##TITLE=1H_Costus-oil-G-SL72-f2
 CDcl3, 8 sc, 
 31.1.2020
##JCAMPDX= 6.0         $$ Bruker NMR JCAMP-DX V2.0
##DATA TYPE= NMR FID
##DATA CLASS= NTUPLES
##ORIGIN= UXNMR, Bruker Analytische Messtechnik GmbH
##OWNER= root
$$ XWIN-NMR		Version 3.5
$$ Fri Jan 31 13:55:28 2020 Russian Standard Time (UT+4h)  she@DPX200
##.OBSERVE FREQUENCY= 200.1315
##.OBSERVE NUCLEUS= ^1H
##.DELAY= (6, 6)
##.ACQUISITION MODE= SIMULTANEOUS
##.ACQUISITION SCHEME= undefined
##.AVERAGES= 8
##.DIGITISER RES= 18
##SPECTROMETER/DATA SYSTEM= spect
##.PULSE SEQUENCE= zg30
##.SOLVENT NAME= CDCl3
##.SHIFT REFERENCE= (INTERNAL, CDCl3, 0, 15.7039)
##AUDIT TRAIL= $$ (NUMBER, WHEN, WHO, WHERE, WHAT)
$$ ##TITLE= Audit trail, XWIN-NMR		Version 3.5
$$ ##JCAMPDX= 5.01
$$ ##ORIGIN= Bruker BioSpin GmbH
$$ ##OWNER= she
$$ F:/spectra/data/she/nmr/H-F/1/audita.txt
$$ ##AUDIT TRAIL=  $$ (NUMBER, WHEN, WHO, WHERE, WHAT)
(   1,<2020-01-31 13:54:19.89 +0400>,<she>,<DPX200>,
      <created by zg, POWCHK disabled, PULCHK disabled
       configuration hash MD5:
       00 E9 B6 7A A2 85 ED C7 34 08 36 98 17 FE 4E 26
       data hash MD5: 16K
       BF B4 94 6F 9F DB 18 79 B8 27 5E 84 5B 5C 3A D1>)
$$ ##END=
$$ 
$$ hash MD5
$$ 99 BD 31 B4 86 35 4D 1A 96 A8 FB 3D 0E 50 12 C7
##$RELAX= 
##$RELAX= 
##$RELAX= 
##$RELAX= 
##$RELAX= 
##$RELAX= 
$$ Bruker specific parameters
$$ --------------------------
##$DU= <F:/spectra>
##$EXPNO= 1
##$NAME= <H-F>
##$PROCNO= 1
##$TYPE= <nmr>
##$USER= <she>
##$AMP= (0..31)
100 100 100 100 100 100 100 100 100 100 100 100 100 100 100 100 100 100 
100 100 100 100 100 100 100 100 100 100 100 100 100 100 
##$AQSEQ= 0
##$AQ_mod= 1
##$AUNM= <au_zg>
##$AUTOPOS= <>
##$BF1= 200.13
##$BF2= 200.13
##$BF3= 200.13
##$BF4= 200.13
##$BF5= 200.13
##$BF6= 200.13
##$BF7= 200.13
##$BF8= 200.13
##$BYTORDA= 1
##$CFDGTYP= 0
##$CFRGTYP= 5
##$CHEMSTR= <none>
##$CNST= (0..31)
1 1 145 1 1 1 1 1 1 1 1 1 1 1 1 1 1 1 1 1 1 1 1 1 1 1 1 1 1 1 1 1 
##$CPDPRG= <>
##$CPDPRG1= <>
##$CPDPRG2= <>
##$CPDPRG3= <>
##$CPDPRG4= <mlev>
##$CPDPRG5= <mlev>
##$CPDPRG6= <mlev>
##$CPDPRG7= <mlev>
##$CPDPRG8= <mlev>
##$CPDPRGB= <>
##$CPDPRGT= <>
##$D= (0..31)
0 1.2 0 0 0 0 0 0 0 0.06 0 0.03 0 0 0 0 0.0002 0 0 0 0 0 0 0 0 0 0 0 0 
0 0 0 
##$DATE= 1580464459
##$DBL= (0..7)
120 120 120 120 120 120 120 120 
##$DBP= (0..7)
150 150 150 150 150 150 150 150 
##$DBP07= 0
##$DBPNAM0= <>
##$DBPNAM1= <>
##$DBPNAM2= <>
##$DBPNAM3= <>
##$DBPNAM4= <>
##$DBPNAM5= <>
##$DBPNAM6= <>
##$DBPNAM7= <>
##$DBPOAL= (0..7)
0.5 0.5 0.5 0.5 0.5 0.5 0.5 0.5 
##$DBPOFFS= (0..7)
0 0 0 0 0 0 0 0 
##$DE= 6
##$DECBNUC= <off>
##$DECIM= 24
##$DECNUC= <off>
##$DECSTAT= 4
##$DIGMOD= 1
##$DIGTYP= 9
##$DL= (0..7)
0 120 120 120 120 120 120 120 
##$DP= (0..7)
150 150 150 150 150 150 150 150 
##$DP07= 0
##$DPNAME0= <>
##$DPNAME1= <>
##$DPNAME2= <>
##$DPNAME3= <>
##$DPNAME4= <>
##$DPNAME5= <>
##$DPNAME6= <>
##$DPNAME7= <>
##$DPOAL= (0..7)
0.5 0.5 0.5 0.5 0.5 0.5 0.5 0.5 
##$DPOFFS= (0..7)
0 0 0 0 0 0 0 0 
##$DQDMODE= 0
##$DR= 18
##$DS= 0
$$ [...]
##$SUBNAM2= <"">
##$SUBNAM3= <"">
##$SUBNAM4= <"">
##$SUBNAM5= <"">
##$SUBNAM6= <"">
##$SUBNAM7= <"">
##$SUBNAM8= <"">
##$SUBNAM9= <"">
##$SW= 24.9337058887773
##$SWIBOX= (0..15)
0 0 2 0 0 0 0 0 0 0 0 0 0 0 0 0 
##$SW_h= 4990.01996007984
##$TD= 16384
##$TD0= 1
##$TE= 0
##$TE2= 300
##$TE3= 300
##$TEG= 300
##$TL= (0..7)
0 120 120 120 120 120 120 120 
##$TP= (0..7)
150 150 150 150 150 150 150 150 
##$TP07= 0
##$TPNAME0= <>
##$TPNAME1= <>
##$TPNAME2= <>
##$TPNAME3= <>
##$TPNAME4= <>
##$TPNAME5= <>
##$TPNAME6= <>
##$TPNAME7= <>
##$TPOAL= (0..7)
0.5 0.5 0.5 0.5 0.5 0.5 0.5 0.5 
##$TPOFFS= (0..7)
0 0 0 0 0 0 0 0 
##$TUNHIN= 0
##$TUNHOUT= 0
##$TUNXOUT= 0
##$USERA1= <user>
##$USERA2= <user>
##$USERA3= <user>
##$USERA4= <user>
##$USERA5= <user>
##$V9= 5
##$VALIST= <valist>
##$VCLIST= <CCCCCCCCCCCCCCC>
##$VD= 0
##$VDLIST= <DDDDDDDDDDDDDDD>
##$VPLIST= <PPPPPPPPPPPPPPP>
##$VTLIST= <TTTTTTTTTTTTTTT>
##$WBST= 1024
##$WBSW= 4
##$XGAIN= (0..3)
0 0 0 0 
##$XL= 0
##$YL= 0
##$YMAX_a= 212604
##$YMIN_a= -143833
##$ZGOPTNS= <>
##$ZL1= 120
##$ZL2= 120
##$ZL3= 120
##$ZL4= 120
##$ABSF1= 10
##$ABSF2= 0
##$ABSG= 5
##$ABSL= 3
##$ALPHA= 0
##$AQORDER= 0
##$ASSFAC= 0
##$ASSFACI= 0
##$ASSFACX= 0
##$ASSWID= 0
##$AUNMP= <proc_1d>
##$AZFE= 0.1
##$AZFW= 0.1
##$BCFW= 1
##$BC_mod= 2
##$BYTORDP= 1
##$COROFFS= 0
##$CY= 11.3945322036743
##$DATMOD= 1
##$DC= 2
##$DFILT= <>
##$DTYPP= 0
##$F1P= 16.9975609425685
##$F2P= -3.02152046262296
##$FCOR= 0.5
##$FTSIZE= 0
##$FT_mod= 4
##$GAMMA= 1
##$GB= 0.15
##$INTBC= 1
##$INTSCL= 1
##$ISEN= 128
##$LB= 0.24
##$LEV0= 0
##$LPBIN= 0
##$MAXI= 10000
##$MC2= 0
##$MEAN= 0
##$ME_mod= 0
##$MI= 1.114404
##$NCOEF= 0
##$NC_proc= 0
##$NLEV= 6
##$NOISF1= 3.799351
##$NOISF2= 2.8
##$NSP= 1
##$NTH_PI= 0
##$NZP= 0
##$OFFSET= 15.70392
##$PC= 1
##$PHC0= -9803.869
##$PHC1= 39.20081
##$PH_mod= 1
##$PKNL= yes
##$PPARMOD= 0
##$PSCAL= 0
##$PSIGN= 0
##$REVERSE= no
##$SF= 200.130013532006
##$SI= 16384
##$SIGF1= 3
##$SIGF2= 2
##$SINO= 400
##$SIOLD= 16384
##$SREGLST= <1H.CDCl3>
##$SSB= 0
##$STSI= 0
##$STSR= 0
##$SW_p= 3612.71676300578
##$SYMM= 0
##$S_DEV= 0
##$TDeff= 0
##$TDoff= 0
##$TI= <>
##$TILT= no
##$TM1= 0
##$TM2= 0
##$TOPLEV= 0
##$USERP1= <user>
##$USERP2= <user>
##$USERP3= <user>
##$USERP4= <user>
##$USERP5= <user>
##$WDW= 1
##$XDIM= 8192
##$YMAX_p= 0
##$YMIN_p= 0
$$ End of Bruker specific parameters
$$ ---------------------------------
##NTUPLES= NMR FID
##VAR_NAME=  TIME,          FID/REAL,        FID/IMAG
##SYMBOL=    X,             R,               I
##VAR_TYPE=  INDEPENDENT,   DEPENDENT,       DEPENDENT
##VAR_FORM=  AFFN,          ASDF,            ASDF
##VAR_DIM=   8192,          8192,            8192
##UNITS=     SECONDS,       ARBITRARY UNITS, ARBITRARY UNITS
##FACTOR=    0.0002004,     1,               1
##FIRST=     0,             0,               0
##LAST=      1.6414764,     0,               0
##MIN=       0,             -143833,         0
##MAX=       1.6414764,     212604,          0
$$ Real data points
##PAGE= N=1
##DATA TABLE= (X++(R..R)), XYDATA
$$ [...]
2246ak121Q06J814p67j037N09R24K28k66p56q88M04J162L57q38o76J226O92j267
2265d95r79P74J309J23j399p07P87J656m64j536M36K076J33k069j359J730J717
2282A733j236j191L13J051K61p38j99j20J262M85o38j851J33K131J23j726l56
2299e63J880P62j845j526J305J827l42j536m16J444K85m93r74L93J326L5j153
2316D09r39Q0J554P6j135n02J230R35j918q55J283J214l20j355n79R18O37n11
2334B22o77K9O39R73j142j646O28K197J88k587n56J998R14k129n69J687L96j003
2352d38o36L85K81k97Q28k11j154L14J243j44j978L11K087m0j818k96J644J56
2370B37j620J85J184k21l57n20L86J21J78L69l06p62M48R36o11q46P46R35n64
$$ plain form
2246 -1 -2122 -1316 498 -269 -1306 -797 127 355 89 -667 -1555 -1151 11 368 -470 -1146 80 772 -495
2265 -495 -1474 -700 609 732 -667 -1374 -587 1069 605 -931 -495 1581 1714 -355 -1714 16 1733
2282 1733 497 -694 -381 670 931 193 -6 -126 1136 1621 983 -868 -735 1396 1519 -207 -563
2299 -563 1317 2079 234 -1292 13 1840 1498 -38 -454 990 1275 782 -192 201 1527 1562 409
2316 409 -530 -450 1104 1180 45 -457 773 1708 -210 -1065 218 1432 1112 -243 -822 96 733 222
2334 222 -455 -426 213 1186 44 -1602 -974 1223 1411 -1176 -1732 266 1180 -949 -1518 169 565 -438
2352 -438 -1074 -689 -408 -705 123 -88 -1242 -928 315 171 -1807 -1496 591 551 -1267 -1563 81 237
2370 237 -1383 -1198 -14 -235 -592 -1112 -726 -605 -427 -58 -364 -1126 -678 258 -353 -1199 -453 482 -82
2389h2j193L50J092K13q54l69Q58M02n76l55m7N97L39m55l57J94P78L14m68r80
2409e99Q54N73m47n52k6Q22K13n52l90L19P39m43l70l33Q71K09n51p30O14J025
2429A246n3j137k05R32N16q95q09P81P31p07l11K12j15M52J52m07n16N33M18J75
2449I93j599L38J591J91k041l91K009M68j689q08J053J018j040p66K51M94L76
2466D48J88q84o70J019Q68o53j473K92J533q0j516n13J447O59q20j008N18J138
2484D93J05j029r84J203P31l09j153j44R65N19j266m84K25J223qj021k75R01R20
2503F12o67r93l75J248M37p51r13Q03J262m60j346l82J406P12p97r66N61J019
2521D10K3r49l65P06Q63m50o95m25Q58P71l56j561L06J660N02j705m34J117J169
$$ plain form
2389 -82 -1275 -925 167 380 -474 -843 15 417 -159 -514 -561 36 375 -80 -437 -243 535 849 381 -599
2409 -599 255 828 381 -171 -197 625 838 286 -104 215 954 511 141 -192 679 888 337 -393 221 1246
2429 1246 1193 56 -149 783 1299 404 -405 376 1107 400 89 301 186 638 790 383 -133 400 818 993
2449 993 -606 -268 1323 1514 -527 -918 1091 1559 -130 -938 115 1133 93 -673 -422 72 448
2466 448 636 -248 -918 101 969 316 -1157 -865 668 588 -928 -1441 6 665 -155 -1163 -645 493
2484 493 598 -431 -1415 -212 519 210 -943 -1087 -122 397 -869 -1353 -1128 95 87 -934 -1209 -308 612
2503 612 -55 -1048 -1423 -175 262 -489 -1402 -599 663 203 -1143 -1525 -119 593 -204 -1170 -609 410
2521 410 433 -516 -881 -175 688 238 -457 -882 -24 747 391 -1170 -864 796 1298 -407 -841 276 1445
2540A445p47j900R63J247M4j182m83Q40N25R2r28n34J127J418r26j746J85J966
2558A406M45k028m15J349R70j562l94L91Q88l81n01k11K87N58P26p64j192N95
2576A67J328o00j897N07J766p8j691n65J368P41j144n59N37J279o56n13o27N95
2594d2Q45k3j200m65J156O62n97j466N26P32J76r82o48J151Q32o17q20K00R85
2613D05N2q64o48J76R06k18p47j39P32N32j24j220J01J277k25q66l88J035P39
2632E16j063m07M1Q65m8l05m86l23O79K87k47m70M16J159J81j463J4N15N94p83
2652c28r52O65P94j62n37p09J278R43j023n14J2J466n7j505L47J012J80p59n48
2671c97J16Q50k6j7p11k91J154L13r71p19J399J145n60j686L09J278j27j276l71
$$ plain form
2540 1445 698 -1202 -239 1008 1052 -130 -613 227 752 844 -84 -618 509 1927 1001 -745 -560 1406
2558 1406 1851 -177 -592 757 1727 165 -229 162 1050 669 168 -43 244 802 1528 764 -428 167
2576 167 1495 895 -1002 -495 1271 1193 -498 -1063 305 1046 -98 -657 -120 1159 503 -10 -637 -42
2594 -42 803 780 -420 -885 271 933 336 -1130 -604 128 304 -678 -1326 -175 657 40 -780 -580 405
2613 405 457 -407 -1055 -879 27 -191 -938 -1077 -345 187 63 -1157 -1056 221 -4 -870 -1258 -223 516
2632 516 -547 -954 -913 -48 -96 -401 -887 -1210 -531 -244 -491 -961 -545 614 795 -668 -654 -139 455 -328
2652 -328 -1280 -615 179 17 -520 -1229 49 992 -31 -545 -533 933 876 -629 -282 730 910 151 -397
2671 -397 -281 569 543 526 -185 -476 678 991 20 -699 700 1845 1285 -401 -92 1186 1059 -217 -588
2690e88J168L70j003n16R57N60M7n06l39N20K17n7n11L0K76N80l05j048m18Q23
2710B57N90q49o36O85Q81m69j174O52J210N36j480o46J062K4r48p28P29Q81k87
2729B90j014k83R24K94j65jO1n2k58J10l51J09J09L38J6j426j80J073O14r54p96
2750a542J339O06j207j060J216J416m86j063L45L98m47n00J81N68j63J44l42p25
2768a322J98R40K48l26o70P09N77l42j328N86J571k95j100p22Q80Q64o79j039
2786a250N35J516r7j495m39J551Q65l39r85K15M42m01n89l93J152M27j5l15q61
2805d76K41J131pj031l44J365P08j540r70J205J650k69k115O8J330K54k007p6
2823h83J837P19q91j249O85P63j80k35K84k51m94L65k27p43r7J858M99j632j242
$$ plain form
2690 -588 580 950 -53 -569 388 948 995 489 150 670 887 830 319 349 625 1205 900 -148 -566 257
2710 257 847 -2 -638 47 928 459 -715 -63 1147 1683 203 -443 619 643 -305 -1033 -304 577 290
2729 290 -724 -1007 -83 211 46 45 106 54 -204 -94 -445 -336 -227 111 127 -1299 -1479 -406 208 -746 -1542
2750 -1542 -203 403 -804 -1864 -648 768 282 -781 -436 -38 -485 -985 -804 -236 -399 -255 -597 -1322
2768 -1322 -1124 -184 64 -262 -932 -223 354 12 -1316 -730 841 546 -554 -1276 -396 468 -211 -1250
2786 -1250 -715 801 704 -791 -1230 321 1186 847 -138 77 519 118 -471 -864 288 715 700 385 -476
2805 -476 -235 896 889 -142 -486 879 1587 47 -923 282 1932 1663 -452 -384 946 1200 -807 -883
2823 -883 954 1673 782 -467 218 981 801 566 850 599 105 470 243 -500 -597 1261 1760 128 -1114
2842a114R46J558o73j538O53J560l03k004l38J443J049q64m14j55M23n14r22N80
2860f27P82M01l0n58p30J24Q80K69p57j050R04J121j243j768J081K439k99k202
2878a263j26J741M51j848m20J579O50q45j211m9Q25J92J21j44m49L22J03k41q64
2897a476M65J437P60j219j347R25J401m50j668L35R63N05j884n16J355J487m18
2914F55j051J86J000m68r45R3R52L98m23r58P4M7Q79N53o06l12J71M83q30o01
2934g03P40J236M00j231j047J082R41j242j072Q35J327m41j743K6J758K48k03
2951I11l87L21jm01m04J33O8M09K36q46m83K64J124Q1r78k27R26r0n75j141J580
2972E20P98m26j083K8J175n11r89l26R21K92q72n39Q09Q58j84k1J13n5j08k91
$$ plain form
2842 -1114 -168 1390 717 -821 -168 1392 1089 -915 -1253 190 1239 375 -39 -194 229 -285 -1207 -627
2860 -627 155 556 526 -32 -762 -638 242 511 -246 -1296 -392 729 -514 -2282 -1201 1238 939 -1263
2878 -1263 -1389 352 803 -1045 -1465 114 764 -81 -1292 -1341 -516 -324 -203 -347 -796 -474 -371 -612 -1476
2897 -1476 -1011 426 1186 -33 -1380 -455 946 496 -1172 -837 126 631 -1253 -1769 -414 1073 655
2914 655 -396 -210 790 322 -623 -530 422 820 397 -561 -487 -440 439 992 386 74 245 728 -102 -703
2934 -703 37 1273 1673 442 -605 477 1418 176 -896 -61 1266 825 -918 -892 866 1114 911
2951 911 524 845 844 443 39 172 240 649 885 39 -444 -180 944 1025 47 -180 746 656 81 -1060 520
2972 520 1318 892 -191 -163 1012 501 -488 -814 107 399 -473 -1012 -203 655 471 450 563 508 400 109
2992A09j20p58k4Q79J66j176l64R67P98k77j233O06R32l33j107k18J170N38n24
3011C1n19J26K86k70o40J1O9J11J54l64M13K45N17r0k47J84L68k04j134m34Q36
3032e51Q82r20o81L76J334m46o63j00J276K06j181j88M58N21J4l45Q6j3L23j43
3052B45p76m02O74M25J03p79L56J086O5l53k16J86L15o49n77J45N41P0p64J17
3072a88O10O73q05l52J39R31j33n64k12K76J33L52n75m9M0N96n70p89J54R01j59
3093D09l68m00P21P18K7p37k27M24J51q58n79R1J006L19j009k83J040K29n15n90
3113d31J59R59n28l90l77P51L47j95p34mO45K09q30q71L78J100j62j083K8J036
3133GR15r43p35L55P37p8r03p66Q08R82r53l89rJ074O6l44o82J93O78J18q77l41
$$ plain form
2992 109 -11 -769 -793 86 252 -924 -1288 -321 477 200 -1033 -427 505 172 -935 -1153 17 555 31
3011 31 -488 -362 -76 -346 -986 -975 -906 -795 -641 -1005 -592 -347 170 80 -167 17 385 181 -953 -1387 -551
3032 -551 331 -589 -1270 -894 440 -6 -669 -769 507 713 -468 -656 -198 323 337 -8 78 65 388 245
3052 245 -531 -933 -259 166 269 -510 -154 932 997 644 428 614 929 280 -297 -152 389 459 -305 -188
3072 -188 422 1095 290 -62 77 1008 875 311 99 375 508 860 285 236 276 872 302 -487 -333 568 409
3093 409 41 -359 362 1080 1107 370 143 567 718 -140 -719 -628 378 697 -312 -595 445 674 159 -431
3113 -431 -272 687 159 -231 -608 143 490 295 -439 -443 202 411 -419 -1290 -912 188 26 -1057 -1029 7
3133 7 922 -21 -756 -401 336 258 -645 -1411 -603 379 -574 -963 -972 102 168 -176 -858 -665 13 131 -746 -1087
3155a087R93O69n42q01J40J118m68q91k05M36P36L1p06j00R05M78n41q33N05O94
3175E31N5j162l61Q29O28jj031l4P20Q61r60n17M51R10l73p38k87J115J79n35
3195B80n73K59N24j0m46m71K29P36M14o79n97J101L90l52j109j2J234m31p78j58
3215d49J064M29m97r26P05N02L17n38q54J96O59N6p47l42J057M94p72r41K50O92
3235C55R4p62o39J100R19o29q95K64Q81K35j054m77M20L10O1j196J31Q68J66j14
3255C8n77m3P68J17n77n38N97M90l34m94l57J046K32p69p22P11L96j17p93P7M11
3276d38N89j43p33L23M70K90j286PM61K35m27K14k15L58L81j52k60j16O44j32
3296G0l47k72O04L4l67p5j01N86j32o37J84P1N07j02n2k55M59M08r2l70j08M81
$$ plain form
3155 -1087 -94 575 33 -768 -628 490 22 -869 -1074 -638 98 129 -577 -677 228 706 165 -668 -163 531
3175 531 586 -576 -937 -108 520 519 -512 -546 174 1035 75 -442 9 919 546 -192 -479 636 815 280
3195 280 -293 -34 490 480 34 -437 -208 528 942 263 -334 767 1157 805 -304 -316 918 487 -291 -449
3215 -449 615 1044 547 -379 326 828 1145 607 -247 -51 608 664 -83 -425 632 1126 354 -587 -337 355
3235 355 449 -313 -952 148 1067 438 -457 -193 688 923 -131 -608 -188 122 183 -1013 -882 -14 152 38
3255 38 -539 -582 186 303 -274 -812 -215 275 -59 -553 -910 136 368 -401 -1123 -412 -16 -133 -926 -849 -438
3276 -438 151 8 -725 -402 68 358 -928 -921 -460 -225 -652 -438 -653 -295 86 -66 -326 -442 202 70
3296 70 -277 -549 55 89 -278 -353 -454 132 0 -637 -453 -382 125 23 -29 -284 175 583 491 121 13 494
3318D94J60o87m95O02L37l29o23J70J210M53r90m55P17L06j49o76J57J48L02n42
3338A10j23L18L95pq27k30P12K39n69m68N68Q26Q6o73l13P34P0l29r28J38N05
3359B34J87o97o37J050O59k37m44n5K53%k41p2RL10jl34n08K93O99j27j025m5
3381g29Q15L92j049q44J100O44K03j072L55M92j21j050J25L48L43p50l3J47N09
3400a75K90k07j0o2K08j40l46m05J53N31m2m65l75N76O16m31k55j9N97j5q31k72
3422a079J003N38k63O6n78N01l60k38o3%M93K71l35k87o8R41M24n30n81N97M95
3443I47j132p67M91J358k9j612m5J205N96j105l26J091K05n76o58p8R47K16n9
3462F69j59j53J65N1l03q51q7J291M76j083o63Q33J113m39j133N38J087m60j466
$$ plain form
3318 494 654 -33 -528 74 411 82 -541 -371 839 1292 302 -153 564 870 721 45 202 350 652 110
3338 110 -13 305 700 693 -134 -364 348 587 18 -450 118 944 1030 357 44 778 848 519 -409 -271 234
3359 234 421 -276 -913 137 796 559 115 60 313 313 72 0 9 319 318 -16 -524 -231 468 341 -684 -729
3381 -729 86 478 -571 -1415 -315 329 532 -540 -185 307 186 -864 -739 -391 -48 -798 -831 -684 -175
3400 -175 115 -92 -102 -164 44 -96 -442 -847 -694 -163 -205 -670 -1045 -469 147 -284 -539 -558 39 24 -807 -1079
3422 -1079 -76 462 199 265 -313 188 -172 -410 -473 -473 20 291 -44 -331 -399 542 966 436 -145 452 947
3443 947 -185 -952 -461 897 868 -744 -789 416 1012 -93 -419 672 877 301 -357 -435 512 728 669
3462 669 510 357 522 573 270 -581 -668 623 1099 16 -647 186 1299 860 -273 265 1352 892 -574
3481e74l44J429O12q55q84M61P08j0p44L00L47k74k17m3j56K99K68M61l75p36
3501c27L82M79n79j021M93R11J53j317k43J272M70p21m85R35M84q40j112L89O15
3520f2l48n50P17K64j92m35J54K24n27M28O30n34o78O1J084K5j021L4P74O27j622
3541i47o03J060J092q29p43K43J055j0n93J09J23P4m68j30k23M01L03M63l20o68
3561f11J09N79j38o00L39J111rj109r04J191J153r44q49P00J039o77j293o0J575
3580F02L79p62n08P81Nm98Q7j02M11K23k2o38m57L29J083j78p38K4O79L50j088
3601c8m68R86O03m02j084L83O96k30p43R6Q88N00j002n92K98P48l74o3K73mj33
3622C38p57O34k8l22J63N32p76n13O25P14m31n57K02J157q68j006J94J294k88
$$ plain form
3481 -574 -918 511 1123 268 -616 -155 553 543 -201 99 446 172 -45 -88 -244 55 323 784 409 -327
3501 -327 55 534 -45 -1066 -573 338 491 -826 -1069 203 673 -48 -533 402 886 46 -1066 -677 -62
3520 -62 -410 -960 -243 21 -171 -606 -452 -228 -755 -327 303 -231 -909 -848 236 261 -760 -726 48 675 -947
3541 -947 -1550 -490 602 -227 -970 -727 328 318 -275 -166 -43 31 -437 -567 -790 -389 -86 377 57 -611
3561 -611 -502 77 -61 -661 -322 789 780 -329 -1233 -42 1111 167 -682 18 1057 380 -913 -973 602
3580 602 981 219 -289 492 497 -1 86 -16 395 618 596 -42 -499 -170 913 735 -3 21 700 1050 -38
3601 -38 -506 480 1083 681 -403 -20 676 446 -297 -201 687 1187 185 -407 -109 639 265 202 475 471 338
3622 338 -419 215 187 -135 28 560 -216 -729 -104 610 179 -378 -176 981 113 -893 -699 595 307
3641C07o91R5M65K1p31K3N28N9l37l04K21l54K52N00L01m14o83N14J81k85o76
3662a008L71Q07k40p83L05N71Rm87l04Q10K63m67l34NO04P5q08M17J09k4j30j34
3684c73j2J15M58l37m21J48L56M15m70l17N36N04k42j011j21J323J47q09n19P85
3704A55L28n93j56N92O14p34l49K44J59R9J06l82j51M09J49j75m76O6O54K35p72
3725B2k69M45N27l05m37L50K72j93j47k88K98L60j58o83J22N52K10n06m62M93
3745B03K40n9m46m05N75L92k31j99l7N89k45n83r1L53J93Qo47r5K87M21j60n22
3767d59M62K3N25j098j87L91L93j91j81jK62J8j82l62J56N06K9o07m79P25L65
3788A08l18l08p2O12k37j51k30K6N98m5n17k85O19M49j83p70J1P14J93q65n02
$$ plain form
3641 307 -384 -289 176 197 -534 -511 17 76 -261 -565 -344 -698 -446 54 355 -59 -742 -228 -47 -332 -1008
3662 -1008 -637 170 -70 -853 -548 23 32 -455 -759 51 314 -153 -487 -482 122 197 -611 -194 -85 -109 -239 -373
3684 -373 -385 -270 188 -149 -570 -422 -66 349 -121 -438 98 602 360 -651 -772 551 698 -111 -630 155
3704 155 483 -110 -266 326 940 206 -143 101 260 359 465 83 -68 341 490 315 -161 -95 559 794 22
3725 22 -247 198 725 420 -17 333 605 412 265 -23 275 635 477 -206 -84 468 678 172 -290 203
3745 203 443 384 -62 -467 108 500 269 70 33 622 377 -206 -297 56 249 257 -390 -485 -198 223 63 -459
3767 -459 3 26 551 -547 -734 -343 50 -141 -322 -323 -61 -43 -225 -587 -431 75 104 -503 -982 -257 108
3788 108 -210 -518 -590 22 -215 -366 -596 -570 28 -17 -534 -819 -200 249 66 -704 -693 21 214 -651 -1153
3809a153P43N81n08o42M55O71O2m63j49K19P26k19m69l20J93O71O2q50m4R25r8
3830C93r01l89J054O90m95p58K45L50M43l63q86O85N64j35p92J66L30N50n15m63
3850b27J11P24R2m49n98O51P63n57q65Q1O29M84m72l30J29N93k24k46m10K19P35
3871H33n16o33J54R06m8q40j85P55n7j38l15lN79n24m50N13j02L15L75l17m23
3892a21k93O00J73n53j07L17L46m17j57o7N67j63m00M2j3K03l08j02j57N87Q9
3913F6o93O8N30K60m12n94M92J88P0k38l04J99J89M11n50l16P61K11k97p50R7
3934f12N30L1m21j11M78L30l54k74K59K33k66p4Mk49P13L08p45j95N02J80j88
3955G9m61MP18J24p51K84M11nl84k72M19J86j23k34j15K00K11Q2l49q5M00K92
$$ plain form
3809 -1153 -410 171 -337 -979 -524 147 209 -254 -403 -184 542 323 -146 -466 -273 398 460 -390 -434 491 393
3830 393 -508 -897 157 847 352 -406 -161 189 632 269 -617 68 632 497 -295 -129 201 751 236 -227
3850 -227 -116 608 700 251 -347 304 1067 510 -355 -274 355 839 367 37 166 759 535 289 -121 98 833
3871 833 317 -316 -162 744 696 -144 -329 426 369 231 -84 -87 492 -32 -482 31 -71 244 619 302 -121
3892 -121 -414 186 359 -194 -301 16 362 -55 -212 -279 288 125 -275 -233 -246 -43 -351 -453 -610 -23 66
3913 66 -627 -559 -29 231 -181 -775 -283 -95 -25 -263 -567 -368 -179 232 -318 -634 127 338 41 -709 -612
3934 -612 -82 -51 -472 -583 -105 225 -129 -403 -144 89 -177 -251 -247 -496 217 525 -220 -415 87 267 79
3955 79 -382 -378 340 464 -287 -3 408 403 19 -253 166 352 229 -5 -120 80 291 373 24 -61 339 631
3977F31k59n59J94N50Q0m96l57K80K99Rl14K24L23qk72k52J82K38K58q95J49K40
3999B45L72l17l33j42P23k88l27j59M02K42j90l41k2K90m9J18m94k9M85K22p05
4020b97m56J189k98K8n85N00M84n48n04J30N81k47j05j37l53O37kj99m83l2P29
4041C2P3p67mM50M68m38o81L79N51K01j144M42M07r9n1n23J58M69J61n20J1K97
4063a28K50N2o38k47Q41P8j27l18j91L45O9k53n47M84N85l9n52k48O99M88o39
4084c6m75P41M48l61j192M59R77n1n19q8R7K34Q7k05j84R5K71K33k20n53L70O61
4106G89m13q67N55P87k06j009NR15J79m45n85M51O3L35m21j60N62Q9k40n58K34
4127F0L70k17j43J94M5Q0mj47l49M2O52R1o81n46M60R64q90k91J2P74j51j038
$$ plain form
3977 631 372 -187 7 557 637 141 -216 64 363 372 58 282 605 597 325 73 255 493 751 -144 5 245
3999 245 617 300 -33 -175 548 260 -67 -226 176 418 228 -113 -135 155 106 224 -270 -299 186 408 -297
4020 -297 -753 436 138 166 -419 81 565 17 -487 -357 224 -23 -128 -265 -618 19 17 -182 -665 -697 32
4041 32 105 -662 -666 -216 252 -186 -867 -488 63 264 -880 -438 -31 -130 -181 -704 -546 -77 84 -436 -425 -128
4063 -128 122 174 -464 -711 130 208 81 -237 -428 -83 -14 -267 -814 -330 255 216 -336 -584 115 603 -36
4084 -36 -511 230 678 317 -875 -416 561 510 -9 -97 0 234 321 116 -68 27 298 531 311 -242 128 789
4106 789 376 -491 64 851 645 -364 -359 556 735 290 -295 156 219 554 133 -27 535 624 384 -174 60
4127 60 430 213 70 264 309 389 385 238 -111 -69 583 674 -7 -553 -93 871 -19 -310 -298 476 325 -713
4149g13K8J031L34j065P3N24Mm42m6J58O6m0j42o0j79m5N64K52r36k44J147K73
4171E42j133j67R06Q34j046r14L94Q32m34m74K71M28m4n70k58L29K17K68L54n92
4191b57r6J84J07j97k56K42O04q2l18o73O07P36n69n01L14K78j68n78j04R78J86
4212D37n84m87L66O31p32M6L49K10j95k35J78J47n6M46K55o85l90O02N38p98l45
4233c02L26P66m83q42L71Q39q8n19KP29j15o85J30J61L58m91L34m06r1M7l8K26
4255B29K45k15J01J74k41n93L46P87m41l33k91Q32n95m70J05Q45J30p57l31O08
4275A35L17n30o39R06K27n6p94J31L75K8n40L30M34p58L3L56p2o71N23P61k60
4296B36q70L3R59r9q38j44Q90M9m89p97M41J023n39l99M43L5m79m6J39J47L80
$$ plain form
4149 -713 -685 346 680 -385 -312 212 216 -226 -272 -114 -48 -88 -230 -290 -469 -514 50 302 -634 -878 269 542
4171 542 -591 -758 148 982 -64 -978 -584 248 -186 -660 -389 39 -5 -575 -833 -504 -287 -19 335 -257
4191 -257 -353 -169 -62 -259 -515 -273 331 249 -69 -742 -135 601 32 -469 -155 123 -45 -623 -727 251 437
4212 437 -147 -634 -268 363 -369 -323 26 236 41 -194 -16 131 75 521 776 91 -299 303 841 43 -302
4233 -302 24 790 307 -535 -164 675 587 68 70 799 684 -1 129 290 648 157 491 85 -6 41 3 229
4255 229 474 259 360 534 293 -300 46 833 392 59 -232 600 5 -465 -360 485 615 -142 -473 135
4275 135 452 -78 -717 189 416 360 -434 -303 72 100 -440 -110 324 -434 -401 -45 -117 -788 -265 496 236
4296 236 -634 -601 358 259 -579 -723 167 216 -273 -1070 -629 394 -145 -544 -101 -66 -545 -591 -452 -305 75
4317G5L5m57j65K02K51L3o5n10M31k8L9o69L87P54j19l85m84O48N00n77k93J96
4339b01R03p53n60JP29N20p52j52M01j12l10K52R5K66k64M02k05l81k63Q34M3
4360D93o05j83N99L40o19p08J158Q11j016k20J98O20l36k64j93M70j6j57l41j94
4380a63L27J80l15K43j03K76j29k4l96J79O11k65m24J5M32j2k62l06n2L16J88
4401C16k79m56O30O61n50n71K20L41k79l63K29J55P0l89J1k7j70M89N5m61j34
4422e02O42K93n26o34N22N33l09o12j58M48L55o73j40O58j8k34l12J87N28J18
4442A66k08k87J57K86n8m03j5J29L43k12l11j31L21L84j73l11k80Q11k6o47j84
4463f49N11O04J3j183PR47j4n73QL76p4J26n2J59J06j43O2m8j49p7N86k59m48
$$ plain form
4317 75 110 -347 -512 -310 -59 -26 -91 -601 -170 -198 -159 -828 -441 313 194 -191 -675 -27 473 -104 -397 -201
4339 -201 702 -51 -611 -610 119 639 -113 -265 136 24 -286 -34 61 327 63 465 260 -121 -384 450 493
4360 493 -112 -295 304 644 25 -683 475 1286 270 50 248 868 532 268 75 545 529 372 31 -163
4380 -163 164 344 29 272 169 445 316 292 -104 75 686 421 -3 12 444 432 170 -136 -188 128 316
4401 316 37 -419 211 872 322 -249 -29 312 33 -330 -101 54 124 -265 -254 -281 -451 38 93 -368 -502
4422 -502 140 433 -93 -727 -205 328 19 -593 -751 -303 52 -621 -761 -103 -121 -355 -667 -480 48 166
4442 166 -42 -329 -172 114 56 -347 -362 -233 110 -102 -413 -544 -223 161 -12 -323 -603 208 182 -465 -649
4463 -649 -138 466 479 -704 -697 250 236 -337 -329 47 -27 99 47 206 312 169 231 183 34 -43 543 284 -164
4486a64O5M78l8n23j52Q93K56r00k3L54K31n5o30K85L47l17Q1J08k50K98J34m04
4508G4j35J59L73k51m65K02P79k42k42LO0j79L6j66j79L16R0M7k47j84N33K11
4530E93p42p3L22M08n85o92O96L73o4m31j56N41k5m97o5J01M3M08R9q03L56L34
4552A41p5j03j80j13L73l34m47K07M00J26k44r4K54k27L24k59L0M08m54p6p2K69
4574a46K76j91n47P3N57j58j15l27L54M94j88l53J36k76N78o1k74m86P36K70m64
4595a12m69J32N66k08j78j39P41k0k72k55L22K58m41L8r5K61j9M08m28n11P67
4616C46J61m30j89K72K44K14o54n7O58k55l11J07OJ10o3m00K29l3J59L07Ml15
4638A10K2M89k47l22n7M29k86l06K1J68L73n01k56N79J47n9J04l72K35Q0K63p65
$$ plain form
4486 -164 -99 379 341 -182 -334 559 815 -85 -108 246 477 422 -208 77 424 107 188 296 46 344 478 74
4508 74 -61 98 471 220 -245 -43 736 494 252 255 315 136 172 6 -173 143 233 280 33 -151 382 593
4530 593 -149 -222 100 508 -77 -769 -73 300 236 -195 -351 190 165 -332 -397 -296 -253 155 254 -549 -193 141
4552 141 66 -37 -217 -330 43 -291 -738 -531 -131 -5 -249 -343 -89 -316 8 -251 -221 187 -267 -343 -415 -146
4574 -146 130 -61 -608 -535 22 -136 -251 -578 -224 270 82 -271 -135 -411 167 106 -168 -654 82 352 -112
4595 -112 -581 -449 117 -91 -269 -408 333 313 41 -214 108 366 -75 -37 -132 129 110 518 90 -421 346
4616 346 507 77 -112 160 404 618 -36 -93 565 310 -1 106 112 222 159 -241 -12 -45 114 421 425 110
4638 110 132 621 374 52 -5 424 138 -168 -147 21 394 -107 -363 216 363 304 408 36 271 351 614 -151
4660a51j03N95K78o31k30L32P2j87m42J55L44L13l80j03J52Q6K48m37m06P8K51
4681a66R4n86KQ15j73m66p1K53L26P3r04L79K47M61k47m87J94J17K76l32k01J79
4703b17K59n3l24m38L98K83Kk28K09M42j06n53q3K74K3l4k21k5L27M18k33o11
4725d91O18OQ2l83k7L59N7m75M11l00l6L78j05n8k57M37J32j078J44N57P78l71
4747C78o01L99L33J67p17l0M01j98K8k96K72K5pL27n11J29K05QR5n88K08N83j6
4770E94n16q8N99p8n17k49N03Q1l53l65M21L45J23m76J14j44L50j36l10k62M74
4791A10K89k64m58J62M6R5O3j11k15P72l32m73R0N8N18l91m52L86M53j38p27m6
4813e65J007l20m97l38P97N8k62p14L88L59l58J09J74k30j91N03Q0m89k9O43J53
$$ plain form
4660 -151 -254 341 619 -12 -242 90 162 -25 -467 -312 32 345 -35 -138 14 100 348 -89 -495 -417 -166
4681 -166 -72 -658 -656 159 -14 -480 -551 -298 28 101 -803 -424 -177 284 37 -450 -256 -139 137 -195 -396 -217
4703 -217 42 -11 -335 -773 -375 -92 -90 -318 -109 333 227 -326 -409 -135 -112 -146 -367 -392 -65 353 120 -491
4725 -491 127 133 215 -168 -195 164 221 -254 157 -143 -179 199 94 36 -221 216 348 -730 -586 -29 749 378
4747 378 -223 176 509 676 -41 -71 330 132 160 -136 136 161 154 481 -30 99 304 312 407 -181 27 610 594
4770 594 78 -10 589 511 -6 -255 248 329 -24 -389 32 377 500 24 138 -6 344 208 -102 -364 110
4791 110 399 135 -323 -161 -115 -20 43 -68 -283 489 157 -316 -226 -168 350 -41 -493 -107 346 208 -519 -565
4813 -565 442 122 -375 -713 84 142 -120 -834 -446 -87 -445 -336 -162 -392 -583 -80 0 -489 -518 125 278
4834B78k61n98L16P70q15l28M12O86j01p79r3J24N47l18K03j9K1pJ4n93N14L74
4856C47l6l32M1P5p8P0l24N4N1N77l77m10J20K91L10r84K42Q52l1m40n70O91O14
4879G53l15n36O9N87m15l05M80J20j05o6j57J3o1K15L78k22n66K09L59k54o94
4900e13L35R79k88n96k83O95n7l77N2M55P5l39k03K12K40K1m90J46J68p4n75N81
4922A64l35J38q1K36K73n19l11O01L52n07k54K41M35q22k45J07J096o56m53L37
4942b03N70l05k78r9Q06k82p58L22Mj43K49L08n6p36j6P73Q9j084M01O53J76p63
4964c72j46Q81j0n94m90O55K40m76n7J51m0M1O7M01r8j18k02o6r5N00p6k9j52
4987h5k88J82L95L28n79l09O25j27k60m75M46Q23k13r45M82N12k09o36J22M19
$$ plain form
4834 278 17 -581 -265 505 -310 -638 -226 460 359 -420 -513 -389 158 -160 43 24 45 38 52 -541 -27 347
4856 347 311 -21 20 95 17 87 -237 -183 -132 445 68 -342 -222 69 379 -605 -363 489 458 18 -552 139 753
4879 753 438 -98 -29 558 143 -162 318 438 333 267 110 123 62 277 655 433 -133 76 435 181 -513
4900 -513 -178 801 513 -83 -366 329 272 -105 -53 402 477 138 -65 147 387 408 -82 64 232 158 -417 164
4922 164 -171 -33 -114 122 395 -124 -435 166 518 11 -243 -2 433 -389 -634 -527 569 -87 -540 -203
4942 -203 367 62 -216 -315 491 209 -549 -227 -223 -366 -117 191 135 -601 -617 156 245 -839 -438 215 391 -372
4964 -372 -518 363 353 -241 -731 -76 164 -312 -369 -218 -258 -217 -150 251 153 35 -167 -233 -328 172 96 67 -85
4987 -85 -373 -191 204 532 -47 -356 269 142 -118 -593 -147 676 463 -482 0 512 303 -333 -211 208
5007B08K41n81m33N74L14j42j9L25l22k77N33j29L6n21M73L22l88o21M88N04l11
5028B74m19O3O85k84o18K31M69J49n85j49J94L82k65j41K9J31R1j75j06l21K81
5049h4L99p2q2%j91M32j32k47k63N50j51p61K40K01M86p81o8P18K08o52n07L41
5071d16N86n59M6K87k6q3r2R4j22PM9J10O6n90M2J065n11o33J45O82l0q80K64
5094d99N04k5n09M8M86J16n02M2L45j10K12l61j30q8N29L3P3N6l3j74L40m29k92
5117c68L60K86j73k17j19M14k8l05k15R60j30j84k99k40N07R4k95p0K56q8o8j79
5139a01L77K73l98j81J05n10P14J15K03p66n6J024q6n35k81M30L29q03o1L50R1
5160B33j73j43J76R9P6l6k25L2j18L95J38n00j0K64J23m47p1L65k17L17j69j6
$$ plain form
5007 208 449 -132 -565 9 323 181 162 487 165 -112 421 292 328 -193 280 602 214 -407 81 585 274
5028 274 -145 -82 603 319 -299 -68 401 550 -35 -184 10 392 127 -14 15 146 237 62 -44 -365 -84
5049 -84 315 243 161 161 -30 402 270 23 -240 310 159 -602 -362 -161 325 -456 -524 194 402 -250 -757 -416
5071 -416 170 -389 -343 -56 -82 -165 -257 -163 -285 -278 -229 -119 -53 -643 -601 464 -47 -680 -535 147 117 -763 -499
5094 -499 5 -20 -529 -481 5 121 -381 -339 6 -104 108 -253 -383 -471 58 91 164 220 187 13 353 -76 -368
5117 -368 -8 278 105 -112 -231 183 155 -150 -365 595 465 281 -18 -258 249 343 48 -22 234 146 78 -101
5139 -101 276 549 151 -30 75 -435 279 394 597 -169 -225 799 713 178 -103 327 656 -147 -208 142 233
5160 233 60 -83 93 192 268 232 7 39 -79 316 454 -46 -56 208 331 -116 -187 178 -39 278 109 93
5182I3k03K68km98L38M28l79n41J59K97M58o04l31K89N34k73m57J75M19j57k32
5203b19o2R0M94j94l35l2j93N01p8l13O4m4M87l07n62L76L92j88l23j20N37n8
5225h7l87p9M75Nj79N03n47K71Q0n9j25J25r5K00j92n12M38L67k96m7rM80j40
5248A90k51k32L36k31K85Ln5m7K28k07k93M65j11r5O4j97K63L14j55k54K24n4
5270A90L30p6n67J84L47k49J63m47J26M06j76m73K58L65r4j4j74K83m6J0j92R2
5292B46L3r5K43k74k16L10M0k26l20M19L09m82j9j37M11o5l92ML67j51J1j69K51
5315I8NN7k8m75K18R7K21m68k07L51N32m03l66J01K02J38m01J97J38k63k8M9l1
5338b66l9J60L1k62m2N98k87j20l61M81k3k19j60L06O65m52l62M1O4N41j53o34
$$ plain form
5182 93 -110 158 156 -342 -4 424 45 -496 -337 -40 418 -186 -517 -228 306 33 -424 -249 170 13 -219
5203 -219 -281 -191 303 109 -226 -258 -451 50 -28 -341 -277 -321 166 -141 -703 -327 65 -123 -446 -566 -29 -87
5225 -87 -474 -553 -78 -73 -252 251 -296 -25 55 -4 -129 -4 -99 101 -91 -603 -165 202 -94 -141 -150 330 190
5248 190 -61 -293 43 -188 97 100 45 -2 226 19 -274 191 80 -15 49 -148 115 429 274 20 244 190
5270 190 520 444 -123 61 408 159 322 -125 1 407 231 -242 16 381 287 273 99 382 336 346 154 246
5292 246 279 184 427 153 -63 247 287 61 -259 160 469 -13 -32 -169 242 177 -215 -211 156 5 16 -153 98
5315 98 103 160 132 -343 -125 -28 193 -275 -482 -131 401 -2 -368 -267 -65 73 -328 -131 7 -256 -284 -235 -266
5338 -266 -305 -145 -114 -376 -418 180 -107 -227 -588 -107 -130 -349 -509 -203 462 10 -352 -311 -247 294 141 -493
5360d93M3M76L02l47k14N2J77J64k23j49J20J69p1m55M29J66j61k0OQ9K22J20
5382D02l76j61L18J9j79n29N98M98l89o5n20L15K37k9l87M12j79L21O3m35J34
5403F8J26R1j1k61P7L82j14q00M77N72j5p49j3M97K02k34l52K5J57K83l84J78
5425B02l28L11J06m1o88L10N54j9p94J23O33K5m92j69M05K33k81k95J7M06l39
5446a21j3k63N72K61l43k26k28L85J88l64j27K26j56K05k84l4k04L21J24N6k1
5467d6j01M8J37n33K34K03K07k13n44L23M66p13Q2M21N8j90k43j5O11l89j6J64
5489d9j34N4j03O3p4J02o3L19k07K14m23M91m01J26k2o1L12l51k10L10L20n01
5511b88J67L5L18j22m40L05J22j35j6L6K86o3k11M33Jn09L59j71K30l09l81N71
$$ plain form
5360 -493 -450 26 328 -19 -233 -181 -4 160 -63 -212 -92 77 6 -449 -20 146 -15 -35 -29 60 282 402
5382 402 26 -135 183 202 23 -506 92 590 201 136 -384 -69 168 139 -248 164 -15 306 369 -66 68
5403 68 194 285 274 13 90 472 358 -442 35 607 592 -157 -170 327 529 295 -57 -32 125 408 24 202
5425 202 -126 185 291 250 -438 -128 426 407 -387 -264 369 394 -98 -267 138 371 90 -205 -188 218 -121
5446 -121 -134 -397 175 436 93 -133 -361 24 212 -152 -279 -53 -209 -4 -288 -322 -526 -205 -81 -25 -46
5467 -46 -147 -99 38 -495 -261 -58 149 -64 -608 -285 181 -532 -450 -29 29 -161 -404 -419 192 -197 -213 -49
5489 -49 -183 -129 -232 -169 -243 -141 -204 115 -92 122 -301 190 -211 -85 -107 -168 144 -207 -417 -107 213 -288
5511 -288 -121 -86 232 110 -330 -25 97 -38 -54 -18 268 205 -6 427 428 -81 278 107 337 28 -353 218
5533B18K71m05m92L72M44k04o36P28O39r19k03J11M18l09j81N70k30Q6l98L11
5553A91J27k20Q4J39k47l09j71O95K79p92j36P57m9n59k75P80l08L4k77J20L58
5574B21k95j51L41N3k10o9Oj75M08o9j08j8J15l10K82j6j58K6L80q0o37J57K26
5597h1P13r26k59L18O86q03k13K60M64k64j23j7K49K42l87l14L82K16k69Q1O8
5618B3l07M3M59k72k32j07M94k07l28P9N38K82o27j9k87O70j61k6k27K84L08l66
5640A4k86L53K04j94O2j45J73k82K42k43J76M7R0J72J72r02M39M68m2l96r8L06
5662C30nl83j47M93L86n74o19O21L25m63l55O53K17j83k87J84J36k42m6L05k28
5683A18j85p8M67J7n75J12O25l68l62J71N21j58l86JK27J21r6m09n5L74R3m13
$$ plain form
5533 218 489 84 -408 -36 408 204 -432 296 935 16 -187 -76 342 33 -148 422 192 278 -120 191
5553 191 318 98 182 321 74 -235 -406 289 568 -224 -360 397 348 -211 -486 294 -14 20 -257 -137 221
5574 221 -74 -225 116 169 -41 -110 -104 -279 129 60 -48 -66 49 -261 21 5 -153 -127 253 173 -464 -307 -81
5597 -81 632 -294 -553 -235 451 -352 -565 -305 159 -105 -228 -245 4 246 -141 -455 -73 143 -126 -45 23
5618 23 -284 -241 218 -54 -286 -393 101 -106 -434 -355 183 465 -162 -181 -468 202 41 15 -212 72 380 14
5640 14 -272 81 285 91 153 8 181 -101 141 -102 74 121 211 383 555 -347 92 560 518 122 24 330
5662 330 325 -58 -205 288 674 100 -519 102 427 -36 -391 262 479 296 9 193 329 87 41 346 118
5683 118 -67 -145 322 339 -236 -124 501 133 -229 -58 463 305 -81 -80 147 268 172 -237 -292 82 175 -238
5705b38M84l84n9K26l44Q5k1L24K75l14l79L03K65j16k36j32L35K20o76o4N35
5726H9n6r4l08L52N0l36k35L75K64L3m84J79J23k17K66k01J58j08j29K32J00n17
5748d64M03M31m58k37l6N50M5l55k55M59L9j10j80J99J85l48R7J05l4J13j08R9
5770A40p5P3K67j62m33K52J50l24N34n26K00J63R1k6l59L07m9k92J42j69M92%
5792C96m30j5L12R0o49J80M39j51j67o3L44Q9J8j94j32q5K5K28J28q19J24O32
5814C00o2l95N9j14M70l99J42o1O58m69j62l44M65J45k9m26M34Nm70K83k17K72
5836H5k11K41k78J36j73K19Q0n9j22Q9m5Q9m43NL38J54n03%L43L14k38k26J43
5859f2M8j33L1k31M59k63j90J60M0k14K81j26L32n55K49K31l85n0J77L6j6l62
$$ plain form
5705 -238 246 -138 -197 29 -315 -230 -251 73 348 34 -345 -42 223 107 -129 -261 74 294 -382 -446 89
5726 89 33 -61 -369 -17 33 -303 -538 -163 101 134 -350 -171 -48 -265 1 -200 -42 -150 -279 -47 53 -464
5748 -464 -61 370 -88 -325 -361 189 234 -121 -376 83 122 12 -168 31 216 -132 -35 70 36 149 41 140
5770 140 65 138 405 243 -190 62 212 -112 422 -104 96 259 350 324 -35 272 223 -69 73 -96 396 396
5792 396 -34 -49 263 353 -296 -116 323 172 5 -58 286 375 393 199 67 -18 7 235 363 -456 -332 300
5814 300 238 -157 -98 -212 258 -141 1 -60 598 129 -33 -377 88 233 204 -222 212 217 -253 30 -187 85
5836 85 -126 115 -163 -27 -200 19 99 40 -82 7 -38 51 -392 -387 -49 105 -398 -398 -55 259 21 -205 -62
5859 -62 -14 -147 -116 -347 112 -151 -341 -181 -141 -355 -74 -200 132 -423 -174 57 -328 -378 -201 -165 -181 -543
5881e43M04J72L4l15j37N67J09j45j73J28r9k29K48M4m6K26J3j93j33K28K47n57
5903a50J2K96q3j37p2J27J26J4P4j52K9M5KR4j75O2J95m7k48k31P96k14k58p8
5927B7L78r2l0p2o0L56l2n12L39o8j52K03k33n8p4J04L44k00j69M0K60o3k91J26
5951G1J06k88J96m11K14L77l21k53P8N25j91r7j33P0K77m16l8J39L6O9l63O9K34
5974e0J6M8Om19L71j8j29n6p2N76j5n76J06J73L66n48k73P0L41M4l36K77R6j01
5998a03J98p9L0j7M6k6j33j16k30P82m45k96J38L69J1n67M04j1l16oM68m7r7J26
6022H3k08K33k01J67rk3q0n5M26k27N7m72K79L25l25k4r8M16k40j36N3K03L68
6045E12l11l23L3K44On3k96K75J68j73j38L45m6Jk28K85k07J65J26m47j55K78
$$ plain form
5881 -543 -139 33 67 -248 -385 182 291 146 -27 101 2 -227 21 65 19 245 258 65 -68 160 407 -150
5903 -150 -138 158 75 -62 -134 -7 119 133 207 55 84 129 131 225 50 112 307 260 12 -219 577 363 105 27
5927 27 405 313 283 211 151 507 475 -37 302 234 82 285 52 -6 -80 24 368 168 -1 39 299 236 -55 71
5951 71 177 -111 85 -326 -112 265 -56 -309 -231 294 103 6 -127 -57 220 -196 -234 -95 -59 10 -353 -284 -50
5974 -50 -34 14 20 -399 -28 -46 -175 -231 -303 273 258 -318 -212 -39 327 -221 -494 -424 -83 -39 -375 -98 -2 -103
5998 -103 95 16 46 29 75 49 -84 -200 -430 352 -93 -389 -251 118 129 -438 -34 -45 -361 -367 101 54 -43 83
6022 83 -125 108 -93 74 65 42 -38 -93 333 106 163 -309 -30 295 -30 -54 -152 264 24 -112 -59 144 512
6045 512 201 -122 -89 155 161 108 -188 87 255 82 -56 289 243 244 16 301 94 259 385 -62 -217 61
6067F1K23l09Q3jK31J55n93R7K28o1L0r9K3K95k61j99N2K12k17o4m0j06L14J10
6091A64on31N93k06N4k88M56j89O2J44m59J63J86j44k56P2j29L94n7rl15L11j56
6114a46J73k86m9O16m93j48M62k5n36M4j28O20l37J75J44j43q6M27m8m05j00L89
6136A20p1Pm21J13L00l22J32k5l9K07j69J12J62q7o0j37M24l63J60l89K26j21
6158b41K48K59n2l43J75j4K94l72j46N85J12n75L3OJ03J2m97L43K40L13k64j49
6180G0K36L0m71J86J19j13Q4P1J44k41J1K21P9n73P09l71j91M9j47N7M74l51K7
6203A09l6L8Q3j13j47K69k12m8j05R0J88N8N8j17P9k69J13k9j13q2L44p6p67M72
6227b13K97l4j23r7j97P11m69m83K93K13K02K0l84kM20l87l89O43N0m2j71l5K7
$$ plain form
6067 61 284 -25 58 57 288 443 -150 -53 175 114 144 45 68 363 102 -97 -45 167 -50 -114 -154 -260 54 164
6091 164 158 -373 220 14 68 -220 236 47 109 253 -206 -43 143 -1 -257 -185 -314 80 23 14 -301 10 -146
6114 -146 27 -259 -308 308 -185 -333 129 104 -432 -388 -516 104 -233 -58 86 -57 -143 284 236 -169 -269 120
6136 120 49 56 -365 -252 48 -274 -142 -167 -206 1 -168 -56 106 19 -41 -178 246 -117 43 -346 -120 -241
6158 -241 7 266 214 -129 46 32 326 -46 -192 393 505 -70 -37 -31 72 84 -413 -70 170 483 219 70
6180 70 306 336 -135 51 170 57 141 212 356 115 126 347 426 -147 562 191 0 49 -98 -41 433 82 109
6203 109 73 111 194 81 -66 203 -9 -57 -162 -72 116 174 232 115 194 -75 38 9 -104 -186 158 82 -685 -213
6227 -213 84 50 -73 -170 -367 344 -125 -608 -315 -102 100 120 -264 -266 154 -233 -622 21 71 29 -142 -177 -150
6250a50J26J35R0k90j20j59L47j27l00k6Q08l79n65K49M76m6l10l71N62J50k40
6271a40P1J92j74j9q7J00j48l9K96nL8k42J53J54l00l00J49M26M4n12L2K40J58
6294H7q9r4J81L08j19m88L69J05q8l47M51J81l10q4Pj00K12Oj57j09N2K1K12M3
6318B50k32K43J25o1l02q0K36K88m11k93N97Jn02K3L79J01l91o3J09J29j68l49
6340c71M88k2l50K10K56j58l13L17K02j98n06M78m2j25j54k7N61j77pm31K92L41
6362B64j91k96M18k62J17j87k6K36n07JJ99J13J0k0j60N5J65o1J3J00l0m61M49
6385f1L24k74k54J73L41n54l26L35M93p3n52Q9L56j14J2j02K48q5K43r1O8j06
6407I0M9P2l55N4k4J4J67k69k2M60m1o27L29K7J95J05l24K43J55N9l03m09M73
$$ plain form
6250 -150 -24 111 201 -89 -209 -368 -21 -148 -448 -474 334 -45 -610 -361 115 69 -241 -612 -50 100 -140
6271 -140 -69 123 -51 -70 -157 -57 -205 -244 52 47 85 -157 -4 150 -150 -450 -301 125 169 -343 -311 -71 87
6294 87 -2 -96 85 393 274 -214 155 260 172 -175 276 457 147 63 70 -30 182 188 31 -78 -26 -5 207 250
6318 250 18 261 386 325 23 -57 179 467 56 -237 360 361 -141 -118 261 362 -29 -92 17 146 -22 -371
6340 -371 117 95 -255 -45 211 53 -260 57 259 61 -445 33 -9 -134 -288 -315 246 69 62 -369 -77 264
6362 264 73 -223 195 -67 50 -137 -163 73 -434 -433 -234 -121 -111 -131 -291 -236 -71 -132 -119 -19 -49 -510 -61
6385 -61 263 -11 -265 -92 249 -305 -631 -296 197 124 -428 -339 17 -97 -85 -187 61 -24 219 128 196 90
6407 90 139 211 -144 -90 -114 -100 67 -202 -224 236 195 -432 -103 -76 119 224 -100 143 298 357 54 -355 118
6430A18k9r4j08L60p8K12q9m67J66J52k73J79pj14j09O22k41j87J63N5L29o16
6452e6l77Q11l9j78k28M73k20J06n11N25j07n31L20O0M8k88M90j10k0j75j11L42
6474B24k29k06L92R1k93j51Q0R7l54K76k83N95j29m43K41M03o8m37k8M71l40n9
6496a50R6l23K99n2k32L31j07k91L12k7k32J86J62q3J05l36M11j25M3j0l16M58
6518A19k25J61k51K90Lk09k68L86K7k50n5P6L89l62k8J17l1J17j31M7n9Nm3M98
6542C23k45k08r8M06J40l83J68k64M85k13k23NJ35J2R2j0j6q0n9j34J77K34k53
6565ik15J15J25r2L31j74m0j3j28L00q3j80L25K02j73j35R2Q0n3l28K7M15L4n00
6589g7J1j63N02k18K54r3l37K21o7J55j05n13N12J96o4k65L05m1n2j63n4j89K31
$$ plain form
6430 118 89 -5 -113 247 169 381 292 -175 -9 143 -130 49 42 -72 -181 441 200 13 176 231 560 -56
6452 -56 -433 378 339 161 -67 406 186 292 -219 306 199 -332 -12 48 96 -192 298 188 168 -7 -118 224
6474 224 -5 -211 181 272 -21 -172 -92 5 -349 -73 -356 239 110 -333 -92 311 243 -194 -222 249 -91 -150
6496 -150 -54 -377 -78 -130 -362 -31 -138 -429 -117 -144 -376 -190 -28 -111 -6 -342 69 -56 -13 -23 -339 119
6518 119 -106 55 -196 94 97 -112 -380 6 33 -217 -272 -196 193 -169 -197 -80 -111 6 -125 -78 -137 -132 -175 323
6542 323 78 -130 -228 178 318 -65 103 -161 324 111 -112 -107 28 40 132 122 106 26 -33 -167 10 244 -9
6565 -9 -224 -109 16 -76 255 81 41 28 -100 200 117 -63 262 464 291 156 248 328 275 -53 -26 389 423 -77
6589 -77 -66 -229 273 55 309 216 -121 100 33 188 83 -430 82 278 214 -51 254 213 161 -2 -56 -245 -14
6612a4K3k3j23J45k9J9k55J72J45l25j90O74l13K08l74k59O70l56k6k6k2J1M3
6635b25J84j53J63j86J70k29r0L41N1j97j98Q1L35m53K49L11k82J36K8k81J84
6656f1O6k78K22k35J97j93K34j52O2K62r6Pj37J26J64j97k17j12N73m2k68P9K58
6679B62k2M4m57L87n2m1ll33J96j8K85m27J23K65M9l11j44M60k38j57M99n25N07
6702C49l35K00k51q3L26j01K39l48K81O6k41k55J91P5L39m91n0L22l6k68Q9J01
6724A19J3j60K13l8PO6o4kL4j57R7j81M5p0J93K4k96K20P4q4J61l89j16K23%M2
6750b6m9j9L3J5k07K48J58m46L52k17j90L2K27J32l01r4L76j51Oj31J50k4J79
6773E3n21K18L42q0r9j52M4Q1K5r9M1J47M0n7k44O2K25l10O98n72M0L42l44l36
$$ plain form
6612 -14 9 -14 -137 8 -21 -2 -257 -85 60 -265 -455 219 -94 114 -260 -519 151 -205 -231 -257 -279 -268 -225
6635 -225 -41 -194 -31 -217 -47 -276 -366 -25 26 -171 -369 -288 47 -406 -157 154 -128 8 36 -245 -61
6656 -61 5 -273 -51 -286 -89 -282 -48 -200 -138 124 28 35 -102 24 188 -9 -226 -338 235 193 -75 4 262
6679 262 240 284 -173 214 162 121 118 -215 -19 -37 248 -179 -56 209 258 -53 -197 263 25 -132 367 -158 349
6702 349 14 214 -37 -120 206 105 344 -4 277 343 102 -153 38 113 452 -39 -89 233 197 -71 18 119
6724 119 132 -28 185 147 154 220 156 154 188 31 128 -53 -8 -78 115 139 -157 63 137 53 214 -175 -291 -68 -68 -26
6750 -26 -75 -94 -61 -46 -253 -5 153 -293 59 -158 -348 -316 -89 43 -258 -352 24 -127 -121 -252 -102 -126 53
6773 53 -468 -250 92 12 -87 -239 -195 -114 -89 -188 -147 0 40 -17 -261 -199 26 -284 414 -158 -118 224 -120 -456
6797d56K75J85L04m92p2L20N4k67J6K5K94k6l61L4M12m23K6K00k8l9k5pk7N3n6
6822h1J11l1m1J70J31j78n5m32L48K30r7oQ9j03J31j35J08J45j44N4J1k34O1J16
6846A68j64K07r6K13k57l51M50m69L74j44l9L00k72K07j61m3k16O02n74L69j84
6867h0l0j5J09k9K32Q9l73J07k5j54K43j5m37K61n2L42j56j08j12K75j51j70O6
6890a83l9L48k23n4O5K44k15l91M68J70j52O1k90J63O9m45J94N9L53o6l30J46
6912d8J42r8J88k21j57J59J13Km4m12L24J85j88j32M3J92J06l66J27k0K22j69
6934e2j28L54j14J8j7l1n3j5J53R0m6l34K83J19l17p7J29M33k2n96J25N52m56
6957bM09m03J32J21k60l9j21N26j10m87K25R9K53n51K70J63j80j05J39j00QJ76
$$ plain form
6797 -456 -181 4 308 -184 -256 64 118 -149 -133 -108 186 160 -201 -167 245 -178 -152 48 20 -19 -44 -51 -78 -25 -81
6822 -81 30 -1 -42 128 259 81 26 -406 -58 172 75 69 158 55 186 51 159 304 160 214 225 -9 52 168
6846 168 4 211 115 328 71 -280 170 -299 75 -69 -108 192 -80 127 -34 -77 -293 309 -265 104 -80
6867 -80 -110 -125 -16 -45 187 276 -97 10 -15 -169 74 59 -378 -117 -169 173 17 -91 -203 72 -79 -249 -183
6890 -183 -222 126 -97 -151 -86 158 -57 -448 20 190 38 99 -191 -28 41 -404 -210 -151 202 136 -194 -48
6912 -48 94 -4 184 -37 -194 -35 78 80 36 -376 -52 133 -55 -187 -144 48 154 -212 -85 -105 117 -52
6934 -52 -180 174 60 78 61 30 -23 -38 115 205 159 -175 108 227 -90 -167 -38 395 373 -223 -98 454 -2
6957 -2 407 4 136 257 -3 -42 -163 363 253 -234 -9 90 343 -208 62 225 45 -60 79 -21 -13 163
6979A63L4Q8l17R5j1j91j33Q4L79J1l22j84M69J14k24J20j7k37J38k21J62j10
7001a10k79K34O4K09p7k81K08L2j81J41j9K98l47M65l08N7k81J81r3J8j23K84
7023I2l92O30j86l10k16J99J58n2j39L50j44k01J97k72K94J8K3m7K33m07n9K01
7045c0J00j37m0k2r8j44K73l37O07l00J9p1K17o0j11L27r3j38k55K03J5L34m02
7068a43K77l51J74j75K54j57L6K41o3j5O8k0l9J02k42J0K47j08m31J99J93J66
7090B23k93L05n1J37j55k41J11N0k49K44j5J73j27m3K40l30j31J31K35J07l59
7111c8J66P7k01o6k8K78N2m06P3J40J33j45K3J14m3k05j11K47J22q9l11J82R0
7134E4l21J56K69j96j02J53K99l61P5k7k2L06m19p4K00J03k86OK33O9l48K27J73
$$ plain form
6979 163 197 285 -32 63 52 -139 -272 -188 191 202 -120 -304 165 279 55 175 158 -79 59 -162 0 -110
7001 -110 -389 -155 -91 118 41 -240 -32 0 -181 -40 -59 239 -108 357 49 106 -175 6 -87 -69 -192 92
7023 92 -300 330 144 -166 -382 -183 -25 -77 -216 134 -10 -211 -14 -286 8 26 49 2 235 -172 -231 -30
7045 -30 70 -67 -107 -129 -227 -371 -98 -435 172 -128 -109 -180 37 -23 -134 193 100 -38 -293 -90 -75 259 -143
7068 -143 134 -217 -43 -218 36 -121 -85 156 93 78 146 126 87 189 -53 -43 204 96 -335 -136 57 223
7090 223 -70 235 184 321 166 -75 36 86 -163 81 66 239 112 69 309 -21 -152 -21 214 321 -38
7111 -38 128 205 4 -62 -90 188 240 -166 -93 47 180 35 58 172 129 -76 -187 60 182 93 -218 -36 54
7134 54 -267 -111 158 -38 -140 13 312 -49 26 -1 -23 283 -136 -210 -10 93 -193 -187 46 115 -233 -6 167
7157A67j09j80j19K78k45j58K52j12q5K64j3J4j87K28J78j23k61J27q1k9J26J45
7179G7J69l3n3j16l10J53K01o2j41J35K05n66J02K00J67q6m8n6J68O2k75L6Q3
7202A2q6q4K17K19j08k49N1K26j99J27j24M7J90k13k38L43J35j30p3R5J05j14
7224A49o5j26J10K23n52L64j67L08n90L63j21qJ60l5j06L6q2M46L01o96K38p5
7246G5o8k68J45L67j71j89k4n9jJ17Q0K84o6m8j69O7j69k03M54m5k47Q0K33k8
7270A47k93P2Q4J5k46M5M13l84Q3Nj76L3L80j87rj38K55N2j89r5p7p8J79J45J32
7295A68k72p8O9L2M9q7l1j82J88L42k40l7m7Pk29K54K80k78J53K74n02M64k10
7318H7k27Q5J69j47k05J88j0L71k75m03O6L96kk94M9j57L79L11m11L42l11o9m5
$$ plain form
7157 167 58 -122 -241 37 -208 -366 -114 -226 -311 -47 -60 -46 -233 -5 173 50 -211 -84 -165 -194 -68 77
7179 77 246 213 160 44 -266 -113 88 26 -115 20 225 -341 -239 -39 128 42 -6 -62 106 168 -107 -71 12
7202 12 -74 -158 59 278 170 -79 -28 198 -1 126 2 49 239 26 -212 131 266 136 63 158 263 149
7224 149 84 -42 68 291 -261 103 -64 244 -346 17 -104 -112 48 13 -93 -57 -139 307 608 -88 150 75
7246 75 7 -261 -116 251 80 -109 -133 -192 -193 -76 4 288 222 174 5 72 -97 -300 154 109 -138 -58 175 147
7270 147 -146 -74 10 25 -221 -176 237 -147 -64 -59 -235 -202 178 -9 -18 -156 99 151 -38 -133 -210 -288 -109 36 168
7295 168 -104 -182 -113 -81 -32 -119 -150 -332 -144 198 -42 -79 -126 -119 -348 -94 186 -92 61 335 -167 297 87
7318 87 -140 -55 114 -33 -238 -50 -60 311 36 -367 -301 95 93 -201 -152 -309 70 381 -30 312 1 -68 -113
7341a13K23q3j28J82k02L88k90J84j48j06K02k84L59n9j55J24J85l84L11k39J53
7362A20J11K0j54K65j10ok09M6jr3l4K37n1k5k39J25K7j67J11j70J68O7J4l5J56
7387A73ln6J5p6j26p0K92j95l8k48P1k3j27K69J59k13L69l31K22J41k69l8j89
7410b91K71k19J07k18L47J03k26M07k47r8J46j96m2K17j72MJ75l99K2o1N34l67
7432b03J07r4N0J10k51l5L39k1M0O2k03K46k7k33j7L90n9j69j07L86k8k71j81
7455a69K9K63LJ26l51J37L5M2J8j69P0K23l2j62j59k0K62m1j72L44k75n0L65l36
7479a9j39rK68j40O0NJ02Q4k55m7K05J63j77m41M65K94l34m8n0P87n40n41K93
7502a4M2N3L0k28L23k39J15r4J61k19N2K21k44k86L4K91m7l0nj05Q1mk17J87L56
$$ plain form
7341 -113 110 27 -101 81 -121 267 -23 161 13 -93 109 -175 184 125 -30 94 279 -105 206 -33 120
7362 120 231 251 97 362 252 246 37 83 82 -11 -45 192 141 116 -123 2 29 -138 -27 -197 -29 38 52 17 173
7387 173 170 114 129 53 -73 -143 149 -46 -84 -332 -261 -284 -411 -142 17 -196 173 -158 64 205 -64 -102 -291
7410 -291 -20 -239 -132 -350 -3 100 -126 281 34 -64 82 -114 -156 61 -111 -107 68 -331 -309 -370 164 -203
7432 -203 -96 -190 -140 -30 -281 -316 23 2 42 104 -99 147 120 -113 -130 260 201 32 -75 311 283 12 -169
7455 -169 -140 123 126 252 -99 38 73 115 133 -36 34 257 225 63 -96 -116 146 105 -67 277 2 -48 317 -19
7479 -19 -158 -167 101 -39 21 26 128 212 -43 -90 115 278 101 -340 125 419 85 37 -13 774 234 -307 -14
7502 -14 28 81 111 -117 206 -33 82 -12 149 -70 -18 203 -41 -327 -293 -2 -49 -79 -84 -189 -108 -112 -329 -142 214
7527B14j17q4Np8J47l22K78o4P9N1k8j00O5o1J20k26k5K38k81M52m64K01k31M6
7551a85m3j9qK68M1L2k91K71j92N8l32K73K35j45l33L96O6k80o7k15K96j07K15
7574f6J80j47j25NL6M61n15Q9M37j79m05J31L5o3J02r7K11J81m82%L6J48l3J95
7598A35k77J62J0o4LJ48j29j13J79K57m71L87l82K34j0j67L15Ok95J98j54Qj40
7621a60L66p6K27j73k30J7L04m25K23j78J25K1j56J49Q5k67K39k03K73Ol63L6
7643a60K03j61J30N6K52k70k95K04KK50o35O27Jl65M0M8P2K18j80j11O1J97l82
7666a98K32l46J57J98l08L02m48M02jK42m98L14j46L7J51J15p9l8Q6m08Ol6J65
7689i9nk15J66K54m36K29L71j25l57M7L26Pj16m14N96l02J68j31L94l12l1K03
$$ plain form
7527 214 97 13 18 -60 87 -235 43 -21 58 109 81 -19 46 -15 105 -121 -146 92 -189 263 -201 0 -231 -185
7551 -185 -228 -247 -255 13 54 86 -205 66 -126 -68 -400 -127 108 -37 -370 26 92 -188 -255 -470 -174 -281 -66
7574 -66 114 -33 -158 -153 -117 344 -171 -82 355 176 -229 -98 -63 -126 -24 -121 90 271 -211 -211 -175 -27 -60 135
7598 135 -142 20 30 -34 -31 117 -12 -125 54 311 -160 227 -155 79 69 -98 217 223 -72 126 -28 -20 -160
7621 -160 206 130 357 184 -46 -29 275 -150 73 -105 20 41 -115 34 119 -148 91 -112 161 167 -196 -160
7643 -160 43 -118 12 68 320 50 -245 -41 -39 211 -424 203 204 -161 -121 -73 -1 217 37 -74 -13 184 -198
7666 -198 34 -312 -155 43 -265 37 -411 -9 -10 232 -266 48 -98 -61 90 205 126 88 174 -234 -228 -264 -99
7689 -99 -104 -319 -153 101 -335 -106 265 140 -217 -170 156 163 47 -367 229 -73 95 -36 358 46 15 218
7711B18l11J60k28N3J79J58j98l52L77K08m17K99l89L40j16j35L45J98l44l19
7731b74K45J88m11M29P7k58lJ98j7k73K06k85L37J6j05q4L84j22l39nK33Lj37
7754Cj3O5L0o6J10R9J90k63p5j32J36k30J15K09j16l70J76N5J61p0l20M52k88
7777a42K48o6j24K17q4l46R4N50l81r6q5J48J67m00mK14mJ11P6n4ol14R2J57p9
7802a11K7J2j93O2p2K96L7m2j34p5j07K63Q8k94K85K32k69j05K66m81J36m75Q44
7825A90l00K41j95j90l8M84m35J72R8n4J62l04K32k21J24k8L18k62k28M44j79
7846C1n80P95l12K57l32K51J9J29j83m23K62K58r1l0L23l07j18M6J8K2L2P5L5
7869A77n9k31K04J17j56L5J20q6k1q2M7L6J44k01N11n26N4J61l36J12J52j16J01
$$ plain form
7711 218 -93 67 -161 -108 71 229 31 -321 56 264 -153 146 -243 97 -19 -154 191 389 45 -274
7731 -274 -29 159 -252 177 254 -4 -7 191 174 -99 107 -178 159 175 70 -14 370 248 -91 -96 137 140 3
7754 3 -10 55 85 19 129 228 418 155 80 -52 84 -146 -31 178 62 -308 -132 -77 84 14 -306 146 -142
7777 -142 106 40 -84 133 49 -297 -203 347 -34 -130 -215 -67 100 -300 -304 -90 -94 17 93 39 33 -281 -189 -32 -111
7802 -111 -84 -72 -265 -203 -275 21 58 16 -118 -193 -300 -37 51 -243 42 274 5 -100 166 -315 -179 -654 190
7825 190 -110 131 -64 -254 -292 192 -243 -71 27 -27 135 -169 63 -158 -34 -62 256 -6 -234 210 31
7846 31 -549 246 -66 191 -141 110 129 258 75 -348 -86 172 81 51 374 67 -51 -5 13 35 67 142 177
7869 177 118 -113 91 208 52 87 207 121 100 18 65 101 245 44 555 29 83 244 -92 20 172 56 157
7892A57J51j45k46N5J66k70L76k75K17k9l56K09K71k77J71j90p7K79n51K86J41
7913F3K18k76K5j99N2O2l66N56k41Q4j23K20l06P7J5J26j05Q1j22j2Q0j52l6N2
7937b27L50n4K7j98Oj74o6N72l77K1j08k74M89J45k00r5l3K58Ko35L29Q0O6K72
7961A76K2j79M8J29r4j16j51K32l36L29k9K09j29j66Nk23J87j63KM62k94L03m37
7984b13mP6Q7J44O8J59j46l75M07k28K03k31J71j3m8m7J76N4P3m21j0J47l8j35
8008a44p4L14K09l66K1J8L05k46J01k61l4K52N7l00L71j97L7K5j55k63M71p0m80
8031d09K56K62j76L98m92P9M53j68j78j99o8j61M67k12J80M1r3j18L06k16J2J01
8053F5j72M16l26m0j01k6K89k70J32j46J94j55p6J2J30j42J21L70j4m47K80l1
$$ plain form
7892 157 308 163 -83 -28 138 -132 244 -31 186 157 -199 10 281 4 175 -15 -92 187 -364 -78 63
7913 63 281 5 30 -169 -117 -55 -421 135 -106 -22 -145 75 -231 -154 -139 -13 -118 -37 -159 -171 -91 -243 -279 -227
7937 -227 123 69 96 -102 -96 -270 -336 236 -141 -120 -228 -502 -13 132 -68 -163 -196 62 64 -571 -242 -162 -96 176
7961 176 198 19 67 196 102 -14 -165 67 -269 60 31 240 111 -55 -50 -273 -86 -249 -247 215 -79 224 -213
7984 -213 -217 -141 -54 90 158 317 171 -204 203 -25 178 -53 118 105 57 10 186 240 313 -108 -118 29 -9 -144
8008 -144 -218 96 305 -61 -40 -22 283 37 138 -123 -157 95 152 -148 223 26 63 88 -67 -330 141 71 -409
8031 -409 -153 109 -67 331 -161 -82 371 203 25 -174 -242 -403 64 -148 32 73 -20 -138 168 -48 -36 65
8053 65 -107 309 -17 -57 -158 -184 105 -165 -33 -179 15 -140 -216 -204 -74 -216 -95 275 261 -186 94 63
8075F3K57n50o7K24l1m9L9J69Q4J46m38M7J35p6N4J20l7J00k73K05p2l48K17J9
8099f2J54K21m16k5J37j14j5K26j53k8P7j53q4K26N7N6k9o9K8j04M54k90J54l0
8123B18m84J27K2Q9J71j42o6k8K58j54j45R9J25j41J39O2Rl11J14L45l51N6K23
8146B35j27q5j18M0J35j79K23J86j65j23j36L53k07jj01K04q6k20l15N33q1J64
8168A29j62j47L72l87K87J6j48M7k8k17K5J12K51j22j51o0J86R4j23j04J03k32
8190b59L78
$$ plain form
8075 63 320 -230 -297 -73 -104 -153 -114 55 139 285 -153 -106 29 -47 7 127 90 190 -83 122 50 -298 -81 -62
8099 -62 92 313 -103 -128 9 -105 -120 106 -47 -75 2 -151 -235 -9 48 104 75 6 34 -70 384 94 248 218
8123 218 -266 -139 -117 -28 143 1 -65 -93 165 11 -134 -35 90 -51 88 150 159 -152 -38 307 -44 12 235
8146 235 108 23 -95 -55 80 -99 124 310 145 22 -114 239 32 31 -70 134 48 -172 -487 46 -35 129
8168 129 -33 -180 192 -195 92 108 -40 7 -21 -238 -213 -101 150 28 -123 -183 3 97 -26 -130 -27 -259
8190 -259 119
8191A19
$$ Imaginary data points
##PAGE= N=2
##DATA TABLE= (X++(I..I)), XYDATA
0@%%%%%%%qJ6j6J6k4L2m0M8n6P2q4R6j16J36j55J80k09K41k75L15l60M06m58N16
31B73n81O52p30Q16r08J009j121J245j382J533j694J873k076K300k550K832l154
48a663L522l948M449n047N776o691P878r482J1786j5400K1917l7284J35529J01262
62B12604l13169m3268K05972Q0302j91813p2437J35811Q6904j03124o7053N3596
73a5675N7864j8848j3303j105j6383j3644K7978J3085k3317q444L3434Q750k9698
86F94j3734K2398N581k2473j1745J2918P706o226l242R739J2331N796o544r614
100C585l14L684j0727j5627O906J9906k71j5611n82J0334j757k118J2654K450
114A2512k4655j1457K4303J2164k4714n712L7218J3270m1851k3931L3908J9564
$$ plain form
0 0 0 0 0 0 0 0 0 -8 8 -8 8 -16 16 -24 24 -32 40 -44 52 -64 72 -83 97 -112 129 -146 169 -191 215 -243 273
31 273 -308 344 -386 430 -478 531 -590 655 -727 806 -888 985 -1091 1209 -1341 1491 -1663
48 -1663 1859 -2089 2360 -2687 3089 -3602 4276 -5206 6580 -8820 13097 -24187 111342 212604
62 212604 -100565 -143833 62139 142441 -49372 -121809 14002 100906 -2218 -69271 -15675
73 -15675 42189 23341 10038 8933 -7450 -21094 6884 19969 -3348 -11792 21642 30392 694
86 694 -13040 9358 14939 -7534 -19279 -6361 1345 -4881 -8123 1616 13947 19743 13199 3585
100 3585 3271 6955 -3772 -19399 -12493 7413 7142 -8469 -9051 1283 -474 -2592 10062 12512
114 12512 -12143 -23600 703 12867 -11847 -17559 19659 32929 -8922 -32853 1055 20619
126B0619l6089k1451L2708K0330k6712j0115L2083R811k8280m506K6388n497l2301
139b3012M772L1222r241l2248J1727L7620o246l5361J841L0832J604k6910q233
152b1633K1748J6696r964k1334n20K5697J3991k4709k7575J5392K8471j2641l0353
165b6734J1414L4921r62k6947l162J7677L617n168J096n096r504P615J0900j4992
179e325j3968K5199K4568k6907l2625K3502L4784k1129l3514K2218L6196j8779
191A4220l7014J4373L4317r795l0378M852K2674m696j7695K468J2408J166k693
204D207J760k771m750O697O907j1505j1044J3764J6160j4721k2539J0538K5446
217A8149m522k3976m46K0416K273j8210m740J6335J0627q899j3163n34R467K812
$$ plain form
126 20619 -15470 -36921 -4213 16117 -10595 -20710 11373 21184 -7096 -11602 14786 9289 -23012
139 -23012 -18240 12982 3741 -28507 -16780 20840 14594 -20767 -18926 11906 13510 -13400 -21633
152 -21633 115 16811 6847 -14487 -15007 10690 24681 -28 -27603 -12211 16260 3619 -26734
165 -26734 -15320 19601 18639 -8308 -11470 6207 9824 4656 5752 656 -8848 -1233 9667 -5325
179 -5325 -19293 5906 30474 3567 -29058 -5556 29228 8099 -25415 -3197 32999 14220
191 14220 -22794 -8421 25896 16101 -14277 -9425 13249 8553 -9142 -6674 5734 6900 4207
204 4207 5967 3196 -1554 5143 12050 545 -10499 3265 19425 4704 -17835 -7297 18149
217 18149 13627 -10349 -10795 9621 11894 -6316 -11056 5279 15906 7007 -6156 -6690 2777 5589
231E589p555m631P392N611r681q173J1058J1110r308j0431J0687P845j4564r046
245a4097J7254R585j8620r397J8221P460j9190n314J8551K603j8686L25J8053
258F748j913j4998O659J3470j0774j1648J2870Q533j8859q728K0925Q102k2048
271a1661o020K4334P138k3053o547K1717O038j7418n199J3010J908r365J142N369
285A393m522k046P119j641j1579L481J6091r76j6585K076J8511O42j8063l337
299i436J5469L765j3351o704P827O219j417m176k156K551Q281K244j1739o168
313h791J3803J2513j4134j6283J2297J9016j0500k1154O631K0068n165j9535K513
326h721J7287J68j0853J528Q676k10l800R85k160m883L257N918p440p991R322
$$ plain form
231 5589 -1966 -6597 795 6406 -3275 -11448 -390 10720 1412 -9019 1668 9513 -5051 -14097
245 -14097 3157 12742 -5878 -15275 2946 10406 -8784 -14098 4453 7056 -11630 -11305 6748
258 6748 4835 -10163 -3504 9966 -808 -12456 414 8947 -9912 -18640 2285 10387 -11661
271 -11661 -17681 6653 13791 -9262 -15809 5908 11946 -5472 -10671 2339 4247 -5118 -3976 1393
285 1393 -3129 -5175 1944 303 -11276 -7795 8296 7320 -9265 -7189 11322 11964 -6099 -9436
299 -9436 6033 9798 -3553 -10257 -2430 3789 2372 -1804 -3960 -1409 6872 9116 -2623 -8791
313 -8791 5012 17525 3391 -12892 -595 18421 7921 -13233 -6602 13466 8301 -11234 -8721
326 -8721 8566 8734 -2119 -591 8085 7875 4075 5060 2900 -1983 1274 7192 -248 -8239 1083
341A083J1019q836j2122P734J2358o053j1499M113R347j045n308JJ756P96J116
356D460k525o382n15O367l83p551J114P565J013k845K808K205n188j467M995l381
372B90r313L961J1609m593j4094N211J5182m998j4440N006J2814n055j1341N191
386d570Q694m123l258O823J41j0748J461J1300n566j6186M786J7363m466j7486
400a5835O441K2150j496j9460n12J5827m92j4902j205J1704L31q645K95N569m56
415f86j602L771o65o406P31P736j977q212N120J2763k479j3491O44J2401r71j1771
431e094k862O852J437k944M76J965J523N484J958q643o510R517Q398j0472r859
446h774Q388R211p932p439P878P246n285m202L107k049m702O291O681o435n630
$$ plain form
341 1083 12102 3266 -8856 -1122 11236 5183 -6316 -2203 7144 6099 791 792 2548 3344 4460
356 4460 1935 -4447 -4962 1405 1022 -6529 -5415 2150 3163 318 3126 5331 143 -1324 3671 290
372 290 -9023 -5062 6547 1954 -12140 -6929 8253 3255 -11185 -6179 6635 1580 -9761 -4570
386 -4570 4124 1 -3257 3566 3707 -7041 -5580 5720 154 -16032 -11246 6117 1651 -15835
400 -15835 -9394 12756 11260 -8200 -8712 7115 6623 -8279 -9484 2220 2551 -6094 -5799 -230 -686
415 -686 -2288 1483 818 -5588 -4857 2879 902 -7310 -2190 10573 8094 -5397 -4753 7648 6677 -5094
431 -5094 -7956 -1104 333 -2611 -2135 -170 1353 6837 8795 152 -6358 3159 11557 1085 -8774
446 -8774 -386 8825 893 -6546 1332 8578 3293 -909 2198 149 -4553 1738 8419 1984 -3646
461c646R026O320j0842o270J1594M524j3210o620J0690M483r112q22J0486J061
475G662q055K84O064k282n118K443K802n527l458N767L190l426j355M367o08n140
491b390p73K700l36L05L020j494m199K405N564k371o752K844O021n902r568N114
507e812J0131l047q415M415Q963m559p887M740O653n803o516M217L279o506J85
522e962J0370p4j2570M75J3103j178j4362K527J5931k773j7421J850J7098p5j4368
537g429J230J2609l674j2810K567J0612j295p243K322N214k163k208L935J016
551B683l228k94K413k858m471L875N720j670m540l6L156J368j59k055j080L688
567B512K414n955n447O353R276m158r244L894P808n623q492N548Q551m480o177
$$ plain form
461 -3646 5380 11700 858 -5412 6182 10706 -2504 -9124 1566 6049 -3063 -3885 6601 7662
475 7662 -393 -109 5955 3673 -1445 998 3800 -1727 -5185 582 3772 346 -1009 3358 2750 -2390
491 -2390 -3163 -463 -799 -494 2526 1032 -3167 -762 4802 2431 -4321 -1477 4544 -1358 -10926 -5812
507 -5812 4319 1272 -7143 -2728 6235 1676 -6211 -1471 5182 -621 -7137 -2920 359 -6147 -5962
522 -5962 4408 4334 -8236 -7761 5342 4164 -10198 -7671 8260 5487 -11934 -10084 7014 6939 -7429
537 -7429 -6199 6410 2736 -10074 -7507 3105 1810 -5433 -3111 2103 -60 -2268 1667 2683
551 2683 -545 -839 1574 -1284 -5755 -1880 3840 2170 -2370 -2406 750 2118 1959 -96 -1176 2512
567 2512 4926 -1029 -6476 -123 9153 4995 -4249 -355 7453 1830 -6662 -1114 7437 2957 -3220
582c220M373L641n273m11P704O54q819r18P991k921r342M041J2358l029j2297
597e468J528J1286p04r358J780Q182k122q505J89N465o28p63L262n59o939j277
613d631P579J833o701j799P511J897q129k820O483M093k870l910m85P58J447L08
629E64l809k487O288N371o663p256O764Q674o717r711O521R598o278r153M262
644d032O840l707l090M982n04o433K577P113n879q316J0171J1846j1716j4793
658a4941J1146J5961r618j6136Q433J4852p840j4999N595J3294k471q287J965
671c046N546k971l255L873R91l182J017M093k933n580J903O654K76n793o50M833
687A776Q07m762k543M135O172j126o087j152M869J664m875j484N585K664n796
$$ plain form
582 -3220 1153 4794 -479 -890 6814 7468 -1351 -2269 5722 2801 -6541 -2500 9858 6829 -5468
597 -5468 -3940 7346 6642 -2716 -936 7246 5124 -3381 -3192 2273 1645 882 4144 3585 -3354 -4631
613 -4631 2948 4781 -1920 -3719 3792 5689 -2440 -5260 1223 5316 2446 -1464 -1949 -1191 256 564
629 564 -3245 -5732 556 5927 -736 -7992 -1228 7446 729 -8982 -2461 7137 859 -8294 -4032
644 -4032 2808 -899 -3989 993 489 -5944 -3367 3746 -2133 -10449 -278 11568 -148 -14941
658 -14941 -3795 12166 2548 -13588 -5155 9697 1857 -13142 -7547 5747 3276 -5011 -3046
671 -3046 2500 -471 -3726 147 1138 -2044 -1027 3066 133 -5447 -3544 3110 3386 -2407 -3057 1776
687 1776 2583 -2179 -4722 -587 5585 4459 -1628 -2780 2089 3753 -1122 -2606 2979 5643 -153
702a53m512M009L815k072p88L997o04n291p32O114J38n374K210O835l414j0078
718e900K440J1032p35j0345R7J0534j458j1075Q45J1024J336q630j7N587k771
733A964n662M407N135n492l794O320K320q967l068J0842M984r395n496P436L610
748E144o750l604N711M964k535m557k023J026L740J043l770j307M557J447p285
763d199l168P973N451n676m836L357K255l740r56L103Q6j208K881j036o671l26
779f710R851K780j0215l198R952L086j1748l748J1702O288r548o527O517M937
793C419o088l334N712L473l835k944J773O95o80J631K259j952k687J685J511k441
809a803j799M402L269l611m229J405L603J18k052L62J483O88j391k471k32L483
$$ plain form
702 -153 -4665 -656 3159 1087 299 4296 3692 -1599 -2331 3783 3921 -1453 757 7592 4178 -5900
718 -5900 -3460 7572 6837 -3508 -3411 7123 5665 -5410 -4565 6459 7795 -835 -852 4735 1964
733 1964 -3698 709 5844 352 -3442 2878 5198 -3769 -6837 4005 8989 -406 -5902 1534 5144
748 5144 -1606 -5210 501 5465 2930 -1627 -3650 -2624 1116 2159 -1611 -2918 1639 3086 -4199
763 -4199 -7367 606 6057 381 -4455 -1098 1157 -2583 -3539 -436 -350 -1558 1323 287 -6384 -6710
779 -6710 3141 5921 -4294 -7492 2460 5546 -6202 -9950 1752 8040 -1508 -8035 -1518 3419
793 3419 -2669 -6003 -291 3182 -653 -3597 -1824 -1129 -1809 -178 2081 129 -2558 -873 638 -1803
809 -1803 -3602 800 4069 458 -3771 -2366 1237 1355 -697 -335 1148 1836 445 -2026 -2258 1225
825A225K970k127l615J666K669k636k868M071L701l482l346L895J111n103m06
840b275P598R49q667l64Q079j613q831L519J0578k909j1050K195R499l787q110
855e189N690Q554o238q197M981N749n727k945Q105J732q738k811Q330J781p939
870b862N73Q288o60r329j235P563J659n106l84L624k9l588j042K230J561K13n67
887I09j818j521J174J619j208p67J833J307k613l009J432L323R84k682j552J003
903a586J508p71j791l32L195J637k901m568J706N634L0n623j44N038J304n778
919c442j896N374L637m213m081K162K863j024j297K31P16R44O25j484k273J735
935a423M445j013n940J32O044P84n112j465M282J868k902k022J473J961R17m99
$$ plain form
825 1225 4195 2068 -1547 119 2788 152 -2716 1355 5056 1574 -1772 2123 3234 -1869 -2275
840 -2275 5323 6272 -2395 -2759 5320 3707 -5124 -1605 8973 6064 -4986 -2791 6708 2921 -5189
855 -5189 501 9055 2817 -5380 -399 5350 -377 -3322 4783 6515 -2223 -5034 3296 5077 -2862
870 -2862 -2289 5999 5339 -3990 -5225 2338 3997 -1109 -1493 2131 2102 -1486 -2528 -298 1263 1476 909
887 909 -909 -2430 -1256 363 -845 -1612 221 1528 -1085 -4094 -2662 661 1645 -1037 -2589 -1586
903 -1586 -78 -849 -2640 -2972 223 1860 -1041 -5609 -3903 1731 1761 -3862 -4006 1032 2336 -3442
919 -3442 -5338 36 3673 -540 -4621 -2459 404 -620 -1917 -1686 -970 -26 599 -885 -3158 -1423
935 -1423 3022 2009 -3931 -3799 2245 3029 -2083 -3548 734 2602 -300 -2322 -849 1112 2029 1530
951A530l002j309M537K858m231l665M148L630m190l793L786L973k991k717J659
966B23J351j612J538K482l127k787M535K368n697l270P161L850p217m847O359
981A310N102n537l921M354L085l749j724K316P23j909J782K471l175l596L196
996G28L904l687m698L625M627l110n396J678N567M49m010j373K747N17j503j094
1012a029R8J650R78j741l400J74M214K218l958l483L148L275k141l749J891M153
1028B298K36l922k262J468L021P20l159l329K600M201j696n505J622O935l92o873
1044d037m90N362J700m402j134K815N3k167O81O41j580P09L609j907m553K293
1060b407N883k471n731K675O673k537o319J726N374r94m845J277K193r70j281
$$ plain form
951 1530 -1472 -2781 1756 4614 383 -3282 866 4496 306 -3487 299 4272 1281 -1436 223
966 223 1574 -38 1500 3982 855 -1932 2603 4971 -726 -3996 3165 7015 -202 -5049 1310
981 1310 6412 875 -3046 1308 4393 644 -1080 1236 1959 50 1832 4303 1128 -2468 728
996 728 4632 945 -3753 -128 4499 1389 -4007 -2329 3238 3687 -323 -1696 1051 1568 65 -1029
1012 -1029 -931 719 1697 -44 -3444 -3270 944 3162 -796 -4279 -1131 2144 3 -3746 -1855 2298
1028 2298 2534 -1388 -3650 -2182 839 1559 -1600 -4929 -2329 1872 176 -5329 -3707 3228 2836 -4037
1044 -4037 -4527 835 2535 -1867 -3001 -186 -133 -2300 -1619 -978 -2558 -1849 1760 -147 -4700 -2407
1060 -2407 3476 1005 -4726 -2051 4622 2085 -4234 -2508 2866 1872 -2973 -1696 497 -473 -1754
1075a754K063M45k136J570K710j901l356K301M473k771m064J666L531j092l677
1090a992J140L246r90k278M58J179M69n3L97o62N5J094O38j701j305J800J465
1107B960k991j796J630K902j077k674J104K194N4j460J6Q52k77m1K96j178o53
1124a39J118J380k257j765J811K563k285k759K005K566j196k047J188J322o14
1139H91k81Rr24n26R05J40k071p04K961P57l051l72K843J139k580j280J612R48
1157D16p99k42j128k24J942J320l429k031L962K900m399l911M115M155l177l418
1173c948L120L003k463k058J558P84k127Q24J721k911j719M228L035m844l293
1188e090O201L598n705n119N506N564m992n742L839N641k566m367J774L098r39
$$ plain form
1075 -1754 309 754 -1382 188 2898 997 -2359 -58 4415 1644 -2420 -754 2777 1685 -1992
1090 -1992 -852 2394 1404 -874 -416 763 1232 1179 1576 914 969 2063 2701 1000 -305 1495 2960
1107 2960 -31 -1827 -197 2705 1628 -1046 58 2252 2306 846 862 1714 1437 1396 1692 514 -139
1124 -139 979 2359 102 -1663 148 2711 426 -2333 -328 2238 1042 -1005 183 1505 891
1139 891 610 619 -305 -831 74 214 -1857 -2561 400 1157 -1894 -2266 577 1716 -864 -2144 -532 416
1157 416 -383 -625 -1753 -1977 -35 1285 -2144 -4175 -213 2687 -1712 -5623 -1508 2647 -530 -3948
1173 -3948 -828 2175 -288 -2346 -788 -4 -2131 -1307 414 -2497 -4216 12 3047 -1797 -5090
1188 -5090 1111 4709 -996 -6115 -609 4955 -37 -5779 -1940 3701 1135 -3232 -1458 1640 701
1203G01j559L7K15m77J614J280j899j325K312K714k865l194K082L200k031l594
1219b789J653L921p87k544P68K290Q4j408l58n01l67J350k1j775m06L269Q03l296
1237a14j370L778J668l480k016K668O88j446K90J174n02r77K185k1m201r02M788
1254B210J242n214j716N463J899m200j950M503K206l990k340J099J449r09q32
1269a080M79j06J347M94j719j103J912K215j788l091J121K221o25j391Q1J246
1285B13K76m32j231j881P23K455J92l577m87M769J502l720j787L648K704l428
1301f1l850J678J509q97j336J318N80j47J115N30j840q67K962J734l815k648L273
1318g62L654l455m221L937M976k741n921R83N319p11m126O2M530J069k455q73
$$ plain form
1203 701 -858 -821 -606 -1083 531 1811 -88 -1413 899 3613 748 -2446 -364 2836 805 -2789
1219 -2789 -1136 2785 1998 -546 222 2512 2596 1188 830 329 -38 1312 1291 -484 -890 2379 3182 -114
1237 -114 -1484 2294 3962 482 -1534 1134 1822 376 666 1840 1338 361 2546 2525 -1676 -2578 2210
1254 2210 3452 -1762 -3478 1985 3884 -316 -2266 2237 4443 453 -1887 -788 661 -248 -1080
1269 -1080 -601 -707 640 1134 -585 -1688 224 2439 651 -2440 -1319 902 277 -1114 -1033 213
1285 213 489 57 -1174 -3055 -2332 123 315 -3262 -3749 1020 2522 -1198 -2985 663 3367 -61
1301 -61 -3911 -2233 -724 -1621 -2957 -1639 -1059 -1206 -91 439 -1401 -2268 694 2428 -1387 -4035 -762
1318 -762 2892 -563 -4784 -847 4129 1388 -4533 -3550 1769 1058 -3068 -3006 1524 2593 138 -735
1334g35J186R73O23l18k448j687J810J546k010j976K491L941j386k917N2K582
1350A727J000r51j726r2J643P42k231k434K919L952k041m879O87L438p76k854
1366a876J487L683m83j966L08Q45j003N9K110j407l940L95K971j138k792K401
1382c46M747o70n061l50L864N67k903k2K053l50j875p98J55J536J279j30k580
1399h84j839J187J612o83o52J868K183j421k606l0J904J003n92j986j919mJ645
1416a214m0j318J001L301P08m441j708L785K423l175k120K905J389l375k229L363
1432g45K100k289j644K585q71l008J046M183q70k936K265L564k785m825L368M310
1448C448k966n514L123L625k783m100L223M791j283l277J165J883j324r67Q57
$$ plain form
1334 -735 451 1424 2047 1729 -719 -2406 -596 950 -1060 -3036 -545 3396 2010 -907 -855 1727
1350 1727 2727 1776 50 -42 1601 2343 112 -2322 597 4549 2508 -2371 -1684 1754 978 -1876
1366 -1876 -389 3294 2811 845 1153 1998 995 1054 3164 1757 -2183 -1788 1183 45 -2747 -346
1382 -346 4401 3731 -1330 -1680 2184 2751 -152 -174 1879 1529 -346 -1144 -989 547 1826 1696 -884
1399 -884 -2723 -1536 76 -607 -1259 609 2792 1371 -1235 -1265 639 1642 1050 -936 -2855 -2859 -1214
1416 -1214 -1254 -2572 -1571 1730 2438 -2003 -3711 74 2497 -678 -2798 107 1496 -1879 -4108 -745
1432 -745 1355 -934 -2578 7 -864 -3872 -2826 1357 487 -2449 -184 3380 595 -4230 -862 3448
1448 3448 482 -5032 -1909 1716 -1067 -5167 -1944 2847 1564 -1713 -548 1335 11 -956 -99
1463i9J007j025K58P71r22j306P53J645n48j106k46J037J38q37O3J516K020j46
1481B973k846p57K067O82k729n43K994L11l341j314L263J937j674l24J569m0k369
1498a41n37K330J9j621J478J021k204k248J984K692j680k407J703K369k614k575
1514b431K440M049o61l542n03J801m31k030J76K336L16j796p33k36R61P88J025
1531A529j012j526N56J005j106j871J784K190n06k188r09N33J116K51n30j032
1547a716J085J777j038l332J090M511l04l991o49K925n48k980j32L714K57k614
1563a945N32J312q91m20K252N51l022p99K899J41l681l37N369R90n104j476M013
1580C84J508l136j606K757J902j664j254O02R72J061m50j104j129J82J203m21
$$ plain form
1463 -99 908 -117 141 912 -10 -1316 -563 1082 534 -572 -818 219 357 -480 -417 1099 3119 2973
1481 2973 127 -630 1437 2119 -610 -1153 1841 2152 -1189 -2503 760 2697 1023 699 2268 2228 -141
1498 -141 -678 1652 1671 50 1528 2549 345 -1903 81 2773 1093 -1314 389 2758 144 -2431
1514 -2431 9 4058 3397 -145 -648 1153 722 -1308 -1132 1204 1520 -276 -1009 -1245 -284 504 1529
1531 1529 517 -1009 -453 552 -554 -2425 -641 1549 1043 -1145 -2054 -1521 -405 -154 -684 -1716
1547 -1716 -631 1146 108 -3224 -2134 2377 2073 -1918 -2567 358 -190 -3170 -3302 412 669 -1945
1563 -1945 -1413 -101 -992 -1412 840 1391 -1631 -2430 469 610 -3071 -3408 1961 2951 -2153 -3629 384
1580 384 1892 -1244 -2850 -93 1809 145 -1109 -507 465 1526 1076 -28 -1157 -975 228 -193
1596a93j837L79K712J085j652j590J586J725j93j910q09J342J139j783j804J414
1612c89L102p4l564n10K656J011k231j224K598J811j492k184J340J312m52q99
1628H11J42m10j536Q73J130j582j031L050K610k309l290K656L244k566m056J958
1644c06L293k514l029J882K145r41q40J055j12j297P69J184j412j503K342K077
1660B793k201l017K596K750k384k946J89K326r58j612K50J996O13P4o3o90N21
1677B37J108q31k354m22J912J91k126n03K374M63o81q42L90J077j44l30r70K29
1695a222J674P56j644j037J661J320j913k738R27J954p7k438J97K227J462p70
1711C39m19N41M24N02j213j346m80J480N27j498r07J570J926o85j764N53J759
$$ plain form
1596 -193 -2030 -1651 1061 2146 494 -1096 490 2215 2022 112 -697 645 1784 1 -1803 -389
1612 -389 2713 2639 -925 -1435 1221 2232 1 -1223 1375 3186 1694 -490 850 2162 1710 811
1628 811 953 543 -993 -120 1010 -572 -1603 1447 4057 1748 -1542 1114 4358 1792 -2264 -306
1644 -306 2987 473 -2556 -674 1471 530 -310 745 633 -664 105 1289 -123 -1626 716 2793
1660 2793 592 -2425 171 2921 537 -2409 -2220 106 -852 -2464 -2214 -218 395 469 406 -284 237
1677 237 1345 514 -1840 -2262 -350 -159 -2285 -2788 -414 49 -632 -1474 -1084 -7 -151 -481 -1451 -1222
1695 -1222 452 1208 -436 -1473 188 1508 -405 -3143 -2216 -262 -339 -2777 -2580 -353 1109 339
1711 339 -80 461 885 1387 174 -1172 -1652 -172 355 -1143 -2050 -480 1446 761 -1003 -450 1309
1728A309k20j770j82J456J007n38n14M00K63P1k51j473o62J184R92k029o43K494
1746H94K046j429j844J977J442j359j739N92j23j48j1L96j087J88K021L59k802
1763f27QK796M26l374l82L097J113l342n77K979j9k167p27J473j109j184J135
1780d81P68j418L16K267M07k228J94K435p4l809q84K754O90k739q52K664J144
1797A154j505j110J600K14l45o87L17r56L13J259N03j490k13J557j38k001r29
1814b457J474J238j652r60R71J756j04p34M83O41m8j308r91k15J421N78j468j157
1832b532J594J647p58j659Q53J996m30k027n91J814O23k97l5j052M63J251J50
1849A010j881j270K534J635k541k414K591L244j511k454J375J936j366j829L17
$$ plain form
1728 1309 1089 -681 -863 593 1600 1062 548 948 1211 1282 1031 -442 -1104 80 1072 -957 -1600 894
1746 894 2940 1511 -333 1644 3086 1727 -12 580 457 309 298 694 -393 -205 1816 2175 -627
1763 -627 -619 2177 2603 -771 -1153 1944 3057 -285 -862 2117 2098 -69 -796 677 -432 -1616 -481
1780 -481 287 -1131 -815 1452 1859 -369 -175 2260 2186 -1623 -2507 247 937 -1802 -2654 10 1154
1797 1154 -351 -1461 139 353 8 -679 -362 -1318 -1005 254 757 -733 -946 611 473 -1528 -2457
1814 -2457 -983 255 -1397 -2357 -1386 370 266 -468 15 656 608 -700 -1691 -1906 -485 93 -1375 -2532
1832 -2532 -938 709 -49 -1708 -855 1141 711 -1316 -1907 -93 530 233 198 -854 -391 860 1010
1849 1010 -871 -2141 393 2028 -513 -2927 -336 2908 1397 -1057 318 2254 888 -941 -624
1864f24R94j02M2m51l96M57K022j15j759m36K149M09k747p99K511J338j842j503
1882h52J215J060Mm67j149r2J355N01j283j596K127K269n72l224k57K855L31k682
1900d57j013K065J197j436j290K35J702P82m34j471p51J370J131j058k385J006
1916h07K821n31l225o35L062J211k185k179J436K225r13k028J77K048J279j225
1932E31j911l04J342J236j793k066J354K445q54j721k12K348J007j736j094M06
1948a022R14L87q83j212K18K511K61l277q75K862J826k976k042K520K387j317
1964B82k027J139J683n20j049l87Rm29J271L4j547n49K808J185k604j464L358
1981A193K022k839k339J656K439j551j942O05J864L9o33r83k14J024P66o69j281
$$ plain form
1864 -624 370 268 310 -141 -537 -80 1942 1827 68 -368 1781 2190 -557 -1356 1155 2493 651 -852
1882 -852 363 1423 1427 960 -189 -281 1074 1575 292 -1304 823 3092 2520 -704 -961 1894 2225 -457
1900 -457 -1470 595 1792 356 -934 -699 1003 1785 1351 -120 -871 499 1630 572 -1813 -807
1916 -807 2014 1483 -1742 -2377 685 1896 -289 -2468 -1032 1193 280 -1748 -1571 477 1756 531
1932 531 -1380 -1684 -342 894 -899 -2965 -1611 834 -20 -1741 -1953 395 1402 -334 -1428 -1022
1948 -1022 -108 279 -604 -1816 -1598 913 1174 -2103 -2978 -116 1710 -1266 -3308 -788 1599 282
1964 282 -1745 -606 1077 557 -492 -879 -870 -1299 -28 6 -1541 -2090 718 1903 -701 -2165 1193
1981 1193 3215 376 -1963 -307 2132 581 -1361 -756 1108 1147 514 -469 -683 341 1107 438 -843
1998h43N94K331j99k520j26K466J222k061j300O34Q38m26j180j63J584R46j74
2015A623j286n85J094J593p76k747O11K196P6l345L78L200O65k984q76J907M16
2032A160j821o4J821K24j033j26O49o24k30J708M01k585j379J835J206k363j079
2049b300L016J551j876k078J153J755o84r80j38P97j08r87p88N67J508K10j291
2066f73m74J61K98q62J7Q55Q62jJ6r71p09J427R11j049j793M54J811j102k431
2085c253O89L873N54l389m41K722J89k254m56J962R13j733q76P11L41k68J321
2102F05M92j594j123J178O19j248J0K003J469k058k036J363K178q54j721O77J325
2119A285n83k312j13K329Q44j67m18m14o3K21j94l33L39P56l3j415q59R39J540
$$ plain form
1998 -843 -249 2082 1883 -637 -763 1703 2925 864 -436 198 1036 610 -570 -733 851 1797 1623
2015 1623 337 -248 846 2439 1663 -1084 -473 1723 1799 -1546 -1168 2032 2697 -287 -1163 744 1160
2032 1160 -661 -725 1096 1320 287 161 810 186 -44 1664 2065 -520 -1899 -64 1142 -1221 -2300
2049 -2300 716 2267 391 -1687 -534 1221 537 -443 -581 216 108 -879 -1667 -1100 408 618 -673
2066 -673 -1147 -986 -688 -1550 -1533 -678 184 183 199 -772 -1481 -54 857 -192 -1985 -1531 280 -822 -3253
2085 -3253 -2564 1309 1863 -1526 -1967 755 944 -1310 -1766 196 1109 -624 -1500 -789 -448 -716 605
2102 605 1097 -497 -1620 -442 177 -1071 -1061 942 2411 353 -1683 -320 1858 1004 -717 -40 1285
2119 1285 702 -1610 -1723 606 1450 1283 865 451 388 609 415 82 421 1177 1144 -271 -1130 -191 1349
2138A349J46o01n20O5N08l90j189L65J967J023k275j645J525K100j672j920J899
2155G35J165j466k669J769J808k25q25P90J30j431K8R93p23j041J410Q52q94k496
2173b090J141K621k45k378r5K082j39k534n19K199J461r11j257j48P06L76q20
2190e50n48P17O22m40j527J35J045P55n0n92k86j4P19m37j324N21J403Q77k090
2209a064j841K034K103j014k326Q12K512o20k974m36L117J306k132q87J205N95
2225C90j043k78N42L22j04M32n73j287Q3K489J007k383j133K271J125k992j543
2242b675K977K362j964k525J249K191o89j548O71Q19R1p06o20k50Q41R43n4p70
2260C43o84J287O19j402q42J060J081l93j219o09J210J397l39j536J22J643M0
$$ plain form
2138 1349 1495 894 374 439 947 557 -632 -267 1700 2723 448 -1197 328 2428 756 -1164 735
2155 735 1900 434 -2235 -466 1342 1117 292 1082 1212 -219 -191 802 79 -962 448 1300 406 -2090
2173 -2090 -949 1672 1427 -951 -1046 1036 897 -1637 -2156 43 1504 593 -664 -812 -106 270 -550
2190 -550 -1098 -381 241 -199 -1726 -1591 -546 209 159 -433 -719 -733 -14 -451 -1775 -1254 149 1026 -1064
2209 -1064 -2905 -871 1232 218 -2108 -1296 1216 596 -2378 -2814 303 1609 -523 -1410 -205 390
2225 390 -653 -931 -389 -67 -171 261 -312 -1599 -1516 973 1980 -403 -1536 735 1860 -1132 -2675
2242 -2675 302 2664 700 -1825 -576 1615 926 -622 49 868 959 253 -367 -617 224 1167 1113 343
2260 343 -341 946 1565 163 -679 381 1462 1069 -150 -759 451 1848 1509 -27 95 1738 1778
2277A778k023j156J945J413r89j253J2J273N60j413n6J61P35J86j250j035M87
2294f25J907J04j998k47J734M78j748j256J309J962n75j994j64J148P57r48m36
2311e92L41J274o90j423l28R59Q92q6j143p23J515N55j199o04R20J064o80j633
2329a581J85R28N47m96m39r6M75P66j219j329J035J966k60k218k73J938Q67j847
2347a051l99J678N78j509p92J074OJ4N81j74j050M09J014j00j170j61J789m8j674
2366i85k47J798K48j190r9J016L59j397J0R23q3k44p9j04N6J07J097n95o05J99
2386A85Q53n19j029M34J174M93j210m78Q06J7k42k31L0N53l01J79l81J89L71K07
2406A100p89k43M07Q05q78m90P1R59L4o98m95P05M62k24n92l09M12N84n85m95
$$ plain form
2277 1778 -245 -1401 544 1957 968 -285 -273 1000 1560 147 91 252 987 1173 -77 -1112 -625
2294 -625 1282 1386 -612 -859 875 1353 -395 -1651 -342 1620 1045 -949 -1113 35 792 -156 -592
2311 -592 -251 1023 333 -1090 -1418 -459 433 347 -796 -1519 -4 551 -648 -1252 -332 732 52 -1581
2329 -1581 -1396 -468 79 -417 -856 -952 -477 289 -930 -2259 -1224 742 482 -1736 -2009 -71 796 -1051
2347 -1051 -1450 228 806 -703 -1495 -421 -415 -401 180 6 -1044 -635 379 279 -891 -1052 737 689 -985
2366 -985 -1232 566 814 -376 -475 541 900 -497 -487 436 353 109 30 -74 -18 89 1186 591 -14 185
2386 185 1038 519 -510 -76 1098 1591 381 -97 709 726 484 253 283 836 535 714 333 522 893 1100
2406 1100 311 68 475 1280 402 -88 -17 942 976 278 -217 488 950 726 134 -175 237 821 236 -259
2426b59J24R46J75j418j95J038L16j005q58J039P56p68l32j00R10k58k28j85m16
2445g18L91J144p21j154PJ547r5j700j53J666P02j846p40J449N26p05p56L84M89
2464b83K01j44n04j58N23O87j042q99M82J386J53j657p3J325O50r29r80M91J409
2483F38k75j146n56J298O65n74j447K68J284M80j239l67J113O95m43j050N4R57
2501C55N87p88j024L70J232oq34o50R41J189n59j283P1J078R62j540m04Q34Q70
2520A401m93o55k38M83P19p14n76l09J037N95o26j005L89J295m8j271q86J674
2538G72J216j612j336J113J330j85j353k54P67N62j39p57l73J102Q39j185j633
2555a126M93J957N1k214m06J898N85j634p19J028J024p58p61j61L77Q19K00j022
$$ plain form
2426 -259 -135 811 986 -432 -627 411 727 -278 -1136 -97 659 -109 -441 -541 369 111 -117 -302 -718
2445 -718 -327 817 96 -1058 -1051 496 401 -1299 -1452 214 916 -930 -1670 -221 305 -400 -1156 -772 -283
2464 -283 -82 -226 -730 -888 -365 322 -720 -1619 -1137 249 402 -1255 -1328 -3 647 -282 -1262 -771 638
2483 638 363 -783 -1339 -41 624 50 -1397 -1129 155 635 -604 -971 142 837 394 -656 -602 355
2501 355 942 154 -870 -500 732 726 -108 -758 183 1372 813 -470 -399 679 1641 101 -303 531 1401
2520 1401 908 253 15 498 1217 503 -73 -382 655 1250 624 -381 8 1303 1255 -16 -902 772
2538 772 1988 376 -960 153 1483 1298 -55 -309 458 1020 881 124 -249 853 1692 507 -1126
2555 -1126 -633 1324 1375 -839 -1245 653 1238 -396 -1115 -87 937 179 -582 -743 -366 453 653 -369
2573c69o71Q32Q63o32j453N56J690k36j847l04J839O96j381j025Q45P70j26r99
2591i52n64J210O46l63j194k93J126P29o66j336O33J464k45r65n66J288P90r97
2609b55j088M66J262k71j121J35Q09N82p44m05L62M37P49o98q71q3J398r9j349
2628g84J5J033L77p35p05P15O60k22n65K8J83L41O44o40n52O50O18jj482K46J179
2649A003R8j163n76O29J264l79j078L1J063P69r71j154N99J526o67j200j68J376
2667A002K77j074q88Q87O69k35k32l81J88M92L96j053m25J180M80n40j704M52
2685e09J214m96j187J13J538J29j113k89Q84P48m79q04j17L90J95k13l47j3k4
2704c80Q04p64q56K85J098J87r49p68J217O36n15j149O31J257J6j663n93P01Q10
$$ plain form
2573 -369 -1040 -208 655 23 -1430 -874 816 580 -1267 -1571 268 964 -417 -1442 -597 173 47 -952
2591 -952 -1516 -306 340 -23 -1217 -1510 -384 345 -321 -1657 -1024 440 195 -770 -1336 -48 742 -255
2609 -255 -1343 -877 385 114 -1007 -872 -63 519 -225 -630 -268 169 918 220 -651 -734 664 565 -784
2628 -784 -769 264 641 -94 -799 -84 576 354 -211 -183 0 341 985 345 -207 443 1061 1060 -422 -176 1003
2649 1003 1101 -62 -638 -9 1255 876 -202 -171 892 1661 690 -464 135 1661 994 -206 -374 1002
2667 1002 1279 205 -683 204 873 638 406 25 213 705 1101 48 -377 803 1283 743 -961 -509
2685 -509 705 209 -978 -865 673 802 -311 -600 284 1032 553 -251 -368 22 217 4 -343 -356 -380
2704 -380 424 -340 -1196 -911 187 374 -575 -1343 -126 510 -5 -1154 -523 734 750 -913 -1506 -805 5
2723En85p23N87O97k06p81J40O96O88q29l59J17K84j3l56O5J66K33L62p05p67
2744a284M66J024K40j098l24J146M30j195m66J355J377j505r73K28J305j252l25
2761h51P31M84n7m06L8R0L11N19J77m99n93L22P87q86o61Q26O36j02j115p22J151
2782A80P68m60r11P86J277j39j512l02J037J197j475j126Q58L78m17l08J09Q70
2800H10M89m28p56m99O25P10np71o28J035N65j310j162J473J320m25j908k90K191
2819A036k14j305o13J950O59j239j327O62Q29l64o03L46j14m29J84J23m53N03
2837c69J138L38j783j398J674J639j200j386Q65J296m65k135n1K134Q06j684r81
2854a562O71O81l37j65K5J120o4k54o00n76L84R38K09j220q23J082R20r74j361
$$ plain form
2723 5 -580 -1303 -716 -19 -225 -1006 -866 -170 518 -311 -670 -553 -269 -282 -638 -573 -407 -174 188 -517 -1284
2744 -1284 -818 206 446 -652 -976 170 600 -595 -1061 294 1671 166 -807 -579 726 -526 -851
2761 -851 -120 364 307 -99 -61 29 340 859 1036 537 -56 266 1053 167 -494 332 968 866 -249 -971 180
2782 180 948 488 -423 363 1640 1501 -11 -313 724 1921 446 -680 178 556 139 -169 -60 810
2800 810 1299 871 115 -384 241 951 946 175 -453 582 1147 -163 -1325 148 1468 1043 -865 -1155 1036
2819 1036 822 -483 -1096 854 1513 274 -1053 -391 438 74 -529 -183 -297 -726 -542 -419 -872 -369
2837 -369 769 1107 -676 -2074 -400 1239 39 -1347 -482 814 349 -1786 -1837 297 1103 -581 -1562
2854 -1562 -891 -210 -547 -712 -687 433 369 115 -485 -1061 -677 261 470 -750 -1573 -491 429 -545 -1906
2873a906J745J837p99k068m9J848M65j699o39J705N05q78j178M12J347M87r07
2890B28m91l83P31L78l66j98K39J133N6j361r73Q74J334l48j736M06J420J42j562
2909d77PJ463J428j264j309M16N79l75o38J06P60M10p74o35K48L76O38Q5n88o44
2929a88N91L15m13q13N18J226L33j686r19J223Q77r92j236J203J113l81j500L17
2947d12J347M73j270j93K36l16l67l3L47m0M83l03l26m94L60J293n43p43q5N97
2967A1j10r48J81R38O86n94j353J38J195m12j256K62R81M53q53n8P87N52m78k80
2987a58k01K9n1m02j37j40K77O97J47p04o73J423R32j044q54Q49N09m86r84M63
3007e08P64J71m07o23M88J80k33m95k9O89M42m50qM83L31j12j42q39k2L41J77
$$ plain form
2873 -1906 -161 1676 877 -1191 -1240 608 1073 -626 -1265 440 945 67 -1111 -699 648 1135 228
2890 228 -263 -646 85 463 97 -101 138 1271 1327 -34 -1007 -133 1201 853 -883 -477 943 1085 -477
2909 -477 -470 993 2421 1157 -152 264 843 468 -170 -64 696 1106 332 -303 -55 321 959 1044 456 -188
2929 -188 403 718 305 -508 10 1236 1569 -117 -1036 187 1064 72 -1164 39 1152 771 -729 -412
2947 -412 935 1408 138 -55 181 -135 -502 -535 -188 -228 255 -48 -374 -868 -508 785 242 -501 -586 11
2967 11 -99 -1047 -866 72 758 164 -1189 -1051 144 -268 -1524 -1262 -281 172 -681 -739 48 600 122 -158
2987 -158 -359 -330 -381 -783 -920 -1060 -783 -86 61 -643 -1316 107 1039 -5 -859 -10 499 13 -971 -508
3007 -508 256 427 20 -603 -115 65 -168 -663 -692 -3 439 -11 -19 464 795 683 541 -298 -320 21 198
3028A98o46n15J537M72q60o74M41J268n6j439J36J229j38q85k64N77Q07l46n52
3047B90m30L84J65m60n04K91O33M26L9p51J51J260j65j060k40K56qn26o00O70
3067a79O17Q0p68P2Q62n7m70k04K22M12P6n86m33O71K67l03m18o05N80M61o60
3088c63r43O24R86J54o11l73R08k3j49p89R4L39K23j304P2J29J238q4p86k7Q19
3109A34J53n00o66K56R47o91k82l50Q97N38o13q33j20J007p1n25o62P89J034n1
3129C91j065J62J094J12p31j070L21J128j75j098m00J087N69k36n27K27Q13N9
3147F61r67j73L98P71K85j242k71J217J59n87p33j6J055K19j009l38R31O61l64
3166F57n65K2P29M8o00q83M45J092j89r16l12J182J98l18n96J67P05K82p99p49
$$ plain form
3028 198 -448 -963 574 1046 186 -488 -47 1221 1165 -274 -138 1091 953 68 -196 381 1188 842 290
3047 290 -140 244 409 -51 -555 -264 369 795 834 83 234 1494 1329 269 29 285 277 -249 -849 -179
3067 -179 438 518 -250 -178 684 627 157 -47 175 587 663 77 -356 315 582 279 -139 -744 -164 297 -363
3088 -363 -1306 -682 304 458 -153 -526 382 359 210 -579 -485 -146 77 -1227 -1155 -1026 212 128 -658 -685 134
3109 134 287 -213 -879 -623 324 -367 -649 -999 -102 436 -177 -1010 -1130 -123 -194 -719 -1381 -592 442 391
3129 391 -674 -512 582 694 -37 -1107 -786 342 167 -931 -1331 -244 325 89 -438 -211 602 661
3147 661 -306 -479 -81 690 975 -267 -538 679 838 251 -482 -498 557 776 -233 -571 360 1021 657
3166 657 92 114 843 891 291 -592 -147 945 756 -160 -472 710 908 590 -6 161 866 1148 349 -400
3186d00P64Q81m17j083O8P20N13q42p61O10K27K61o24l87P40N95k2r17j98O45
3206C73N76r12r89K64J101k36j338M59J102L63r64m15N31M51O9m15o96K07N91
3225A22R7j289K77J042p7p34j019Q31R53p5p08m94P81R21l99j008K35O53q6p86
3245g63o66K50J238m40m42J11P69L92n13p59L30R98n61n96j17O44M28m90m38J64
3265d61N65L46q78k77P20N7Q0n09k5O30L64k23o60p4O65Q7q65j31N51M51l89r5
3287g1p9M83L95j5l76j30L01J34o72N1L44J83n16l65N90J75K06n29p6N61P6j18
3309E52l54Q0L72K81j30q85R9O50m5o35l94M06O29k19m90J84Q44Q5p48k90l8M77
3331D31J11j046J19K69Q36n81j90p3M81J7n32m06P38K26n44j36J00R96k51j092
$$ plain form
3186 -400 364 1245 828 -255 -187 533 1046 204 -557 53 280 541 -83 -470 270 865 843 -74 -272 373
3206 373 949 37 -952 -688 413 177 -1161 -702 400 763 -201 -616 -85 366 435 20 -676 -469 122
3225 122 219 -1070 -793 249 172 -562 -1581 -750 203 128 -580 -1074 -293 628 229 -779 -544 109 23 -763
3245 -763 -1429 -1179 59 -381 -823 -712 57 449 -64 -823 -493 505 -56 -652 -769 -125 303 -187 -625 -461
3265 -461 104 450 -428 -705 15 72 152 -357 -382 248 612 389 -271 -345 320 407 -458 -589 -38 413 24 -71
3287 -71 -150 333 728 713 337 207 508 642 -30 21 365 548 32 -333 257 432 638 109 33 594 670 552
3309 552 198 278 650 931 801 -84 15 665 620 -15 -409 -3 626 407 -83 101 945 1030 282 -8 -46 431
3331 431 542 -504 -385 -116 720 139 -51 -124 357 374 -158 -564 174 400 -144 -280 -180 816 565 -527
3351e27j91N55M45o91p65K63Q89oj006K89J131j00j50p97M42L48o89j53j91J76
3371g28N14K83o25l38L42N46j95m01J3O26J74r98j62J070N10k38j480K84J177
3390C74n94m80j89P64J57m33j64N58N76k1j99m5k17j40K07n80j75O96M7K97m96
3411e7k74L60K29j25k79k2O41K9o30j24R74M00o18n37K40L09l74k35j49M24R2
3432B74J04j61K4J7Q19K89q33o32J68L81o95n09N30J708o17j223j58J006M01j065
3452a72j24P10P23p26q87L71O85K63m38m64%k40L26n15O2L09M54L84j348j38R53
3473A88J248q71j396M99R14m91j245l50J582Q63j280m63M47O99k29j016M30P27
3491B56k39l05k84K16K48L89j42n97j89K69R0k48m45L45J257j92j083k56J129
$$ plain form
3351 -527 -718 -163 282 -409 -1174 -911 -22 -28 -1034 -745 386 286 136 -661 -219 129 -560 -713 -904 -728
3371 -728 -214 69 -556 -894 -552 -6 -201 -602 -589 37 211 -787 -949 121 631 393 -1087 -803 374
3390 374 -220 -700 -889 -125 32 -401 -565 -7 569 548 349 304 87 -53 154 -426 -601 95 142 439 -57
3411 -57 -331 29 258 133 -146 -168 473 502 -128 -252 722 1122 504 -33 207 516 142 -93 -242 182 274
3432 274 378 217 241 258 1077 1366 533 -99 69 450 -245 -754 -224 1484 867 -356 -514 492 893 -172
3452 -172 -296 414 1137 411 -476 -105 580 843 405 -59 -59 -299 27 -488 -426 -117 337 721 -627 -765 188
3473 188 1436 565 -831 -332 582 91 -1154 -1504 78 941 -339 -802 -355 344 115 -901 -471 256
3491 256 17 -288 -572 -356 -108 281 139 -458 -647 -378 -288 -536 -981 -636 621 429 -654 -910 219
3510B19L43j078m89R76K11n43r66P64J042n02n37N96l50r5j20L15J34k25K00M19
3530C14j46p70P6J235j23p06m19J171j58r84m96J233J006o96q92K35J074k75j022
3549c43L29O56n6n07m53K37M84O9O62n52o18K4N61J23j026M63J041Pj211m67R42
3570C65R64j015r35Q00R64o12j441N56J382m8p14n00Q06o0l77K5J6M0j01K05m03
3591h3m62M77J022m86r25j6Q29O9j052n4J048K22p15r90N36J083l82r18N36M17
3611A56J42n87p62N35P04j10k63j92J90k30k43J41J51j13K86K09o99k15N75P46
3631D21n76p05O41L01l90m28lR61M6j033O6L83J46n14L16M03j9l00k2j54L26N2
3653h2L20K50p37j07K63K8l20j33M06M35m49m78P6P91K30m86R9L07m0l72k79K40
$$ plain form
3510 219 562 -516 -1005 -29 182 -361 -1327 -563 479 -23 -560 36 -314 -409 -529 -214 -80 -305 -105 314
3530 314 168 -602 -526 709 586 -120 -539 632 474 -510 -1006 227 1233 537 -355 -120 954 679 -343
3549 -343 -14 642 586 79 -374 -137 347 416 1078 526 -92 -68 493 616 -410 53 1094 1101 -110 -577 365
3570 365 1329 314 -621 179 1143 531 -910 -354 1028 980 266 -234 572 512 135 160 176 216 115 320 -83
3591 -83 -545 -68 954 468 -457 -473 356 425 -627 -681 367 589 -126 -1116 -580 503 121 -797 -261 156
3611 156 298 -289 -1051 -516 188 78 -185 -377 -187 -417 -660 -519 -368 -481 -195 14 -685 -900 -325 421
3631 421 -155 -860 -219 82 -308 -736 -739 222 268 -765 -699 -316 -170 -684 -368 35 16 -284 -306 -460 -134 -82
3653 -82 238 488 -249 -356 -93 -65 -385 -518 -112 323 -126 -604 -528 263 493 7 106 413 373 1 -278 -38
3675c8O06P9n31j06k1L89l17n1L13M00l22j82l91K78N29O5k05n35L94M65m92n55
3697b28j04J131J13j009m25Q84N70p27l39L38Q53n75r40L77L88K30k96l7l03K85
3717A86L8r8n74L81N74j35o38m3N92L78k13j248P94J58o4q16n9N35R74o94o50
3738f22Q4R08j4p09j04K04O39k77q75J13O33nm41l23N59J78J84n23j16R0N98n45
3760c64j68J5P91j2m77p47O77L60j67o54K60K26N09o85P1r5M64j4j39k83J19L72
3782E9J27m98o08Q65N29k45o63K82O31j46o32j04J49N73l57q6k41P22K81m12m43
3803b17o7P37l5r07K87Q48lm66m41K34Q08P5n75k03L07O1Km18L5K67P28o08n57
3826a08J53P36K43p47o85P24L08l42p62N44P81r5n63l28K83N52n41m54K02O60
$$ plain form
3675 -38 568 647 116 10 -11 378 61 10 323 723 401 219 -172 106 635 700 495 -40 354 819 327 -228
3697 -228 -332 799 912 -97 -522 362 932 205 -134 204 1057 482 -458 -81 307 537 241 204 -99 186
3717 186 224 126 -448 -67 507 372 -266 -309 283 661 448 -800 -6 152 88 -728 -787 -252 722 28 -622
3738 -622 -538 370 356 -353 -457 -253 386 109 -766 -653 -20 -25 -466 -789 -230 -52 132 -391 -507 -417 181 -364
3760 -364 -532 -517 274 262 -215 -962 -285 75 -92 -746 -486 -260 249 -436 -365 -460 4 -10 -149 -432 -313 59
3782 59 186 -312 -920 -55 474 229 -434 -152 479 333 -299 -403 -254 319 -38 -124 -365 357 638 226 -217
3803 -217 -284 453 418 -489 -202 646 643 177 -264 -30 778 853 278 75 382 443 445 27 62 329 1057 449 -108
3826 -108 45 781 1024 277 -408 316 624 282 -480 64 845 750 187 -141 142 694 153 -301 -99 561
3846E61M00n90p05K44J037l95p67k16L33O37o92l09L39M12p9l91m15N34J55Q0
3866A73n32l66M57M43n40m90L91M82K97r29L32L51j5m07k07K80R4kk17J33j68
3887d40J11K52k59k38K96L10k38o34L92L95K87q53j16M62O08k50n09l53O97L28
3907B48o03j22qN54L31p06l85R32O1n87n41O29L20J09k25k56L53m6K32p8q17P62
3929A57L41k91p50K13R70l93k55j33P36L72n57o15M52L46l05l09K1M58L3J09m06
3950A94pJ86J36j46o20K91N92M6j011J76N76M63n72n68N99p8j76j31M4J96O28
3971H18n34j33m84O29L64p64lK61J28P8n68j47P59j84J48n55J15J48m6j83k04
3992c57P0L90m8l43l47O36J50m72j96K72M51k51n13J99K81L4J84o35n6L46M07
$$ plain form
3846 561 961 371 -334 -90 947 552 -215 -431 -98 539 -153 -462 -123 289 210 -181 -596 -62 93 173
3866 173 -359 -725 -268 175 -365 -855 -464 18 315 -614 -282 69 54 -353 -560 -280 -186 -188 -405 -272 -440
3887 -440 -329 -77 -336 -574 -278 32 -206 -840 -448 -53 234 -619 -735 -273 335 85 -424 -777 -80 248
3907 248 -355 -477 -485 69 400 -306 -691 241 302 -285 -826 -197 123 232 7 -249 104 58 290 212 -605 157
3929 157 498 207 -543 -330 640 247 -8 -141 595 967 410 -205 247 593 288 -21 0 458 491 600 194
3950 194 187 373 509 363 -257 34 626 672 -339 -163 413 876 304 -264 335 257 81 -50 -6 190 818
3971 818 284 151 -333 296 660 -104 -107 154 282 360 -208 -355 404 220 368 -187 -72 76 30 -153 -357
3992 -357 -287 103 55 -288 -635 1 151 -321 -517 -245 206 -45 -558 -359 -78 -44 140 -495 -551 -205 202
4013B02p38j50K17M78M4o84j36P90l1m89k55L86N17l55m02M87l2Q4k75j75K01
4034c16J91J73m02R1j57M72J83o11k76R05J70o01n80N40O13j20m22l43M34N11
4054D55p17j67N44J91J98m73l69L29M84r4n24J34J75L40l94l95K28L88J61n04
4074a0j91M41P52n52o42M8P74K60p77k98M56O02l06r74N4J160j84l96l41N80J82
4095F38l98k63Q3L42O6J53p38m24R03J52j60q90L41P88k95o03k02R06L31o66n35
4116d71M44M79k43l90R2L3M84n36k51J74K77K19l8l30Q8j45N37l92o14L34L37
4137H8P8j64q61N62M35k2j111O66J101q08r63N54R19n3q43m28M50K76l40Q8J56
4158b20J31j52K11n09k5O7Q34M48j554K78Q88M1j187r0J435L32q85r63O90P36
$$ plain form
4013 202 -536 -686 -469 9 53 -631 -767 23 -8 -497 -752 -366 151 -204 -606 -119 -151 -67 -342 -517 -316
4034 -316 -125 48 -354 -263 -420 52 235 -376 -652 253 423 -178 -758 -218 395 275 -147 -490 -56 455
4054 455 -262 -429 115 306 504 31 -338 -9 475 381 -143 -9 166 506 112 -283 -55 333 494 -10
4074 -10 -201 240 992 440 -202 -154 620 880 103 -195 261 863 557 -417 -363 797 613 217 -124 456 638
4095 638 240 -23 60 402 468 621 -117 -541 362 514 354 -536 -195 593 298 -305 -507 399 730 64 -471
4116 -471 -27 452 209 -181 -89 -56 428 -108 -359 -185 92 311 273 -57 31 -114 423 31 -583 -249 88
4137 88 166 2 -859 -297 138 116 -995 -329 772 -36 -999 -445 474 421 -422 -850 -400 -124 -464 -376 -220
4158 -220 -89 -241 -30 -539 -564 -497 337 785 -769 -491 397 438 -749 -839 596 928 43 -920 -230 506
4178E06q09PJ7N99O8l42l82K12M02P6l00k10J21K00K2r4m04L64P84o44o03j38
4200e48J019L68m30p46O3O87P6p88M4J188m0j005n67J163K61l65o38Q44j24Jn66
4221a03J58J9j8N09m4n31l45N59J42L4m57L19Q83o69j135N10J065n03q32M25P79
4242G65k71o74k29N90L21m47l43J82MO0l8j06L8J07L80j42j92n43N25j54R3m80
4264e54l9K88L37m18k78P25L80q08n95N41N24n12r2K5P32n99m81J29N95j43m0
4285b83M9j52p9n9P05j73k69M0M33r8q12K06R86j73r73j09R60Lj005J16R26M66
4307G05p47k07K89L73n59r3J46M71m83J41N1o26M10L73J19k02k81J97K7m0l38
4328b74M75P12K1q60n61O32O02j69q95Q88J67L2j075J55N95jn16L57K51P5m39
$$ plain form
4178 506 -303 -296 -279 320 388 46 -336 -124 278 354 54 -156 -35 165 187 93 -311 53 837 193 -410 -548
4200 -548 471 839 409 -337 -274 413 489 -299 -255 933 893 -112 -679 484 745 380 -258 586 462 463 -103
4221 -103 55 74 56 565 521 -10 -355 204 346 380 -77 242 1125 456 -679 -169 896 393 -439 -14 765
4242 765 494 -180 -409 181 502 55 -288 -106 -102 -42 -80 -186 -148 -41 339 197 5 -538 -13 -167 -74 -554
4264 -554 -593 -305 32 -386 -664 61 441 -367 -962 -421 103 -409 -501 -476 256 -343 -824 -695 -100 -243 -283
4285 -283 -234 -386 -465 -524 181 8 -261 -221 212 114 -698 -492 494 321 -652 -761 199 202 -803 -687 239 705
4307 705 -42 -249 40 413 -146 -239 -93 378 -105 36 87 -539 -129 244 363 161 -120 77 104 64 -274
4328 -274 201 913 934 74 -487 145 747 578 -317 571 738 770 -305 -150 445 444 -72 285 536 611 172
4349A72k24L40K03k72K95k71m11J44N46m5p00p0K92O81p77k65O08N11q8r70K61
4370d0P12n72l93L30N5k0k84J63q2K22L18r5k53k94K60J63k86j16m7M38Q7o40
4392c74k27J02O68m24Mk25O59o7o72k70Q84K93l56p40K08N60k79o09N24L83k92
4413b50l50k4L24j62L13M42n08k77J06P61n27o97N15R79l99j129L66P61M1o96
4433d11l02O15K21o0n30M10O09l88O0k97J45j91K36k71k7M4M95On68o9Q56J8l23
4456B78l09k4N76k78m40j09O19M90p07m90L82P01k7q62O9M52N36m18m10N77R8
4477G04j13m48JK0j43M18l74k37J93M33O8p33J75L23N05p86k73O69K39l86o35
4498c80L62J52K74k70l69K61N1j47j92l8K2Q31k56m91J44M92n59k72l06O09J81
$$ plain form
4349 172 -52 288 491 219 514 243 -168 -24 522 477 -223 -293 -1 680 -97 -362 246 757 669 -301 -40
4370 -40 672 100 -293 37 92 72 -212 -49 -131 91 409 314 61 -233 27 190 -96 -212 -259 179 266 -374
4392 -374 -601 -499 169 -255 -251 -476 183 116 -556 -826 58 351 -5 -745 -537 23 -256 -865 -341 42 -250
4413 -250 -600 -624 -300 -462 -149 293 -215 -492 -386 375 -152 -849 -334 645 246 -883 -517 244 285 -411
4433 -411 -713 -98 123 63 -467 -57 552 164 224 -73 72 -119 117 -154 -181 -137 358 364 -204 -273 583 601 278
4456 278 -31 -55 521 243 -197 -306 313 803 96 -394 -12 689 662 -200 -131 321 857 439 29 606 704
4477 704 591 143 144 164 21 439 65 -172 21 454 522 -211 -36 287 792 6 -267 402 641 255 -380
4498 -380 -18 134 408 138 -231 30 81 -66 -258 -296 -274 557 301 -190 -46 446 -113 -385 -691 -82 99
4519I9n81N2j33J40L69j72m42L57M87j73k92j38P9P39n71n71K79P69l33n17K27
4540c26L30j53j32m40L69j19N96J7k24n09N26J92m29j41J5K71J33m70K76P19k80
4561B21n38%N28J13L3p33K77J68q9k6O5k92O86p2o08K96J77J06j61n28M05K74
4583C02p5r6j66O0N06p1m89k40M46K1j31l00K05O98j34l92k8N85m09l44r5M41
4605B94l7l9L26m14O8J29K54o18L7qP42o66l82K26N44J0r42N27L21L69q44m56
4627e59N90K9l13N6J12M13K01k69l44K19k57K96k18l09J00N06l05n14Q2K61O03
4648C80m70l98L93Q8k11J48j13R9J87q3l14j98K3N76n68j96N07L94l48m02Q1N48
4670A23k66P5j61K11j08r4j51k79K00O40j59l6k65J98N14m89n35N28N16n82l4
$$ plain form
4519 99 -482 -430 -563 -423 -54 -226 -668 -311 176 3 -289 -427 -348 391 -180 -751 -472 297 -36 -553 -326
4540 -326 4 -149 -281 -721 -352 -471 125 142 -82 -591 -65 127 -302 -443 -428 -157 -24 -494 -218 501 221
4561 221 -317 -317 211 324 357 -376 -99 69 -20 -46 19 -273 413 341 -267 29 206 312 151 -377 28 302
4583 302 227 131 -35 25 531 460 -29 -269 177 198 67 -233 -28 670 536 144 116 701 292 -52 -147 294
4605 294 257 218 544 130 198 327 581 -37 0 -8 734 68 -314 -88 456 466 -476 51 372 741 -103 -559
4627 -559 31 60 -253 -197 -85 328 529 260 -84 135 -122 174 -44 -353 -253 253 -52 -566 -484 -223 380
4648 380 -90 -488 -95 -7 -218 -70 -183 -84 103 20 -294 -492 -469 107 -461 -657 -150 244 -104 -506 -425 123
4670 123 -143 -68 -229 -18 -126 -220 -371 -650 -450 190 31 -5 -270 -72 442 -47 -582 -54 462 -120 -154
4691a54K5J10J42j37j27J16rJ37k15j70L16LJ94m58j10P43p0k43k73J75O08m05
4713A98l20j96J65N47J18r05J63L68L95j35l94O8L12J44p70L31N70Rp54j03K15
4734B6L22J04j54k94J16K47K57l83l26L33O54o76n40L97P22l67o50j32P00o6l82
4755i2j12L45J82l23L65j21k36K14m36M67p11M66K45l9n78J24O49j17r43K5O31
4776EL03n45k20M44M45n12j8k58J18L54l82j25Q2J1j3K29n53K35L70Pj98L4k08
4799c95M2N06m05K8Q7N93p83m15J51J081j81r02J00P81k44m84j07O67n5K0n9K31
4821B57j54l41M1K89l01J30J97n2l21P0N31K98p53j80M60K28k85o70L97Q86n11
4842B16o99J10P84lm38O9%K87o3l07J88p4J59J56l1l09P0L8Q2k29N0J18M59m43
$$ plain form
4691 -154 -129 -19 123 -14 -141 -25 -34 103 -112 -282 34 37 231 -227 -337 406 336 93 -180 -5 603 198
4713 198 -122 -318 -153 394 512 -393 -230 138 533 398 4 72 384 528 -242 89 659 668 -86 -189 26
4734 26 348 452 298 4 120 367 624 241 -85 248 902 226 -314 83 805 438 -212 -344 356 290 -92
4755 -92 -204 141 323 0 365 244 8 222 -214 253 -458 8 253 214 -364 -240 409 292 -651 -626 5
4776 5 308 -237 -457 -13 432 -80 -98 -356 -238 116 -266 -391 -309 -298 -311 -82 -635 -400 -30 -23 -221 -187 -395
4799 -395 -353 153 -252 -224 -137 456 -327 -742 -591 490 309 -593 -493 288 44 -440 -547 120 65 85 26 257
4821 257 103 -238 -197 92 -209 -79 118 66 -255 -185 346 644 -109 -289 171 399 114 -556 -159 727 216
4842 216 -483 -373 411 408 -30 39 39 326 263 -44 144 70 229 385 354 45 115 153 235 6 56 174 633 190
4866A90j85p5N23m4m68n8M42P45r65m99N66L53n30m43N96K22m28l46R02o5p41
4887c08M06q9J9o3L9J93j74m34M18N13k02p91J51O08j09o09j15P71n0m03O7P6
4909h6J96k66m39P20k24o6N4k01n9K25m4J9K3J64k9J50l28m22L10K79J91o14o8
4932e15J46N12m72m35L73R84p45o81O70M60j15o69L89L53k15k81j27M77p3l67
4952c31L27J31m04j35M60K01l93nM88j23m69rN89l8n09O0L60N10p18l77M84L38
4974D37k33j1j9J68q2k85M84l53J53K45k87mj35m0K30p2j79%K87J12j95k90J74
4997A05O26l08o58L30L28j24m88q4N26L33r22m4P45K81m31j36L27j59m38p0K43
5018a8N3m29N75K96o14n13N68N82q02l08N81M72m14n74J46R87k07l39m13N49o2
$$ plain form
4866 190 5 -70 453 409 -59 -117 325 1070 105 -394 172 525 -5 -448 148 370 -58 -404 498 433 -308
4887 -308 98 9 28 -35 4 197 23 -411 7 520 318 -473 -322 286 177 -432 -547 224 174 -229 -162 -86
4909 -86 110 -156 -595 125 -99 -165 -111 -312 -371 -146 -190 -171 -148 16 -13 137 -191 -613 -303 -24 167 -447 -515
4932 -515 -369 143 -329 -764 -391 593 -152 -833 -163 297 182 -487 -98 255 40 -241 -368 109 36 -331
4952 -331 -4 127 -277 -412 48 249 -144 -149 339 216 -253 -262 327 289 -220 -160 200 710 -8 -385 99 437
4974 437 204 193 174 342 260 -25 459 106 259 504 217 213 78 38 268 196 17 17 304 416 221 -69 105
4997 105 731 423 -235 95 423 299 -189 -273 253 586 -336 -380 365 646 215 79 406 247 -191 -261 -18
5018 -18 35 -394 181 477 -137 -650 -82 500 -302 -610 -29 443 29 -545 -399 588 381 42 -371 178 116
5039A16m29K1j69K95J66m4j27j3M33k76jk7j80J84m8l52K45l09P56l09n91K83
5061c76K91N94q55k25K13P40o66m61O00M97m29n34M81K98j29n42N06kn98N00J89
5082I2k46k68K48N27P0q33M52N96m83q86L79R54k50k71l56N91r1k92K9K54R0k98
5104Hk7p1K13o2L97J0o27M43J8J1k65m8J47O6q3k18JN91m8l15K3J85L2l15p6R8
5130H8K69K08l35k37L59o5j33q0J91m79K04r2J22j48l8Q22l93m42J26K92J1p14
5152d64M7N09M60q82k59O08K02k28k3J28M8J17n24QL82k70R4Q6l86J76L18o1m79
5175c93j09M32j02j30J2N6L55j39l35J0J70K93j37k93l7J98m6j38j91K35O94l73
5197C2l80K13M11m99N3k09M00k74O8J44p8l1J17K17l30P0J39M29m53l22O02K11
$$ plain form
5039 116 -313 -292 -461 -166 0 -44 -171 -184 249 -27 -28 -55 -235 -51 -99 -451 -206 -515 241 -68 -659 -376
5061 -376 -85 509 -346 -571 -358 382 -284 -745 -145 352 -77 -611 -130 168 39 -503 3 1 -597 -97 92
5082 92 -154 -422 -174 353 423 -410 42 638 155 -731 -352 602 352 81 -275 316 225 -67 -38 216 306 8
5104 8 -19 -90 123 61 458 468 -159 284 302 313 48 0 147 213 130 -88 -87 504 456 141 164 349 381 66 -10 88
5130 88 357 565 230 -7 352 287 154 74 265 -214 -10 -102 20 -128 -166 656 263 -179 -53 239 250 -464
5152 -464 -417 92 552 -330 -589 19 221 -7 -30 98 146 263 -261 -253 129 -141 -47 39 -347 -171 147 86 -393
5175 -393 -502 -70 -172 -302 -290 -234 121 -18 -353 -343 -173 120 -17 -310 -347 -149 -195 -333 -524 -289 405 32
5197 32 -348 -135 276 -223 -170 -379 21 -253 -185 -41 -119 -150 -33 184 -146 -76 63 492 39 -283 319 530
5219E30m47o40N65N16n09l76K42K78j83K59J45m29L03q8JK25k51J61P6m96l2L96
5241B46K00l92j27j82N19K8J18n35M78O3q7k47k00K96J05k80M4N8J25J03n54k
$$ plain form
5219 530 83 -557 8 524 15 -361 -119 159 -24 235 380 -49 254 166 167 392 141 302 378 -118 -150 246
5241 246 446 54 -73 -255 264 292 410 -125 353 416 329 82 -118 178 283 3 47 105 230 333 -221 -223
$$ [...]
8191a86
##END NTUPLES=NMR FID
##END=
