##TITLE=1H_Costus-oil-G-SL72-f10
 CDcl3, 8 sc, 
 31.1.2020
##JCAMPDX= 6.0         $$ Bruker NMR JCAMP-DX V2.0
##DATA TYPE= NMR FID
##DATA CLASS= NTUPLES
##ORIGIN= UXNMR, Bruker Analytische Messtechnik GmbH
##OWNER= root
$$ XWIN-NMR		Version 3.5
$$ Fri Jan 31 14:03:41 2020 Russian Standard Time (UT+4h)  she@DPX200
##.OBSERVE FREQUENCY= 200.1315
##.OBSERVE NUCLEUS= ^1H
##.DELAY= (6, 6)
##.ACQUISITION MODE= SIMULTANEOUS
##.ACQUISITION SCHEME= undefined
##.AVERAGES= 8
##.DIGITISER RES= 18
##SPECTROMETER/DATA SYSTEM= spect
##.PULSE SEQUENCE= zg30
##.SOLVENT NAME= CDCl3
##.SHIFT REFERENCE= (INTERNAL, CDCl3, 0, 15.7039)
##AUDIT TRAIL= $$ (NUMBER, WHEN, WHO, WHERE, WHAT)
$$ ##TITLE= Audit trail, XWIN-NMR		Version 3.5
$$ ##JCAMPDX= 5.01
$$ ##ORIGIN= Bruker BioSpin GmbH
$$ ##OWNER= she
$$ F:/spectra/data/she/nmr/H-F/1/audita.txt
$$ ##AUDIT TRAIL=  $$ (NUMBER, WHEN, WHO, WHERE, WHAT)
(   1,<2020-01-31 14:02:05.14 +0400>,<she>,<DPX200>,
      <created by zg, POWCHK disabled, PULCHK disabled
       configuration hash MD5:
       00 E9 B6 7A A2 85 ED C7 34 08 36 98 17 FE 4E 26
       data hash MD5: 16K
       8B A2 12 34 BB AD 53 03 3F CF 90 13 DE BE 16 51>)
$$ ##END=
$$ 
$$ hash MD5
$$ 0E 9D 55 C9 E3 A2 03 11 AD 01 6F FC DF 85 34 B9
##$RELAX= 
##$RELAX= 
##$RELAX= 
##$RELAX= 
##$RELAX= 
##$RELAX= 
$$ Bruker specific parameters
$$ --------------------------
##$DU= <F:/spectra>
##$EXPNO= 1
##$NAME= <H-F>
##$PROCNO= 1
##$TYPE= <nmr>
##$USER= <she>
##$AMP= (0..31)
100 100 100 100 100 100 100 100 100 100 100 100 100 100 100 100 100 100 
100 100 100 100 100 100 100 100 100 100 100 100 100 100 
##$AQSEQ= 0
##$AQ_mod= 1
##$AUNM= <au_zg>
##$AUTOPOS= <>
##$BF1= 200.13
##$BF2= 200.13
##$BF3= 200.13
##$BF4= 200.13
##$BF5= 200.13
##$BF6= 200.13
##$BF7= 200.13
##$BF8= 200.13
##$BYTORDA= 1
##$CFDGTYP= 0
##$CFRGTYP= 5
##$CHEMSTR= <none>
##$CNST= (0..31)
1 1 145 1 1 1 1 1 1 1 1 1 1 1 1 1 1 1 1 1 1 1 1 1 1 1 1 1 1 1 1 1 
##$CPDPRG= <>
##$CPDPRG1= <>
##$CPDPRG2= <>
##$CPDPRG3= <>
##$CPDPRG4= <mlev>
##$CPDPRG5= <mlev>
##$CPDPRG6= <mlev>
##$CPDPRG7= <mlev>
##$CPDPRG8= <mlev>
##$CPDPRGB= <>
##$CPDPRGT= <>
##$D= (0..31)
0 1.2 0 0 0 0 0 0 0 0.06 0 0.03 0 0 0 0 0.0002 0 0 0 0 0 0 0 0 0 0 0 0 
0 0 0 
##$DATE= 1580464924
##$DBL= (0..7)
120 120 120 120 120 120 120 120 
##$DBP= (0..7)
150 150 150 150 150 150 150 150 
##$DBP07= 0
##$DBPNAM0= <>
##$DBPNAM1= <>
##$DBPNAM2= <>
##$DBPNAM3= <>
##$DBPNAM4= <>
##$DBPNAM5= <>
##$DBPNAM6= <>
##$DBPNAM7= <>
##$DBPOAL= (0..7)
0.5 0.5 0.5 0.5 0.5 0.5 0.5 0.5 
##$DBPOFFS= (0..7)
0 0 0 0 0 0 0 0 
##$DE= 6
##$DECBNUC= <off>
##$DECIM= 24
##$DECNUC= <off>
##$DECSTAT= 4
##$DIGMOD= 1
##$DIGTYP= 9
##$DL= (0..7)
0 120 120 120 120 120 120 120 
##$DP= (0..7)
150 150 150 150 150 150 150 150 
##$DP07= 0
##$DPNAME0= <>
##$DPNAME1= <>
##$DPNAME2= <>
##$DPNAME3= <>
##$DPNAME4= <>
##$DPNAME5= <>
##$DPNAME6= <>
##$DPNAME7= <>
##$DPOAL= (0..7)
0.5 0.5 0.5 0.5 0.5 0.5 0.5 0.5 
##$DPOFFS= (0..7)
0 0 0 0 0 0 0 0 
##$DQDMODE= 0
##$DR= 18
##$DS= 0
$$ [...]
##$SUBNAM2= <"">
##$SUBNAM3= <"">
##$SUBNAM4= <"">
##$SUBNAM5= <"">
##$SUBNAM6= <"">
##$SUBNAM7= <"">
##$SUBNAM8= <"">
##$SUBNAM9= <"">
##$SW= 24.9337058887773
##$SWIBOX= (0..15)
0 0 2 0 0 0 0 0 0 0 0 0 0 0 0 0 
##$SW_h= 4990.01996007984
##$TD= 16384
##$TD0= 1
##$TE= 0
##$TE2= 300
##$TE3= 300
##$TEG= 300
##$TL= (0..7)
0 120 120 120 120 120 120 120 
##$TP= (0..7)
150 150 150 150 150 150 150 150 
##$TP07= 0
##$TPNAME0= <>
##$TPNAME1= <>
##$TPNAME2= <>
##$TPNAME3= <>
##$TPNAME4= <>
##$TPNAME5= <>
##$TPNAME6= <>
##$TPNAME7= <>
##$TPOAL= (0..7)
0.5 0.5 0.5 0.5 0.5 0.5 0.5 0.5 
##$TPOFFS= (0..7)
0 0 0 0 0 0 0 0 
##$TUNHIN= 0
##$TUNHOUT= 0
##$TUNXOUT= 0
##$USERA1= <user>
##$USERA2= <user>
##$USERA3= <user>
##$USERA4= <user>
##$USERA5= <user>
##$V9= 5
##$VALIST= <valist>
##$VCLIST= <CCCCCCCCCCCCCCC>
##$VD= 0
##$VDLIST= <DDDDDDDDDDDDDDD>
##$VPLIST= <PPPPPPPPPPPPPPP>
##$VTLIST= <TTTTTTTTTTTTTTT>
##$WBST= 1024
##$WBSW= 4
##$XGAIN= (0..3)
0 0 0 0 
##$XL= 0
##$YL= 0
##$YMAX_a= 236200
##$YMIN_a= -144047
##$ZGOPTNS= <>
##$ZL1= 120
##$ZL2= 120
##$ZL3= 120
##$ZL4= 120
##$ABSF1= 10
##$ABSF2= 0
##$ABSG= 5
##$ABSL= 3
##$ALPHA= 0
##$AQORDER= 0
##$ASSFAC= 0
##$ASSFACI= 0
##$ASSFACX= 0
##$ASSWID= 0
##$AUNMP= <proc_1d>
##$AZFE= 0.1
##$AZFW= 0.1
##$BCFW= 1
##$BC_mod= 2
##$BYTORDP= 1
##$COROFFS= 0
##$CY= 11.3945322036743
##$DATMOD= 1
##$DC= 2
##$DFILT= <>
##$DTYPP= 0
##$F1P= 16.9975609425685
##$F2P= -3.02152046262296
##$FCOR= 0.5
##$FTSIZE= 0
##$FT_mod= 4
##$GAMMA= 1
##$GB= 0.15
##$INTBC= 1
##$INTSCL= 1
##$ISEN= 128
##$LB= 0.24
##$LEV0= 0
##$LPBIN= 0
##$MAXI= 10000
##$MC2= 0
##$MEAN= 0
##$ME_mod= 0
##$MI= 1.114404
##$NCOEF= 0
##$NC_proc= 0
##$NLEV= 6
##$NOISF1= 3.799351
##$NOISF2= 2.8
##$NSP= 1
##$NTH_PI= 0
##$NZP= 0
##$OFFSET= 15.70392
##$PC= 1
##$PHC0= -9807.09
##$PHC1= 42.20081
##$PH_mod= 1
##$PKNL= yes
##$PPARMOD= 0
##$PSCAL= 0
##$PSIGN= 0
##$REVERSE= no
##$SF= 200.130013532006
##$SI= 16384
##$SIGF1= 3
##$SIGF2= 2
##$SINO= 400
##$SIOLD= 16384
##$SREGLST= <1H.CDCl3>
##$SSB= 0
##$STSI= 0
##$STSR= 0
##$SW_p= 3612.71676300578
##$SYMM= 0
##$S_DEV= 0
##$TDeff= 0
##$TDoff= 0
##$TI= <>
##$TILT= no
##$TM1= 0
##$TM2= 0
##$TOPLEV= 0
##$USERP1= <user>
##$USERP2= <user>
##$USERP3= <user>
##$USERP4= <user>
##$USERP5= <user>
##$WDW= 1
##$XDIM= 8192
##$YMAX_p= 0
##$YMIN_p= 0
$$ End of Bruker specific parameters
$$ ---------------------------------
##NTUPLES= NMR FID
##VAR_NAME=  TIME,          FID/REAL,        FID/IMAG
##SYMBOL=    X,             R,               I
##VAR_TYPE=  INDEPENDENT,   DEPENDENT,       DEPENDENT
##VAR_FORM=  AFFN,          ASDF,            ASDF
##VAR_DIM=   8192,          8192,            8192
##UNITS=     SECONDS,       ARBITRARY UNITS, ARBITRARY UNITS
##FACTOR=    0.0002004,     1,               1
##FIRST=     0,             0,               0
##LAST=      1.6414764,     0,               0
##MIN=       0,             -144047,         0
##MAX=       1.6414764,     236200,          0
$$ Real data points
##PAGE= N=1
##DATA TABLE= (X++(R..R)), XYDATA
0@%%%%%%%%qJ6j6J6k4L2l2M0n2O0p2Q8j04J20j37J58j82K10k42K75l13L55m01
31b13M51n06N68o33P05p88Q77r72J080j200J327j468J627j802J997k215K462k742
49a445L065l442L887m421N077n911P003q507J0735j4403K1818o3018J76031P8345
63B04814k74172n8389J91983Q0221j78096p7169J18064P1909r7623n2381O1392
74i447M0449l7402J4L3129j2894l9020K6170L8216k9603m7081K8722M6690k2336
87A5607n0142J7140M8254q198m6132P166N3803R344n5018l1222L4299L5212k1398
100H715k8470J9060K8431j6726k8894J3109K9569n847k2721M18Q374p218J956
113b44J9406n937l0665M247L9304k134m7738k898N3717R379n5397j3249N7937
$$ y = [0, 0, 0, 0, 0, 0, 0, 0, 0, -8, 8, -8, 8, -16, 16, -16, 24, -28, 32, -40, 48, -56, 64, -73, 85, -97, 113, -129, 146, -167, 188, -213, 238, -268, 300, -333, 372, -416, 461, -511, 569, -631, 696, -772, 855, -947, 1050, -1165, 1297, -1445, 1620, -1822, 2065, -2356, 2721, -3190, 3813, -4694, 6041, -8362, 13456, -49562, 126469, 204814, -69358, -127747, 64236, 144457, -33639, -110808, 7256, 79165, -18458, -70839, -9447, 31002, -6400, -6386, 26743, 13849, -25171, 999, 39215, 9612, -37469, -8747, 37943, 15607, -34535, -17395, 30859, 22661, -23471, -16305, 37498, 46842, -8176, -39398, -5099, 30113, 8715, -19755, -695, 27736, 11010, -17884, -4775, 24794, 18947, -3774, -3356, 5018, -2200, -244, 19162, 13225, -17440, -13193, 26111, 23977, -23761, -26659, 27058, 36437, -18960, -32209, 25728]
126B5728J9800n9534l3120N0459M1373l6186m0603K0116L1627j2794k1299J1391
138c042J6708r222j2834J322K230R29J1943O379j8722j9292J5765K6659j0200
151H623l1036K405L2077O245l0102j4622K6360K2167k0669k8279J1809L2376k428
164A4926l3523j0216K7881J9080j6199j8894P191J4350l216r979J177P951L166
177C695l237r289q061Q675J9957m08k3979p211K4688J2346k4141j5497K3766J9971
191B1275k1557k4824J6739K7694q941k6750L085K3208M784j6556r412P063Q938
204D746j16n259m001L957Q857p21j3409m142J7178J3157j4574k1275O237K2988
218A3623L546j9593r493J5068J2748r639j6491K886J9616N593j6982j2874J1929
$$ y = [25728, 45528, -14006, -47126, 3333, 44706, 8520, -32083, -11967, 19660, 6866, -14433, -3042, 13666, 4444, -8390, -7068, -4838, -3909, 8034, 14413, -4309, -23601, -7836, 18823, 8623, -22413, -20008, 12069, 18314, -11788, -26410, -50, 22117, 1448, -26831, -15022, 17354, 14926, -18597, -28813, -932, 18148, 1949, -16945, -9754, 4596, 1380, -8599, -7422, 529, 3695, 458, -8831, -16892, -8217, 11740, 11332, -12647, -19858, 4830, 17176, -6965, -22462, 1304, 21275, -282, -25106, -8367, 19327, 10386, -16364, -13279, 9929, 14713, -1843, -11255, -4192, 4746, 4630, -629, -4630, -673, 8184, 7463, -5946, -10088, 7090, 20247, 5673, -15602, -9365, 13623, 17169, -2424, -11917, 3151, 15899, 6260, -10231, -7345, 12271, 17864, 882, -11992, -63]
231f3J8253n425k1571l109K0457J0870j5199j6006Q247J7117j551j5522m272J2923
245E149Q557r937j3100L437J6126N273j3281j2066P349J4479l681j6622j578J6657
259F762P204j5185j2312J0484J5935l980j6138l626J3359P748q874j1170L175
272f618J2063K306j0675p904P188J0112m014j3067L75J5310N560j3993j2819R196
286f980J5755l061j5416k859J4411O691j1946j0832P301J3184j791j4309l758
299a3610J2697Q889q046j2756L588J4324J906j3233q154R847J2084m307j2884
312i655n96J2631N433j0620j0063O954J3548j088j4120l912J2938Q932r490j1719
326a0827N369J3088q70j3028l573J1058Q475n548r738K55R553M711p929q984M715
$$ y = [-63, 18190, 12765, -8806, -11915, 8542, 19412, 4213, -11793, -3546, 13571, 12020, -3502, -7774, 5149, 13706, 3769, -9331, -5894, 10232, 15505, 2224, -9842, -2493, 11986, 8305, -8317, -9895, 6762, 13966, -1219, -13531, -3047, 12888, 8908, -7230, -10856, 2503, 10251, 1377, -9793, -6618, 5445, 7751, -2924, -10828, -3640, 6472, 2458, -10609, -10234, 5076, 10636, -3357, -16176, -6980, 8775, 5714, -9702, -12561, 1850, 8541, -3405, -14237, -6936, 6248, 4457, -9852, -13610, -913, 7976, -70, -12826, -9238, 5086, 6992, -6241, -14395, -4548, 7536, 3229, -9655, -10251, 2380, 7813, -2807, -12870, -5916, 7632, 6544, -7576, -11488, 1450, 10382, 892, -10827, -5458, 7630, 6760, -6268, -9841, 1217, 9692, 4144, -5594, -5339, 4214, 8925, 996, -7988, -3273]
341c273J2622O96j3795n069J3263R455j1526j2843P962J5763l211j5847j401J3987
355F783N896r592q309M936Q345m11p421l343N632O861k604r929k515R384P314
370A1027p225r790M321J2471m56j3181n494J1685Q725q024j1815L996J3364O32
384A0236j3147n684J0761Q738q220j1528L837J2100R39j0418m523P574O432m352
398B745q162q04P511M211m725p623J144Q821K678r354o495Q400R581n995j2563
413a0630J546J3814K966j3238o685J0342R780p138j1621K736J1863J399j0508
426e374m701P230P157l460p396m43O916M053n315o707J943Q502K293q708o477
441a0487O871R742l668j1326M91J2536L619j1792p019R452R453o013j0294K903
$$ y = [-3273, 9349, 10045, -3750, -8819, 4444, 13899, 2373, -10470, -2508, 13255, 10044, -5803, -7204, 6783, 12679, 3087, -5222, -286, 8059, 7648, 227, -3116, 2516, 9377, 6773, -3156, -5671, 3713, 11027, 3802, -5988, -1667, 10804, 10348, -2833, -8327, 3358, 12083, 4059, -7756, -3760, 9604, 10236, -2911, -8595, 2166, 10904, 2684, -8844, -5007, 7093, 8032, -2386, -6909, 665, 7097, 2745, -5417, -6221, 1290, 5501, 776, -6847, -5703, 3118, 5796, -3558, -10053, -1653, 7928, 1933, -10630, -9084, 4730, 7696, -5542, -12227, -1885, 7895, 757, -10864, -8128, 3735, 5134, -5374, -10075, -2845, 4312, 852, -6544, -6987, -71, 3982, -1333, -8040, -6097, 2405, 4698, -4010, -10487, -3616, 6126, 2458, -8868, -8377, 4159, 7778, -4014, -11033, -1581, 7872, 1859, -8435, -5532]
455e532J1144O66r175m103O375O167k498o352j126N774M627l030p097J91Q763
470D794L608q247p227O495R628l509j0392N55J1555K687j0522o721Q234R406m201
485F143j0342N76R324L325p855n578N400P838k742q694p66P095L876m781n320
500b501J739N934J573n956m616L480P415J35r694l823Q790P532p526j0508M786
515c240J2639j578j3890k037J2281N066j0468o978P516Q177n180q288J099P171
529B290K260m251m910L58M115L526k803o336N69P919J453q570n015R100P808p471
545D2j1246M400J2990j142j3270l064J2478O180r223q332N759R152l066q296M07
560f231P080J760n123l374J817L889K277k036n421j461O829M746o368p633O104
$$ y = [-5532, 5612, 6278, -2897, -7000, -625, 5542, 3044, -3308, -4434, 1340, 5967, 2937, -4160, -3969, 4794, 8402, 155, -7072, -577, 9051, 5542, -4850, -4295, 7260, 9947, -575, -7296, 938, 10344, 6143, -4199, -3623, 5701, 9026, 1171, -4407, 993, 8831, 6089, -2605, -3371, 3724, 7600, 2819, -2501, -762, 5172, 6745, 789, -3827, -347, 7068, 7203, -2491, -6314, 2476, 10008, 2482, -8026, -3240, 9399, 7821, -6069, -8106, 4175, 9241, -1227, -8205, -689, 7488, 2308, -5980, -4881, 2290, 4550, 299, -4611, -4253, -138, 3388, 585, -5751, -5182, 2737, 4190, -4380, -9395, -295, 7513, 42, -11204, -6804, 6186, 5044, -8226, -11290, 1188, 7368, -1855, -10187, -4428, 4724, 1658, -6638, -6231, 849, 2609, -2514, -5888, -4071, -182, 2095, 59, -5362, -6823, 6, 4752, -1616, -9249, -3145]
575c145J0958n143j3435K628J5745J371j5695m495J3843P560j1175q511P635Q715
589F856m545o834K022N619k35k517j344o28J947M752l57q075k761R405P016q098
605B223r270N938J0575m998j1124L594J3037p35j3684l043J1817O957q334q079
619e126M835P159j691o112J4L821J552k393j980n5K362K503j430n845o92P525
635D447M933p653r135N360J1023k154j1926M37J1664R21j2994l917J2792P351
649A1149r813j0097N069R880k126o786m09L944R02k081j446n77J596L653l89p270
665d801k691R028O921r006j1454O006J3980k006j4253j183J2958K214j1773l470
679i530J1174O179r639q584N095Q357j4n271k371M02K119K146K43l233p77M369
$$ y = [-3145, 7813, 2670, -10765, -8137, 7608, 8979, -6716, -11211, 2632, 10192, -983, -9494, -1859, 6856, 2311, -4523, -2501, 3118, 2883, 366, -978, -1606, 341, 5093, 4736, -3339, -6100, 3305, 10321, 2223, -7047, -1109, 9466, 4468, -6656, -3062, 9975, 9240, -4444, -7487, 4330, 11287, 2953, -5126, -291, 6868, 5177, -935, -921, 2900, 4452, 2059, 79, 24, 2386, 4889, 3459, -2386, -3078, 4447, 9380, 1727, -7408, -2048, 8975, 6821, -5105, -4668, 6996, 7917, -5077, -8994, 3798, 11149, 1336, -8761, -3692, 6188, 4062, -2724, -3133, 811, 1713, -368, -1814, -2391, -795, 2858, 2469, -4801, -7492, 1536, 8457, -549, -12003, -5997, 7983, 5977, -8276, -9459, 3499, 5713, -6060, -9530, 1644, 7823, -1816, -10400, -5305, 3052, 3038, -2233, -4604, -4202, -2083, 63, 306, -2927, -3704, 665]
695F65O38o275k554Q834N757q512r741O897J2260k795j2606j109J1269L556q972
710b688m409P502N235o042o747M269P982k67o521l542K574M601K276j715m802
725b294k85M749J619n519k454P434N484q031r725O617J3040k207j3913j748J2009
740D776M712r336m930O440N312m635n536K950N473J66m176l723N94N592M397m116
756C960q636j99R523M122p977n264O817N526p683o913O814J0252m053j2155n61
771f427J0173M179o383n404K732L981j303k756j00L022J306k593m042N61N616
786B562K458n083o678K306Q598J075p706l998N371M980m620n484M084P447k440
801B872r849j523R869N677p203p463K881O229K70m748q18L511J348k508l480N74
$$ y = [665, 1303, -4972, -7526, 1308, 7065, -1447, -11188, -4291, 7969, 5174, -7432, -8541, 2728, 6284, -2688, -7097, 405, 5640, -402, -7149, -2880, 5102, 4835, -1686, -5228, -2654, 1947, 4223, 2508, -2294, -2579, 2170, 3789, -1730, -4184, 3250, 8734, 703, -9022, -2405, 10635, 8428, -5485, -7233, 4776, 9488, 152, -4778, 1662, 6974, 2339, -3197, -247, 5226, 5392, 1216, -2507, -1913, 3679, 8076, 3960, -4676, -4875, 4648, 8770, 793, -4471, 2346, 7872, 189, -6724, 90, 10342, 6289, -5866, -6427, 3746, 7925, 1542, -3862, -1130, 2851, 1548, -1208, -1308, 1714, 3020, 427, -3615, -3054, 2562, 5020, -63, -6741, -4435, 4163, 5238, -2468, -6466, -1095, 3885, -735, -6219, -2135, 5312, 2872, -6977, -8500, 1369, 7046, -157, -7620, -4739, 1490, 1760, -2988, -3806, -295, 1053, -1455, -4935, -4361]
817d361N099L244m931p045J902R623K243r971n609P914P572m789q012L246P957
832D082k235q153L79P885L606n773n876J213O281L415l600n304L03N465J640m711
848a383k517N029M319m514p185K972R068O41q774l981O754O741l711p218J206
863b553O892P27o061k389N927L901m278n690J660O625J829n242m285J727M960
878C750J488l882l412L320M227l219n696J829Q093Q47q969m303O929P191l908
893D285p703R74O315O13n047j833L702L488k724m582l72N334L204m149o551J218
909c828P729K324p241n041N323O222l863o661J795P193j67p438k554O179N336
924E308l803o336n7N524K958m395l968J709M763l8m663k015M532M055l846n971
$$ y = [-4361, 738, 3982, -949, -7994, -6092, 3531, 5774, -4197, -9806, -1892, 5680, 891, -7121, -3875, 4082, 1847, -6306, -5927, 1958, 5564, -209, -6085, -4872, 1409, 4824, 1224, -4080, -3777, 1688, 3328, -1383, -3900, 1129, 5448, 934, -6251, -3279, 5789, 6430, -2344, -6325, 429, 7170, 3459, -3759, -2553, 4339, 5066, -995, -3384, 2543, 6444, 2166, -3524, -1864, 4761, 6590, 1348, -2937, -1210, 3750, 5238, 1356, -2056, 1264, 5491, 2272, -3424, -1595, 6498, 7345, -1624, -5927, 1002, 8193, 4285, -3418, -2444, 3871, 4484, -563, -2396, 1306, 4794, 2070, -2512, -2884, 2450, 5654, 1505, -5046, -3828, 3901, 6225, -1016, -6057, -734, 5488, 1625, -5036, -3241, 3952, 3785, -3653, -6207, -28, 5308, 1505, -4831, -4888, 636, 3594, -801, -4769, -3060, 1703, 1665, -2998, -5013, -481, 3574, -272, -6243]
940f243J267O841J693o220m491M758O249k527p013M45O911J334o296l670N242
955a720N980k910o757J40O071K913m217m558J550M932J269m881k771M624M711
970D376l098o363R84P358K050o866m701N181O184k402o609J51O273K283m927l623
986c749L095N164j203n556j461N383M457m023o091J298P040J718o070m288M418
1001A32N660k205o498M29O679K190n660m812L985O628k071o755o37N754L198m808
1017A209m518K850N355q45n154j431L568L912k124n188m33N416K699m836m718
1032d238K825O935j612o913j477O963L190n860m981L503O121j358o629r45N045
1047E69L396l373m790J268M902Q23m620k850L324M716j791n788n23N871K641m977
$$ y = [-6243, -4976, 1865, 3558, -2662, -7153, -2395, 3854, 1327, -5686, -5241, 1670, 3004, -3292, -6962, -1720, 4260, 1350, -5407, -5267, 804, 3717, -500, -5058, -3508, 1424, 2693, -2188, -4959, -335, 4376, 1278, -5085, -4101, 3257, 5307, -1559, -6260, -1079, 5105, 2703, -3906, -3755, 2518, 4801, -126, -3749, -654, 4510, 3307, -2249, -3710, 1673, 6130, 2107, -3984, -2686, 4354, 6072, 2, -4286, 132, 5792, 3587, -2911, -2482, 4197, 6387, 727, -4085, -100, 6528, 4457, -2298, -2935, 2819, 6017, 1209, -3309, -459, 4896, 4051, -1103, -2534, 1034, 4946, 2822, -2366, -2799, 2617, 5316, 480, -4238, -1413, 5522, 3910, -3003, -4480, 2483, 5673, -187, -5168, -1665, 4456, 3098, -3531, -4476, 569, 3965, 592, -4198, -2930, 1972, 2795, -1825, -4675, -1351, 3365, 1574, -4214, -4737, 1134, 3775, -1202]
1063a202n256L713O464j503o556j447O142K736m207m900K678N606k15n764j177
1078d888M096M029k861n402Q99N138J683m418l586K779N442m26o338j428N675
1093C94L836m241n448K454O441k42o418j787O133L526m399n002K849N266J05n064
1109a597k168M180L732k128m629R4M774K273l828l927K267N140k83n451j845N117
1125A721M101l965n400K060O626J43o569k491N367M487l504n692J653N690P06
1140D933m871k959L394M581j517n247p19N021K531l724m624J884N641J87n307
1155g96l457N484M440l223n942J339N899J050n773l090L983M926k775n707N98
1170c044N171J771m447l353K579M354l91n097j485M042L410k412n480J035N632
$$ y = [-1202, -6458, -2745, 3719, 2216, -4340, -5787, 355, 3091, -1116, -6016, -3338, 2268, 2053, -3711, -4888, -792, 3237, 376, -5026, -4127, 1011, 2694, -1724, -5310, -2531, 2911, 2485, -3853, -5281, 394, 4230, -11, -5459, -3005, 3436, 3194, -3224, -5011, 1122, 4648, 249, -4753, -1904, 3362, 3467, -1597, -3765, 415, 4147, 2019, -2610, -2516, 2258, 4531, 703, -3224, -957, 4183, 3900, -1551, -3396, 1721, 5822, 1857, -3543, -1483, 5143, 5286, -1283, -3774, 1593, 6080, 2576, -3116, -1463, 4227, 4933, 62, -2897, 497, 5078, 3561, -1686, -2405, 2616, 5147, 1423, -3201, -1317, 4324, 4511, -796, -4253, 1231, 5671, 2448, -3494, -2155, 3744, 4794, -979, -4069, -86, 4840, 2065, -3642, -3044, 2127, 3898, -549, -3902, -1323, 3031, 2640, -2457, -3942, 100, 3510, 1098, -4382, -3347, 2285]
1185B285J048n254l555L998N366k624o236N64O125J525n323l889L981N157k222
1200I46n369n3M879K231l509l848J771M352J58m079k082L191M147j853n080l34
1216d532N647K277m662m278L810N635j780o387m29N771K863m897l869K968N169
1231C306j028n308l32M390K600l222l702J312M760P76m130l080L075M346j106
1246B657m779r22M964K313l709l875K701N338q93n587r93M880L315m281m096K156
1262h11N123k56m844j176L198L023k291l719N60L853J790l725l747K741M589n81
1278C727n032j599M965L120m490m211K455N584r59n804r74M899L274m040m083
1293c168J471M673O24m469j979K437K826q60l749J12L530J597l490l647K272M867
$$ y = [2285, 3333, -1921, -5476, -1478, 3888, 1264, -4972, -4408, 1717, 3242, -2081, -5970, -1989, 3168, 946, -4423, -4476, 403, 2634, -875, -4723, -2952, 1400, 1558, -2521, -4603, -1412, 2735, 882, -4198, -4532, 1115, 3392, -1270, -5548, -1738, 3897, 2117, -4270, -4699, 1072, 3935, -962, -4831, -1863, 3306, 2278, -3030, -3362, 1028, 3628, 406, -3296, -1984, 2776, 3552, -578, -3658, -583, 3763, 2657, -2122, -3044, 1920, 4233, 524, -3351, -650, 4688, 3795, -1792, -2785, 2095, 5410, 1129, -2967, -811, 4312, 4056, -788, -1964, 1234, 4257, 1966, -1753, -1193, 2660, 4450, 725, -3022, -281, 4308, 3727, -1305, -2904, 2061, 5181, 691, -3520, -1065, 4519, 3560, -2244, -3218, 1681, 4955, 915, -3168, -1697, 2976, 3600, -869, -2848, -411, 2415, 1555, -2194, -2082, 1448, 3045, -445, -4092, -1820, 3047]
1309C047J60n606k496M289M316k854n169J346N205j63n258j364M831L358m061
1324d19m159J305M803O12l866k347K132L224n85k992j299K696K674k035l744R85
1340c015M782O29n410k721N101M509k958n403J061M991N39m343j102L566K277
1355B503k551l409J049L557J656k800k974P34L813J152k807k970K304M037j770
1370A524m378O05N179R69n779k121N100M136l117n557J200M918J035l774j518
1385a578K346J343j257j840J297K302N06k308k462O68L734J877l304l795K010
1400d61M544n70m769q36M950J253m605k646M639L754l366n052J406N316N16l681
1416C92k209K162J237l87j008j05P08M59p77k364P8L750K441m314m471K235N482
$$ y = [3047, 3207, -2399, -4895, -606, 3710, 856, -4313, -2967, 2238, 2075, -3183, -4547, 284, 3642, -419, -4578, -3273, 1530, 2142, -1724, -4071, -1939, 1285, 700, -2292, -3591, -895, 1779, -256, -4000, -3015, 1767, 2396, -3014, -5735, -634, 3875, 917, -4486, -3425, 1566, 2105, -2238, -3340, 226, 2503, -48, -3457, -2408, 1149, 2805, 5, -2969, -2235, 1578, 2730, -77, -3047, -743, 3294, 1524, -2854, -2249, 2930, 3899, -1880, -4001, 1099, 5235, 2118, -3439, -2239, 2679, 3714, -60, -1578, 768, 2111, 854, -986, 311, 2613, 3119, 811, -1651, -983, 2751, 4628, 1324, -2471, -461, 4083, 3513, -1256, -2092, 2858, 4111, -494, -3140, 1499, 5253, 1887, -3165, -1759, 3557, 4073, 392, -1817, 345, 1582, 1195, 187, 82, 790, 1249, 472, -1892, -1814, 1936, 4377, 63, -4408, -2173, 3309]
1433C309j56n570q34M670J224m902j473L982L297l738l942J178M237R07k912k021
1449b744P46K156O09r73j874J31J738L04j906q86K984K112l742m424L161N948
1465C340l29o541j410M953K618l999k511L673K875l406l582K255L849m63l012
1480a690j073J589J379R80q93k220j51K270J857k227k332K504K972l059l730K712
1496a112N850j281o727j093O013K489l872k629K857K075k454k207K460K431m57
1511B343k359r46N25J666J830j058l032q77L377K017k872k391K400L185k439l996
1527b627K714M948j796o028K91N359J902m045k708K005K505j262j443J164Q44
1542A823q24j438O7M29J340J039j346l133J89L518J740l616k882K863L436k538
$$ y = [3309, 3153, -2417, -3251, 1419, 2643, -2259, -3732, 250, 3547, -191, -4133, -2955, 1282, 2189, -723, -2744, -1998, 158, 767, -206, -2080, -1949, -211, 93, -1813, -2699, 285, 2397, -1345, -5769, -2608, 3340, 3011, -3530, -4940, 13, 2631, -1368, -3879, -206, 2669, -737, -4319, -2064, 1785, 1322, -1690, -2763, -1174, 205, 1185, 292, -1928, -2079, 191, 2048, -179, -2511, -7, 2965, -94, -3824, -1112, 4738, 3457, -3270, -4363, 1650, 4139, 267, -2362, 495, 2570, 116, -2091, 369, 2800, 2343, -16, -962, -437, 1229, 3059, 2001, -1031, -1908, 1469, 3486, 614, -1777, 623, 3808, 1369, -2627, 87, 5035, 3239, -2789, -2498, 2861, 4763, 718, -1990, 15, 2520, 1258, -185, 979, 1823, 999, -439, -372, 57, 1397, 2436, 1090, -2043, -1854, 1664, 3404, -212, -3094, -231, 3205, 667]
1558F67l793K356M404j986m840l7N324J086m163k539K974K190j306j668M87N06
1574c38l53K28m73l42P86J343j087l235P11M248J107m131k993L440L410k654l079
1591c412J725L758j763l810L73M068J148l649k050K329K698o33k146l49O46P89
1607b78N06j047o36R07J220q95k049N49M015J20m179k018L580L707k492l639J227
1624a402L658j070l248N45L245Q76k870j749J713K322k86j448j270P69J802J72
1640A759j339j336J319K181j032k963Q05L441L99m297j385L957K884k844l511
1655a962J525L320n3l331m54K972P67k318j754J235K365n2k002j214O69K099M53
1672B265k351j181J800K129j368k969Q26L207O0l583j045K702K812k472l322J250
$$ y = [667, -3126, -770, 3634, 1648, -3192, -3229, 2095, 3181, -982, -3521, -547, 1643, 337, -1331, -844, -338, -691, -463, -936, -1278, -492, 851, -236, -3471, -2760, 1488, 2595, -1536, -4529, -1089, 2321, -333, -3412, -1687, 2071, 308, -3502, -3129, 939, 2087, -1562, -3612, -1283, 1415, 782, -1364, -1713, -1067, -278, 228, -819, -1455, -548, 672, -223, -2272, -1723, 2292, 2412, -1767, -3785, -205, 3502, 1010, -2629, -1402, 2256, 1186, -2062, -1517, 1728, 2604, -266, -2015, -302, 2020, 1734, 286, -984, -215, 1587, 1759, 420, -916, 403, 2584, 1552, -1411, -606, 2835, 3234, -1063, -2448, 1509, 4393, 1549, -1962, -437, 2883, 2830, -501, -955, 2017, 2784, 466, -1288, -53, 2312, 2260, 258, -956, -287, 1812, 2265, -86, -1267, 533, 2662, 1294, -1675, -849, 2358, 2418, -1165, -2210, 492, 3304, 832, -2490, -1240]
1688a240L050j71k543j168K192J388j468j863Q21J695J45j444j574P91K468p9
1704A000k808j005K300K145j413l136P42L241L33l266j352K847J917j841k841
1719c137J192K880j59k322j088J673J869j050j993L66J720J217j685k009P20K857
1735A051ok372j528K175K236j328k873R22K656N99k573j376K259K365j506k746
1751b045M12L055M70k222j681J847K394p72k553o26K359J700j692k157P20K688
1767A897L43k389j392K036K355j324k758K32L104Q30k683j943K007K688j114k870
1783i81j14K910Q51j908k013J493K387o63k233r06K347J637j961k053N24K503
1799A820M65k437j535J986K675j190l190j62L013J215k844j711J429K779r50k876
$$ y = [-1240, 1810, 1639, -904, -2072, 120, 1508, 40, -1823, -1002, 693, 838, -606, -2180, -1389, 1079, 1000, -1808, -2813, -513, 1632, 219, -2917, -2175, 1066, 1399, -1867, -3219, -372, 1545, -296, -3137, -1945, 935, 776, -1546, -2634, -961, 908, -142, -2135, -1769, -49, 1168, -517, -2526, -1806, 1051, 1045, -1327, -2855, -680, 1556, 228, -2645, -1723, 933, 1532, -1041, -2417, -158, 2207, 701, -2045, -1633, 1422, 1892, -330, -2011, -164, 2230, 1458, -1095, -1721, 638, 2338, 646, -1511, -791, 1897, 2240, -149, -1541, 495, 2850, 1526, -1232, -1000, 2104, 2934, 251, -1692, 315, 3003, 1889, -981, -1095, 1815, 2666, 758, -1255, 238, 2625, 1962, -271, -1177, 1170, 2807, 846, -1207, -683, 1820, 2285, -152, -1687, 299, 2974, 1784, -1406, -1568, 1445, 2660, -184, -1895, -466, 2313, 1363, -1513]
1815a513l58K389J490k106j634P56K629j56k804p05J783K027j468k661J78L101
1831I48N59k460j474J001K723o46k948n70L099J516k425k577J943K419J10l169
1847a951j249K918J894k043k611J143K875J46k995r16K108J645m39k920K92K503
1863D00J417k739k073J731K514m38k663l80K457J693k012k108P65L025q4k495
1879i90j150K486J807j369k478R6K993J144k739j774J848K303l82k927OK757R44
1896B575k115k378J705K726n89k542q36K718J541j721k433R45K606N98k744j350
1912a294J908K424j207k534l35K777J269k165k450J615K453l51k929m85K400J949
1928C045k127k800J273K942J40l187j515K872K450j915k767L96K503Q09k423j428
$$ y = [-1513, -1871, 518, 2008, -98, -1732, -976, 1653, 1497, -1307, -2012, -229, 1798, 330, -2331, -2153, 948, 1507, -953, -2427, -1426, 1297, 651, -2297, -2867, 232, 1748, -677, -3254, -1311, 1108, 1218, -1951, -3200, -282, 1612, -431, -3042, -1899, 976, 1122, -1873, -2789, -681, 964, 525, -2395, -2103, 400, 1817, -922, -2995, -1264, 1250, 812, -1851, -2231, 226, 1919, -93, -2201, -1436, 1589, 1505, -990, -2140, 346, 2153, 784, -1694, -1598, 1395, 2539, -200, -1974, -126, 2177, 1795, -1132, -1126, 1631, 2575, 460, -1918, -213, 2513, 1924, -618, -1454, 1264, 2805, 1084, -1349, -404, 2202, 2800, 56, -1294, 614, 3038, 1831, -703, -1038, 1739, 3008, 843, -1607, 8, 2461, 2110, -819, -1304, 1096, 3045, 918, -1882, -609, 2333, 2473, -714, -2229, 643, 3093, 1178, -1589, -1193, 1310, 2119, -304, -1732]
1944a732J520J861m42k667n51K442J617j479k758N04L160L74l340j450K568K424
1960B051j979k681R64K830Q7k811j056J723K027p64k451j48K107J442k040j867
1976b566J029K154K19k693q85K188K243j387l226N86L631L73l143j614K458K441
1992A808j656l187J125K864J70k893n80K162J935j228k171O3J464J348o40j776
2008a192n5J813J093j798j874J692K899j284l887N46M049O45l142j951K416K760
2024B730j679k636P90K569J64j913r08J451J369o79j535o00J480J762m55k578
2040f68o55K751J660k136k792J925K792j092l670M48L997R17l596k368K453K957
2056B923j309k684M45J880K87j619p19J022J187n43j215r70J108K103n60k368
$$ y = [-1732, -212, 1649, 1207, -1460, -2011, 431, 2048, 569, -2189, -1685, 1475, 1849, -1491, -2941, -373, 2051, 72, -2609, -1645, 1185, 1272, -1539, -2595, -872, 1155, 391, -2060, -2208, -101, 1341, -699, -2566, -1537, 617, 836, -1857, -2742, -554, 1689, 302, -2924, -2338, 1293, 1666, -1477, -3091, -633, 1808, 152, -3035, -1910, 954, 1124, -1769, -2349, -187, 1748, 520, -1651, -1588, -124, 1224, 584, -1192, -1247, 566, 1659, -139, -2013, -321, 2578, 1294, -2593, -2047, 2002, 2647, -495, -2446, -30, 2730, 1051, -1585, -795, 1774, 1938, 25, -883, 568, 1937, 1258, -277, -877, 603, 2365, 1910, -668, -1323, 1428, 3088, 952, -1840, 85, 2877, 1785, -1885, -1437, 2560, 3477, -119, -2487, -34, 2923, 1614, -1070, -625, 1255, 1542, -77, -796, 226, 1413, 870, -345, -1315, -207, 1896, 1336, -1032]
2072a032j266K486K886k334l300J120L207l45l518k4L518J044l745k309L519K803
2088B710j778l085J87K203L54j024n72L79M16Q4o76j269R94J920L56l009j423
2105c233K771K831k103l787J393L625Ql656k88L191P06l253j178K615K201j325
2121E18k510l41K307P69l47j296m53N84J234m20j118J65K098N52l227j575L022
2138c8L375k606l627J152L576K71l258m99L011O94k478j082K004J859j365k242
2154a253K4K249P79m00j162j346Q20K074M1j917p16K090R35k665j144L215K253
2171C877k673l891J181M542R1l630q99K477J280k261j003J243J584r47j300O9
2187b60Q88P78k60j260j417R89K689Ql029q78K405J464k194j861K656K048k469
$$ y = [-1032, -2298, 188, 3074, 740, -2560, -1440, 1767, 1422, -2096, -2120, 1398, 2442, -1303, -3612, -93, 2710, 932, -2153, -1966, 237, 591, -433, -1005, -626, -210, -126, -802, -2071, -1077, 843, 1199, -1810, -3233, -462, 2369, 266, -3521, -2128, 1497, 1505, -2151, -2439, 752, 1458, -1795, -2973, -358, 1843, 518, -1992, -2333, -26, 743, 396, -900, -1353, -769, 465, 45, -1073, -908, 1190, 1742, -1485, -3060, -38, 3337, 731, -2896, -1744, 1832, 2103, -1155, -1654, 1357, 2051, -427, -1509, 495, 2354, 989, -1253, -1229, 1020, 1799, 1399, 237, -1109, -289, 1785, 1826, -91, -807, 1283, 2218, -447, -1591, 1624, 3877, 1204, -2687, -1506, 3036, 3127, -503, -1402, 1075, 2355, 94, -909, 334, 1918, 971, -329, -260, 628, 1406, 1146, -114, -1531, -542, 2147, 2155, -874, -1752, 653, 2117, -77, -1938, 718, 2766, 297]
2204B97l042J348L795j97l373j316K350J192q93j137N36O04l68r71j05J062Q13
2221E95m0j683j120J506K519p03l153l28K468J703k424j965J947J744j982j977
2237b893J522L009l66l204o88K130J619p28j629m43R62O63k28o57N0J064J36j456
2255a137j136J472K656o90l330k64L181J114k188j820J749K476j966k150J319
2270g14K174l89k239n99K106J606q39j598m18P18J222L25j476n44J150J032j078
2287D39j660J383K552j084l124m57L697J365k274k537J853K016o92k103O36J760
2303A770n8j763o76J345J029k03j522p22J038J448j90j571j275J679J495r88j562
2320g26P95J707m95k584M5K623R20k249j953J461J949k58j913l65J581M53r52
$$ y = [297, -2745, -1397, 2398, 2201, -1172, -2488, -138, 1054, 161, -976, -440, 164, -204, -1175, -1280, -218, 595, 555, -1128, -2248, -742, 1777, 1074, -2079, -2407, 61, 1764, -660, -2625, -678, 1066, -916, -2893, -1371, 1638, 1272, -1932, -2620, -490, 1129, 401, -1228, -1671, -709, -46, -274, -931, -881, 183, 319, -1137, -2273, -801, 1855, 1165, -2165, -2429, 752, 1866, -322, -2142, -393, 2083, 117, -2033, -714, 1460, 1071, -1168, -1767, 339, 1945, 1106, -492, -910, -192, 1030, 1355, -121, -665, 485, 1517, 439, -1221, 162, 2714, 1630, -1494, -1951, 1746, 3111, 837, -1700, 153, 2169, 1477, -626, 10, 1770, 1712, -51, -727, 618, 1647, 1444, -78, -800, 238, 1686, 1496, -75, -1350, 329, 1824, 836, -726, 69, 1776, 1281, -1303, -1258, 1365, 2285, 36, -1917, -456, 1493, 1235, -678, -1043, 538, 991, 39]
2337C9r25L73Q91J59j385o05Q34J690m1k171n70J634J359j533j829R49K120l37
2355F52k514L37J957Q04k480j327J395K128o39j860m83J548Q33q26q56L00Q40
2372a91L34j179p37J060J624n34j854n17J768J508j386j811P42K184q9k295l86
2389a759K204P89j312j594J344J339k57j607k01J141Q60n78j200K79J382L74j258
2406e4j123Q89J772j66k019o01K004J358j466j587O59K394n37j576p42J585J047
2423A837j201j333N23J447M13j713o08R77J305k64j318k11Q24J027j199j197Q01
2440A10J181l2j314j076J573J472r29j812K52K068k3j821r51J592J069p89j573
2457a003N54J408k1j128r12J012J040l99j443l18J384P89p26j608N77J441K36
$$ y = [39, -886, -513, 378, 537, -848, -1453, -619, 1071, 1030, -1141, -1711, -77, 1282, -251, -2080, -1131, 989, 652, -1862, -1525, 432, 1236, -1244, -2571, -1176, 952, 313, -1547, -2030, -482, 351, -475, -1331, -1031, -191, 143, -1036, -1773, -713, 911, 377, -1477, -1994, -226, 1282, -104, -1915, -1173, 1011, 922, -1373, -1759, 445, 1234, -78, -1672, -328, 1011, 754, -853, -1054, 87, 947, 369, -831, -552, 830, 1204, -54, -1177, -288, 1484, 1318, -701, -1302, 702, 2060, 594, -993, -334, 2060, 1523, -53, -795, 790, 1837, 636, -697, -174, 1273, 1686, -27, -635, 342, 1647, 1383, 65, -146, 678, 1705, 506, -691, 110, 1291, 1259, -55, -1131, 442, 1914, 985, -827, -575, 1493, 1470, -351, -1302, 290, 1359, 570, -1003, -449, 959, 938, -190, -1102, -90, 950, 551, -892, -1210, 174, 963, 237, -1371, -794, 647, 883]
2474H83j647r97J630J088q38j545K65J543K80j353r08R95J235o53j627O7J700
2491A18P35j756r62O40J490P8j767l18J271J265j255j104L76J307K70j208r60
2508a780J033J535p33j526Q6J367O48j495p79J049J518k63j853l7J433P24r64
2525c7q86N13J116J12j204p04J473P38o45j195K04J452M70j175j295J097J706
2542A740o14j664m3J695K22j177p08M39J248n9j326j73J022J156r45j258L12J587
2560A454j17j335q27J327R38l38j382k3J460K19q84j054Q31J449l39j786j90J186
2578E89J042j176r65L60J583l40j181p15Q44Q51n42j132P5J081M65r64p42O07
2596b60R25l39j064m24J488N34j306j073R57J108n88q69k06P39Q70o83r44L73
$$ y = [883, -764, -1761, -131, 957, 119, -1426, -1161, 382, 662, -691, -1599, -604, 631, -22, -1649, -1582, 118, 853, -903, -1865, -1225, 265, 343, -1424, -1742, -471, 794, -461, -1565, -1189, 118, 388, -820, -1780, -747, 788, 55, -1471, -1385, -18, 630, -865, -1644, -595, 923, 660, -1193, -1230, 203, 927, -37, -923, -410, 706, 818, -386, -1090, 383, 1121, 476, -719, -515, 937, 1407, 232, -1063, 34, 1740, 1126, -538, -581, 1114, 1336, 159, -549, -110, 1138, 1079, -247, -420, 602, 1758, 813, -445, -133, 1454, 1337, 2, -825, 502, 1440, 1102, -280, -303, 1157, 1376, 492, -562, 269, 1718, 1379, -407, -597, 589, 1631, 455, -510, -150, 1433, 1093, -88, -803, 41, 892, 350, -782, -707, 374, 839, -125, -867, -260, 665, 326, -738, -1162, 326, 860, -446, -1519, -562, 546, -42, -911, -1117, -378, 492, -191, -1135, -762]
2614g62R07k0q97o67R67R02p40o44m70J232N08q45j221Q29J482j64j498o38J681
2633e8O21r12j354J121J124n48j191j43J558K55n85q33K04J262o9r88k28O10N57
2652D03m88n01l75Q63J083j058j090P78J363j60j473j74J485P21r28j264P31J408
2670A324l43j245j89J032P62q41q56J44J029K57n27o48K84Q39J67j236l9Q07O33
2689A354r12j073P75J286O7j789l2J197Q98j420j077J174M84N3r09r9Q22l7m15
2708C47q04M27O34L57n18j133K94J145M91j208l67O38P32p72j286O87J311l89
2726E86j479m27J687M77r67j048N33R21k66o48l31O34M33l59m92J54M42O96j142
2745e96j030O32J179K74j272j104J431P72r00r96J092J108o20j385r7J558L30
$$ y = [-762, 145, 125, -772, -1439, -472, 430, -310, -954, -1424, -192, 316, -529, -1750, -921, 561, 397, -1101, -1739, -58, 563, -349, -1703, -582, 542, -6, -1197, -1340, 218, 473, -112, -945, -741, 521, 452, -536, -764, -154, 403, -85, -586, -961, -98, 985, -73, -1163, -385, 978, 818, -655, -829, 656, 1377, 449, -815, -84, 1324, 981, -264, -453, 579, 1341, 500, -356, -212, 817, 1074, 547, -101, 183, 1022, 1189, -47, -86, 721, 1354, 442, -631, 144, 1430, 1497, -292, -324, 873, 1771, 351, -726, 448, 932, 985, 76, -23, 799, 762, 347, -457, -30, 604, 961, 443, -690, -396, 749, 1240, 32, -335, 303, 1035, 263, -1023, -336, 975, 586, -893, -1320, 367, 844, -123, -1171, -638, 283, 17, -631, -962, -328, 105, -254, -746, -592, -150, 546, -596, -1626, -994, 185, 459, -813, -1917, -486, 286, -614, -1610, -518, 590, -30, -1415, -1512, 46, 376]
2762C76m57j310M17Q38M57m40p90L55O23j14o16j97O76Q97j026j186O69J733J13
2781A018j780q76J510J173l38j668P86R72j46j552L10J457J87j165r35P48P46
2798D47L58k68q26K51M10R66o26o75L37J009q40j396M98J794J77j974o04J930
2816I68J115j186j326N02J075p9j284N92Q02K8j123l74O66Q03J84j001o20j89
2834d47Q52R91r03j112N69J031l32j613P77J674k0k405p52K456R21j459j331M57
2852f46J411k27j052L86M68l67n08k52N07O55k97o22o60m0J488Q45j015j867M64
2871a329K051j69j926K64J721k03k007k21K093J264j743j702R11J206j00p47k27
2888h64M05J92n14J62L2L89K53m89m91q3J249R64j260j967Q82K312j44k133K1
$$ y = [376, -81, -1391, -974, -136, 321, -119, -909, -554, 69, -45, -661, -858, -182, 715, -311, -1497, -828, 905, 1018, -762, -1638, -128, 1045, 707, -961, -175, 797, 651, -901, -591, 866, 1053, -112, -1047, -299, 447, 805, 537, -289, -38, 372, 1338, 712, 37, 374, 1383, 543, -853, -355, 1439, 1616, -358, -962, 968, 2083, 897, -429, 73, 1148, 1069, -215, 377, 1179, 1207, 84, -290, 376, 1179, 1363, 362, -258, -447, 405, 1396, 493, -619, -50, 981, 649, -964, -187, 1487, 1467, -938, -1690, 766, 1687, 228, -1103, -646, 765, 538, -514, -128, 340, -27, -535, -787, -280, 375, 78, -544, -1204, -1244, 244, 1089, 74, -1793, -1329, 722, 553, -1373, -1109, 612, 409, -1598, -1819, 274, 1538, -205, -1907, -996, 210, 110, -637, -864, -459, -267, -781, -619, -587, -198, 55, -434, -925, -1008, 241, 1205, -55, -2022, -1140, 1172, 1028, -1105, -1084]
2907a084J688j28j339m24K228O43j875j341J097J612m32o12j23J48j66K92M48
2924F32m98n22N53M69p25k11J479M58j441j817J341K762p87k543J6K033L85j530
2942E4k79J479O02j768j063R57J751k90j334Mj84N52L53k2n77n05P12O19r15r02
2962g56J361J053j349j715J278K102p87k074k04K104L52j332j039J637K34j209
2978c44n02P59R06m61p72m29M43L46O71k64j170l21J183P09j026j180J419J190
2996A157j630j282R71K189p09k557jK262O07j969l54J035M47m83p20N62P60n76
3014b91k98l52j79R87R30o76j672J76J736N84j374j225J607R90j070j410J001
3031e36J430n32j794k31K239M98r52j730J086J592q19p34J59K27M34K25p11k08
$$ y = [-1084, 604, 476, -863, -1287, 941, 1584, -291, -1632, -535, 1077, 645, 33, -90, 58, -108, 184, 632, 134, -388, 165, 634, -91, -302, 1177, 1635, 194, -1623, -282, 2480, 1693, -850, -834, 1199, 1584, 54, -225, 1254, 1856, 88, -975, -18, 1733, 1443, 109, 113, -71, 481, 834, 812, 235, -270, 442, 1061, 146, -756, 605, 1658, 309, -1406, -128, 1974, 1187, -887, -1091, 1013, 1365, 33, -1006, 631, 865, -344, -846, -87, 819, 358, -414, -843, -400, -54, 617, 353, -817, -1138, 45, 754, -272, -1452, -33, 1157, -473, -1755, -784, 1405, 696, -1861, -1862, 400, 1007, -962, -1316, -281, 166, -317, -1037, -475, 285, -291, -589, -941, -1120, -133, 797, 121, -1551, -1375, 361, 945, -429, -1654, -47, 943, -127, -1537, -536, 894, 362, -1432, -1663, 576, 1074, 122, -1608, -522, 1070, 251, -483, -324, -97, 337, 562, -149, -357]
3049c57M59Q79p00j288K61J663Q85j989p49O88K080j260j269P91J296j69j780
3066e59M2J239R16j136j209P55J042j7q19k78p6R06L77q19m54M48R88l77j497
3085e28M8J758K20j666j070J739J229r20j415K08J612m95r33n84J345N96q70o32
3103c58j62J168K16o55r37P9J197K93j010n92K83J255n03j337J15J428K09j380
3121f91p53R17J393p40j316N8J528K90j215p63R78N24k87j011oP45Q35q83n81
3140i78M1P97O78j226p58R81R31m04j135k75J498N01j193j015J176J162n72j500
3158a291J53J541L22j055p49P36J131o84p25l71J174N85n40p88p3J067L56o90
3176I9j510J219J327m36j257L9J052M30n85j281N64J640n62j161j71J155N94n92
$$ y = [-357, 102, 981, 281, -1007, -746, 917, 1802, -187, -936, -248, 1832, 572, -697, 94, 1390, 1221, -559, -517, 722, 1638, 502, -707, 48, 1090, 1073, 254, -24, -100, 806, 1183, 364, -90, 358, 1346, 969, -528, -480, 1278, 1498, -168, -1238, 501, 1730, 810, -605, -397, 1215, 720, -213, -797, 548, 1144, 274, -358, -520, 648, 864, 209, -728, -649, 548, 841, -169, -761, -478, 777, 274, -1063, -948, 480, 689, -691, -1444, -527, 866, 126, -1190, -1132, 396, 686, -529, -1292, -314, 210, -77, -1088, -1094, -349, 486, -397, -978, -937, -140, 538, -688, -1446, -465, 466, 62, -1073, -1348, 150, 651, -542, -1557, -381, 781, 209, -1291, -1138, 403, 725, -330, -1079, -343, 788, 104, -621, -992, 182, 767, 227, -561, -634, 433, 789, 99, -1411, -192, 1135, 699, -558, -519, 533, 963, 378, -903, -339, 1301, 739, -422, -593, 562, 1156, 564]
3194E64r33J86Q08O48j209l45Q01L71J04j229k89J525L65r21r66O52J221l98j340
3213c85o9J024O69p48r32K69J117J10j325k69P15Q83o73j021M4J191K95p58n06
3232c69J79R01p4j019j92Q72M65n46j177K65J531k49r18o68J004O23m16j002j78
3251i68J304K7q82n49R56M52l95o86k14M44O18p27n39M61J033n60p22J6O42Q54
3271E65m33j638N63R98J48q79l32L83J160n12q13j3R62K14q55o11K57J261k54
3290A71j019o6J303K01n16r57N75J084n08m53m26P39O30p28o18K78O91J0m49n23
3310e81N87R63n30j150K33J057N11r48m18K74O67J78n88o08P35Q54p21n74J38
3329G9R70k38o45m58O69R41q79j014L94J035K06o50p75M78J015n40n48j81N94
$$ y = [564, -369, -183, 625, 1273, 64, -281, 520, 891, 995, -234, -523, 1002, 1367, 446, -520, 132, 1353, 955, -385, -454, 570, 1239, 491, -441, -172, 945, 1055, -270, -539, 176, 1059, 386, -635, -591, 600, 895, 137, -369, -190, 711, 637, -382, -574, 298, 763, 217, -960, -695, 836, 587, -331, -999, 5, 628, 212, -790, -968, 336, 363, -519, -1068, -112, 340, -55, -741, -955, -511, 107, -620, -1159, -698, 335, -225, -947, -931, -289, 565, 132, -1506, -943, 55, 203, -676, -1008, -625, 535, 23, -790, -803, 159, 373, -482, -1093, -836, 425, 171, -848, -914, 389, 590, 74, -883, -308, 776, 268, -185, -611, 128, 758, 30, -588, -310, 381, 391, -58, -581, 6, 969, 439, -711, -478, 579, 1090, 142, -276, -2, 665, 843, 255, -353, 382, 1236, 515, -59, 79, 1049, 811, 166, -292, 377, 1318, 439, -575, -181, 854, 1060, 410, -365, 113, 1128, 588, 40, -141, 453]
3348D53N64n80p11N9P58J52o26n41R02N93n74p53n8Q53J97n56p94N79M98j16j080
3369g81L09P24M32p96p20N18N65k7o89j0J3O35l56l53j30N14L59o72q03P09Q11
3390B52j36o67n86J132N65j362j67N76N97k41p86PQ49L3o61j78L62L94O8m31m17
3411g97K57N38n8m95R0N88K50n47q19M01J381r1j327l35J061M34p62n62O52Q66
3431G25m20o85J48O38J78n98m40N21L65jo7n16o5P42L04m72n49K42Q79o60m52
3452a83J55J173j48j344l62J443L72m10r67N00P11n80k86NJ044k73p37JK57J63
3472E34K94o57k53l1M23N37o96m74K94R05m52p45J9J081j57j532L76J172M33j080
3492ir14M22Q44l29j75Q8M02m87n08M20L84K4j00j41k14m12O16Q64j072r26N90
$$ y = [453, 1017, 437, -274, -215, 543, 695, 69, -472, 430, 1023, 449, -304, -362, 491, 688, 132, -662, -83, 415, 299, -781, -472, 252, 684, -112, -832, -314, 251, 224, -465, -475, -462, 173, -183, -536, -666, -152, 207, -465, -1268, -559, 252, 116, -551, -1137, -5, 560, -802, -969, -393, 204, -37, -823, -816, 33, 66, -595, -773, -411, -17, 51, -380, -797, -540, -2, -60, -555, -465, 123, 373, -174, -993, -592, 789, 698, -629, -964, 97, 531, -231, -793, -141, 725, 305, -380, -232, 406, 584, -14, -454, 67, 432, 431, 364, -152, -217, 525, 829, 357, -192, 50, 929, 269, -183, -28, 1145, 997, -347, -709, 734, 1106, 696, -271, 229, 940, 360, 74, 79, 1123, 850, 113, 114, 371, 534, 828, 171, -82, -113, 310, 847, 151, -323, -29, 876, 424, -321, -302, 779, 622, -910, -534, 638, 1071, -9, -923, -501, 343, 14, -161, -73, 329, -158, -666, -246, 138, 162, 62, -79, -293, -705, -89, 775, -297, -1223, -633]
3513f33J160l63j342M46R20k05j011j24J422N13j638n62J187N68k72o11K55k4
3531c14l7n12Q58J7n45nM23o81M8O22O97n55j318P26J018j1j187m9Q58M58j203
3552f92J08J092K19j353q6Q55N19n61o21J44P12n13K33L56n8m96r9Q54l75j84
3572E4O04M31j008p55M46J589l84j294j03J287k28n39k18J149k90j153Q7Q78N89
3591A142p96j32j06J39j76L73L76m89n04L11J020p12n48M43O53j233m58R82J282
3610A567p17j501O7J112ln51j13P31nj103m3Q17P56j313k49L06K23M8J69Lq78
3631f77O8P05R4l48m95L49M48n55m41J063N17p53j692Q69J149J58q41k16N13j0
3651i5m29k98J096n9p94M9J22J31P5K23j78o02m07J168M44o84q37N64O35n70m05
$$ y = [-633, 527, 164, -1178, -732, 188, -17, -1028, -1152, 270, 783, -855, -1417, -230, 338, 66, -545, -290, -314, -351, -863, -5, 12, -533, -538, -115, -796, -748, -126, 571, 16, -1302, -576, 442, 431, -756, -805, 53, 511, -692, -584, 508, 727, -626, -712, 143, 662, 101, -520, -376, 336, -177, 56, 412, 354, -142, -241, 613, 238, 54, 658, 1089, 81, -674, -228, 1361, 977, -317, -420, 867, 639, 100, -118, 1031, 741, -412, -325, 553, 1142, 346, 214, 108, 247, 71, 444, 820, 331, -173, 138, 1158, 446, -102, 341, 994, -239, -697, 285, 1567, 850, -651, -584, 528, 525, -26, -139, 592, 587, -516, -559, 258, 1014, -299, -548, -242, -19, 29, 198, 201, -677, -609, 96, 190, -158, -653, -304, 144, -411, -852, 211, 728, -25, -1717, -848, 301, 459, -382, -598, -85, -95, -524, -822, 274, 215, -579, -530, -408, -277, -202, 21, -157, -759, -1166, 2, 446, -238, -1075, -511, 124, -446, -851]
3672h51R90M69q03q38M75J217l58j040l01J232j66n8K02l2k03m59M82M5j05L24
3692B22k32m8n19K94P65J50p97q29J072R62r05l21L62P97r51n12Q53L48M7r41
3712a83K19M59J41o9q3n84K75P3J06k09J16N3L46k42m23O6Q72j09j084k28R42
3733D54M68p84n41O85M56m12n23M33L57l61l64m7M20O7P3m61L60n01N69J3k64
3754I7l81J28N77k97o80N92N58m02q27j09R75K31o58m88K04P28l80l54M12N8j0
3775b6p56J37L40M04k81n4o04J30N73K89n86n53N24P24m69l57P4M25K11r71N8
3796g68Q12J23o78m84Q02L59o1p29K24O19l09n5j31O5M09k56l29J07L57J49k12
3817A4j38k24K87K89j64m63K67P86m12o39J42Q33L31p63l84N36K27j96k52l10
$$ y = [-851, 139, 608, -195, -1033, -558, 659, 301, -739, -1040, 192, 26, -32, 170, 138, -65, -524, -42, 3, -102, 222, -10, -58, -577, -283, 482, 632, -165, -994, 78, 1040, 135, -186, 176, 973, 22, -490, 363, 711, 758, -183, 36, 495, 636, 567, 484, -100, 175, 248, 354, 145, 261, 314, 660, 418, -5, 61, 933, 824, -260, -488, 454, 922, 138, -403, 282, 738, 326, -197, 236, 593, 232, -132, -179, 241, 308, 381, -80, 280, -221, 348, 361, 97, -284, -156, 421, 124, -556, 36, 594, 192, -635, -744, 231, 462, -196, -684, -480, 248, -132, -486, -74, -16, -26, -782, -645, -305, 99, -182, -236, -840, -710, -137, 152, -434, -987, -463, 261, -208, -565, -491, -66, 145, -826, -768, 44, 167, -511, -995, -193, 166, 105, -624, -400, 219, -90, -145, -276, -211, 198, -58, -387, -280, 77, 226, 14, -124, -348, -61, 228, 64, -399, -132, 654, 242, -397, -255, 578, 909, 146, -238, 298, 525, 329, 77, -233]
3837b33O37N7j69m12K82R7L65j26k22l5M47M7n72m0L10K86m29k83K25P28m48n42
3859c0j10P35J4k74l42K09N48l68l68l50O68J56K1l57k02J44L79m54j91J21M88
3880D37j66n60k3P28K72p38k13l10P67J09m34l22N86K57n73k89j53R01j06n54
3900c84n98N51M94m40p3K57J59j08j67J9L6L4o8j97m4J51M12m78l26K61L91L05
3922A87o35j40M49J48j83j54r0M51P4n62j02L40L53j36j86k81L01M40m15m07J54
3943c94N38K42p74J6L21K82k17l59M24l7L68m27m18O91M65l46o48Q4P84k27l41
3964B7k91L11O91k11n77r7M41L59l03k72N0K24L33n87O2J29M93n21j58J2K49N17
3986H81n70n60M95K08K07m96j54L02K00Kn38K9N57k73l28l7M04K52l60n26k8O76
$$ y = [-233, 404, 461, 292, -120, 162, 259, 624, 498, 276, 241, 688, 735, 163, 123, 433, 719, 290, 7, 232, 960, 512, -30, -140, 595, 609, 335, -7, 202, 750, 382, 14, -336, 332, 488, 509, 152, -50, 94, 473, 19, -172, -51, 437, 271, -289, -312, 416, 688, -50, -263, -573, 194, 303, -131, -453, 133, 390, -183, -472, -625, 276, 170, -384, -982, -431, 63, -377, -450, -193, -34, -142, -309, -290, -254, -220, -288, -485, -529, -378, 34, -444, -770, -509, -118, 187, -448, -588, -139, 9, -174, -328, -418, 33, 107, -455, -557, -217, 136, 0, -186, -467, -166, 274, -141, -548, -394, 144, 386, -388, -372, -51, 231, 14, -345, 79, 42, 410, -17, -435, 256, 721, 375, -273, -189, 595, 368, 27, -264, 47, 738, 527, -50, -147, 294, 653, 350, 78, 128, 352, 685, 98, 160, 289, 782, 261, 103, 115, 364, 881, 311, -249, 246, 454, 661, 165, 11, 313, 513, 515, -23, 6, 563, 290, -38, -75, 329, 581, 221, -305, -333, 343]
4008C43J2n74l55O82K5k5n98K34O08K81p76m49L15K78n2l77q0M69K76m59j34j68
4030e24N07J83l20m70K75M03L4o40j57O55J11l53n94O92J82k48l84J33O72l96
4050b39j71k1j81L80L11n14k98N55K08N8l89J25L35P5n64l55M68N50l11p65L96
4071c47M90J39l55n69P74L47l35n84J04O32O0k69k47K86R9J09l67J04L14l45L88
4092D28n21j04O14L21m25n61M44N05o4q09k29M97O74n50k78N51R4j04k01l76P20
4113F26Nn20k35J48K56K74k14l63L6K06P4K8m11N00J01l93n18J36R81k80l90o58
4135f11P74M29m09q66O83O16n96l08K28Q6K7k06k8Q3k10N43r1o24L05L7k2j82
4157c42k08N07M09n25o83M05O39L30j143k60N62N16k41o35j0Q44m16k59q6M46
$$ y = [343, 355, -219, -574, 108, 133, 108, -490, -256, 352, 633, -143, -592, -277, 1, -51, -428, -508, -39, 237, -222, -356, -524, -17, 166, -154, -624, -349, 54, 88, -552, -709, -54, 57, -296, -890, -198, -16, -264, -648, -515, 157, -239, -410, -431, -612, -232, 79, -435, -733, -178, 30, 88, -301, -176, 159, 234, -330, -685, -217, 333, 22, -743, -347, 143, 282, -73, -642, 132, 479, 144, -440, -336, 296, 356, 87, -160, 126, 225, 334, -33, 71, 385, 40, 428, -93, -197, 417, 738, 313, -248, 196, 701, 637, -172, -401, 96, 770, 220, -58, 493, 587, 483, 282, -94, 626, 631, 111, -124, 24, 280, 554, 340, -23, 13, 219, 293, 321, -90, 410, 511, 118, -400, -264, 717, 437, 47, -611, 163, 592, 183, -683, 0, 616, 20, -288, -60, 26, 53, -153, -181, -98, -308, 235, 144, -480, -175, -138, -160, -342, -550, -43, 366, -159, -842, -437, 202, 532, -611, -871, -309, 207, -34, -669, -679, 165, -251, -510, -596, -150]
4177a50Q8k40m08K99J55K03p9q51L57M75O25p25o36O22M86m57k68P10J41k96n80
4198e29k87R87M32p23j62M0J09K51m12L83l33P62n43qk35Q0R39m43p44k7R60M15
4220I12j028j10J02Q88k44o76L00M00k86n74J29O31N11m31m42J71j78K01L47p7
4240E46m13K11J49k44k46j2Q53j19r01J0R06K39r26o36O02O64m45l82K66Nj87
4261f0K4j08M11J49l75j20l00L29M46J58p47m01K55N06K97p20j46P26j03r50K05
4282e24Q97J25q63o96Q80L97j37o36J44PJ78r1k88R13m43o01K80J03K52n4J88
4303C1n15k68K51P99r6p84j84O62L41n53k88O49J52m35q86Q36Q61p07m16K60L96
4324A06j34j05K56m8m13j7M48K25l70J03L36q31p3j25R21K46j164M83Q38o1p17
$$ y = [-150, -62, -302, -710, -411, -256, -53, -132, -983, -626, -151, 474, -251, -887, -265, 221, -236, -504, 206, 347, 51, -529, -816, 171, 603, -120, -282, -242, -133, 118, -294, 89, -244, 518, -25, -33, -268, -188, 751, 308, -436, -463, 497, 912, -116, -226, -124, 764, 520, -156, 144, 544, 258, -316, -187, 444, 955, 524, 82, 253, 75, 276, 623, 546, 133, 344, 493, 249, 3, -9, 844, 725, -176, -166, 740, 979, 53, -583, 19, 683, 238, -144, 122, 127, -60, -36, -144, 267, 416, 41, -79, -379, -50, 396, 554, -193, -594, -339, 167, 464, -256, -402, 324, 221, -729, -524, 373, 498, -365, -1061, -181, 216, 79, -557, -413, -406, -228, -319, -607, 306, -137, -738, -458, -355, -103, -157, 31, -484, -752, -501, 298, 202, -582, -766, -104, 237, -316, -604, 45, 197, -238, -1124, -288, 573, -134, -550, -290, 106, -28, -133, 123, 75, -338, -355, 93, 318, -52, 51, 387, -444, -517, -642, 279, 525, -639, -156, 682, 621, -96]
4345i6K83M47l7q65K02L70N18k66r16L68K28M85l72l7m14k22L36M19j96k56L06
4366B85K57n19j88L83N88j80q04k86R10N87j183M6N53K16o46q1O22J43n30k87
4386a14k3M83m1j38j80j86K4K02N53l72n50M13N24q19l76M78N68k88j042L39Q95
4407C50N71j270p8L77L71n15L4L89j53n45j18J82J74p8P0Q1l24J2N26K44l39q72
4429i11J89Q70n61L8M1N80k66j079M83O38qn4l24L19r9l2J02k64J17l8qL45l99
4452c21K31L25j35k30m69N18N70o52l82L89Q11n44m82J48M93j40k10qK81M89p91
4473a09j58L56J67O4k18Q0j36J58K93J28n47K23j27K94l96k67O70L3l40m63P47
4494D52L2k19m69L43L38j57j28k62M42K70q32K99J06R0q0l5K45l25j26L35K2m04
$$ y = [-96, 187, 634, 597, -268, -66, 304, 822, 556, -360, 8, 236, 721, 349, 312, -102, -324, 12, 431, 235, -21, 285, 542, 23, -165, 218, 806, 626, -178, -464, 446, 1033, -150, -104, 449, 665, 19, -62, 560, 703, 173, -114, -137, 346, 305, 167, -13, -199, -175, 27, 580, 208, -342, 71, 595, -224, -600, -122, 446, 158, -884, -545, 350, 921, -349, -427, -50, 321, -194, -160, 229, 76, -469, -587, -405, -231, -309, -239, -158, -482, -470, 56, 300, -39, -911, -722, 148, -413, -375, -334, 246, -20, -1099, -616, 22, 14, -40, -364, -45, -144, -176, -74, -338, -221, -259, -267, 78, -321, -90, 235, 100, -130, -599, -81, 489, -163, -545, -156, 655, 111, -371, -223, 270, 130, -80, -88, 193, 682, -109, -267, 89, 256, 320, 102, 182, 46, 204, 497, 625, 78, 301, 174, 468, 72, -195, 475, 508, 168, -295, 452, 484, 265, -204, 139, 477, 320, 192, -70, 372, 642, -190, 109, 215, 305, 225, 190, 435, 110, -16, 319, 341, -63]
4516f3j93J91K42l13Q6L03K6l95M0J70K83k67l58K73M21l95k83O6J76j59q1M7
4538a83N8L17k76k73K86j16j79M86j74m47M00O6j81j94p5Q7J41M6k49M63j85j0
4560a92l44R5L20j73j04q4P7M53k69qJ30K8j99K5j27k8L37k77L4K1K99j32J14
4583dl84N1O66q4k73k75O8M07l4l1j26j31N64m61k8K01j72l9L04K34m48J81N7
4606B43j67L0K82k00J93m59J47M04k07m3l54L97l4j16K08P6k12J85l33M0K17N9
4628C56j10J23n52O03m1l16K52p6J06p1p4k27J3L12o3r1j18L78k64q4k26N19n08
4651a59L31j41K32j91J78k72M09o72L97P8m41o0o6K39P5l7r6MJ72j00k27K17l57
4674d87N30l29J80j08n8nm03O51K87l53j99J98l80K51k41P1L14p2l07L70Q9l50
$$ y = [-63, -256, -65, 177, -136, -50, 253, 279, -116, -76, 94, 377, 110, -248, 25, 446, 51, -232, -166, 10, -149, -230, -183, -125, 192, -84, -357, -71, -187, -366, 120, -54, -501, -101, -35, -216, -410, -485, -398, -257, -211, -460, 3, -182, -192, -536, -441, -121, -294, -398, -482, -405, 48, -221, -229, -99, -71, -270, -245, -372, -400, -63, -340, -306, -285, 14, -118, -4, -388, -337, 329, 245, -28, -303, -235, 172, 138, 107, -19, -150, 414, -47, -75, 126, -46, -85, 219, 453, 5, 186, 243, 76, 106, 388, 188, 381, -78, 69, 473, 266, 223, -131, 266, 232, 116, 324, 400, 188, 373, 40, 80, 297, 356, 246, 369, -183, 420, 379, 63, 315, 239, 345, 274, 200, -27, -14, 298, 235, 144, 26, 404, 140, 56, -170, 349, -159, 172, 31, 263, 72, 250, -22, 387, -285, 112, 190, -251, -311, -377, -138, -63, -100, -196, -192, -20, -120, -347, -130, -487, 43, -286, -106, -214, -272, -277, -680, -29, 258, -95, -294, -96, -476, -225, -466, -395, -81, -153, -460, -90, -1, -351]
4696c51L14k75j3k37P8K48k59j28O62l37mJ88J48m6j15pP3j14q2K24j48J58Q8
4719F5k1p0l38K87O3J41k82O6J71J49l01J24J00J27k53K40M3j79J47l31K86P1
4741C05L4j71l11L08N8M4k75K71K72m59M2o1n0K36J3Q9k2j10K08j15j39j18L33
4764C82j22OJn0J02p1p4j41N09l01rl25J93M83m78l94L82K9J94n55K10O7j27k06
4788b95J82L41j13j77k43lK21P7j00k16R2J01K89j90k0q4K09J70p45k0M64j92
4810b52M2j39L04J53m08QL27k00k5m4j24Q1k70N29l37k45L88K4J13j84N0j51K84
4833g6k25k86K09M21j37m83J01L61L46m42m6J96L65m62K1K33m9j10N5j48M83j29
4855A98m5j03q8K2J86j3K46m45k53M62K85n88K01J43m1k2k67J26M69l38l01L55
$$ y = [-351, -37, -312, -325, -562, -484, -236, -495, -623, 39, -298, -302, -114, 34, -12, -127, -134, -61, -175, -257, -33, -181, -23, 65, 44, -26, -364, -77, -14, 127, -155, -89, 82, 231, -70, 54, 154, 281, 28, 268, 311, 132, 279, -52, 234, 305, 339, 168, -143, 165, 223, 267, -8, 263, 535, 76, 118, 57, 7, 243, 256, 345, 323, 213, 421, 306, 167, 49, 382, 260, 266, 267, 217, 319, 248, 174, 33, 542, 241, 232, -93, 100, 583, 105, -289, 93, 122, 316, -239, -29, 38, -89, -295, -113, 228, 115, -62, -305, -308, -87, -10, -110, -326, -234, -133, 156, -34, -54, -138, 71, 241, -504, -524, -60, -252, -210, -349, -45, 108, -300, -292, 35, -165, -190, -234, -358, -277, -547, -18, -355, -600, -212, -188, -75, -259, -209, -360, -76, -301, -587, -378, 43, -94, -577, -476, -115, 231, -211, -257, -61, 304, -158, -137, 96, 47, -63, -8, -156, 327, 198, 153, 50, -38, -16, 170, 157, 403, -42, -295, 167, 452, -136, 65, 208, 167, 145, -122, 4, 473, 135, -166, 189]
4877A89K00J2l63J60J20k6m4j76K2M2J84J29k41j76O3L17J98p21J00L76j19j54
4899I2m37P37P8o95K49L21N3m64o2J37K64l87J37M76k35j44j31Q2q0l39J48K42
4921D2q3n22O15M82l74m46j64O27Lk52m59K89K42l32LN13L17q80k46M0L57K10
4943a8O8l16j17k26NR54m17k59k76M45P8l04q2O65j46j081N04Q00Rl84k13M32
4965A21r1n9j23P7J62m77J70L49O6k23j37J54p3m61P71M05m29n88kO56j73k52
4987a57J21M15l56m18J38L27K23n15j26O31K99n57L6J05m3n8j5N49l28l35J14
5008E0J19O1P0n6O15q10k13R9Q83m51l48J55K15k20n84L85M71N3p12L3N51K57
5030F23m02j16j1j14k17O05O1j69l89o4M61l04l06O40p4k38m76K67P30j55p05
$$ y = [189, 389, 401, 38, 198, 318, 292, 248, 72, 94, 136, 320, 449, 208, 32, 95, 412, 610, -111, -11, 365, 246, 92, -345, 392, 470, -225, 24, 345, 398, -66, -128, 9, 273, -114, 23, 499, 264, 120, -11, 71, -9, -348, -200, 42, -41, -563, 52, 534, 160, -286, -450, 177, 180, -72, -531, -242, 0, -332, -329, 184, 501, -379, -625, -585, -228, -18, 50, -266, -383, -609, -604, 350, -67, -326, -602, -157, -79, -383, -465, 200, 54, -1027, -523, 277, 286, -98, -311, 121, 30, -29, -152, -75, 87, -390, -220, 129, 195, -28, -165, -11, -84, -545, 226, 631, 202, -386, -388, 268, 95, -157, -36, 379, 23, -395, -257, 70, 293, -222, -348, 283, 582, 25, 61, 166, 123, 65, 50, 599, 271, -64, 50, 169, 230, 300, 244, 859, 49, -164, -65, 818, 367, 19, 174, 389, 169, -415, -30, 441, 494, -218, -185, 366, 623, 221, 105, 94, -20, -237, 368, 429, 260, -129, -193, 268, -36, -342, 298, 224, -14, -490, -223, 507, 352, -353]
5051c53NN44r9k47j67M68l44m04L46J26j31J81k69p3j03m9L86O57n78m75N65J02
5073H8k85k63K37K91n96J41J45M34j38q46M77K87M2n48J96K98r3l78L49L29k22
5094e5k38l39M12J68rj2L58p49mN86j5K7m34K27JJ6j83L51J17L7o01K03L99M2
5118C05j72J43j82k76n7M10K40o0k06k4j74J77K5J06J38l86O3K02M29m14k87P7
5140G7M98m32k80J36M17j10l22J74L39o6k39J77J33m33P1N2J72m97J00O23o28
5161c8m6M63j02J69l76l33L02K81j30m09K99p5p4j00J58K42l7j48j02j15j29J58
5183a42O9K2k76J43K43j33j86K54N3l08m10Q38k00P7m41k63M70j3k88J82p8L09
5205g8N1l88K68k11r0QL83l99K34l26M75k15J67j23M96n16k00L68J04RK1k16N8
$$ y = [-353, -348, 196, 97, -150, -317, 151, -193, -597, -251, -125, -256, -75, -344, -417, -520, -569, -183, 474, -104, -579, -14, 88, -197, -460, -223, 68, -528, -387, -242, 192, 54, -792, -315, -28, 14, -534, -338, -40, -133, -511, -162, 167, -55, -293, -632, -220, -52, -61, -73, 285, -464, -468, 118, 103, 130, -304, -77, -76, -60, -243, 108, 225, 262, -339, -136, 263, 305, 133, 276, 94, -182, -239, 171, 411, 351, 145, 121, -53, 124, 149, 255, 393, 7, 70, 272, 701, 287, 0, 77, 575, 143, -137, -1, 416, 306, -16, 158, 497, 431, 192, 369, 502, 69, 140, 192, 364, -133, -33, 590, -38, -84, 379, 277, 446, 70, -263, 39, 320, 190, -219, 80, 5, -69, -169, -11, 231, 194, 46, -56, -171, -300, -142, -73, -51, -327, -184, 59, -74, -260, -6, 47, -261, -671, 167, -33, 44, -397, -660, -190, -203, -491, -309, -387, -78, -27, -415, -147, -358, -448, -440, -57, -456, -222, -548, -73, -288, -121, -244, 252, -264, -464, -96, 8, 17, 38, -178, -120]
5228a20kk40J63J71K62n20R6O7K89m1l66K58J00P2j17J43n11K73K16m7J0k98J25
5251a7J08j89m1K76J6K29j81j09L47O9j46k30M09n71L0J60J17o5j55j12J97R8
5273B40p0K73R1j19o2j51J33k35jJ92O9l84K33j1R8l39J23R3L9J34m24Pk1L63
5297B71o33J78K20J03J27l21j11nR6J24k35K42n0j80J43j36N7K05k73M20l87r
5319a54J08L1j66l68J50jJ48k4l5J2J52k34R6J62n8oj95Q2l9P3K72k78J06K77
5343A11j69l58L67l42O24m80N4j25M03m6q3j02J63P0m39K53Jr8M9j25N68l93K75
5366A78l87K8J02L73l25Q5o5PK65l08K10k51K88k39M12l63R6O5P8m4J41j19j66
5389F1m1o2K16J13k74J56P3K23j00j71j51m3J90J36j43j9j08k3K08j87J18L16
$$ y = [-120, -122, -362, -199, -28, 234, -286, -190, -123, 166, 125, -241, 17, 117, 189, 72, 215, -296, -23, 193, 146, 156, -142, -17, 91, -98, -139, 137, 153, 382, 201, 92, 439, 508, 362, 132, 541, -30, 0, 160, 277, 212, 57, -55, 142, 240, 170, 443, 534, 415, 353, 202, 335, 100, 99, 291, 360, -24, 209, 198, 296, -43, 80, 173, 212, 346, -78, -71, -92, 271, -362, -184, 36, 139, 266, -55, -166, -171, -75, 49, -186, 56, 6, -174, -31, -167, -110, 95, -178, 242, -145, -154, -46, -15, -181, -549, -399, -400, -252, -276, -311, -299, -147, -381, -285, -123, -181, -187, -382, -300, -339, -266, 6, -272, -166, 111, -58, -416, -49, -391, 233, -247, -193, -318, 85, 39, -44, -146, 17, 87, -352, -99, -98, -196, -147, -272, 296, -97, 178, -209, -181, -79, 294, -31, 54, -11, -4, 261, -47, 163, -88, 200, -39, 373, 10, 106, 171, 249, 205, 346, 227, 61, 20, -42, 174, 287, 13, 169, 242, 465, 365, 194, 43, 0, 190, 326, 183, 164, 56, 33, 241, 54, 172, 488]
5411D88k64k2k19Q0J42j39P8m08O71k32j62K34j74r3Pj50J65J56m50J52J09P0
5433C9J7J10j54n1o7L33l17p1K1qO7r0L6j7J68l37J06K75J9k31N1m6j01kj44J44
5459b50R4L31l85K81Pj83n1j72L19m86L75o2j05Q8j17J99L35p67L91o6J88j6k11
5482b63RJ8K66m21J46J16k28K28J17J63k90L95n73L62M7j09N5k33Q9J9K33p3K3
5505I6j31K33l94pK49pK29j70J4J40J18l00k87M39kj29kK00q7q0N9O5L7l19K79
5530B43J66q3j34k23J46K80n32J67j52O30m16l36M42m6k49J48JL26l33P8K32j64
5552A91o5k66J83K92m44M9J71J37l30l6L5K94j81j17J96l77r7J16L07K68n72N3
5574a93J13N3l46R5L6K47o73N00L05k60J04l63K54j92K4J03R9m5l32K2L65M5m25
$$ y = [488, 224, 202, -17, 63, 205, 66, 144, -264, 407, 175, 13, 247, 73, -20, -13, -163, 2, 158, -292, -140, -31, 39, 56, 166, 12, -39, -106, 227, -90, -161, -140, -148, -81, -171, -135, -152, 16, -321, -215, 60, 79, -152, -101, -147, -248, -250, -394, -250, -156, 175, -210, 71, 78, -105, -156, -328, -9, -495, -120, -182, -287, -199, -316, -117, 218, -549, -158, -224, -36, -52, -263, -254, -236, 30, -391, -245, -129, -357, -129, -12, 151, -139, 256, -317, 45, 92, -17, 38, -195, -106, -87, 146, 73, 96, -35, 198, -196, -203, 46, 39, 268, 98, 112, 252, 370, 70, -217, 222, 220, 91, 89, 289, 202, 122, 181, 246, 283, -36, 243, 409, 326, 192, -31, 115, 395, -137, 30, -122, 508, 92, -244, 198, 152, -97, 51, 52, 378, 45, 123, 355, 191, 126, -140, 43, 335, -109, -60, 111, 248, -82, -118, -83, 211, 30, -87, 109, -268, -365, -249, 58, 326, -246, -193, -80, -27, -373, -278, -242, 5, -668, -168, 137, -123, -19, -382, -128, -320, -296, -193, -94, -139, -471, -449, -84, -39, -464]
5597d64j4M28k76o0O0K88J34l22l2j5J53n5mK24j29p4M2L34J44m78M52l92n1M1
5621f6K72l89N5K3J8J19L01K3o2j03j90J81J64J29j53j54k0j99K19j62L44k20
5643A30N3J14j78L20p9p8l26r2K59l38N49L06k42p05L08K46m2lPN6j63j3K11L9
5667C39j20L3k47P0k68K98Qj54j30K21l3M31n85j16K80M89l89ML15l53J59m28
5689a76L01P4k91N9K0J06o4l7j20J92k63m3L84J28m92o4L23l5k35N3K06J81l32
5712a25j24L11J78l62J88j72k67J15J4J5J19N6o6K22n6l99R1L53m29j31j37P16
5734A10j97Q3j85R4k98N2J07J35L8k82n8N98m2p7k25K10J0j5L5K98l23j87k73
5757c92O33k09Loq2Q0l03N77Mk1k32j55L17r6M0q8K04K5l87K07K73m0k82j81K46
$$ y = [-464, -478, -50, -326, -386, -326, -38, 96, -226, -258, -273, -120, -175, -179, 45, -84, -158, -116, 218, 362, -116, 336, -56, -107, -66, 206, -183, -128, -105, -87, 32, 333, 356, 294, 191, 1, 182, 346, 475, 322, 168, 148, -51, 168, 6, 350, 130, 183, 297, 119, 439, 360, 282, -44, -136, 123, -215, 334, 640, 398, -307, 1, 247, 205, 202, 209, 265, 102, 89, 300, 339, 219, 252, 5, 75, -193, 105, 113, -41, -171, 50, 17, 448, -137, -253, 27, 516, 127, 131, 446, 93, 252, -176, 125, 199, -92, -33, -13, 93, 29, -8, -128, 64, -199, -242, 142, 270, -222, -286, 37, 2, -233, -180, 26, 207, -125, -249, 62, 240, -122, 66, -106, -373, -258, -244, -229, -110, -54, -120, 102, 46, -353, -262, 91, -338, -469, -606, 110, -87, -4, -189, -95, -393, -341, -234, -99, -61, -343, -401, 197, 155, 78, -147, 63, 73, 58, 93, 391, 68, -119, -392, 241, 32, 35, 29, -53, 27, -276, 301, 305, 284, 52, -103, 214, 118, 158, 70, 274, 299, -88, 119, 392, 352, 70, -111, 135]
5782A35j3kq5K69l2k39l6L22K39o41K08J24k80L3P3K83J89p32L2M91J90j32l11
5805H5k67M89l03J6J79j39l13L25R1R5k60l8L32k73j03k22M15m9k64J48k0J44
5827F8k92k41P10l06j70j35J93J4j2k49K46J98q1k48L19rl05N8j28j4K10R5k5
5850a04k22j90J51L37J14l50j06J86Q2k81R8L39J42l25m64O97k98j92J78J33K5
5871e0k80N11j57j99r6J36J56%o5J74j25m31L29N1M70m00l70M51K93j12k59j4
5893A3J51j47MP5O7K10l29j18R9J02Q4O8o9j19n8J79K42k98K06k56J65j3k46L69
5917C81j16j00k45J12O4L58o29L37R0j40j01K66q2M6k31j3L57l24L09j28l19M4
5939f4R9J42k1m9o0j91M30j82J6M0r0l89K45p0r2J58K8j68J14K83l17k29M86l39
$$ y = [135, 122, 120, 35, 304, 272, 33, -3, 319, 558, -83, 125, 249, -31, 2, 75, 358, 547, -185, -153, 338, 528, 396, 85, -182, 307, 4, 20, 199, 60, -253, 72, 163, 258, -2, -40, 292, 19, -84, -306, 109, 60, -204, -56, -76, 68, -224, -465, 245, -61, -231, -366, -173, -159, -171, -420, -174, 24, -57, -305, 14, 5, -300, -242, -370, -384, -174, -79, -104, -326, -516, -365, -28, 86, -264, -370, -184, -102, -383, -285, 54, 196, -129, -593, 104, -194, -386, -208, -75, -50, -330, 181, 24, -175, -271, -135, 21, 21, -44, 130, 5, -426, -97, -46, 424, 24, -346, 105, 398, 286, 27, 13, 164, 17, 21, 96, 163, 373, 44, -74, 25, 127, 211, 279, 210, 91, 33, 212, 454, 156, 362, 106, 271, 258, 12, 381, 265, 165, -80, 32, 96, 454, -175, 162, 252, 112, 11, 277, 195, 241, 10, -3, 354, 30, 339, 211, -108, -64, 35, 177, 156, 107, 47, -144, 286, 104, 120, 160, 70, -319, -74, -144, -236, -78, -50, -218, -104, 179, -138, -367, 119, -220]
5963b20J3J37K40k40k81L21Q0j64j64l10L89J96l53L24Q4j84j21K42K3l66K01
5984a53O8l6j09r8K1K79Q6m31L10K7l07K45p1Q0J71l86L67m4k57J83K77m16n5
6007b49k3M91l04K37k50PM8M6K53k49l2J01k33K01Q8K20m85M04k46Q1J9k34L60
6030B51n38L83M19l03k0J98j88M8j46Q3p4j02J86k4k3L03l20J35j13k26J98K0
6052A47J40k41J89r7K59l36l3p9J63O9l7n9kj49k2J79j76J54K77j69k39L26l30
6075f6l81L60J21j62K02k2k58L83j67k18L2j40J04M11k85k29L86l24J78k08l1
6096c14L02J14k26J68k73n8J82j79j22N03l13j84K50j51L3L03j74J14Q3k26L81
6117B13j96o1j8k31K60l58r2M57m89K27M7L10o07L68j0Q2l7L15k34j77K26j5J65
$$ y = [-220, -207, -70, 170, -70, -351, -30, 50, -114, -278, -588, -199, -3, -356, -32, 52, -132, -253, -11, 12, -354, -153, -85, -121, -230, -328, -307, -28, 58, -373, -63, -36, -343, -98, -169, -89, 82, -304, 63, 19, -238, -55, 222, -194, -249, -272, 219, -85, 152, -98, -91, -43, 3, 256, 7, -25, 76, -157, 44, 132, 352, -133, 271, 25, 106, 125, -109, 251, -287, 96, 515, 212, 192, 390, 202, 250, 104, 187, 113, 11, 197, 173, 150, 453, 133, 268, 155, -71, 127, 147, 287, 46, 235, 138, 397, 61, 28, -51, 112, 181, 144, 85, 83, -66, -88, 91, -85, 69, 346, 177, -62, 264, -66, -447, -87, 34, -128, 74, 52, -206, 177, 10, -208, -176, -316, -212, 199, -86, -315, 71, -253, -75, -283, -314, -12, 102, -124, 44, -229, -287, -105, -284, -406, 97, -216, -400, -150, -301, -268, 35, -139, -25, 58, -168, 213, 17, -44, -62, -293, -33, -391, -483, -26, -515, -288, -241, 69, -538, -170, -180, -98, -135, 180, -54, -231, -5, -20, 145]
6140A45l35J75K74m56L54N6q0Qj60kL3q0O2J97j65J77O3l0j07j96J69l5J50k47
6164c0O5L22l14P0o2K40k69J84J72l20k27L77j34M6PK03oj15k50M90j99j75K43
6187C18l49K01M7k9n7o4k05L38k4p2l52R8J12J1o9O1k2M3Pj52L60m23o3J21K08
6212D4J65m43P0k75L56J47l88K56J05M4j48K75m97K9K69k43m9r3J49K08J2m00
6234d07K36K27j92oJ74Rl5j59k44J08q2M14p6l98K36j26L45j30L0j57m4L91k32
6257a18O6lQK05k85J30J9J57l55k85N31k2j20k88Q7L61l62N32r1j16M5m4PR1q2
6282F8J98K84o47K59j58J53r9J02Oqk68n3J97K18j04n0k06L38K24k44j92k6j44
6305a52K65q8n1K16j05R6J94n35J07k35L11J26K5n4M20l84j94j24K99j50j59N90
$$ y = [145, -190, -15, 259, -197, 157, 213, 133, 141, -19, -21, 12, -68, -6, 191, 26, 203, 266, 236, 129, -67, 102, 67, 217, -30, 35, 357, 43, 113, 51, 291, 22, 206, 378, 58, -169, 208, 74, 120, 127, 330, 324, 209, -41, 449, 250, 75, 318, -31, 170, 217, 188, 131, 67, -138, 200, 176, 104, -248, -150, -38, -27, -96, -35, -57, -14, -7, -159, 201, -222, -285, -164, 44, 209, -234, -164, -439, -83, 64, -324, -68, 37, 81, -67, 208, -289, -260, 9, -234, -283, -376, -227, -19, -7, -407, -171, 56, -136, -142, 32, 41, 6, -153, -397, -289, -371, 43, -33, -431, -195, -321, 24, -106, -76, -233, -277, 114, -118, -52, -55, -47, 158, -127, 3, 22, 179, -176, -461, 70, 48, -72, -360, -273, 88, -274, 258, 167, 51, 96, 52, 59, 150, 68, 266, 550, -97, 162, 4, 157, 58, 160, 166, 158, -110, -163, 34, 252, 148, 98, -108, 230, 454, 210, 18, -8, -152, 113, 25, -26, 190, 85, 181, 375, -160, -53, -288, 23, 149, 174, 120, 540, 156, -38, -162, 137, -13, -172, 418]
6327D18n10N0k10R0J94J37Kj26p3O4m6j95K52O9k59J41j49J8j02J21M10m92L65
6350A69m67N90j94m64q7M13J26l18M05l61J73k77J3J08J56k90K33j86J37K08O1
6371A48l25K75o41L88K74k17l0R9m1Nj86j33P77m43mm47N09J56n05K81O2K60k27
6394C5m0L39j66l58l2L73M1k59j28M53j56j9rL61k59k70r7M76j38j96J80M7Q5
6417B63l14p8N28M9l68l54M92o0J4N8j77Jk72L10R2J11o8l15K85k41P2o7M03l43
6441B1k53M81R7l32J86k75L95j18k37RO06m78o2n7n6J85m13J66J79L2j24J71J24
6464B47l43J3N6L68k16m60M48J89n64j58L16K82j95l32K87R1l17O9o6L53j01k12
6486b45M1J53M0k0J3k70Q6J75l59M35k42pJ28K11k69k65J64Q1J62m79N43J64l22
$$ y = [418, -92, -42, -252, -162, 32, 169, 171, 45, -28, 36, -10, -205, 47, 116, -143, -2, -151, -133, -235, -114, 296, -196, 169, -298, 292, 98, -366, -453, -40, 86, -232, 173, -188, -15, -292, -279, -171, -15, -305, -72, -258, -121, 87, 148, -177, 98, -543, -155, 119, -98, -128, -29, -70, -65, -251, -384, 393, -50, -54, -501, 8, 164, -341, -60, 2, 262, 35, -5, 334, 168, -190, -222, 151, 192, -67, -195, 258, 102, 83, 74, 435, 176, -94, -191, 285, 147, -49, 131, 178, 263, -51, -129, 399, 448, 80, -274, 218, 158, 172, 230, 53, 54, -218, 92, 184, 295, 227, -88, 197, -44, 28, -39, 364, 21, -232, 249, 346, 14, 200, -75, 320, 202, -35, -26, 580, 102, 40, -17, -73, 112, -301, -135, 44, 76, -48, 123, 247, -96, -83, -27, 341, 125, -335, 113, 302, -262, -420, -104, 178, -17, -349, -62, 29, -288, -219, -285, 68, -33, -245, -204, -51, -11, -31, -18, -288, -202, -27, -386, 49, -193, -200, -72, 139, -130, -395, -231, -150, 12, -467, 76, 240, -82]
6509h2l71K94rNmJ00rL73n99Q0K00K58k16p5M6j17O9M1M41n24J36j3L42n44J1
6534a67J19o4K88l31P1L99J61n12j46L12k8J34l11J9K85k53M96k86l2Or8J39k60
6557e9J69J7M5p1j4J5K77j75k15K72J25j44j48N5K92k24o2l10K34j11J40L45l91
6580F2j7J80k06L49m14K1kn8J90m2K69k86Nk69J68J71m88J26M43l03j7k8M3J76
6604G3k61l9L87k87J66J6k53J16m38N23k61P1j48m1K30m9j36j14L68k2K23l36
6626b12L98m17K18R3l06M14m97M6K68K2l54P5Q8Q1M8l1L87p34K20M35k40k11J06
6649a03J11k38R2J38J60P3m43J0K21m8k8q6J96o8K58n2k73Q6Q1J00k37l0k16L85
6673H9P8k17J06K7r5P3q1k6K9N79l23M2l09K30j8j39r0M66k97J64r9r1Q7p6J03
$$ y = [-82, -453, -159, -168, -163, -167, -67, -76, 297, -302, -222, -22, 236, 20, -55, -9, -126, -57, -16, 425, -99, 37, 24, 366, -178, -167, -48, -112, 176, -155, -84, 315, 476, -36, -182, 130, 102, 236, -75, -56, 229, -24, 472, 186, 154, 160, 62, 201, -59, 110, 127, 172, 101, 87, 102, 379, 204, -11, 261, 386, 242, 94, 149, 441, 217, 155, -155, 79, -32, 108, 453, 62, 45, 225, 19, 368, -46, -25, -27, -85, 105, 63, 332, 46, 51, -218, -50, 121, -367, -241, 202, -101, -118, -146, -103, 73, -188, -227, 160, -127, 39, 55, -198, -82, -520, 3, -258, -187, -335, -376, -146, -195, -331, -445, -77, -99, 124, -212, 186, -231, -13, 80, -226, 188, -309, -263, 5, 27, -327, -252, -164, -83, -35, -66, 321, -413, -193, 242, 2, -209, -103, 8, -230, -138, 0, 160, 233, -210, -200, 21, -27, -55, -141, 55, -13, 245, 193, -80, 6, 87, 187, -50, -80, -296, 89, 167, -50, 56, 83, -12, 61, -20, -46, -17, 562, 239, 281, -28, 202, 184, 45, -45, 421, 124, 288, 189, 98, 185, 109, 212]
6698B12j4m76P08l66p3J62j20L6L87m29j51K32j43L34l92k4L36j52j64L0J84R1
6720B08j25k88K57K06l09q0J0R7j67K50k26Q9oJ73n0k54J76j29K0K32j27J81l11
6743a73P0k8j87K37r9j32J56J94K43n26K17J36l16L43l40J01K36n2l58qK41j14
6765a59k21K62j06P3m4L19k56j72J56j3Q4k89J87K36k3q6J69j57k20J81R4K2j10
6788g3J99r4j60k56O76j52j73K7J25l27L80L5l38J97k6L40m59J83J43j83j99L23
6810A88km1k54L83Ll5m55L89J15k34R7Q2k56J76k3P4j93p4K05k26J83j8m7N7K39
6835C33k27k87L54M2J6k24K25m0K63j44n89N29m82K07p7J37m3j84O8k26N22L2
6857B05k43J33n52L66O6M8j78jK92k81j44J22M1K57j19j02R7mk76J37K54p4k00
$$ y = [212, 198, -278, 430, 64, -9, 153, 33, 69, 456, 27, -124, 108, -35, 299, -93, -117, 219, 67, -97, -67, 117, 208, 83, -205, 52, 258, -51, -131, -121, -24, -191, 59, -167, -78, -84, 89, 39, -215, -39, -168, -148, 84, -43, 138, -173, -103, -131, -318, -81, -180, -312, -156, 38, 281, -245, -28, 108, -208, 135, -205, -104, 132, 80, -278, -286, -45, -159, -380, -118, -224, -151, -195, 124, -132, -304, -148, -161, -77, -366, -179, 57, 34, -52, 117, -40, -260, -79, 15, 37, -73, 126, 32, -128, -384, 292, 140, -33, -6, 119, -208, 172, 207, -131, 66, 40, 380, -79, 104, 247, 64, -135, 188, 186, 145, -109, 274, 277, 242, -213, 176, 291, 57, 154, 236, -20, 156, 133, 207, 14, -60, 145, -81, 102, 84, 37, 94, 333, 106, -181, 173, 215, 231, 7, 232, 192, 455, 311, -278, 251, -231, -24, -101, 36, -7, -191, -123, -349, 173, 205, -38, 95, -457, -91, -25, 23, -155, -156, 136, -145, -289, -167, -126, 131, 12, -90, 7, 3, -273, -136, 118, 44, -156]
6880a56j16J29j05J28k01J53q8L59k88L2l3ON84m32K1l42K44K99L4k66j64M26
6902B24k66m0Q9N8r7J56k34l2K04K5M5k16K13Q7J51j50Jj34j8j25M3R3k25N0O0
6927c8MO8j02L68m54O17o06J52j43Q6K78N4n34K12J26J89m54K82k09K44K37k57
6949A20R0j12J9L1J87l64l8L42O1J9j81J08k33K10l9k46KJ07j34LJ99J88k00m61
6973c22N14l04M9r5J83J58k98r3QJ32j96K01j25L80k61J66k27L31l61J27J64k35
6995a04r9K49n3Q9K05n08K19L6m08L42OK11m26n4%l6J73J64M2j89j79M05k03j03
7019b21k1J10N5j37J02j83K63K07n25K02L11J62l17J18k69J83j97M2R3j20r7n4
7041b93P0J79J46o6k59L67j85J44j4k26l12N28j34K34Q7j75J41k80k58K69l6J84
$$ y = [-156, -272, -143, -248, -120, -321, -168, -256, 103, -185, -153, -186, -180, 404, -28, -7, -349, -105, 194, 228, -38, -202, 224, -42, -82, 7, 65, -32, 124, -110, -142, 62, 87, 132, -84, 129, 216, 367, 217, 218, 84, 66, -59, -16, 77, -148, -98, -38, -34, 34, -68, 300, -154, 463, -143, 9, -134, -48, 230, 284, -250, -38, 88, 277, -177, 105, -104, 140, 377, 120, 210, 98, 117, 148, 335, -29, -67, 275, 336, 355, 174, 282, 49, 259, 220, -26, -24, 83, -51, -48, 151, 339, 139, -322, 192, -112, -63, -158, 25, 183, -115, -208, -200, -68, -264, -63, -188, 192, -69, 97, -130, 201, -160, -33, 131, -104, -203, 46, -7, 82, 287, -221, -2, 34, -374, -32, -26, 185, -241, -295, -295, -331, -158, 6, 48, -141, -320, 85, -118, -221, -242, -132, -77, -214, -112, -295, -32, 175, -350, -148, 163, 325, 8, 126, -143, 40, -157, -115, -22, -142, -239, -293, -223, -44, 102, 36, -223, 144, -41, 103, 89, -137, -449, 79, -55, 179, 266, 91, 232, -48, -306, -37, -73, 111]
7063A11j17M8K85l00K99k07K0o3q2J51P3j79j56L42q7j89N0l6J52r1n2n3K97M6
7087B62k42K4L7L9j16QR4J09q5m7j02k9Q7L15l85k12l2K28K49l54O5P6k0K26m54
7112b59K53M9k8l64K04K32M7l78L58j14m4l21K30K6L7J4j18K80k08l10K17j50
7134c47q5K16K03j20k22J15J20M25m36M3M4k74o6OK86J69l02j72J78J26l4L06
7156A79j99j71P0j92R7M30k58j88J28K38l06L51j16M72m00j39J78p3k02r3M27
7177B33r6j88K04j72K52j37l34K21jK61L6j11p2p5j24K94j14k7k4P3j61J81o1
7200E8j1J95m10j26N11j58J57j26K24l9p3k54L72j21K46k80J47k66J81J27l45
7221Io2p8L07K39k23n68J83M30k15j06L8p2J29j47R7O9l5o2J28p7O1k89J62k38
$$ y = [111, -6, 42, 327, 27, 326, 119, 139, 76, -6, 145, 218, 39, -117, 225, 138, -51, -1, -37, 115, 24, -28, -81, 216, 262, 20, 44, 81, 120, 4, 12, 106, 215, 130, 83, -19, -48, 39, 354, -31, -243, -275, -47, 202, -152, -87, -11, -31, 195, -259, -6, 43, 15, -349, -145, 87, 134, -244, 114, 0, -44, -365, -135, -109, -72, -58, -176, 104, -104, -414, -197, -347, -432, -216, -13, -133, -355, -240, -120, 305, -131, -88, -44, -318, -384, -378, -92, 77, -225, -397, -219, -93, -127, 179, -20, -191, -121, -313, -216, 214, -44, -232, -104, 134, -172, 179, 63, 535, 135, -4, 174, 101, -101, -194, 233, 137, -51, 153, -19, 233, 96, -238, -17, -18, 243, 279, 168, 96, 21, -103, 191, 77, 50, 26, 99, -62, 119, 58, 47, 242, -168, -294, 217, 59, 216, 90, 314, 275, 202, -52, 320, 199, 445, 165, 312, 46, 227, 354, 9, -53, -131, 176, 415, 192, -376, -193, 237, 22, -84, -46, -118, 11, -136, -39, 30, -5, -67, 61, -16, 45, -244, -82, -320]
7245c20L18l5O0Ll9m06K50J50k73J22M0M48m70j57J5M32k06p1J1J21Lk42J52J47
7269E3K56l56j05J40j95J91j33j69L41j67M7K65k27O9J18k51p0K13Q5o3k12j2
7291a82q5L69j24n80N52M42k60j03j64L46k58p3K67j79p5K43o5j49J00j45p1J27
7313f7K0K84l5j97o4R8n21O71j35p8k9L5J36j1K01j61k62K65J00l06J53l22PJ06
7337a12L21k52K63l48M63l35K4O5j6p7Q9J52j55K00l44L7K49m80J09M96l25n0
7359b6j39n5K78J2j50L00k77m7K17pj42m3j80K06N1k24lK03K04j00J09k01Lk29
7383b40K97j41j03L00k05K67j07k24O4p8K19j60j59K59m45K87J3J37Q6l91L5K19
7405g0J16J2j24j08j05K12n2K17j80O0j28L40l87L10k29O7O6k57K11J59l67n6
$$ y = [-320, -2, -37, 23, 26, -13, -419, -169, -19, -292, -170, -130, 318, -152, -309, -294, 138, -68, -139, -128, -7, -4, -246, -94, 53, 309, -47, -152, -12, -207, -16, -149, -318, 23, -144, -97, 168, -59, 10, 128, -123, -193, 20, 105, 42, -170, -182, -267, 102, -22, -602, -50, 392, 132, 29, -135, 211, -47, -120, 147, -32, -107, 136, 71, -78, 22, -123, -194, -67, -47, 237, 202, 5, -59, 39, -482, 189, 54, -24, -53, -18, 118, 107, 308, 147, -115, 150, 250, -56, 97, -225, -218, -112, 209, -43, 220, -128, 335, 0, 24, 89, 73, -4, 85, 237, 82, 282, -62, -25, 224, -256, -147, 349, 24, -26, -165, -220, 58, 70, -80, 220, -57, -104, 113, 106, -36, -79, -259, -53, -2, -226, -229, -26, 178, 78, 187, -14, -11, -240, 57, -84, -187, 113, -92, 175, 68, -156, -92, -170, 49, -111, -270, -11, -456, -169, -156, -19, 67, -324, -289, -70, 46, 58, -66, -174, -279, -67, -119, 98, -82, -22, -150, 190, -197, 113, -116, -49, 17, -240, -29, 130, -237, -293]
7427b93N9l0J52j7R6O6j39K8k08K13J51k54j36K94J61k19K73j42K8k79K14J62
7449A80j82j65J73J84J10j74K21p8l68J86k36N10k96N8lR1K14m20o0K86p2K28
7471C87m88M50k01oj21j63M70L3l38J12k17M04jl70J13j49l2K31P8l66Q2J13K14
7494B35l48R0j68K56J19j26pl33M6K79j32M2J31k66J99j96L55m6l5j00j89J69
7516b5j58N8r8K13j61L49m60K94l01K36r8L8L23m88K62l4J30j03j21L09k29J6
7538d8J94m1m1q7rj70J22N8n3K74K9n30J09K91j53j5n7k16M44k35m1M51k46j19
7562h9K76j30j39J00o7R4K23k56o9K15m1k46J68J46j95o7M0K5N17p66J54J95K07
7585B95Ok22j42K73p9j89K60j77j17K19p5J03l71K95k38L21l79N56j91n2P9j52
$$ y = [-293, -234, -264, -112, -129, -33, 33, -106, -78, -286, -73, 78, -176, -312, -18, 143, -76, 197, 55, 83, -196, 18, 180, -2, -167, 6, 190, 300, 126, 347, 269, -99, 87, -149, 361, 65, 123, 120, 211, 425, 5, -55, 231, 159, 387, -101, 349, 148, 142, 21, -142, 328, 361, 23, 135, -82, 322, 321, -49, 64, -85, -117, 114, 192, -174, -92, 21, 235, -113, -23, -191, 65, 184, 58, 51, -282, -236, 43, -89, -47, 84, -182, 17, -179, 176, 130, 95, -5, -194, -25, -183, -125, -223, -10, -171, 178, -282, 12, -289, -53, -151, -113, 210, -278, -16, -50, 80, -23, -144, 165, -64, -48, 146, 105, 64, -23, -32, -202, -80, -22, -75, 199, 228, -302, -193, 98, -55, -70, -127, -343, 101, -134, -175, 276, 30, -89, 187, 57, -82, 18, -49, 45, 268, 12, -57, 158, 117, -129, 39, 185, -10, -77, -37, -12, 505, -261, -107, 88, 295, 301, 79, -63, 210, 131, -58, 202, 25, -92, 127, 52, 155, -216, 79, -159, 162, -217, 339, 148, 96, 175, 23]
7607B3J24j2L2l52L4K59k86L3K26K13k03j21N9p2m2R8j30R9N5K31m25J68r8LL0
7632e4J96m76P44j34l29j1j87M16j99M5r2K85m53K55Q8l25K34lJ70m10j54N27
7654A33j52K04k66j06J08n0J6O7qn57M19q8J42o3P5j61j19M23N5q1l0l65N34l72
7678b42J87j68L26J16l94K86j35J83k80R3R1p3J71k76K49k74K85J79Mo55L74K10
7700B57k98rN3o5P9j97K21J27J8k16K78l89J87K24k79K53j07OL1r9k83M04mk90
7724i8M01m67J19K93l33K04K5J44M0m70K41L01k07rj02OO6n7LJ2l61L06K90k57
7748I0k26J55L5q6J26k62J23M02o59j9L65K24l92J07Q7K31m49P2p9K19k55L16
7770A25k21k43K85L9j22j23j21M76j3k38J52j65j66K83j19N6K49P1l44m3P5K25
$$ y = [23, 147, 135, 167, -185, -151, 108, -178, -145, 81, 294, 91, -30, 29, -43, -85, 13, -117, -18, 37, 268, -157, 11, -87, -84, -54, 142, -334, 410, 276, -53, -64, -251, 165, -34, 11, -81, 204, -249, 6, 94, -231, 3, 0, 170, -240, -394, 133, -19, 185, -81, -187, -79, -129, -113, -46, -54, -611, -192, -280, -138, -201, -126, -287, -406, 17, 72, -9, -39, -404, 130, -242, -55, -223, 103, 219, -175, 111, -24, 159, -121, -28, 63, -10, 161, -115, 134, -140, 145, 324, 328, -327, 47, 257, -41, -50, 3, -62, 17, -180, 41, 168, 186, -30, 248, -141, 46, 270, -9, 244, 137, 143, 174, 75, -208, 196, 192, -98, 303, -164, -45, 248, -85, 119, 144, 288, 328, -142, 99, 400, 193, 184, 82, 88, 154, 97, 100, 112, -249, 57, 347, 90, -136, 19, 54, -32, 94, -168, -45, 357, -302, -321, 44, 268, -124, -17, 70, 301, -148, -76, -155, 64, -191, 125, -96, -339, -54, -15, -137, -260, -381, 95, 82, -156, -4, -169, -335, -52, -171, -115, 134, 205, -139, -182, -107, 118]
7792A18k15k0J64R2O2j91j6n5k19L9J92J20j81l37O59k87Lk69N08k38m61L85r4
7815b41J09J9k43O46l56q1j97N60p1k36o2K50R0N8O2j94l49M62j40R6k54L03k34
7838cJ75j85J63J19N9j72r0R2O2J22m93j53O16k21l66J90K93j9l1j71K35m3k84
7861a05J93R4O5l68N08j66r8l89P56k36k72L3j09J13J06k88L12J78o5o47J81K71
7883F7j35l7J34L4p1k20K93L7j10j2K13n32K25L10l22J21Kl62M62l28j9P4N9J30
7907A3N0l37O5M1L69l41j11L86j47k15J62K00j38j49M16j83j65m7P7m0R7l02K99
7930@Q2j69O0k44L85J4k46L1K31k07K04o9J07k71m1J21J69K40n96K89j52J91M5
7953A74k10p1J00Qn9P0L6R4Kj46P3k19K78j07R1m3k93L03K79n22K06J45K0k13
$$ y = [118, -97, -117, 47, 139, 201, 10, -6, -61, -280, -241, -49, 71, -110, -447, 212, -75, -72, -341, 167, -71, -532, -147, -241, -132, -113, -356, 290, -66, -147, -344, 216, 145, -91, -153, 97, 187, 245, 307, 113, -236, 226, 86, 182, -72, 231, -3, 172, -13, 150, 269, 328, 156, 66, 158, 220, 342, -151, -304, 312, 91, -275, -85, 208, 189, 158, -13, 222, 179, -105, 88, 182, 247, -121, 387, 221, 123, -266, 490, 254, -18, 15, -94, 19, 125, -163, 149, 327, 262, -385, -204, 67, -68, -105, 29, 63, -8, -228, 65, 102, -8, -20, 193, -339, -114, 196, -126, -5, -3, -365, 97, -231, -250, -176, -117, 13, 63, -274, -209, -168, 201, -140, -251, 135, -12, -227, -65, 135, -3, -152, 264, 81, -84, -131, -54, -94, 3, -299, 0, 82, -87, -27, -271, 114, 128, -118, -87, 144, -63, 141, 72, 179, -92, -133, -12, 157, 397, -199, 90, -62, 129, 174, -36, -107, -7, 1, -58, 12, 48, 142, 144, -2, 71, -148, 130, 23, 114, 71, -222, 81, 360, -162, 44, 189, 209, -4]
7977dk23M40j32J85n65K02L53k28o9J76O6k65J8O33n04j13O5o2Q4o0J01j29K62
8000B31j67M5n1j70j10K01j79j9L10k3J24r7J6n1m2j26P0K83j83q3j93J52N36
8023D74j61l94K20q3Pj25L6K99l15k47K78j11R5r5o9J69k2o2k5J79R8j11k84K14
8047c5r7N4k82K74R7k47j0J23K66j52L17l08J12j35K2J41k19N1J29N5l17L23l46
8070a84P5R1j24L27m27J49K4L85k94k35J8M77j0m1q7j26l5L60l20lN08m67r9M14
8094C76l31J00j82K96P9J0k34J12q7o2Q5m1k7l41N55k74P9L4m20N24k12q1L67
8117C25l64K07P4k35J33k76L1r2L63J4k41K05l47J45K68j55n8j65K15k15n1k1
8139b40J13P5j03O5J58k60J93J25q8Nj36J26j99M42m15J65j47j8j3O33m94l06
$$ y = [-4, -227, 213, 81, 266, -299, -97, 256, 28, -41, 135, 201, -64, -46, 587, 83, -30, 35, -27, 57, -3, 98, -31, 231, 64, 109, 58, -112, -222, -21, -200, -219, 91, 68, 192, 95, 111, 60, 18, -108, -38, 245, 62, -21, -214, -62, 474, 313, -81, 139, 56, 63, -62, -26, 273, -42, -289, -11, -122, -27, -122, -191, -22, -44, -106, -131, 48, 146, 35, -249, -35, -132, -78, -360, -86, 11, -236, -246, -123, 143, -9, 308, 0, 112, -23, -1, 140, -79, -28, 101, 156, -161, 162, -184, -109, -18, -142, 185, -242, -93, -69, 316, 22, -213, -195, 282, 272, 231, 144, 18, -17, 343, 23, 20, 528, 61, -38, 376, 45, 145, -37, 259, 338, 348, 114, 226, 139, 77, 162, 121, 94, -247, 308, 34, 113, 147, -273, 251, 39, -42, 325, -39, 168, 242, 7, 140, -136, -105, -197, 166, 180, -61, 144, -203, -58, 210, 55, -3, -168, 47, -168, -219, -240, -127, -52, -155, -90, 68, -192, 1, 126, 38, 43, -93, 33, -166, 276, -139, 26, -121, -139, -152, 481, -13, -319]
8161c19L34J5j80J16k03K92p6j13J50J35k81J60o1k88O8L59P8k57Q6j51L14k5
8183A53n9l20L00j46j61M14P7l25
$$ y = [-319, 15, 30, -150, -34, -237, 55, -21, -134, 16, 151, -130, 30, -31, -319, -251, 108, 186, -71, 15, -136, 178, 153, 94, -226, 74, -72, -233, 181, 258, -67]
8191f7
$$ Imaginary data points
##PAGE= N=2
##DATA TABLE= (X++(I..I)), XYDATA
0@%%%%%%%qJ6j6J9k7L2m0N2o0P2q8J04j23J47j71J97k29K63l02L45l91M45n04
30b67N66o37P16q01Q94r97J110j231J367j517J681j861K059k280K526k803L114
47A639l468L872m337M887n544O344p349Q650j0409J2937j6900K4044m0893J49676
61A23149J13051l30469m9778K05847Q0242j98503p1199J40441Q3563j10977n4987
72f9620P6772N3119m9801j7121K9781o630l9342K1347L6027k7053m4880L1127
84f274M5944k4428m9982K1719M9067j1171m6992Q441M8121j323n7299k1668M5287
97e58L6254k6015l1453J8832K8014j8128k8891J4782K9900j0360k7786J685J5039
110A315k922j995J2835m865k5237M733L5081k975m3550J78N1640N772n4718j1711
$$ y = [0, 0, 0, 0, 0, 0, 0, 0, -8, 8, -8, 11, -16, 16, -24, 28, -32, 40, -48, 56, -67, 80, -91, 106, -123, 140, -162, 183, -208, 237, -267, 299, -338, 378, -423, 471, -526, 584, -647, 720, -797, 884, -977, 1082, -1198, 1328, -1475, 1639, -1829, 2043, -2294, 2593, -2951, 3393, -3956, 4694, -5715, 7222, -9678, 14366, -26527, 123149, 236200, -94269, -144047, 61800, 142042, -56461, -127660, 12781, 96344, -14633, -69620, 7152, 60271, 10470, -6651, 23130, 16500, -22842, -1495, 34532, 7479, -37401, -6274, 39670, 15242, -34740, -13021, 36046, 24875, -22117, -13676, 34445, 33122, -24177, -45845, -558, 35696, 9681, -21772, -2940, 25074, 6946, -21945, -7163, 22737, 12377, -15409, -13724, 1315, -1607, -3602, 9233, 4368, -20869, -16136, 18945, 15970, -27580, -27402, 24238, 30010, -24708, -36419]
124c6419N5856J5508n9904k6888N6762L8174m3559m2052K7752L7157j5076k6606
136a9295J1698J8178j1064j4700M949Q698J354M509J895j6632j3173J8310K3452
149A8179j2620k9304O342L2227K530l1425j0179K8844J7969k3639k5317J6439
161i954L0526p000l3450l736L2368J5851k2312j9538J1319J6654m895j1508K119
174c556Q896N54n730o538j580J0685J5337n249k2905l721K4524J0432k4468j3998
188a7317K4052J8170k3493k2104J9761K6881j3330k7164N714K5164J054k0572
200c184p742J2148R669k798p196k394M816O627k928j1220j102J5267P839j6728
214A074j7896J1078K2803r46k1964p089J7013J1179j1980j5365O779J8397R12
$$ y = [-36419, 19437, 34945, -24959, -51847, 4915, 43089, -470, -42522, -14770, 22387, 7311, -19295, -7597, 10581, -483, -15183, -10234, -1536, -182, 4327, 6222, -10410, -23583, -5273, 18179, 5559, -23745, -17403, 14824, 17354, -14071, -24250, 4594, 22563, -1076, -26393, -9954, 20572, 13572, -19878, -23614, 8754, 24605, 2293, -17245, -5926, 10728, 5833, -5675, -3556, 5340, 5894, 164, -6374, -7954, 2731, 18068, 12819, -10086, -13807, 10717, 21149, -3319, -17317, 6735, 24905, 1412, -20692, -931, 25950, 12620, -14544, -8830, 16334, 17388, -3184, -10926, 1222, 10891, 8093, 897, -1497, 3319, 9946, 7018, -4202, -5304, 9963, 17802, 1074, -16822, -5744, 17059, 16113, -5851, -12940, 4073, 15252, 3272, -12093, -5314, 13083, 13995]
227A3995j8545r853J3969J5971q952k0342J251K1045O926j7973j4176J1805J6461
240A1582m593j6472j715J4382N841j1884j0780P068J4930J206j5354r559R836
253e512J3520n761j5063J290J6529L958j5657j0070J3020J4336p005j6584J6J5334
267B351N534j1011r993O132J1811m00j1617n237R435R186n753j1138K529J4295
281F124K730j5184r419J2113J4566n810j5936O34J4650M974j3291q911J0416J2420
295A0076m882j4018n47J3541P272j0552j0691N734J3383n15j3763n169J2221J0428
309A2518o726j2922J912J3005L206j2254p383R356J2044l973j3873j551J3636
322F995O641j1538j0557Q044J2064l331j2643j647J2499O530q229r517K352R643
$$ y = [13995, -4550, -14403, -434, 15537, 6585, -13757, -12506, 8539, 15465, -2508, -16684, -4879, 11582, 6989, -9483, -11198, 3184, 9025, -2859, -13639, -6571, 8359, 9565, -5789, -15348, -5512, 8008, 2247, -12816, -11526, 5003, 8961, -6696, -16766, -3746, 10590, 3585, -12999, -12983, 2351, 7885, -3126, -13119, -6987, 4824, 4424, -7193, -12430, -2995, 6191, 438, -10700, -8171, 6124, 8854, -6330, -15749, -3636, 10930, 5120, -10816, -10182, 4468, 9442, -3849, -12760, -2344, 10076, 5194, -8824, -9371, 4170, 11442, 890, -9801, -4067, 9316, 8801, -4962, -10131, 2090, 12518, 5792, -7130, -5218, 7787, 10993, -1261, -8644, 712, 12756, 8783, -5090, -6641, 6995, 13636, 2098, -8459, -415, 11649, 8318, -4325, -5972, 6527, 13057, 4828, -4689, -2337, 7306]
336G306K093q715o784O281J1171k272j3577k980J3579P322j2395j1693R924J4697
350A3957o051j5786M06J5087L788j1604p973O790Q662k627p846j874O434M927
364F290l954r050m03R876M889q046q854O006J1171k628j3572k439J2444P072r963
379a161j0494N932J2578j641j3619l204J2040P110r685j0254O238J2350j330j2026
393g166k667R061N655o223p826K230P800K959o423o168L147Q975L61q851m465
408i601Q324Q032o562j1331L631J3781R78j3779m715J2082Q166q851j0901N444
422e302J2052p81j0674l482R209O359n210p368J423P577K437o439n609M258P926
437F376L6q514m474Q104Q429n382j0701K404J1707J945j2034n400J0481Q644p797
$$ y = [7306, 9399, 684, -6100, 181, 11352, 9080, -4497, -7477, 6102, 13424, 1029, -10664, -740, 13957, 7906, -7880, -7474, 7613, 11401, -203, -8176, -1386, 7276, 4649, -3197, -5071, 1363, 6290, 2336, -6714, -7117, 2759, 7648, -398, -9252, -3246, 7925, 5297, -8275, -10714, 1730, 8802, -1161, -11655, -5723, 6855, 5214, -8405, -11609, 431, 7541, -2144, -12398, -6160, 6190, 4860, -7166, -9833, -772, 4883, -1340, -9166, -6936, 864, 3823, -2600, -8768, -5621, 3354, 3715, -5136, -9601, -1277, 6755, 193, -11138, -7507, 6274, 7252, -6527, -11242, 840, 9006, 155, -10746, -5302, 6750, 5969, -4705, -8187, 1022, 7381, 2171, -5197, -3774, 3803, 6240, -199, -5808, -1550, 6376, 6412, -2102, -6576, 1528, 9957, 4575, -6126, -3722, 7985, 9930, -2104, -7504, 2977, 11621, 3824]
452C824r955M735J0739j306j0499k317Q027N315m648o533J061N919L038m278o127
467c005J802P769J466q584n682P784Q410n127j0121K089J1082R68j1859m610R425
482A807Q057o264j0280K372R934J500r259m464O476P160m208q676P40Q059K170
497E124n993n159L449N952k08o293l435M837O101k078q837k031R242O109p968
512a188r680O259J2002l501j3554m47J3441L201j1644n858R233P658o203q258
526h539K769P962N61o074l051K090M409J668k903n286J702P382O95q370l406R075
542F84O570q167r767O087J2537k728j3138j063J3146M743j0492p748P650Q949
556G263m035q905J694P970O90n534k858L752L379M98k709m117N60N893L878o934
$$ y = [3824, -6131, -1396, 9343, 8037, -2462, -4779, 3248, 8563, 3915, -2618, -1557, 4362, 7400, 3122, -3005, -1203, 6566, 8032, -552, -6234, 1550, 9960, 4833, -5288, -3199, 7883, 8851, -3008, -7618, 1807, 9864, 3600, -6680, -4308, 5626, 7126, -2133, -6597, -121, 7039, 2831, -5845, -5105, 2954, 5124, -869, -6028, -2579, 3373, 3165, -3128, -6563, -1726, 4375, 2297, -6540, -8571, 671, 6780, -1188, -10868, -4609, 7393, 3892, -9662, -10109, 3332, 6533, -5111, -10969, -1736, 5922, -281, -8539, -5770, 2192, 2753, -3321, -6372, -4282, 127, 1795, -1108, -6394, -4692, 2690, 3385, -4985, -8391, 684, 7254, -913, -10680, -4593, 7944, 5216, -7922, -8985, 4161, 8904, -1588, -9336, -1686, 7263, 3228, -5677, -3983, 3987, 4677, -857, -3715, 37, 3416, 3914, 1205, -2912, -2352, 3541, 7419, 485]
572D85o024O348R298n745j2211M195J4888p73j5610l181J4804O026j2074q672
586h246R761Q990o184p923L252N982p91m113p15R92J787K717j774o494j097Q959
602E103M964r141q598P069J0130n079j1215M182J2260k863j3544j181J3114N403
616A0604j0630p461N950Q051l301p059O62M784P79l144k036J372K061J335k550
631e83m239R06O448K882q349o986P145R671l774j1542J245J1666q1j2054k330
646i975J3083N296j1694q554P467J0072l410q082P9N465P66l066p70N33J909K079
662A198j136n701j000Q618M449r087r515Q328J2912l956j4369P4J3638K093j1908
677e362l056J1537M630j0298p255P922Q813k439p165j480K853K647J162n39l458
$$ y = [485, -5539, 809, 10107, 4362, -7849, -3654, 11234, 10461, -5149, -8330, 6474, 12500, 426, -8246, 1515, 10505, 4321, -3602, -350, 5632, 4841, 728, 13, 1005, 2792, 5509, 3735, -2759, -3856, 5103, 10067, 926, -7672, -603, 9527, 4448, -6767, -2585, 9675, 6812, -6732, -7913, 5201, 10604, -26, -7487, -1537, 6514, 3213, -3846, -3184, 1600, 2379, -765, -2801, -1429, 632, 1967, -583, -4822, -3916, 2532, 5414, -2935, -9921, -2776, 6895, 3121, -8421, -7176, 4490, 4409, -7645, -9975, 3108, 8404, -3290, -11844, -4377, 5695, 2285, -5797, -5718, -253, 513, -2553, -3323, -2790, -881, 1198, 62, -5639, -6639, 1979, 6428, -2659, -12174, -3846, 9066, 5110, -9259, -9185, 4453, 6546, -5362, -8418, 3119, 7749, -2549, -9804, -1882, 6931, 4492, -2673, -4153, -1300, 1347, 2509, 1970, -1488]
692a488l41L880J002n216j304P925L718r174p237P945J1176m706j2673P54J1817
707F078K822r796m357Q255M732o870n844N484P565k224p670j566M462M268K08
722E547l374m407P61N022J344m959k065O227L577p954p556P634J1643m352j4294
737g206k5J3284L260j0732m953P750N179n889n308L766N361j496n217j713K789
752a150M516J751n325o866J870R766K311r439m856P254N366p334o343Q094Q441
767H056o113j1661J809J1720K434q341n441M587M450j326l567M27L050N61l239
782b594k105J830M386J284n906m562M161P639m82q348l209O450N186m586n217
797f073M482O573l993q959J093J0310L587q572o949M816P734j125n465n36L764
$$ y = [-1488, -1829, 2051, 3053, -2163, -3467, 4458, 8176, -998, -8235, -290, 10886, 6180, -6493, -5739, 6078, 8900, -896, -5253, 3002, 7734, 864, -4980, 504, 8069, 5845, -1825, -3391, 1071, 5339, 5547, 2173, -2234, -1473, 3549, 4893, -66, -2131, 4096, 7673, -281, -7837, -203, 11440, 7088, -7206, -7231, 6053, 9313, -1419, -6372, 1378, 6557, 668, -4640, -874, 4487, 2991, -2226, -3939, -1150, 3366, 5117, -208, -7074, -5204, 4562, 6873, -2566, -7422, -168, 5198, -2136, -8479, -385, 8056, 1943, -9718, -7909, 3811, 6245, -2096, -7537, -2950, 1500, 174, -3393, -2966, 84, 645, -2594, -4699, -2869, 1517, 2801, -3105, -7667, -3506, 4133, 3651, -4697, -7906, -1456, 3730, -856, -6073, -1591, 4982, 989, -7970, -6877, 3433, 7020, -1552, -8501, -3685, 4049, 2924, -2541, -3077, 687]
812F87J566l105k284J570M753J281n395m884L868Q733l84j0316l743R428P313
827I088o967p707M619P609l068p834J362Q832J470p376n091L998O432J354m988
842A733m832J634N521J079m909k403M947L364m955n362L826P964j067r353k415
857e228P837N629n471o696K097O828J5o317j722N678L158n188m922L101O559k55
873E103o313l356L186N176R4n299k061L350L788l226n017K542P083q56r155k418
889g379Q069N937n711p560K260O871J46n857j287M330K719l388l925R52N084J852
905C113m770n571K954P784L23p627m067O738N491m329o677K624O958j000p234
920e290r71P069L993n541n888J884O425J779n020l311K517M416n64m801q07M780
$$ y = [687, 2253, -852, -3136, -1566, 3187, 4468, -927, -5811, -1943, 6790, 6406, -3910, -7653, 1775, 9088, 2121, -5586, -967, 6642, 3574, -4260, -2898, 5934, 7404, 28, -5063, -1065, 5367, 6721, 1733, -3099, -1465, 4056, 5135, 226, -2177, 2770, 6134, 1179, -4183, -357, 7607, 6540, -2813, -5228, 2609, 8238, 2767, -3929, -1832, 4996, 5011, -1306, -3028, 2650, 5808, 620, -4302, -1201, 5358, 5103, -1210, -4566, -1380, 3796, 3890, -1409, -3470, -120, 3668, 442, -4575, -2033, 5050, 4194, -4961, -7379, 690, 6627, 916, -6644, -4384, 2487, 2633, -3224, -4511, -181, 2538, -850, -4775, -3823, 1261, 3113, -1657, -7228, -4274, 3510, 3833, -3794, -7861, -1123, 4368, 39, -6638, -4014, 2944, 1944, -5290, -6261, 808, 4801, -740, -6628, -4744, 1681, 3460, -1560, -4871, -2354, 2062, 1498, -3303, -4110, 670]
936F70K802l911n119K751O646N30p043l187N959N517l597o695J590P071M85o789
952b320k433N915M855l928o216J449O719J829n520l997K816N225l17n140j703
967b766M547L999l711n754K186P195K49p333l202O109N831m107o646J357O450
982D404J348n908k980L781M801k530n493J91N642L030m971n611K692O611K32o562
998a323l124N151M836l303o429J464O622J016o672l518M990N623l086o893P30
1013c916O408J797n579l634L747N080j962n945n76M995K858l253m563J099N337
1028A893J081n234l769L941N722j810p317J50O960K093o185m205M778N895k962
1043A031o262J34N770K433m591l644K048M913j49m562j805M303L396k403n256
$$ y = [670, 3472, -439, -5558, -2807, 3839, 4369, -2674, -5861, 98, 5615, 2018, -4677, -3087, 3984, 4469, -2320, -4753, 1162, 6017, 2089, -4127, -2678, 4041, 5870, 350, -3647, -831, 4394, 4077, -1063, -2766, 1781, 5780, 2069, -3685, -1499, 5696, 5945, -1388, -4590, 1519, 7350, 3243, -3403, -2046, 4404, 5752, -156, -3136, 645, 5446, 2916, -2577, -2386, 3256, 6286, 1315, -4296, -1604, 5007, 5239, -1323, -4447, 704, 5540, 2237, -4192, -2728, 3894, 4910, -1762, -5280, -290, 5333, 2247, -4646, -3916, 2492, 4289, -1290, -4924, -1177, 3903, 1941, -4004, -4580, 415, 3273, 20, -4543, -3444, 1893, 2974, -2260, -6029, -2088, 3634, 1824, -5493, -5343, 1617, 3710, -2475, -6680, -1902, 3993, 1031, -5231, -5097, 673, 3106, -1485, -5129, -3081, 1832, 1683, -2879, -4684, -381, 3015, 612, -4644]
1058d644L91O407J474n730l752M768N660k184o784m8O510J981m852m183L754N334
1074D102j362n757l37M763L123l677m802K012N119O79m792k625L751M930k068
1089C059n893j85N958K501m867m662L802O336k094o305n74O409K475n123m460
1104c623L689N234j465n247j000M514L137l134m289J168M730J091m533l636L323
1119d1M683j098n639j029N530L115m837m785L078N928j129o379j448N651L690
1134E290m730m946K443N751j36n692k091M357L537k809m773J96N468J832m829
1149a132l991L553N077j237n921j567N440L695m170n360K479O014l38o108k010
1164e576N202L635l574m930J678N399Q18n004l017L777M042j584m778k92M374
$$ y = [-4644, -4253, 2154, 3628, -2102, -5854, -1086, 4574, 2390, -4394, -4442, 2068, 4049, -803, -4986, -1232, 4102, 2740, -3017, -3354, 1409, 4532, 855, -3947, -1935, 3184, 3863, -929, -3554, 197, 5127, 3059, -2834, -3019, 2939, 5440, 573, -4089, -287, 6049, 3955, -2350, -2924, 3485, 5960, 837, -3623, 66, 5300, 3835, -1412, -2412, 2102, 5239, 2105, -2184, -1016, 3714, 4805, 272, -3364, -41, 4642, 3544, -2095, -3124, 2406, 5521, 684, -4101, -1023, 4905, 3776, -2603, -4051, 1600, 5290, 560, -4386, -1943, 3808, 3672, -2020, -4111, 246, 3783, 974, -3799, -3603, 1865, 3697, -1132, -5123, -1570, 3507, 2270, -3651, -5218, 222, 3917, -253, -5613, -3134, 2880, 2542, -3566, -5576, -374, 3261, -313, -5243, -3565, 1834, 2652, -2352, -5369, -1592, 2450, 866, -3912, -4204, 170]
1179A70K677l225m611J590N342M41n334k331M964M280l475n388J062O342J151
1194C655n979k730M777M608k786n583J002N149J460m242l004K532M379o99m465
1209a926j232M002L371k766m198N48N353J509n566l192M466N025k646n737M74
1224b515O141J497n313l590M104M627k120m689K00M379J850l906l238K341M778
1239D546o87m528k014L722L679k227m556j36N185J590m590l282L433M803j842
1254C096n587j75N476J761m611l728L136M572q45n180r75M360K080l136l271J291
1270a736L896P14m205k315K465M645j481n375o48N219K264m451l701L214M889
1285C394k065n291q0N039K258m308m248K977M648q24m320j474L403K541j998k809
$$ y = [170, 2847, -378, -4989, -3399, 1943, 2384, -2950, -5281, -317, 3963, 488, -4900, -3838, 2504, 3655, -2324, -5054, -277, 4331, 1545, -4038, -3036, 2113, 3573, -669, -3673, -1141, 3238, 2539, -1926, -3158, 844, 4215, 1449, -2749, -2201, 3152, 4661, -905, -4097, 369, 5394, 2748, -2989, -2515, 3626, 5123, -190, -3780, 324, 4951, 2831, -1858, -1658, 2721, 4571, 665, -2573, -232, 4546, 3859, -669, -2683, 1039, 4718, 2491, -2065, -2201, 2984, 4574, -16, -3298, 135, 4938, 3096, -2491, -2666, 2810, 4571, -40, -3768, -632, 3940, 3095, -2085, -3060, 1300, 3380, 244, -3027, -1736, 2160, 2874, -1331, -3646, -1181, 3464, 1983, -3392, -4040, 1179, 3443, -1008, -4709, -1495, 3394, 1329, -3962, -4042, 997, 3255, -1053, -5301, -2324, 2324, 1500, -2820, -4294, -891, 1650, -348, -3157]
1301c157K10L485R09l333k575K924M111r95n338j500N170L822l666m787K099M999
1317B378m21n584o69N284K671m439l931L042M597q11m089j412L109K929j363l242
1333a951m30L154K154k326l416J997M244m51m963j835N744L622l935n525J918
1348a999N597j58m261r14L641K080l607k927K346L831rl397k328J734L635N83
1364C847m064j919K839L672k287m310J095N024l26m939j469N165L697m436n549
1379c960K510N158K86m312j970L000J718j818j678J161J825j05k645j829J729
1394i30L829L82l750l100K554M068j014m752k44M677P55m671k063M989L196m454
1410e28m611K673N240m47m970r95K713J848j107j320J21M86L71n41j588M55L373
$$ y = [-3157, -2947, 538, 1447, -1886, -4461, -1537, 2574, 1579, -3759, -5259, -89, 3733, 67, -4720, -2621, 2378, 1957, -3627, -4296, 988, 3659, -780, -4711, -1669, 2928, 2117, -1972, -3384, -275, 2654, 1291, -1951, -2381, 773, 2927, 601, -2815, -818, 3426, 2975, -1988, -3823, 1921, 5543, 1608, -3917, -1999, 3598, 3440, -821, -1735, 1906, 3986, 379, -2548, -202, 3629, 3620, 223, -2105, -371, 3264, 3847, -217, -2136, 703, 4375, 2088, -2222, -1127, 3897, 3571, -1368, -2837, 2328, 6025, 1589, -3960, -1450, 3708, 3994, -318, -2288, 712, 2430, 612, -1066, 95, 1920, 1815, -830, -2659, -930, 2899, 3281, -469, -3569, -1015, 3053, 2039, -2713, -2957, 1720, 2475, -2196, -4259, 730, 3926, -528, -5139, -2466, 2774, 2327, -2643, -3638, -925, 923, -184, -1504, -1383, -897, -526, -1067, -2655, -2200, 1173]
1427A173J387m408l821L477N423j215n982p2N023J104m749j421M672K539m261
1442a131l687K486M419l89l875j146K375K009M1j399j739O57J715O95k088m24
1458a481K735R74l625l005L690N416j638o852k99N729K255m208k467L819K394
1473C437l593k935L164L641j390l357p16K227J525J19j243j402p4K698Q24k338
1489E87j798K320K469k460l423K763N106k638o350K09O808J610m643k835L025
1504G50K359k577j698K260K402j666k874l17J839J567O16j722k929L59L313J376
1520C058l370k194K881K775k649l357K541M166k393n501O59O302P46n044k500
1535c880L152K326j222j843R86Q53j055j161Q27Q05O05J86j476k269P09L677P75
$$ y = [1173, 2560, -1848, -5669, -2192, 3231, 2016, -3966, -4038, 985, 2089, -2660, -4081, 591, 3130, -1131, -4818, -2332, 2087, 1698, -2177, -3323, -948, 1061, 1102, -297, -2036, -1379, 336, 1031, -1057, -1481, 1254, 2228, -1397, -4402, -712, 4704, 3066, -3786, -4085, 1644, 3899, -309, -2776, 1043, 3437, -156, -3091, 73, 3714, 2324, -1033, -1749, 478, 2003, 2122, 879, -523, -597, 2101, 2925, 587, -1211, 1109, 3578, 1118, -2305, 458, 5564, 2926, -3424, -3215, 3593, 5203, 560, -2275, 750, 3109, 532, -1166, 1094, 3496, 1830, -1044, -1361, 478, 2045, 2661, 939, -1990, -1631, 1682, 3058, -312, -2506, 375, 3150, 501, -2856, -315, 3851, 1458, -4043, -3384, 2918, 3664, -1380, -3880, -728, 1598, 376, -1467, -481, 372, -683, -1844, -1017, -212, 393, 579, -897, -3166, -2457, 1220, 1995]
1552A995l756k646L511L234k946l170K443M276k437n050J365N393n7m827j342
1567d014L551K161k158j879J023Q55k2n40N22j19M14O01p57k110P99L844L0m009
1585a808k010L821L100k626l218K085L279j520m246J376M444j8l753j559K998
1600C45K419j040k578m1J570P03l06q23n92Q98J387r35j998J186K854q6m124j268
1618b429M281K470l175l730J842M207j164l747P54L506K56l425j206K527J964
1633B931j293j783k16J001J179j97j631q04J204J701j057k676J023L207m65l521
1649a397r24L418K661l398l365J879L449n20l390k92K915L33k622r31K035J653
1665A504p41j943r61J421J967l00k355j187K037J745j362k527P87L246n28l109
$$ y = [1995, -1761, -4407, -896, 2338, -608, -3778, -1335, 2941, 504, -4546, -3181, 2212, 2155, -2672, -4014, -463, 1698, -460, -2339, -1316, -461, -483, -1023, -501, -620, -206, 395, -362, -2472, -1673, 2171, 2201, -1808, -3818, 3, 3103, 477, -2741, -656, 2623, 1103, -3143, -1767, 2677, 2659, -1094, -2653, 345, 2764, 1724, -854, -895, 675, 1378, 1072, 249, -343, 555, 1942, 1007, -991, 195, 3049, 2963, -1161, -2429, 1852, 4322, 1147, -2583, -741, 3466, 2302, -1445, -691, 2815, 3071, -354, -1560, 967, 2931, 1638, -145, -361, 640, 1819, 1622, -9, -813, 391, 2092, 1035, -1641, -618, 2589, 2124, -1397, -2321, 1097, 3758, 360, -3005, -1126, 2323, 1803, -1587, -1879, 1036, 1369, -1253, -2184, -149, 1504, 763, -1180, -2141, -720, 1247, 947, -1408, -2595, -558, 1187, -175, -2702, -1915, 1331, 803, -2306]
1681b306q72L225J896l031k704J962L249n69k877l82K007J037j003j933O01J866
1697A66J52j882r75J633J818l76k351r61K727J780k173k356J084L314l78l104
1713a882n81L070J667k503k416J605K905n24k682n03K529J334j394j917M30K039
1729A177R44j936j717J508K052L2k898m05K601J324j795k270J304K476o4k960
1745f27p25K584J826j641k933J297K617K45k930j115K338J799q00k865J97K217
1761A484J355k160k110J339K409l29k796m45K303J878j961k772R96L053k2k821
1777e99j088K060K361j746k783K62L131N47k664j606J957J738p83k659R6K610
1793H34R05k062k308J399K516k50k880j004K770K057j758k919M27L047N21k754
$$ y = [-2306, -3178, 47, 1943, -1088, -3792, -1830, 1419, 850, -2027, -2409, -402, 635, -368, -2301, -1700, 166, 318, -1564, -2539, -906, 912, 536, -1815, -2776, -49, 1731, -442, -2798, -1714, 1600, 1222, -1882, -2463, 607, 2274, -229, -2645, -1040, 1865, 1341, -1341, -1844, 685, 2019, 625, -1292, -862, 1177, 2121, 185, -1532, -24, 2028, 2060, -838, -1243, 1358, 2682, 887, -1383, -79, 2397, 2333, -627, -1352, 1232, 3058, 1417, -1516, -219, 2398, 2643, -287, -1402, 936, 2735, 1935, -930, -733, 1484, 2839, 679, -1431, -92, 2317, 1988, -808, -1253, 1050, 2928, 967, -1805, -809, 2244, 2222, -599, -1687, 373, 2734, 988, -1795, -1533, 1598, 2145, -519, -2125, -168, 1570, 787, -1872, -1776, 834, 1739, -323, -2631, -1232, 1284, 1034, -1846, -2850, -80, 1977, 219, -2700, -2273, 774, 1295, -1459]
1809a459j644K294K417j304k819N62K395Q53k719j595J691K915j298k409m23K389
1825a54J630k121j885M07L060j6k035j529J945K052j230k545J31L062J093k850
1841i85j889K044K968p09l722j2L167J659k469k413J569K645l38k347j097K595
1857F66J455j465k307Q50K599Q27k790j623J797K853q14l302J36K687J033j907
1873F95k041J529K527n05k952m91K904J562j871k434M08L312O8k865j275K247
1889H18K340j316l049J75K827P31k528j800J998K563j008l162l5K902J112k052
1905E16k433J277K711k57k815r21K298K016j900k390M45K696Q31l045j524J978
1921e17K153r05k508l07K615J333k597k417K096K721l79l345j047L285J708k342
$$ y = [-1459, -3103, -809, 1608, 304, -2515, -1953, 442, 1295, -1424, -3019, -1328, 1587, 289, -2120, -2543, -154, 1476, -645, -2530, -2123, 937, 921, -1114, -2643, -698, 1354, 124, -2421, -2290, 772, 1865, -985, -2874, -830, 2138, 1429, -2293, -2305, 862, 2521, 52, -2361, -792, 1853, 1515, -832, -1929, 666, 2121, 656, -1651, -801, 1798, 2625, -165, -1788, 9, 2862, 2048, -1254, -1118, 1569, 2602, 695, -1346, 183, 2710, 2205, -747, -1238, 1666, 3228, 1357, -1077, -669, 2643, 2711, -154, -1429, 818, 3158, 1842, -1207, -1032, 1795, 2526, -2, -1802, 196, 2759, 1751, -1411, -1446, 1456, 2568, 516, -1917, -640, 2071, 1814, -1001, -1922, 376, 2392, 492, -1898, -1453, 1243, 2074, -971, -2495, -517, 1636, 731, -1777, -2084, 531, 1864, -733, -3150, -1054, 1667, 1288, -2057, -3104, 181, 1889, -453]
1937d53k650J188K689J50k492r45J958J525j123k094j90L017R77k527k166J354
1953a782L036k64l189p44L042J821k751j969J294K719R2k932p33K464J523j421
1969B06k226J47K551Q39j895j209J008K205n43k487l41K470J865k023k793J046
1985a180L536q2l013j467K725K366k081k815J294L143m80k731m63K228J773j714
2001A039k124Q71J444R07j340j728L10K384M46j734j731K066K271j708l104N70
2017a161L925N89l895j877L511K294k274k764J142K690m86k346l18J815Q34j294
2033C85j358R0J593J409j365j950m56K788J271k410j824J464K865j768k987N62
2049a691L763L45m059j568K976K486j815k743N60K484l84j688l79J558Q55q41
$$ y = [-453, -3103, -1915, 774, 924, -1568, -2513, -555, 970, -153, -2247, -2437, 580, 1557, -970, -3136, -1782, 1254, 990, -2199, -2943, 99, 1920, -831, -2800, -1506, 1213, 1305, -1627, -2360, 104, 1627, 206, -2020, -1873, 678, 1517, -378, -1587, -579, 1626, 1083, -1404, -1745, 725, 2590, 567, -2226, -1180, 2356, 2274, -739, -2206, 519, 2885, 804, -2011, -717, 2426, 1946, -785, -1248, 980, 2753, 1039, -1085, -214, 1230, 2137, 797, -931, -621, 1763, 2209, 475, -1256, 810, 3081, 1373, -1731, -1161, 2764, 3353, -542, -2419, 1092, 3386, 1112, -1652, -510, 2180, 1694, -652, -970, 845, 1679, 385, -973, -883, 710, 2119, 754, -1196, -1652, 1136, 2407, -3, -1827, -363, 2502, 734, -2253, -1691, 2072, 2417, -1642, -3210, -234, 2252, 437, -2306, -1746, 738, 354, -1334, -1713, -155, 700, -141]
2065a41j284l48J495J082n27k314q19K926J773j986l290J734L139m42l263m58
2081b723L968J97l892j536L915K763k462l425P62L099Nj181n68O00L94j34k60
2098d78p98R32J426k98k726o43L219K056k256l692J864M250q90m004O6L508Q32
2115B368l221j349K840K344k205k766Q47K317J020j110j489K5M59J348j48j580
2131c00O21J356N7k564o20L283K038k702l813J764L839j03l918L1K813O74k552
2148i6j202K432J488j884k020P38J945M60j057j484m81J426J609m40j833q15K192
2165I78N91k068j336K609K171l034l187K202L731l33l793r73L260P49k122j268
2181a823J765J111j480j265O46J253K70l25j541p36J574J713n90k736j71K721
$$ y = [-141, -1425, -1773, -278, 804, 277, -2037, -2856, 70, 1843, -143, -3433, -1699, 1440, 998, -2265, -2723, 1245, 1442, -2450, -3986, -71, 2692, 230, -3195, -2433, 666, 671, -510, -1078, -478, -84, -218, -478, -1276, -344, 1082, 784, -1942, -2585, 634, 2690, 434, -3258, -1394, 2856, 1966, -2038, -1972, 1536, 2368, -853, -2202, 638, 2982, 777, -1989, -1142, 1175, 2195, 1085, -404, -379, 80, 1428, 1280, -300, 321, 1677, 1734, -830, -1450, 1833, 3871, 1169, -2644, -880, 2959, 2856, -1062, -1031, 1782, 2456, -96, -1298, 1134, 2622, 738, -1282, -544, 1401, 1861, 804, -680, -1161, 265, 1874, 1434, -399, -1214, 978, 1569, -499, -1835, 774, 2945, -89, -3276, -1074, 2657, 2324, -1469, -2442, 818, 1567, -555, -1823, -58, 1053, -427, -1692, -1046, 207, 477, 152, -1389, -2125, -551, 1162, 572, -2164, -2335, 386]
2197C86J212k486j719K285J895k228l039K539L316p91l925n25K530J708j343j250
2213a435J97J206k07p61o7Q82P38n10j147p71J855J895j453k925L23K844J310
2230A974k377j518J615J772j516j773J530K530r89l266N4K794J436j537j723J74
2246h20J134P75n39n39J06N89O18j777m49J544K169j575k960K83L059J288l142
$$ y = [386, 1598, -888, -2607, -322, 1573, -655, -3694, -1155, 2161, 1370, -2555, -3080, -550, 1158, -185, -1435, -1238, -32, -239, -1000, -1067, -185, 553, 43, -1104, -1875, -20, 1875, 422, -2503, -2180, 664, 1974, -403, -1921, -306, 1466, -50, -1823, -293, 2237, 1248, -2018, -1964, 830, 2266, 729, -994, -820, 314, 1089, 550, 11, 117, 706, 1324, -453, -902, 642, 2811, 1236, -1724, -1441, 1618, 2906, -236]
$$ [...]
8191A36
##END NTUPLES=NMR FID
##END=
