##TITLE=1H_Costus-oil-400-PE-pr2
 CDCl3, 8 sc, 
 10.1.2019
##JCAMPDX= 6.0         $$ Bruker NMR JCAMP-DX V2.0
##DATA TYPE= NMR FID
##DATA CLASS= NTUPLES
##ORIGIN= UXNMR, Bruker Analytische Messtechnik GmbH
##OWNER= root
$$ XWIN-NMR		Version 3.5
$$ Thu Jan 10 14:06:35 2019 Russian Standard Time (UT+4h)  she@DPX200
##.OBSERVE FREQUENCY= 200.1313
##.OBSERVE NUCLEUS= ^1H
##.DELAY= (6, 6)
##.ACQUISITION MODE= SIMULTANEOUS
##.ACQUISITION SCHEME= undefined
##.AVERAGES= 8
##.DIGITISER RES= 18
##SPECTROMETER/DATA SYSTEM= spect
##.PULSE SEQUENCE= zg30
##.SOLVENT NAME= CDCl3
##.SHIFT REFERENCE= (INTERNAL, CDCl3, 0, 15.7039)
##AUDIT TRAIL= $$ (NUMBER, WHEN, WHO, WHERE, WHAT)
$$ ##TITLE= Audit trail, XWIN-NMR		Version 3.5
$$ ##JCAMPDX= 5.01
$$ ##ORIGIN= Bruker BioSpin GmbH
$$ ##OWNER= she
$$ F:/spectra/data/she/nmr/H-F/1/audita.txt
$$ ##AUDIT TRAIL=  $$ (NUMBER, WHEN, WHO, WHERE, WHAT)
(   1,<2019-01-10 14:05:04.10 +0400>,<she>,<DPX200>,
      <created by zg, POWCHK disabled, PULCHK disabled
       configuration hash MD5:
       00 E9 B6 7A A2 85 ED C7 34 08 36 98 17 FE 4E 26
       data hash MD5: 16K
       8A 07 76 55 BB 93 F3 B7 E4 80 BB 13 DE C9 66 46>)
$$ ##END=
$$ 
$$ hash MD5
$$ 03 28 A1 9E 4D 20 8F 97 D1 89 52 6E C9 F4 33 24
##$RELAX= 
##$RELAX= 
##$RELAX= 
##$RELAX= 
##$RELAX= 
##$RELAX= 
$$ Bruker specific parameters
$$ --------------------------
##$DU= <F:/spectra>
##$EXPNO= 1
##$NAME= <H-F>
##$PROCNO= 1
##$TYPE= <nmr>
##$USER= <she>
##$AMP= (0..31)
100 100 100 100 100 100 100 100 100 100 100 100 100 100 100 100 100 100 
100 100 100 100 100 100 100 100 100 100 100 100 100 100 
##$AQSEQ= 0
##$AQ_mod= 1
##$AUNM= <au_zg>
##$AUTOPOS= <>
##$BF1= 200.13
##$BF2= 200.13
##$BF3= 200.13
##$BF4= 200.13
##$BF5= 200.13
##$BF6= 200.13
##$BF7= 200.13
##$BF8= 200.13
##$BYTORDA= 1
##$CFDGTYP= 0
##$CFRGTYP= 5
##$CHEMSTR= <none>
##$CNST= (0..31)
1 1 145 1 1 1 1 1 1 1 1 1 1 1 1 1 1 1 1 1 1 1 1 1 1 1 1 1 1 1 1 1 
##$CPDPRG= <>
##$CPDPRG1= <>
##$CPDPRG2= <>
##$CPDPRG3= <>
##$CPDPRG4= <mlev>
##$CPDPRG5= <mlev>
##$CPDPRG6= <mlev>
##$CPDPRG7= <mlev>
##$CPDPRG8= <mlev>
##$CPDPRGB= <>
##$CPDPRGT= <>
##$D= (0..31)
0 1.2 0 0 0 0 0 0 0 0 0 0.03 0 0 0 0 0 0 0 0 0 0 0 0 0 0 0 0 0 0 0 0 
##$DATE= 1547114703
##$DBL= (0..7)
120 120 120 120 120 120 120 120 
##$DBP= (0..7)
150 150 150 150 150 150 150 150 
##$DBP07= 0
##$DBPNAM0= <>
##$DBPNAM1= <>
##$DBPNAM2= <>
##$DBPNAM3= <>
##$DBPNAM4= <>
##$DBPNAM5= <>
##$DBPNAM6= <>
##$DBPNAM7= <>
##$DBPOAL= (0..7)
0.5 0.5 0.5 0.5 0.5 0.5 0.5 0.5 
##$DBPOFFS= (0..7)
0 0 0 0 0 0 0 0 
##$DE= 6
##$DECBNUC= <off>
##$DECIM= 24
##$DECNUC= <off>
##$DECSTAT= 4
##$DIGMOD= 1
##$DIGTYP= 9
##$DL= (0..7)
0 120 120 120 120 120 120 120 
##$DP= (0..7)
150 150 150 150 150 150 150 150 
##$DP07= 0
##$DPNAME0= <>
##$DPNAME1= <>
##$DPNAME2= <>
##$DPNAME3= <>
##$DPNAME4= <>
##$DPNAME5= <>
##$DPNAME6= <>
##$DPNAME7= <>
##$DPOAL= (0..7)
0.5 0.5 0.5 0.5 0.5 0.5 0.5 0.5 
##$DPOFFS= (0..7)
0 0 0 0 0 0 0 0 
##$DQDMODE= 0
##$DR= 18
##$DS= 0
##$DSLIST= <SSSSSSSSSSSSSSS>
$$ [...]
##$SUBNAM2= <"">
##$SUBNAM3= <"">
##$SUBNAM4= <"">
##$SUBNAM5= <"">
##$SUBNAM6= <"">
##$SUBNAM7= <"">
##$SUBNAM8= <"">
##$SUBNAM9= <"">
##$SW= 24.933730806125
##$SWIBOX= (0..15)
0 0 2 0 0 0 0 0 0 0 0 0 0 0 0 0 
##$SW_h= 4990.01996007984
##$TD= 16384
##$TD0= 1
##$TE= 0
##$TE2= 300
##$TE3= 300
##$TEG= 300
##$TL= (0..7)
0 120 120 120 120 120 120 120 
##$TP= (0..7)
150 150 150 150 150 150 150 150 
##$TP07= 0
##$TPNAME0= <>
##$TPNAME1= <>
##$TPNAME2= <>
##$TPNAME3= <>
##$TPNAME4= <>
##$TPNAME5= <>
##$TPNAME6= <>
##$TPNAME7= <>
##$TPOAL= (0..7)
0.5 0.5 0.5 0.5 0.5 0.5 0.5 0.5 
##$TPOFFS= (0..7)
0 0 0 0 0 0 0 0 
##$TUNHIN= 0
##$TUNHOUT= 0
##$TUNXOUT= 0
##$USERA1= <user>
##$USERA2= <user>
##$USERA3= <user>
##$USERA4= <user>
##$USERA5= <user>
##$V9= 5
##$VALIST= <valist>
##$VCLIST= <CCCCCCCCCCCCCCC>
##$VD= 0
##$VDLIST= <DDDDDDDDDDDDDDD>
##$VPLIST= <PPPPPPPPPPPPPPP>
##$VTLIST= <TTTTTTTTTTTTTTT>
##$WBST= 1024
##$WBSW= 4
##$XGAIN= (0..3)
0 0 0 0 
##$XL= 0
##$YL= 0
##$YMAX_a= 122449
##$YMIN_a= -215789
##$ZGOPTNS= <>
##$ZL1= 120
##$ZL2= 120
##$ZL3= 120
##$ZL4= 120
##$ABSF1= 10
##$ABSF2= 0
##$ABSG= 5
##$ABSL= 3
##$ALPHA= 0
##$AQORDER= 0
##$ASSFAC= 0
##$ASSFACI= 0
##$ASSFACX= 0
##$ASSWID= 0
##$AUNMP= <proc_1d>
##$AZFE= 0.1
##$AZFW= 0.1
##$BCFW= 1
##$BC_mod= 2
##$BYTORDP= 1
##$COROFFS= 0
##$CY= 11.3945322036743
##$DATMOD= 1
##$DC= 2
##$DFILT= <>
##$DTYPP= 0
##$F1P= 18.9103706918063
##$F2P= -1.10871071338519
##$FCOR= 0.5
##$FTSIZE= 0
##$FT_mod= 4
##$GAMMA= 1
##$GB= 0.15
##$INTBC= 1
##$INTSCL= 1
##$ISEN= 128
##$LB= 0.24
##$LEV0= 0
##$LPBIN= 0
##$MAXI= 10000
##$MC2= 0
##$MEAN= 0
##$ME_mod= 0
##$MI= 1.114404
##$NCOEF= 0
##$NC_proc= 0
##$NLEV= 6
##$NOISF1= 3.799351
##$NOISF2= 2.8
##$NSP= 1
##$NTH_PI= 0
##$NZP= 0
##$OFFSET= 15.70392
##$PC= 1
##$PHC0= -8871.039
##$PHC1= 15.60006
##$PH_mod= 1
##$PKNL= yes
##$PPARMOD= 0
##$PSCAL= 0
##$PSIGN= 0
##$REVERSE= no
##$SF= 200.130013532006
##$SI= 16384
##$SIGF1= 3
##$SIGF2= 2
##$SINO= 400
##$SIOLD= 16384
##$SREGLST= <1H.CDCl3>
##$SSB= 0
##$STSI= 0
##$STSR= 0
##$SW_p= 3612.71676300578
##$SYMM= 0
##$S_DEV= 0
##$TDeff= 0
##$TDoff= 0
##$TI= <>
##$TILT= no
##$TM1= 0
##$TM2= 0
##$TOPLEV= 0
##$USERP1= <user>
##$USERP2= <user>
##$USERP3= <user>
##$USERP4= <user>
##$USERP5= <user>
##$WDW= 1
##$XDIM= 8192
##$YMAX_p= 0
##$YMIN_p= 0
$$ End of Bruker specific parameters
$$ ---------------------------------
##NTUPLES= NMR FID
##VAR_NAME=  TIME,          FID/REAL,        FID/IMAG
##SYMBOL=    X,             R,               I
##VAR_TYPE=  INDEPENDENT,   DEPENDENT,       DEPENDENT
##VAR_FORM=  AFFN,          ASDF,            ASDF
##VAR_DIM=   8192,          8192,            8192
##UNITS=     SECONDS,       ARBITRARY UNITS, ARBITRARY UNITS
##FACTOR=    0.0002004,     1,               1
##FIRST=     0,             0,               0
##LAST=      1.6414764,     0,               0
##MIN=       0,             -215789,         0
##MAX=       1.6414764,     122449,          0
$$ Real data points
##PAGE= N=1
##DATA TABLE= (X++(R..R)), XYDATA
$$ plain form
0 0 0 0 0 0 0 0 0 -8 8 -8 8 -8 11 -16 16 -24 27 -32 40 -48 56 -64 72 -85 96 -111 127 -144 163 -185 209
31 209 -234 262 -293 329 -366 406 -451 500 -555 616 -681 753 -835 925 -1026 1140 -1268 1417
49 1417 -1589 1793 -2035 2331 -2704 3187 -3844 4795 -6300 9057 -15793 69060 21960 -148270
63 -148270 -89254 48050 122449 21369 -104923 -127330 -17749 78600 79945 6226 -33142
74 -33142 -14250 25291 25462 1351 -18292 -17298 -21558 -31898 -30244 4281 40255 40626 3492 -20094
88 -20094 3414 46948 49159 -2456 -56071 -55036 -11071 15257 -8298 -47212 -49727 -11261 22115
101 22115 17490 -11514 -26311 -14616 5531 10967 -2059 -20444 -27975 -17617 5022 18516 5567
114 5567 -24568 -36772 -10566 27994 30054 -13717 -54182 -41779 10867 37913 3453 -52421
$$ packed form
0@%%%%%%%qJ6j6J6j6J9k7L2m0N1n9P2q8J04j20J36j57J81k07K38k71L07l48L94
31B09m43M96n55O22o95P72q57R51j055J171j297J434j588J760j951K166k408K685
49A417l006L382l828M366n035N891p031Q639j1095J5357k4850Q4853m7100j70230
63a48270N9016J37304P4399j01080j26292k2407J09581R6349J345p3719l9368
74c3142J8892L9541J71k4111j9643R94m260j0340J654L4525L5974L71l7134k3586
88b0094K3508M3534K211n1615n3615J035M3965K6328k3555l8914k515L8466L3376
101B2115m625k9004j4797J1695K0147N436j3026j8385p531J0358K2639J3494j2949
114E567l0135j2204K6206L8560K060m3771m0465J2403N2646K7046l4460n5874
$$ plain form
126 -52421 -61135 -12340 33386 20034 -31102 -50722 -10287 40665 39123 -7439 -32361 709
138 709 47436 40280 -16615 -51148 -19038 35817 35717 -21875 -61038 -27082 38867 52025 -1854
151 -1854 -48440 -26891 30915 46154 -310 -43775 -26750 27246 46551 11889 -23152 -6116
163 -6116 43198 59617 22586 -19057 -13249 27724 44743 11431 -31246 -31387 8372 34782 15354
176 15354 -21083 -26575 3643 28888 17409 -11883 -19750 2426 24106 20443 3905 1770 17668
189 17668 29944 24627 12172 7779 10172 9560 3981 726 798 -1763 -8212 -8104 3289 11797 2004
204 2004 -17716 -22369 -3864 12026 507 -26954 -33546 -5968 23884 20689 -8122 -19178 8182
217 8182 41124 35126 -5773 -30725 -9926 25384 21196 -23122 -52796 -28321 19274 27644 -14261
$$ packed form
126e2421q714M8795M5726j3352n1136j9620M0435N0952j542m6562k4922L3070
138G09M6727p156n6895l4533L2110N4855j00n7592l9163L3956O5949J3158n3879
151a854m6586K1549N7806J5239m6464m3465J7025N3996J9305l4662l5041J7036
163f116M9314J6419l7031m1643N808M0973J7019l3312m2677j41L9759K6410j9428
176A5354l6437n492L0218K5245j1479k9292p867K2176K1680l663j6538k135J5898
189A7668J2276n317j2455m393K393o12n579l255P2k561o449J08J1393Q508r793
204B004j9720m653J8505J5890j1519k7461o592K7578K9852l195k8811j1056K7360
217H182L2942n998m0899k4952K0799L5310m188m4318k9674K4475M7595Q370m1905
$$ plain form
230 -14261 -49725 -30631 16973 28619 -12348 -53014 -39598 6548 23572 -9225 -41382 -24355
242 -24355 22400 39018 5951 -26649 -13601 27279 37301 -1530 -41229 -32743 9011 26281
254 26281 -5130 -44214 -39565 3487 30660 9182 -30294 -36784 -4007 24470 13975 -18695
266 -18695 -30433 -7921 19189 20153 647 -9551 1977 18656 19456 7560 -1227 1129 4546
279 4546 2088 -2265 -2530 -1325 -2826 -4837 -972 5951 6821 -100 -3502 3868 12995 10538 -1144
294 -1144 -5168 7130 20995 16396 -1048 -5793 11783 29535 21419 -5598 -16628 3044 27237
307 27237 20065 -13030 -29618 -7255 27066 27920 -5998 -29197 -8423 30314 36321 947 -28977
320 -28977 -13035 26965 36105 2086 -29670 -15038 26724 39643 5694 -29773 -19586 20884
$$ packed form
230a4261l5464J9094M7604J1646m0967m0666J3416M6146J7024l2797l2157J7027
242b4355M6755J6618l3067l2600J3048M0880J0022l8831l9699Q486M1754J7270
254B6281l1411l9084M649M3052K7173k1478l9476o490L2777K8477j0495l2670
266a8695j1738K2512K7110R64j9506j0198J1528J6679Q00j1896q787K356L417
279D546k458m353k65J205j501k011L865O923Q70o921l402P370R127k457j1682
294a144m024J2298J3865m599j7444m745J7576J7752q116k7017j1030J9672K4193
307B7237p172l3095j6588K2363L4321Q54l3918k3199K0774L8737O007l5374k9924
320b8977J5942M0000R140l4019l1756J4632M1762J2919l3949l5467J0187M0470
$$ plain form
332 20884 35637 1123 -38805 -33610 7826 29244 2005 -36382 -33836 7395 34686 15496
344 15496 -21547 -26448 6415 32596 17867 -16813 -27456 -3411 21051 13631 -14165 -25050
356 -25050 -7371 13325 10177 -11449 -22600 -13145 739 -973 -14108 -21504 -15047 -5398 -3561
369 -3561 -5846 -5283 -729 1671 1239 2759 6687 6972 141 -6160 -3543 3904 3895 -6166 -13305 -6757
385 -6757 4323 3363 -9502 -16714 -7039 6001 1681 -17883 -25735 -7545 14837 11376 -13656 -24974
399 -24974 -367 32809 33089 -1429 -25831 -7332 32310 39619 2868 -32632 -22487 19966 38874
412 38874 10201 -28230 -27241 10014 33142 11697 -24664 -29355 657 23595 9722 -18737 -20666
425 -20666 8693 30670 18553 -7684 -9329 16653 34129 18167 -10719 -15469 8995 28402
$$ packed form
332B0884J4753l4514l9928N195M1436K1418k7239l8387K546M1231K7291j9190
344A5496l7043m901L2863K6181j4729l4680j0643K4045K4462p420k7796j0885
356b5050J7679K0696l148k1626j1151R455J3884j712j3135p396O457R649J837
369c561k285N63M554K400m32J520L928K85o831o301K617P447rj0061p139O548
385f757J1080r60j2865p212R675J3040m320j9564p852J8190K2382l461k5032j1318
399b4974K4607L3176K80l4518k4402J8499L9642P309l6751l5500J0145M2453J8908
412C8874k8673l8431R89L7255K3128k1445l6361m691L0012K2938j3873k8459j929
425b0666K9359K1977j2117k6237j645K5982J7476j5962k8886m750K4464J9407
$$ plain form
437 28402 15743 -12233 -18401 4690 25904 16951 -11053 -21897 -5299 15035 11541 -10612 -22704
450 -22704 -10281 10277 15968 3936 -6898 -3358 9433 16731 12077 2851 -3431 -3555 702 6328
464 6328 6742 -397 -9873 -10662 360 11693 7467 -9518 -19548 -9619 8266 9961 -8171 -22939
478 -22939 -13896 8358 15151 -1908 -19345 -12293 10693 18518 852 -19087 -13158 10629 18990
491 18990 -955 -23396 -18219 7138 16937 -4493 -28576 -22542 6809 20610 65 -25860 -19854
504 -19854 12243 28443 5402 -26653 -26061 7009 27554 7289 -27988 -31000 3120 32176 19903
517 19903 -15363 -26839 -1348 26417 18553 -14793 -32519 -15377 10696 12412 -8527 -19076
529 -19076 -3744 18681 21697 4650 -6687 1312 13735 10698 -6016 -15837 -7336 5802 8347
$$ packed form
437B8402j2659k7976o168K3091K1214q953k8004j0844J6598K0334l494k2153j2092
450b2704J2423K0558N691j2032j0834L540J2791P298m654r226o282j24M257N626
464F328M14p139r476p89J1022J1333m226j6985j0030R929J7885J695j8132j4768
478b2939R043K2254O793j7059j7437P052K2986P825j7666j9939N929K3787Q361
491A8990j9945k2441N177K5357R799k1430k4083O034K9351J3801k0545k5925O006
504a9854L2097J6200k3041l2055N92L3070K0545k0265l5277l012L4120K9056j2273
517A9903l5266j1476K5491K7765p864l3346j7726J7142K6073J716k0939j0549
529a9076J5332K2425L016j7047j1337P999J2423l037j6714r821Q501J3138K545
$$ plain form
542 8347 -336 -4392 3454 13395 13577 4720 -3296 -4633 -3293 -4894 -7677 -7950 -5152 -1394 2531 8326
558 8326 15118 16385 10809 5970 6802 10328 5917 -6701 -13858 -6227 8272 10168 -1634 -9570 2261
573 2261 20572 20872 -1090 -21104 -15076 6319 11827 -8854 -29488 -20305 11167 28054 12266
586 12266 -11322 -8759 17389 32278 12755 -17501 -22383 1873 19742 6939 -19342 -21985 3811
599 3811 25512 14987 -13599 -22413 -2737 16508 6421 -21232 -29966 -8930 13871 9867 -11987
612 -11987 -19088 1015 21960 16916 -6823 -17642 -1735 17980 14868 -7916 -19605 -6133 14488
625 14488 15317 -3680 -18113 -11322 5249 9443 -3471 -16552 -14580 -1703 6268 2543 -5098 -7059
639 -7059 -2210 2302 3438 558 -2631 -4493 -3197 1765 7403 7732 2169 -1455 2245 9456 8533 -2199
$$ packed form
542H347q683m056P846R941J82q857q016j337J340j601k783k73K798L758L925N795
558H326O792J267n576m839Q32L526m411j2618p157P631J4499J896j1802p936J1831
573B261J8311L00k1962k0014O028K1395N508k0681k0634R183L1472J6887j5788
586A2266k3588K563K6148J4889j9523l0256m882K4256J7869j2803k6281k643K5796
599C811K1701j0525k8586q814J9676J9245j0087k7653q734K1036K2801m004k1854
612a1987p101K0103K0945n044k3739j0819J5907J9715l112k2784j1689J3472K0621
625A4488Q29j8997j4433O791J6571M194j2914j3081J972J2877P971l725p641j961
639g059M849M512J136k880l189j862J296M962N638L29n563l624L700P211r23j0732
$$ plain form
655 -2199 -12291 -9635 1745 5458 -4573 -14335 -8382 8945 16288 4312 -10703 -8190 8126
668 8126 15201 560 -17849 -15751 5029 18324 6533 -11941 -9919 12855 26422 11869 -13407
681 -13407 -16670 3794 18982 5568 -19871 -23196 1771 23591 15754 -10324 -17968 3261 24977
694 24977 17068 -12329 -25861 -8151 16376 14896 -8897 -21743 -5877 19307 21997 595 -15512
707 -15512 -7775 11671 14818 -3031 -18396 -12912 5051 12662 3438 -7587 -4445 7861 13466
720 13466 5675 -5108 -7320 -1535 2498 -713 -5876 -6266 -2230 1717 2991 2473 1336 -347 -2060
735 -2060 -1854 -224 -600 -4069 -6959 -4337 2586 5756 1904 -2101 482 8413 10272 1324 -7677 -4982
751 -4982 5824 8421 -3597 -14799 -9092 8602 15682 1076 -16166 -13190 7947 19046 3511
$$ packed form
655b199j0092K656J1380L713j0031r762N953J7327P343j1976j5015K513J6316
668H126P075j4641j8409K098K0780J3295j1791j8474K022K2774J3567j4553k5276
681a3407l263K0464J5188j3414k5439l325K4967K1820p837k6078p644K1229K1716
694B4977p909k9397j3532J7710K4527j480k3793j2846J5866K5184K690k1402j6107
707a5512P737J9446L147j7849j5365N484J7963P611r224j1025L142J2306N605
720A3466p791j0783k212N785M033l211n163l90M036L947J274n18j137j683j713
735b060K06J630l76l469k890K622O923L170l852m005K583P931J859q948r001K695
751d982J0806K597j2018j1202N707J7694P080j4606j7242K976K1137J1099j5535
$$ plain form
764 3511 -19800 -21029 1627 19646 10535 -13398 -19055 1021 22324 17573 -5615 -16811 -1894
777 -1894 17584 14803 -5870 -17264 -4495 14191 12664 -6900 -17396 -4270 14512 13114 -8122
790 -8122 -21048 -8271 12684 14056 -5785 -20854 -11038 11250 18411 2686 -13913 -10926 6454
803 6454 15540 6998 -7529 -9863 -141 8288 5940 -1767 -4624 -1402 2702 2277 -235 -1822 -1819 -2616
819 -2616 -3422 -3487 -1981 -1398 -2634 -3475 -1785 752 1510 378 -350 1064 2232 -143 -2765 -1441 3314
836 3314 4460 -1048 -6087 -2197 7866 10718 1130 -9857 -6968 6782 12878 933 -15234 -14386
850 -14386 3056 14756 4798 -14396 -16283 2466 18562 10669 -10482 -17057 -754 17397 13291
863 13291 -7579 -17425 -3406 16528 16531 -2607 -14658 -3325 15692 17569 54 -14143 -6755
$$ packed form
764C511k3311j229K2656J8019r111k3933n657K0076K1303m751k3188j1196J4917
777a894J9478k781k0673j1394J2769J8686j527j9564j0496J3126J8782j398k1236
790h122j2926J2777K0955J372j9841j5069R816K2288P161j5725j6599K987J7380
803F454R086q542j4527k334R722Q429k348p707k857L222M104m25k512j587Lp97
819b616q06o5J506N83j236q41J690K537P58j132p28J414J168k375k622J324M755
836C314J146n508n039L890J0063K852r588j0987K889J3750O096j1945j6167Q48
850a4386J7442J1700r958j9194j887J8749J6096p893k1151o575J6303J8151m106
863A3291k0870r846J4019J9934Lj9138j2051J1333J9017J877j7515j4197P388
$$ plain form
876 -6755 11173 14815 -911 -15461 -10077 6968 12870 149 -13224 -9406 5915 12375 3197
889 3197 -8360 -6865 5132 10796 3917 -5186 -4465 3904 8457 3734 -2420 -1520 4945 7739 3471
904 3471 -1911 -2262 1884 4223 212 -5445 -6359 -3213 245 368 -2585 -4638 -4087 -325 3880 4310
920 4310 323 -4611 -5520 500 6900 5814 -3542 -10440 -4735 8515 13151 2940 -11457 -11078 4068
935 4068 13772 5005 -13030 -18488 -4108 10320 6374 -10125 -17869 -6047 9331 8864 -6028 -14070
949 -14070 -4938 8734 8149 -4930 -12215 -3613 9678 9019 -4933 -12502 -3218 11384 10327 -5013
963 -5013 -15651 -6725 10170 12582 -2987 -16945 -10395 7590 13861 596 -14235 -12288 3949
976 3949 13312 5255 -8514 -9791 1490 11281 6958 -3303 -6934 -222 6534 4728 -1296 -3654
$$ packed form
876f755J7928L642j5726j4550N384J7045N902j2721j3373L818J5321O460r178
889C197j1557J495J1997N664o879r103P21Q369M553m723o154R00O465K794m268
904C471n382l51M146K339m011n657r14L146L458J23k953k053N51L762M205M30
920D310l987m934r09O020O400j086r356o898N705J3250M636j0211j4397L79J5146
935D068R704q767j8035n458J4380J4428l946j6499p744J1822J5378m67j4892q042
949a4070R132J3672n85j3079p285Q602J3291o59j3952p569R284J4602j057j5340
963e013j0638Q926J6895K412j5569j3958O550J7985O271j3265j4831J947J6237
976C949R363q057j3769j277J1281R791m323j0261l631O712O756j806o024k358
$$ plain form
990 -3654 631 4700 3974 -51 -523 2428 4696 3348 245 -965 1342 4141 4113 2069 394 806
1006 806 2744 4345 4576 2038 -1575 -3023 -67 5088 5157 -491 -5609 -2183 7285 11552 4551 -5933
1022 -5933 -6295 4357 12379 6983 -6859 -9967 1272 14242 11857 -1738 -8534 219 11731 10346
1036 10346 -3978 -13170 -7457 3942 5102 -5862 -13177 -5872 7161 9014 -1495 -9808 -4337
1049 -4337 7623 8635 -3768 -13947 -8850 5576 10527 694 -9659 -5476 8509 14397 4607
1062 4607 -9420 -11440 -1855 4235 -3030 -14055 -15643 -6034 2126 589 -6456 -7302 -1192 3658 868
1077 868 -6120 -8336 -3510 871 92 -4224 -4430 836 6595 7333 2743 -736 -1556 330 1290 -1470
1093 -1470 -5764 -8964 -8292 -3376 540 997 -3303 -6207 -3714 2618 5059 -331 -7470 -7589 390 7770
$$ packed form
990c654M285M069p26m025m72K951K268j348l103j210K307K799k8k044j675M12
1006H06J938J601K31k538l613j448K956N155O9n648n118L426R468M267p001j0484
1022e933l62J0652Q022n396j3842l108J1239J2970k385j3595o796Q753J1512j385
1036A0346j4324r192N713J1399J160j0964p315P305J3033J853j0509q313N471
1049d337J1960J012j2403j0179N097J4426M951r833j0353M183J3985N888r790
1062D607j4027k020R585O090p265j1025j588R609Q160j537p045q46O110M850k790
1077H68o988k216M826M381p79m316k06N266N759P38m590l479q20J886R60k760
1093a470m294l200O72M916L916M57m300k904K493O332K441n390p139j19P979P380
$$ plain form
1109 7770 6708 -574 -2668 4791 13305 12295 2095 -4697 -553 7480 6885 -2013 -8076 -2819 6397
1124 6397 7801 -168 -5865 -1386 6853 7144 -2498 -8559 -3174 7567 9734 888 -4811 1963 14495
1139 14495 17115 6036 -4461 -2261 9451 13300 3156 -8906 -8150 4340 12821 7515 -3882
1152 -3882 -6382 2129 8936 4977 -5209 -9140 -3181 4161 3107 -2822 -4012 2171 9116 8113 1485
1167 1485 -2389 383 4232 3307 -3054 -7692 -5952 -1018 2039 903 -1914 -2776 -1630 849 803 -1425
1183 -1425 -5391 -8020 -6498 -3071 -586 -1193 -3425 -2598 964 3850 2393 -2576 -5364 -3785 -1791
1198 -1791 -4298 -8597 -9092 -4492 811 -866 -5959 -7166 -1228 4376 1311 -7234 -11300 -5288 3569
1213 3569 3404 -4686 -9111 -2636 7965 9857 556 -7490 -4890 4204 6299 -3055 -12576 -10114 686
$$ packed form
1109G770j062p282k094P459Q514j010j0200o792M144Q033n95q898o063N257R216
1124F397J404p969n697M479Q239K91r642o061N385J0741K167q846n699O774J2532
1139A4495K620j1079j0497K200J1712L849j0144j2062P56J2490Q481n306j1397
1152c882k500Q511O807l959j0186l931N959P342j054n929j190O183O945j003o628
1167A485l874K772L849r25o361m638J740M934L057j136k817q62J146K479m6k228
1183a425l966k629J522L427K485o07k232Q27L562K886j457m969k788J579J994
1198a791k507m299m95M600N303j677n093j207N938N604l065q545m066O012Q857
1213C569j65q090m425O475J0601J892r301q046K600R094K095r354r521K462J0800
$$ plain form
1228 686 6106 -68 -8492 -7479 2252 8468 3998 -5513 -6955 933 7307 5042 -1893 -2359 4911
1243 4911 11410 9025 2360 738 5894 9836 5671 -2713 -5323 -28 5768 3875 -3182 -6156 -1249
1258 -1249 5926 7524 1843 -3912 -2778 3045 7281 6029 1729 -341 2801 8594 11408 9320 5025
1273 5025 2819 4379 7451 7484 3103 -2487 -3530 -492 3027 1159 -3180 -5232 -2069 1779 1774 -2261
1289 -2261 -4719 -2281 1775 2509 -273 -2471 625 5773 6368 2375 -354 2291 6197 5244 -1383 -5902
1305 -5902 -3202 2124 1477 -6317 -11809 -7627 -5 1504 -6034 -12701 -9854 -98 3571 -2643 -11076
1320 -11076 -9938 -144 6784 3141 -5974 -7452 272 7705 5639 -3423 -8099 -3815 2830 1959 -5472
1335 -5472 -10259 -7445 -1339 16 -4247 -8614 -7158 -2161 -185 -2579 -5409 -5087 -1911 727 381
$$ packed form
1228F86N420o174q424J013R731O216m470r511j442P888O374k265o935m66P270
1243D911O499k385o665j622N156L942m165q384k610N295N796j893p057k974M907
1258a249P175J598n681n755J134N823M236j252m300k070L142N793K814k088m295
1273E025k206J560L072L3m381n590j043L038L519j868m339k052L163L848nm035
1289b261k458K438M056P34k782k198L096N148N95l993k729K645L906r53o627m519
1305e902K700N326o47p794n492M182P622J509p538o667K847R756L669o214q433
1320a1076J138R794O928l643r115j478P724P433k066r062m676M284O645q71p431
1335e472m787K814O106J355m263m367J456M997J976k394k830L22L176K638l46
$$ plain form
1350 381 -517 -164 1222 3048 2585 2227 1652 1643 1007 -800 -919 -723 -523 -694 -1097 -1439 -899 196 1499
1369 1499 2214 1278 -250 -857 1065 4392 4997 2571 -45 1704 6921 10133 6997 227 -1967 3103
1385 3103 8412 7146 -787 -6282 -2745 5249 8622 3062 -3652 -3225 4344 9239 6149 -600 -1839
1400 -1839 2701 7000 6115 2475 1048 4500 7076 5162 1684 1312 3602 4197 -35 -5139 -4436 470
1416 470 3278 -570 -6327 -6198 503 5936 4267 -2877 -6310 -1636 5185 5989 719 -4067 -2060 3684
1432 3684 6319 3623 -1482 -3099 -938 911 -1024 -4384 -6782 -7015 -5750 -5154 -5434 -5680 -4948 -4394
1448 -4394 -3876 -3423 -2735 -2376 -1739 -1330 -1462 -1524 -323 1055 2520 1653 -296 -1692 -937 665 111 -3538
1466 -3538 -7245 -7979 -4959 -2154 -2995 -7319 -9149 -6361 -1109 803 -2219 -6006 -4750 92 4126
$$ packed form
1350C81q98L53J386J826m63l58n75ro36j807j19J96K00j71m03l42N40J095J303
1369A499P15r36j528o07J922L327O05k426k616J749N217L212l136o770k194N070
1385C103N309j266p933n495L537P994L373n560o714M27P569M895l090o749j239
1400a839M540M299q85l640j427L452K576j914l478l72K290N95m232n104P03M906
1416D70K808l848n757J29O701N433j669p144l433M674O821Q04n270m786K007N744
1432C684K635k696n105j617K161J849j935l360k398k33J265N96k80k46P32N54
1448d394N18M53O88L59O37M09j32o2J201J378J465q67j949j396P55J602n54l649
1466c538l707p34L020K805q41m324j830K788N252J912l022l787J256M842M034
$$ plain form
1481 4126 2855 -397 -300 3264 6189 5599 2803 2032 3473 3786 1086 -1668 -1576 867 1098 -2784 -6083
1498 -6083 -4123 873 3074 -531 -5158 -4454 1681 7035 5526 102 -1802 2883 9688 10971 6219
1513 6219 1054 2133 7499 9928 6978 1025 -644 1820 4066 3366 -20 -2003 -1545 -106 274 -39
1529 -39 -103 360 776 900 2018 3125 4128 3973 3399 3154 3654 4269 4583 3811 2032 1228 1153 1688 2343 552
1549 552 -1907 -3531 -2891 -1048 -756 -2252 -4768 -4361 -1691 1138 1200 -1395 -2831 -784 2204 2839 -172
1566 -172 -2833 -2708 186 1625 -724 -4037 -4266 -1367 560 -2135 -6195 -6866 -4288 -2158 -3125 -6689
1582 -6689 -6885 -3505 -11 -1 -2406 -3568 -1099 1980 1874 -1496 -3922 -3064 -379 698 -1436 -3493
1598 -3493 -3395 -1244 -251 -1697 -4284 -4640 -3966 -2464 -2813 -4609 -3752 -1668 557 1174 957 1387 2664
$$ packed form
1481D126j271l252R7L564K925n90k796p71J441L13k700k754R2K443K31l882l299
1498f083J960M996K201l605m627P04O135N354j509n424j904M685O805J283m752
1513F219n165J079N366K429k950n953j669K464K246p00l386j983M58J439L80l13
1529c9o4M63M16J24J118J107J003j55n74k45N00O15L14p72j779q04p5N35O55j791
1549E52k459j624O40J843K92j496k516M07K670K829O2k595j436K047K988O35l011
1566a72k661J25K894J439k349l313k29K899J927k695m060o71K578K130r67l564
1582f689j96L380L494J0k405j162K469L079j06l370k426Q58K685J077k134k057
1598c493R8K151R93j446k587l56O74J502l49j796Q57K084K225O17k17M30J277
$$ plain form
1615 2664 3928 3047 2065 1044 1676 2075 1573 900 110 559 1600 1851 608 -1114 -2665 -1763 -804 -630
1633 -630 -2027 -2615 -1207 2016 4458 4806 3776 3797 5155 7250 7165 4561 2581 2533 4678 5412 3900
1650 3900 2001 1154 2985 3599 2227 -1050 -2817 -1801 -938 -1657 -3222 -3732 -722 2746 3511 2110
1666 2110 1326 3496 6434 6399 3555 1146 1582 4118 4668 2766 633 192 1859 3014 1117 -2117
1682 -2117 -4143 -4004 -3887 -4273 -5522 -6158 -4721 -2666 -1093 -1217 -969 -148 1170 1245 546 -158 31 634
1700 634 452 -145 -284 389 880 150 -1185 -2387 -3363 -3631 -4374 -5792 -6832 -7085 -5715 -4024 -3234 -3329
1718 -3329 -2974 -2088 -129 1178 109 -1687 -2043 -751 1363 1572 -394 -1116 6 1863 2275 575
1734 575 -1909 -3321 -2303 -1390 -2161 -3785 -4793 -3595 -1054 599 121 -534 -21 1980 3016 1996
$$ packed form
1615B664J264q81r82j021O32L99n02o73p90M49J041K51j243j722j551R02R59J74
1633f30j397n88J408L223K442L48j030K1J358K095q5k604j980m8K145P34j512
1650C900j899q47J831O14j372l277j767J016Q63p19j565n10L010L468P65j401
1666B110p84K170K938l5k844k409M36K536N50j902k133m41J667J155j897l234
1682b117k026J39J17l86j249o36J437K055J573j24K48Q21J318P5o99p04J89O03
1700F34j82n97j39O73M91p30j335j202r76k68p43j418j040k53J370J691P90r5
1718c329L55Q86J959J307j069j796l56J292K114K09j966p22J122J857M12j700
1734E75k484j412J018R13p71j624j008J198K541J653m78o55N13K001J036j020
$$ plain form
1750 1996 912 400 1543 2557 2413 1951 2048 2661 3043 2582 2007 1418 724 126 -339 -813 -189 663 544
1769 544 817 1105 2084 3407 4013 3284 2202 2293 2847 3439 3262 1828 833 1814 2825 3286 2084 411
1787 411 -1 739 1098 232 -866 -1514 -1423 -436 890 1297 1258 1206 1570 2626 3262 2902 1756 920 752 1274
1807 1274 1435 664 -366 -1012 -934 -588 -776 -1809 -2472 -3178 -3182 -3042 -2851 -2803 -3083 -2477 -1386 -285 636 695
1827 695 610 1305 1156 1530 1027 644 -492 -840 -1132 -992 -1282 -1837 -2649 -3165 -2810 -3038 -2984 -4110 -4504 -4377
1847 -4377 -3910 -3210 -2462 -2076 -1212 -342 866 1700 2070 2035 1839 1863 1815 1245 607 193 312 -16 -397 -812
1867 -812 -976 -893 -1448 -2010 -2970 -3725 -2846 -2269 -1871 -1837 -1497 -400 1396 2612 3305 2659 2666 2665 3465 3757 2958
1888 2958 1670 1020 1496 2328 2715 1739 336 -27 214 94 -203 -1289 -2173 -2621 -1906 -641 346 531
$$ packed form
1750A996j084n12J143J014j44m62R7O13L82m61n75n89o94n98m65m74O24Q52j19
1769E44K73K88R79J323O06p29j082R1N54N92j77j434r95R81J011M61j202j673
1787D11m12P40L59q66j098o48R1R87J326M07l9n2L64J056O36l60j146q36j68N22
1807A274J61p71j030o46P8L46j88j033o63p06mJ40J91M8k80O06J091J101R21N9
1827F95q5O95j49L74n03l83j136l48k92J40k90n55q12n16L55k28N4j126l94J27
1847d377M67P00P48L86Q64Q70J208Q34L70l5j96K4m8n70o38m14J19l28l81m15
1867h12j64Q3n55n62r60p55Q79N77L98L4L40J097J796J216O93o46PjQ00K92p99
1888B958j288o50M76Q32L87r76j403l63K41j20k97j086q84m48P15J265R87J85
$$ plain form
1906 531 907 1243 2347 3459 3706 3323 2459 1859 1570 2092 2752 2179 1308 468 1450 2324 2211 655 -1587
1925 -1587 -2644 -1637 -463 -1230 -2835 -3371 -1583 797 2150 1272 11 37 1209 2324 1545 -645
1941 -645 -1480 -708 400 1025 193 -383 -301 168 -94 -434 -1424 -2161 -2208 -2312 -2740 -2524 -1678 -572 49 -412
1961 -412 -123 638 1055 608 -613 -2016 -1857 -934 -747 -846 -1535 -1210 -171 554 154 -1009 -1702 -1914 -1311
1980 -1311 -1210 -1880 -2513 -1436 260 1336 1121 244 677 1813 2010 1133 -721 -1468 -870 214 439 -849
1998 -849 -2027 -1424 821 1648 120 -1701 -2684 -1202 508 267 -1561 -2225 -641 2237 3586 2362
2014 2362 943 1374 2979 3770 2320 208 -362 526 1680 819 -634 -770 643 1071 -155 -1709 -2301
2031 -2301 -624 27 -1372 -2750 -2499 295 2738 2234 340 -153 2480 4478 4367 1295 -648 137
$$ packed form
1906E31L76L36J104J112K47l83q64o00k89N22O60n73q71q40R82Q74j13j556k242
1925a587j057J007J174p67j605n36J788K380J353q78j261K6J172J115p79k190
1941f45q35P72J108O25q32n76Q2M69k62l40r90p37m7j04m28K16Q46J106O21m61
1961d12K89P61M17m47j221j403J59R23J87r9o89L25J039P25m00j163o93k12O03
1980a311J01o70o33J077J696J076k15q77M33J136J97q77j854p47N98J084K25j288
1998h49j178O03K245Q27j528j821r83J482J710k41j828o64J584K878J349j224
2014B362j419M31J605P91j450k112n70Q88J154q61j453j36J413M28j226j554n92
2031b301J677O51j399j378K51K794K443n04j894m93K633J998j11l072j943P85
$$ plain form
2047 137 2792 3577 1008 -1456 -1717 321 2324 622 -2132 -3236 -2162 -361 -853 -2459 -3567 -2305
2063 -2305 63 852 251 -571 548 1905 2580 1694 495 583 1845 2391 1770 -177 -651 702 1758
2080 1758 674 -1751 -2809 -1984 -202 -549 -2698 -3958 -3143 -651 415 -534 -2485 -2118 262 2562
2096 2562 1695 -496 -1583 656 2960 3125 669 -1534 -583 2136 2941 339 -2716 -2459 270 1678
2112 1678 -24 -3171 -3235 -850 922 336 -2173 -2821 -878 1334 1397 -607 -1235 361 2263 1907 210
2129 210 -422 628 2108 1833 -595 -1928 -513 2070 2104 -629 -2514 -1595 1294 2204 153 -3215 -2984
2146 -2984 122 2212 1239 -1526 -2746 -716 2217 2768 427 -1666 -1583 274 2287 1258 -1356 -2626
2162 -2626 -1078 1315 1676 551 -1059 -769 760 1101 410 -680 -1067 -196 20 -78 -359 100 459 1198
$$ packed form
2047A37K655P85k569k464k61K038K003j702k754j104J074J801m92j606j108J262
2063b305K368P89o01q22J119J357O75q86j199Q8J262N46o21j947m74J353J056
2080A758j084k425j058Q25J782l47k149j260Q15K492J066r49j951L67K380K300
2096B562q67k191j087K239K304J65k456k203R51K719Q05k602l055K57K729J408
2112A678j702l147o4K385J772n86k509o48J943K212O3k004o28J596J902l56j697
2129B10o32J050J480k75k428j333J415K583L4k733j885R19K889R10k051l368K31
2146b984L106K090r73k765j220K030K933N51k341k093Q3J857K013j029k614j270
2162b626J548K393L61j125j610K90J529L41o91j090l87Q71K16r8k81M59L59P39
$$ plain form
2180 1198 266 -698 -621 103 685 -590 -2460 -2686 -478 1381 1165 -1116 -2246 -485 2554 2942 341
2197 341 -2406 -1611 1455 3199 1596 -1350 -1505 1235 3521 2386 -305 -1810 -566 1293 616 -1381
2213 -1381 -2644 -1851 279 633 -813 -1577 -710 1581 2032 162 -1633 -874 1347 2602 1095 -690
2229 -690 -355 2140 3461 2764 160 -387 799 1824 992 -1317 -2284 -1755 -270 130 -727 -1499 -1005 -18
2247 -18 470 -140 -1373 -938 209 453 146 -591 -224 1491 2399 2094 729 -28 1168 2169 1615 -727
2265 -727 -2113 -1902 287 1270 -295 -2377 -2843 -894 1415 722 -1882 -3876 -2472 127 1103 -604
2281 -604 -2730 -1792 608 2341 1847 -653 -834 509 2034 1421 -722 -1565 -279 755 138 -1576 -2003
2298 -2003 0 1103 101 -2562 -3137 -968 780 -79 -2594 -3822 -1848 1586 2304 -403 -2495 -1229
$$ packed form
2180A198r32r64P7P24N82j275j870k26K208J859k16k281j130J761L039L88k601
2197C41k747P95L066J744j603k946j55K740K286j135k691j505J244J859o77j997
2213a381j263P93K130L54j446p64Q67K291M51j870j795P59K221J255j507j785
2229f90L35K495J321o97k604n47J186J025q32k309r67N29J485M00q57p72M94R87
2247a8M88o10j233M35J147K44l07p37L67J715R08l05j365p57J196J001n54k342
2265g27j386K11K189R83j565k082m66J949K309o93k604j994J404K599R76j707
2281f04k126R38K400J733m94k500j81J343J525o13k143q43J286J034o17j714m27
2298b003K003J103j002k663n75K169J748q59k515j228J974L434P18k707k092J266
$$ plain form
2314 -1229 2032 3411 1708 -1470 -1679 590 2623 1981 -660 -1707 -22 2107 1905 328 -1136 -331
2330 -331 990 880 -423 -1351 -1017 305 540 -432 -703 -76 1480 1865 651 -464 -33 1430 2464
2347 2464 1150 -850 -1027 1447 3172 3324 776 -595 587 2637 3629 1490 -1239 -2046 64 2162
2363 2162 1821 -992 -2769 -1203 1889 2968 637 -2182 -2016 588 2326 936 -1417 -2128 -3 2029
2379 2029 2125 678 -144 861 2051 1414 23 -978 -263 649 -272 -1678 -1921 -424 1181 435 -1949
2396 -1949 -2963 -1134 1320 610 -2414 -4712 -3210 276 2025 -469 -2837 -2587 705 3540 2233
2411 2233 -1422 -3012 -1656 1489 1652 -1172 -3682 -2885 267 1798 975 -1460 -2481 -1097 73 -403
2427 -403 -1996 -3340 -2679 -1117 -453 -855 -1390 -315 1276 1130 -113 -1044 -303 540 666 -624 -1872
$$ packed form
2314a229L261J379j703l178k09K269K033o42k641j047J685K129k02j577j464Q05
2330c31J321j10j303r28L34J322K35r72k71O27J556L85j214j115M31J463J034
2347B464j314k000j77K474J725J52k548j371J182K050R92k139k729q07K110K098
2363B162l41k813j777J566L092J079k331k819J66K604J738j390k353p11K125K032
2379B029R6j447q22J005J190o37j391j001P15R12r21j406k43J497J605p46k384
2396a949j014J829K454p10l024k298J502L486J749k494k368K50L292K835j307
2411B233l655j590J356L145J63k824k510P97L152J531q23k435j021J384J170m76
2427d03j593j344O61J562O64m02n35J075J591j46j243r31P41Q43J26j290j248
$$ plain form
2444 -1872 -810 1283 2568 1383 -445 -876 784 2456 1627 -989 -3063 -1951 898 2389 371
2459 371 -1587 -1112 1623 3483 2319 -549 -1540 8 1851 1130 -661 -1097 474 2716 3063 1147
2475 1147 416 2163 3381 2663 8 -1322 7 2281 2735 180 -1802 -437 3000 4689 1831 -1966
2491 -1966 -2337 508 2564 818 -2652 -3537 -915 2496 3289 926 -1366 -287 2540 3372 1382 -1374
2507 -1374 -1816 144 1817 1316 -45 -108 570 1980 1467 157 -1214 -1162 -706 -1333 -2803 -3369 -2142 -469
2525 -469 -404 -1591 -2119 -831 936 1370 -841 -2910 -2410 -561 1297 392 -1624 -2152 204 2717 2520
2542 2520 -65 -2292 -2112 -58 534 -2067 -4553 -4183 -1845 223 -842 -3060 -2885 -414 1342 43
2558 43 -2923 -3727 -1251 1276 1041 -1258 -2240 206 3600 3986 1181 -1615 -858 2114 2922 43 -3269
$$ packed form
2444a872J062K093J285j185j828m31J660J672q29k616k074J112K849J491k018
2459C71j958M75K735J860j164k868r91J548J843p21j791m36J571K242L47j916
2475A147p31J747J218p18k655j330J329K274M54k555j982J365L437J689k858l797
2491a966l71K845K056j746l470q85K622L411P93k363k292J079K827Q32j990k756
2507a374m42J960J673n01j361o3O78J410n13j310j371N2M56o27j470n66J227J673
2525d69O5j187n28J288J767M34k211k069N00J849J858r05k016n28K356K513j97
2542B520k585k227J80K054N92k601k486L70K338K068j065k218J75K471J756j299
2558D3k966q04K476K527k35k299r82K446L394L86k805k796P57K972Q08k879l312
$$ plain form
2575 -3269 -3098 -302 1888 803 -1660 -2544 -417 1835 1359 -1146 -2294 -958 1390 1413 -31 -682
2591 -682 799 2772 3425 2245 953 1575 3065 3131 1185 -794 -299 1856 2673 1352 -1016 -1007 1621
2608 1621 2993 1674 -860 -2157 -242 2218 2475 125 -1909 -394 2561 4017 2159 -281 -745
2623 -745 1361 3363 2930 -13 -1804 -212 2171 2594 356 -1400 -928 1245 2173 207 -1648 -1926
2639 -1926 14 1311 432 -1864 -1873 190 1807 910 -1330 -2372 -806 1177 927 -1914 -3386 -1824
2655 -1824 839 1276 -927 -3089 -2481 295 1289 -336 -3055 -2758 -174 1546 -43 -2601 -2692 -255
2671 -255 1664 602 -2360 -3338 -1519 821 365 -2403 -3955 -2638 -32 385 -1595 -3711 -2984 -98
2687 -98 1263 96 -2453 -2464 -240 2223 1828 -927 -1862 7 2557 2425 441 -1689 -820 1671 2391
$$ packed form
2575c269J71K796K190j085k463q84K127K252m76k505j148J336K348K3j444o51
2591f82J481J973O53j180j292O22J490O6j946j979M95K155Q17j321k368RK628
2608A621J372j319k534j297J915K460K57k350k034J515K955J456j858k440m64
2623g45K106K002m33k943j791J592K383M23k238j756M72K173R28j966j855k78
2639a926J940J297q79k296rK063J617q97k240j042J566J983k50k841j472J562
2655a824K663M37k203k162O08K776R94j625k719K97K584J720j589k558r1K437
2671b55J919j062k962r78J819K340m56k768j552J317K606M17j980k116P27K886
2687i8J361j167k549j1K224K463l95k755r35J869K550j32j984k130Q69K491P20
$$ plain form
2704 2391 270 -2048 -2259 -149 1401 335 -2127 -2470 -704 1374 1372 -677 -1871 65 2870 3269
2720 3269 1401 -291 675 3331 4378 2707 28 -12 2697 3861 2599 -252 -863 541 2460 1599
2736 1599 -1252 -2595 -816 1664 1266 -788 -2334 -279 2651 3181 1052 -1011 508 3521 4434 2262
2752 2262 -755 -375 2943 4452 2750 -963 -1873 900 3172 2513 -1234 -3683 -2053 706 1025 -1608
2768 -1608 -4261 -2954 -123 1440 174 -2380 -2243 592 2261 1445 -1035 -1740 -4 2087 1698 -883
2784 -883 -1814 -424 1274 765 -1572 -3296 -2365 -646 -453 -2337 -4033 -3834 -1095 156 -1454 -3312
2800 -3312 -3449 -861 1430 858 -2045 -3464 -1120 1484 1827 -647 -2750 -1831 876 2332 134 -2482
2816 -2482 -3022 -630 750 5 -2389 -3205 -1388 682 477 -1554 -2293 -244 1885 1552 -835 -2016
$$ packed form
2704B391k121k318k11K110J550j066k462l43J766K078kk049j194J936K805L99
2720C269j868j692R66K656J047j671k679m0K709J164j262k851o11J404J919q61
2736A599k851j343J779K480l98k054j546K055K930N30k129k063J519L013R13k172
2752B262l017L80L318J509j702l713r10K773K272o59l747k449J630K759L19k633
2768a608k653J307K831J563j266k554J37K835J669q16k480p05J736K091l89k581
2784h83r31J390J698n09k337j724R31J719J93j884j696J99K739J251j610j858
2800c312j37K588K291n72k903j419K344K604L43k474k103R19K707J456k198k616
2816b482n40K392J380p45k394q16J817K070k05k031p39K049K129l33k387j181
$$ plain form
2832 -2016 -277 1895 2730 117 -2224 -909 2142 3530 1532 -1548 -1784 1292 2998 2251 -1014 -2609
2848 -2609 -260 2602 2862 337 -1162 199 2949 3857 2206 -75 387 2600 3403 1731 -395 -743
2864 -743 1159 2175 1605 -450 -693 744 2111 1849 -794 -1544 -118 1898 1884 -29 -1334 462 2744
2881 2744 3754 1836 -406 -71 2522 3832 1960 -1430 -2282 -140 1866 1412 -1449 -3223 -2253 636
2897 636 1291 -802 -3446 -3322 -453 974 -49 -2181 -2271 132 2160 1752 -274 -1051 402 2385 1780
2914 1780 -954 -2216 -1279 785 384 -1543 -3545 -2677 -652 182 -2089 -4892 -4296 -1751 -1 -1356
2930 -1356 -3843 -3945 -582 2188 1911 -548 -1598 438 2691 2712 180 -2521 -1217 1081 1882 29
2946 29 -2449 -2050 280 1347 -259 -2641 -3449 -1722 -34 -870 -2906 -3875 -1090 1724 2480 382 -792
$$ packed form
2832b016J739K172Q35k613k341J315L051J388j998l080k36L076J706p47l265j595
2848b609K349K862K60k525j499J361K750R08j651k281M62K213Q03j672k126l48
2864g43J902J016n70k055k43J437J367k62k643p50J426K016j4j913j305J796K282
2881B744J010j918k242L35K593J310j872l390q52K142K006m54k861j774R70K889
2897F36O55k093k644J24K869J427j023k132r0K403K028m08k026p77J453J983o05
2914A780k734j262R37K064m01j927k002Q68K025Q34k271k803N96K545J750j355
2930a356k487j02L363K770k77k459j050K036K253K1k532k701J304K298Q01j853
2946B9k478L99K330J067j606k382q08J727J688q36k036r69K785K814P56k098j174
$$ plain form
2963 -792 811 3520 3922 1503 -908 -460 2130 3500 1888 -581 -1002 1061 2846 1950 -163 -1774
2979 -1774 -923 759 613 -1359 -2204 -1010 1634 2436 886 -412 909 3277 3851 1994 -525 -331
2995 -331 2170 4152 2188 -206 -985 1202 3799 3136 -228 -2162 -1080 1024 1483 -1009 -3060 -2279
3011 -2279 819 2224 1037 -965 -1027 1513 3359 2017 -1146 -2331 -504 1996 1452 -751 -1723 -850
3027 -850 1905 2448 19 -1772 -2034 -573 -18 -1739 -3184 -2753 -436 661 -16 -1580 -802 926 2282
3044 2282 734 -2097 -2786 -1108 1043 224 -2244 -3983 -1732 1189 1736 -275 -3348 -3067 -869 816
3060 816 -954 -3473 -3479 -1816 818 1042 -519 -1152 213 2198 1973 79 -1530 -870 651 1046 -814
3077 -814 -2300 -1824 718 1648 176 -1991 -2830 -399 965 124 -2281 -3065 -1236 1459 1930 627 -481
$$ packed form
2963g92J603K709M02k419k411M48K590J370j612k469m21K063J785q96k113j611
2979a774Q51J682j46j972q45J194K644Q02j550j298J321K368N74j857k519J94
2995c31K501J982j964k394p79K187K597o63l364j934J082K104M59k492k051P81
3011b279L098J405j187k002o2K540J846j342l163j185J827K500n44k203r72Q73
3027h50K755N43k429j791k62J461N55j721j445M31K317J097o77j564P78J728J356
3044B282j548k831o89J678K151q19k468j739K251K921N47k011l073K81K198J685
3060H16j770k519oJ663K634K24j561o33J365J985k25j894j609O60J521L95j860
3077h14j486M76K542R30j472k167q39K431J364q41k405p84J829K695M71j303j108
$$ plain form
3094 -481 816 2963 3501 1715 114 335 1916 2661 1333 -1042 -1091 1190 2738 1432 -1263 -2196 -664
3111 -664 989 566 -1602 -2996 -1413 1373 2171 1185 -577 703 2535 3797 2701 635 354 2160
3127 2160 3295 2172 -342 -798 1308 2673 2051 -862 -2494 -1125 875 777 -1680 -3620 -2917 78
3143 78 1385 311 -1387 -1714 993 2951 2073 50 -457 910 2251 2048 14 -779 260 1963 1914
3160 1914 -532 -2031 -1460 13 254 -1750 -4133 -3632 -961 148 -508 -2444 -2838 -665 1710 1058
3176 1058 -1148 -1971 -504 1558 1722 -522 -1684 -607 1190 2098 287 -1920 -1556 1 1153 -548
3192 -548 -2998 -3280 -1369 675 -67 -2370 -2687 -996 1465 1747 -566 -2000 -910 1446 2184 108
3208 108 -1313 -1134 1118 2213 570 -1029 -1369 602 2002 706 -1619 -2013 -362 1387 1144 -886
$$ packed form
3094d81J297K147N38j786j601K21J581P45j328k375m9K281J548j306k695r33J532
3111f64J653m23k168j394J583K786P98r86j762J280J832J262j096k066k81J806
3127B160J135j123k514m56K106J365o22k913j632J369K000r8k457j940P03K995
3143G8J307j074j698l27K707J958q78k023n07J367J341k03k034p93J039J703m9
3160A914k446j499N71J473K41k004k383N01K671J109o56j936l94K173K375o52
3176A058k206q23J467K062J64k244j162J077J797R08j811k207L64J557J152j701
3192e48k450k82J911K044p42k303l17J691K461K82k313j434J090K356P38k076
3208A08j421J79K252J095j643j599l40J971J400j296k325l94J651J749k43k030
$$ plain form
3224 -886 -1942 -316 1897 2346 297 -1486 -464 1897 3026 1116 -967 -1184 1166 2350 1224 -888
3240 -888 -1687 257 1910 1336 -603 -2170 -519 1681 2310 309 -1056 -546 1468 2759 1554 -801
3256 -801 -668 1515 2967 1480 -609 -1039 324 2075 1230 -926 -2277 -1022 1133 1110 -1060 -2356
3272 -2356 -1448 894 1575 -157 -1880 -1496 963 2607 1620 -588 -766 1025 2891 2175 -574 -1546 -154
3289 -154 1675 1727 -828 -2375 -2005 156 405 -1045 -2725 -2915 -712 301 -269 -2317 -2128 -150 1324
3306 1324 810 -825 -1316 367 2384 2125 552 -748 -17 1678 1663 -114 -2129 -1948 70 986 -654
3323 -654 -2856 -3424 -1201 426 94 -2110 -3208 -1404 739 1418 -679 -1496 -551 1479 2875 1081
3339 1081 -102 48 1702 2647 1426 -515 -1045 391 1362 602 -1750 -2228 -553 763 435 -1432 -2557
$$ packed form
3224h86j056J626K213M49k049j783J022K361J129j910k083k17K350J184j126k112
3240h88p99J944J653n74j939j567J651K200O29k001j365N10K014J291j205k355
3256h01J33K183J452j487k089m30J363J751q45k156j351J255K155k3k170j296
3272b356R08K342O81j732j723L84K459J644r87k208j78J791J866p16k749r72J392
3289a54J829N2k555j547L70K161K49j450j680j90K203J013n70k048J89J978J474
3306A324n14j635m91J683K017k59j573j300P31J695j5j777k015J81K018R16j640
3323f54k202n68K223J627l32k204j098J804K143O79k097q17R45K030J396j794
3339A081j183J50J654R45j221j941n30J436R71p60k352m78J675J316l28j867j125
$$ plain form
3356 -2557 -1007 889 1302 -273 -1673 -739 1463 2535 1195 -582 -453 1562 3039 2347 68 -899
3372 -899 479 2222 1780 -502 -1721 -1283 661 1469 -539 -2205 -1474 277 1320 224 -1443 -1147
3388 -1147 408 1549 935 -753 -912 805 2340 1548 66 -998 92 1643 1703 -563 -1795 -1020
3404 -1020 986 1365 -148 -1788 -1555 289 1846 762 -1320 -2036 -315 1226 1287 -928 -1788 -562
3420 -562 1267 1706 32 -1234 -940 806 1294 359 -1585 -1735 1 882 323 -1109 -1271 502 1540
3437 1540 891 -591 -1231 -190 1133 982 -811 -1608 -699 1047 1725 -218 -1620 -1030 553 1282 -283
3454 -283 -2154 -2498 -685 1011 61 -1397 -1907 -26 1742 1743 -24 -1181 -205 1389 1805 318 -1140
3471 -1140 -827 1141 2129 1080 -395 -1238 302 1471 513 -1430 -2233 -1035 348 173 -1371 -2065 -831
$$ packed form
3356b557J550J896M13j575j400R34K202J072j340j777J29K015J477o92k279r67
3372h99J378J743m42k282j219M38J944Q08k008j666P31J751J043j096j667K96
3388a147J555J141o14j688j59J717J535p92j482j064J090J551O0k266j232P75
3404a020K006L79j513j640K33J844J557j084k082p16J721J541O1k215q60J226
3420e62J829M39j674j266K94J746M88r35j944j50J736Q81n59j432j62J773J038
3437A540o49j482o40J041J323j51j793p97R09J746O78j943j402N90J583P29j565
3454b83j871l44J813J696r50j458n10J881J768Jj767j157R76J594M16j487j458
3471a140L13J968R88j049j475q43J540J169r58j943q03J198J383j75j544o94J234
$$ plain form
3488 -831 1006 1582 331 -1190 -318 1211 2027 574 -575 -799 1307 2226 1140 -157 -627 905 2131
3505 2131 1142 -1084 -2077 -1215 421 409 -1114 -2475 -1585 478 1353 423 -1327 -1553 476 1371 1097 -675
3523 -675 -1267 679 2558 2022 623 -333 371 2134 1957 37 -1571 -1449 133 616 -739 -2102 -1710
3540 -1710 -234 1255 235 -1391 -1776 -619 766 584 -768 -1687 -55 1916 1860 255 -216 625 2144
3557 2144 2097 550 -1310 -1120 341 939 -291 -1936 -1682 -4 1284 694 -1235 -1784 -493 633 690
3574 690 -1198 -2207 -955 864 1517 749 -779 -278 1457 2543 1303 -708 -1393 -224 1280 775
3590 775 -775 -1447 -450 1127 1526 -134 -1345 -785 466 1267 -265 -1928 -1329 112 875 502 -575
3607 -575 -684 713 1859 737 -526 -1158 -303 970 527 -1032 -1472 -252 1189 1551 52 -1164 -781
$$ packed form
3488h31J837N76j251j521Q72J529Q16j453j149k24K106R19j086j297m70J532J226
3505B131r89k226r93Q62J636j2j523j361Q90K063Q75r30j750k26K029Q95k74j772
3523f75n92J946J879n36j399r56P04J763j77j920j608J22J582M83j355j363L92
3540a710J476J489j020j626l85J157J385j82j352r19J632J971n6j605m71Q41J519
3557B144m7j547j860J90J461N98j230j645K54J678J288n90j929n49J291J126N7
3574F90j888j009J252J819O53p68j528N01J735J086j240k011o85J169J504n05
3590G75j550o72R97J577L99j660j211N60J251Q01j532j663N99J441P63l73j077
3607e75j09J397J146j122j263o32Q55J273m43j559m40J220J441L62j499j216L83
$$ plain form
3624 -781 1040 1467 114 -1849 -2001 59 1409 574 -1242 -1521 -112 1516 1320 -501 -1851 -1281 362
3641 362 705 -372 -2011 -1314 377 1543 656 -692 -943 352 1509 690 -515 -1066 -71 1274 1107
3658 1107 -158 -529 177 1232 956 -315 -1400 -948 250 703 -664 -1996 -1605 470 1391 488 -489
3675 -489 -1169 280 1697 1399 -517 -1418 -466 1710 2023 813 -727 234 1410 1985 693 -1037 -1158
3692 -1158 -84 787 -110 -1592 -1555 -710 806 455 -877 -1154 -317 955 710 -145 -1045 -241 929 1586
3710 1586 747 -367 -133 1562 2209 1243 -222 -953 143 1417 631 -1402 -1833 -811 593 504 -855
3727 -855 -1728 -1267 451 861 -345 -1317 -1222 136 1200 420 -595 -660 391 1326 1230 -193 -680 234 1235
3746 1235 969 -593 -1302 -533 485 777 -1023 -1807 -1291 -37 383 -776 -1528 -1705 -241 620 244 -771
$$ packed form
3624g81J821M27j353j963j52K060J350q35j816k79J409J628j96j821j350N70J643
3641C62L43j077j639O97J691J166q87j348k51J295J157q19j205n51R95J345j67
3658A107j265l71P06J055k76j271j085M52J198M53j367j332L91K075R21r03r77
3675d89o80J449J417k98j916r01R52K176L13j210j540R61J176N75j292j730j21
3692a158J074Q71q97j482L7Q45J516l51j332k77Q37J272k45q55r00Q04J170O57
3710A586q39j114K34J695O47r66j465p31J096J274p86k033m31J022J404q9j359
3727h55q73M61J718M10j206r72R5J358J064p80j015o5J051R35r6j423m87R14J001
3746A235k66j562p09P69J018K92j800p84N16J254M20j159p52j77J464Q61l76j015
$$ plain form
3764 -771 -1185 -125 999 963 -218 -981 -251 1196 1093 106 -998 -878 801 1032 350 -1255 -806 293
3782 293 734 260 -1195 -1419 -447 877 279 -861 -965 -419 773 988 205 -953 28 962 1206 345
3800 345 -971 -448 857 1405 814 -349 -393 490 1518 1133 -345 -1016 16 1308 994 -204 -1255
3817 -1255 -671 768 1016 375 -765 -630 748 1251 556 -542 -796 255 1218 816 -159 -922 174 1211
3835 1211 1356 443 -559 238 1339 1310 298 -732 -368 360 1042 70 -1011 -926 -34 455 441 -890 -1171
3854 -1171 -371 733 505 -602 -1054 -537 481 787 22 -796 -496 799 1169 317 -569 -620 433 1401
3872 1401 393 -1024 -1366 -359 207 14 -1006 -1573 -1007 -72 181 -745 -1684 -1358 36 753 -641 -1243
3890 -1243 -1170 80 822 494 -594 -1081 280 1181 889 -340 -866 -225 707 976 -367 -1423 -1080 409
$$ packed form
3764g71m14J060J124l6j181p63P30J447j03r87j104J20J679K31o82j605M49J099
3782B93M41m74j455k24R72J324n98j140j04N46J192K15p83j158R81R34K44q61
3800C45j316N23J305N48n91j163m4Q83J028l85j478o71J032J292l14j198j051
3817a255N84J439K48o41j140J35J378N03o95j098k54J051R63m02r75p63J096J037
3835A211J45r13j002P97J101k9j012j030L64P28O82r72j081Q5Q92M89j4j331k81
3854a171Q00J104k28j107m52N17J018L06p65q18L00J295L70q52q86n1J053R68
3872A401j008j417l42J007N66j93j020n67N66R35K53r26r39L26J394P17j394o02
3890a243P3J250P42l28j088m87J361R01k92j229n26O41R32K69j343j056L43J489
$$ plain form
3908 409 758 -416 -1268 -989 -190 756 297 -917 -1440 -219 926 791 -219 -845 303 1268 1265 356 -652
3927 -652 -66 1413 1216 491 -373 -552 731 1582 650 -74 -669 239 1237 569 -519 -962 -341 763 895
3946 895 -275 -749 -415 1118 1512 602 -483 -60 1077 1385 608 -266 -387 866 1479 1262 156 -273
3964 -273 315 1365 899 -186 -831 -344 686 338 -270 -1211 -981 166 731 294 -922 -1190 -98 453
3982 453 59 -786 -1113 -88 1406 814 -18 -321 -77 1126 1280 174 -828 -382 139 787 -198 -1309
4000 -1309 -1260 -268 612 -160 -1323 -1706 -717 -10 -142 -1054 -1581 -689 208 353 -682 -685 -617 508 1020 318
4020 318 -588 -379 181 626 275 -494 -591 106 638 448 -583 -1281 -893 55 27 -1022 -1562 -1000 52 416
4040 416 -135 -735 -401 295 692 591 -559 -710 443 1110 1029 271 -60 419 1250 1147 379 -398 53 400
$$ packed form
3908D09L49j174q52K79P99R46m59j214n23J221J145j35j010o26J148R65lr09j008
3927f52N86J479j97p25q64j79J283Q51r32p24n95R08R98o68j088m43O21J104J32
3946H95j170m74L34J533L94r10j085M23J137L08p77q74j21J253O13k17j106m29
3964b73N88J050m66j085o45M87J030l48o08r41K30J147N65m37j216k68J092N51
3982D53l94q45l27J025J494n92q32l03K44J203J54j106j002M46N21O48r85j111
4000a309M9R92Q80p72j163l83R89P07j32r12n27Q92Q97J45j035lO8J125N12p02
4020C18r06K09N60M45l51p69r7O97N32j90j031o98L88R48k8j049n40N62J052L64
4040D16n51o00L34O96L97j01j150j51J153O67q1p58l31M79Q31j03p68p77M51L47
$$ plain form
4060 400 682 -197 -928 -883 316 758 440 -554 -266 507 1115 425 -37 -491 150 911 1288 138 141 628
4080 628 1323 1768 738 101 229 764 1054 268 -670 -649 206 847 709 -49 -462 224 681 629 -556 -957
4100 -957 -645 144 308 -327 -1081 -754 793 1328 274 -521 -34 492 779 199 -807 -879 72 219 805
4119 805 -243 -560 -39 446 317 -368 -870 -867 -319 -273 -795 -1161 -1043 45 97 -201 -760 -834 -27 530 75
4140 75 -748 -1166 -763 321 337 -143 -695 -48 706 848 365 -484 -757 -3 709 -163 -1019 -1077 -480 226 -75
4161 -75 -687 -1272 -536 206 -51 -629 -1245 -774 246 493 439 -428 27 588 1071 929 -121 -259 60 1059
4181 1059 969 -178 -105 -63 579 532 -269 -562 21 270 50 -710 -1041 -323 198 497 -9 -438 -229 1097
4201 1097 1518 733 218 273 1049 1219 1176 505 154 558 1096 1095 496 -283 -310 478 575 -66 -637 -1087 -274 421
$$ packed form
4060D00K82q79p31M5J199M42l18r94K88P73O08o90m62m54O41P61L77j150LM87
4080F28O95M45j030o37J28N35K90p86r38K1Q55O41j38p58m13O86M57n2j185m01
4100i57L12P89J64o35p54L27J547N35j054p95M87N26K87n80j006p2R51J47N86
4119H05j048l17N21M85j29o85n02LN48M6n22l66J18J088N2k98n59p4Q07N57m55
4140G5q23m18M03J084J6m80n52O47P54J42m83q49k73P54P12q72q56n8N97P06l01
4161g5o12n85P36P42k57n78o16M71J020K47n4q67M55N61M83j42j050j38L19R99
4181A059r0j147P3M2O42m7q01k93N83K49k20p60l31P18N21K99n06m29K09J326
4201A097M21p85n15N5P76J70m3o71l51M04N38jn99p79k7P88R7o41n71m50Q13O95
$$ plain form
4223 421 -6 -632 -948 -432 477 770 -159 -215 -101 516 909 465 77 181 625 903 466 23 204 178 449
4244 449 -218 -800 -904 -358 -155 -228 -1220 -919 -606 4 296 -539 -970 -911 259 389 125 -792 -794 453 807
4265 807 474 -36 -538 153 582 212 -286 -590 -534 -45 -126 -397 -904 -528 26 281 -383 -975 -765 -81 328
4286 328 6 -556 -743 -141 506 353 -290 -399 -474 813 471 -8 -414 -282 170 495 25 -257 -187 163
4306 163 675 430 0 -392 232 548 316 -62 -484 -361 616 505 -50 -364 -7 758 804 215 -181 -174 417
4327 417 739 444 -265 8 447 1110 735 -8 26 733 1052 749 147 -163 -87 521 562 -95 -570 -716 41
4348 41 706 -90 -627 -680 -247 309 160 -236 -794 238 923 720 183 -133 158 707 828 535 -452 174
4368 174 825 738 26 -815 -710 -124 -75 -307 -1046 -1246 -938 -38 -162 -750 -1340 -819 -108 349 -132 -595 -218
$$ packed form
4223D21m27o26l16N16R09K93r29n6J14O17L93m44l88J04M44K78m37m43J81k6K71
4244D49o67n82j04N46K03p3r92L01L13O10K92q35m31N9J170J30k64r17kJ247L54
4265H07l33n10n02O91M29l70m98l04N6M89q1k71n07L76N54K55o64n92K10O84M09
4286C28l22n62j87O02O47j53o43j09p5J287l42m79m06J32M52L25m70k82P0L50
4306A63N12k45m30l92O24L16k32l78m22J23R77j11n55l14L57P65M6n89l96PN91
4327D17L22k95p09K73M39O63l75p43L4P07L19l03o02l10P6O08M1o57m75j46P57
4348D1O65p96n37n3M33N56j49l96n58J032O85k03n37l16K91N49J21k93r87O26
4368A74O51q7p12q41J05N86M9k32p39k00L08R00j24n88n90N21P11M57m81m63L77
$$ plain form
4389 -218 96 684 369 44 346 284 255 42 -146 -279 153 143 -202 -392 -673 -836 -336 -491 -1101 -1031 -788
4410 -788 -286 -31 -456 -791 -463 550 1002 525 -330 -131 301 1076 743 81 -70 -62 648 743 -171 -540 -653
4431 -653 -236 221 -178 -813 -781 -483 44 97 -270 -621 30 387 329 -57 -23 279 1082 899 310 424 572
4452 572 1010 913 243 -127 -13 716 739 144 -286 -567 146 448 301 -282 -294 157 372 498 24 -510 -74
4473 -74 601 731 171 -41 249 365 652 247 -70 -284 305 233 91 -103 -447 165 316 21 -149 -438 35
4494 35 381 67 -208 -355 -53 67 187 -140 -666 -502 -223 691 153 -349 -509 -193 -16 39 -316 -386 -259
4515 -259 58 213 328 -529 -224 70 524 -65 -256 -375 76 476 -23 -423 -258 -75 75 -110 -697 -843
4535 -843 -589 69 -54 -719 -689 -320 77 261 -105 -403 -223 216 860 339 135 120 602 837 791 78 -209
$$ packed form
4389b18L14N88l15l25L02o2k9k13j88j33M32j0l45j90k81j63N00j55o10P0K43
4410g88N02K55m25l35L28J013M52m77q55J99M32P75l33o62j51QP10R5r14l69j13
4431f53M17M57l99o35L2K98N27N3l67l51O51L57n8l86L4L02Q03j83n89J14J48
4452E72M38r7o70l70J14P29K3n95m30k81P13L02j47n83j2M51K15J26m74n34M36
4473g4O75J30n60k12K90J16K87m05l17k14N89p2j42j94l44O12J51k95j70k89M73
4494C5L46l14k75j47L02J20J20l27n26J64K79R14n38n02j60L16J77N5l55p0J27
4515b59L17J55J15q57L05K94M54n89j91j19M51M00m99m00J65J83J50j85n87j46
4535h43K54O58j23o65L0L69L97J84l66k98J80M39O44n21k04j5M82K35m6p13k87
$$ plain form
4556 -209 137 236 349 4 -697 -458 -172 -151 -284 -669 -482 139 305 -50 -241 -21 42 268 309 156 200 362
4578 362 724 744 726 395 601 638 561 91 -222 -463 -184 144 -393 -462 -773 -289 15 -152 -439 -536 -149 -50
4600 -50 293 -92 -308 11 503 663 517 256 424 584 766 494 173 6 106 106 32 -590 -758 -429 -90
4621 -90 -391 -809 -467 -365 122 -31 -210 -704 -412 371 624 428 -13 333 718 932 380 224 -75 91
4641 91 141 -219 -339 -637 -363 -192 85 -442 -662 -640 -178 -27 -594 -508 -585 -286 -50 -186 -95 -210 272 655
4663 655 591 223 -128 -30 -35 -27 -181 -247 8 160 27 -38 -194 -315 71 127 -93 -452 -298 18 306 -15 -128
4686 -128 -264 228 473 59 81 -256 -177 192 504 -91 -129 -79 29 352 283 202 133 52 358 240 49 -90 263
4709 263 226 419 -28 179 224 325 239 144 -104 -30 85 -225 -67 -489 -284 219 395 1 -257 8 610 191
$$ packed form
4556b09L46R9J13l45p01K39K86K1j33l85J87O21J66l55j91K20O3K26M1j53M4J62
4578C62L62K0j8l31K06L7p7m70l13k41K79L28n37o9l11M84L04j67k87r7L87R9
4600e0L43l85k16L19M92J60j46k61J68J60J82k72l21j67J00%p4o22j68L29L39
4621i0l01m18L42J02M87j53j79m94K92P83K53j96m41L46L85K14n52j56k99J66
4641I1N0l60j20k98K74J71K77n27k20K2M62J51n67Q6p7K99K36j36R1j15M82L83
4663F55o4l68l51R8nQj54o6K55J52j33o5j56j21L86N6k20l59J54L16K88l21j13
4686a28j36M92K45m14K2l37P9L69L12n95l8N0J08L23o9q1o9q1L06j18j91j39L53
4709B63l7J93m47K07M5J01q6r5k48P4J15l10J58m22K05N03J76l94k58K65O02m19
$$ plain form
4731 191 193 -11 -241 160 244 568 368 100 237 407 608 301 -324 -57 -298 -218 -34 -756 -645 -331 -344 -325
4753 -325 -340 -256 -292 -95 -91 161 164 131 397 113 572 385 131 583 561 534 32 -381 -66 35 -369 -649 -539
4776 -539 -576 -319 17 -232 -641 -223 -572 70 -284 -419 -464 54 675 474 104 408 642 412 899 222 296
4797 296 264 488 349 98 -281 -314 -128 -330 -338 -846 -319 -238 -266 -385 -689 -74 -52 147 50 -3 160 378 601
4820 601 481 479 309 22 597 276 233 11 285 123 -123 -85 -534 -207 -222 88 -383 -376 -180 -424 -66 117
4842 117 -140 -127 201 -81 347 377 199 123 353 444 284 133 82 69 333 -66 79 -237 -65 177 153 -217
4864 -217 -554 -150 -18 -195 -63 -463 -219 142 -20 122 -216 -175 146 91 -30 -196 -106 27 117 1 -24 -232
4886 -232 64 277 425 287 -111 -46 297 229 87 -58 -297 55 112 -62 -552 -150 -415 -7 -289 -86 -179
$$ packed form
4731A91Kk04k30M01Q4L24k00k68J37J70K01l07o25K67k41Q0J84p22J11L14j3J9
4753c25j5Q4l6J97MK52Ll3K66k84M59j87k54M52k2k7n02m13L15J01m04k80J10
4776e39l7K57L36k49m09M18l49O42l54j35m5N18O21k01l70L04K34k30M87o77P4
4797B96l2K24j39k51l79l3J86k02qn08N27Q1k8j19l04O15K2J99r7n3J63K18K23
4820F01j20kj70k87N75l21m3k22K74j62k46L8m49L27j5L10m71PJ96k44L58J83
4842A17k57J3L28k82M28L0j78p6K30R1j60j51n1j3K64l99J45l16J72K42k4l70
4864b17l37M04J32j77J32m00K44L61j62J42l38M1L21n5j21j66R0J33R0j16k5k08
4886b32K96K13J48j38l98O5L43o8j42j45k39L52N7j74m90M02k65M08k82K03r3
$$ plain form
4907 -179 -419 -171 64 -186 -392 41 213 183 30 332 235 99 509 47 201 235 227 225 -78 53 -141 0
4929 0 156 91 -158 -335 -75 -99 -444 -401 -429 -186 -167 -85 -14 55 -45 485 223 310 194 124 270 340 577 367
4953 367 -140 203 251 283 192 -223 74 -548 -176 -489 -331 -710 -293 -455 -308 -189 -404 -222 -159 242 156 16
4975 16 -90 342 389 147 376 376 230 347 480 37 159 61 182 -406 -185 -272 -349 -13 -573 -531 -319 -309 -81
4998 -81 -185 -352 -399 -29 93 292 258 197 69 342 329 481 332 263 351 -145 97 30 -296 -191 -141 -103 -241
5021 -241 -241 -258 -157 -277 -327 -222 -340 -158 -96 61 -184 48 175 478 48 283 204 340 -163 252 277 -103
5043 -103 205 -24 170 233 -34 -191 157 98 8 -46 -432 -184 102 -202 -353 -109 -320 -86 58 47 135 54
5065 54 145 -113 176 152 86 95 90 212 65 118 152 211 180 -103 -354 291 119 170 -258 -78 -87 -109 -8 -179 -196 -256
$$ packed form
4907a79k40K48K35k50k06M33J72l0j53L02r7j36M10m62J54L4qkl03J31j94J41
4929@J56o5k49j77K60k4l45M3k8K43J9Q2P1O9j00N30k62Q7j16p0J46P0K37k10
4953C67n07L43M8L2r1m15K97o22L72l13J58l79M17j62J47J19k15J82O3M01q6j40
4975A6j06M32M7k42K29%j46J17J33m43J22r8J21n88K21q7p7L36n60M2K12J0K28
4998h1j04j67m7L70J22J99l4o1j28K73j3J52j49o9Q8m96K42o7l26J05N0L8j38
5021b41%j7J01j20n0J05j18J82O2J57k45K32J27L03m30K35p9J36n03M15K5l80
5043a03L08k29J94O3k67j57L48n9r0n4l86K48K86l04j51K44k11K34J44j1Q8q1
5065E4R1k58K89k4o6RnJ22j47N3L4N9l1k83k51O45j72N1m28J80rk2J01j71j7o0
$$ plain form
5091 -256 -153 -42 -110 -81 -21 -114 246 -86 169 122 -33 51 92 152 303 -94 173 215 141 236 185 208 376 81
5115 81 -303 -401 -434 -302 -233 -300 -535 13 42 -106 -254 -89 -377 258 -139 2 297 281 330 333 340 284 351 714 443
5140 443 -73 -111 -204 -140 31 173 -177 -65 89 -209 -29 -232 -470 -171 -228 -106 -90 -187 -23 298 182 315
5162 315 327 333 375 542 157 491 129 232 235 -104 91 -47 105 32 -122 -363 -201 -283 -374 -278 -137 -90 -236 -117
5186 -117 -295 99 219 183 152 40 104 64 403 140 163 249 202 195 246 48 5 -199 -163 -146 -255 -109 -289 -230 -521
5211 -521 -332 -362 -222 74 -196 -14 -25 96 45 158 -335 -174 66 274 201 261 317 317 210 224 -80 -14 172
5234 172 -63 -79 -104 -134 -237 -119 143 -361 119 -13 -5 -32 112 -206 23 158 -85 174 143 66 304 218 26
5257 26 92 64 325 431 109 -164 -187 17 164 105 -107 16 -69 14 -165 112 -192 -56 -332 -30 65 -230 69
$$ packed form
5091b56J03J11o8K9O0r3L60l32K55m7j55Q4M1O0J51l97K67M2p4R5n1K3J68k95
5115H1l84r8l3J32O9o7k35N48K9j48j48J65k88O35l97J41K95j6M9LPn6O7L63k71
5140D43n16l8r3O4J71J42l50J12J54k98J80k03k38K99n7J22J6r7J64L21j16J33
5162C15J2OM2J67l85L34l62J03Ll39J95j38J52p3j54k41J62q2r1R6J41M7j46J19
5186a17j78L94J20l6l1j12O4m0L39k63K3Q6m7pN1j98m3k04L6J7j09J46j80N9k91
5211e21J89l0J40K96k70J82j1J21n1J13m93J61K40K08p3O0N6%j07J4l04O6J86
5234A72k35j6k5l0j03J18K62n04M80j32Qk7J44l18K29J35k43K59l1p7K38q6j92
5257B6O6k8K61J06l22k73k3K04J47n9k12J23q5Q3j79K77l04J36k76L02R5k95K99
$$ plain form
5280 69 -16 -47 146 103 -17 161 233 91 161 0 323 604 191 397 -160 -238 126 154 -107 -8 -115 157 -249
5303 -249 3 -273 -182 -362 -179 -176 -203 154 -278 11 -12 16 -117 121 167 128 131 167 355 171 81 230 296 20
5327 20 57 -127 -265 -148 -186 -100 -294 -284 -106 -150 -225 -195 -154 -99 -252 51 -266 165 125 -56 -25 128 227 145 211
5352 211 78 75 226 155 267 -94 -165 -36 -242 46 -399 -237 -422 -275 -235 -394 -127 -148 -174 -245 -151 35 65
5375 65 367 206 167 502 144 219 442 209 299 428 138 -55 65 120 122 -149 -275 107 -54 -274 -247 -294 -260
5398 -260 -115 -154 -109 -114 13 -172 -237 232 45 183 29 16 132 185 158 307 281 367 295 -97 31 -90 -268 -60
5422 -60 -217 -133 -82 -444 -180 221 -307 -17 -147 62 -143 -293 34 98 -313 20 9 -32 -11 -40 -11 355 350 91
5446 91 212 140 37 9 -184 -333 94 -448 -169 -280 -122 44 -304 -277 -391 -347 -216 -204 52 -49 180 -101
$$ packed form
5280F9q5l1J93m3j20J78P2j42P0j61L23K81m13K06n57p8L64K8k61R9j07K72m06
5303b49K52k76R1j80J83Lk7L57m32K89k3K8j33K38M6l9LL6J88j84r0J49O6k76
5327B0L7j84j38J17l8Q6j94J0J78m4p5L0M1N5j53L03l17M31m0j81L1J53R9q2O6
5352B11j33lJ51p1J12l61p1J29k06K88m45J62j85J47M0j59K67k1k6p1R4J86L0
5375F5L02j61l9L35l58P5K23k33R0J29k90j93J20N5Kk71j26L82j61k20K7m7L4
5398b60J45l9M5nJ27j85o5M69j87J38j54j3J16N3k7J49k6Q6p2l92J28j21j78K08
5422f0j57Q4N1l62K64M01n28K90j30K09k05j50L27O4m11L33j1m1K1k9K9L66nk59
5446I1J21p2j03k8j93j49M27n42K79j11J58J66l48K7j14M4J31J2K56j01K29k81
$$ plain form
5468 -101 -122 674 246 90 251 91 15 278 34 277 194 -18 129 -181 -50 156 -92 -430 -73 -269 -374
5489 -374 -499 -339 -57 -88 6 104 -97 45 154 191 55 113 287 337 430 115 23 214 142 321 278 181 -181 281
5513 281 -106 -265 141 -26 -189 -179 -60 -91 -430 -103 -200 -171 205 -212 -216 -330 -236 73 117 258 -67 184 527
5536 527 98 429 322 135 100 -64 -22 114 107 -45 -245 -215 -216 -246 91 -81 -184 -342 25 -85 192 -133 -87
5559 -87 25 186 -66 -52 -57 107 73 34 249 18 169 110 4 40 -258 12 121 26 -314 -83 -160 -303 -581
5582 -581 -197 -361 -438 -277 -338 -367 -327 -2 271 174 -53 427 192 244 220 251 154 476 196 70 259 366 -79
5605 -79 -170 -70 -129 -157 -218 -275 80 39 -169 -386 -385 -198 18 -214 25 -78 -190 -149 352 399 294 51 101 201
5629 201 340 270 284 348 124 281 -158 179 -233 -264 99 128 -115 -522 -260 -179 -126 -199 -257 54 175 5 127
$$ packed form
5468a01k1P96m28j56J61j60p6K63k44K43q3k12J47l10J31K06k48l38L57j96j05
5489c74j25J60K82l1R4R8k01J42J09L7j36N8J74N0R3l15r2J91p2J79m3r7l62M62
5513B81l87j59M06j67j63J0J19l1l39L27r7K9L76m17mj14R4L09M4J41l25K51L43
5536E27m29L31j07j87l5j64M2J36pj52k00L0jl0L37j72j03j58L67j10K77l25M6
5559h7J12J61k52J4nJ64l4l9K15k31J51n9j06L6k98K70J09r5l40K31p7j43k78
5582e81L84j64p7J61o1k9M0L25K73r7k27M80k35N2k4L1r7L22k80j26J89J07m45
5605g9r1J00n9k8o1n7L55m1k08k17JJ87K16k32K39j03j12M1N01M7j05k43N0J00
5629B01J39p0J4O4k24J57m39L37m12l1L63K9k43m07K62Q1N3p3n8L11J21j70J22
$$ plain form
5652 127 51 255 200 313 173 346 291 148 124 210 199 -18 -43 240 360 -133 -136 -9 -94 207 -315 -450 -291
5675 -291 -251 -44 -222 -251 -117 -25 42 1 -66 92 -290 75 33 -66 255 361 302 156 178 64 94 -31 -143 34
5699 34 -119 -21 -233 -155 -218 -371 -520 -47 -298 -113 -193 -96 -225 192 86 10 150 -33 261 504 -32 108
5721 108 -1 26 196 173 24 -257 -157 5 -156 -76 -329 -148 33 -120 1 45 59 -85 -294 141 -245 -139
5743 -139 104 -40 150 -195 302 27 220 54 293 68 493 -18 228 18 399 -157 -156 63 66 -361 -67
5764 -67 -273 -379 94 -157 -60 89 -92 -96 -247 -71 -185 153 48 357 272 183 272 86 162 -48 22 497 51
5787 51 189 243 72 -79 -172 -123 -289 -157 -172 -266 -57 89 -404 -334 -5 -38 -393 -381 -160 -162 2 -5 -43 -217 313
5812 313 58 99 202 237 224 167 53 112 -28 44 -216 -140 -235 -215 -277 -153 -327 -300 -334 -319 -38 -215 -131 -114 102
$$ packed form
5652A27p6K04n5J13j40J73n5j43k4Q6j1k17k5K83J20m93lJ27q5L01n22j35J59
5675b91M0K07j78k9J34R2O7m1o7J58l82L65m2r9L21J06n9j46K2j14L0j25j12J77
5699C4j53R8k12P8o3j53j49M73k51J85q0R7j29M17j06p6J40j83K94K43n36J40
5721A08j09K7J70k3j49k81J00J62j61Q0k53J81J81j53J21M4J4j44k09M35l86J06
5743a39K43j44J90l45M97k75J93j66K39k25M25n11K46k10L81n56JK19Lm27K94
5764f7k06j06M73k51R7J49j81mj51J76j14L38j05L09q5q9Q9j86P6k10P0M75m46
5787E1J38N4j71j51r3M9j66J32j5r4K09J46m93P0L29l3l55J2K21kJ64pl8j74N30
5812C13k55M1J03L5j3n7j14N9j40P2k60P6r5K0o2J24j74K7l4J5K81j77Q4J7K16
$$ plain form
5837 102 -112 61 -126 79 129 293 256 240 330 240 347 105 137 99 -173 -200 -100 -35 31 -1 -173 7 -225 -65
5861 -65 -221 -59 -232 -81 16 106 89 -54 247 -62 -32 22 -75 332 409 399 119 122 331 237 235 6 137 40 79
5886 79 49 16 -166 -201 -239 -269 -240 -74 -359 37 161 18 207 66 169 388 -86 84 16 216 378 374 180
5909 180 144 -41 8 94 146 20 -235 -36 -88 -55 -409 -65 -239 -182 -9 6 -58 -66 29 -21 -168 -84 19 200 93
5934 93 121 92 22 -185 218 105 308 -141 -11 71 9 5 79 -153 211 113 198 -377 -521 -178 -65 77 -273 81
5958 81 -196 -219 -211 -139 214 392 126 216 36 59 485 64 53 85 158 118 -87 124 177 -208 99 -68 -147 -324
5982 -324 -148 -371 -19 -217 -171 -325 7 24 -170 50 -56 0 -157 73 21 317 131 403 128 100 245 131
6004 131 209 162 99 -58 -120 -26 144 -14 -96 -82 -211 -46 -384 -104 -214 -297 -24 -69 -112 135 -18 107 150 490
$$ packed form
5837A02k14J73j87K05N0J64l7j6R0r0J07k42L2l8k72k7J00O5O6l2j72J80k32J60
5861f5j56J62j73J51R7R0j7j43L01l09L0N4r7M07P7j0k80LK09r4kk29J31r7L9
5886G9l0l3j82l5l8l0K9J66k85L96J24j43J89j41J03K19m74J70o8K00J62mj94
5909A80l6j85M9Q6N2j26k55J99n2L3l54L44j74N7J73J5o4qR5n0j47Q4J03J81j07
5934I3K8k9p0k07M03j13K03m49J30Q2o2mP4k32L64r8Q5n75j44L43J13J42l50L54
5958H1k77k3QP2L53J78k66R0j80K3M26m21j1L2P3m0k05K11N3l85L07j67p9j77
5982c24J76k23L52j98M6j54L32J7j94K20j06N6j57K30n2K96j86K72k75k8J45j14
6004A31P8m7o3j57o2R4J70j58q2J4j29J65l38K80j10q3K73m5m3K47j53J25M3L40
$$ plain form
6028 490 224 124 60 307 352 109 190 39 155 111 267 19 -151 -118 73 24 -425 -90 -399 -389 -278 -287 -327
6051 -327 -94 -23 -71 -229 -98 -38 -36 454 240 232 59 249 104 30 192 -101 -130 -168 -53 -281 -164 -201 -295 -132
6075 -132 10 -196 -280 -152 -118 -356 -191 13 -121 177 8 -143 15 158 148 65 290 238 147 16 290 227
6097 227 17 -262 9 -19 34 -26 -10 -157 -300 -302 -71 -347 -1 -118 -28 -76 164 70 127 -20 152 319 193
6120 193 217 65 201 242 47 55 6 114 1 -195 106 101 148 -284 -366 17 98 -189 -135 -33 -184 -1 -157 -202
6144 -202 -95 -72 -70 55 238 242 57 201 327 45 180 -70 130 -78 290 16 117 -216 114 -26 -87 126
6166 126 -218 4 -208 -214 -184 57 -117 -104 89 -206 -371 -22 147 308 -105 94 177 335 48 160 259 60
6188 60 139 9 -114 114 33 103 -41 -96 -35 -63 -110 74 31 -21 -387 -296 -349 -247 -8 -17 36 166 -306 137 124
$$ packed form
6028D90k66j00o4K47M5k43Q1j51J16m4J56k48j70L3J91m9m49L35l09J0J11rm0
6051c27K33P1m8j58J31O0KM90k14qj73J90j45p4J62k93k9l8J15k28J17l7r4J63
6075a32J42k06q4J28L4k38J65K04j34K98j69j51J58J43j0q3K25n2r1j31K74o3
6097B27k10k79K71k8N3o0J6j47j43kK31k76L46j17R0m8K40r4N7j47J72J67j26
6120A93K4j52J36M1j95Qm9J08j13j96L01nM7m32q2L83Q1k87N4J02j51J83j56m5
6144b02J07K3KJ25J83Mj85J44J26k82J35k50K00k08L68k74J01l33L30j40o1K13
6166A26l44K22k12oL0K41j74J3J93k95j65L49J69J61m13J99Q3J58k87J12R9j99
6188F0P9j30j23K28q1P0j44n5O1k8m7J84m3n2l66R1n3J02K39rN3J30m72M43j3
$$ plain form
6213 124 219 169 342 183 -9 260 151 36 100 268 -129 -120 -177 52 -11 -81 -52 -268 -276 -149 79 -74 -77 -122 116
6238 116 64 60 104 -126 108 315 -19 -62 157 323 146 66 84 439 152 125 34 151 -37 -233 -207 20 -232
6261 -232 -119 -233 92 -333 -153 17 33 -50 174 50 163 350 148 168 222 55 204 228 82 332 119 79
6283 79 179 325 92 176 -468 114 23 -117 -184 -178 -297 131 -333 -200 99 -311 202 217 126 260 68 213 122
6306 122 74 -44 194 84 137 272 -75 165 187 259 -33 -176 -235 -216 -57 -140 -114 -179 -314 -135 -233 -18 -15 -259
6330 -259 37 33 137 -88 -102 158 259 141 30 126 419 140 106 250 -71 111 236 -110 -110 -464 -123 -185 -40
6353 -40 -122 -253 13 -241 39 -210 -18 -94 -104 -33 78 -113 -303 49 -119 238 95 50 78 1 25 37 163
6376 163 50 345 173 -99 44 9 -125 47 -113 -224 -161 -69 -175 -322 -346 -104 50 10 116 -179 185 176
$$ packed form
6213A24R5n0J73j59j92K69j09j15O4J68l97Rn7K29o3p0K9k16qJ27K28j53lm5K38
6238A16n2mM4k30K34K07l34m3K19J66j77q0J8L55k87k7r1J17j88j96K6K27k52
6261b32J13j14L25m25J80J70J6q3K24j24J13J87k02K0N4j67J49K4j46K50k13m0
6283G9J00J46k33Q4o44N82r1j40o7Oj19M28m64J33K99m10N13J5r1J34j92J45r1
6306A22m8j18K38j10N3J35l47K40K2P2k92j43n9J9J59q3K6o5j35J79r8K15Lk44
6330b59K96mJ04k25j4K60J01j18j11R6K93k79l4J44l21J82J25l46%l54L41o2J45
6353d0q2j31K66k54K80k49J92p6j0P1J11j91j90L52j68L57j43m5K8p7K4J2J26
6376A63j13K95j72k72J43l5j34J72j60j11O3R2j06j47k4K42J54m0J06k95L64r
$$ plain form
6398 176 277 147 -12 396 40 134 192 206 20 123 260 206 -205 -44 51 -123 -176 -403 -86 -449 -263 -167
6420 -167 -225 -217 27 -151 -90 -11 -141 119 106 70 178 199 166 505 367 14 102 75 130 -166 16 144 18 -130
6444 -130 -206 -214 62 -111 67 -151 96 -83 -27 20 -140 40 110 273 31 69 -37 329 164 109 77 141 260
6467 260 394 -112 -120 39 17 -208 -113 51 -22 -37 -45 117 -5 -125 -59 46 -114 -28 -150 -62 45 23 -63 -62 -35
6492 -35 16 206 24 294 -277 12 -287 245 -199 83 75 150 -225 -446 -148 -209 -141 -97 -486 -194 133 -126 20
6515 20 -169 24 -172 114 -59 -22 -242 1 -50 58 213 -251 38 -66 13 115 263 -126 146 -189 -149 58
6537 58 7 40 -147 -237 215 -209 -269 220 -294 -264 122 86 18 -159 26 -27 143 -75 -262 95 -11 -32 199
6560 199 326 168 448 97 340 302 -313 -114 -80 127 -152 58 -21 16 -259 107 18 -50 -55 -27 158 41 -37
$$ packed form
6398A76J01j30j59M08l56R4N8J4j86J03J37n4m11J61R5j74n3k27L17l63J86R6
6420a67n8QK44j78O1P9j30K60j3l6J08K1l3L39j38l53Q8k7N5k96J82J28j26j48
6444a30p6qK76j73J78k18K47j79N6M7j60J80P0J63k42L8j06L66j65n5l2O4J19
6467B60J34n06qJ59k2k25R5J64p3j5qJ62j22j20O6J05j60Q6j22Q8J07k2q6JK7
6492c5N1J90j82K70n71K89k99N32m44K82qP5l75k21K98o1O8M4l89K92L27k59J46
6515B0j89J93j96K86j73L7k20K43n1J08J55m64K89j04P9J02J48l89K72l35M0K07
6537E8n1L3j87r0M52m24o0M89n14L0L86l6o8j77J85n3J70k18j87L57j06k1K31
6560A99J27j58K80l51K43l8o15J99L4K07k79K10p9L7k75L66q9o8nK8J85j17p8
$$ plain form
6583 -37 -5 80 300 286 394 -31 275 345 -39 296 -127 58 143 58 82 48 -278 -80 -396 -123 -92 -381 119
6606 119 -285 40 134 -58 -79 -57 152 233 -6 -55 16 89 315 218 318 23 67 -55 73 34 47 -31 -12 -552
6630 -552 -314 -155 -343 -58 -121 -197 -295 -320 -242 57 -99 35 -181 15 118 32 155 -80 -7 312 255 179 125
6653 125 294 266 100 146 -103 116 -79 -264 -130 -189 -478 -141 109 -239 25 -21 -200 -115 -52 -95 -133 139 -27
6676 -27 -95 -24 147 42 417 304 141 -27 116 220 46 250 75 -93 119 -185 121 -62 -338 112 -52
6697 -52 -207 -163 -17 56 41 -3 180 494 143 61 339 146 301 234 -43 115 475 337 138 -118 223 50
6719 50 106 -266 29 82 -53 -202 -266 -62 -330 -214 -335 73 -242 -50 49 89 388 265 -3 349 -70 -23
6741 -23 108 64 239 124 105 -120 83 -69 13 -147 -27 -426 -72 -276 -226 -190 -29 -306 -231 -77 -166 -107 -304
$$ packed form
6583c7L2Q5K20j4J08m25L06P0l84L35m23J85Q5q5K4l4l26J98l16K73L1k89N00
6606A19m04L25R4j92k1K2K09Q1k39m9P1P3K26r7J00k95M4j22J28l9J3p8J9n40
6630e52K38J59j88K85o3p6r8k5P8K99j56J34k16J96J03q6J23k35P3L19n7p6n4
6653A25J69k8j66M6k49K19j95j85J34n9k89L37K50l48K64m6j79Q5O3m3l8K72j66
6676b7o8P1J71j05L75j13j63j68J43J04j74K04j75j68K12l04L06j83k76M50j64
6697e2j55M4J46P3j5m4J83L14l51q2K78j93J55o7k77J58L60j38j99k56L41j73
6719E0N6l72K95N3j35j49o4K04k68J16j21M08l15J92R9M0K99j23k68L52m19M7
6741b3J31m4J75j15j9k25K03j52Q2j60J20l99L54k04N0L6J61k77P5J54q9N9j97
$$ plain form
6764 -304 72 -109 -246 14 123 48 -23 100 20 -194 -11 151 94 -117 -190 11 -293 54 -315 61 -34 -92
6786 -92 -68 -334 -191 9 25 -97 57 -110 -265 -20 133 246 38 43 150 4 278 -200 -59 -122 -326 348
6808 348 190 -83 33 197 228 -172 -243 -12 -43 243 125 185 22 -197 -57 56 -72 -160 380 26 96 205
6830 205 155 140 308 130 73 375 98 -14 186 204 95 190 176 254 160 -343 -161 290 -41 22 60 -183 -167 22
6854 22 67 -96 -152 -121 123 -37 142 151 -67 23 115 176 -50 -71 220 -80 56 235 83 50 -79 -14 -270 -173
6878 -173 -194 53 -154 -96 -103 -525 -230 -146 -98 -6 -17 -106 27 -50 -123 -117 -4 248 38 -143 123 -100 -169 -307 -223
6903 -223 -147 -339 -154 -172 -265 -142 -147 -324 -181 -349 -206 -358 -144 84 -76 83 123 -96 -27 212 -46 198
6925 198 -79 78 -26 -109 161 135 225 149 62 97 51 73 -101 64 -132 -210 184 296 135 -524 -278 61 199
$$ packed form
6764c04L76j81j37K60J09p5p1J23q0k14J83J62n7k11p3K01l04L47l69L76r5n8
6786i2K4k66J43K00J6j22J54j67j55K45J53J13k08NJ07j46K74m78J41o3k04O74
6808C48j58k73J16J64L1m00p1K31l1K86j18O0j63k19J40J13j28q8N40l54P0J09
6830B05n0j5J68j78n7L02k77j12K00J8j09R5j4P8r4n03J82M51l31O3L8k43J6J89
6854B2M5j63n6L1K44j60J79Rk18R0R2O1k26k1K91l00J36J79j52l3j29O5k56R7
6878a73k1K47k07N8pm22K95Q4M8R2j1q9J33p7p3OJ13K52k10j81K66k23o9j38Q4
6903b23P6j92J85j8r3J23nj77J43j68J43j52K14K28j60J59M0k19O9K39k58K44
6925A98k77J57j04q3K70k6R0p6q7L5m6K2j74J65j96p8L94J12j61o59K46L39J38
$$ plain form
6948 199 -49 152 246 54 114 375 445 105 43 54 111 130 291 84 89 -29 106 202 60 -27 237 169 201 10
6972 10 -23 -22 -202 -179 -149 11 52 -139 -4 47 212 32 256 236 57 42 151 159 181 161 323 8 104 65 59 61 1
6999 1 -48 -119 96 -278 -204 -250 -245 55 -196 -113 -389 -100 19 -292 213 -94 226 79 16 37 -17 36 -195 223
7023 223 -25 192 127 -79 -313 26 -38 -290 -193 -192 -75 82 -527 -312 -322 -3 -187 6 5 -13 106 -108 -132
7046 -132 67 -109 39 39 -3 -80 33 -112 8 147 -173 267 177 18 -185 89 -42 -18 -161 172 -54 233
7068 233 64 -256 -66 -84 46 90 419 107 143 100 -35 262 187 212 -41 220 285 416 255 51 354 251
7090 251 228 406 48 -18 149 191 259 -184 -6 219 277 -203 81 125 162 339 -110 211 -10 326 187 93 126
7113 126 -67 186 97 11 -75 108 122 -217 103 -213 -226 108 72 -176 -264 -318 -76 -9 25 -256 -298 -343 38 112
$$ packed form
6948A99k48K01R4j92O0K61P0l40o2J1N7J9J61k07Nj18J35R6j42q7K64o8L2j91
6972A0l3Jj80K3L0J60M1j91J35N1J65j80K24k0j79j5J09QK2k0J62l15R6l9oKo0
6999Am9p1K15l74P4m6NL00k51Q3k76K89J19l11N05l07L20j47o3K1n4N3k31M18
7023B23k48K17o5k06k34L39o4k52R7JJ17J57o09K15j0L19j84J93jj8J19k14k4
7046a32J99j76J48%m2p7J13j45J20J39l20M40r0j59k03K74j31K4j43L33k26K87
7068B33j69l20J90j8J30M4L29l12L6m3j35K97p5K5k53K61O5J31j61k04L03j03
7090B51k3J78l58o6J67M2O8m43J78K25N8m80K84M4L7J77m49L21k21L36j39r4L3
7113A26j93K53q9q6q6J83J4l39L20l16j3L34l6k48q8n4K42O7L4k81m2m5L81P4
$$ plain form
7137 112 26 -153 85 -19 266 161 131 114 148 -159 -47 23 -267 -304 -286 -116 -170 -116 -66 -71 -39 -91 -269 9 -164
7162 -164 -311 -190 -196 85 -26 86 -40 327 -86 116 223 82 71 -68 66 -5 95 -44 -29 -216 -43 -168
7184 -168 32 -357 77 -313 -138 -255 -82 -132 69 -12 154 47 -55 -15 165 -96 290 145 -74 112 499
7205 499 -65 73 217 40 222 124 -118 -32 254 23 -93 18 55 148 -147 41 40 8 180 -33 2 -95 -91 273
7229 273 264 172 75 61 171 153 31 347 11 -42 -166 -94 46 -186 -118 16 -158 -382 262 165 -362 -126 -287
7252 -287 -176 -224 -81 108 -120 -3 99 150 125 89 60 317 80 -29 35 -75 61 31 74 -59 -104 -73 -305
7275 -305 -220 -216 67 -171 -206 117 -61 20 -32 153 -258 -151 -323 -80 -71 -61 -315 -145 -342 -67 138 57 78 -8
7299 -8 46 -44 -218 -21 -123 -52 -263 39 -231 110 -152 178 -133 -56 49 -82 -100 -172 91 -63 -12 -184 139
$$ packed form
7137A12q6j79K38j04K85j05l0j7L4l07J12P0k90l7J8J70n4N4N0nL2n2j78K78j73
7162a64j47J21oK81j11J12j26L67m13K02J07j41j1j39J34p1J00j39J5j87J73j25
7184a68K00l89M34l90J75j17J73n0K01q1J66j07j02M0J80k61L86j45k19J86L87
7205D99n64J38J44j77J82r8k42Q6K86k31j16J11L7R3k95J88jl2J72k13L5r7ML64
7229B73rr2r7j4J10j8j22L16l36n3j24P2J40k32O8J34j74k24O44r7n27K36j61
7252b87J11m8J43J89k28J17J02N1k5l6k9K57k37j09O4j10J36l0M3j33m5L1k32
7275c05Q5MK83k38l5L23j78Q1n2J85m11J07j72K43RJ0k54J70j97K75K05q1K1q6
7299hN4r0j74J97j02P1k11L02k70L41k62L30l11P7J05j31j8p2K63j54N1j72L23
$$ plain form
7322 139 15 -193 130 -16 85 12 341 190 71 74 114 292 191 162 241 77 14 172 260 307 168 -202 47
7345 47 127 163 134 -164 208 210 11 241 52 314 59 152 247 128 -82 -49 157 145 235 -42 73 20 241 249 -130
7370 -130 -24 -359 -188 -130 90 -272 43 -75 -193 -248 -242 -85 -265 51 56 -85 -22 -123 109 -205 -94 242
7392 242 214 157 154 -94 -356 -77 -48 54 -152 -228 54 -130 -123 -56 -148 -137 -53 -219 -289 -370 54 120 -140 97 220
7417 220 -38 -95 190 24 -193 224 233 177 -28 142 237 455 -39 -25 302 -21 17 -37 -245 -168 -126 -337 -27
7440 -27 -80 -318 129 -156 93 -43 163 44 93 290 5 50 179 168 38 189 279 185 280 159 412 -22 -135
7463 -135 -270 -261 -23 202 66 156 -257 31 72 -198 -255 15 66 -44 212 139 200 354 181 285 221 69 589
7486 589 -15 277 158 312 -33 150 259 51 -133 162 -71 -47 61 -124 -415 -177 -103 -402 -116 -218 -136
$$ packed form
7322A39j24k08L23j46J01p3L29j51j19LM0J78j01k9P9j64o3J58Q8M7j39l70K49
7345D7Q0L6k9k98L72Kj99K30j89K62k55R3R5j19k10L3K06j2R0k77J15n3K21Ql79
7370a30J06l35J71N8K20l62L15j18j18n5OJ57j80L16Nj41O3j01K32l14J11L36
7392B42k8n7lk48k62K79K9J02k06p6K82j84PO7r2J1Q4j66p0q1M24O6k60K37J23
7417B20k58n7K85j66k17M17Rn6k05J70R5K18m94J4L27l23L8n4k08P7M2k11L10
7440b7n3k38M47k85K49j36K06j19M9J97k85M5J29j1j30J51R0r4R5j21K53m34j13
7463a35j35RK38K25j36R0m13K88M1k70n7K70N1j10K56p3O1J54j73J04o4j52N20
7486E89o04K92j19J54l45J83J09k08j84K95k33K4J08j85k91K38P4k99K86j02Q2
$$ plain form
7507 -136 312 78 -57 75 -32 86 -3 -57 451 -77 140 101 -58 -18 -25 55 128 17 240 -28 -298 -142 -255
7530 -255 127 -319 -202 -218 -50 28 -23 -253 -56 32 121 236 -8 -98 356 74 -64 2 -153 53 -205 136
7552 136 -122 -349 -64 -70 -150 -104 159 -107 -229 -51 -143 -156 56 -165 -37 -109 -125 39 192 176 95 80 242 155
7576 155 434 99 100 2 231 165 -252 -68 -88 19 89 -255 50 -223 -83 -157 -228 86 30 47 -142 83 138 -39
7600 -39 342 186 -58 38 -139 92 29 121 379 -104 -199 380 115 268 19 117 42 20 229 -122 -206 -17 195
7623 195 -75 -146 -141 92 170 187 -134 -19 58 28 70 216 -187 150 93 -58 126 -162 109 -100 95 43 -55 -10
7647 -10 -215 -343 -251 -2 82 -140 -3 27 -282 -119 -117 90 -150 -161 -49 85 -81 -95 435 138 47 192 39
7670 39 91 130 -44 144 -161 -186 77 -124 9 -46 -17 22 -79 62 -18 -270 -169 83 -58 -149 -48 -78 82
$$ packed form
7507a36M48k34j35J32j07J18q9n4N08n28K17l9j59M0pQ0P3j11K23k68k70J56j13
7530b55L82m46J17j6J68P8n1k30J97Q8Q9J15k44r0M54k82j38O6j55K06k58L41
7552A36k58k27K85oq0M6K63k66j22J78r2j3K12k21J28p2j6J64J53j6q1j5J62q7
7576A55K79l35Jr8K29o6m17J84k0J07P0l44L05k73J40p4p1L14n6J7j89K25N5j77
7600c9L81j56k44R6j77K31o3R2K58m83r5N79k65J53k49R8p5k2K09l51q4J89K12
7623A95k70p1NK33P8J7l21J15P7l0M2J46m03L37n7j51J84k88K71k09J95n2r8M5
7647a0k05j28R2K49Q4k22J37L0l09J63KK07k40j1J12J34j66j4N30k97r1J45j53
7670C9N2L9j74J88l05k5K63k01J33n5K9L9j01J41q0k52J01K52j41r1J01l0J60
$$ plain form
7693 82 -11 133 -10 324 52 232 20 256 16 193 102 145 105 58 386 8 255 -377 -137 37 -44 39 -175
7716 -175 -102 47 148 12 -81 36 -132 -349 -17 -116 -85 242 -19 375 -76 -153 38 153 43 2 -24 14 -114
7739 -114 46 55 106 93 -132 37 176 102 -301 -151 101 -42 -84 -68 -245 184 32 49 168 -39 259 104 -50
7762 -50 -155 66 201 436 59 228 46 -19 -9 143 -297 -173 -54 -410 16 -40 -108 125 -26 43 63 -166
7784 -166 110 -17 -90 142 10 -55 7 229 182 -163 384 23 100 300 -32 304 286 -52 -108 -104 305 -83 -78 -71
7808 -71 -70 -129 176 66 130 -68 -66 -69 -92 -71 -292 141 79 73 173 -106 124 138 -119 19 362 215 82 116 -156
7833 -156 -377 -273 -111 -202 143 -164 -65 -277 -125 -415 -270 40 157 -137 -139 19 135 -79 86 -74 -97 159
7855 159 2 -111 150 36 -182 62 -76 -262 55 -273 -28 -174 -223 96 -194 13 -310 127 -354 -80
$$ packed form
7693H2r3J44j43L34k72J80k12K36k40J77r1M3m0m7L28l78K47o32K40J74q1Q3k14
7716a75P3J49J01j36r3J17j68k17L32r9L1L27k61L94m51p7J91J15j10m1k6L8j28
7739a14J60RN1j3k25J69J39p4m03J50K52j43m2J6j77M29j52J7J19k07K98j55j54
7762e0j05K21J35K35l77J69j82o5J0J52m40J24J19l56M26n6o8K33j51O9K0k29
7784a66K76j27p3K32j32o5O2K22m7l45N47l61P7K00l32L36j8l38n6MM09l88NP
7808g1Jn9L05j10O4j98Klk3K1k21M33o2oJ00k79K30J4k57J38L43j47j33L4k72
7833a56k21J04J62r1L45l07R9k12J52k90J45L10J17k94kJ58J16k14J65j60k3K56
7855A59j57j13K61j14k18K44j38j86L17l28K45j46m9L19k90K07l23M37m81K74
$$ plain form
7875 -80 97 -168 102 5 -22 121 64 232 101 194 43 -146 239 -34 18 113 -66 -74 -265 -3 12 -33 -44 13
7899 13 100 1 -410 131 -180 -81 71 -107 -47 -43 87 -118 200 -212 -112 -48 106 187 95 194 -355 11 131 99
7923 99 -128 -10 -30 0 110 -21 -132 -23 -207 -166 247 39 -32 -56 5 -181 43 289 -54 172 -215 214
7945 214 -3 208 178 255 299 1 456 -76 -121 -58 30 -46 14 -83 -395 188 -53 -300 -226 -118 -246 -52 -142 -303
7969 -303 76 -190 -317 47 51 -184 133 -70 -209 89 -249 126 -158 -187 67 -61 -61 190 -80 63 -111 10
7991 10 -220 -127 -86 -114 -110 19 -239 8 30 52 -117 -41 56 1 105 -3 60 376 -140 -115 7 49 -147 -107 155
8016 155 -229 114 -94 -159 76 -121 82 -35 61 -88 -115 176 -37 78 127 -100 278 197 36 373 -40 214
8038 214 71 -1 194 139 424 201 241 138 143 267 -145 -6 -41 155 142 18 -273 -70 86 43 -69 87 363
$$ packed form
7875h0J77k65K70r7k7J43n7J68j31R3j51j89L85k73N2R5j79qj91K62J5m5j1N7
7899A3Q7r9m11N41l11R9J52j78O0MJ30k05L18m12J00O4J54Q1r2R9n49L66J20l2
7923I9k27J18k0L0J10j31j11J09j84M1M13k08p1k4O1j86K24K46l43K26l87M29
7945B14k17K11l0P7M4k98M55n32m5O3Q8p6O0r7l12N83k41k47P4J08j28J94r0j61
7969c03L79k66j27L64Mk35L17k03j39K98l38L75k84k9K54j28%K51k70J43j74J21
7991A0k30R3M1k8MJ29k58K47K2K2j69P6R7n5J04j08O3L16n16K5J22M2j96M0K62
8016A55l84L43k08o5K35j97K03j17R6j49k7K91k13J15M9k27L78q1j61L37m13K54
8038B14j43p2J95n5K85k23M0j03NJ24m12J39l5J96j3j24k91K03J56m3j12J56K76
$$ plain form
8061 363 340 -97 197 123 86 211 244 80 86 311 55 199 92 88 28 237 195 -147 91 290 -26 16 -213 -152
8085 -152 6 103 -106 -78 -12 -12 81 -93 -117 -167 67 -92 -144 -237 168 93 189 129 23 210 42 55 148 -21 59
8110 59 -248 97 -325 -48 -118 -316 -253 -246 -144 22 39 -234 -122 -108 236 -176 22 77 35 -95 162 -219 155
8133 155 347 133 93 197 -25 94 97 -63 -112 -28 -22 46 -174 103 -198 -48 318 -55 -52 20 41 199 93 -27
8157 -27 -5 41 98 109 503 134 78 301 347 204 98 175 4 155 3 26 -176 -48 -23 108 37 231 338 152
8181 152 -30 214 558 -113 17 -47 439 -123 -70 15
$$ packed form
8061C63k3m37K94p4l7J25L3j64OK25k56J44j07mo0K09m2l42K38J99l16M2k29O1
8085a52J58R7k09K8O6%R3j74k4n0K34j59n2r3M05p5R6o0j06J87j68J3R3j69Q0
8110E9l07L45m22K77p0j98O3PJ02J66J7k73J12J4L44m12J98N5m2j30K57l81L74
8133A55J92k14m0J04k22J19Lj60m9Q4OO8k20K77l01J50L66l73LP2K1J58j06j20
8157b7K2M6N7J1L94l69n6K23M6j43j06P7j71J51j52K3k02J28K5J31p1J94J07j86
8181A52j82K44L44o71J30o4M86n62N3Q5
8191A5
$$ Imaginary data points
##PAGE= N=2
##DATA TABLE= (X++(I..I)), XYDATA
$$ plain form
0 0 0 0 0 0 0 0 0 0 0 8 -8 8 -8 16 -16 16 -24 24 -32 39 -41 48 -56 67 -77 87 -100 114 -127 145 -164 183
32 183 -204 228 -257 284 -317 352 -390 433 -479 529 -587 651 -721 800 -888 990 -1108 1246
50 1246 -1408 1604 -1847 2155 -2562 3128 -3969 5357 -8058 15311 -78199 -215789 -80482 69339
64 69339 97743 -33490 -131972 -90860 48738 118418 68240 -30070 -58563 -19340 23220 12155
76 12155 -20796 -36580 -24257 -15327 -14234 -4760 23377 39201 18276 -25886 -41411 -13594 17438
89 17438 927 -52797 -83579 -52549 4115 24209 -6188 -36244 -21185 24161 46352 24652
101 24652 -10042 -17519 2606 21262 16972 -2001 -15985 -13669 2888 19815 19921 -1992 -26857
114 -26857 -26090 4770 30462 15199 -30185 -52262 -19998 32175 41048 -4563 -47084 -30639 29138
$$ packed form
0@%%%%%%%%%Qj6J6j6K4l2L2m0M8n6P1q0Q9j04J23j44J64j87K14k41K72l09L47
32A83l87M32m85N41o01O69p42Q23r12J008j116J238j372J521j688J878k098K354
50A246k654L012l451M002m717N690p097R326j3415K3369r3510j37590J35307J49821
64F9339K8404j31233r8482M1112J39598O9680n0178r8310k8493L9223M2560j1065
76A2155l2951j5784J2323Q930J093R474K8137J5824k0925m4162j5525K7817L1032
89A7438j6511n3724l0782L1030N6664K0094l0397l0056J5059M5346K2191k1700
101B4652l4694p477K0125J8656m290j8973j3984K316J6557J6927J06k1913k4865
114b6857P67L0860K5692j5263m5384k2077L2264N2173Q873m5611m2521J6445N9777
$$ plain form
127 29138 62062 31528 -18330 -19947 30162 68196 45642 -7156 -22447 16434 50210 25840
139 25840 -31318 -47088 -577 46071 28572 -29883 -49115 1149 57310 45905 -17335 -49917
151 -49917 -10434 45507 43607 -9797 -39562 -4490 49770 52701 7472 -20990 5172 47678
163 47678 44455 -3941 -37865 -18049 23604 27673 -12951 -45397 -27774 16642 31631 735
175 735 -32902 -26359 9105 26266 4667 -24058 -21582 6585 23335 11536 -7717 -7736 8072
188 8072 14705 2509 -12524 -15099 -8885 -7495 -11580 -12986 -10256 -9487 -12234 -9445 -97 2835 -9869
203 -9869 -25134 -22182 -1940 8780 -6443 -28418 -23445 8359 29127 13703 -17270 -21526 6736
216 6736 27620 7168 -34065 -45116 -12636 18425 5683 -34695 -45431 -6356 36227 28710
$$ packed form
127B9138L2924l0534m9858j617N0109L8034k2554n2798j5291L8881L3776k4370
139B5840n7158j5770M6511M6648j7499n8455j9232N0264N6161j1405o3240l2582
151d9917L9483N5941j900n3404k9765L5072N4260K931m5229k8462K6162M2506
163D7678l223m8396l3924J9816M1653M069m0624l2446J7623M4416J4989l0896
175G35l3637O543L5464J7161k1599k8725K476K8167J6750j1799j9253j9J5808
188H072O633j2196j5033k575O214J390m085j406K730P69k747K789R348K932j2704
203i869j5265K952K0242J0720j5223k1975M973L1804K0768j5424l0973m256K8262
216F736K0884k0452m1233j1051L2480L1061j2742m0378j0736L9075M2583p517
$$ plain form
228 28710 -18175 -41178 -9296 34848 30532 -17215 -44598 -15484 31097 35138 -4965 -29648
240 -29648 -3362 38197 37500 -5693 -33077 -11122 25553 22577 -20523 -46566 -20192 24999 31359
253 31359 -5294 -33036 -11731 34026 47079 13099 -22424 -15426 22799 42111 19273 -13811
265 -13811 -15310 13627 34704 23513 -2191 -10056 4483 17289 10673 -5874 -12590 -6181 90
278 90 -823 -4071 -1863 2500 3709 3947 9218 14624 13033 6586 4186 11328 17268 11352 -572 -1544
294 -1544 10595 18098 7248 -9946 -11224 5394 15164 -867 -25493 -27312 -2977 15224 811
307 811 -28435 -31998 -482 28253 17834 -17421 -28854 532 34131 26186 -13875 -32761 -6356
320 -6356 29797 26159 -13350 -35928 -11041 26513 24028 -17452 -44633 -22464 16258 17262 -23047
$$ packed form
228B8710m6885k3003L1882M4144m316m7747k7383K9114M6581M041m0103k4683
240b9648K6286M1559o97m3193k7384K1955L6675k976m3100k6043K6374M5191O360
253C1359l6653k7742K1305M5757J3053l3980l5523O998L8225J9312k2838l3084
265a3811j499K8937K1077j1191k5704p865J4539J2806o616j6547o716O409O271
278I0r13l248K208M363J209K38N271N406j591o447k400P142N940n916j1924r72
294a544J2139P503j0850j7194j278J6618R770j6031k4626j819K4335J8201j4413
307H11k9246l563L1516K8735j0419l5255j1433K9386L3599p945m0061j8886K6405
320f356L6153l638l9509k2578K4887L7554k485m1480k7181K2169L8722J004m0309
$$ plain form
333 -23047 -51552 -29879 14447 24734 -9817 -39476 -22196 21440 36164 5233 -29023 -21825
345 -21825 15370 31273 6052 -27065 -25322 5438 24270 7327 -20722 -23180 43 16586
357 16586 4835 -18256 -23514 -7510 5991 1013 -12386 -14465 -2920 7631 7894 3283 3440 7095
371 7095 8494 6555 5688 7463 5421 -902 -4315 583 7760 6423 -2859 -6197 2625 11890 7968
386 7968 -5343 -8821 2822 12786 5199 -11207 -11656 9118 25486 14697 -9654 -12318 14349
399 14349 37306 23356 -13721 -27162 768 33795 26847 -13888 -36667 -11172 31167 36302
411 36302 -1498 -32509 -17046 23057 34697 3450 -28619 -20506 14824 30685 8260 -18720
423 -18720 -12354 18057 30300 8167 -18314 -13960 11409 20356 -2344 -27503 -21511 7018 19747
$$ packed form
333b3047k8505K1673M4326J0287l4551k9659J7280M3636J4724l0931l4256P198
345b1825L7195J5903k5221l3117J743L0760J8832j6943k8049k458K3223J6543
357A6586j1751k3091n258J6004J3501m978j3399k079J1545J0551K63m611J57L655
371G095J399j939q67J775k042o323l413M898P177j337r282l338Q822R265l922
386G968j3311l478J1643R964p587j6406m49K0774J6368j0789k4351k664K6667
399A4349K2957j3950l7077j3441K7930L3027o948m0735k2779K5495M2339N135
411C6302l7800l1011J5463M0103J1640l1247l2069Q113L5330J5861k2425k6980
423a8720O366L0411J2243k2133k6481M354K5369Q947k2700k5159N992K8529J2729
$$ plain form
436 19747 454 -23319 -19306 7823 22253 5318 -21096 -22329 1286 17885 7838 -14048
448 -14048 -18226 347 18728 15540 -2228 -12334 -5924 5824 6849 -3885 -14416 -16811 -12306
461 -12306 -5427 -1632 -3587 -10016 -14459 -9608 2315 9613 1015 -13818 -15846 -676 14894 10762
475 10762 -8258 -16246 -1607 18290 16953 -4619 -17912 -5958 14323 13831 -8432 -23990 -11810
488 -11810 10444 11561 -12062 -28147 -14183 11449 14865 -8628 -24635 -8671 21162 26275 895
501 895 -19025 -4466 26219 30494 716 -25092 -13141 20818 30979 2543 -26984 -17754 19306
514 19306 36121 9970 -25443 -26521 4950 25232 6964 -25678 -30631 -2453 23154 17834 -4371
527 -4371 -10022 9936 28198 21496 -413 -9325 1557 12999 6822 -8680 -11560 2134 15101
$$ packed form
436A9747j9293k3773M013K7129J4430j6935k6414j233K3615J6599j0047k1886
448a4048m178J8573J8381l188j7768j0106O410J1748J025j0734j0531k395M505
461a2306O879L795j955o429m443M851J1923P298q598j4833k028J5170J5570m132
475A0762j9020p988J4639J9897j337k1572j3293J1954K0281m92k2263j5558J2180
488a1810K2254J117k3623j6085J3964K5632L416k3493j6007J5964K9833N113k5380
501H95j9920J4559L0685M275k9778k5808J1951L3959J0161k8436k9527R230L7060
514A9306J6815k6151l5413j078L1471K0282j8268l2642m953K8178K5607n320k2205
527d371n651J9958J8262o702k1909q912J0882J1442o177j5502k880J3694J2967
$$ plain form
540 15101 13035 1463 -2583 4706 10242 4520 -7734 -14462 -11014 -6701 -5237 -5272 -2460 3024 7008
555 7008 9374 11629 12609 8148 22 -5006 -2907 181 -3524 -11720 -11419 1135 13751 11174 -2429
570 -2429 -7510 3499 15240 6622 -16975 -29285 -14464 7423 8140 -12672 -24192 -6036 22923
583 22923 27862 2765 -19402 -11141 13920 18678 -6547 -30965 -23256 6607 20172 2046 -20211
596 -20211 -14194 13756 26740 6268 -21426 -21740 2324 16794 996 -23273 -21511 4375 22419
609 22419 10617 -12598 -14497 7202 21520 7597 -16733 -20341 316 16577 6891 -15165 -18909
622 -18909 449 18500 12132 -8420 -17342 -3494 13376 12512 -2916 -12154 -4168 10403 13932
635 13932 5453 -3767 -3536 2075 5473 2839 -1622 -3832 -3475 -373 4150 6173 3454 -2540 -4759
$$ packed form
540A5101k066j1572m046P289N536n722j2254o728L448M313J464l5K812N484L984
555G008K366K255R80m461q126n028K099L088l705q196L01J2554J2616k577j3603
570b429n081J1009J1741q618k3597j2310J4821K1887P17k0812j1520J8156K8959
583B2923M939k5097k2167Q261K5061M758k5225k4418P709K9863J3565j8126k2257
596b0211O017K7950J2984k0472k7694l14K4064J4470j5798k4269J762K5886J8044
609B2419j1802k3215j899K1699J4318j3923k4330l608K0657J6261r686k2056l744
622a8909J9358J8051o368k0552q922J3848J6870q64j5428r238P986J4571L529
635A3932q479r220K31N611L398k634m461k210L57L102M523K023k719n994k219
$$ plain form
650 -4759 -492 5178 2188 -7477 -11883 -3654 8776 10880 655 -5212 3765 17927 17939 1382 -11532
665 -11532 -5144 10367 11439 -5227 -18939 -9690 11608 17853 966 -15321 -8559 12382 17203
678 17203 -3391 -24599 -18827 6009 16118 -216 -19908 -12980 15371 29410 11985 -13707
690 -13707 -14077 9974 24233 7440 -20513 -23865 996 21488 11750 -13603 -19626 973 20978
703 20978 13625 -12627 -23801 -9336 9459 7366 -11478 -20081 -6921 12324 15209 1987 -7835
716 -7835 -1269 10792 12127 518 -9345 -6914 1620 5443 1003 -3558 -2274 2544 5042 3514 -330
731 -330 -2715 -4133 -5330 -4353 -2886 -3145 -5084 -5092 -933 5285 6508 1293 -2675 699 7220 6144 -3051
748 -3051 -8786 -2611 8061 7970 -3822 -10221 -550 14456 14618 -3244 -16569 -7560 11813 14960
$$ packed form
650d759M267N670k990r665m406Q229J2430K104j0225n867Q977J4162J2j6557j2914
665a1532O388J5511J072j6666j3712R249K1298O245j6887j6287O762K0941M821
678A7203k0594k1208N772K4836J0109j6334j9692O928K8351J4039j7425k5692
690a3707l70K4051J4259j6793k7953l352K4861K0492r738k5353o023K0599K0005
703B0978p353k6252j1174J4465J8795k093j8844q603J3160J9245K885j3222r822
716g835O566J2061J335j1609r863K431Q534L823m440m561J284M818K498j528l844
731c30k385j418j197R77J467k59j939qM159O218J223n215l968L374O521j076r195
748c051n735O175J0672r1j1792o399R671J5006J62j7862j3325R009J9373L147
$$ plain form
762 14960 -5126 -23497 -15568 9451 20174 3411 -18417 -16393 7340 21970 8704 -14910
774 -14910 -18348 1804 18013 9222 -11705 -16110 2038 17943 10360 -9511 -13859 2991 17359
787 17359 9159 -12398 -18294 -604 17010 11088 -11261 -19846 -4119 15971 14602 -5720 -19055
800 -19055 -9391 9230 13062 -615 -13521 -9880 3604 10212 4585 -3816 -4478 1620 5466 4021
814 4021 244 -1092 -273 28 -265 212 1550 1251 -390 -1079 301 1446 1117 -1517 -2526 -1072 -792
831 -792 -2600 -3697 -1613 2490 2800 -1361 -4151 1366 9793 8999 -1519 -8744 -1797 10974 12539
846 12539 -1616 -13467 -6506 11346 17188 1964 -14353 -10059 9226 18434 3990 -16386 -16249
859 -16249 3797 17046 5844 -14736 -17240 2272 18259 11258 -8864 -15248 786 17666 13147
$$ packed form
762A4960k0086j8371P929K5019J0723j6763k1828K024K3733J4630j3266k3614
774a4910l438K0152J6209q791k0927m405J8148J5905p583j9871m348J6850J4368
787A7359q200k1557n896J7690J7614n922k2349q585J5727K0090j369k0322j3335
800a9055R664J8621L832j3677j2906L641J3484O608n627q401o62O098L846j445
814D021l777j336Q19L01k93M77J338k99j641o89J380J145l29k634j009J454K80
831g92j808j097K084M103L10m161k790N517Q427p94j0518p225O947J2771J565
846A2539j4155j1851O961J7852N842j5224j6317M294J9285R208j4444k0376J37
859a6249K0046J3249j1202k0580k504J9512J5987p001k0122o384J6034J6880m519
$$ plain form
872 13147 -6514 -15368 -2199 14628 12549 -5174 -15062 -4051 12438 12209 -3227 -13511 -5540
885 -5540 9205 10698 -2670 -12780 -7701 4408 6887 -2489 -10786 -6645 2952 5468 -578 -6170
899 -6170 -3103 3754 4938 -367 -4769 -3054 1931 2831 -2059 -5627 -4268 741 3638 1570 -1725
914 -1725 -3404 -1666 1720 2921 145 -4203 -7918 -6510 -97 3770 -69 -8468 -10677 -1601 9416
929 9416 8959 -4034 -13883 -7607 8167 13369 513 -14430 -12167 5556 16612 7400 -9052 -11154
943 -11154 3719 15517 8772 -7514 -12156 -165 10688 5967 -8295 -12264 -620 10173 5148
956 5148 -8146 -11778 949 12817 7790 -7842 -12471 1537 16278 13084 -3924 -12117 42
969 42 17037 16825 291 -11581 -3949 12438 16309 2939 -9929 -7213 5721 11301 2641 -8146
$$ packed form
872A3147j9661q854J3169J6827k079j7723r888J1011J6489k29j5436j0284P971
885e540J4745J493j3368j0110N079J2109K479r376q297M141R597K516o046n592
899f170L067O857J184n305m402J715M985R00m890l568J359N009K897k068l295
914a725j679J738L386J201k776m348l715J408O413L867l839q399k209R076J1017
929I416m57j2993r849O276J5774N202j2856j4943K263J7723J1056r212j6452k102
943a1154J4873J1798o745j6286m642J1991J0853m721j4262l969J1644J0793n025
956E148j3294l632J2727J1868n027j5632m629J4008J4741l194j7008q193J2159
969D2J6995k12j6534j1872P632J6387L871j3370j2868K716J2934N580q660j0787
$$ plain form
983 -8146 -8559 454 6019 2303 -4341 -4468 1387 5322 3378 -332 -5 3493 5332 3544 647 873
999 873 4028 5755 4460 1304 -179 651 1846 2040 -115 -3442 -5942 -5207 -1511 1461 -239 -5937
1015 -5937 -8354 -2938 5101 5563 -3472 -11354 -7281 4614 9507 1014 -10116 -7837 5722 14134
1029 14134 6684 -7637 -10784 137 9164 3047 -12042 -16751 -5965 5079 2702 -8594 -12575
1042 -12575 -2904 8059 5416 -7331 -13315 -4940 5455 3193 -9115 -13834 -3929 10161 10827 -988
1056 -988 -9075 -1744 11051 11235 -2815 -14347 -10869 1381 6004 -2394 -11327 -7662 4155 9828
1070 9828 4364 -3991 -4249 2341 4463 -439 -6335 -5697 969 4725 3024 -693 330 5603 9340
1085 9340 6212 434 -2840 -1298 1613 2245 -295 -2614 -2598 1256 6622 8957 6489 1490 -435 2597
$$ packed form
983h146m13R013N565l716o644j27N855L935j944l710L27L498J839j788k897K26
999H73L155J727j295l156j483Q30J195J94k155l327k500P35L696K972j700n698
1015e937k417N416Q039M62r035p882M073J1895M893q493j1130K279J3559Q412
1029A4134p450j4321l147J0921R027o117j5089m709J0786J1044k377j1296l981
1042a2575R671J0963k643j2747n984Q375J0395k262j2308m719R905J4090O66j1815
1056i88q087P331J2795J84j4050j1532L478J2250M623q398q933L665J1817N673
1070I828n464q355k58O590K122m902n896O38O666L756j701l717J023N273L737
1085I340l128n778l274J542K911O32k540k319J6L854N366K335k468m999j925L032
$$ plain form
1101 2597 7173 6649 324 -5455 -2478 6163 10850 5868 -2063 -2476 5168 10785 5458 -5149 -8323
1116 -8323 -1138 6636 4698 -3689 -5820 2059 10934 9160 -15 -4206 1912 8842 6068 -3613 -7067
1131 -7067 727 9561 7948 -2448 -6790 714 9969 6596 -7147 -15020 -8506 3156 4104 -7051
1145 -7051 -14487 -8296 5755 10409 1353 -9145 -7790 2381 7480 699 -8480 -8545 426 6749 3207
1160 3207 -3414 -4135 1807 5444 518 -7867 -10885 -6683 -3310 -5164 -10611 -12001 -7146 -482 1276
1175 1276 -1654 -4412 -4145 -1564 599 338 -2175 -4526 -3998 53 4054 5123 3191 305 655 2946
1191 2946 3401 -674 -5832 -7387 -5025 -2578 -4402 -7000 -5375 425 3748 1181 -3762 -2745 3071
1206 3071 6509 2508 -4941 -4433 4199 11671 9295 951 -979 6934 14510 11467 -131 -6533 -1052
$$ packed form
1101B597M576n24o325n779K977Q641M687m982p931m13P644N617n327j0607l174
1116h323P185P774j938q387k131P879Q875j774r175m191O118O930k774r681l454
1131g067P794Q834j613j0396m342P504R255l373j3743p873O514J1662R48j1155
1145g051p436O191J4051M654r056j0498J355J0171N099o781r179o5Q971O323l542
1160C207o621p21N942L637m926q385l018M202L373j854n447j390M855O664J758
1175A276k930k758K67K581K163k61k513k351N28M051M001J069j932k886L50K291
1191B946M55m075n158j555K362K447j824k598J625N800L323k567m943J017N816
1206C071L438m001p449N08Q632P472k376q344j930P913P576l043j1598o402N481
$$ plain form
1221 -1052 7526 6196 -4147 -9861 -3492 7683 9701 943 -6262 -2350 7652 10470 2512 -5323
1235 -5323 -3284 6424 11284 6540 156 1153 9184 12493 7500 -238 -1017 4660 6547 965 -5926
1250 -5926 -5600 1254 6146 2134 -4285 -5204 1265 6789 4635 -2665 -6780 -3497 3009 5219 1783
1265 1783 -2873 -3036 1437 5378 5527 901 -3561 -4572 -2003 730 -625 -5022 -7895 -6336 -1699
1280 -1699 805 -1635 -5498 -5891 -1925 1329 -476 -4897 -6241 -3032 308 134 -3643 -5395 -1542
1295 -1542 1705 482 -4349 -6607 -3645 -127 -2425 -8349 -10020 -4789 657 -853 -7251 -8992 -2240
1310 -2240 5159 4003 -4258 -8170 -2620 6802 6911 -1673 -8245 -4028 5790 8875 1279 -7612 -6175
1325 -6175 2254 6556 1275 -8143 -9462 -2202 4258 2188 -4937 -6319 -130 6524 6459 1573 -613
$$ packed form
1221a052Q578j330j0343n714O369J1175K018q758p205L912J0002K818p958p835
1235e323K039R708M860m744o384R97Q031L309m993p738p79N677J887n582o891
1250e926L26O854M892m012o419r19O469N524k154p300m115L283O506K210l436
1265A783m656j63M473L941J49m626m462j011K569K733j355m397k873J559M637
1280a699K504k440l863l93L966L254j805m421j344L209L340j74l777j752L853
1295a542L247j223m831k258K962L518k298n924j671N231N446j510o398j741O752
1310b240P399j156q261l912N550R422J09q584o572M217R818L085p596q891J437
1325f175Q429M302n281r418j319P260O460k070p125j382O189O654o5m886k186
$$ plain form
1340 -613 2421 7504 8364 4674 1556 2857 6239 7112 5043 2646 2543 3504 3285 1863 432 -393 -703
1357 -703 -1459 -1369 -771 645 1423 1716 2214 2895 4490 5324 5940 6056 5052 3800 4056 6168 7942 6577
1375 6577 2690 594 2499 6006 5546 -107 -6281 -6337 -852 2654 -801 -7882 -10022 -3390 4899 5009
1391 5009 -1470 -6370 -2824 5227 8084 2718 -3781 -2980 2940 6454 3318 -1109 -1996 1406 2417
1406 2417 -1239 -5357 -5326 -3272 -3759 -7861 -10835 -8017 -2637 -1114 -5382 -9387 -6695 572 4120 -187
1422 -187 -6630 -7086 -310 5237 3829 -2417 -5691 -1711 3734 4422 -817 -6100 -6293 -2956 -1682 -3536
1438 -3536 -6912 -7638 -5943 -3464 -2512 -2802 -2610 -1890 -984 -738 -199 92 809 1004 1085 1332 1769 2532 3722
1457 3722 3366 2012 118 -584 298 1744 605 -2004 -4099 -2232 1777 3876 1918 -1229 -1595 2587
$$ packed form
1340f13L034N083Q60l690l118J301L382Q73k069k397j03R61k19j422j431q25l10
1357g03p56R0N98J416P78K93M98O81J595Q34O16J16j004j252K56K112J774j365
1375F577l887k096J905L507m60n653o174n6N485L506l455p081k140O632Q289J10
1391E009o479m900L546Q051K857n366o499Q01N920L514l136m427q87L402J011
1406B417l656m118L1K054m87m102k974K818N380J523m268m005K692P267L548m307
1422a87o443m56O776N547j408o246l274L980N445O88n239n283j93L337J274j854
1438c536l376p26J695K479R52k90J92P20R06K46N39K91P17J95Q1K47M37P63J190
1457C722l56j354j894p02Q82J446j139k609k095J867M009K099j958l147l66M182
$$ plain form
1473 2587 6810 6272 1607 -1118 1526 6180 8195 4687 940 1664 4969 6496 3978 706 239 1914
1489 1914 2230 212 -1355 319 3310 2842 -110 -1320 2556 6683 6941 2310 -1313 991 6684 9183
1505 9183 5022 -1047 -2002 3036 7628 5272 -1361 -5595 -2502 2260 3113 -1807 -5972 -5673 -1617 1332
1521 1332 -57 -2607 -2884 -942 1438 1904 1386 958 1108 1472 1163 1169 1254 763 -820 -2445 -2955 -2948 -2683
1540 -2683 -3734 -5049 -6419 -6267 -5655 -4244 -4240 -4977 -6098 -5844 -3539 -917 -212 -1181 -2462 -715 2564
1557 2564 4113 2564 -541 -1825 -88 1814 404 -3047 -5835 -4478 -2003 -1828 -4558 -6864 -6357
1572 -6357 -2860 -1740 -4056 -6500 -5286 -1077 1367 348 -1470 -104 4264 6972 5407 2312 1609
1587 1609 4098 5874 3994 60 -1513 97 2492 2126 -760 -2570 -1811 289 498 -1536 -3341 -2679
$$ packed form
1473B587M223n38m665k725K644M654K015l508l747P24L305J527k518l272m67J675
1489A914L16k018j567J674K991m68k952j210L876M127K58m631l623K304N693K499
1505I183m161o069r55N038M592k356o633m234L093M762Q53m920m165K99M056K949
1521A332j389k550k77J942K380M66n18m28J50L64l09OQ5m91j583j625n10PK65
1540b683j051j315j370J52O12J411Mp37j121K54K305K622P05r69j281J747L279
1557B564J549j549l105j284J737J902j410l451k788J357K475J75k730k306N07
1572f357L497J120k316k444J214M209K444j019j818J366M368K708j565l095p03
1587A609K489J776j880l934j573J610K395l66k886j810P59K100K09k034j805O62
$$ plain form
1603 -2679 -269 1698 1551 777 2399 4906 6879 6310 5350 5233 6072 5958 4694 3095 2593 3106 3401
1620 3401 2663 1013 925 1223 1749 647 -911 -2399 -2544 -960 209 542 -298 212 2138 5038 5849
1637 5849 4237 2098 1983 3180 3790 2478 65 -1335 -304 2123 2157 74 -2061 -1967 -622 -186 -2685
1654 -2685 -4772 -5040 -3365 -1596 -2172 -3187 -2237 747 2793 2176 -734 -1700 -21 1427 -146 -3564
1670 -3564 -4862 -3303 -802 -232 -2387 -4103 -3516 -1568 -1273 -3411 -5480 -5674 -4324 -2644 -2304 -3254
1686 -3254 -2549 -485 1331 1553 631 -333 -176 -198 -859 -2382 -3114 -2510 -1911 -2025 -2262 -2126 -1352 -1249 -1577
1705 -1577 -2419 -3160 -2327 -1707 -1311 -1543 -946 483 2786 4228 4229 3406 2870 3584 3987 3051 1238 -1155 -900
1724 -900 854 1875 913 -879 -1413 -274 1353 787 -893 -2424 -1801 264 1909 1827 1525 1953 4258
$$ packed form
1603b679K410J967j47p74J622K507J973n69r60j17Q39j14j264j599n02N13K95
1620C401p38j650q8K98N26j102j558j488j45J584J169L33q40N10J926K900Q11
1637E849j612k139j15J197O10j312k413j400J031K427L4k083k135R4J345M36k499
1654b685k087k68J675J769n76j015R50K984K046o17k910r66J679J448j573l418
1670c564j298J559K501N70k155j716N87J948K95k138k069j94J350J680L40r50
1686c254P05K064J816K22r22r64J57k2o61j523p32O04N99j14k37J36P74J03l28
1705a577q42p41Q33O20L96k32N97J429K303J442Jq23n36P14M03r36j813k393K55
1724i00J754J021r62j792n34J139J627n66j680j531O23K065J645q2l02M28K305
$$ plain form
1741 4258 6462 6941 5633 4176 4345 4989 4950 2779 994 570 1812 1873 886 -326 -382 -326 -538 -1156 -1773
1760 -1773 -2136 -1918 -1623 -1169 -167 1391 2450 2850 3129 3609 4404 4507 3574 2546 1024 831 1356 1380
1778 1380 449 -1483 -2366 -1602 -1145 -1570 -3647 -4686 -4716 -3711 -3099 -3610 -4162 -3704 -1824 -251 688 831
1796 831 612 673 1389 1681 1724 489 -413 -1364 -1003 -712 -915 -2023 -3163 -3081 -2936 -2654 -3230 -4114 -4615 -4177
1816 -4177 -3702 -2656 -2355 -2125 -1769 -993 438 982 1266 1162 946 1116 1109 699 370 -10 -468 -560 -537 -430
1836 -430 -400 -786 -1184 -1908 -1299 -716 -1148 -1442 -1507 -828 393 1074 1334 1491 1689 2407 3098 2882 2276 1645
1856 1645 1159 1174 1069 716 470 679 1076 1176 1069 614 685 958 959 85 15 120 937 1645 2004 1932 2070 2614
1878 2614 3549 3581 2484 1392 450 515 900 503 -530 -1323 -1137 -21 1047 830 297 -486 -904 162
$$ packed form
1741D258K204M79j308j457J69O44l9k171j785m24J242O1r87j212n6N6k12o18o17
1760a773l63K18K95M54J002J558J059M00K79M80P95J03r33j028j522j93N25K4
1778A380r31j932q83P64M57m25k077j039l0J005O12n11n52M58J880J573R39J43
1796H31k19O1P16K92M3j235r02r51L61K91k03j108j140Q2J45K82n76q84n01M38
1816d177M75J046L01K30L56P76J431N44K84j04k16J70pm10l29l80m58r2K3J07
1836d30L0l86l98p24O09N83m32k94o5O79J221O81K60J57J98P18O91k16o06o31
1856A645m86J5j05l53k46K09L97J00j07m55P1K73Jq74p0J05Q17P08L59p2J38N44
1878B614R35L2j097j092r42O5L85l97j033p93J86J116J068k17n33p83m18J066
$$ plain form
1896 162 780 416 -486 -627 116 1302 2813 2570 1946 1402 1335 1362 986 -209 -1401 -2438 -2813 -2434 -1921
1915 -1921 -1392 -2052 -2488 -2486 -1342 -420 -867 -1987 -3076 -2388 -151 1019 784 -265 -53 1891 3713 3355
1933 3355 815 -1368 -1197 -376 -289 -1912 -3677 -4067 -2772 -1541 -1350 -2269 -2954 -2245 -1485 -1369 -1935 -2194
1951 -2194 -1707 -695 -145 275 1446 2611 3405 3005 2166 1742 1805 1823 263 -1200 -1807 -1553 -662 -501 -1289
1970 -1289 -2135 -1720 -526 -505 -1222 -2296 -2524 -1617 -385 212 -1 640 2271 3499 4332 3412 2319 2388
$$ packed form
1896A62O18l64r02j41P43J186J511k43o24n44o7K7l76j195j192j037l75L79N13
1915a921N29o60m36KJ144R22m47j120j089O88K237J170k35j049K12J944J822l58
1933C355k540k183J71Q21Q7j623j765l90J295J231J91r19o85P09P60J16n66k59
1951b194M87J012N50M20J171J165P94m00q39m24O3J8j560j463o07K54Q91J61p88
1970a289q46M15J194K1p17j074k28R07J232N97k13O41J631J228Q33r20j093O9
$$ [...]
8191f5
##END NTUPLES=NMR FID
##END=
