##TITLE=1H_Costus-Summ2-f25
 CDCl3, 8 sc, 
 7.8.2020
##JCAMPDX= 6.0         $$ Bruker NMR JCAMP-DX V2.0
##DATA TYPE= NMR FID
##DATA CLASS= NTUPLES
##ORIGIN= UXNMR, Bruker Analytische Messtechnik GmbH
##OWNER= root
$$ XWIN-NMR		Version 3.5
$$ Fri Aug  7 10:55:56 2020 Russian Standard Time (UT+4h)  she@DPX200
##.OBSERVE FREQUENCY= 200.1314999998
##.OBSERVE NUCLEUS= ^1H
##.DELAY= (6, 6)
##.ACQUISITION MODE= SIMULTANEOUS
##.ACQUISITION SCHEME= undefined
##.AVERAGES= 8
##.DIGITISER RES= 18
##SPECTROMETER/DATA SYSTEM= spect
##.PULSE SEQUENCE= zg30
##.SOLVENT NAME= D2O
##.SHIFT REFERENCE= (INTERNAL, D2O, 0, 15.7039)
##AUDIT TRAIL= $$ (NUMBER, WHEN, WHO, WHERE, WHAT)
$$ ##TITLE= Audit trail, XWIN-NMR		Version 3.5
$$ ##JCAMPDX= 5.01
$$ ##ORIGIN= Bruker BioSpin GmbH
$$ ##OWNER= she
$$ F:/spectra/data/she/nmr/H-F/1/audita.txt
$$ ##AUDIT TRAIL=  $$ (NUMBER, WHEN, WHO, WHERE, WHAT)
(   1,<2020-08-07 10:54:53.54 +0400>,<she>,<DPX200>,
      <created by zg, POWCHK disabled, PULCHK disabled
       configuration hash MD5:
       00 E9 B6 7A A2 85 ED C7 34 08 36 98 17 FE 4E 26
       data hash MD5: 16K
       32 27 0C 79 1F A4 A4 3F 7D C2 7D CA B6 5D 90 FA>)
$$ ##END=
$$ 
$$ hash MD5
$$ 4B 11 B5 17 9B F5 26 68 FA 1C 59 AF 24 86 EF A1
##$RELAX= 
##$RELAX= 
##$RELAX= 
##$RELAX= 
##$RELAX= 
##$RELAX= 
$$ Bruker specific parameters
$$ --------------------------
##$DU= <F:/spectra>
##$EXPNO= 1
##$NAME= <H-F>
##$PROCNO= 1
##$TYPE= <nmr>
##$USER= <she>
##$AMP= (0..31)
100 100 100 100 100 100 100 100 100 100 100 100 100 100 100 100 100 100 
100 100 100 100 100 100 100 100 100 100 100 100 100 100 
##$AQSEQ= 0
##$AQ_mod= 1
##$AUNM= <au_zg>
##$AUTOPOS= <>
##$BF1= 200.13
##$BF2= 200.13
##$BF3= 200.13
##$BF4= 200.13
##$BF5= 200.13
##$BF6= 200.13
##$BF7= 200.13
##$BF8= 200.13
##$BYTORDA= 1
##$CFDGTYP= 0
##$CFRGTYP= 5
##$CHEMSTR= <none>
##$CNST= (0..31)
1 1 145 1 1 1 1 1 1 1 1 1 1 1 1 1 1 1 1 1 1 1 1 1 1 1 1 1 1 1 1 1 
##$CPDPRG= <>
##$CPDPRG1= <>
##$CPDPRG2= <>
##$CPDPRG3= <>
##$CPDPRG4= <mlev>
##$CPDPRG5= <mlev>
##$CPDPRG6= <mlev>
##$CPDPRG7= <mlev>
##$CPDPRG8= <mlev>
##$CPDPRGB= <>
##$CPDPRGT= <>
##$D= (0..31)
0 1.2 0 0 0 0 0 0 0 0.06 0 0.03 0 0 0 0 0.0002 0 0 0 0 0 0 0 0 0 0 0 0 
0 0 0 
##$DATE= 1596783292
##$DBL= (0..7)
120 120 120 120 120 120 120 120 
##$DBP= (0..7)
150 150 150 150 150 150 150 150 
##$DBP07= 0
##$DBPNAM0= <>
##$DBPNAM1= <>
##$DBPNAM2= <>
##$DBPNAM3= <>
##$DBPNAM4= <>
##$DBPNAM5= <>
##$DBPNAM6= <>
##$DBPNAM7= <>
##$DBPOAL= (0..7)
0.5 0.5 0.5 0.5 0.5 0.5 0.5 0.5 
##$DBPOFFS= (0..7)
0 0 0 0 0 0 0 0 
##$DE= 6
##$DECBNUC= <off>
##$DECIM= 24
##$DECNUC= <off>
##$DECSTAT= 4
##$DIGMOD= 1
##$DIGTYP= 9
##$DL= (0..7)
0 120 120 120 120 120 120 120 
##$DP= (0..7)
150 150 150 150 150 150 150 150 
##$DP07= 0
##$DPNAME0= <>
##$DPNAME1= <>
##$DPNAME2= <>
##$DPNAME3= <>
##$DPNAME4= <>
##$DPNAME5= <>
##$DPNAME6= <>
##$DPNAME7= <>
##$DPOAL= (0..7)
0.5 0.5 0.5 0.5 0.5 0.5 0.5 0.5 
##$DPOFFS= (0..7)
0 0 0 0 0 0 0 0 
##$DQDMODE= 0
##$DR= 18
##$DS= 0
##$DSLIST= <SSSSSSSSSSSSSSS>
$$ [...]
##$SUBNAM2= <"">
##$SUBNAM3= <"">
##$SUBNAM4= <"">
##$SUBNAM5= <"">
##$SUBNAM6= <"">
##$SUBNAM7= <"">
##$SUBNAM8= <"">
##$SUBNAM9= <"">
##$SW= 24.9337058888022
##$SWIBOX= (0..15)
0 0 2 0 0 0 0 0 0 0 0 0 0 0 0 0 
##$SW_h= 4990.01996007984
##$TD= 16384
##$TD0= 1
##$TE= 0
##$TE2= 300
##$TE3= 300
##$TEG= 300
##$TL= (0..7)
0 120 120 120 120 120 120 120 
##$TP= (0..7)
150 150 150 150 150 150 150 150 
##$TP07= 0
##$TPNAME0= <>
##$TPNAME1= <>
##$TPNAME2= <>
##$TPNAME3= <>
##$TPNAME4= <>
##$TPNAME5= <>
##$TPNAME6= <>
##$TPNAME7= <>
##$TPOAL= (0..7)
0.5 0.5 0.5 0.5 0.5 0.5 0.5 0.5 
##$TPOFFS= (0..7)
0 0 0 0 0 0 0 0 
##$TUNHIN= 0
##$TUNHOUT= 0
##$TUNXOUT= 0
##$USERA1= <user>
##$USERA2= <user>
##$USERA3= <user>
##$USERA4= <user>
##$USERA5= <user>
##$V9= 5
##$VALIST= <valist>
##$VCLIST= <CCCCCCCCCCCCCCC>
##$VD= 0
##$VDLIST= <DDDDDDDDDDDDDDD>
##$VPLIST= <PPPPPPPPPPPPPPP>
##$VTLIST= <TTTTTTTTTTTTTTT>
##$WBST= 1024
##$WBSW= 4
##$XGAIN= (0..3)
0 0 0 0 
##$XL= 0
##$YL= 0
##$YMAX_a= 510489
##$YMIN_a= -277126
##$ZGOPTNS= <>
##$ZL1= 120
##$ZL2= 120
##$ZL3= 120
##$ZL4= 120
##$ABSF1= 10
##$ABSF2= 0
##$ABSG= 5
##$ABSL= 3
##$ALPHA= 0
##$AQORDER= 0
##$ASSFAC= 0
##$ASSFACI= 0
##$ASSFACX= 0
##$ASSWID= 0
##$AUNMP= <proc_1d>
##$AZFE= 0.1
##$AZFW= 0.1
##$BCFW= 1
##$BC_mod= 2
##$BYTORDP= 1
##$COROFFS= 0
##$CY= 11.3945322036743
##$DATMOD= 1
##$DC= 2
##$DFILT= <>
##$DTYPP= 0
##$F1P= 16.9975609425685
##$F2P= -3.02152046262296
##$FCOR= 0.5
##$FTSIZE= 0
##$FT_mod= 4
##$GAMMA= 1
##$GB= 0.15
##$INTBC= 1
##$INTSCL= 1
##$ISEN= 128
##$LB= 0.24
##$LEV0= 0
##$LPBIN= 0
##$MAXI= 10000
##$MC2= 0
##$MEAN= 0
##$ME_mod= 0
##$MI= 1.114404
##$NCOEF= 0
##$NC_proc= 0
##$NLEV= 6
##$NOISF1= 3.799351
##$NOISF2= 2.8
##$NSP= 1
##$NTH_PI= 0
##$NZP= 0
##$OFFSET= 15.70392
##$PC= 1
##$PHC0= -9798.463
##$PHC1= 19.00092
##$PH_mod= 1
##$PKNL= yes
##$PPARMOD= 0
##$PSCAL= 0
##$PSIGN= 0
##$REVERSE= no
##$SF= 200.130013532006
##$SI= 16384
##$SIGF1= 3
##$SIGF2= 2
##$SINO= 400
##$SIOLD= 16384
##$SREGLST= <1H.CDCl3>
##$SSB= 0
##$STSI= 0
##$STSR= 0
##$SW_p= 3612.71676300578
##$SYMM= 0
##$S_DEV= 0
##$TDeff= 0
##$TDoff= 0
##$TI= <>
##$TILT= no
##$TM1= 0
##$TM2= 0
##$TOPLEV= 0
##$USERP1= <user>
##$USERP2= <user>
##$USERP3= <user>
##$USERP4= <user>
##$USERP5= <user>
##$WDW= 1
##$XDIM= 8192
##$YMAX_p= 0
##$YMIN_p= 0
$$ End of Bruker specific parameters
$$ ---------------------------------
##NTUPLES= NMR FID
##VAR_NAME=  TIME,          FID/REAL,        FID/IMAG
##SYMBOL=    X,             R,               I
##VAR_TYPE=  INDEPENDENT,   DEPENDENT,       DEPENDENT
##VAR_FORM=  AFFN,          ASDF,            ASDF
##VAR_DIM=   8192,          8192,            8192
##UNITS=     SECONDS,       ARBITRARY UNITS, ARBITRARY UNITS
##FACTOR=    0.0002004,     1,               1
##FIRST=     0,             0,               0
##LAST=      1.6414764,     0,               0
##MIN=       0,             -277126,         0
##MAX=       1.6414764,     510489,          0
$$ Real data points
##PAGE= N=1
##DATA TABLE= (X++(R..R)), XYDATA
$$ [...]
$$ plain form
2435 2239 2418 1801 1202 1568 2194 1624 1014 1553 1580 616 133 996 1209 493 -131 373 602 -309 -790 -284
2455 -284 -171 -707 -1025 -1187 -1102 -1557 -1183 -1276 -1823 -2091 -1759 -1759 -2741 -2597 -1931 -2227 -2799 -2952 -2739 -2893 -3633
2476 -3633 -3184 -3245 -3488 -3655 -3474 -3760 -4306 -3875 -3504 -3905 -4533 -4294 -4050 -4452 -4718 -4445 -4463 -4425 -4967 -5299 -4853
2497 -4853 -4693 -4810 -4948 -4747 -4898 -4639 -5012 -4736 -5261 -4467 -4530 -4994 -5368 -5208 -4864 -4725 -4804 -4897 -4881 -4824 -4581
2518 -4581 -4934 -4903 -4382 -4115 -4327 -4497 -4434 -4038 -3938 -4124 -4051 -3791 -3920 -3938 -3749 -3547 -3526 -3386 -3039 -3379 -3277
2539 -3277 -2843 -2580 -3031 -2948 -2791 -2458 -2435 -2998 -2371 -1571 -1477 -2080 -2083 -1527 -1358 -1883 -1946 -1243 -684 -977 -1108 -1185
2561 -1185 -928 -485 -586 -632 -828 -519 130 4 -109 30 256 437 33 273 689 1114 652 421 915 1116
2581 1116 767 952 920 1223 1456 1543 1540 1864 1721 1889 1855 2043 2112 2469 2103 1947 1776 2255 2472 2238 2202 2158
$$ packed form
2435B239J79o17n99L66O26n70o10N39K7r64m83Q63K13p16o24N04K29r11m81N06
2455b84J13n36l18j62Q5m55L74r3n47k68L32%r82J44O66k96n72j53K13j54p40
2476c633M49o1k43j67J81k86n46M31L71m01o28K39K44m02k66K73j8L8n42l32M46
2497d853J60j17j38K01j51K59l73K76n25P94o3m64l74J60L44J39p9r3J6N7K43
2518d581l53L1N21K67k12j70O3L96J00j86P3K60j29j8J89K02K1J40L47l40J02
2539c277M34K63m51Q3J57L33K3n63O27Q00R4o03lN56J69n25o3P03N59k93j31p7
2561a185K57M43j01m6j96L09O49j26j13J39K26J81m04K40M16M25m62k31M94K01
2581A116l49J85l2L03K33Q7lL24j43J68l4J88O9L57l66j56j71M79K17k34l6m4
$$ plain form
2603 2158 2463 2444 2585 2604 3110 3008 2852 2973 3116 2903 3297 3396 2890 2980 3373 3547 3429 3139 3407 3849 3379
2624 3379 3133 3355 3988 3423 3705 3697 3683 3915 4007 3601 3405 3500 3799 3844 3636 3510 3945 4333 3788 3340 3660 4160
2646 4160 4174 3552 3853 3881 4080 3546 3181 3723 3655 3615 3541 3076 3649 3583 3280 3331 3338 3506 3522 3188 3091 2977 3206
2669 3206 3242 2818 2562 2759 2944 2593 2066 2226 2782 2668 2274 1973 2740 2321 2113 1976 2004 1597 1426 1258
2689 1258 1455 1403 1157 807 825 870 936 521 528 462 537 494 176 253 25 118 113 -485 -743 -1000 -853 -771 -1150 -1413
2713 -1413 -1121 -1164 -1107 -2066 -1770 -1473 -1549 -1995 -2243 -2388 -2137 -2152 -2698 -3037 -2773 -2801 -2906 -3266 -2940 -3207 -3123 -3128
2735 -3128 -3747 -3454 -3600 -3606 -3535 -3712 -3636 -3843 -3983 -4297 -4550 -4029 -4135 -4277 -4517 -4055 -4074 -4249 -4422 -4063 -4053 -4130
2757 -4130 -4483 -4168 -4493 -4185 -4556 -4377 -4392 -4432 -4226 -4202 -4361 -4296 -3907 -4131 -3890 -4222 -3472 -3558 -3857 -4048 -3635
$$ packed form
2603B158L05j9J41J9N06j02j56J21J43k13L94R9n06R0L93J74j18k90K68M42m70
2624C379k46K22O33n65K82qj4K32R2m06j96R5K99M5k08j26M35L88n45m48L20N00
2646D160J4o22L01K8J99n34l65N42o8m0p4m65N73o6l03N1PJ68J6l34r7j14K29
2669C206L6m24k56J97J85l51n27J60N56j14l94l01P67m19k08j37K8m07j71j68
2689A258J97n2k46l50J8M5O6m15Po6P5m3l18P7k28R3nn98k58k57J47Q2l79k63
2713a413K92m3N7r59K96K97p6m46k48j45K51j5n46l39K64k8j05l60L26k67Q4n
2735c128o19K93j46oP1j77P6k07j40l14k53N21j06j42k40M62j9j75j73L59J0p7
2757d130l53L15l25L08l71J79j5m0K06K4j59O5L89k24K41l32P50q6k99j91M13
$$ plain form
2778 -3635 -3240 -3140 -3265 -3912 -3666 -3256 -3264 -3571 -3415 -2628 -2520 -2940 -3093 -2247 -2002 -2403 -2574 -2250 -1983 -2389
2798 -2389 -2232 -2090 -2101 -1806 -1315 -1587 -1313 -1719 -1136 -861 -1392 -1393 -201 -385 -558 -896 -157 124 -52 -511
2818 -511 -468 20 79 -170 -13 136 224 705 1110 779 746 836 1482 1014 821 1207 1129 1321 896 1328 1759 1822
2840 1822 1410 1444 1839 1927 1735 1735 2055 2743 2243 2139 2268 2409 2511 2626 2277 2175 2501 2145 2262 2246 2450
2861 2450 2939 3264 2988 3027 2663 2943 3228 2841 2779 3027 3115 2512 2582 2850 3347 3274 3170 3107 3270 3036 2717 2649
2883 2649 3102 3218 3570 3044 2999 3150 3202 3131 3239 2886 2821 3078 2768 2632 2872 3142 3545 3204 2759 3029 3235
2904 3235 3077 2130 2619 2719 2557 2555 2584 3064 3250 2758 2614 2434 2640 1952 1904 2185 2576 2345 2354 2158 2161 2147 2554
2927 2554 2134 1882 1581 1684 1725 1313 1431 1701 2111 1862 1685 1286 1094 1535 775 765 893 786 753 476 615
$$ packed form
2778c635L95J00j25o47K46M10ql07J56P87J08m20j53Q46K45m01j71L24K67m06
2798b389J57J42j1K95M91k72K74m06N83K75n31jJ192j84j73l38P39K81j76m59
2818e11M3M88N9k49J57J49Q8M81M05l31l3R0O46m68j93L86p8J92m25M32M31O3
2840A822m12L4L95Q8j92%L20O88n00j04J29J41J02J15l49j02L26l56J17j6K04
2861B450M89L25k76L9l64K80K85l87o2K48Q8o03P0K68M97p3j04o3J63k34l19o8
2883B649M53J16L52n26m5J51N2p1J08l53o5K57l10j36K40K70M03l41m45K70K06
2904C235j58r47M89J00j62kK9M80J86m92j44j80K06o88m8K81L91k31Rj96Lj4M07
2927B554m20k52l01J03M1m12J18K70M10k49j77l99j92M41p60j0J28j07l3k77J39
$$ plain form
2948 615 893 531 421 419 20 -180 -421 88 -342 -561 -530 -185 -563 -1067 -812 -424 -952 -1433 -1372 -1136 -1193 -1552
2970 -1552 -1591 -1358 -1326 -1674 -1874 -1778 -1565 -2057 -2391 -2797 -2697 -2603 -2406 -2609 -2538 -2679 -2591 -2505 -2776 -3124 -3065 -3126 -3358
2993 -3358 -3192 -3329 -3165 -3317 -3544 -3449 -3417 -3575 -3800 -3528 -3451 -3715 -3263 -3856 -3670 -3031 -3428 -3376 -3722 -3584 -3656
3014 -3656 -3959 -4156 -3922 -3862 -3457 -3425 -3581 -3467 -3222 -3124 -3187 -3392 -3527 -3017 -3138 -3409 -3295 -2932 -2737 -2955 -2994
3035 -2994 -2626 -2680 -2658 -2905 -2767 -2544 -2435 -2288 -2328 -2109 -1913 -1778 -1373 -1873 -1687 -1694 -1860 -2434 -2041 -1458 -1051
3056 -1051 -1145 -1086 -891 -566 -471 -453 -587 -508 -585 -726 -574 -485 -233 88 -44 36 303 200 220 104 646 819 714
3079 714 604 942 900 1391 1369 1327 1050 1113 1101 1343 844 1210 1328 1833 1662 1525 1836 2373 2260 1604 1637 1962
3101 1962 2289 2004 1719 2084 2593 2168 2288 2372 2340 2528 2243 2125 2027 2364 2739 2418 2123 2708 2982 2353 2304
$$ packed form
2948F15K78l62j10kl99k00k41N09m30k19L1L45l78n04K55L88n28m81O1K36n7l59
2970a552l9K33L2l48k00R6K13m92l34m06J00R4J97k03P1j41Q8Q6k71l48N9o1k32
2993c358J66j37J64j52k27R5L2j58k25K72P7k64M52n93J86O39l97N2l46J38p2
3014c656l03j97K34O0M05L2j56J14K45R8o3k05j35N10j21k71J14L63J95k18l9
3035b994L68n4K2k47J38K23J09J47m0K19J96J35M05n00J86pj66n74L93N83M07
3056a051r4N9J95L25R5J8j34P9p7j41J52Q9K52L21j32Q0K67j03K0j16N42J73j05
3079G14j10L38m2M91k2m2k77O3j2K42m99L66J18N05j71j37L11N37j13o56L3L25
3101A962L27k85k85L65N09m25J20Q4l2J88k85j18r8L37L75l21k95N85K74o29m9
$$ plain form
3122 2304 2442 2644 2403 2519 2335 2558 2742 2652 2762 2176 3139 3053 2838 2511 2626 2563 2621 2277 2375 2411 2700 2525
3144 2525 2647 2724 2699 2307 2558 2346 2275 2361 2589 2538 2065 2422 2916 2347 2007 2029 2109 2489 2015 1835 2148 2433
3166 2433 2095 2126 1907 1911 2169 2039 1850 1516 1987 2103 1372 1289 1714 1733 1452 1300 1568 1508 1408 1059 857 1153
3188 1153 1304 1043 779 1040 994 1152 829 497 589 683 405 111 177 35 347 109 -104 -213 112 19 -164
3209 -164 -665 -511 -534 -101 -652 -873 -975 -439 -682 -993 -981 -920 -926 -1079 -1647 -1757 -1410 -1279 -1802 -1815 -1845 -1619
3231 -1619 -2143 -2128 -1952 -2112 -2130 -2193 -2380 -2294 -2271 -2193 -2219 -2700 -2586 -2578 -2924 -3392 -2686 -2526 -2920 -2978 -2972 -2891 -2780 -2847
3255 -2847 -2726 -2858 -2933 -3014 -3143 -3264 -3141 -3258 -3255 -3273 -3031 -2732 -2886 -2985 -2819 -3010 -3094 -3347 -2953 -3115 -2976 -2610
3277 -2610 -2260 -2688 -2755 -2751 -2979 -2952 -2863 -2667 -2429 -2476 -2486 -2432 -1770 -1936 -2120 -1903 -1960 -1817 -2204 -2143 -1889 -1653 -1462
$$ packed form
3122B304J38K02k41J16j84K23J84r0J10n86R63q6k15l27J15o3N8l44R8L6K89j75
3144B525J22P7k5l92K51k12p1Q6K28n1m73L57M94n69l40K2Q0L80m74j80L13K85
3166B433l38L1k19MK58j30j89l34M71J16p31q3M25J9k81j52K68o0j00l49k02K96
3188A153J51k61k64K61m6J58l23l32R2R4k78k94O6j42L12k38k13j09L25r3j83
3209a64n01J54k3M33n51k21j02N36k43l11J2O1oj53n68j10L47J31n23j3l0K26
3231a619n24J5J76j60j8o3j87Q6K3P8k6m81J14Ql46m68P06J60l94n8OQ1J11o7
3255b847J21j32p5q1j29j21J23j17Lj8K42K99j54r9J66j91q4k53L94j62J39L66
3277b610L50m28o7Mk28K7Q9J96K38m7j0N4O62j66j84K17n7J43l87O1K54K36J91
$$ plain form
3300 -1462 -1757 -1907 -1794 -1201 -1164 -1219 -1522 -948 -953 -1180 -779 -827 -316 -151 -121 -306 -473 -43 -466 -153 -564 -196
3322 -196 145 -21 0 83 879 877 756 263 810 956 529 673 997 1088 1092 1282 1008 1116 1468 1744 1214 1479
3344 1479 1391 1548 1493 1421 1931 2198 1962 2006 2106 2219 2024 1878 1154 2046 2046 2112 1763 2192 2386 2258 2625 2262
3366 2262 2293 1961 2230 2085 2234 2219 2430 2333 2362 2298 2478 2384 2389 2175 2156 2347 2186 2341 2117 2290 2432 2421 2087
3389 2087 2266 2036 2363 2131 2077 2062 2108 2233 1913 2460 2256 1950 2307 2235 2070 2072 1926 1716 1550 1508 2005 1634
3411 1634 1872 1332 1796 2011 1706 1505 1384 1496 1579 1362 1160 1702 1209 1599 1420 1246 1363 1237 1060 975
3431 975 771 868 1129 1021 713 1045 1048 957 866 927 671 458 310 174 398 577 600 205 206 437 203 -53 -227
3454 -227 -20 -93 67 -95 -336 24 -278 -300 -491 -435 -480 -724 -805 -1020 -920 -707 -862 -735 -1209 -926 -865 -1248
$$ packed form
3300a462k95j50J13N93L7n5l03N74nk27M01m8N11J65L0j85j67M30m23L13m11L68
3322a96L41j66K1Q3P96kj21m93N47J46m27J44L24R1MJ90k74J08L52K76n30K65
3344A479q8J57n5p2N10K67k36M4J00J13j95j46p24Q92%O6l49M29J94j28L67l63
3366B262L1l32K69j45J49j5K11r7K9o4J80r4Nk14j9J91j61J55k24J73J42j1l34
3389B087J79k30L27k32n4j5M6J25l20N47k04l06L57p2j65Kj46k10j66m2M97l71
3411A634K38n40M64K15l05k01j21J12Q3k17k02N42m93L90j79j74J17j26j77q5
3431I75k04R7K61j08l08L32Lr1r1O1k56k13j48j36K24J79K3l95JK31k34k56j74
3454b27K07p3J60j62k41L60l02k2j91N6m5k44q1k15J00K13j55J27m74K83O1l83
$$ plain form
3476 -1248 -1308 -1296 -982 -1610 -1773 -1894 -1270 -1499 -1477 -1534 -1228 -1562 -2088 -2179 -1564 -1825 -2157 -2267 -1803 -2081 -2286
3497 -2286 -1914 -1891 -2171 -2435 -2186 -2498 -2329 -2437 -2192 -2521 -2398 -2482 -2635 -2373 -2548 -2690 -2476 -2513 -2385 -2795 -2417
3518 -2417 -2552 -2502 -2374 -2359 -2181 -2546 -2545 -2387 -2322 -2353 -2410 -2262 -2204 -2134 -2559 -2493 -2127 -2098 -2035 -2076 -2086 -1948 -2401 -1942
3542 -1942 -1716 -1487 -1713 -1623 -1422 -1410 -1620 -1559 -1468 -1711 -1450 -1447 -1299 -992 -1126 -597 -764 -963 -720 -467 -405 -637
3564 -637 -460 -563 -148 -483 -626 -294 190 187 -123 -597 19 384 -78 174 503 376 531 587 833 815 806 730
3586 730 933 1126 1047 769 1037 1236 1093 1318 1051 1278 1422 1735 1795 1595 1572 1673 1891 1882 1707 1512 1944 2107
3608 2107 1815 1494 1815 2180 1894 1838 1980 1967 1836 2113 2376 2288 2038 1917 2023 2358 1774 2073 1959 2065 2037
3629 2037 2067 2099 2332 1869 1796 2052 2250 1840 1695 1897 1834 2038 1850 2168 1956 1804 1789 1458 1854 1703 1590
$$ packed form
3476a248o0J2L14o28j63j21O24k29K2n7L06l34n26r1O15k61l32j10M64k78k05
3497b286L72K3k80k64K49l12J69j08K45l29J23q4j53K62j75j42K14l7J28m10L78
3518b417j35N0J28J5J78l65JJ58O5l1n7J48N8P0m25O6L66K9O3m1j0J38m53M59
3542a942K26K29k26R0K01J2k10O1R1k43K61LJ48L07j34N29j67j99K43K53O2k32
3564f37J77j03M15l35j43L32M84ll10m74O16L65m62K52L29j27J55N6K46j8rp6
3586G30K03J93p9k78K68J99j43K25k67K27J44L13O0k00k3J01K18rj75j95M32J63
3608B107k92l21L21L65k86n6J42j3j31K77K63q8k50j21J06L35n84K99j14J06k8
3629B037L0L2K33m63p3K56J98m10j45K02o3K04j88L18k12j52j5l31L96j51j13
$$ plain form
3650 1590 1656 1526 1551 1523 1740 1458 1815 1537 1338 1477 1175 1145 1377 1687 1311 1062 795 1218 1270 1233 955 1436
3672 1436 1147 1061 866 1156 907 938 1217 671 684 872 820 745 286 473 682 364 236 447 749 360 157
3693 157 310 524 490 134 92 153 112 315 -193 -255 -55 -10 -69 -303 -366 -278 222 -501 -453 -444 -422 -704 -513 -489 -734
3718 -734 -812 -674 -787 -812 -942 -1139 -1066 -921 -1028 -865 -958 -1147 -1083 -939 -947 -1223 -1617 -1293 -1298 -1463 -1461 -1380 -1444 -1612
3742 -1612 -1475 -1425 -1393 -1848 -1630 -1731 -1599 -1938 -2129 -1709 -1643 -1776 -1722 -1617 -2092 -2132 -1975 -1860 -1988 -1860 -1962
3763 -1962 -1685 -1619 -1802 -2345 -1885 -1740 -1964 -2236 -2136 -2056 -1948 -2137 -1934 -2100 -1647 -1846 -1890 -2075 -1798 -1894 -1800
3784 -1800 -1949 -1855 -2039 -1673 -1550 -1722 -1889 -1442 -1351 -1723 -1954 -1535 -1157 -1322 -1595 -1170 -1252 -1212 -1365 -1274 -864
3805 -864 -943 -565 -815 -1150 -994 -232 -790 -942 -312 -162 -250 -292 -453 -124 202 -36 30 -241 -92 82 267
$$ packed form
3650A590O6j30K5k8K17k82L57k78j99J39l02l0K32L10l76k49k67M23N2l7k78M81
3672A436k89q6j95K90k49L1K79n46J3J88n2p5m59J87K09l18j28K11L02l89k03
3693A57J53K14l4l56m2O1m1K03n08o2K00M5n9k34o3Q8N00p23M8RK2k82J91K4k45
3718g34p8J38j13k5j30j97P3J45j07J63r3j89O4J44qk76l94L24nj65KQ1o4j68
3742a612J37N0L2m55K18j01J32l39j91M20O6j33N4J05m75m0J57J15j28J28j02
3763a962K77O6j83n43M60J45k24k72J00Q0J08j89K03j66M53j99m4j85K77r6R4
3784a800j49R4j84L66J23j72j67M47R1l72k31M19L78j65k73M25q2M0j53R1M10
3805h64p9L78k50l35J56P62n58j52O30J50q8m2j61L29L26k38O6k71J49J74J85
$$ plain form
3826 267 127 421 255 274 363 415 481 673 688 762 776 1068 911 818 817 879 1167 960 1042 922 1495 1059 1042 1267
3850 1267 1484 1415 1366 1292 1599 1732 1471 1507 1469 1636 1683 1946 1814 1552 1689 1848 1675 1838 1775 1672 1748 1948
3872 1948 1888 1802 1814 1862 1868 2014 1651 2024 1700 1586 1778 1615 1749 1700 1744 1854 1738 1537 1583 1791 1721 1741 1442
3895 1442 1686 1436 1604 1363 1390 1502 1726 1605 1346 1334 1473 1694 1462 1083 796 1338 1168 1173 1308 1131 1288
3916 1288 958 1026 812 491 1004 1083 623 492 737 1055 857 469 439 650 519 325 332 470 541 236 56 321
3938 321 246 317 414 -246 84 240 79 18 -314 167 34 -178 -143 106 -95 -327 -479 -378 -93 -192 -408 -177
3960 -177 -332 -696 -410 -420 -125 -807 -343 -417 -748 -675 -719 -480 -1052 -707 -721 -959 -1004 -573 -981 -1151 -886 -1168
3982 -1168 -894 -826 -985 -853 -1044 -1271 -1171 -1128 -897 -1572 -1436 -1134 -1169 -1476 -1274 -1617 -1143 -1408 -1516 -1576 -1476
$$ packed form
3826B67j40K94j66J9Q9N2O6J92J5P4J4K92j57r3jO2K88k07Q2j20N73m36j7K25
3850A267K17o9m9p4L07J33k61L6l8J67M7K63j32k62J37J59j73J63o3j03P6K00
3872A948o0q6J2M8OJ46l63L73l24j14J92j63J34m9M4J10j16k01M6K08p0K0k99
3895A442K44k50J68k41K7J12K24j21k59j2J39K21k32l79k87N42j70NJ35j77J57
3916A288l30O8k14l21N13P9m60j31K45L18j98l88l0K11j31j94PJ38P1l05j80K65
3938C21p5P1R7o60L30J56j61o1l32M81j33k12L5K49k01k32j52J01K85r9k16K31
3960a77j55l64K86j0K95o82M64p4l31P3m4K39n72L45j4k38m5M31m08j70K65k82
3982a168K74O8j59J32j91k27J00M3K31o75J36L02l5l07K02l43M74k65j08o0J00
$$ plain form
4003 -1476 -1532 -1285 -1496 -1606 -1674 -1301 -1394 -1596 -1876 -1355 -1485 -1806 -1551 -1483 -1502 -1702 -1746 -1417 -1531 -1720 -1044 -1736
4025 -1736 -1689 -1468 -1432 -1626 -1598 -1610 -1453 -1440 -1671 -1475 -1479 -1415 -1558 -1413 -1705 -1353 -981 -1116 -1350 -1080 -1022 -1166 -988
4048 -988 -1066 -1128 -959 -981 -1559 -761 -751 -807 -1092 -560 -609 -425 -304 -493 -147 -509 -93 -528 -310 -267 -305 3 36
4071 36 -440 -157 392 -215 308 256 51 378 23 439 530 514 540 731 595 665 690 959 618 710 949 838 967
4094 967 1135 1015 1251 1115 1232 1102 1002 1217 1137 1291 963 1306 1239 1182 1202 1560 1383 1508 1548 1612 1885 1527
4116 1527 1595 1640 1691 1482 1505 1632 1562 1540 1660 1314 1681 1336 1506 2047 1991 1407 1610 1812 1375 1183 1798 1782
4138 1782 1471 1299 1080 1410 1627 1536 1397 1327 1298 1326 1214 1130 1267 1353 1451 944 1036 1139 1406 1071 837 696
4160 696 1057 657 913 964 904 873 1043 873 681 712 814 631 429 829 734 369 481 569 640 544 377 418 620
$$ packed form
4003a476n6K47k11j10o8L73r3k02k80N21j30l21K55O8j9k00m4L29j14j89O76o92
4025a736M7K21L6j94K8j2J57J3k31J96mO4j43J45k92L52L72j35k34K70N8j44J78
4048i88p8o2J69k2n78P98J0n6k85N32m9J84J21j89L46l62M16m35K18M3l8L08L3
4071C6m76K83N49o07N23n2k05L27l55M16R1j6K6J91j36P0K5K69l41R2K39j11J29
4094I67J68j20K36j36J17j30j00K15q0J54l28L43o7n7K0L58j77J25M0O4K73l58
4116A527O8M5N1k09K3J27p0k2J20l46L67l45J70N41n6n84K03K02m37j92O15j6
4138A782l11j72k19L30K17r1j39p0k9K8j12q4J37Q6R8n07R2J03K67l35k34j41
4160F96L61m00K56N1o0l1J70j70j92L1J02j83k02M00r5l65J12Q8P1r6j67M1K02
$$ plain form
4183 620 334 65 299 389 262 216 20 -37 66 -145 69 48 -144 185 -88 -131 -476 -500 -143 -149 -342 -201 -88
4206 -88 18 -420 -566 -441 -496 -575 -712 -658 -532 -780 -945 -517 -668 -480 -835 -814 -736 -831 -815 -692 -535 -1103 -1070
4229 -1070 -589 -1086 -1081 -945 -1006 -950 -1154 -1135 -823 -654 -881 -725 -1020 -1169 -877 -1156 -1410 -1027 -1070 -940 -1121 -1287
4251 -1287 -1163 -1363 -1154 -1162 -1003 -1212 -1262 -1335 -1092 -1608 -1157 -1043 -1061 -1252 -1391 -1195 -1450 -1453 -1414 -1039 -1381 -1437 -1204
4274 -1204 -1265 -1353 -1241 -965 -952 -1058 -1023 -1124 -1332 -1272 -1255 -887 -1273 -1252 -1157 -1053 -1108 -1438 -1261 -946 -782 -1008 -1237
4297 -1237 -1132 -918 -566 -1161 -440 -633 -732 -829 -761 -618 -534 -488 -733 -359 -270 -65 -183 -167 -60 -339 -84 -169
4319 -169 -137 -142 -2 -26 -81 -312 -185 85 326 97 231 690 208 363 349 751 610 632 408 537 706 460
4341 460 826 495 852 610 786 838 826 958 940 1304 973 1054 1271 1100 1074 1073 1095 1053 1123 801 1241 1209 1024 1119
$$ packed form
4183F20k86k69K34R0j27m6j96n7J03k11K14k1j92L29k73m3l45k4L57oj93J41J13
4206h8J06m38j46J25n5p9j37N4J26k48j65M28j51J88l55K1P8r5J6J23J57n68L3
4229a070M81m97NJ36o1N6k04J9L12J69k27J56k95j49K92k79k54L83m3J30j81j66
4251a287J24k00K09qJ59k09n0p3K43n16M51J14j8j91j39J96k55lL9L75l42n6K33
4274a204o1q8J12K76J3j06L5j01k08O0J7L68l86K1R5J04n5l30J77L15J64k26k29
4297a237J05K14L52n95P21j93r9r7O8J43Q4M6k45L74Q9K05j18J6J07k79K55q5
4319a69L2nJ40k4n5k31J27K70K41k29J34M59m82J55j4M02j41K2k24J29J69k46
4341D60L66l31L57k42J76N2j2J32j8L64l31Q1K17j71k6jK2m2P0l22M40l2j85R5
$$ plain form
4365 1119 1344 1224 1432 1460 1429 1161 1454 1441 1208 1051 1066 1305 1005 1352 1797 1191 1343 1325 1434 1139 1099 1467
4387 1467 1249 1467 1243 1394 1461 1150 1302 1287 881 786 917 1179 919 1169 1070 738 917 727 1092 1054 985 975
4409 975 1047 793 387 968 1014 1029 744 412 759 492 666 350 478 636 542 379 246 561 395 380 486 155
4431 155 489 6 292 -223 374 301 72 312 -81 -37 -56 223 -30 -361 -114 75 -482 -71 -410 -209 -236
4452 -236 -317 -319 -461 -417 -176 -472 -319 -16 -679 -701 -387 -223 -621 -539 -179 -749 -1003 -730 -448 -859 -959 -786
4474 -786 -886 -739 -723 -666 -600 -501 -879 -727 -1030 -738 -861 -694 -883 -742 -1127 -717 -687 -833 -775 -908 -878 -1085
4496 -1085 -736 -629 -761 -911 -1049 -928 -1052 -1151 -1029 -986 -1018 -1061 -787 -971 -983 -804 -808 -810 -1345 -970 -1164 -1173 -1102 -1020
4520 -1020 -964 -1177 -1026 -1002 -1048 -1258 -1209 -1085 -882 -1078 -566 -1065 -1062 -860 -871 -798 -726 -1033 -714 -615 -762 -961 -541
$$ packed form
4365A119K25j20K08K8l1k68K93j3k33j57J5K39l00L47M45o06J52j8J09k95m0L68
4387A467k18K18k24J51O7l11J52j5m06r5J31K62k60K50r9l32J79j90L65l8o9j0
4409I75P2k54m06N81M6J5k85l32L47k67J74l16J28J58r4j63j33L15j66j5J06l31
4431A55L34m83K86n15N97p3k29K40l93M4j9K79k53l31K47J89n57M11l39K01k7
4452b36q1kj42M4K41k96J53L03o63k2L14J64l98Q2L60n70k54K73K82m11j00J73
4474g86j00J47J6N7O6R9l78J52l03K92j23J67j89J41l85M10L0j46N8j33L0k07
4496a085L49J07j32j50j38J21j24r9J22M3l2m3K74j84j2J79mkn35L75j94rP1Q2
4520a020N6k13J51K4m6k10M9J24K03j96N12m99LK02j1P3P2l07L19R9j47j99M20
$$ plain form
4543 -541 -821 -688 -825 -677 -558 -872 -648 -714 -427 -548 -454 -640 -566 -202 -582 -291 -102 -154 -510 -319 -479
4564 -479 -375 -248 -547 -313 51 -34 -142 28 -141 -92 -220 147 -44 7 241 230 126 428 79 546 635 364
4586 364 472 596 467 596 493 584 449 448 289 459 642 585 932 734 546 1014 1012 608 577 1113 979 933 979
4609 979 867 998 1213 840 1040 717 917 1050 1158 1033 1124 1053 1178 1259 1085 1096 1264 1207 1026 1163 1257 1168
4631 1168 1046 1181 1369 906 1131 1153 1124 1184 1050 1165 1140 949 1067 1005 927 842 1111 1149 931 760 930 817
4653 817 1005 977 977 778 834 884 850 975 512 791 580 568 672 637 394 677 347 559 506 340 291 259 563 483
4677 483 336 177 321 319 252 113 157 227 17 53 -138 -27 23 -240 11 100 -252 93 -28 -451 -234 -208 83
4700 83 -195 -341 -298 -98 -52 -467 -254 -235 -314 -571 -637 -508 -150 -583 -475 -623 -402 -659 -463 -443 -476 -586 -434
$$ packed form
4543e41k80J33j37J48J19l14K24o6K87j21R4j86P4L64l80K91J89n2l56J91j60
4564d79J04J27k99K34L64q5j08J70j69M9j28L67j91N1K34j1j04L02l49M67Q9k71
4586C64J08J24j29J29j03R1j35jj59J70J83n7L47j98j88M68km04l1N36j34m6M6
4609I79j12J31K15l73K00l23K00J33J08j25R1p1J25Q1j74J1J68n7j81J37R4q9
4631A168j22J35J88m63K25K2k9O0j34J15k5j91J18o2p8q5K69L8k18j71J70j13
4653H17J88k8%j99N6N0l4J25m63K79k11j2J04l5k43K83l30K12n3j66m9l2L04q0
4677D83j47j59J44ko7j39M4P0k10L6j91J11N0k63K51Q9l52L45j21m23K17K6K91
4700H3k78j46M3K00M6m15K13J9p9k57o6J29L58m33J08j48K21k57J96K0l3j10J52
$$ plain form
4723 -434 -686 -539 -778 -720 -651 -842 -793 -663 -416 -739 -735 -952 -704 -534 -876 -895 -873 -658 -871 -705 -482 -535 -927
4746 -927 -873 -579 -687 -877 -831 -935 -1240 -487 -889 -738 -894 -914 -812 -778 -751 -581 -667 -669 -750 -929 -730 -674 -473
4769 -473 -836 -809 -962 -634 -729 -1110 -854 -928 -573 -493 -863 -502 -664 -547 -844 -726 -663 -603 -387 -510 -629 -553
4791 -553 -578 -629 -842 -776 -494 -420 -460 -717 -675 -106 -599 -587 -209 -321 -205 -432 -279 -562 -507 -138 -425 -203 -248
4814 -248 -286 125 -335 -128 -36 11 -40 -91 -201 117 -67 -79 238 195 143 415 73 -83 272 172 446 137 243
4837 243 188 332 180 383 453 659 79 317 868 358 528 533 710 140 291 679 629 588 831 977 800 687
4859 687 547 580 816 652 701 753 837 499 993 1035 472 724 665 796 1047 852 884 1052 953 973 1047 971 669 919
4883 919 1234 800 996 926 893 1024 1008 1182 939 1099 809 842 910 1088 807 778 551 834 715 860 346 772
$$ packed form
4723d34k52J47k39N8O9j91M9J30K47l23Mk17K48J70l42j9K2K15k13J66K23n3l92
4746i27N4K94j08j90M6j04l05P53m02J51j56k0J02L4K7J70q6kq1j79J99N6K01
4769d73l63K7j53L28r5l81K56p4L55Q0l70L61j62J17k97J18O3O0K16j23j19P6
4791e53k5n1k13O6K82P4m0k57M2N69m93J2L78j12J16k27J53k83N5L69k87K22m5
4814b48l8M11m60K07R2M7n1n1j10L18j84j2L17m3n2K72l42j56L55j00K74l09J06
4837B43n5J44j52K03P0K06n80K38N51n10J70NJ77n70J51L88n0m1K43J46j77j13
4859F87j40L3K36j64M9N2Q4l38M94M2n63K52n9J31K51j95L2J68r9K0P4p6l02K50
4883I19L15m34J96p0l3J31j6J74k43J60k90L3O8J78k81k9k27K83j19J45n14M26
$$ plain form
4905 772 916 673 904 624 939 751 688 554 684 297 565 680 445 433 347 298 736 328 369 329 597 224
4927 224 183 343 254 199 206 110 293 54 30 145 137 47 -44 -102 -78 -224 79 -154 -82 -74 81 -178 -56 0 -194 -72
4953 -72 -330 -225 -226 -226 -278 -152 -387 -691 -508 -532 -537 -315 -127 -283 -718 -620 -519 -577 -317 -763 -526 -445 -486 -486 -596
4978 -596 -604 -566 -585 -814 -823 -754 -814 -940 -660 -470 -869 -523 -566 -826 -964 -573 -468 -580 -636 -599 -880 -241 -756 -711
5002 -711 -705 -587 -914 -941 -534 -653 -484 -630 -541 -674 -653 -213 -676 -703 -702 -414 -597 -649 -618 -298 -542 -701 -456
5025 -456 -774 -367 -589 -380 -295 -698 -455 -394 -709 -406 -305 -560 -683 -483 -464 -635 -409 -280 -500 -241 -435
5046 -435 -363 -283 -482 -261 -266 27 -278 -405 -98 -354 -268 32 -213 -229 -214 -101 -51 -179 1 61 46 -331 -244 21
5070 21 -182 -302 -117 190 190 203 118 -114 97 218 249 336 364 92 -138 205 9 435 291 191 325 230 570
$$ packed form
4905G72J44k43K31k80L15j88o3j34J30l87K68J15k35j2q6m9M38m08M1m0K68l73
4927B24m1J60q9n5Pr6J83k39k4J15qr0r1n8K4j46L03k33P2QJ55k59J22N6j94J22
4953g2k58J05j%n2J26k35l04J83k4nK22J88j56m35R8J01n8K60m46K37Q1m1%j10
4978e96qL8j9k29rO9o0j26K80J90l99L46m3k60j38L91J05j12n6L7k81O39n15M5
5002g11OJ18l27k7M07j19J69j46Q9j33K1M40m63k7JK88j83n2L1L20k44j59K45
5025d56l18M07k22K09Q5m03K43O1l15L03J01k55j23K00J9j71K26J29k20K59j94
5046d35P2Q0j99K21nK93l05j27L07k56Q6L00k45j6J5J13N0j28J80O0j5l77Q7K65
5070B1k03j20J85L07%J3q5k32K11J21L1Q7K8k72k30L43j96M26j44j00J34r5L40
$$ plain form
5093 570 416 278 354 258 271 237 412 483 639 475 749 584 679 803 567 555 746 478 600 485 577 545 316
5116 316 579 629 791 769 511 766 628 759 694 737 814 759 451 510 806 1042 891 742 701 796 878 667 707 612
5140 612 735 1057 901 593 555 595 714 909 838 885 479 538 886 311 547 651 438 590 713 727 501 627
5162 627 592 568 495 417 576 351 264 170 337 261 112 261 317 294 227 99 358 323 -141 231 248 328 -211 -85
5186 -85 65 -68 36 215 21 -234 -522 -315 -110 -577 105 -220 -371 -455 -356 -41 -52 -255 -206 -97 -136 -86
5208 -86 -402 -170 -651 -800 -289 -411 -128 -401 -314 -501 -538 -657 -299 -534 -678 -398 -209 -446 -592 -336 -333 -449
5230 -449 -576 -579 -429 -571 -468 -529 -642 -602 -593 -644 -851 -652 -690 -702 -519 -654 -639 -389 -584 -378 -622 -454 -704
5253 -704 -435 -480 -404 -776 -454 -241 -661 -373 -580 -551 -546 -517 -451 -355 -470 -605 -598 -704 -282 -455 -533 -451 -506 -694
$$ packed form
5093E70j54j38P6r6J3l4J75P1J56j64K74j65R5J24k36j2J91k68J22j15R2l2k29
5116C16K63N0J62k2k58K55j38J31o5M3P7n5l08N9K96K36j51j49m1R5Q2k11M0r5
5140F12J23L22j56l08l8M0J19J95p1M7m06N9L48n75K36J04k13J52J23J4k26J26
5162F27l5k4p3p8J59k25q7r4J67p6j49J49N6k3o7j28K59l5m64L72J7Q0n39J26
5186h5J50j33J04J79j94k55k88K07K05m67O82l25j51q4R9L15j1k03M9J09l9N0
5208h6l16K32m81j49N11j22K83k73Q7j87l7j19L58k35j44K80J89k37j46K56Lj16
5230d49j27lJ50j42J03o1j13M0Rn1k07J99l8j2J83j35J5K50j95K06k44J68k50
5253g04K69m5P6l72L22K13m20K88k07K9NK9O6R6j15j35Pj06M22j73p8Q2n5j88
$$ plain form
5277 -694 -431 -403 -714 -148 -376 -334 -329 -205 -440 -191 -531 -206 -221 -204 -262 -308 -63 -362 -232 -252 -30 5 -163
5300 -163 -267 -13 -270 -178 -118 -521 -126 160 -117 -147 219 -122 -143 199 -6 231 214 -214 35 -36 135 207
5322 207 -79 312 82 19 233 -64 141 142 78 100 300 337 173 211 353 147 142 298 405 285 298 383 350 325
5346 325 168 278 344 672 217 272 332 647 542 496 241 510 214 435 472 472 414 542 692 613 192 439 416
5369 416 224 433 559 358 469 724 747 880 841 988 487 502 586 602 565 515 701 630 455 656 359 747 573
5392 573 632 580 758 383 648 641 747 573 570 728 501 522 611 639 414 356 497 437 707 353 346 236 210 308 435
5417 435 343 247 424 315 213 160 134 104 292 363 -79 193 142 428 267 156 -194 123 -182 84 114 -113 157
5440 157 -199 -109 -107 -250 49 24 -168 -152 71 -427 -16 -337 -270 -80 -215 -350 -110 -354 -351 -398 -188 -258 -215 -215
$$ packed form
5277f94K63K8l11N66k28M2NJ24k35K49l40L25j5J7n8m6K45k99J30k0K22L5j68
5300a63j04K54k57R2O0m03L95K86k77l0L66l41k1L42k05K37j7m28K49p1J71P2
5322B07k86L91k30o3K14k97K05Jo4K2K00L7j64L8J42k06nJ56J07j20J3Q5l3k5
5346C25j57J10O6L28m55N5O0L15j05m6k55K69k96K21L7%n8J28J50p9m21K47k3
5369D16j92K09J26k01J11K55K3J33l9J47n01J5Q4J6l7n0J86p1j75K01k97L88j74
5392E73N9n2J78l75K65pJ06j74lJ58k27K1Q9K8k25n8J41o0K70l54pj10k6R8J27
5417D35r2r6J77j09j02n3k6l0J88P1m42K72n1K86j61j11l50L17l05K66L0k27K70
5440A57l56R0Kj43K99k5j92J6K23m98M11l21O7J90j35j35K40k44Lm7K10p0M3%
$$ plain form
5464 -215 -593 -493 -224 -282 -432 -572 -639 -242 -351 -321 -182 -461 -366 -173 -862 -267 -676 -372 -555 -531 -445 -541
5486 -541 -463 -633 -616 -564 -425 -419 -501 -318 -135 -480 -164 -578 -451 -422 -444 -451 -554 -461 -477 -403 -287 -180 -547 -527 -502
5511 -502 -568 -453 -321 -226 -700 -195 -425 -213 -627 -649 -275 -418 -173 -221 -387 -412 -400 -381 -529 -254 -412 -87
5533 -87 -393 -261 -326 -351 -333 -119 -451 -265 -432 -104 -146 -483 48 -304 -68 -123 -71 -236 30 60 122 -108 -225
5556 -225 92 -85 -37 -95 -14 169 -147 -169 -64 74 123 8 174 115 -17 153 360 2 -32 -139 435 145
5578 145 22 234 -243 -11 166 159 239 278 332 334 124 509 442 32 256 543 226 -43 -77 219 302 437 107
5601 107 312 326 311 401 330 476 273 526 442 408 453 217 687 315 151 206 380 540 324 533 320 748 461
5624 461 364 492 286 631 301 225 202 349 480 210 557 525 465 362 294 429 213 622 226 557 437 458
$$ packed form
5464b15l78J00K69n8j50j40o7L97j09L0J39k79R5J93o89N95m09L04j83K4Q6r6
5486e41P8j70J7N2J39Oq2J83J83l45L16m14J27K9k2pj03R3j6P4J16J07l67K0K5
5511e02o6J15J32R5m74N05k30K12m14k2L74j43K45m8j66k5J2J9j48K75j58L25
5533h7l06J32o5k5J8K14l32J86j67L28m2l37N31l52K36n5N2j65K66L0O2k30j17
5556b25L17j77M8n8Q1J83l16k2J05J38M9j15J66n9j32J70K07l58l4j07N74k90
5578A45j23K12m77K32J77pQ0L9N4Kk10L85o7m10K24K87l17k69l4K96Q3J35l30
5601A07K05J4j5R0p1J46k03K53q4l4M5k36M70l72j64N5J74J60k16K09k13M28k87
5624D61r7J28k06L45l30p6k3J47J31k70L47l2o0j03o8J35k16M09l96L31j20K1
$$ plain form
5646 458 395 260 470 745 479 353 393 318 159 376 330 209 237 544 201 623 145 170 425 319 -26 449
5668 449 385 173 346 107 302 103 135 251 183 138 300 88 33 195 -38 -39 94 43 -21 -228 253 77 -475
5691 -475 -103 -31 209 -265 51 -441 -64 -199 2 -282 -274 -14 -141 98 -469 -180 -413 -142 -190 -243 -502 -417
5713 -417 -216 -302 -442 -238 -250 -398 -141 -376 -345 -279 -22 -360 -290 -176 -654 -417 -294 -492 -634 -329 -198 -108
5735 -108 -294 -433 -463 -590 -599 -470 -562 -428 -392 -622 -425 -61 -519 -467 -338 -580 -380 -471 -358 -188 -643 -472
5757 -472 -318 -372 -309 -222 -541 -267 -650 -470 -262 -525 -377 -247 -270 -419 -532 -225 -49 -232 -324 -294 -162 -90
5779 -90 -58 -328 -378 -429 -154 -394 217 -126 -224 -119 87 -157 -392 -223 21 -109 -426 111 115 -32 -61 -134 -22
5802 -22 57 -42 -90 -36 18 -232 118 -141 -117 176 334 -8 82 -8 -133 120 0 -1 204 403 87 453 19 162
$$ packed form
5646D58o3j35K10K75k66j26M0p5j59K17m6j21K8L07l43M22m78K5K55j06l45M75
5668D49o4k12J73k39J95j99L2J16o8m5J62k12n5J62k33jJ33n1o4k07M81j76n52
5691d75L72P2K40m74L16m92L77j35K01k84QK60j27K39n67K89k33K71m8n3k59Q5
5713d17K01q6j40K04j2j48K57k35L1O6K57l38P0J14m78K37J23j98j42L05J31R0
5735a08j86j39l0j27rJ29r2J34L6k30J97L64m58N2J29k42K00r1J13J70m55J71
5757d72J54n4O3Q7l19K74l83J80K08k63J48J30k3j49j13L07J76j83r2L0J32P2
5779i0L2k70n0n1K75k40O11l43r8J05K06k44k35J69K44j30l17N37Mj47k9p3J12
5802b2P9r9m8N4N4k50L50k59K4K93J58l42R0r0j25K53j20jK05J99l16L66m34J43
$$ plain form
5826 162 119 154 6 218 158 246 120 162 248 210 18 403 291 -33 260 171 -45 232 171 34 395 404 477 421
5850 421 150 177 11 256 202 410 330 208 351 137 462 219 288 194 560 368 499 322 286 290 517 195 408
5873 408 31 198 561 237 442 238 366 382 207 311 496 526 308 481 478 190 369 261 189 417 403 85
5895 85 379 128 434 149 436 634 374 277 242 175 415 365 558 177 352 429 274 57 140 29 307 -68
5917 -68 12 180 8 213 198 -101 5 39 234 -164 -290 257 -35 304 -19 181 -4 119 4 126 244
5938 244 40 -91 81 -37 -139 -89 72 -221 236 101 -191 -207 59 -471 -145 -70 -329 -52 209 -110 -344
5959 -344 -221 -21 -115 -525 -245 -329 -399 -115 -67 -256 -246 -314 -424 -295 -24 -524 -437 -304 -119 -159 -236 -471 -90
5982 -90 -262 -254 -327 34 -21 -332 -217 -163 -246 -236 -411 -346 -315 -269 -500 -584 -429 -236 -48 -284 -375 -355 -213 -317 -129
$$ packed form
5826A62m3L5j48K12o0Q8j26M2Q6l8j92L85j12l24K93q9k16K77o1j37L61RP3n6
5850D21k71K7j66K45n4K08q0j22J43k14L25k43O9r4L66j92J31j77l6MK27l22K13
5873D08l77J67L63l24K05k04J28J6j75J04J85L0k18J73lk88J79j08p2K28j4l18
5895H5K94k51L06k85K87J98k60r7l5o7K40n0J93l81J75P7j55k17Q3j11K78l75
5917f8Q0J68j72K05j5k99J06L4J95l98j26N47k92L39l23K00j85J23j15J22J18
5938B44k04j31J72j18j02N0J61k93M57j35k92j6K66n30L26P5k59K77K61l19k34
5959c44J23K00r4m10K80q4p0K84M8j89J0o8j10J29K71n00Q7J33J85m0p7k35L81
5982i0j72Qp3L61n5l11J15N4q3J0j75O5L1M6k31q4J55J93J88k36r1K0J42j04J88
$$ plain form
6007 -129 -527 -250 -289 -370 -81 -253 -613 -222 -215 -168 -415 -291 -435 -249 40 -210 -337 -173 -36 -174 -328 -300
6029 -300 -430 -172 -297 -230 -14 -338 -62 -164 -176 160 -57 -81 -18 30 -233 -1 -53 -367 150 123 193 -134 -46
6052 -46 -84 -105 109 -80 -105 -23 -118 105 65 -254 5 -14 130 196 50 -54 86 126 15 -66 -20 50 346 9
6076 9 -129 97 142 530 -127 -157 373 108 584 252 473 270 286 169 37 158 114 310 0 449 291 348
6098 348 13 359 136 355 483 403 450 412 281 166 334 111 124 293 360 448 -4 135 382 191 316 51
6120 51 385 -102 280 249 136 -58 77 466 131 203 181 230 64 544 294 354 341 588 206 181 518 91 138
6143 138 206 215 278 360 -14 -26 367 147 293 455 228 137 489 156 220 236 362 413 99 135 202 243 213 249 260
6168 260 69 118 61 -265 28 37 174 147 -49 112 309 265 7 115 59 0 -140 77 109 -266 67 34 -173
$$ packed form
6007a29l98K77l9q1K89j72l60L91PM7k47J24j44J86K89k50j27J64J37j38j54K8
6029c00j30K58j25O7K16l24K76j02j2L36k17k4O3M8k63K32n2l14N17k7P0l27Q8
6052d6l8k1K14j89k5Q2r5K23m0l19K59j9J44O6j46j04J40M0j11q1M6P0K96l37
6076Ij38K26M5L88o57l0N30k65M76l32K21k03J6j17j32J21m4J96l10M49j58N7
6098C48l35L46k23K19J28q0M7l8j31j15J68k23J3J69O7Q8m52J39K47j91J25k65
6120E1L34m87L82l1j13j94J35L89l35P2k2M9j66M80k50O0j3K47l82k5L37m27M7
6143A38O8RO3Q2l74j2L93k20J46J62k27r1L52l33O4J6J26N1l14L6O7M1l0L6J1
6168B60j91M9n7l26K93RJ37k7j96J61J97m4k58J08n6n9j40K17L2l75L33l3k07
$$ plain form
6191 -173 166 61 -104 124 -73 -82 -101 170 180 -207 -68 -137 -38 -58 -370 -56 -167 -4 -320 -295 -225 -285 -95
6214 -95 99 43 -165 -309 -323 -264 -267 -117 -108 -383 15 -235 -371 -405 -407 -274 -175 -217 -290 -381 -475 -113 -15 -505 -45 -385
6240 -385 -226 -90 -202 -231 -266 -417 -211 -226 -128 -370 -211 -218 -325 -289 -300 -219 -139 29 -162 -141 -219 -311 -349 -152 -261
6265 -261 -379 -309 -201 -381 -129 -25 -201 -138 -218 -551 -523 -348 -119 -167 -387 -52 49 -400 -142 -243 -276 110
6287 110 -304 -60 122 -278 -288 -288 21 -208 116 -95 -246 -96 -139 147 36 -265 -101 79 -43 61 -63
6308 -63 78 -143 129 144 318 58 -181 157 -93 79 -61 -59 -75 -24 204 7 251 255 123 286 -58 338 123
6331 123 155 251 330 -99 308 467 -224 -131 474 66 467 233 253 189 -102 218 478 277 63 303 122 388
6353 388 411 77 203 14 318 161 81 322 245 359 -28 109 357 228 142 97 442 95 193 232 341 110
$$ packed form
6191a73L39j05j65K28j97rj9K71J0l87J39o9R9k0l12L14j11J63l16K5P0o0J90
6214i5J94n6k08j44j4N9lJ50Rk75L98k50j36l4kJ33R9m2p3r1r4L62R8m90M60l40
6240c85J59J36j12k9l5j51K06j5R8k42J59pj07L6j1Q1Q0J68j91K1p8r2l8J97j09
6265b61j18P0J08j80K52J04j76O3q0l33K8J75K29m8k20L35J01m49K58j01l3L86
6287A10m14K44J82m00j0%L09k29L24k11j51J50m3K86j11l01J64J80j22J04j24
6308f3J41k21K72J5J74k60k39L38k50J72j40Kj6N1K28j97K44Mj32J63l44L96k15
6331A23L2R6P9m29M07J59o91R3O05m08M01k34K0o4k91L20K60k01k14K40j81K66
6353C88K3l34J26j89L04j57q0K41p7J14l87J37K48j29q6m5L45l47R8L9J09k31
$$ plain form
6375 110 -64 -6 61 264 328 427 121 291 174 186 287 144 272 157 48 326 263 -103 308 -5 342 140
6397 140 -7 -6 -57 247 67 -83 245 2 -27 -6 237 264 42 -202 223 196 -1 91 -176 360 88 -170 318
6420 318 30 -17 239 -163 -40 27 180 366 35 -16 -121 80 80 95 -46 38 156 -192 -269 -7 148 -279 -60
6443 -60 313 333 -169 -53 -192 -107 -55 -5 -117 -102 -299 -81 -11 164 -114 -261 5 0 -252 -323 -146 43 -119
6466 -119 -81 -421 -265 -300 -99 -90 -275 -109 -163 -88 -61 -242 56 -178 -225 -75 -127 -305 -313 -275 -283 -206 -396 -177 -234
6491 -234 -45 -28 -180 -31 48 -287 -250 -284 -207 -200 -13 -295 -315 -276 -392 -295 -265 -186 -206 -406 -443 -196 93 -397 -158
6516 -158 -140 -133 -87 -157 -124 -175 -57 -84 139 -244 -313 -248 28 -273 -251 -184 -140 96 -68 -100 242 -58 -281 -286 65
6541 65 74 14 -22 64 77 56 26 49 83 -85 317 -28 41 -175 11 26 415 169 371 239 134 30 -7 240 244
$$ packed form
6375A10j74N8O7K03O4R9l06J70j17J2J01j43J28j15j09K78o3l66M11l13L47k02
6397A40j47Jn1L04j80j50L28k43k9K1K43K7k22k44M25k7j97R2k67N36k72k58M88
6420C18k88m7K56m02J23O7J53J86l31n1j05K01%J5j41Q4J18l48p7K62J55m27K19
6443f0L73K0n02J16j39Q5N2N0j12J5j97K18P0J75k78j47K66nk52p1J77J89j62
6466a19L8l40J56l5K01Rj85J66n4P5K7j81K98k34m7J50n2j78qL8qP7j90K19n7
6491b34J89J7j52J49P9l35L7l4P7PJ87k82k0L9j16R7L0P9k0k00l7K47K89m90K39
6516a58J8PM6p0L3n1J18k7K23l83o9O5K76l01K2O7M4K36j64l2L42l00k23nL51
6541F5Ro0l6Q6J3k1l0K3L4j68M02l45O9k16J86J5L89k46K02j32j05j04l7K47M
$$ plain form
6566 244 11 208 9 182 -190 -61 251 172 292 19 216 336 247 294 112 205 -47 161 134 85 380 79
6588 79 222 -38 -86 -99 41 178 50 94 48 430 327 28 167 196 83 269 304 519 195 29 446 55
6610 55 204 31 -64 90 201 -33 272 166 433 194 190 248 250 225 430 84 437 115 247 157 -139 465 264
6633 264 -98 196 126 416 159 165 -51 -145 79 284 317 354 171 76 212 33 -105 -6 205 383 264 127 163
6656 163 12 265 201 -77 -166 -238 248 -26 181 45 80 45 104 72 -193 37 81 -62 151 41 -143 7 -185
6679 -185 -183 -131 -284 -153 145 -23 -69 -224 -71 -248 41 2 -46 111 16 -33 -78 -73 -78 128 -317 127 8 -161
6703 -161 65 -122 -182 20 -154 -2 -30 129 34 200 89 -190 -152 -59 -280 -18 -62 -113 23 24 -173 -182 -97 -283
6727 -283 -66 -249 172 -330 120 -339 -213 -442 -443 -184 -273 -279 -129 -180 -114 22 181 119 -433 -69 -185 -52 41
$$ packed form
6566B44k33J97j99J73l72J29L12p9J20k73J97J20q9M7j82R3k52K08k7m9K95l01
6588G9J43k60m8j3J40J37j28M4m6L82j03k99J39K9j13J86L5K15l24j66M17l91
6610E5J49j73r5J54J11k34L05j06K67k39mN8Kk5K05l46L53l22J32r0k96O04k01
6633B64l62K94p0K90k57Ok16r4K24K05L3L7j83r5J36j79j38R9K11J78j19j37L6
6656A63j51K53o4k78q9p2M86k74K07j36L5l5N9l2k65K30M4j43K13j10j84J50j92
6679a85KN2j53J31K98j68m6j55J53j77K89l9m8J57r5m9m5NnK06m45M44j19j69
6703a61K26j87o0K02j74J52k8J59r5J66j11k79L8R3k21K62m4n1J36Jj97rQ5j86
6727b83K17j83M21n02M50m59J26k29jK59q9oJ50n1O6J36J59o2n52L64j16J33R3
$$ plain form
6750 41 -200 -120 -208 -382 -175 95 -281 -287 -307 -115 -415 -114 -62 -157 -54 50 -81 -336 -385 -147 -95 -26 -233 -229
6774 -229 -48 -11 -306 -337 82 -102 -328 -27 -157 -91 -91 -314 192 137 -103 21 49 50 150 187 150 33 -216 62
6798 62 -69 -285 120 -156 -41 128 39 71 39 89 119 -161 319 6 294 -91 -10 90 -63 223 122 59 98
6821 98 299 320 223 62 131 105 165 -70 60 188 6 248 184 108 -224 322 121 239 393 42 54 -57 232
6844 232 -32 167 395 383 86 168 3 -42 -33 139 255 312 129 149 326 334 199 265 84 54 -100 159 64 396
6868 396 175 281 313 233 279 268 72 94 72 239 133 154 389 490 238 -201 395 225 -131 -35 407 344 51
6891 51 30 1 10 170 220 137 302 58 108 23 75 -10 302 91 230 218 246 80 70 182 35 -72 144 127 -173
6916 -173 -25 -136 34 82 -65 185 -2 -271 -256 3 -183 -102 -67 -105 -80 -175 95 -27 -58 -95 -37 238 31
$$ packed form
6750D1k41Q0q8j74K07K70l76ok0J92l00L01N2r5J03J04j31k55m9K38N2O9k07M
6774b29J81L7k95l1M19j84k26L01j30O6%k23N06n5k40J24K8JJ00L7l7j17k49K78
6798F2j31k16M05k76J15J69q9L2l2N0L0k80M80l13K88l85Q1J00j53K86j01o3L9
6821I8K01K1r7j61O9k6O0k35J30J28j82K42o4p6l32N46k01J18J54l51J2j11K89
6844B32k64J99K28j2k97Q2j65m5RJ72J16N7j83K0J77Qj35O6j81l0j54K59r5L32
6868C96k21J06L2q0M6j1j96K2k2J67j06K1K35J01k52m39N96j70l56R6M42o3k93
6891E1k1k9RJ60N0q3J65k44N0q5N2q5L12k11J39j2K8j66j0J12j47j07K16j7l00
6916a73J48j11J70M8j47K50j87k69J5K59j86Q1L5l8K5r5K70j22l1l7N8K75k07
$$ plain form
6939 31 255 -137 210 67 -26 7 37 -83 -413 270 -111 -9 -323 -202 -215 -22 151 -152 -380 -50 -233 -96
6961 -96 100 -277 -324 -100 -7 -256 -240 -140 -219 -464 -231 -313 -10 -142 47 -358 -34 -72 29 -333 -92 -290
6983 -290 -538 -228 -347 -100 14 -120 -121 -5 -182 -12 -273 -199 -39 67 60 -166 -61 -145 -173 -81 -228 -112 46
7006 46 -484 -106 -240 -287 -223 -226 -30 24 -204 77 -372 -294 -129 -198 -12 137 -128 -46 -105 -90 -148 -168 184 8
7030 8 -61 -87 252 -68 -81 21 30 29 -54 -241 90 7 289 -111 107 131 -23 122 -245 -44 -168 -150 321 -203
7054 -203 -92 337 -1 164 41 -208 -18 27 7 378 404 -158 187 -36 -187 -46 -65 144 402 147 53 -65
7076 -65 160 154 240 213 77 211 77 160 365 577 197 105 99 156 177 224 -73 96 427 74 387 193 351 97
7100 97 490 522 226 343 173 6 192 91 -49 185 163 -175 432 64 91 418 170 408 -34 -314 98
$$ packed form
6939C1K24l92L47j43r3L3L0j20l30O83l81J02l14J21j3J93J73l03k28L30j83J37
6961i6J96l77m7K24R3k49J6J00p9k45K33q2L03j32J89m05L24l8J01l62K41j98
6983b90k48L10j19K47J14j34jJ16j77J70k61P4J60J06pk26J05q4k8R2j47J16J58
7006D6n30L78j34m7O4lJ96N4k28K81m49P8J65o9J86J49k65Q2n9J5n8k0L52j76
7030Ho9k6L39l20j3J02Rjq3j87L31q3K82m00K18K4j54J45l67K01j24J8M71n24
7054b03J11M29l38J65j23k49J90M5k0L71K6n62L45k23j51J41j9K09K58k55r4j18
7076f5K25oQ6k7j36J34j34Q3K05K12l80r2oN7K1M7k97J69L31l53L13j94J58k54
7100I7L93L2k96J17j70j67J86j01j40K34k2l38O07l68K7L27k48K38m42k80M12
$$ plain form
7121 98 406 -4 52 281 264 -65 148 152 158 -71 61 -63 108 167 -64 287 191 -383 138 -44 47 102 -10 331
7145 331 65 -148 -149 289 65 302 -71 178 61 386 23 33 94 -274 -126 -187 -249 107 -66 -174 27 -53
7167 -53 180 66 44 -122 -13 42 274 -54 -214 55 -114 -12 -94 90 83 -89 165 -202 59 -405 -18 53
7189 53 20 53 -31 -415 -62 -77 -1 38 139 -81 -233 48 -134 -130 225 17 -27 -154 -254 -131 -283 -88 11 -74
7213 -74 -87 -186 -184 -119 -206 -147 209 -319 -378 -108 154 -316 -61 -43 -203 -87 -190 -319 -90 -167 -237 -66 -211 -37
7237 -37 -197 -215 -98 -107 177 49 -302 -177 -113 -199 49 70 -346 -328 -280 -140 -213 -39 -249 -161 -330 116 -253 -37
7261 -37 -72 -227 -8 -189 -96 -40 66 152 -148 -239 -145 -38 -255 59 -151 34 -30 -77 -50 43 204 107 19 208
7285 208 3 -92 74 101 -144 -32 271 284 -34 36 -247 272 -79 191 80 -236 -287 -126 136 -215 -154 413
$$ packed form
7121I8L08m10N6K29j7l29K13MOk29J32j24J71N9k31L51r6n74N21j82R1N5j12L41
7145C31k66k13jM38k24K37l73K49j17L25l63J0O1l68J48o1o2L56j73j08K01q0
7167e3K33j14k2j66J09N5K32l28j60K69j69J02q2J84pj72K54l67K61m64L87P1
7189E3l3L3q4l84L53j5P6L9J01k20j52K81j82ML55k08m4j27j00J23j52J95R9q5
7213g4j3r9KO5q7N9L56n28n9K70K62m70K55J8j60J16j03j29K29p7p0J71j45J74
7237c7j60j8J17rK84j28l51J25O4q6K48K1m16J8M8J40p3J74k10Q8j69M46l69K16
7261c7l5j55K19j81R3N6J06Q6l00r1R4J07k17L14k10J85o4m7K7R3J61r7q8J89
7285B08k05r5J66K7k45J12L03J3l18P0k83N19l51K70j11l16n1J61K62l51O1N67
$$ plain form
7307 413 308 46 9 -135 89 -248 107 310 -44 108 -105 206 18 -172 -41 -126 217 113 173 87 556
7328 556 239 -33 300 -118 125 106 -164 102 186 175 241 93 307 213 280 197 283 193 24 190 -65 109 -185
7351 -185 -87 -60 4 -45 110 346 229 352 128 267 -15 76 494 51 279 242 230 389 140 254 117 46 -29
7374 -29 -9 35 72 22 248 -140 87 130 -25 3 37 -27 225 224 -158 290 247 362 -184 -239 -123 -71 128 -27 336
7399 336 -190 66 82 10 -158 -58 -133 225 -154 -218 -108 42 -47 -36 -280 106 -254 292 -75 52 155 -162
7421 -162 96 24 -87 -37 -130 -19 -108 50 -465 245 -83 -129 118 -19 88 -190 11 83 177 -95 96 -306
7443 -306 23 -291 212 84 -438 -189 -282 -222 -121 -180 182 -127 -191 146 -159 -205 8 -80 -335 -164 6 -49
7465 -49 -272 -95 -28 -174 -370 -47 -158 -391 -29 90 -151 -22 72 -83 -119 -124 5 -45 -57 -384 -173 299 29
$$ packed form
7307D13j05k62l7j44K24l37L55K03l54J52k13L11j88j90J31q5L43j04O0q6M69
7328E56l17k72L33m18K43j9k70K66Q4j1O6j48K14r4O7q3Q6r0j69J66k55J74k94
7351a85R8K7O4m9J55K36j17J23k24J39k82R1M18m43K28l7j2J59k49J14j37p1p5
7374b9K0M4L7n0K26l88K27M3j55K8L4o4K52jl82M48m3J15n46n5J16N2J99j55L63
7399C36n26K56J6p2j68J00p5L58l79o4J10J50q9J1k44L86l60N46l67J27J03l17
7421a62K58p2j11N0r3J11q9J58n15P10l28m6K47j37J07k78K01P2R4k72J91m02
7443c06L29l14N03j28n22K49r3O0J01n9L62l09o4L37l05m6K13q8k55J71J70n5
7465d9k23J77O7j46j96L23j11k33L62J19k41J29R4j55l6nJ29n0j2l27K11M72k70
$$ plain form
7488 29 -1 -167 -89 40 -201 250 -73 -132 -21 -270 -37 156 -171 125 -384 -346 -9 -125 -99 -110 307 -51
7510 -51 -296 -126 -20 -4 36 -184 -105 -84 204 53 -21 172 -33 -281 -25 134 52 -474 -68 -175 -61 -40 -39
7533 -39 -76 89 -141 -69 -176 45 22 415 185 195 135 -87 40 22 109 11 208 59 151 183 -24 87 389 -23
7557 -23 124 151 35 195 91 52 126 -15 268 -179 298 -257 0 59 116 -121 35 218 328 -53 -75 -24 193
7580 193 144 365 448 295 422 179 -19 303 15 301 50 231 160 -108 -9 79 281 27 340 121 56 218
7602 218 226 45 242 38 224 280 265 272 344 155 327 68 101 136 85 114 81 -82 200 -142 123 -59 124 -3
7626 -3 365 470 -18 270 133 -140 -47 131 219 -193 103 -172 -116 211 -93 144 110 -26 4 46 8 42 -241
7649 -241 -160 -21 -94 -387 212 5 -15 -187 -401 -200 -108 -72 109 47 83 -14 -9 103 -76 -113 18 29 187 -226
$$ packed form
7488B9l0j66P8J29k41M51l23n9J11k49K33J93l27K96n09L8L37j16K6j1M17l58
7510e1k45J70J06J6M0k20P9K1K88j51p4J93k05k48K56J59q2n26M06j07J14K1J
7533c9l7J65k30P2j07K21k3L93k30J0o0k22J27j8Q7r8J97j49R2L2k07J11L02m12
7557b3J47K7j16J60j04l9P4j41K83m47M77n55K57N9N7k37J56J83J10l81k2N1K17
7580A93m9K21Q3j53J27k43j98L22k88K86k51J81p1k68R9Q8K02k54L13k19o5J62
7602B18Qj81J97k04J86N6j5PP2j89J72k59L3L5n1K9l3j63K82l42K65j82J83j27
7626cL68J05m88K88j37k73R3J78Q8m12K96k75N6L27l04K37l4j36L0M2l8L4k83
7649b41Q1J39p3k93N99k07k0j72k14K01R2L6J81o2L6r7NJ12j79l7J31J1J58m13
$$ plain form
7673 -226 -64 107 -178 -55 -57 -130 -1 113 31 -101 -239 -144 47 -344 -240 -46 -59 -12 127 -240 -33 -213
7695 -213 51 102 -71 -248 -484 -385 15 -22 63 -233 99 56 -225 -203 -213 -86 175 -106 147 -53 -361 -217
7717 -217 -359 -64 -9 -65 -220 -46 -192 -93 -105 -189 164 92 65 -72 59 48 -88 -74 -245 14 3 188 -145
7740 -145 -331 -280 -264 -229 -130 85 -129 -87 45 -223 -131 230 -124 324 -36 151 87 -219 -48 268 -6 -101 -134
7763 -134 -83 176 88 67 -72 48 -54 -87 22 -23 6 52 -152 -47 -170 167 221 115 160 20 166 -62 -24
7786 -24 127 -320 136 97 -5 -11 52 -55 86 -6 -94 -22 12 178 -1 85 -116 68 95 135 9 275 235 364
7810 364 210 238 115 117 260 131 134 -129 98 158 123 177 98 58 32 -134 168 43 376 173 68 274 75 334
7834 334 190 268 63 -1 35 199 184 -8 386 87 272 -103 251 89 49 -51 -64 -3 107 328 141 245
$$ packed form
7673b26J62J71k85J23kp3J29J14q2j32j38R5J91l91J04J94j3M7J39l67K07j80
7695b13K64N1j73j77k36R9M00l7Q5k96L32m3k81K2j0J27K61k81K53k00l08J44
7717b17j42K95N5n6j55J74j46R9j2q4L53p2k7j37J31j1j36J4j71K59j1J85l33
7740a45j86N1J6L5R9K15k14M2J32k68R2L61l54M48l60J87o4l06J71L16k74r5l3
7763a34N1K59q8k1j39J20j02l3J09m5K9M6k04J05j23L37N4j06M5j40J46k28L8
7786b4J51m47M56l9j02oO3j07J41r2q8P2L4J66j79Q6k01J84K7M0j26K66m0J29
7810C64j54K8j23KJ43j29Lk63K27O0l5N4p9m0k6j66L02j25L33k03j05K06j99K59
7834C34j44P8k05o4L6J64j5j92L94k99J85l75L54j62m0j00j3O1J10K21j87J04
$$ plain form
7856 245 -190 15 264 155 -205 210 15 356 33 254 165 -118 -227 -148 38 101 90 182 171 91 -97 -174 -71
7879 -71 -15 -53 15 158 99 104 20 10 -32 -211 180 66 -425 -139 24 -137 -142 -44 -143 -393 -15 11 -99 213 -35
7904 -35 192 -119 14 -77 -454 -144 -84 29 -254 -230 -262 -96 89 -67 -402 -175 -52 9 -88 -93 -192 -152 -92 -125
7928 -125 165 -363 -49 -296 20 -119 -24 -158 -302 -39 208 11 -133 -39 -117 -145 103 -27 219 -428 -93
7949 -93 84 -143 -36 -168 -279 -225 -250 -100 -274 -44 -257 -359 -45 -22 -319 -306 -30 28 42 -124 -100 -272 -156
7972 -156 -142 -343 58 -464 -194 -219 -34 -216 -42 16 240 62 -161 -315 -142 254 -300 111 -68 -138 -7
7993 -7 -27 -54 61 -93 -21 318 -65 -8 -89 -191 22 -209 -41 -28 -135 -285 -214 -114 146 -115 60 100 -244
8016 -244 -40 117 -40 -21 -7 -13 85 -131 22 -27 -178 253 -39 148 120 222 95 140 188 96 378 -53 361
$$ packed form
7856B45m35K05K49j09l60M15j95L41l23K21q9k83j09P9J86O3j1R2j1q0j88p7J03
7879g1N6l8O8J43n9Nq4j0m2j79L91j14m91K86J63j61nR8r9k50L78K6j10L12k48
7904c5K27l11J33r1l77L10O0J13k83K4l2J66J85j56l35K27J23O1r7nr9M0O0l3
7928a25K90n28L14k47L16j39R5j34j44K63K47j97j44R4p8k8K48j30K46o47L35
7949i3J77k27J07j32j11N4k5J50j74K30k13j02L14K3k97J3K76N8J4j66K4j72J16
7972a56J4k01M01n22K70k5J85j82J74N8K24j78k23j54J73L96n54M11j79p0J31
7993gk0k7J15j54P2L39l83N7q1j02K13k31J68J3j07j50P1J00K60k61J75M0l44
8016b44K04J57j57J9J4oR8k16J53m9j51M31k92J87k8J02j27M5M8r2K82m31M14
$$ plain form
8039 361 18 109 378 188 58 21 86 -215 -34 1 -137 18 69 77 110 415 256 85 37 185 300 159 -42
8062 -42 91 143 161 -116 148 158 -44 59 126 -36 -12 103 -102 -33 204 117 217 -109 316 -93 219 209 287
8085 287 -127 69 68 200 325 69 31 273 152 80 118 82 271 -125 107 182 1 -67 348 205 120 227 212
8108 212 120 -44 310 123 -118 348 98 71 184 167 -175 -19 82 409 -241 -121 -185 220 -70 144 37
8129 37 32 2 -209 444 -81 -132 15 4 -414 -227 74 79 257 367 34 -104 8 -252 -38 -131 -20 144 -157
8152 -157 -245 -294 -164 -134 174 -329 152 176 140 38 102 -91 -233 -94 70 -8 58 -39 -189 -144 -10 21 40 -225
8176 -225 22 -286 -138 -109 59 -162 -345 290 -162 -349 -290 75 -25 -141 -311
$$ packed form
8039C61l43R1K69j90j30l7O5l01J81L5j38J55N1QL3L05j59j71m8J48J15j41k01
8062d2J33N2J8k77K64J0k02J03O7j62K4J15k05O9K37q7J00l26M25m09L12j0P8
8085B87m14J96jJ32J25k56l8K42j21p2L8l6J89l96K32P5j81o8M15j43q5J07j5
8108B12r2j64L54j87k41M66k50k7J13j7l42J56J01L27o50J20o4M05k90K14j07
8129C7nl0k11O53n25n1J47j1m18J87L01NJ78J10l33j38J12k60K14r3J11J64l01
8152a57q8m9J30L0L08n03M81K4l6j02O4j93j42J39J64p8O6r7j50M5J34L1J9k65
8176b25K47l08J48K9J68k21j83O35m52j87N9L65j00j16j70
8191c11
$$ Imaginary data points
##PAGE= N=2
##DATA TABLE= (X++(I..I)), XYDATA
$$ plain form
0 0 0 0 0 -8 8 -8 8 -16 16 -24 32 -40 48 -56 67 -81 98 -117 138 -162 192 -221 258 -298 341 -389 444
27 444 -503 573 -646 727 -816 915 -1022 1142 -1271 1415 -1570 1742 -1930 2138 -2366 2620
43 2620 -2901 3216 -3565 3963 -4418 4939 -5546 6266 -7130 8197 -9544 11317 -13759 17352
57 17352 -23187 34258 -62733 286159 510489 -221500 -260227 185125 320082 -102635 -210380
68 -210380 87149 242957 27105 -53025 82473 139649 20852 10763 84108 68237 -16766
79 -16766 23856 108029 94046 21603 40004 90238 73162 10357 9299 55806 73314 32635
91 32635 4720 29461 59671 32469 1869 36390 86691 59265 12721 43426 82305 21845
103 21845 -41667 18258 90447 30434 -44127 18924 95445 31681 -40372 24135 82017 -35
$$ packed form
0@%%%qJ6j6J6k4L2m0N6p2Q8j04J23j48J79k15K55l00L54m13M79n56O39p30Q33
27D44r47J076j219J373j543J731j937K164k413K686k985L312l672M068m504M986
43B620n521O117o781P528q381R357j0485J1812j3396J5327j7741K0861k5076L1111
57A7352m0539N7445r6991L48892K24330p31989l8727M45352J34957m22717j07745
68b10380K97529J55808k15852q0130J35498N7176j18797j0089P3345j5871q5003
79a6766M0622Q4173j3983p2443J8401N0234j7076o2805j058M6507J7508m0679
91C2635k7915K4741L0210k7202l0600L4521N0301k7426m6544L0705L8879o0460
103B1845o3512N9925P2189o0013p4561O3051P6521o3764p2053O4507N7882q2052
$$ plain form
115 -35 -59864 26927 84332 -4694 -49483 57025 103365 -17942 -81422 29639 91737 -20125
127 -20125 -91112 6881 78534 -4259 -64533 13793 73423 5665 -52152 -42 44600 -7446
139 -7446 -53859 -13921 25352 -8397 -39848 -5913 26999 -2498 -36459 -12100 18361 -11310
151 -11310 -52414 -27316 24702 8009 -50946 -43379 23740 29821 -42020 -68373 -9434 20215
163 20215 -36188 -71857 -22391 20288 -10060 -41224 -20818 -6660 -28098 -28193 -2652 -15626 -53865
176 -53865 -39596 -315 -23798 -70778 -41066 19023 -6573 -71596 -52919 10025 -6605 -64661
188 -64661 -45167 11638 -9660 -66746 -45653 10369 -10601 -67573 -51743 441 -14075 -64864
200 -64864 -55619 -8228 -7738 -43549 -46087 -17589 -11785 -29654 -37376 -32677 -30235 -26791 -21208 -26305
$$ packed form
115c5n9829Q6791N7405q9026m4789J06508M6340j21307o3480J11061O2098j11862
127b0125p0987R7993P1653q2793o0274P8326N9630o7758n7817N2110M4642n2046
139g446m6413L9938L9273l3749l1451L3935L2912k9497l3961K4359L0461k9671
151a1310m1104K5098N2018j6693n8955P567O7119O081p1841k6353N8939K9649
163B0215n6403l5669M9466M2679l0348l1164K0406J4158k1438r5K5541j2974l8239
176e3865J4269L9281k3483m6980K9712O0089k5596o5023J8677O2944j6630n8056
188f4661J9494N6805k1298n7086K1093N6022k0970n6972J5830N2184j4516n0789
200f4864R245M7391M90l5811k538K8498N804j7869p722M699K442L444N583n097
$$ plain form
214 -26305 -37423 -33716 -17308 -15838 -34200 -45007 -31683 -15662 -22197 -41060 -35768 -5812 1780
227 1780 -29368 -50280 -26852 -2387 -20492 -43407 -24980 -1651 -20270 -42587 -23653 -2387
239 -2387 -19820 -34621 -9799 4082 -23694 -40088 -11888 4077 -23313 -36827 -8446 5540
251 5540 -17686 -28106 -7409 -1146 -18272 -17113 667 -1947 -14970 -5746 8640 -4310 -18556
264 -18556 -3951 8326 -8934 -21159 -1691 14947 889 -11449 4193 17183 4088 -7535
276 -7535 2522 14939 11285 4489 8047 15157 15563 9545 4987 7943 15166 14736 5854 6091 19351
291 19351 23786 12430 8975 25292 35801 23866 13288 22131 32118 24912 15322 18779 25412 24323
305 24323 22246 23325 21779 22173 30704 36687 28376 21434 31873 41070 30277 18693 29741 43442
$$ packed form
214b6305j1118L707J6408J470j8362j0807J3324J6021o535j8863N292K9956P592
227A780l1148k0912K3428K4465j8105k2915J8427K3329j8619k2317J8934K1266
239b387j7433j4801K4822J3881k7776j6394K8200J5965k7390j3514K8381J3986
251E540k3226j0420K0697O263j7126J159J7780k614j3023R224J4386j2950j4246
264a8556J4605J2277j7260j2225J9468J6638j4058j2338J5642J2990j3095j1623
276g535J0057J2417l654o796L558P110M06o018m558K956P223m30q882K37J3260
291A9351M435j1356l455J6317J0509j1935j0578Q843R987p206r590L457O633j089
305B4323k077J079j546L94Q531N983q311o942J0439R197j0793j1584J1048J3701
$$ plain form
319 43442 34084 20237 27943 39617 30937 18326 25598 35515 27829 21943 33827 41586 31938 27213
333 27213 36185 35598 20973 20757 34521 33839 20869 24350 38608 31940 14117 18260 34266 28873
347 28873 12445 18350 34943 30874 15440 17660 30259 28822 17508 15372 19197 18870 14492 12126
361 12126 12181 13949 15706 14347 13225 16969 19170 13861 10836 12775 9569 380 1709 11166 7559
376 7559 -4863 219 14701 9864 -5165 39 12158 1513 -13464 -3195 10056 -1082 -10131
389 -10131 4046 9239 -12146 -19067 3023 5813 -21380 -25624 1649 3536 -24326 -25262 5371
402 5371 8080 -19212 -21356 821 -531 -21801 -20640 -6330 -12896 -26353 -18818 -8443 -17034 -23322
416 -23322 -12655 -9481 -23076 -26280 -15453 -14365 -22040 -17629 -7192 -11714 -20692 -17580 -14014 -22160
$$ packed form
319D3442r358j3847P706J1674q680j2611P272R917p686n886J1884P759r648m725
333B7213Q972n87j4625k16J3764o82j2970L481J4258o668j7823M143J6006n393
347B8873j6428N905J6593m069j5434K220J2599j437j1314k136L825l27m378k366
361A2126N5J768J757j359j122L744K201n309l025J939l206r189J329R457l607
376G559j2422N082J4482m837j5029N204J2119j0645j4977J0269J3251j1138r049
389a0131J4177N193k1385o921K2090K790k7193m244K7273J887k7862r36L0633
402E371K709k7292k144K2177j352k1270J161J4310o566j3457P535J0375q591o288
416b3322J0667L174j3595l204J0827J088p675M411J0437m522q978L112L566q146
$$ plain form
430 -22160 -27766 -22967 -21498 -25321 -22675 -18077 -21196 -21093 -12159 -13839 -28068 -26851 -10724 -12219 -29689
445 -29689 -26409 -8365 -14429 -34354 -27760 -8060 -14414 -30467 -21973 -8767 -22665 -36018 -20930
458 -20930 -8273 -22908 -30898 -11734 -2891 -21983 -29657 -11046 -5548 -24905 -32456 -16512 -11565
471 -11565 -24992 -27423 -13050 -7882 -15364 -17973 -12156 -12684 -18637 -20174 -16793 -14989 -16660 -17186 -13527
486 -13527 -8874 -9546 -15951 -17120 -9301 -8062 -17904 -19339 -4783 389 -15023 -20468 -5090 820
500 820 -14535 -18390 -891 3120 -14832 -19247 -1172 2785 -13840 -13923 5103 6649 -9281 -8685
514 -8685 8434 6024 -11122 -8878 7246 3573 -10373 -2998 13048 6197 -9129 -382 15325
527 15325 8136 -6127 2541 16894 9541 -3482 5444 21331 15850 2105 5520 16652 12461
$$ packed form
430b2160n606M799J469l823K646M598l119J03Q934j680j4229J217J6127j495j7470
445b9689L280J8044o064j9925O594J9700o354j6053Q494J3206j3898j3353J5088
458b0930J2657j4635p990J9164Q843j9092p674J8611N498j9357p551J5944M947
471a1565j3427k431J4373N168p482k609N817n28n953j537L381J804j671n26L659
486a3527M653o72o405j169P819J239r842j435J4556N172j5412n445J5378N910
500H20j5355l855J7499M011j7952m415J8075L957j6625q3J9026J546j5930N96
514h685J7119k410j7146K244J6124l673j3946P375J6046o851j5326Q747J5707
527A5325p189j4263Q668J4353p353j3023Q926J5887n481j3745L415J1132m191
$$ plain form
540 12461 2020 5769 16748 16169 7947 9107 17674 20443 15861 15689 20202 20566 14823 12467 17094
555 17094 20575 16747 15405 20512 24110 17966 14542 21725 27868 20086 12377 20169 28110 20272 13604
570 13604 23589 32124 23087 15196 24533 31144 19719 13216 25407 30467 16271 10683 25446 31190
584 31190 18005 14095 28677 31967 17482 13019 24720 26174 15508 15257 25420 23708 13424
597 13424 15410 25459 22203 13128 15902 22677 18018 9323 12431 19909 19053 13395 12752 13641 12448
612 12448 11183 11982 12986 13010 12677 10721 8322 8899 9758 7552 6611 9077 7908 2363 2108 8140 6747
629 6747 -3110 -3067 7451 7155 -3986 -4825 6581 6975 -6095 -8926 2291 4446 -6159 -9431 -2915
644 -2915 -3538 -9221 -6496 -625 -7088 -14074 -8501 -3578 -12380 -19270 -8209 1014 -9196 -19959 -11131
$$ packed form
540A2461j0441L749J0979n79q222J160Q567K769m582j72M513L64n743k356M627
555A7094L481l828j342N107L598o144l424P183O143p782p709P792P941p838o668
570A3604R985Q535r037p891R337O611j1425o503J2191N060j4196n588J4763N744
584C1190j3185l910J4582L290j4485m463J1701J454j0666k51J0163j712j0284
597A3424J986J0049l256r075K774O775m659q695L108P478q56n658o43Q89j193
612A2448j265P99J004K4l33j956k399N77Q59k206r41K466j169n545k55O032j393
629F747r857M3J0518k96j1141q39J1406L94j3070k831J1217K155j0605l272O516
644b915o23n683K725N871o463o986N573M923q802o890J1061R223j0210j0763Q828
$$ plain form
659 -11131 12 -8636 -20873 -15634 -6958 -13396 -22476 -16538 -7516 -12870 -21150 -17081 -9488 -13678
673 -13678 -20375 -16082 -9972 -14309 -20417 -17484 -12705 -15739 -19911 -16496 -12730 -15978 -18220 -15540 -14417
688 -14417 -19158 -20497 -15296 -13698 -17947 -19331 -13396 -12066 -17279 -18845 -13151 -9985 -16129 -20898 -17680
703 -17680 -12476 -13892 -17316 -15148 -11455 -13175 -18454 -17387 -11838 -11708 -15934 -14723 -10152 -12232 -18585
718 -18585 -15434 -7441 -9449 -18309 -16117 -7566 -8567 -17326 -15289 -6348 -8056 -15668 -12377 -5801 -10097
733 -10097 -16417 -11279 -5715 -11971 -15750 -7237 -2617 -11192 -15333 -6177 -1469 -8959 -12061 -5461 -3430
748 -3430 -9360 -10717 -5899 -4177 -6422 -5269 -4322 -6693 -6249 -1977 -2457 -5703 -3918 -1217 -3276 -4899
764 -4899 -532 2246 -1624 -1705 4266 3414 -3411 -2006 5452 3355 -3204 356 6927 2569 -890 6962
$$ packed form
659a1131J1143q648j2237N239Q676o438r080N938R022n354q280M069P593m190
673a3678o697M293O110m337o108K933M779l034m172L415L766l248k242K680J123
688a4417m741j339N201J598m249j384N935J330n213j566N694L166o144m769L218
703a7680N204j416l424K168L693j720n279J067N549J30m226J211M571k080o353
718a8585L151P993k008q860K192Q551j001q759K037Q941j708p612L291O576m296
733a0097o320N138N564o256l779Q513M620q575m141R156M708p490l102O600K031
748c430n930j357M818J722k245J153R47k371M44M272m80l246J785K701k059j623
764d899M367K778l870q1N971q52o825J405P458k097o559L560O571m358l459P852
$$ plain form
780 6962 11225 2826 227 10826 12701 802 316 14670 16284 2682 1768 15336 15948 3384
794 3384 3587 15843 16496 7368 8080 15733 14408 9178 12386 16850 13026 11182 16540 18026 11514 10699
810 10699 18512 20740 14224 12488 16090 17356 15395 15550 16893 16660 17280 16813 14921 14343 18508 20658
826 20658 17019 15590 19438 18407 13006 14844 21951 18778 10682 14476 23072 18629 9540 14709 23776
841 23776 17397 7360 13380 21528 15161 8351 15913 22449 13984 8040 15784 18975 10189 8010 17068
856 17068 16973 6664 6173 15181 13767 4806 7414 16726 12555 3026 5567 14140 11497 4124 5802
871 5802 10609 7337 1523 4439 8574 6603 2582 2007 3024 2439 2419 2256 1722 1347 1998 905 -3627
888 -3627 -1946 1282 -536 -3407 -2125 -426 -3139 -4710 -2669 -2760 -6288 -7099 -4135 -5756 -10534 -9259
$$ packed form
780F962M263q399k599J0599J875j1899m86J4354J614j3602r14J3568O12j2564
794C384K03J2256O53r128P12P653j325n230L208M464l824j844N358J486o512q15
810A0699P813K228o516j736L602J266j961J55J343k33O20m67j892n78M165K150
826B0658l639j429L848j031n401J838P107l173q096L794Q596m443r089N169R067
841B3776o379j0037O020Q148o367o810P562O536q465n944P744L191q786k179R058
856A7068r5j0309m91R008j414q961K608R312m171r529K541Q573k643p373J678
871E802M807l272n814K916M135j971m021n75J017n85k0j63n34l75O51j093m532
888c627J681L228j818k871J282J699k713j571K041r1l528q11K964j621m778J275
$$ plain form
904 -9259 -4105 -6459 -11575 -8876 -4313 -7945 -14052 -10558 -4825 -8966 -15758 -12930 -7689 -11372 -15413
919 -15413 -10617 -6391 -12086 -17536 -14603 -10635 -13837 -16010 -12406 -11673 -15836 -16515 -12458 -11130 -13712
934 -13712 -13723 -11932 -14469 -18019 -15799 -11363 -11836 -14850 -15515 -14810 -14467 -13993 -14003 -14523 -13386 -11897 -14309
951 -14309 -17399 -15049 -9150 -10243 -14961 -14294 -9214 -11295 -16508 -13210 -7799 -11695 -16578 -12099 -8024
966 -8024 -12941 -15253 -8451 -5103 -12348 -15216 -8022 -6183 -12997 -12968 -5034 -4658 -11996 -11514 -4175 -5843
982 -5843 -11956 -9607 -3138 -6820 -12635 -8226 -1785 -4994 -9744 -5217 -225 -4989 -10325 -6024 -638
997 -638 -3767 -7496 -4991 -1223 -2547 -5198 -3019 -260 -890 -2970 -3369 -2183 -1748 -2723 -1871 32 1036
1014 1036 -475 -1638 -728 1470 1669 1338 2007 1894 529 790 3380 4063 2217 3335 6289 4347 -337
$$ packed form
904i259N154k354n116K699M563l632o107L494N733m141o792K828N241l683m041
919a5413M796M226n695n450K933L968l202k173L604P33m163o79M057J328k582
934a3712j1J791k537l550K220M436m73l014o65P05L43M74j0n20J137J489k412
951a4309l090K350N899j093m718O67N080k081n213L298N411l896m883M479M075
966h024m917k312O802L348p245k868P194J839o814K9P934L76p338M82P339j668
982e843o113K349O469l682n815M409O441l209m750M527M992m764n336M301N386
997f38l129l729K505L768j324k651K179K759o30k080l99J186M35r75Q52J903J004
1014A036j511j163R10K198J99l31O69j13j365K61K590O83j846J118K954j942m684
$$ plain form
1031 -337 1379 8061 8624 2591 1203 6578 8556 4120 4147 8860 10530 6413 4659 7996 10412 8638
1047 8638 8344 10048 8987 7061 7917 10546 10372 7950 8810 11408 11388 9707 10652 13373 13317 10721 10076
1064 10076 12867 14064 12581 11168 11997 12463 12012 12182 13412 13809 12903 12145 13169 14039 13426 12812 13632
1081 13632 14628 14400 12727 13648 15132 14787 12529 11401 13422 14503 12760 11126 12207 12609 11853 11910 13781
1098 13781 13907 11428 10984 13021 12470 9852 10501 13864 11692 7251 7613 12515 11254 6467 6743 11122
1114 11122 9626 5116 6725 10710 8850 4233 6169 9175 5926 2221 5016 8049 4037 450 3698
1129 3698 5960 2464 309 2944 3959 537 -1050 1305 867 -1474 -1002 773 -688 -3471 -2229
1144 -2229 -594 -2768 -4515 -3364 -2685 -4626 -6321 -4986 -4422 -5157 -5848 -6074 -6901 -6846 -6539 -8104 -9203
$$ packed form
1031c37J716O682N63o033j388N375J978m436K7M713J670m117j754L337K416j774
1047H638k94J704j061j926Q56K629j74k422Q60K598k0j681R45K721n6k596o45
1064A0076K791J197j483j413Q29M66m51J70J230L97r06p58J024Q70o13o14Q20
1081A3632R96k28j673R21J484l45k258j128K021J081j743j634J081M02p56N7J871
1098A3781J26k479m44K037n51k618O49L363k172m441L62M902j261m787K76M379
1114A1122j496m510J609L985j860m617J936L006l249l705K795L033m012l587L248
1129C698K262l496k155K635J015l422j587K355m38k341M72J775j461k783J242
1144b229J635k174j747J151O79j941j695J335N64p35o91k26q27N5L07j565j099
$$ plain form
1161 -9203 -7667 -7197 -10301 -10933 -7472 -7019 -11638 -12622 -7905 -6991 -11966 -13200 -8561 -8178 -13039 -13278 -10005
1178 -10005 -10676 -13588 -11745 -10094 -12953 -14566 -10326 -9005 -14144 -15136 -9142 -7975 -14226 -15967 -9923
1193 -9923 -8215 -14060 -15731 -10783 -9145 -12868 -14078 -10992 -10227 -12609 -12086 -10005 -11531 -13084 -11371
1208 -11371 -9543 -10802 -11717 -9333 -8520 -10310 -10623 -9476 -9500 -10111 -9612 -8980 -9579 -9518 -7809 -7836 -8782 -7461
1226 -7461 -5703 -7322 -9244 -7570 -5569 -7652 -8747 -5565 -3479 -6078 -7436 -4495 -2600 -4773 -6243
1241 -6243 -4084 -3370 -5904 -5786 -2209 -2220 -4709 -3276 -142 -2412 -5566 -2719 1522 -392 -4720 -2387
1257 -2387 1846 567 -2531 -524 2423 770 -1491 -750 729 363 485 1201 1615 1598 2013 3278 3071
1274 3071 2972 3150 3517 3502 3672 3566 2512 3134 5851 5221 2681 3382 7240 6255 2098 3006 7895 7903 3441
$$ packed form
1161i203J536M70l104o32L461M53m619r84M717R14m975j234M639L83m861k39L273
1178a0005o71k912J843J651k859j613M240J321n139r92N994J167o251j741O044
1193i923J708n845j671M948J638l723j210L086P65k382N23K081j526j553J713
1208a1371J828j259r15K384Q13j790l13J147k4o11M99O32n99O1J709k7r46J321
1226g461J758j619j922J674K001k083j095L182K086k599j358K941J895k173j470
1241f243K159P14k534J18L577j1k489J433L134k270l154K847M241j914m328K333
1257b387M233j279l098K007K947j653k261P41J479l66J22P16M14j7M15J265k07
1274C071r9J78L67j5J70j06j054O22K717o30k540P01L858r85m157R08M889Qm462
$$ plain form
1293 3441 4292 9141 8996 5061 6732 10548 8670 4503 6145 9186 6746 4520 8068 10317 7025
1308 7025 6290 10866 12290 7862 7106 11548 11376 6349 7410 12832 12124 6796 7649 12829 12295 7667
1324 7667 8404 11897 10955 7785 8600 11563 12069 10780 11209 11560 10767 11326 12289 10591 8394 9759 11010
1341 11010 9553 8143 9587 11555 11379 10323 10067 9696 9485 10371 10211 8224 7794 10049 10891 7216 5906
1358 5906 9202 10339 7542 5896 7692 7453 5476 6105 8131 7030 5327 6846 8131 4689 2556
1373 2556 5478 7080 3333 734 2583 4311 2243 1418 3343 4494 1899 806 1584 1670 113 -240
1389 -240 747 -88 -1507 -2084 -1565 -1491 -1505 -2198 -3252 -3915 -3216 -3306 -5013 -4878 -3235 -3136 -4451 -4728 -4051 -5050
1409 -5050 -6289 -6008 -5544 -8099 -9230 -7416 -6018 -9021 -10051 -7135 -5186 -8172 -10204 -8053 -6227
$$ packed form
1293C441Q51M849j45l935J671L816j878m167J642L041k440k226L548K249l292
1308G025p35M576J424m428p56M442j72n027J061N422p08n328Q53N180n34m628
1324G667P37L493r42l170Q15K963N06j289M29L51p93N59R63j698k197J365J251
1341A1010j457j410J444J968j76j056k56l71k11Q86j60j987m30K255Q42l675j310
1358E906L296J137k797j646J796k39j977O29K026j101j703J519J285l442k133
1373B556K922J602l747k599J849J728k068q25J925J151k595j093P78Q6j557l53
1389b40R87q35j419n77N19P4j4o93j054o63O99r0j707J35J643R9j315k77O77r99
1409e050j239K81M64k555j131J814J398l003j030K916J949k986k032K151J826
$$ plain form
1424 -6227 -8279 -10569 -9007 -7929 -9071 -10526 -9652 -9775 -10520 -10179 -8781 -9972 -11860 -10715 -8293 -9608
1440 -9608 -12682 -11151 -7129 -7389 -11309 -12386 -9121 -7992 -11261 -12332 -9947 -8830 -10961 -11859 -9856
1455 -9856 -8867 -9540 -8986 -7947 -9177 -10843 -9543 -7272 -7959 -10184 -9303 -7088 -7687 -9573 -9307 -6881 -6906
1472 -6906 -7904 -7876 -6812 -6397 -7369 -7214 -5720 -5003 -5860 -6232 -5793 -5318 -6072 -6172 -5030 -3285 -3526 -5418
1490 -5418 -5242 -3431 -2374 -3422 -3042 -1737 -2701 -3860 -2995 -1571 -2065 -2494 -771 -583 -3094 -3367 290
1507 290 1698 -984 -2157 1133 2443 -487 -1428 2227 3475 862 -295 1352 2214 947 1384 2748
1523 2748 2608 1514 2757 4200 3207 2048 4030 5509 4367 3187 4004 4798 4286 3196 3911 4587 5429
1540 5429 5333 4271 3868 5172 6607 5693 4800 6422 7718 5716 4341 6565 8514 6636 4639 6725
$$ packed form
1424f227k052k290J562J078j142j455Q74j23p45L41J398j191j888J145K422j315
1440i608l074J531M022k60l920j077L265J129l269j071K385J117k131q98K003
1455i856R89o73N54J039j230j666J300K271o87k225Q81K215n99j886K66K426k5
1472f906r98K8J064M15r72J55J494P17q57l72M39M75p54j00J142J745k41j892
1490e418J76J811J057j048L80J305r64j159Q65J424m94m29J723J88k511k73L657
1507B90J408k682j173L290J310k930r41L655J248k613j157J647Q62j267M37J364
1523B748j40j094J243J443r93j159J982J479j142j180Q17P94n12j090P15O76Q42
1540E429r6j062m03J304J435r14q93J622J296k002j375K224J949j878j997K086
$$ plain form
1556 6725 7492 5236 4508 7699 8554 6373 6392 8647 8227 5877 7435 10233 8554 5239 6447 10100
1572 10100 8154 4889 7550 10636 8537 5112 6727 9828 8712 6517 7653 9538 8818 7679 8376
1587 8376 8537 8009 8003 8224 7463 6552 7303 8526 7433 6302 7366 8927 9001 7591 7072 7580 8451 7894 6026
1606 6026 5660 6967 7325 5741 4278 5966 7695 6918 4412 5022 6222 5807 4620 5088 5759 4565 4009
1623 4009 4899 4658 2291 3186 4013 3774 -1598 402 3835 3035 56 162 2727 2811 -375 668 3476
1640 3476 1727 -1899 -1338 496 -436 -3038 -2028 523 -3139 -2843 -2001 -417 -2977 -4934 -2402 -2282
1656 -2282 -4911 -4367 -2455 -2547 -5429 -6201 -3831 -4488 -7453 -6859 -6279 -6114 -7269 -6964 -6558 -6542 -5802 -5093
1674 -5093 -6364 -7389 -6274 -5928 -7154 -9916 -8436 -7413 -8242 -9265 -8608 -8007 -9128 -8552 -8062 -9015 -9590
$$ packed form
1556F725P67k256p28L191Q55k181J9K255m20k350J558K798j679l315J208L653
1572A0100j946l265K661L086k099l425J615L101j116k195J136J885p20j139O97
1587H376J61n28oK21p61r11P51J223j093j131J064J561P4j410n19N08Q71n57j868
1606F026l66J307L58j584j463J688J729p77k506O10J200m15j187M68O71j194n56
1623D009Q90k41k367Q95Q27k39n372K000L433q00k979J06K565Q4l186J043K808
1640C476j749l626N61J834r32k602J010K551l662K96Q42J584k560j957K532J20
1656b282k629N44J912r2k882p72K370o57k965N94N80J65j155L05M06J6P40P09
1674e093j271j025J115L46j226k762J480J023q29j023O57O01j121N76M90r53n75
$$ plain form
1691 -9590 -7868 -7098 -9189 -10376 -7476 -5901 -8756 -10296 -8039 -7687 -9955 -11199 -8291 -7541 -9600 -9862
1707 -9862 -7578 -6967 -8096 -7181 -5890 -6872 -8249 -7059 -6515 -8271 -8789 -6724 -5812 -7291 -8429 -6433
1723 -6433 -5216 -6254 -6358 -5666 -4998 -5575 -5607 -4752 -4589 -3349 -3994 -4481 -4645 -3614 -3578 -4790 -5080 -2954
1741 -2954 -2001 -3369 -3818 -1589 -1133 -1711 -2179 72 -698 -2813 -1829 -27 -1099 -2385 -686 1397 -200
1758 -200 -2434 598 2674 784 -787 2074 3529 1195 -228 2295 3272 2138 1407 3092 2014 1027
1774 1027 1668 3438 2715 771 2484 4563 3142 1995 3540 5343 3965 3170 3900 5392 4773 3374
1790 3374 3930 4927 4661 4209 4451 4042 3961 4595 5526 5555 6194 5489 5179 4790 6299 5915 5857 5823 5895 5671 5530
1811 5530 5824 5365 6003 5271 5501 6006 6209 6310 6710 7333 6540 5647 6151 6950 6283 5659 6048 6628 6564 5851
$$ packed form
1691i590J722P70k091j187K900J575k855j540K257L52k268j244K908P50k059k62
1707i862K284O11j129R15J291r82j377J190N44j756n18K065R12j479j138J996
1723f433J217j038j04O92O68n77l2Q55J63J240o45m87j64J031L6j212k90K126
1741b954R53j368m49K229M56n78m68K251p70k115R84J802j072j286J699K083j597
1758b00k234L032K076j890j571K861J455k334j423K523R77j134p31J685j078r87
1774A027O41J770p23j944J713K079j421j147J545J803j378p95P30J492o19j399
1790C374N56R97k66m52K42m09q1O34R31K9O39p05l10l89J509l84n8l4P2k24j41
1811E530K94m59O38p32K30N05K03J01M00O23p93q93N04P99o67o24L89N80o4p13
$$ plain form
1831 5851 5399 6670 6850 6266 5853 6619 6429 5991 6387 6805 6572 6133 6166 6215 5351 5016 6223 6018 5322 4982
1851 4982 5901 6400 5190 4965 5895 6588 5413 4667 4954 4761 4620 4684 4756 4065 3671 4218 4245 4015 3829 4388
1871 4388 4297 3429 3247 3543 2524 2791 3325 2965 1571 1375 2661 1721 376 901 1786 1279 -54 422
1889 422 1366 334 -55 791 832 -904 -1486 -511 -172 -2349 -3013 -1233 -807 -2831 -3455 -2063 -1777 -3116
1907 -3116 -3147 -2593 -3062 -4004 -3417 -3150 -4136 -5403 -4508 -3615 -4587 -6457 -5692 -3957 -5379 -6843 -6280 -5156
1925 -5156 -5467 -5975 -6202 -5966 -5569 -6285 -6281 -6829 -7221 -6916 -6957 -7230 -7598 -7074 -6911 -7108 -7067 -7052 -7053 -6844 -6684 -7607
1947 -7607 -7563 -6886 -6556 -7305 -8352 -7645 -6385 -7044 -8073 -7573 -6875 -6992 -7841 -6952 -6064 -6282 -6376 -5748 -5428
1966 -5428 -6546 -6566 -5448 -5557 -7009 -6896 -5386 -5301 -6041 -5372 -4240 -4245 -5153 -4616 -3436 -3893 -4663 -3913 -3297
$$ packed form
1831E851m52J271J80n84m13P66j90m38L96M18k33m39L3M9q64l35J207k05o96l40
1851D982R19M99j210k25R30O93j175p46K87j93j41O4P2o91l94N47K7k30j86N59
1871D388r1q68j82K96j019K67N34l60j394j96J286r40j345N25Q85n07j333M76
1889D22R44j032l89Q46M1j736n82R75L39k177o64J780M26k024o24J392K86j339
1907c116l1N54m69r42N87K67r86j267Q95Q93r72j870P65J735j422j464N63J124
1925e156l11n08k27K36L97p16Mn48l92L05m1k73l68N24J63j97M1J5jK09J60r23
1947g607M4O77L30p49j047P07J260o59j029N00O98j17q49Q89Q88k18r4O28L20
1966e428j118k0J118j09j452J13J510Q5p40O69J132nr08N37J180m57p70P50O16
$$ plain form
1985 -3297 -3870 -4407 -3610 -2627 -2611 -3369 -3062 -2771 -3101 -2483 -1998 -2047 -2015 -1194 -289 -1066 -1149 -419 360 -434 -1074
2006 -1074 -691 -614 -722 -77 502 505 532 1209 2061 749 639 1959 3204 1548 758 2038 2929 1862 1315
2025 1315 2701 3330 2043 2008 3417 2914 2185 2898 4416 3630 2479 4088 5835 4328 2949 3859 5442
2042 5442 4063 2751 3336 4519 4304 3602 4447 5274 4833 4577 4978 4841 4689 4868 5431 4979 4541 4755 5435
2061 5435 4888 5098 5223 5039 4668 4782 5103 4840 5028 5644 5760 5248 5520 6476 5474 4770 5130 5695 4428
2080 4428 3795 5274 6031 3961 3574 5586 6385 4679 4434 5803 6087 4218 3682 5126 5515 4320 4401
2097 4401 5240 4594 3301 4447 5402 4314 2838 4146 4940 3884 3487 4550 4864 3997 3354 4163 4023
2114 4023 2807 3068 3040 3136 2347 2920 3085 2605 2441 2626 3103 2683 2237 2127 1700 1491 1437 1517 1082 1461 1627
$$ packed form
1985c297n73n37P97R83J6p58L07K91l30O18M85m9L2Q21R05p77q3P30P79p94o40
2006a074L83P7j08O45N79LK7O77Q52j312j10J320J245j656p90J280Q91j067n47
2025A315J386O29j287l5J409n03p29P13J518p86j151J609J747j507j379R10J583
2042E442j379j312N85J183k15p02Q45Q27m41k56M01j37j52J79N63m52m38K14O80
2061E435n47K10J25j84l71J14L21k63J88O16J16n12K72R56j002p04L60N65j267
2080D428o33J479P57k070l87K012P99j706k45J369K84j869n36J444L89j195Q1
2097D401Q39o46j293J146R55j088j476J308P94j056l97J063L14q67o43Q09j40
2114D023j216K61k8R6p89N73J65m80j64J85M77m20m46j10m27k09n4Q0m35L79J66
$$ plain form
2135 1627 879 -11 351 1416 853 -463 -304 42 -390 -1224 -363 525 -277 -1348 -1147 -818 -1570 -2223 -1981
2154 -1981 -1956 -2203 -3000 -2555 -2222 -2761 -2908 -2287 -2627 -3225 -3654 -3367 -3214 -4012 -4172 -3639 -3592 -4285 -4789 -4546
2174 -4546 -4368 -4767 -5146 -5065 -4831 -5362 -5527 -5535 -5198 -5072 -5001 -5204 -5444 -5939 -5889 -5992 -5847 -6255 -5829 -5852 -6338 -5944
2196 -5944 -6050 -5684 -5323 -5838 -6266 -5902 -5941 -5885 -7037 -6353 -5382 -5402 -6506 -6464 -5440 -5329 -6151 -6255 -5334 -5026
2216 -5026 -5849 -5843 -5221 -4571 -5089 -5078 -4656 -4770 -5180 -4925 -4420 -4616 -5064 -4109 -3527 -3949 -4306 -3507 -2651 -3318 -3804
2237 -3804 -3023 -2226 -2757 -3424 -2510 -1967 -2169 -2338 -1848 -1244 -1545 -1553 -1064 -824 -1206 -758 150 -51 -1157 -574
2257 -574 703 583 52 222 1069 793 398 921 1085 1393 1452 1786 1684 1772 2215 2188 2356 2180 2536 2617 2063
2278 2063 2522 2911 3220 2799 2899 3523 3232 2783 3143 3466 3339 3524 3901 3782 3379 3836 4154 4229 3854 3910
$$ packed form
2135A627p48q90L62J065n63j316J59L46m32q34Q61Q88q02j071K01L29p52o53K42
2154a981K5k47p97M45L33n39j47O21l40n98m29K87J53p98j60N33M7o93n04K43
2174d546J78l99l79Q1K34n31j65qL37J26P1k03k40m95N0j03J45m08M26k3m86L94
2196e944j06L66L61n15m28L64l9N6j152O84R71k0j104M2J024J11q22j04R21L08
2216e026q23OO22O50n18J1M22j14m10K55N05j96m48R55N82m22l57P99Q56o67m86
2237c804P81P97n31o67R14N43k02j69M90O04l01qM89K40l82M48R08k01j106N83
2257e74J277j20n31J70Q47k76l95N23J64L08N9L34j02Q8M43k7J68j76L56Q1n54
2278B063M59L89L09m21J00O24k91m49L60L23j27J85L77j19m03M57L18P5l75N6
$$ plain form
2298 3910 4316 4092 3580 3972 4998 4808 4481 4364 4148 4499 4449 4518 4619 4533 4656 4327 4047 4118 4706 4922 4674
2319 4674 3953 4392 4476 4348 4143 4695 4573 4568 3875 4208 4327 4284 4648 4424 4028 3748 4340 4559 3943 3586 4503
2340 4503 4432 4047 3250 4084 3898 3933 3653 3654 3678 3247 3078 3517 3576 3357 3102 3711 2777 2558 3108 3418 2520 2369
2362 2369 2927 3163 2097 2034 3002 2993 2240 1623 2115 1955 1351 1892 2413 2114 1451 1326 1867 1116 739 1226
2382 1226 2064 326 144 669 1100 401 154 608 666 -89 -609 -286 90 -561 -844 -727 -1033 -881 -1036 -1048
2402 -1048 -1252 -1398 -1023 -1373 -2228 -2423 -1660 -1717 -2360 -2385 -2384 -2494 -2713 -2881 -2833 -2937 -2681 -2875 -3719 -4078 -3253
2423 -3253 -3189 -3588 -4362 -3999 -3357 -3923 -4507 -4302 -3824 -4422 -4568 -4454 -4409 -5054 -4852 -4332 -4792 -5200 -4880 -4673
2443 -4673 -4946 -5632 -4915 -4569 -4919 -5819 -4785 -4668 -5599 -5628 -4981 -4783 -5268 -5669 -5374 -4862 -5041 -4927 -5095 -5126
$$ packed form
2298C910M06k24n12L92J026j90l27j17k16L51n0O9J01q6J23l29k80P1N88K16k48
2319D674p21M39Q4j28k05N52j22no93L33J19m3L64k24l96k80N92K19o16l57R17
2340D503p1l85p97Q34j86L5k80JK4m31j69M39N9k19k55O09r34k19N50L10q98j51
2362B369N58K36j066o3R68rp53o17M92j60o04N41N21k99o63j25N41p51l77M87
2382A226Q38j738j82N25M31o99k47M54N8p55n20L23L76o51k83J17l06J52j55j2
2402a048k04j46L75l50q55j95P63n7o43k5Jj10k19j68M8j04K56j94q44l59Q25
2423c253O4l99p74L63O42n66n84K05M78n98j46J14M5o45K02N20m60m08L20K07
2443d673k73o86P17L46l50r00J034J17r31k9O47J98m85m01K95N12j79J14j68l1
$$ plain form
2463 -5126 -5060 -4490 -4621 -5186 -4742 -3837 -4218 -5283 -4564 -3984 -4158 -4278 -4059 -3809 -3787 -3715 -3543 -3629 -3629 -3505 -2910
2484 -2910 -2857 -3540 -3280 -2577 -2691 -2815 -2609 -1572 -1642 -2417 -2064 -1763 -1801 -1226 -1489 -1397 -1021 -857 -623 -761 -793
2505 -793 -479 213 -380 -381 -64 733 543 267 674 812 1099 1244 1143 1269 1402 1881 1725 1147 1577 2307 2212
2526 2212 1802 1996 2531 2477 2300 2699 2805 3050 3185 3099 2967 2897 3369 3649 3495 3058 3564 3822 3416 3035 3577
2547 3577 4373 4308 3203 3386 4124 4290 3529 3448 4188 4402 3726 3674 3920 3941 4362 3835 4081 4159 3855 4156 4187
2568 4187 4049 3992 4319 4199 4059 3805 4018 4003 3621 3308 3690 4029 3695 3522 3427 3734 3809 3532 3599 3613 3576 3445
2590 3445 3296 3259 3234 3326 3078 3026 2858 3324 3188 2939 2766 2815 3045 2879 2740 2905 2758 2764 2139 2098 2289 1940
2612 1940 2424 1974 1643 1703 1927 1889 1531 1525 1519 1678 1182 1151 924 1545 1185 1002 852 867 978 734 386 373 200
$$ packed form
2463e126O6N70j31n65M44R05l81j065P19N80j74j20K19K50K2P2J72q6%J24N95
2484b910N3o83K60P03j14j24K06J037p0p75L53L01l8N75k63R2L76J64K34j38l2
2505g93L14O92n93jL17P97j90k76M07J38K87J45j01J26J33M79j56n78M30P30r5
2526B212m10J94N35n4j77L99J06K45J35q6j32p0M72K80j54m37N06K58m06l81N42
2547C577P96o5j105J83P38J66p61q1P40K14o76n2K46K1M21n27K46P8l04L01L1
2568D187j38n7L27j20j40k54K13j5l82l13L82L39l34j73r5L07P5k77O7J4l7j31
2590C445j49l7k5R2k48n2j68M66j36k49j73M9K30j66j39J65j47Oo25m1J91l49
2612A940M84m50l31O0K24l8l58ooJ59m96l1k27O21l60j83j50J5J11k44l48j3j73
$$ plain form
2635 200 449 405 149 94 407 379 -138 -665 -484 -89 -180 -1062 -728 -600 -856 -1049 -1402 -1355 -1087 -1055 -1313 -1753
2657 -1753 -1485 -1454 -1715 -2132 -1903 -1744 -1972 -2189 -2493 -2422 -2383 -2355 -2776 -3144 -2688 -2658 -3021 -3059 -2978 -2701 -2781 -3311
2679 -3311 -3600 -2790 -3141 -3686 -3716 -3986 -3400 -4070 -3991 -3908 -3730 -3993 -4250 -4143 -4048 -3833 -3928 -4322 -4238 -4112 -3908 -3925
2701 -3925 -4257 -4420 -4328 -4124 -4477 -4681 -4375 -4092 -3835 -4379 -4462 -4002 -3804 -4194 -4231 -4043 -3930 -3770 -3851 -4342 -4299
2722 -4299 -3814 -3502 -4043 -3675 -3348 -3142 -3427 -3384 -2991 -2768 -2607 -2884 -3130 -2903 -2679 -2569 -2248 -2479 -2582 -2118
2742 -2118 -2029 -2568 -2398 -1794 -1385 -1669 -1339 -843 -786 -1074 -836 -281 -379 -643 -625 -383 -135 -549 65 -196 264
2763 264 546 603 869 677 870 784 1423 1350 1273 1589 1679 1518 1658 1552 2363 2331 1654 1785 2105 2523 2416 2118
2785 2118 2660 3252 3224 2575 2470 3560 3595 2895 2899 3227 3327 2932 3085 3281 3291 3728 3718 3760 3001 3590 3724 3916
$$ packed form
2635B00K49m4k56n5L13k8n17n27J81L95r1q82L34J28k56j93l53M7K68L2k58m40
2657a753K68L1k61m17K29J59k28k17l04P1L9K8m21l68M56L0l63l8Q1K77q0n30
2679c311k89Q10l51n45l0k70N86o70P9Q3J78k63k57J07R5K15r5l94Q4J26K04j7
2701c925l32j63R2K04l53k04L06K83K57n44q3M60J98l90l7J88J13J60q1m91M3
2722d299M85L12n41L68L27K06k85M3L93K23J61k77k46K27K24J10L21k31j03M64
2742b118Q9n39J70O04M09k84L30M96N7k88K38N55r8k64J8K42K48m14O14k61M60
2763B64K82N7K66j92J93q6O39p3p7L16R0j61J40j06Q11l2o77J31L20M18j07k98
2785B118N42N92k8o49j05J090L5p00ML28J00l95J53J96J0M37j0M2p59N89J34J92
$$ plain form
2807 3916 3313 3136 4000 4170 3487 3089 3511 3916 3568 3275 3530 3606 3541 3556 3878 3615 3965 3766 3820 3383 3335
2828 3335 3157 3559 3257 3168 3662 3311 3328 3201 3458 3115 3231 3052 2971 2903 2707 2793 2700 2730 2948 2658 2612 2482
2850 2482 2470 2226 2027 2088 1940 2216 2019 1842 1967 2279 2182 2174 1821 1482 1477 1457 1090 1080 1250 1475 1297 918 875
2873 875 1193 1604 1375 589 234 406 466 440 139 623 615 503 59 -43 65 382 508 -199 -681 -308 -201
2894 -201 -387 -751 -677 -237 -380 -916 -1390 -887 -753 -1192 -1513 -936 -1294 -1541 -1641 -1484 -1053 -1210 -1631 -1986
2914 -1986 -1996 -1803 -1926 -1992 -1789 -2053 -1877 -2080 -1993 -2545 -2704 -2421 -2540 -2753 -2781 -2902 -2662 -2444 -2707 -2594 -2511
2935 -2511 -2756 -3316 -3428 -3541 -2843 -3556 -3507 -3282 -3405 -3254 -3562 -2830 -2761 -3242 -3763 -3486 -3523 -3373 -3920 -3295 -3281
2956 -3281 -3898 -3452 -3252 -3286 -3798 -2966 -2982 -3321 -3860 -3575 -3162 -3337 -3473 -3194 -2579 -2734 -3438 -3330 -3222 -2977
$$ packed form
2807C916o03j77Q64J70o83l98M22M05l48k93K55P6o5J5L22k63L50j99N4m37m8
2828C335j78M02l02q9M94l51J7j27K57l43J16j79q1o8j96Q6r3L0K18k90m6j30
2850B482j2k44j99O1j48K76j97j77J25L12r7ql53l39nk0l67j0J70K25j78l79m3
2873H75L18M11k29p86l55J72O0k6l01M84qj12m44j02J08L17J26p07m82L73J07
2894b01j86l64P4M40j43n36m74N03J34m39l21N77l58k47j00J57M31j57m21l55
2914a986j0J93j23o6K03k64J76k03Q7n52j59K83j19k13k8j21K40K18k63J13Q3
2935b511k45n60j12j13O98p13M9K25j23J51l08P32O9m81n21K77l7J50n47O25J4
2956c281o17M46K00l4n12Q32j6l39n39K85M13j75j36K79O15j55p04J08J08K45
$$ plain form
2976 -2977 -3371 -3406 -2949 -2857 -2583 -2472 -2251 -2194 -2345 -2119 -2432 -2570 -2385 -2169 -2266 -1848 -1993 -1405 -1271 -1348 -1552
2997 -1552 -1350 -1236 -1417 -1434 -1181 -699 -564 -595 -669 -304 -40 -28 -164 -423 -150 -273 -294 -35 208 620 724
3018 724 767 827 922 1118 1212 1138 996 1169 1768 1335 1022 1583 2300 2005 1662 1930 2029 2383 2396 2069 2648 2608 2804
3041 2804 2469 2593 2916 2999 2850 2740 2553 2520 2745 2626 3132 2635 3078 3581 3291 3015 3131 3438 3506 3309 3142
3062 3142 3160 3075 3053 2916 3286 3151 3597 3074 2876 3416 3382 3335 2902 3329 3098 3208 3334 3075 3215 3141 3322 3076
3084 3076 2540 2721 2690 2418 2391 2485 2742 2907 2782 2524 2577 3061 2195 2259 2026 2289 2092 1626 1876 2181 2117 1798
3106 1798 1654 1444 1659 1732 1455 1503 1313 1588 1656 1357 1105 1204 1199 1022 730 579 852 601 404 270 331 853
3128 853 612 577 706 598 547 95 -105 -344 126 -91 -364 199 -166 -170 -177 -340 -550 -564 -533 -856 -823 -1086 -582
$$ packed form
2976b977l94l5M57R2K74J11K21N7j51K26l13j38J85K16r7M18j45N88J34p7k04
2997a552K02J14j81j7K53M82J35l1p4L65K64J2j36k59K73j23k1K59K43M12J04
3018G24M3O0R5J96R4p4j42J73N99m33l13N61P17k95l43K68R9L54J3l27N79m0J96
3041B804l35J24L23Q3j49j10j87l3K25j19N06m97M43N03k90k76J16L07O8j97j67
3062C142J8q5k2j37L70j35M46n23j98N40l4m7m33M27k31J10J26k59J40p4J81k46
3084C076n36J81l1k72k7R4K57J65j25k58N3M84q66O4k33K63j97m66K50L05o4l19
3106A798j44k10K15P3k77M8j90K75O8k99k52R9nj77k92j51K73k51j97j34O1N22
3128H53k41l5J29j08n1m52k00k39M70k17k73N63l65mpj63k10j4L1l23L3k63N04
$$ plain form
3151 -582 -575 -737 -827 -757 -702 -1507 -1556 -1404 -1219 -1235 -1360 -1583 -1188 -1487 -1670 -1547 -1648 -1738 -1618 -1675 -2302 -2125 -2085
3174 -2085 -2256 -2142 -2015 -2153 -1757 -2075 -2112 -2277 -2287 -2326 -2523 -2428 -2527 -2420 -2394 -2103 -2411 -2606 -2631 -2682 -2875 -2873 -2626
3197 -2626 -2426 -2407 -2911 -2624 -2558 -2425 -3039 -2880 -2623 -2670 -2909 -2788 -2826 -2819 -2458 -2759 -2516 -2888 -2515 -2545 -2841 -2772
3219 -2772 -2633 -2607 -2750 -2924 -2806 -2150 -2341 -2784 -2791 -2355 -2637 -2519 -2313 -2362 -2159 -2072 -2291 -2346 -2195 -1786 -1539 -1975
3241 -1975 -1673 -1685 -1665 -1508 -1596 -1433 -1041 -1134 -1021 -1022 -1004 -588 -671 -565 -835 -718 -557 -606 -499 -281 -80 -191 106
3264 106 176 463 190 158 6 273 411 225 618 690 1110 1066 1254 1291 648 1009 1281 1061 1036 1488 1540 1893
3286 1893 1585 2145 2147 2124 1984 1811 1668 2189 2053 2002 2292 2431 2467 2326 2125 2362 2810 2786 2529 2263 2541 2853
3308 2853 2520 2762 2755 3304 3288 2928 2554 2816 2865 2796 2448 2801 2715 2973 3096 3055 3135 3154 3150 2630 2238 2673 2521
$$ packed form
3151e82Pj62r0P0N5q05m9J52J85j6j25k23L95k99j83J23j01r0J20n7o27J77M0
3174b085j71J14J27j38L96l18l7j65j0l9j97R5r9J07K6K91l08j95k5n1j93KK47
3197b626K00J9n04K87O6J33o14J59K57m7k39J21l8PL61l01K43l72L73l0k96O9
3219b772J39K6j43j74J18O56j91m43pM36k82J18K06m9K03Q7k19n5J51M09K47m36
3241a975L02j2K0J57q8J63L92r3J13jJ8M16q3J06k70J17J61m9J07K18K01j11K97
3264A06P0K87k73l2j52K67J38j86L93P2M20m4J88L7o43L61K72k20k5M52N2L53
3286A893l08N60Kk3j40j73j43N21j36n1K90J39L6j41k01K37M48k4k57k66K78L12
3308B853l33K42pN49j6l60l74K62M9o9l48L53q6K58J23m1Q0J9mn20l92M35j52
$$ plain form
3331 2521 2339 2392 2451 2783 2604 2513 2307 2346 2307 2169 2032 2253 2178 2112 2206 2006 2246 2523 2124 1663 1569 2200 1752
3354 1752 1438 1335 1629 1419 1524 1479 1672 1545 1337 1343 1157 1193 876 367 709 543 672 718 708 344 403 421
3376 421 403 532 236 -76 365 256 179 112 116 464 190 -348 -377 -467 -550 -526 -801 -368 -490 -612 -232 -884 -684
3399 -684 -360 -386 -1118 -1174 -1151 -1014 -775 -1214 -1448 -899 -723 -1029 -1296 -1248 -1094 -1009 -1412 -1281 -1306 -1330 -1390 -1565 -1300
3422 -1300 -1474 -1632 -1779 -1709 -1991 -1744 -1732 -2119 -1773 -2077 -1542 -1691 -1875 -1997 -1936 -2146 -2471 -2374 -2021 -1882 -2444
3443 -2444 -2497 -1863 -1958 -2063 -2196 -2315 -2119 -2428 -2607 -2573 -1983 -2248 -2005 -2246 -2377 -2359 -1946 -2307 -2522 -2288 -2282 -2602
3465 -2602 -2581 -2480 -2052 -1912 -2108 -2173 -2268 -2066 -1982 -2062 -2375 -2095 -1655 -1676 -1767 -2077 -1513 -1671 -1571 -1760 -1804 -1436
3487 -1436 -1812 -1830 -1400 -1340 -1362 -1174 -1218 -1195 -1090 -1070 -1007 -790 -1534 -931 -760 -701 -805 -640 -416 -381 -369 -510 -324
$$ packed form
3331B521j82N3N9L32j79r1k06L9l9j38j37K21p5o6R4k00K40K77l99m61r4O31m48
3354A752l14j03K94k10J05m5J93j27k08Oj86L6l17n09L42j66J29M6j0l64N9J8
3376D21j8J29k96l12M41j09p7o7ML48k74n38k9r0q3K4k75M33j22j22L80o52K00
3399f84L24k6p32n6K3J37K39m39k34N49J76l06k67M8J54Q5m03J31k5k4o0j75K65
3422a300j74j58j47P0k82K47J2l87L46l04N35j49j84j22O1k10l25R7L53J39n62
3443b444n3O34r5j05j33j19J96l09j79L4N90k65K43k41j31J8M13l61k15K34Ol20
3465b602K1J01M28J40j96o5r5K02Q4q0l13K80M40k1r1l10N64j58J00j89m4L68
3487a436l76j8M30O0k2J88m4K3J05K0O3K17p44O03J71N9j04J65K24L5J2j41J86
$$ plain form
3510 -324 -309 -427 -423 -232 60 -96 51 377 128 211 491 485 401 399 288 570 635 772 1032 929 883 1125 1135 1310
3534 1310 1532 899 1217 1717 1687 1190 1389 1728 2211 1973 1655 1710 2130 2204 2188 1949 2065 2025 1834 1940 1999 2636
3556 2636 2227 2422 2391 2147 2397 2702 2342 2100 2587 2342 2688 2354 2255 2523 2601 2450 2347 2493 2674 2474 2424
3577 2424 2057 2494 2707 2485 2267 2298 2229 2066 2162 2262 2077 1989 1935 2176 2173 2047 2095 2076 1913 1775 1834 1623 1686
3600 1686 1717 1317 1427 1765 1449 1609 1587 1182 844 1018 1176 885 935 888 937 770 824 783 695 545 354 610
3622 610 572 389 209 398 478 -78 43 488 -86 128 -10 -225 76 -338 -38 -276 -173 -293 -380 -404 -278
3643 -278 -812 -440 -575 -601 -799 -552 -458 -876 -693 -966 -778 -861 -616 -1188 -1367 -1160 -1016 -1149 -1382 -908 -1266
3664 -1266 -1571 -1193 -1003 -1044 -1239 -1457 -1323 -1411 -1652 -1655 -1277 -1381 -1458 -1623 -1602 -1818 -1805 -1619 -1750 -1717 -1308 -1166
$$ packed form
3510c24J5j18MJ91K92j56J47L26k49Q3K80oq4kj11K82O5J37K60j03m6K42J0J75
3534A310K22o33L18N00l0m97J99L39M83k38l18N5M20P4j6k39J16m0j91J06N9O37
3556B636m09J95l1k44K50L05l60k42M87k45L46l34r9K68P8j51j03J46J81k00n0
3577B424l67M37K13k22k18L1o9j63R6J00j85q8n4K41lj26M8j9j63j38N9k11O3
3600A686L1m00J10L38l16J60k2m05l38J74J58k91N0m7M9j67N4m1q8j50j91K56
3622F10l8j83j80J89Q0n56J21M45n74K14j38k15L01m14L00k38J03j20q7k4J26
3643b78n34L72j35k6j98K47R4m18J83k73J88q3K45n72j79K07J44j33k33M74l58
3664a266l05L78J90m1j95k18J34q8k41lL78j04p7j65K1k16J3J86j31L3M09J42
$$ plain form
3686 -1166 -1783 -2041 -1751 -1518 -1844 -1703 -2058 -1618 -1690 -2096 -2370 -1991 -1572 -1511 -1908 -1667 -1765 -1651 -1874 -1916 -1619
3707 -1619 -1747 -1596 -1881 -2007 -1864 -1697 -1980 -1629 -1438 -1767 -1747 -1372 -1569 -1684 -1720 -1603 -1673 -1456 -1503 -1386 -1292
3728 -1292 -1504 -1482 -1396 -1275 -1710 -1730 -1273 -936 -1474 -1373 -1087 -896 -1603 -1041 -803 -916 -1217 -1056 -1088 -614 -707
3749 -707 -884 -822 -617 -1064 -650 -509 -620 -614 -206 -434 -680 -115 -212 -164 -134 -89 -86 -27 102 154 185 93 239 219 383
3774 383 419 327 718 677 738 510 598 920 729 1119 885 1076 845 1148 1236 1237 1533 1716 1107 1481 1452 1570 1590
3797 1590 1394 1415 1717 1564 1595 1639 1735 2036 1858 1639 1779 1900 2003 2176 1897 1820 2174 2263 1904 1790 1978 2046
3819 2046 2139 1889 2145 2170 2281 2159 1904 2008 2107 1987 1730 2137 2126 2337 2057 2000 2051 1935 1616 1866 1727 1716
3841 1716 1806 1919 1574 1589 1679 1376 1509 1467 1311 1644 1354 1282 1458 887 1210 1240 1006 1243 1217 1258 1123 1149 799
$$ packed form
3686a166o17k58K90K33l26J41l55M40p2m06k74L79M19O1l97K41r8J14k23m2K97
3707a619j28J51k85j26J43J67k83L51J91l29K0L75j97j15l6J17p0K17m7J17R4
3728a292k12K2Q6J21m35k0M57L37n38J01K86J91p07N62K38j13l01J61l2M74r3
3749g07j77O2K05m47M14J41j11OM08k28k46N65r7M8L0M5LN9J29N2L1r2J46k0J64
3774C83L6r2L91m1O1k28Q8L22j91L90k34J91k31L03Q8JK96J83o09L74k9J18K0
3797A590j96K1L02j53L1M4R6L01j78k19J40J21J03J73k79p7L54Q9l59j14J88O8
3819B046R3k50K56K5J11j22k55J04R9j20k57M07j1K11k80n7N1j16l19K50j39j1
3841A716R0J13l45J5R0l03J33m2j56L33k90p2J76n71L23L0k34K37k6M1j35K6l50
$$ plain form
3864 799 785 642 527 664 619 508 620 627 279 373 278 408 -11 166 217 151 -354 -112 260 14 -155 -499 -392
3887 -392 -15 -274 -296 -108 -579 -437 -310 -750 -752 -664 -868 -820 -805 -835 -684 -715 -1050 -1192 -898 -625 -1238 -957 -1012
3910 -1012 -977 -1102 -1439 -1269 -1237 -972 -1130 -1405 -1249 -1421 -1084 -1075 -1495 -1474 -1237 -1493 -1610 -1629 -1345 -1348 -1355 -1398 -1375 -1520
3934 -1520 -1479 -1667 -1591 -1507 -1324 -1662 -1544 -1320 -1463 -1326 -1539 -1457 -1165 -1515 -1815 -1788 -1545 -1115 -1364 -1508 -1578 -1663
3956 -1663 -1394 -1402 -1392 -1323 -1302 -1305 -1204 -1500 -1432 -1413 -1070 -1088 -1485 -1478 -923 -1124 -1283 -1301 -1143 -1293 -1437 -1146 -1220 -1129 -1209
3981 -1209 -1006 -1003 -898 -961 -1030 -1205 -999 -1061 -718 -792 -1223 -526 -987 -1085 -797 -669 -848 -612 -294 -525 -607 -406
4003 -406 -411 -395 -425 -402 -110 -291 -293 -245 -6 -67 261 -94 68 190 188 177 410 134 187 560 310 416 166 397
4027 397 653 350 890 889 720 690 500 1077 905 823 741 1010 967 1112 1294 828 1084 1037 1402 1031 1103 1551 1333
$$ packed form
3864G99j4j43j15J37m5j11J12Pl48R4r5J30m19J77N1o6n05K42L72k46j69l44J07
3887c92L77k59k2J88m71J42J27m40kQ8k04M8J5l0J51l1l35j42K94K73o13K81n5
3910a012L5j25l37J70L2K65j58k75J56j72L37Rm20K1K37k56j17j9K84lpm3K3j45
3934a520M1j88P6Q4J83l38J18K24j43J37k13Q2K92l50l00K7K43M30k49j44p0q5
3956a663K69qJ0O9K1lJ01k96O8J9L43j8l97PN55k01j59j8J58j50j44K91p4R1q0
3981a209K03LJ05o3o9j75K06o2L43p4m31O97m61r8K88J28j79K36L18k31q2K01
4003d06nJ6l0K3K92j81kM8K39o1L28l55J62J22kj1K33k76N3L73k50J06k50K31
4027C97K56l03N40jj69l0j90N77j72q2q2K69m3J45J82m66K56m7L65l71P2M48k18
$$ plain form
4050 1333 1519 1162 1406 1400 1318 1269 1639 1862 1423 1550 1442 1833 1550 1620 1498 1409 1662 1475 1944 1622 1685 1582
4072 1582 1939 1615 1810 1734 1866 1671 1790 1875 1703 1645 1523 1465 1696 1613 1601 1618 1563 1697 1876 1796 1501 1228 1632
4095 1632 1749 1416 1421 1648 1246 1426 1085 879 935 839 1444 1090 695 726 1126 403 750 715 974 555 498 835
4117 835 775 248 549 585 149 197 319 404 391 215 262 295 306 -395 23 15 -25 -568 75 -301 -80 -486 -326 8
4141 8 -391 -337 -458 -462 -670 -556 -595 -752 -731 -670 -852 -890 -796 -846 -850 -895 -1061 -801 -992 -710 -629 -889 -1002 -1157 -1126
4166 -1126 -1339 -1306 -1071 -699 -922 -1179 -1572 -957 -1001 -1087 -1277 -1060 -959 -1050 -1486 -1110 -1183 -1482 -1144 -1095 -1370 -1185
4188 -1185 -1236 -1162 -1429 -1621 -1291 -1279 -957 -1247 -1013 -1015 -1532 -1375 -1113 -1197 -1331 -1245 -1141 -1125 -1215 -1307 -937 -912 -1154
4211 -1154 -1199 -1041 -992 -932 -1171 -1225 -968 -1004 -838 -794 -774 -1142 -698 -825 -928 -834 -838 -1030 -892 -931 -1119 -690 -819
$$ packed form
4050A333J86l57K44oq2m9L70K23m39J27j08L91k83P0j22q9K53j87M69l22O3j03
4072A582L57l24J95p6J32j95J19Q5j72n8j22n8K31q3j2J7n5J34J79q0k95k73M04
4095A632J17l33NK27m02J80l41k06N6r6O05l54l95L1M00p23L47l5K59m19n7L37
4117H35o0n27L01L6m36M8J22Q5j3j76M7L3J1p01M18qm0n43O43l76K21m06J60L34
4141Hl99N4j21mk08J14l9j57K1O1j82l8R4n0mm5j66K60j91K82Q1k60j13j55L1
4166a126k13L3K35L72k23k57l93O15m4q6j90K17J01r1m36L76p3k99L38M9k75J85
4188a185n1P4k67j92L30J2L22k90K34kn17J57K62q4j34Q6J04J6r0r2L70K5k42
4211a154m5J58M9O0k39n4K57l6J66M4K0l68M44j27j03R4mj92J38l9j88M29j29
$$ plain form
4234 -819 -597 -939 -915 -672 -555 -827 -800 -350 -613 -537 -297 -326 -317 -601 -474 -428 -478 -392 -243 -483 -220 -116 -338
4257 -338 -274 -440 -537 130 -12 26 -446 117 106 120 97 151 155 372 151 347 483 221 529 415 726 347 344 217
4281 217 659 374 635 964 610 712 1064 764 909 697 911 1155 856 1016 892 866 1254 962 939 1188 1141
4302 1141 1271 1226 1291 1189 1282 1656 1144 1292 1178 1192 859 1141 1613 1700 1272 1445 1427 1444 1591 1314 1436 1513
4324 1513 1326 1498 1411 1280 1395 1644 1753 1274 1042 1447 1408 1155 1413 1307 1231 1290 1281 1349 987 1371 1359 1536
4346 1536 1275 1028 1348 1126 1293 698 1343 972 918 790 879 896 678 543 553 823 619 728 600 824 1029
4367 1029 621 450 464 243 659 248 -76 450 340 44 231 59 343 11 -234 -58 -16 -293 243 -329
4387 -329 -383 -330 -165 -68 -437 -650 -320 -245 -585 -384 -468 -276 -614 -557 -1016 -702 -715 -731 -675 -713 -821 -749 -970 -1029
$$ packed form
4234h19K22l42K4K43J17k72K7M50k63P6K40k9Rk84J27M6n0Q6J49k40K63J04k22
4257c38O4j66r7O67j42L8m72N63j1J4k3N4MK17k21J96J36k62L08j14L11l79lj27
4281B17M42k85K61L29l54J02L52l00J45k12K14K44k99J60j24k6L88k92k3K49m7
4302A141J30m5O5j02R3L74n12J48j14J4l33K82M72Q7m28J73j8J7J47k77J22P7
4324A513j87J72q7j31J15K49J09m79k32M05l9k53K58j06p6N9rO8l62L84j2J77
4346A536k61k47L20k22J67n95O45l71n4j28Q9J7k18j35J0K70k04J09j28K24K05
4367A029m08j71J4k21M16m11l24N26j10k96J87j72K84l32k45J76M2k77N36n72
4387c29n4N3J65R7l69k13L30P5l40K01q4J92l38N7m59L14j3j6N6l8j08P2k21n9
$$ plain form
4411 -1029 -1168 -879 -867 -1039 -1182 -1053 -997 -1197 -1059 -919 -1022 -1020 -1289 -1170 -1154 -895 -1079 -1053 -1131 -1091 -1193 -1245 -1166
4434 -1166 -926 -893 -1186 -1169 -1201 -1074 -1131 -974 -1126 -1042 -993 -1278 -1082 -1227 -1180 -1021 -952 -1024 -1238 -1012 -910 -761 -1107
4457 -1107 -1029 -938 -831 -859 -1188 -901 -1339 -1063 -1081 -1014 -1133 -1090 -852 -614 -828 -646 -510 -566 -777 -727 -558 -630 -1126
4480 -1126 -598 -636 -536 -545 -426 -531 -646 -674 -396 -351 -262 -454 -614 -283 -627 -236 -464 -478 -426 -282 -45 -346
4502 -346 -290 -183 -19 -145 -116 30 -100 192 193 139 -64 -157 151 -138 -12 -202 324 347 -132 252 584 267
4524 267 106 259 525 590 331 517 247 719 500 561 637 402 409 588 751 674 733 939 777 563 1023 1159
4546 1159 758 746 916 1087 884 877 830 1128 729 602 1193 744 1252 1097 1330 992 1100 1017 1027 875 861 1141
4568 1141 1198 1118 936 842 1084 1288 1102 1087 945 1310 1059 1188 1277 1181 1191 1196 1027 937 946 1210 1018 1036 1059 703
$$ packed form
4411a029j39K89J2j72j43J29N6k00J38J40j03Kk69J19J6K59j84K6p8M0j02n2P9
4434a166K40L3k93J7l2J27n7J57j52Q4M9k85J96j45M7J59O9p2k14K26J02J49l46
4457a107P8R1J07k8l29K87m38K76j8O7j19M3K38K38k14J82J36n6k11N0J69p2m96
4480a126N28l8J00rJ19j05j15k8K78M5Q9j92j60L31l44L91k28j4N2J44K37l01
4502c46N6J07J64j26K9J46j30K92Jn4k03r3L08k89J26j90N26K3m79L84L32l17
4524B67j61J53K66O5k59J86k70M72k19O1P6k35PJ79J63p7N9K06j62k14M60J36
4546A159m01j2J70J71k03pm7K98l99j27N91m49N08j55K33l38J08q3J0j52j4K80
4568A141N7q0j82r4K42K04j86j5j42L65k51J29Q9r6J0Nj69r0RK64j92J8K3l56
$$ plain form
4592 703 1002 1075 974 1009 943 854 913 684 877 822 1054 968 783 732 773 403 605 826 506 534 523 736 614 450
4616 450 417 601 336 288 265 397 445 253 186 218 51 222 147 -61 52 181 -54 47 -152 -99 -12 -129 -284
4639 -284 -276 -288 -336 -260 -310 -517 -433 -628 -619 -499 -585 -411 -424 -510 -661 -769 -449 -764 -717 -503 -785 -653 -993 -821
4663 -821 -684 -741 -475 -804 -809 -924 -871 -593 -1085 -1018 -1103 -823 -812 -1087 -893 -853 -1041 -1334 -992 -946 -967 -757 -1072
4686 -1072 -1082 -1307 -1196 -921 -801 -754 -1036 -1184 -1174 -981 -1087 -907 -914 -1066 -696 -1155 -1022 -960 -1079 -897 -942 -536
4708 -536 -901 -993 -832 -716 -744 -820 -590 -579 -609 -653 -577 -586 -581 -450 -636 -674 -319 -294 -494 -467 -470 -158 -671 -385 -434 -309
4734 -309 -249 -419 -464 -491 -120 -242 -248 -236 -224 92 -79 -121 -255 -369 -175 13 -224 -246 105 -65 -143 -112 76 231
4758 231 -80 4 175 470 50 57 402 4 394 411 142 10 5 442 386 224 311 376 543 378 171 473 720
$$ packed form
4592G03K99P3j01L5o6q9N9k29J93n5K32q6j85n1M1l70K02K21l20K8j1K13j22j64
4616D50l3J84k65m8k3J32M8j92o7L2j67J71p5k08J13J29k35J01j99N3Q7j17j55
4639b84Qj2m8P6n0k07Q4j95RJ20q6J74j3q6j51j08L20l15M7K14k82J32l40J72
4663h21J37n7K66l29nj15N3K78m92O7q5K80J1k75J94M0j88k93L42M6k1K10l15
4686a072j0k25J11K75J20M7k82j48J0J93j06J80pj52L70m59J33O2j19J82m5M06
4708e36l65r2J61J16k8p6K30J1l0m4P6rNJ31j86l8L55K5k00K7lL12n13K86m9J25
4734c09O0j70m5k7L71j22oJ2J2L16j71m2j34j14J94J88k37k2L51j70p8L1J88J55
4758B31l11Q4J71K95m20PL45l98L90J7k69j32nM37n6j62Q7O5J67j65k07L02K47
$$ plain form
4781 720 538 325 402 685 424 518 593 552 242 703 472 630 216 762 504 667 705 696 810 675 633 826 733
4804 733 578 825 691 559 1121 808 857 906 609 986 399 846 662 848 957 973 878 764 995 828 905 844
4826 844 817 684 921 782 666 1045 1048 982 1102 824 1196 725 624 703 720 759 788 733 807 593 455 1089 700
4849 700 650 798 665 751 700 607 678 626 589 763 519 687 53 317 600 264 382 -61 293 476 394 103 -18
4872 -18 323 382 248 175 213 -89 76 64 -119 343 203 104 -31 20 -227 -78 -240 -252 -183 -115 -253 -394 -325 -421
4896 -421 -73 -363 -442 -721 -428 -521 -450 -563 -520 -424 -692 -419 -389 -607 -659 -694 -941 -812 -814 -811 -582 -1012 -760 -609
4920 -609 -671 -754 -958 -951 -662 -1018 -913 -919 -979 -973 -1037 -974 -725 -856 -756 -882 -1001 -747 -1110 -924 -836 -893 -890 -789 -623
4945 -623 -845 -453 -754 -810 -905 -702 -822 -1004 -1032 -841 -710 -737 -752 -534 -808 -400 -682 -879 -861 -544 -600 -525 -600
$$ packed form
4781G20j82k13P7K83k61R4P5m1l10M61k31J58m14N46k58J63L8rJ14j35m2J93r3
4804G33j55K47j34j32N62l13M9M9k97L77n87M47j84J86J09J6r5j14K31j67P7o1
4826H44k7j33K37j39j16L79Lo6J20k78L72m71j01P9J7L9K9n5P4k14j38O34l89
4849G00n0J48j33Q6n1r3P1n2l7J74k44J68o34K64K83l36J18m43L54J83q2k91j21
4872a8L41N9j34p3L8l02J65j2j83M62j40r9j35N1k47J49j62j2O9O8j38j41O9r6
4896d21L48k90p9k79K93r3P1j13M3R6k68K73L0k18n2l5k47J29kLK29m30K52J51
4920f09o2q3k04PK89l56J05oo0Oo4O3K49j31J00j26j19K54l63J86Q8n7LJ01J66
4945f23k22L92l01n6r5K03j20j82k8J91J31k7j5K18k74M08k82j97J8L17n6P5p5
$$ plain form
4968 -600 -878 -448 -683 -696 -216 -318 -514 -121 -353 -660 -283 -416 -416 -355 -439 -374 -625 -254 -258 -200 -280 -132 -84 -167
4992 -167 143 -118 -228 -225 -24 -28 1 -303 -344 212 75 -198 14 171 279 110 -31 -62 -80 425 152 67 98
5015 98 466 -204 470 94 -30 452 89 107 214 161 41 478 292 397 485 216 409 503 474 621 699 594
5037 594 471 166 252 544 311 359 499 476 450 620 344 699 749 540 682 550 274 302 679 767 712 674 573
$$ packed form
4968f00k78M30k35j3M80j02j96L93k32l07L77j33%O1q4O5k51L71mN8q0J48M8q3
4992a67L10k61j10LK01mK9l04m1N56j37k73K12J57J08j69j41l1j8N05k73q5L1
5015I8L68o70O74l76j24M82l63J8J07n3j20M37j86J05Q8k69J93R4k9J47P8j05
5037E94j23l05Q6K92k33M8J40k3k6J70k76L55N0k09J42j32k76K8L77Q8n5l8j01
$$ [...]
8191a49
##END NTUPLES=NMR FID
##END=
