##TITLE=1H_Costus-Summ1-f24-f11
 CDCl3, 8 sc, 
 7.8.2020
##JCAMPDX= 6.0         $$ Bruker NMR JCAMP-DX V2.0
##DATA TYPE= NMR FID
##DATA CLASS= NTUPLES
##ORIGIN= UXNMR, Bruker Analytische Messtechnik GmbH
##OWNER= root
$$ XWIN-NMR		Version 3.5
$$ Fri Aug  7 10:45:06 2020 Russian Standard Time (UT+4h)  she@DPX200
##.OBSERVE FREQUENCY= 200.1314999998
##.OBSERVE NUCLEUS= ^1H
##.DELAY= (6, 6)
##.ACQUISITION MODE= SIMULTANEOUS
##.ACQUISITION SCHEME= undefined
##.AVERAGES= 8
##.DIGITISER RES= 18
##SPECTROMETER/DATA SYSTEM= spect
##.PULSE SEQUENCE= zg30
##.SOLVENT NAME= D2O
##.SHIFT REFERENCE= (INTERNAL, D2O, 0, 15.7039)
##AUDIT TRAIL= $$ (NUMBER, WHEN, WHO, WHERE, WHAT)
$$ ##TITLE= Audit trail, XWIN-NMR		Version 3.5
$$ ##JCAMPDX= 5.01
$$ ##ORIGIN= Bruker BioSpin GmbH
$$ ##OWNER= she
$$ F:/spectra/data/she/nmr/H-F/1/audita.txt
$$ ##AUDIT TRAIL=  $$ (NUMBER, WHEN, WHO, WHERE, WHAT)
(   1,<2020-08-07 10:44:08.60 +0400>,<she>,<DPX200>,
      <created by zg, POWCHK disabled, PULCHK disabled
       configuration hash MD5:
       00 E9 B6 7A A2 85 ED C7 34 08 36 98 17 FE 4E 26
       data hash MD5: 16K
       AE 91 13 D8 6F 15 C8 39 3C 5F 03 AC FE 6C 3B FF>)
$$ ##END=
$$ 
$$ hash MD5
$$ C3 FB A0 34 F7 8C 6C 8E 38 F0 2E D8 85 07 E6 90
##$RELAX= 
##$RELAX= 
##$RELAX= 
##$RELAX= 
##$RELAX= 
##$RELAX= 
$$ Bruker specific parameters
$$ --------------------------
##$DU= <F:/spectra>
##$EXPNO= 1
##$NAME= <H-F>
##$PROCNO= 1
##$TYPE= <nmr>
##$USER= <she>
##$AMP= (0..31)
100 100 100 100 100 100 100 100 100 100 100 100 100 100 100 100 100 100 
100 100 100 100 100 100 100 100 100 100 100 100 100 100 
##$AQSEQ= 0
##$AQ_mod= 1
##$AUNM= <au_zg>
##$AUTOPOS= <>
##$BF1= 200.13
##$BF2= 200.13
##$BF3= 200.13
##$BF4= 200.13
##$BF5= 200.13
##$BF6= 200.13
##$BF7= 200.13
##$BF8= 200.13
##$BYTORDA= 1
##$CFDGTYP= 0
##$CFRGTYP= 5
##$CHEMSTR= <none>
##$CNST= (0..31)
1 1 145 1 1 1 1 1 1 1 1 1 1 1 1 1 1 1 1 1 1 1 1 1 1 1 1 1 1 1 1 1 
##$CPDPRG= <>
##$CPDPRG1= <>
##$CPDPRG2= <>
##$CPDPRG3= <>
##$CPDPRG4= <mlev>
##$CPDPRG5= <mlev>
##$CPDPRG6= <mlev>
##$CPDPRG7= <mlev>
##$CPDPRG8= <mlev>
##$CPDPRGB= <>
##$CPDPRGT= <>
##$D= (0..31)
0 1.2 0 0 0 0 0 0 0 0.06 0 0.03 0 0 0 0 0.0002 0 0 0 0 0 0 0 0 0 0 0 0 
0 0 0 
##$DATE= 1596782648
##$DBL= (0..7)
120 120 120 120 120 120 120 120 
##$DBP= (0..7)
150 150 150 150 150 150 150 150 
##$DBP07= 0
##$DBPNAM0= <>
##$DBPNAM1= <>
##$DBPNAM2= <>
##$DBPNAM3= <>
##$DBPNAM4= <>
##$DBPNAM5= <>
##$DBPNAM6= <>
##$DBPNAM7= <>
##$DBPOAL= (0..7)
0.5 0.5 0.5 0.5 0.5 0.5 0.5 0.5 
##$DBPOFFS= (0..7)
0 0 0 0 0 0 0 0 
##$DE= 6
##$DECBNUC= <off>
##$DECIM= 24
##$DECNUC= <off>
##$DECSTAT= 4
##$DIGMOD= 1
##$DIGTYP= 9
##$DL= (0..7)
0 120 120 120 120 120 120 120 
##$DP= (0..7)
150 150 150 150 150 150 150 150 
##$DP07= 0
##$DPNAME0= <>
##$DPNAME1= <>
##$DPNAME2= <>
##$DPNAME3= <>
##$DPNAME4= <>
##$DPNAME5= <>
##$DPNAME6= <>
##$DPNAME7= <>
##$DPOAL= (0..7)
0.5 0.5 0.5 0.5 0.5 0.5 0.5 0.5 
##$DPOFFS= (0..7)
0 0 0 0 0 0 0 0 
##$DQDMODE= 0
##$DR= 18
##$DS= 0
$$ [...]
##$SUBNAM2= <"">
##$SUBNAM3= <"">
##$SUBNAM4= <"">
##$SUBNAM5= <"">
##$SUBNAM6= <"">
##$SUBNAM7= <"">
##$SUBNAM8= <"">
##$SUBNAM9= <"">
##$SW= 24.9337058888022
##$SWIBOX= (0..15)
0 0 2 0 0 0 0 0 0 0 0 0 0 0 0 0 
##$SW_h= 4990.01996007984
##$TD= 16384
##$TD0= 1
##$TE= 0
##$TE2= 300
##$TE3= 300
##$TEG= 300
##$TL= (0..7)
0 120 120 120 120 120 120 120 
##$TP= (0..7)
150 150 150 150 150 150 150 150 
##$TP07= 0
##$TPNAME0= <>
##$TPNAME1= <>
##$TPNAME2= <>
##$TPNAME3= <>
##$TPNAME4= <>
##$TPNAME5= <>
##$TPNAME6= <>
##$TPNAME7= <>
##$TPOAL= (0..7)
0.5 0.5 0.5 0.5 0.5 0.5 0.5 0.5 
##$TPOFFS= (0..7)
0 0 0 0 0 0 0 0 
##$TUNHIN= 0
##$TUNHOUT= 0
##$TUNXOUT= 0
##$USERA1= <user>
##$USERA2= <user>
##$USERA3= <user>
##$USERA4= <user>
##$USERA5= <user>
##$V9= 5
##$VALIST= <valist>
##$VCLIST= <CCCCCCCCCCCCCCC>
##$VD= 0
##$VDLIST= <DDDDDDDDDDDDDDD>
##$VPLIST= <PPPPPPPPPPPPPPP>
##$VTLIST= <TTTTTTTTTTTTTTT>
##$WBST= 1024
##$WBSW= 4
##$XGAIN= (0..3)
0 0 0 0 
##$XL= 0
##$YL= 0
##$YMAX_a= 364581
##$YMIN_a= -254017
##$ZGOPTNS= <>
##$ZL1= 120
##$ZL2= 120
##$ZL3= 120
##$ZL4= 120
##$ABSF1= 10
##$ABSF2= 0
##$ABSG= 5
##$ABSL= 3
##$ALPHA= 0
##$AQORDER= 0
##$ASSFAC= 0
##$ASSFACI= 0
##$ASSFACX= 0
##$ASSWID= 0
##$AUNMP= <proc_1d>
##$AZFE= 0.1
##$AZFW= 0.1
##$BCFW= 1
##$BC_mod= 2
##$BYTORDP= 1
##$COROFFS= 0
##$CY= 11.3945322036743
##$DATMOD= 1
##$DC= 2
##$DFILT= <>
##$DTYPP= 0
##$F1P= 16.9975609425685
##$F2P= -3.02152046262296
##$FCOR= 0.5
##$FTSIZE= 0
##$FT_mod= 4
##$GAMMA= 1
##$GB= 0.15
##$INTBC= 1
##$INTSCL= 1
##$ISEN= 128
##$LB= 0.24
##$LEV0= 0
##$LPBIN= 0
##$MAXI= 10000
##$MC2= 0
##$MEAN= 0
##$ME_mod= 0
##$MI= 1.114404
##$NCOEF= 0
##$NC_proc= 0
##$NLEV= 6
##$NOISF1= 3.799351
##$NOISF2= 2.8
##$NSP= 1
##$NTH_PI= 0
##$NZP= 0
##$OFFSET= 15.70392
##$PC= 1
##$PHC0= -9803.671
##$PHC1= 24.60092
##$PH_mod= 1
##$PKNL= yes
##$PPARMOD= 0
##$PSCAL= 0
##$PSIGN= 0
##$REVERSE= no
##$SF= 200.130013532006
##$SI= 16384
##$SIGF1= 3
##$SIGF2= 2
##$SINO= 400
##$SIOLD= 16384
##$SREGLST= <1H.CDCl3>
##$SSB= 0
##$STSI= 0
##$STSR= 0
##$SW_p= 3612.71676300578
##$SYMM= 0
##$S_DEV= 0
##$TDeff= 0
##$TDoff= 0
##$TI= <>
##$TILT= no
##$TM1= 0
##$TM2= 0
##$TOPLEV= 0
##$USERP1= <user>
##$USERP2= <user>
##$USERP3= <user>
##$USERP4= <user>
##$USERP5= <user>
##$WDW= 1
##$XDIM= 8192
##$YMAX_p= 0
##$YMIN_p= 0
$$ End of Bruker specific parameters
$$ ---------------------------------
##NTUPLES= NMR FID
##VAR_NAME=  TIME,          FID/REAL,        FID/IMAG
##SYMBOL=    X,             R,               I
##VAR_TYPE=  INDEPENDENT,   DEPENDENT,       DEPENDENT
##VAR_FORM=  AFFN,          ASDF,            ASDF
##VAR_DIM=   8192,          8192,            8192
##UNITS=     SECONDS,       ARBITRARY UNITS, ARBITRARY UNITS
##FACTOR=    0.0002004,     1,               1
##FIRST=     0,             0,               0
##LAST=      1.6414764,     0,               0
##MIN=       0,             -254017,         0
##MAX=       1.6414764,     364581,          0
$$ Real data points
##PAGE= N=1
##DATA TABLE= (X++(R..R)), XYDATA
0@%%%%%Qq%qJ6j6K0k8M0m8N6p2Q3r3J10j32J56j82K11k44K80l19L64m16M71n29
31b80N98o74P56q44R39j050J171j296J437j596J768j957K166k400K659k947L273
48A723l644M070m564N147n845O695p762R147j1025J3732j7997K5850o2523L42889
62B95893M5402m97584n0201L34355M7231l16170m453K82230O123l02981l4370
73a94525K56765Q5844j54045r445J18948o6769j87574N4672K13043n117k08005
84i6208l3559J68218N5690j10902m49J33003j8957k08159o1398J96907J29347
95A53533j38921j37944R3550J19505o8573p1102J09746P3359j58097j39155J20873
106d3226J45133q9678j03024J21793J04445j48486j24602J58739J50314j47769
$$ plain form
0 0 0 0 0 0 0 8 0 0 -8 8 -8 12 -16 24 -24 32 -40 43 -50 60 -72 84 -98 113 -131 149 -170 194 -222 249 -280
31 -280 318 -356 400 -444 495 -555 616 -680 757 -839 929 -1028 1138 -1262 1397 -1550 1723
48 1723 -1921 2149 -2415 2732 -3113 3582 -4180 4967 -6058 7674 -10323 15527 -46996 295893
62 295893 341295 -156289 -206490 127865 175096 -141074 -145527 136703 142826 -160155 -194525
73 -194525 62240 148084 -5961 -15406 103542 36773 -150801 -96129 116914 111797 -96208
84 -96208 -129767 38451 94141 -16761 -17210 115793 96836 -111323 -172721 24186 153533
95 153533 14612 -123332 -29782 89723 21150 -49952 59794 133153 -24944 -164099 -43226
106 -43226 101907 12229 -90795 30998 135443 -13043 -137645 21094 171408 23639
116B3639j70922J00926J24011j06389p3876J73533J02209j95796j38791J81637
126B0181J49140j74135j63681J49935J55117j45102j54332J48796J90004r6540
136G9383j82072M3697J28847m7803j07110N5049J02097n5387j06197M8892J19466
147G8862p968q9640k423M5377m5416o9517O4171J16661l7036j38475N059J43936
159F3591L0196j24734l5876J13157J9711j47516n5024J55221J09706r9349j07481
170g8398N2559O6696m2731k1759O7192m57j14633l0268J15552O0071p1638k9212
182b7026O4508o082r3919P668J16566J0451j22109m0712R2759M2720n5431J33
194a0474P2201j4352j07091j9119J01829M8250o9716n4126L4492L0877k1919M381
$$ plain form
116 23639 -147283 -46357 77654 -28735 -102611 70922 173131 -22665 -161456 20181
126 20181 169321 -4814 -168495 -18560 136557 -8545 -162877 -14081 175923 79383
136 79383 -102689 -58992 69855 22052 -85058 -30009 72088 16701 -89496 -40604 78862
147 78862 70894 -18746 -21169 24208 -21208 -90725 -26554 90107 53071 -85404 -80345 63591
159 63591 93787 -30947 -66823 46334 66045 -81471 -136495 18726 128432 29083 -78398
170 -78398 -25839 40857 -1874 -23633 43559 43102 -71531 -101799 13753 73824 2186 -27026
182 -27026 37482 31400 -62519 -54851 61715 72166 -49943 -90655 2104 44824 -10607 -10474
194 -10474 61727 47375 -59716 -78835 22994 71244 1528 -52598 -18106 12771 -9148 -4767
206d767N5753R706p7368n7179M4054O9961o703m9649l982K9618m996k0709K7750
219A1489M2387k6460o4876k358M8249L328l0235K1936M4183l2945o6568K8681
231b3189Q6781o962q9764k1577O1735J7838m1898K494N0591l145n3026l151M5375
244B2102L897l6186l845K1544j3035k2416K5508L8785j2742l4888M905K1379j3677
257A331k3472J5166K7294j1459l2351Q32L2893J8033j4825j8521n99O868n963
270d773j1314N894J8051J969j5299m284J3530N252p932K062O882j6501k5401J0925
284b0939L5456M972k6493m897J9226j163j7700Q755K1658j5488l5203M173L5260
297G617P584j8246J136J4882j1107k3586R073K8803j649k8464j0767J5265J1408
$$ plain form
206 -4767 50986 60692 -16676 -73855 -29801 40160 33457 -16192 -20174 9444 4448 -16261 11489
219 11489 53876 27416 -37460 -39818 8431 11759 -18476 3460 47643 14698 -51870 -23189
231 -23189 63592 56630 -33134 -54711 7024 24862 -17036 -14542 36049 32904 -20122 -23273 22102
244 22102 25999 -10187 -14032 7512 -5523 -27939 -2431 36354 23612 -11276 -6371 15008 1331
257 1331 -22141 -6975 20319 8860 -23491 -22659 10234 28267 13442 -5079 -5678 1190 -4773
270 -4773 -16087 -10193 7858 9827 -5472 -9756 3774 9026 1094 3156 10038 -6463 -31864 -20939
284 -20939 14517 19489 -7004 -11901 7325 6162 -11538 -2783 18875 3387 -31816 -27643 7617
297 7617 15201 -3045 -1909 12973 1866 -21720 -12647 16156 14507 -13957 -24724 -9459 1949
310A949J017O379P046j1234k2288l082J9427J4635q430j6969k779J0829P375J855
324E730N478L023j4577j9733M104K3021M864j6468m292J3734L81j2668Q056K3559
338B4212o841l5457q336K8752J3924j6973m257J6296k520k2072N782L0922J66
351B3598l4091j1313K2872Q546j5362J681K2575j312k7135l304K5508O969k3103
364c871r365J6373M125j6825N49K5180O821k4726j3479J8263J3329j5723j3786
377a3135J2809J1375j4011j0169J9001J6443j6073k0652J0617J7185j2368j7500
389a6478J3182J9270j3703k0372J4275K4172j0502k4188Q937J9622j3904k3061
401b2750J5090K8013j1858k8861J0291K8182q613k6526Q218K4690j1628k7846
$$ plain form
310 1949 2966 9345 16391 5157 -17131 -20213 -786 13849 5419 -11550 -14329 -3500 3875 5730
324 5730 11208 14231 -346 -20079 -15975 7046 11910 -4558 -8850 4884 5265 -7403 653 24212
338 24212 17371 -18086 -26422 2330 16254 -719 -4976 11320 8800 -13272 -7490 23432 23598
351 23598 -10493 -21806 1066 9612 -5750 -4069 18506 17194 -9941 -13245 12263 19232 -3871
364 -3871 -13236 3137 7262 -9563 -9014 16166 22987 -1739 -15218 3045 16374 651 -13135
377 -13135 -326 11049 -2962 -13131 5870 22313 6240 -14412 -3795 13390 1022 -16478
389 -16478 -3296 15974 2271 -18101 -3826 20346 9844 -14344 -5407 14215 311 -22750
401 -22750 -7660 20353 8495 -20366 -10075 18107 9494 -17032 -8814 15876 4248 -23598
413b3598R403K9578n565k5118P163K4289r877k5979R437K6580q457k9116M789
426a6471K8004p80k3902M095K3062m677k6491K272K6661J4k6340l228K4451M246
440A0916k0592j132K2970Q22k5732n574K4440Q127k1670p971K0427P012k0975
453h932m523K5721Q163k8153j4034K4084J4198k0792j1496K2387J0947k3665j2346
466a8441K5548J6085k3506j7906J8197J4783j8436j1298K2401J3010k2258j5785
478a7606K1833J6724j9035j6456J6894J2661j8884j2230K1735J7323j9569j9571
490a6181J5172J8131j2578j5669J1491J3321j4331j4151J5267J8400j0664j8247
502a0039P725J3920r816j3888J2557J6382j2923k1181R743K3486l746k0179K632
$$ plain form
413 -23598 -14195 15383 9818 -15300 -8137 16152 6275 -19704 -10267 16313 7856 -21260 -16471
426 -16471 11533 10753 -13149 -9054 14008 9331 -17160 -14888 11773 11787 -14553 -17781 6670 10916
440 10916 -9676 -10808 12162 12984 -12748 -18322 6118 14245 -7425 -15396 5031 12043 -8932
453 -8932 -13455 12266 20429 -7724 -21758 2326 16524 -4268 -15764 6623 17570 -6095 -18441
466 -18441 7107 23192 -314 -18220 -23 14760 -3676 -14974 7427 20437 -1821 -17606
478 -17606 4227 20951 1916 -14540 2354 15015 -3869 -16099 5636 22959 3390 -16181
490 -16181 -1009 17122 4544 -11125 366 13687 -644 -14795 472 18872 8208 -10039
502 -10039 -2314 11606 1790 -12098 459 16841 3918 -17263 -7520 15966 12220 -7959 -5327
515e327J6521o544j9125O515K1362l452k1265J029J8457m45j4691M265J4530q952
529B878k0184P313K2760l102k1695J991J9334k408j8020L433J8886l055k1283
542a3152j978J8027M586j1300j309R216l225j0770M706J3996l617j5616m25J2902
556B041J943j0273M21J2731P43j5431n890J3853R895r510j0367M532P783l384
570i13l416O483L956q449n747P444M711p741k689J0536L136j3967m735J7034R088
585A4731j5137j2929J0822J2324q594r666P569Q685n960o534N448L333m355p7
599c40N948l758j0437M567J4568o98j5101k609J3250M368j0368n170P769N762
613G751n069o039J189M815L630j307m563l580K238M823O25l119r97J259K6n52
$$ plain form
515 -5327 11194 4650 -14475 -7960 13402 9950 -11315 -10286 8171 7726 -6965 -2700 11830 2878
529 2878 -17306 -9993 12767 9665 -12030 -10039 9295 6887 -11133 -7700 11186 8131 -13152
542 -13152 -15130 2897 7483 -3817 -5126 4090 865 -9905 -5199 8797 5180 -10436 -10861 2041
556 2041 3984 -6289 -5868 6863 7606 -7825 -13715 138 10033 523 -9844 -5312 2471 -913
570 -913 -4329 2154 6110 -2339 -8086 -642 4069 -3672 -6361 4175 7311 -6656 -11391 5643 14731
585 14731 -406 -13335 -2513 9811 1217 -8449 -880 7805 1845 -4689 759 4092 -263 -340
599 -340 5608 1850 -8587 -4020 10548 9850 -5251 -7860 5390 9758 -610 -5780 1989 7751
613 7751 2682 -3357 -2168 2647 6277 4970 407 -3173 -935 3888 4513 1394 397 1656 1682 1130
629A130l52m01J078L247j184p432j404R383O279p690q620M027P222k422n032J032
645a139L183j743q11J183j079r25N176K473q740q071P346J2019l342j1770j067
660g307Q046K812k065j324j704k722K878L438m526n114O825R756o308j4062K901
675h476J5305J178j2763m813P011M029k560j030J351J82P39J165m433m782O342
690a555Q864o144j3135K324J6185L664j2885o559P790O697m847n931N13M081K228
705A290j79l040k559M445O621j194r284m682N797P638m24p051l497N435P316j489
721E143p641r61O867J012p896k539P526M373n091k341N086M39n368Q27O744l068
737C112r684K263J0999j340j0021K918J1682j890j2675n41J1814J090j0514l329
$$ plain form
629 1130 778 377 1455 4702 3518 -3914 -5318 4065 10344 2654 -5966 -1939 5283 2861 -2171 -1139
645 -1139 2044 301 -510 673 -406 -1331 3845 6318 -2422 -10493 -3147 8872 5530 -6240 -7307
660 -7307 739 3551 1486 162 -1542 -4264 -1386 2052 -2474 -7588 -763 8993 2685 -11377 -8476
675 -8476 6829 8007 -4756 -9569 -2558 1471 -1089 -2119 -768 -586 153 1318 -3115 -7897 -1555
690 -1555 7309 1165 -11970 -9646 6539 10203 -2682 -9241 -1451 5246 399 -5532 -5019 -938 1290
705 1290 1111 -1929 -4488 -43 6578 5384 -3900 -8582 -2785 4853 4429 -2622 -6119 -684 6632 5143
721 5143 -2498 -3459 3408 4420 -3476 -6015 1511 5884 793 -1548 3538 3977 -1391 -564 6180 3112
737 3112 -6572 -4309 6690 5350 -4671 -1753 9929 8039 -4636 -5177 6637 7727 -2787 -6116
751f116P365L301k000N46j18l534k78O549K41r912m265J0428P742p700j0366N826
767b291J2333q21j1118n973O767O770k991o657m5N612K961k700j995L56M9k40
783A7O81j620m213J245P326J315q072j876R544L400j1925o158J0925P468j1109
798c052r402J0360J1140o537r261M796O243m365m805L883Q92o188M31Q660J080
813C875q586o05R801J777j0538m768O746N011m073l058K305J715m5K122K040l400
829C19n438M60M037J718l412j506K805L741l61k994K79L468n36o589l112N675
845a446M713k499k879L636K107l341o69L960j33o162k182M479L90j114M653N272
861H785o805q270N816J0874m534j3101j81J0062J682o214K096O748q55o283jK789
$$ plain form
751 -6116 1249 4550 2550 3096 2978 -556 -834 5715 5956 -3956 -8221 2207 9949 2249 -8117 -2291
767 -2291 10042 9221 -1897 -7870 -1103 5667 2676 -3981 -4026 1586 4547 1847 -148 208 257 17
783 17 698 -922 -5135 -3890 3436 4751 -3321 -5197 4347 7747 -4178 -10336 589 8057 -3052
798 -3052 -12454 -2094 9046 2509 -6752 -1956 4287 -78 -4883 -1000 -108 -6296 -5865 2795 3875
813 3875 -4711 -5316 4485 6262 -4276 -9044 -2298 2713 -1360 -4418 -2113 -398 -443 1679 3719 319
829 319 -5119 -4659 -622 1096 -2316 -3822 -1017 2724 2363 -631 -352 3116 2580 -4009 -7121 -1446
845 -1446 3267 768 -2111 1525 3632 291 -378 3582 3449 -2713 -4895 -416 -26 -1140 3513 8785
861 8785 1980 -6290 -474 10400 5866 -7235 -7416 2646 4328 -1886 210 6958 6103 -180 -181 2608
877B608k163k019K790j48n148M06Q760M814n551n374J330N67k087oK941n18m132
894b930K38N655L817j500l494k444j296P6N79J26M69J025J183q17L51K586K45
911C869k878l582j844J82J207L176K272j656j747J998K084j673k274k63j819l769
927f717J431O113J825l581m33M837K17n066l104K627L96l075K98K436P18P70L875
944C567J559m944m856K533K106l951k538M249L240j440r05L252K100k595k722
959a345j36j591l373R86N651K815j722j803J311J533R8o88j656l758k624K013
975d289M162L426K65j241p97q36L4J72Q9j556k938j923K624N989K965r04j980
992C262j486k400k690K449M752j407o777j712O577O739M71k632k828m142k009
$$ plain form
877 2608 445 -1574 1216 1068 -4080 -3674 5086 9900 4349 -1025 305 872 -1215 -1221 1720 1202 -2930
894 -2930 -2692 2963 6780 5280 1786 -658 -1954 -1878 -1299 -1173 -704 321 1504 687 1038 3624 3869
911 3869 991 -2591 -4435 -4253 -3046 130 2402 746 -1001 997 3081 1408 -866 -1129 -2948 -6717
927 -6717 -5286 827 2652 -929 -1362 3475 3692 -1374 -4478 -1851 -1455 -4530 -4232 -1796 -1078 -308 3567
944 3567 5126 182 -4674 -2141 -35 -3986 -6524 -2275 965 -475 -1380 1872 3972 1377 -1345
959 -1345 -1481 -3072 -6445 -5459 192 3007 1285 -518 793 2326 2424 1736 80 -3678 -6302 -4289
975 -4289 -127 3299 3564 2323 1526 690 724 896 985 -571 -3509 -5432 -2808 3181 6146 5242 3262
992 3262 1776 -624 -3314 -865 3887 2480 -4297 -6009 568 7307 7778 5146 2318 -1824 -3833
1007c833K989L723j831l552J711L491o36l97M337K563p323q536Q73P243K231k076
1023I77l80J221j524L82M128J882n124o234m50K245J465K093L744k83m379k023
1039b260L743L511l176n383j333K335L55J56K970L699l97l847k370Q79P75j011
1055a354j040l89j120R4M334M358r77m701j728K358m95m037m86M150J773k976
1071b236n46L638K164j525j453R39l628m102J436N524J227k845N66L064r06l560
1087b243J204M141k086o615j578N382L146m73P66J857j965m188O22L525L85l478
1103a598j832J002L08J494M863K846l345p343j178N112L270k483l311Q92J057
1118b46n77J810M746J507n318n519l59K810K186J261P37k491l736J319O598L165
$$ plain form
1007 -3833 -844 2879 1048 -2504 -793 2698 2062 1665 6002 8565 1242 -7294 -6421 822 3053 977
1023 977 597 1818 294 676 4804 6686 1562 -4672 -5122 -2877 -1412 681 4425 4142 -237 -2260
1039 -2260 1483 4994 1818 -3565 -4898 -2563 -2208 -2052 918 4617 4220 373 -1997 -1118 -343 -1354
1055 -1354 -2394 -2783 -3903 -3809 525 4883 3906 -795 -2523 -165 -660 -4697 -5183 -1033 740 -2236
1071 -2236 -2782 856 3020 1495 42 981 -2647 -6749 -5313 211 1438 -1407 -841 2223 1317 -2243
1087 -2243 -1039 3102 1016 -5599 -7177 -1795 1351 878 1644 3501 1536 -2652 -2030 1495 1880 -1598
1103 -1598 -3430 -2428 -2120 -626 4237 7083 3738 -3605 -4783 329 3599 1116 -2195 -1303 -246
1118 -246 -823 987 5733 7240 1922 -3597 -3956 -1146 1040 2301 3038 547 -3189 -1870 4728 7893
1134G893m079n431j007R29q10K722M637L20n603k976M236N208j510l737j920n01
1150a629k000J395N510K543l694l326J065J828r57N0J830j969n196p29O270M512
1166E503j869l597j66K62j121k70K067P14l194k136J547L051J411j92O5j620l341
1183b886p65K362J898j003j940J100Q83j20k67K256J261l133m276M18K627J261
1199c24o67L29J141q18j465R01K061o22k375q66J47n92P85L802K626l560m090
1216c587J080L661r9k423Q9N41j537j096K873M574q57l333j714j54j28J845K755
1233B490l00m317k328L710M110n7j825jj470k741o87M251K875j234l456j101J329
1250g52K614K411J82l733l958M18L639J919m35j130J12m51j487Q03K978J454l229
$$ plain form
1134 7893 3814 -1617 -2624 -1695 -2505 217 4854 5174 -429 -3405 831 6039 4529 792 -1128 -1629
1150 -1629 -3629 -2234 3276 5819 2125 -1201 -136 1692 735 785 2615 646 -4550 -5279 991 5503
1166 5503 3634 37 -129 133 -988 -1258 809 1523 -1671 -3807 -2260 791 2202 2010 2075 455 -2886
1183 -2886 -3651 -1289 609 -394 -2334 -1234 -351 -471 -738 1518 2779 -354 -4630 -4212 -1585 -324
1199 -324 -991 -662 479 -339 -1804 -903 1158 536 -1839 -2705 -2558 -3150 -2365 1437 4063 503 -3587
1216 -3587 -2507 1154 1055 -1368 -1279 -738 -2275 -3371 -498 4076 3219 -114 -1828 -1982 -2110 -265 2490
1233 2490 2190 -2127 -4455 -745 3365 3308 1483 1482 12 -2729 -3416 835 3710 2476 -980 -2081 -752
1250 -752 1862 4273 4455 722 -3236 -2818 821 2740 2305 1175 1287 836 -651 152 3130 4584 1355
1267A355m511j170M403L643M01j966k512n65J293J774J70q45k049o37O2L12J431
1284E89L527L76l844m666J547N099O42l366k163J185P54j02J374J730o78k390
1300c86j382j0J25J305K893n67m390k313M583M458k427m253M37J979j300j800
1316c048J815L415j330k495l07J000N53J079Q73k246l895n1M562K571j947k848
1332b299J407J614k270j674K310L364j829m195q71L169K787M50j217j698j660
1347b612M72K467J103j462j938O51J656j528m76K916K903k989n280j22N286K304
1363C351k481k325N66K30O15J416J072r40k248j7N27r04Q21L133J218m069m148
1380d183K961N912q4m745k128J911J126p21M33J963M91k748j187M49J770R92M92
$$ plain form
1267 1355 -3156 -4326 77 3720 4121 2155 -357 -922 371 2145 2315 1470 -579 -1216 -1154 -842 589
1284 589 4116 4492 648 -4018 -2471 2628 3270 -96 -2259 -1074 -320 -422 952 2682 2004 -386
1300 -386 -1768 -1778 -1653 -348 2545 1978 -2412 -4725 -142 4316 1889 -2364 -1927 52 -1248 -3048
1316 -3048 -1233 2182 852 -1643 -1950 -950 -397 682 1555 -691 -4586 -4637 -75 2496 549 -2299
1332 -2299 -892 722 -1548 -3222 -912 2452 623 -3572 -4443 -1274 1513 1963 746 -952 -2612
1347 -2612 -2140 327 1430 -32 -1970 -1319 337 -1191 -1667 1249 4152 1163 -4117 -4239 1047 3351
1363 3351 870 -1455 -889 -659 -44 1372 2444 1504 -744 -761 -234 -1138 -317 2816 4034 -35 -4183
1380 -4183 -1222 4690 4606 -139 -2267 -356 770 49 482 2445 2936 188 -999 -550 1220 2212 2704
1397B704j361l221j280L858L944p28m567j083K769J009k095q21L150M33l932k193
1413c414L308L682k51k594j507l70j84J649K965j359l310j115L449N60j848m7
1429c86K716j200m745%M598K346k556k684J74O61j43J762J680j800l538J34K746
1446b35N57j240J269Q70k303l127J722M036R03l015k922O79J734J645J68j17j261
1463f37j169j27R96Q63Jl35p48n67q60J353L251J010l513l828J032M287P59j973
1481b05q01J234r29j632J632L165j94l758p75J178M35M86K381M98l468k682K992
1498d43L217j499k241J103J323k619j128L933K817k412l629K08K133N4j23J420
1514B114p01k932Q1K978J856j857j148L88n39j154O75K331O67j846j777N03J385
$$ plain form
1397 2704 1343 -1878 -3158 700 4644 3916 -651 -1734 1035 2044 -51 -872 2278 2711 -1221 -3414
1413 -3414 -106 3576 3325 731 -776 -1146 -1330 319 3284 1925 -1385 -2500 949 1509 -339 -386
1429 -386 2330 1130 -3615 -3615 983 3329 773 -1911 -1737 -1076 -1219 543 2223 423 -3115 -2981 -235
1446 -235 322 -918 351 1221 -1082 -4209 -2487 1549 2452 -563 -3485 -2806 -1072 573 741 624 -637
1463 -637 -1806 -1933 -937 -74 -73 -408 -1156 -1723 -2583 -1230 2021 3031 -482 -4310 -3278 1009 1768 -205
1481 -205 -1006 228 -701 -2333 -701 2464 2270 -1488 -2263 -1085 -650 -164 2217 2715 -753 -3435 -443
1498 -443 2774 1275 -966 137 1460 -1159 -2287 1646 4463 2051 -1578 -1370 763 817 694 2114
1514 2114 1413 -1519 -1438 1540 3396 1539 391 779 240 -914 -239 2092 2759 913 -864 -361 1024
1531A024N48N06L2k101j624M04J590J752J99j914j189O77J132J97n33M87m09k278
1549a500o42K455J868m88j489m86l80p15Q86J931j64k521j140K158Q57m39J025
1566A216O55k513k932J203L326K84k231p19Q91m2j51K221J035k218k780L48J117
1583a290N93M60J058j64k811n54K540J729n90j880q12j020Q0K037K469n88k134
1600h77j266J009J041M29j6o02j118p03Q1J573K212L33j609k281J22J592J090
1617A010k05r80j475J44P56K168Q72r97j396j35q20o8J716J886j654l086M12K869
1635A017J638j362m88J2q42j614P68K260N91j261l22m3k93N76K477l10l074k534
1653b804K013K540l24j585J022P76j502o97J289J502r42j306q46O3M16J186J812
$$ plain form
1531 1024 1572 2078 2110 9 -1615 -1211 379 2131 2330 416 -773 -96 1036 1233 700 1187 778 -1500
1549 -1500 -2142 313 2181 1693 204 -282 -662 -1377 -491 1440 1276 -1245 -2385 -227 630 191 1216
1566 1216 1871 -642 -3574 -2371 955 1239 -992 -1711 -820 -862 -1013 1208 2243 25 -2755 -2407 -1290
1583 -1290 -697 -237 821 657 -2154 -2708 -168 1561 971 -909 -1721 -2741 -2661 -624 1845 1257 -877
1600 -877 -2143 -1134 -93 336 320 -282 -1400 -2103 -2022 -449 1763 2096 487 -1794 -1672 -80 1010
1617 1010 805 -175 -1650 -1506 -750 1418 2290 1293 -103 -238 -1058 -1126 590 2476 822 -2264 -1852 1017
1635 1017 2655 1293 805 817 -25 -1639 -871 1389 1980 719 397 354 61 637 3114 2804 -270 -2804
1653 -2804 -791 1749 1425 -160 862 1638 136 -561 728 2230 1288 -18 -864 -801 -385 801 2613
1670B613r04j863m10J035O72n69l27l03k02n45j41J526J418N0k307j403P18R55
1688A3L31p53R5j08o95N28J293O20j096r86N37r63j184R15L034k71l512n51K691
1707f2J721r33j563L95p48j599J026K151J88j330P0N31j080o00K286J377k689
1724h59k936R71K976Q89r62l23M07p81r19Q51J601l74j505r66N0J069J542J074
1742A805k37k308j312Q85K117j45j199n56M82J93J81O37J689N4k389j924L33K163
1760D69J106j027o83J90m95R73J763L52k062j893J117L15m79O64J626N92k859
1777c31j149K721J786j741j671k03M45r32J128K106N04k066r93J040L88l70j77
1794D85Q35j200k266P64L015J283j455j389J47Qm63K6P79j92p80j100J076J270
$$ plain form
1670 2613 1709 -154 -564 471 1143 574 247 -56 -258 -803 -944 582 2000 2050 -257 -1660 -942 13
1688 13 344 -409 -314 -422 -1117 -589 704 1324 228 -758 -221 -1184 -2368 -1453 1581 1310 -2202 -2753 -62
1707 -62 1659 726 -837 -442 -1190 -2789 -1763 388 576 -754 -684 -153 -1233 -1833 453 1830 -859
1724 -859 -3795 -2824 152 1041 79 -244 163 -618 -1537 -686 915 541 -964 -1930 -1880 -811 731 1805
1742 1805 1568 -740 -2052 -1167 950 805 -394 -950 -468 -275 -94 543 2232 2286 -103 -2027 -1694 469
1760 469 1575 548 -135 55 -440 533 2296 2648 586 -1307 -190 125 -354 310 1936 2528 -331
1777 -331 -1480 1241 3027 1286 -385 -588 -143 -1075 53 2159 2663 597 -396 644 1032 662 485
1794 485 1320 120 -2146 -1382 1633 2916 1461 72 219 227 -236 -210 569 377 -403 -1503 -427 843
1812H43N45l4q94j084q53L06J182L51p17q63P5J323R19q42M07O0j380k482P88
1831b350K483P31j145q24J188j92k44N90Q63j426k350n1J832L98J97P96O82j702
1849e24j726J859J550j173k232M44P77k05K73J913P54j382j412j5R10k19L66P
1867c5q48j568R52K614J299j257j260o81j22R7J96N85J87n33l64M59J195J211
1885B127l1j881j944L55P15J006N58J14q69m10L52J298M7k56m23j376j388P01
1903a305K761J531j557j931P11Q35m3k8J64q01j298k69J659P26O12O0l83j615
1921a71j151J641J910j109j998m81J111R88N02R22n81j193j044k37N58P70N31
1938I68l59j226p59J170K051K97j640j671l78P24L61L26L29J6o69k52l7J146J270
$$ plain form
1812 843 1388 1354 460 -624 -1477 -1171 11 362 -355 -1218 -1143 180 1099 257 664 724 -656 -3138 -2350
1831 -2350 133 864 -281 -1105 83 -109 -353 237 1100 -326 -2676 -2727 -895 -497 -300 496 1178 -524
1849 -524 -2250 -391 1159 -14 -2246 -1802 -1025 -1230 -957 956 1710 328 -1084 -1099 -189 -408 -42 -35
1867 -35 -883 -2451 -1499 1115 2414 1157 -103 -784 -906 -809 -613 -28 159 -374 -738 -279 916 2127
1885 2127 2096 215 -1729 -1374 -659 347 905 1019 150 -260 92 1390 1437 1181 758 -618 -2006 -1305
1903 -1305 1456 2987 1430 -501 210 1045 1002 974 1138 337 -961 -1230 429 1155 1767 1827 1444 -171
1921 -171 -1322 319 2229 1120 -878 -1359 -248 740 1242 2164 1583 390 -654 -891 -333 437 968
1938 968 609 -617 -1376 -206 1845 2142 502 -1169 -1547 -823 -462 -136 193 209 -460 -712 -749 397 1667
1957A667j059k044j115P17J911M65j34m76q58J27Q51k71J7n10L34j084q29J327
1975i64J821P24j609j096j71Q03L95M23j005o89p9R69N21k09L03P25k97k055o58
1994b148J663J777j062j354m2R25K71N02N08n90j056m07K68K76J75R66M58j460
2012c30o52Q54J474M10j000j700J39N80P41L55r0K08k78p23p17Q90J350l77j256
2031a22j069L86J389R38N25j044j647J72J286M92p19o02Q17j45j560J60K953N06
2049B716j995j136N6L44L97R94J88j547j502J325J699o40q64L9Q30j732j205J925
2067a08J862p13j775j62P39J98N28Q70j033j597K85Q11M28k52J06L03o44j276
2085a430Q40J180L59j068j005m54O98J486M34r92j078L18K76l66K76O98j93r52
$$ plain form
1957 1667 608 -1436 -2551 -1834 77 542 408 -68 -926 -799 52 -219 -202 -712 -378 -1462 -2291 -964
1975 -964 857 1581 -28 -1124 -1295 -492 -97 326 -679 -1368 -1447 -478 43 -166 137 862 565 -1490 -2148
1994 -2148 -485 1292 230 -1124 -1166 -241 30 532 1040 450 -606 -1013 -745 -469 -294 672 1130 -330
2012 -330 -982 -128 1346 1756 756 -944 -805 -225 516 871 781 989 711 -12 -729 161 1511 1134 -122
2031 -122 -1191 -805 584 1522 2047 1003 -644 -472 814 1306 587 -15 802 657 -903 -743 2210 2716
2049 2716 721 -415 -359 -15 382 1376 1564 17 -1485 -160 1539 899 35 74 904 -828 -2033 -108
2067 -108 1754 1041 -734 -896 -157 41 569 1439 406 -1191 -906 -95 333 81 187 490 -154 -1430
2085 -1430 -590 590 949 -119 -1124 -1578 -880 606 1040 48 -1030 -712 -436 -802 -526 172 -21 -973
2103i73n84R11N49kK62R2j307j273K043J242j385q92J002N72r45n97J486R37j551
2122d13j109Q95M04o27M91J395m99j616L16J525P8j569K02R22n14j076Q27J479
2140A111k51j107R9M76j95J17L93O6r10n23Q54N50J20K7l03k89n97M15N63K62
2160H78J40m54q41P1P90Q05k09o38o6n78o11O88J554k61j307J6O52M08o70N06
2180H73M47j076j310N79K013l16j360M53K18n74l52J278R67j803q99P89N49o07
2198a31J11J013l85j469j25J469P08j109o08K49l44m52R60N89k83j113M6Q70k89
2217b93m61O91m6n97q2o4O22P86k58r69o64K66R12r2n67K71O14j017k94J190J21
2238F9j71r45P68op55M59J245l16j767k4J382P29j277j7J124m33j311K25J613
$$ plain form
2103 -973 -1557 -646 -97 -99 163 255 -1052 -2325 -282 960 -425 -1317 -315 257 -688 -1285 201 1138 -413
2122 -413 -1522 -627 -223 -850 -359 1036 537 -1079 -763 762 840 -729 -527 395 -119 -1195 -368 1111
2140 1111 860 -247 -148 328 133 250 643 709 -201 -724 130 680 800 827 524 235 -362 53 616 878
2160 878 1018 564 -277 -206 584 1389 1180 542 476 -102 -713 -25 1529 1268 -39 -23 629 1037 367 873
2180 873 1320 244 -1066 -487 1526 1210 -150 303 521 -53 -405 873 1840 37 -862 -73 476 -131
2198 -131 -20 993 608 -861 -986 483 1191 82 -526 -277 -621 -1073 -113 476 193 -920 -874 -4 -293
2217 -293 -754 -63 -109 -706 -788 -852 -230 556 298 -671 -1335 -1069 -157 -249 -816 -545 69 -948 -1242 -52 69
2238 69 -102 -1047 -279 -285 -1040 -581 664 348 -1419 -1443 -61 668 -609 -626 498 65 -1246 -1021 592
2257E92R6r23o4N31n11n86J327O30j430q19J023N90o56n10J117M46o93n01L67
2276B6L72k6q9l9n98j16J086L59k66o08J81K79l88O9P82o27k00J63j42k45O57
2297F30J079o19j391k29J589mj383K99R88o40o13R73O41m69p63O68j49j185n2
2316f30J846K92j834p08J602P93j261l58P08J32j089j77Q00K65m23M5M92o86j70
2335c61N37Q43j268j154Q51O77k94m32O69l27k09M19j93R8j18K74k81j027N9J274
2355C7L47r31l30P16Q1l57J3qJ16m17N58R4r06K62J216j05j349n11J447M74r11
2376d64p4L79J44m65K96J007q36q68O95M63r14n63J542O74j421m79O91N02j85
2395A24l22N00m16o9J36M53k95q7O68mo68l47R64O3p16o88M30P97k10j22O49o24
$$ plain form
2257 592 688 -235 -299 232 -279 -865 462 1092 -338 -1157 -134 456 -200 -710 407 853 160 -341 26
2276 26 398 372 283 244 -354 -470 616 975 709 101 282 561 173 242 1024 397 197 360 218 -27 630
2297 630 1709 1090 -301 -530 1059 1055 -328 -29 959 319 -294 679 1320 851 88 756 607 -578 -630
2316 -630 1216 1508 -326 -1034 568 1361 100 -258 450 582 -507 -684 116 381 -42 3 495 -191 -361
2335 -361 176 1019 -249 -1403 -552 125 -169 -601 68 -259 -468 -49 -242 -144 -262 12 -269 -1296 -1237 37
2355 37 384 -547 -877 -161 -80 -437 -424 -432 -316 -733 -175 -81 -987 -725 491 386 -963 -1474 -27 447 -464
2376 -464 -538 -159 -15 -480 -184 823 -13 -881 -186 277 -637 -1200 342 1016 -405 -884 -193 309 124
2395 124 -198 302 -114 -183 -47 406 111 24 692 688 20 -327 637 700 -16 -704 -274 523 313 191 840 216
2417B16K63o3j49J49l03Q96m59o84p3Q94N30o15n91M81J48p01M58L53n18M1J71
2438D44K82q58L63P14Q1q53p00P38K17n18j32M75L79o50M45K21l77n51R1M29m03
2459a63l71P46N54j058l68J031N8m02o18O29R3o97Q7M87k00j64O20j9n05o00O09
2480b51M92r18j38L4O82k51P0L05J84p40j04L50k79j6J56L93m36k16L51L23j81
2501a90n0Q3N2n52L30R1r4K61L57o98J17J42O45k59m78k11K99K16l93R5M02P5
2523B40m38K49K3Q3l29L58l0n87J96P69rn36q0Q33O8m99n45N42K33m82P7M16p2
2546D80l64K52N86r25j37O21rk20o32R93J35l82o8K30J58k26j6j32l46K76Q5J43
2568E02m69J20K00M13r43M19K57j60l30J5j1q7K93J81M9m65l8N24j78n84m5L93
$$ plain form
2417 216 479 416 267 416 113 1009 550 -134 -207 687 1217 602 11 492 640 -61 397 750 232 273 444
2438 444 726 -132 231 945 1026 173 -527 211 428 -90 -222 253 632 -18 427 648 271 -280 -189 240 -163
2459 -163 -534 212 766 -292 -660 371 429 27 -591 38 131 -566 -479 8 -192 -356 264 245 -260 -860 -251
2480 -251 241 -677 -815 -781 -99 -350 -280 25 209 -531 -635 -285 -564 -580 -424 -31 -467 -683 -332 -9 -190
2501 -190 -240 -157 -105 -657 -327 -236 -330 -69 288 -410 -293 -151 494 235 -243 -454 -155 61 -332 -237 165 240
2523 240 -198 51 74 157 -172 186 156 -431 -235 534 525 -11 -91 742 810 311 -234 308 541 59 136 552 480
2546 480 116 368 954 29 -108 513 504 284 -348 645 780 398 330 560 718 492 476 344 -2 274 359 502
2568 502 33 153 353 766 -177 242 499 339 9 24 13 -74 219 400 449 -16 -54 470 292 -292 -337 56
2590E6j37n66N18M94k94l57O1L15m49j97P37L5p38m82R53L81n38m82Q52K35j112
2611g15k28R24k22l93LN55k28j56N28J59p68l13L46K65k1n84M20L18j82k64K94
2632b62J51j05J96l52k90J57N38L12n28l94O07J66l31j2L49k41l26K50J02l14
2652c27J27O39L23j559M5J298K6j039p0Q02M06p14m35R54L9o14K11O64n82n35
2672c41Q11L11o40r24J241P73o49q47O12L97o82m76N06M04M3m43M20j84k19J84
2692B97L87j49p69K37O99m24n15N54L24j30n72k27P90l2k54K31o35l52N20M47
2712D27j61j25k88M84o35o2L66K34k23k11L73m93J22M15M34p71r48Q22N28m28
2732a40m78N84P0l85l47N92P88q79m30K82N6o95P26P13r07n44L63O77K53k29n2
$$ plain form
2590 56 -81 -647 -129 365 71 -286 -225 90 -359 -556 181 216 -522 -1004 -51 330 -208 -690 162 397 -715
2611 -715 -943 -19 -241 -634 -631 -76 -304 -460 68 227 -541 -854 -508 -243 -264 -848 -428 -110 -292 -556 -262
2632 -262 -111 -216 -20 -372 -662 -505 33 345 -183 -577 30 196 -135 -147 202 -39 -365 -115 -13 -327
2652 -327 -200 439 762 -797 -752 546 572 -467 -537 265 671 -43 -478 476 515 -99 112 776 194 -341
2672 -341 470 781 141 -783 458 1231 582 -265 347 744 62 -414 92 496 539 96 516 332 113 297
2692 297 684 535 -234 3 702 278 -237 317 641 511 -61 -288 502 470 216 447 -188 -540 -20 427
2712 427 266 141 -147 337 -298 -360 6 240 17 -194 179 -314 -192 223 657 -114 -1062 -240 288 -140
2732 -140 -618 -34 36 -349 -696 -104 684 -195 -625 -343 -287 -982 -256 457 -450 -994 -631 46 299 70 18
2753A8j25m15p05O62P71l57o06M01J3l70N00M45Q1q40l20M58J08P8J88m2l4j84
2775b75J79L12j26J02k65k56J1J51M18J69k12L3j09k82L31K22P2l45l32O92j73
2796C17j35O32L56q88q79M07P87l20l19M70J28p36K51O12K04m17m89K99p1o14
2816d05Q53J82J43o38k85M46P1J41j43K12k96m33M41MR4J75o9l91j55M46K54L
2838F50l76k66m23L52M00M78n05m96J97K60l50P5M15N0j202l59R28L91j13j28
2858b2M73n57m37j29J065k69p41r1M32j21j59Q46l6l31j036K80N32k42J40J13
2878b90L48n62j48P13P18j211j39j25K23q1K41L46J6l25N2O5r2J06M68l34q44
2899h55M1Q58K75qk43j86l0n91R25L0n83J56J32n1l42M72J030l07j079P0N69r9
$$ plain form
2753 18 -107 -522 -1227 -565 206 -151 -757 -356 -343 -713 -213 232 313 -527 -847 -389 -281 -203 -15 -57 -91 -275
2775 -275 -96 216 90 192 -73 -329 -318 -167 251 420 208 241 132 -150 181 403 475 130 -202 490 317
2796 317 182 814 1170 282 -597 -190 597 277 -42 428 556 -180 71 683 887 470 -19 280 209 -405
2816 -405 448 630 773 135 -150 296 367 508 365 577 281 -152 289 293 387 562 493 102 -53 393 647 650
2838 650 274 8 -415 -63 337 815 310 -186 11 271 -79 -4 411 461 -741 -1100 -172 219 106 -22
2858 -22 451 -106 -543 -672 393 124 -617 -708 -276 -397 -556 290 254 -77 -1113 -833 -301 -543 -403 -290
2878 -290 58 -504 -652 61 779 -432 -571 -696 -473 -554 -313 33 49 -276 -224 -159 -251 -145 323 -11 -855
2899 -855 -814 44 319 311 68 -118 -148 -739 186 216 -367 -211 -79 -130 -472 0 1030 723 -356 -286 283 184
2921A84n06O81M9m88m32O32O79m41j76K90j50n69k01J210j05m57j97L48M16l07
2941D60J01J63l21q79M14M59n05K22O91mo62l17J059j02l90o08K07r3K11O34n2
2962F88l40k74o0K19n13L23N26j37p62m46P64M95l76K96m9l52n06P29j3l56j71
2983c15L86j11m40J05O36N81j151o42L10O05m06K04L95o97q9K58K12p8l15O06
3003E4l67n88j05P02O76n60l07L01q7J7L75k08n91k07M28K92mj45M51Nq63j7M75
3026b73K27j5k80K76l32O1K58O81m58m70K01m1k97o8R17J35q98j83P38K87j80
3047B86j4Q6m79J80K05J21k08q3L71k75j07L65R4J69l81l24l6J00K71L97p2m82
3069A84j66L87k75K9j84O18M7p69j59P71J33j67k08K15j78j04J17N21p99l81M20
$$ plain form
2921 184 -322 359 408 -80 -512 120 799 358 182 472 322 -247 -448 762 657 200 3 351 767 460
2941 460 561 724 403 -476 -62 397 -108 114 805 801 139 -178 881 779 389 -219 -12 -105 106 740 688
2962 688 348 74 14 233 -280 43 569 432 -330 -776 -12 483 107 403 354 2 -504 225 212 -144 -315
2983 -315 71 -40 -480 -375 261 842 -309 -951 -641 -36 -442 -238 157 -540 -629 -371 -159 -237 -552 54
3003 54 -313 -901 -1006 -304 372 -188 -495 -194 -281 -264 111 -97 -688 -895 -467 -175 -179 -324 127 132 -731 -748 -273
3026 -273 -46 -61 -341 -65 -397 -336 -78 603 145 -325 -124 -165 -462 -530 387 522 -376 -559 179 466 286
3047 286 272 358 -121 59 264 385 177 94 465 190 83 448 542 711 330 6 -30 70 341 738 666 184
3069 184 18 405 130 159 -25 593 640 -129 -288 483 616 449 241 456 278 174 291 812 13 -368 52
3090E2L02j12k25P36k27m70l56K02O03n54R1K19q1o78O34J79m9l66k02L23k32
3111b11J13M2J31j81m22O2L26k5J37j03l83K5J98J31j15J17J85j30l85J97K56
3132c5m4m08P1K89j5k84N39k04k62m08M47N09o37K81K46k61m96r7Q61J88k24k36
3154a80J26l09p8K91M87m83l30K43N70n44j05N58j27n28J0L48K17J18l17k13K00
3175d6J98L9j2j3k98J69L78q17O57L7K0k55Q5K03j14PQ0r7j76j1M00j09M5j95
3199A75K58J84n74K08M46j60m34l71O24J6k43K83l53R7k66L43K76o41j35M51N1
3220B35r4r2K79K23p62R1K49Q7m83K09K62M7m96K74M42o32J77j26R6k17l33M63
3242a01J44J07l50q7K74k32J52J86l83l22K37M01m36r3M79j28l17J83J59j83R8
$$ plain form
3090 52 354 242 17 753 526 56 -300 -98 505 -49 42 261 180 -498 136 315 266 -100 -302 21 -211
3111 -211 -98 -56 75 -106 -528 -466 -140 -165 -28 -131 -514 -489 -291 -160 -275 -158 27 -103 -488 -291 -35
3132 -35 -79 -487 -416 -127 -142 -426 113 -91 -353 -761 -314 195 -442 -161 85 -176 -672 -769 92 280 56 -180
3154 -180 -54 -363 -441 -150 337 -146 -476 -233 337 -207 -312 246 119 -409 -399 -51 166 284 -33 -246 -46
3175 -46 152 191 179 166 -132 37 415 -402 255 292 312 57 142 345 231 238 318 221 45 34 434 325 370 175
3199 175 433 617 43 251 697 537 103 -268 356 372 129 412 59 156 -110 233 509 -132 -267 184 235
3220 235 141 49 328 551 -211 -120 129 216 -267 -58 204 251 -245 29 471 -161 16 -110 -14 -231 -564 -101
3242 -101 43 150 -200 -287 -13 -245 -93 93 -290 -612 -375 26 -410 -503 -24 -152 -469 -286 -127 -310 -212
3263b12j33J03k84n4N99m7j47k69J35L79l81p4M24j8m17m19O63K53K03k43J6k21
3285a44k71L76M3l6k76j48M40k55j95O45J5l09l37K64J22k14K71J88q2pJ3P25
3307H28n54j48k3K57k29k90L26M11j3q33L69J59K5O6j26l19J16P5L67k7j20J70
3329D87l98J96p5j0K45j98k4l54J14J72K27K51m11K3M8J02j35r7k9R9p1l07M51
3352C06p9r2J08j95o0pJ82J44m73Q5Q8J64k64N9j8J56n72J97K35J39k25j47J16
3375a53K21n73N10l16N30j86n84L56o4K40L6k60K74n24K30j47M15j1m20J32k27
3396e21O3K24j8N1J11N7l36o9L65j86K51k77p4M3J43L49L0l38l35P8J00K57k5
3419e7J3K89m39o7M74Q8m32o6K41k32j91K21K86P7k91l6L73q4P4R6l79Q5m87O19
$$ plain form
3263 -212 -345 -242 -526 -580 19 -28 -175 -444 -309 70 -311 -385 39 21 -396 -815 -152 101 304 61 77 -144
3285 -144 -415 -39 4 -32 -308 -456 -16 -271 -466 179 194 -115 -452 -188 -66 -280 -9 179 97 90 103 828
3307 828 274 126 103 360 131 -159 167 578 565 -268 101 260 285 351 225 -94 22 97 464 437 317 487
3329 487 89 285 210 200 445 247 223 -131 -17 155 382 633 222 245 293 395 260 163 134 233 162 -145 306
3352 306 227 135 243 48 -12 -19 163 307 -166 -81 7 171 -93 -34 -52 104 -468 -271 -36 103 -122 -269 -153
3375 -153 68 -505 5 -311 219 33 -551 -195 -259 -19 17 -243 31 -493 -263 -410 5 -6 -426 -294 -521
3396 -521 -458 -234 -252 -201 -90 -33 -369 -438 -73 -259 -8 -285 -359 -316 -173 176 206 -132 -467 -389 -289 -32 -57
3419 -57 -44 245 -194 -261 213 301 -131 -197 44 -188 -379 -158 128 205 -86 -122 251 167 241 337 -42 43 -444 175
3443A75JM2P3Q4j38k78K48R0J15l41L47k61j69K67K74k39o2k26K01R5j35K71q0
3466C54m30M9k6M92L9k96L26l25k92j22N85m2n0k17J10K9m0L45Q0o87r5J34L18
3489B39k06l4M81l73l58M97L3j71L2j57m63j48K62K28k9M00n55J05J19M0j01J20
3511c9m5l64k51K58K63K85k30k40m1l8l6K37Q6l93M96k91M2M72m1K55p03j64K
3534d80L56j78J15L69m87m4K9N21k91L58l63N8m17J02M07J94m37J42N6J40l43
3555a93L02J30k71n13L41K23o1n5K21K45n79r9N36J97n53J7K37q8k31K53M88l79
3577A68l53K58J19j47q6J74J59j20m25N24K91R6j73j28P6k04p8n6J11j64M7J72
3599B61j77K44j14M2k06l66K33J19O5K15J7k66l00J99J99J16k02j06m03P7L20
$$ plain form
3443 175 176 218 291 375 237 -41 207 297 412 71 418 157 -12 255 529 290 228 2 203 298 163 434 354
3466 354 -76 -27 -53 439 478 182 508 183 -109 -231 354 312 262 45 155 184 144 489 569 -118 -213 -79 239
3489 239 33 -1 480 107 -251 246 279 108 140 -17 -480 -628 -366 -138 -167 233 -322 -217 -98 -58 -159 -39
3511 -39 -84 -448 -699 -441 -178 107 -123 -363 -404 -442 -478 -241 -155 -548 -52 -343 -301 171 130 385 -318 -482 -480
3534 -480 -124 -302 -187 182 -305 -349 -320 201 -90 268 -95 -37 -454 -352 55 249 -188 -46 10 150 -193
3555 -193 109 239 -32 -545 -204 19 -42 -97 124 369 -210 -309 227 424 -129 -112 125 37 -194 59 547 168
3577 168 -185 73 192 45 -41 133 292 172 -253 271 562 658 485 357 433 229 151 95 206 42 89 261
3599 261 84 328 214 256 50 -316 -83 36 101 316 333 67 -233 -34 165 281 79 -27 -430 -353 -33
3620c3M6L81n06j02L34o9k38R4L11k03n77L77K76n4O0J17J63p77K17L20l67K18
3642a2n3k59j3K29J93R1m05k93J95N8o5n7O3L78km42L31l0J64k61J23k15J20k2
3666a84Q0l3j41K6L09k16l3M25l50j01m6L8l2K46J60j85j12K4J46R0j16K76J13
3689C84p32J12M28q8J7r2N2j9J35j81k35O46m32j30J62J85J6k04M03k07r8q7J73
3712B08L95m35k7J18J55n2k12N37n66j85k1L34j95J09j58L21K3k64L0L18k8n19
3734a14K40k22R7O3N9J29k68K17p3J62l34J55K57k48m50Q5J9M08p8K49o57P8J12
3757a14K61k88l12L97J63n36K80M03k13l0k35L50k41l12J79J89j07r5oJ64L9l46
3779d10L86j72l22K02J92Q0J24m06J99J22k37P5k39K69l00p1L96k67O99k16l12
$$ plain form
3620 -33 13 394 -112 -214 120 51 -187 -93 218 15 -562 -185 91 37 97 214 377 -400 -183 137 -230 -12
3642 -12 -65 -324 -337 -108 85 176 -229 -522 -327 -269 -334 -391 -328 50 48 -394 -63 -93 71 -190 -67 -282 -162 -184
3666 -184 -104 -137 -278 -252 57 -159 -192 233 -117 -218 -264 -226 -258 -12 148 -37 -149 -125 21 111 -5 271 384
3689 384 -348 -236 192 104 121 29 81 62 197 16 -219 427 -5 -135 27 212 228 24 427 220 122 35 208
3712 208 603 168 141 259 414 362 150 687 121 -64 -85 249 54 163 5 326 349 85 115 433 405 -114
3734 -114 126 -96 1 64 123 252 -16 201 128 290 -44 111 368 120 -330 -245 -226 182 104 353 -304 -226 -114
3757 -114 147 -141 -453 -56 107 -429 -149 254 41 11 -224 126 -115 -427 -248 -59 -166 -261 -267 -103 -64 -410
3779 -410 -24 -196 -518 -316 -124 -44 80 -326 -127 -5 -242 -167 -406 -137 -437 -508 -112 -379 320 104 -208
3800b08Oj27n4K21K08k2k42K68k07J80J79o7nQ4j13j8k66K90K07m69OJ94M6j34
3824d3%L64k87l61K80L39l8j25K42j72jk38K01M12j20o36K34K22k66K29p6J67
3846C27n9k06m6N14m48l5K89j77l0N36n66J61k05k75K12m4K1L59J04j22j81j34
3868eR2rQ7j13j03j44L06k06J89j24j42j49N23l97K13K98l88k61L29k67K14L49
3890B92j95k15j41Q7J23n3n93O46l58M34k91M13l42K6m0J9k38J63K4K51r5O9l23
3913c37L01N3k08j43M96l93j17J06k33M52l19m7K94M7k62L16k3L4m29J25K04m1
3935a24O9K66j87j71L5J33n5J2J19P0j96k17M75j38N7N1j91J93k05J43k58K39
3957A20J60l47R9J92J02k42J31l51L13n4mK24k52K45k03k16N46l38k28J60O4j71
$$ plain form
3800 -208 -202 -329 -383 -162 46 24 -218 50 -157 23 202 135 130 214 101 83 -183 107 314 -155 -149 45 91 -43
3824 -43 -43 321 34 -327 -47 292 254 129 371 199 198 -40 161 573 453 -183 51 273 7 236 160 327
3846 327 268 62 16 530 82 47 336 159 129 665 99 260 55 -220 -8 -52 -31 328 432 310 129 -5
3868 -5 87 78 165 52 -51 -195 111 -95 94 -30 -172 -321 202 -195 18 316 -72 -333 -4 -271 -57 292
3890 292 97 -118 -259 -172 -49 -102 -695 -49 -407 27 -264 149 -193 -167 -207 -188 -426 -263 -239 12 -83 -14 -337
3913 -337 -36 17 -191 -334 162 -231 -348 -242 -475 -23 -342 -389 -95 -48 -310 6 -17 17 -412 -287 -83 -124
3935 -124 -55 211 24 -147 -112 21 -34 -22 97 167 -29 -246 229 91 148 199 8 201 -4 139 -119 120
3957 120 280 -67 32 224 326 84 215 -136 177 123 119 343 91 336 133 -83 463 125 -103 57 121 -50
3979e0j47L43K41k16k67K16k58J98K85l26J8j92K67l1J39j21q8p6k0J54pK97j65
4002A94k30K65l72j21N01j8o2j06j96P6j13k0M60l01k3m8K78j37j37PL3j64j71
4025d05M31k3j34j62J42Q7m77K69m4J71O7k50K1o0M02K41m27l8j81K20J98k99
4047b51j26M23j10j82l13N19J22j21M5j89K7J62kJ64k83L6J24J9P5l43O3L8O8
4070c5m11M89K20m30J30J02q6l55K63L67l97N4O9J55l7o7M6j81L63j51J92J38
4092D38l27j29K22q3M3n7R5j03k53J67J65P8q9J00j31O0K12k88J45j70J42j10
4114A27j13P0J56k13K50m73L39o7j14R1K42k01Mj17k4K59j41j90j66M71k41p2
4136a23n4K27k65K79K63k79j29l3J06K1j3j41k2m1Q0L73k24Q9o62M80l15L38k38
$$ plain form
3979 -50 -197 146 387 171 -96 120 -138 60 345 19 37 -155 112 81 220 99 11 -65 -85 69 62 359 194
4002 194 -36 229 -143 -264 237 219 157 51 -145 -69 -182 -202 258 -43 -66 -114 164 27 -110 -103 -70 -234 -405
4025 -405 26 3 -131 -293 -151 -64 -541 -272 -316 -145 -78 -328 -307 -367 35 276 -151 -189 -370 -150 48 -251
4047 -251 -377 46 -64 -246 -559 -40 82 -39 6 -183 -156 6 4 168 -115 -79 45 64 139 -204 -141 -103 -35
4070 -35 -446 43 263 -167 -37 65 -21 -376 -113 254 -143 -89 -20 135 98 31 77 -104 259 108 300 438
4092 438 111 -18 204 121 164 107 202 99 -154 13 178 256 167 267 136 196 408 120 265 95 237 127
4114 127 14 84 240 27 277 -196 143 76 -38 53 295 94 98 -19 -43 216 75 -115 -281 190 -51 -123
4136 -123 -177 50 -215 64 327 48 -81 -114 -8 13 0 -141 -163 -204 -124 249 25 114 -548 -68 -383 -45 -283
4159b83k1K02m11J94L32r2k60L59O9l19J40P6q3O0k49J03Km5J74J34n5k80K14
4182c9M8j1l11J80K55j69m1N5j11K43j18K08J15m78J29o9M2j10K56l37L67l65
4204b61J07N23k48j16J83j5l33K18K3J2k6K9J65n7j10j78L60j11l5M43m04J1l9
4227A41J08k16L32k69J21j51o9J19k9n5M73k81N3jp5p0OQ8m7l8k27j7L91j24l9
4252A24q1O1q0P9q6R3p8q8j84J31M93n21M2K25R3K5l13L1Q2j53J31J02k77p0M81
4277B62l30l11L34K8K19k43l2j00L41j12J52j49k01J24m62M95j40j45O1j02L9
4298b72m9O0J54p4K61j50k32J06k04M84m04K70q6K04l36J66J90k61N0Q1LJ12m73
4321d00K74Q5k74J22K31j38j78K92j28J60J04k97p1L33l4J16m4j64J9j38N37j90
$$ plain form
4159 -283 -304 -102 -513 -319 13 -79 -339 20 89 -230 -90 -14 -97 -37 -286 -183 -181 -226 -52 82 27 -253 -39
4182 -39 9 -2 -313 -133 122 -47 -88 -33 -144 99 -19 189 304 -174 -45 -114 -72 -182 74 -263 104 -261
4204 -261 -154 369 121 5 188 173 -160 58 81 93 67 96 261 204 94 -84 276 165 130 573 169 180 141
4227 141 249 33 365 96 217 66 -3 116 87 32 505 224 277 276 201 131 137 225 178 140 -87 -104 287 163 124
4252 124 43 104 24 103 17 110 32 -56 -240 -109 384 -137 -95 130 223 248 -65 -34 48 -105 26 128 -149 -219 262
4277 262 -68 -379 -45 -17 202 -41 -73 -173 168 56 208 59 -142 -18 -480 15 -125 -270 -209 -311 -272
4298 -272 -321 -261 -107 -181 80 -70 -302 -196 -400 84 -320 -50 -136 68 -268 -102 88 -173 -123 -42 -39 73 -400
4321 -400 -126 -41 -315 -193 38 -100 -278 14 -114 46 150 -147 -218 115 81 197 153 -11 8 -130 407 217
4343B17m04M62k95J51R0j18o4K53n4l1j94K0j13N19m29J4L4K13k84r2J08J14J46
4366B63l09P1K24k44R5J51J29m8j75L5k01j7k46N53m88J22L38J02k60J9j18M50
4388D46k19l34J00P0O7k88L27k61K87l70L52m61K58k32j2M6K31j41K01k80P4J49
4410A0J91l79l3K05k65J36J98j23j17K00j33L53n41L59q0r2k50J11mK07j20o4
4432b31J37j4M0o7R3l32K66mk1j9K89j12M9j55R9j2J42k85j46N7P0J87m8J1O8
4457F2p9j50J24j04L06p3J2j32j26M28j42m28L54K62j29n7M2q4L0K98k49n8j03
4480DJ23L19j79k10k78N14m03K58J93J88o21L06J61l39J88j09J29p5R7j76J88
4501B78K38m17J90j41l67M7L96P2m25r1M39k65j46J09J22L3j96nj0J61J0J38n52
$$ plain form
4343 217 -187 275 -20 131 221 103 39 292 238 207 13 33 -80 439 10 24 58 271 -13 -105 3 117 263
4366 263 -46 25 249 5 100 251 380 332 157 192 -9 -26 -272 281 -207 -85 253 355 95 114 -4 446
4388 446 227 -107 -7 63 130 -158 169 -92 195 -175 177 -284 -26 -258 -270 -224 7 -134 67 -213 -139 10
4410 10 201 -178 -211 -6 -271 -135 63 -60 -177 23 -110 243 -298 61 -19 -111 -361 -250 -254 -47 -167 -231
4432 -231 -94 -108 -68 -135 -42 -374 -108 -112 -133 -152 137 25 74 -81 18 6 148 -137 -283 -226 -156 31 -17 -6 62
4457 62 -17 -167 -43 -147 159 86 98 -34 -160 268 126 -302 52 314 185 128 170 86 116 414 165 107 4
4480 4 127 446 267 57 -221 293 -110 148 341 529 -92 214 375 36 224 115 244 169 266 90 278
4501 278 516 99 289 148 -219 -172 224 296 -129 -220 219 -46 -192 -83 39 72 -124 -129 -139 22 32 170 -382
4524c82K51p9K38j70J06J0j70R4Q0J4q7N6k78P9J36J57n6O9m51K09J54j4m3K8
4548d9n0n7P9j85J76R6j95K8l22M41J20l1o1n6p4j66J59J58j00L89l49q2JJ59
4572B9J32j10n68L16R6l31N57m26L87k26p9M89l16J77j52J3QP5N0l02N7L21K36
4595D33n18j73M54j58j12K71p7j42k0O2J99J62j77l17L90k4m9j52K32J24m40r6
4617a28J67N4m3K43L4Oj32k49N70l96k33J88j03J6J27R5J52k88j66K17K10k88
4639E3j01L90J30o58J37n0J69j67J65j21J43K06k04O6m7k92J23M46o11L10P8k31
4661f6j6J25R1o9k63K65l2j05l99L30K09k65l69M97j23m9J86j21N28n33l8K29
4683A2J86k88J1K1k10k11N08j1j70k24K60P3m28M25m1K0J3p7j18L75k94K25K08
$$ plain form
4524 -382 -131 -210 28 -142 -36 -26 -196 -102 -22 -8 -95 -39 -317 -238 -102 55 -1 68 -383 -174 -20 -34 -77 -49
4548 -49 -99 -156 -77 -262 -86 10 -185 -157 -479 -38 82 51 -10 -66 -140 -306 -147 11 -89 300 -49 -131 -130 29
4572 29 161 51 -517 -201 -105 -436 121 -305 82 -144 -223 266 -50 127 -25 -12 -4 71 121 -181 -124 197 433
4595 433 -85 -258 196 38 -74 197 120 -22 -42 20 219 381 204 -113 277 253 204 52 284 408 -32 -128
4617 -128 39 93 50 293 327 333 201 -48 522 126 -107 81 -22 -6 121 216 368 80 -86 131 341 53
4639 53 -48 342 472 -186 -49 -99 70 -97 68 -53 90 296 92 158 111 -181 -58 388 -223 87 165 -66
4661 -66 -82 43 134 65 -198 67 35 -70 -469 -139 70 -195 -564 -67 -190 -239 -53 -174 354 -179 -217 12
4683 12 198 -90 -79 -58 -268 -479 29 18 -152 -376 -116 -43 -471 -46 -87 -67 -54 -131 -249 126 -168 57 265
4706B65n38J52M2J12l3K05J79m12j79J72K17j81k6J58p0l1k00J22m0P4p4P9J08
4729A01r3P1K51J5l26m7K44K07k26k93r2J76j31K52O0J6j34J87j92l12J90L2P3
4752B9K79p0k40K69r5j25Q0O0k05k6J3j64L97r5jJ80k42L03j60j74n3O9p6p7L08
4777A84M3n6j99m1R4M2j05Q1o5n9Q4l2K9o4j32M0j40J25L3k3kK89n76M29J9j40
4803a42K54k45j19K83p2o6K71j73k4p5K5N5j27L99m94J49N1j12r2L04k48P6mL53
4827B27j29K9j67O4k5J59l58K51j99K16O1m95J77q6K40M0M8j10K12k90j43L31
4849E3k50J81j1j38L59K29m88K9L7N8o4J37n3M3j24J18l11qM19j02j93j30M90
4872B81L7j87J00j10l5Jk41J93j7L04l97P28p59Q8K6M81l36j0L04m42K63n85O07
$$ plain form
4706 265 -273 -121 -79 33 0 205 384 -28 -207 -35 182 1 -25 133 63 32 -168 -46 -86 -12 -86 -7 101
4729 101 8 79 330 345 19 -28 216 423 197 -96 -188 -12 -143 109 169 185 51 238 46 -266 -76 -44 29
4752 29 308 238 -2 267 172 47 127 187 -18 -44 -31 -195 202 107 106 286 44 347 187 13 -40 29 -47 -124 184
4777 184 227 171 -28 -69 25 67 -38 43 -22 -81 3 -29 0 -64 -196 -156 -296 -171 -138 -161 -163 126 -450 -21 -2 -142
4803 -142 112 -133 -252 31 -41 -107 164 -9 -33 -108 -83 -28 -155 244 -250 -101 -50 -162 -254 50 -198 -122 -126 227
4827 227 98 127 -40 24 -1 158 -200 51 -148 68 129 -366 -189 -275 -35 5 53 -57 155 -135 -278 53
4849 53 -197 -16 -27 -165 194 423 -65 -36 1 59 -5 132 79 122 -2 116 -195 -203 216 114 -79 -209 281
4872 281 318 131 231 121 86 87 -154 39 22 326 -71 657 -102 -14 12 493 157 147 451 9 272 -313 294
4895B94j51l02K08j2m7L9k8pr7k25M71Q4j86L39l28L9n8o3L86j87m14K66n1q0
4919a10J18J98j85k44q8K23j26K06L4j88j2k44K65M8N8j50J20p1k6j55J83K09
4941F3q5l31J51R0L93n50K26J86m65L8M11j14j53J3K34N9r6n1Q3k82N5R4j21J94
4965D2j53K05j6k04K77n2j77K89k97j1M03k24J68k57R2L1pp7p8O3K49j51PK04
4989C26r3J6j16l73M29l16K97Pl23J04j87L85rj83O7K34l51M7J56p7n0J7R2k36
5013a37J43j02K29l90K78l5R3K61o14L05O3l7K94l81L40k94K28l37K56k96NP7
5035e1J44p5O7nJ13j46n5k91N67l40Q1m01L21O6l96L80j96J90L27J8q4m34P7N0
5059g3J31p7N4j68j06Q9K69n02K28O3K0p3J04L11k57j55o0K03Q5k93Q9J75Q4o7
$$ plain form
4895 294 143 -159 49 37 -10 29 1 -6 -103 -328 143 227 41 380 52 91 33 -30 356 169 -245 21 -30 -110
4919 -110 8 206 21 -223 -311 -88 -214 -8 26 -162 -174 -418 -153 -105 -47 -197 -77 -148 -174 -329 -146 63
4941 63 -22 -353 -202 -112 281 -269 -43 143 -322 -284 127 13 -140 -127 107 166 70 19 102 -180 -125 -31 -152 42
4965 42 -111 94 78 -126 151 99 -78 211 -86 -97 306 82 250 -7 85 116 109 32 -46 17 266 115 122 326
4989 326 233 249 133 -240 189 -127 170 177 -146 -42 -229 156 147 -36 31 265 -86 -39 117 40 -10 7 99 -137
5013 -137 6 -96 133 -257 21 -14 79 340 -274 31 94 57 351 -30 310 16 244 -93 163 -133 -128 -51
5035 -51 93 18 85 80 193 47 -8 -299 268 -72 9 -392 -71 -5 -401 -21 -217 -27 300 318 234 -200 -123 -73
5059 -73 58 -19 35 -133 -239 -150 119 -383 -155 -92 -72 -145 -41 270 13 -142 -202 1 86 -207 -118 57 141 74
5083G4k04k07M34l61K01J43k87J58M7mk84K98j66L95n45J42K44L0k10J73pK4k5
5106F3k24J94j60L99j56k29J08J09J79l78N38k80J04l84l87N29O3L67m95j51M56
5127B65j28k72P5J09l0l1K85j73j33K01O8k5k72Q1Nj4j88K57k71l7M20l65K93
5150A20m3r6m3k32K81N8Lj06OJ23j15J41R9l34L54l54J31j28j15N2L20Rj95p1
5174a35J76k65K40M1l9L4k55L4O7K25l33M6L26k40j52R7K65j75j21N5K30k28K22
5197A15p2n4j5k35J42J59k71M2J32K34j76j24j03J76J15o7L3k86P5K17K04l03
5219f2J20l0m8j04j2j15J32K66j50jq3Q6K28M3k47L6L3l64K96k2k1o2N0L57m17
5244i1J81k1M9R0J6l49L52k63nN9J9K04k04j54J9j27M15K0j84J06J40l12j14L15
$$ plain form
5083 74 -130 -337 97 -264 -63 80 -207 -49 -2 -6 -290 8 -158 237 -308 -166 78 108 -102 71 64 88 63
5106 63 -161 33 -127 272 116 -113 -5 104 283 -95 443 163 267 -117 -504 25 88 455 -40 -191 265
5127 265 137 -135 -60 49 19 -12 273 100 -33 168 236 211 -61 20 25 11 -177 80 -191 -228 192 -173 120
5150 120 77 -19 -62 -294 -13 45 48 -58 -52 71 -44 97 196 -138 216 -138 -7 -135 -250 -198 122 131 -64 -135
5174 -135 41 -224 16 57 18 52 -203 -169 -102 123 -210 -164 162 -78 -230 -133 132 -43 -164 -109 121 -107 115
5197 115 43 -11 -26 -261 -119 40 -231 -189 -57 177 1 -123 -226 -50 65 -2 31 -255 -180 37 241 -62
5219 -62 58 28 -20 -124 -136 -251 -119 147 -3 -4 -87 -1 227 270 23 59 92 -272 24 2 -19 -81 -31 326 -91
5244 -91 90 69 118 208 224 -125 227 -36 -41 18 37 241 37 -117 -98 -225 190 210 26 132 272 -40 -154 161
5268A61O8p2J27j78q8K08j72mK44l53M7J58N9n8j09l5j96K95L6l00K77j64j6M2
5292b3M2P8n42M37J88r2j32P6J16o17M65Q3m1k02N6p6K3j57m0J83K89j52P6L7
5316G5k63k11K18J03m9J72j99K7J2k36L22j12r5J50L7j61JJ67k20M17m03O0M01
5339B13m18J74K47Lq2k23J07j09K97l45P0K15p9l61O6O9NJ61m6l9j2J30k58LN6
5364a56M8K64k76L28k94J66M5J66q7k24r0J02o0J94j87R3L62n7k62j50j56L60
5386A29R0j61J01J01j54rj13J8J29m6m2J35L9k57J71p6j36L97m2n7k61J47J24
5409B27j37J56l15J89j55L52l19r5K7K61k90j17J44j87L15R1j76Q4NpJ77l73L40
5432A97j60Q8j9l33J56R0J02K49l18l6k70P9j28L1M04N0j77rj13J89k0O4J26k53
$$ plain form
5268 161 229 157 284 106 18 226 54 50 294 -59 -12 146 205 147 38 3 -193 102 138 -162 115 -49 -65 -23
5292 -23 19 97 -445 -8 180 88 -44 32 148 -469 -4 79 38 -164 -108 -184 -161 -318 -358 -175 114 -38 38 75
5316 75 -188 -399 -181 -78 -127 45 -154 -127 -115 -351 -29 -141 -236 -86 -49 -210 -209 -42 -262 155 -248 -188 213
5339 213 -205 -31 216 219 137 -86 21 -88 209 -136 -66 149 70 -291 -225 -156 -151 10 -36 -75 -87 43 -215 -212 -156
5364 -156 -108 156 -120 208 -86 80 125 291 204 -20 -110 -8 -68 126 -61 32 394 337 75 -75 -231 129
5386 129 219 58 159 260 106 97 -16 2 131 85 43 178 217 -40 131 55 -81 316 274 217 -44 103 227
5409 227 90 246 -69 120 -35 317 -2 -97 -70 191 -99 -216 -72 -259 56 147 -29 55 60 53 230 -143 197
5432 197 37 125 106 -227 -71 19 121 370 52 16 -254 -175 -303 -272 132 182 5 -4 -117 72 52 116 242 -11
5456a1m5j12J54m9%m55M06Q6l0M6o7j15Q0M0K1O2j36o5J45lJ51k19J11j85M20
5481B30m0k1k92J10K03j53p7j68M16j83k56K60Q0k62k25L93R4o3J41j47j46pQ3
5504c0kK25l39L73l6j94J04j14Q5J17q0l23L58n2p2L3K45j68k54L1L51j20r9m5
5528fP1l0o3RJ6j03J28jP8k50L4K69Q9jj91k14K63J7j99Q5j34J07J77k06o5Q6
5554c4j46J04K13m38L55j52j16L76J4l13R2k95O50m92k97L51m8j41L70p6Ml83
5576d02P0L10rj25j9J68jj97M8Q4R0j41r7P2j39L5K78m29K44J40o1j05L3j45K55
5601d3R3K8j20J21j80j05N47m66P0j97M55m51k8O19j91p6J00k42j7J65o4J77l87
5624a92m4K53N6R4k71L8M1MK12N8m2n16M35j38r3J43O8O7lo4l59P4K16o4K21o9
$$ plain form
5456 -11 -56 -168 -14 -63 -63 -518 -112 -26 -56 -10 -77 -192 -112 -72 -51 11 -125 -190 -45 -48 103 -116 -5 -190 230
5481 230 190 169 -123 -13 190 37 -40 -208 208 25 -231 29 109 -153 -378 15 109 46 187 40 -106 -113 -30
5504 -30 -32 193 -146 227 191 -3 101 -13 72 189 109 -214 144 92 20 53 298 130 -124 -93 258 138 39 -6
5528 -6 65 35 -28 -19 -3 -106 22 21 99 -151 -117 152 241 240 49 -165 98 115 -84 1 -133 -26 151 -55 -120 -34
5554 -34 -180 -76 137 -301 54 -98 -214 162 176 -137 -45 -340 310 -182 -479 -128 -176 -317 53 -23 -19 -402
5576 -402 -332 -22 -31 -156 -175 -7 -8 -205 -157 -73 17 -124 -221 -149 -288 -253 25 -404 -160 -20 -81 -186 -153 -298 -43
5601 -43 50 78 -42 79 -101 -206 341 -125 -55 -252 203 -248 -276 343 152 76 176 -66 -83 82 18 195 -192
5624 -192 -236 17 73 167 -104 -66 -25 -21 191 249 207 -309 126 -12 -105 38 106 173 170 106 -253 -179 37 -27 194 125
5650A25K64m8l99L1q3j1R9P3%o2J12j10P1J96j08l64K37K8l1j45l3K47k47K72
5674A14l69L53N5k60J62p3l2K24k00l1J61l62L66k93R3l9M57l17j18J07q2J71
5696H7j18j53Q9m0O3J62l6o5j94K07j64j54K54J41l23J27L4K57l74J21J03omr4
5720h0j8k62L54m7J4L28n36P0P9m2RJ84j52N7J7L8o7k46M31j80J32K25k98k32
5744b22K67k85N02l78l0K36j24K58l21j13L46o8l0p1K05o5j43j55J97l0J25k38
5766a37J84N3j31O8j93M14k77ll6J78o6j54Q5K95l09M0K98j71k1r9l9L0O0J40
5790B09j4j71o9J9q5L62n15K70j16LL78n35L10j43J56J13p5k54L30j46k34K15
5812Hl0m3k5r9J85o0P2J15j94r9J54j57L64k17q5P2J15K8k12J57l3J49j49j50
$$ plain form
5650 125 389 341 -58 -27 -110 -121 -22 51 51 -11 101 -9 62 258 150 -214 23 51 20 -125 -158 89 -158 114
5674 114 -255 98 153 -107 55 -18 -50 174 -26 -57 104 -258 108 -185 -92 -131 326 9 -109 -2 -84 87
5696 87 -31 -184 -95 -135 -72 90 54 -11 -205 2 -162 -316 -62 79 -244 -117 -83 174 -200 -79 24 18 14 -80
5720 -80 -98 -360 -6 -53 -39 289 -247 -177 -98 -140 -131 53 -99 -42 -25 13 -54 -300 131 -49 83 308 10 -222
5744 -222 45 -240 262 -116 -146 90 -34 224 -97 -210 136 68 38 -33 172 107 -36 -191 6 -24 101 -137
5766 -137 47 100 -31 37 -156 258 -19 -22 -58 120 54 -100 -15 280 -29 11 309 138 117 18 -21 9 69 209
5790 209 195 24 -45 -26 -111 251 -264 6 -110 -107 271 -264 46 -97 59 172 97 -157 173 27 -207 8
5812 8 -22 -65 -90 -189 -4 -64 8 123 -71 -170 -16 -173 191 -26 -111 -39 76 104 -108 49 16 165 16 -134
5836a34j39J36P1j31K34j63j17K07k82K28J19l7r4j03K58k28k19L24n7J76j23
5857g4J95p4n4l5K05l14O0q6j63M3K53K05k41q8J63lR1l0r4J37O0k70J15J8J00
5882A19j70O9J35l15Q9K81j19m71N49k63M4L1J57J32k24J36M13n69j68L33j29
5903F0O1j34K81l88J45p7P4j42J32J53j64N0o4J10j06M75m16n9K04k16J8J65j24
5926C8J0L3k2nj4K18m51K50ql8JL90m11M7J00q1j16q6N12m44K71j70m2J65j57
5951a0o6K64k02j7j15N8p5j56L38j12J07N1M1l87K73N2j00M13l58j2j05O6j93
5974b45K22L1j04l08M50r3L06l72j65J36j95K60l6j90N03M1m57L20o5J00J7k14
5996e8K9LK7M1J44K4m07L42j50N9Q1j74J02j88k0J67q5L5K43l11O41p36L71j48
$$ plain form
5836 -134 -273 -137 -66 -197 37 -126 -243 -36 -318 -90 29 -8 -102 -205 53 -175 -394 -70 -127 49 -74
5857 -74 121 47 -7 -42 163 -151 -91 -177 -340 -297 -44 161 -80 -168 -5 -8 83 53 -41 96 156 -114 1 19 119
5882 119 -51 18 153 -162 -73 208 89 -382 167 -96 -52 -21 136 268 44 180 593 24 -144 189 60
5903 60 121 -13 268 -120 25 -52 22 -120 12 165 1 51 -13 97 -9 466 50 -9 195 -21 -3 162 38
5926 38 48 81 59 54 40 258 -193 57 49 11 12 402 -9 38 138 57 -59 -145 367 -77 194 24 -18 147 -10
5951 -10 -76 188 -14 -31 -146 -88 -163 -319 19 -93 14 65 106 -281 -8 44 -56 357 -1 -13 -118 -52 -245
5974 -245 -23 8 -96 -404 46 -47 259 -113 -278 -142 -337 -77 -113 -303 200 241 -216 104 39 139 156 -58
5996 -58 -29 -26 1 42 186 210 -197 145 -5 54 135 -39 63 -125 -145 22 -63 -28 215 -96 545 -191 180 32
6020C2L8p2J17j45J87j49J50j08K76j08k74K54jk56K5K36m9j03j50O8q2J15j81
6043a80L76Lj3m97N29J01k08N5j66M7q4m8K11n86M98l8J25l47J32j0Q2J01k39
6066a56L7J69J27j36J20k18J2O2j02rj0J71n8j13k2j29k1J64k0K59j83j4K88q4
6090A34J3l65O5J69k51J10P1k99L53j47Ml7J81j6j23K47j73O1K18j67K8j67k49
6113c40M68m6LJ93Q2l58R0k42K32m26K07J85j02J82m6O3j34J10j86j55L33qo5
6136D0m7j17M5J07K46l00J4k3J67K5o13N65k20K45o2k3J9J37j62N1L11l35m3J27
6160A54l6k51J33k36K75k62J58Q3j6k2K78M7k77J37l71K30J37j51M07l64J83p6
6182A60l57L60j29J26k10J19J7j08J85J02k55j15K20Q6m19M26l23k0J86j58J45
$$ plain form
6020 32 70 -2 115 -30 157 8 158 50 326 218 -56 198 197 -59 -34 202 153 50 -100 -32 -114 1 -180
6043 -180 196 199 186 -311 218 319 111 166 0 47 -37 -85 126 -460 38 0 125 -222 -90 -100 -18 83 -156
6066 -156 -119 50 177 41 161 -57 -45 17 -85 -94 -104 67 9 -104 -126 -255 -276 -112 -132 127 -56 -70 218 134
6090 134 147 -218 -153 16 -235 -125 -54 -353 0 -147 -143 -180 1 -15 -138 109 -64 -3 215 48 76 -91 -340
6113 -340 128 82 85 278 360 2 92 -150 82 -344 -137 48 -54 128 82 145 11 121 -65 -220 113 105 40
6136 40 -7 -124 -79 28 274 -26 -12 -35 132 157 -456 109 -111 134 72 49 68 205 43 94 405 70 27 154
6160 154 118 -133 0 -236 39 -223 -65 18 2 -20 258 305 28 165 -206 24 161 10 417 53 236 160
6182 160 -197 163 34 160 -50 69 86 -22 163 265 10 -105 115 201 -218 208 -115 -135 51 -107 38
6203C8k0m27N89j40k94L05k80K58K55k32p3k6R9r4N7Nj17K06l23M58l01L39m19
6226a37j0K91j39R2j17j51Q3K76k65k49K94J21j31j20L8Lo4J20J14j80K90m7j82
6249g0J29qQ8k48J49j66L06m76K21K02m78M02M8j83L28m28K32l3O1k28J50J7j68
6272a53Q8J75O7J89k69L9J16k04n0L0N7j70k17L59J14k00q4L10R0k18K2j25J52
6295A18k08N04l24m01L08L34r5j59L4j9l9m0M3L23m80K64l8j95J83j75J37j38
6317f3K15R3n51K11J54J04Q4j68m4k08L19l7J57p6j3k52n3j15L48P2m21L96j38
6340A4J42p0P9j70J11j33j17k03J72K27Jk15k35L60nq4p4K35K32l55J26j55L79
6363B62n7j99q1l2l1M0k6N0j59K99l78J88O0o1Q7K41m37L23q0j59k23N11j60K3
$$ plain form
6203 38 18 -409 180 40 -254 51 -229 29 284 52 -21 -47 52 -42 15 20 -97 109 -214 244 -57 282 -137
6226 -137 -147 144 5 97 -20 -171 -88 188 -77 -326 -32 89 -42 -162 -124 -121 -185 -65 49 -131 159 112 -70
6249 -70 59 51 139 -109 40 -126 180 -296 -75 127 -351 51 99 -84 244 -184 48 15 76 -152 -2 15 -153
6272 -153 -65 110 177 366 97 136 252 48 -2 28 85 -85 -302 57 171 -29 -113 197 287 69 91 -34 118
6295 118 -90 414 90 -311 -3 331 236 77 111 92 53 13 56 379 -101 163 125 -70 113 -62 75 -63
6317 -63 152 245 -306 -95 59 163 247 79 35 -173 146 109 266 190 177 -75 -128 -243 105 177 -244 152 14
6340 14 156 86 165 -5 106 -27 -144 -347 -175 52 53 -162 -397 -37 -42 -126 -200 35 267 -88 38 -117 262
6363 262 205 6 -75 -107 -138 -98 -124 -74 -233 66 -312 -124 -64 -125 -38 203 -234 89 9 -150 -373 138 -22 1
6387AJ36j19q5K08n37J91M48n24J31O6J95k06j01L15j72M7L4n2L4M8k56K62k46
6410a82K84j85K04k47L33l17J90p5J0O4j84K67o7P6j21lp7r8J41K75k11j2q1N5
6434C9nK06j1m0j76N2r8R5Q0l67K24J18k22L9k49J86J56j84J66o8J04j10p7K9
6458a13oJ34k09J24n6L9j12J15J66l93M57rk95L85m48J0K65k16J78k29L92k21
6480d2K91l17j07j8J59L6O3J68k51J82l29l7r7L67k51K08L11m97L49k45K32k81
6502a06J5J62K2k05M9Om9J17j0J95k44J85l08m0M08oj63k30j3J95k92L05o0lJ11
6527D1k61L27k04j96L17r8n3m7K22j69L39k89j3o5OM1K00p4nM1k69K31J50l01
6551a29J35J05j50j54J44m7kk8J90j62q7Q6J36J07K8j08M0j37J85k10l1N1n4J56
$$ plain form
6387 1 137 18 -67 141 -396 -205 243 -281 -150 -84 111 -95 -196 119 -53 -6 28 -24 10 58 -198 64 -182
6410 -182 102 -83 121 -126 207 -110 80 5 15 79 -105 162 95 171 50 47 -30 -128 13 288 77 65 -16 39
6434 39 34 240 229 189 13 65 -33 62 142 -225 -1 117 -105 -66 -315 -129 27 -157 9 -59 45 -65 -142 -113
6458 -113 -119 15 -194 -70 -126 -87 -199 -84 82 -311 146 137 -158 227 -221 -211 54 -162 16 -213 179 -42
6480 -42 249 -68 -175 -193 -34 2 65 233 -18 164 -165 -202 -299 68 -183 25 336 -161 188 -57 175 -106
6502 -106 -91 71 93 -112 -63 -57 -106 11 1 196 -48 137 -171 -211 197 191 28 -202 -215 -20 -312 -7 -67 -70 41
6527 41 -220 107 -97 -293 24 -74 -127 -174 48 -121 218 -71 -84 -149 -143 -102 98 24 19 60 -209 22 172 -129
6551 -129 6 111 -39 -193 -49 -96 -98 -126 64 -98 -185 -99 37 144 172 64 104 -33 152 -58 -89 -38 -92 64
6575F4k40K18J21M0j78j4J01J91l06m6J32J03j83j34k0J81l14j62N03l29K94L1
6597E3j91K16J6K03j93l49N5P3K83j63j0j7R4J10j43L6r6M9L4k08L25k58K47k98
6621a32M6K01R6l15J38m5j62K9K20q4n0r8pQ7q5L42o0k53K63N9j74L0R3j01o1
6646b3j1J17j38J0j69J59K85o0k38j6K09J71k37K01k90J97k16O5J65k75K28k7
6668A07r2N8j5K26l11Q5j03j15M4j09M51l03J10N8l41L32o5j14m8K17k54O7m1
6691a56p0L63j92K82k97O5M5k64M57q9j44K39j11j97K75l47L31k90J01Q0r5j75
6713a89N13m86J30k57J45J06M58l82j50M56k31j36N1K41j65j02J33j62J68J44
6733B85l55J47Q4q9j14k91N55j3n91J76K23J21k23P8J98n97J93O6J09j83R9m9
$$ plain form
6575 64 -176 42 163 203 25 11 112 303 -3 -49 83 186 3 -131 -151 30 -284 -446 57 -272 22 53
6597 53 -138 78 94 297 104 -245 -190 -117 166 3 -7 -24 70 180 37 73 -23 26 60 -148 177 -81 166 -132
6621 -132 -86 115 211 -104 34 -11 -173 -144 76 -8 -58 -156 -163 -76 -161 181 121 -132 131 190 16 46 139 38 -23
6646 -23 -34 83 -55 -45 -214 -55 230 170 -68 -84 125 296 59 260 -30 167 -49 16 181 -94 134 107
6668 107 15 73 58 284 -27 58 -45 -160 -116 -225 226 -77 33 91 -250 82 17 -97 -145 72 -182 -115 -156
6691 -156 -226 137 -55 227 -70 -5 40 -224 233 144 0 239 128 -69 206 -141 190 -100 1 81 -14 -189
6713 -189 324 -162 -32 -289 -144 -38 420 38 -112 344 113 -23 28 269 104 2 135 -27 141 285
6733 285 -70 77 161 72 -42 -333 222 209 -382 -206 17 138 -85 -7 191 -406 -213 -147 -38 -221 -122 -171
6755a71J84J19j25n6L45k43l32P7n3P80m75j01J06j48Q1J30m12K25K39j81J03
6776I2j07j01P3L1J05qk4J05k32J66l80M04j49J29n4j12r2J37J82M2j58K4P5k49
6800a01l2n7n5M75j5n8q3J61j56l6Q8j26Q3n9J71m41L98j33J0o7L5r8J35k36Q0
6825a17j42J2J85J17J8p4kkK2PN1j53Q0K28j02L27j90k90J68j93J13k42K51o7
6849Ek3J3J17j03K09k62K56n02J74P4J8k15L11k30L57l33J82L0n2k43j24J55K76
6872I0Ok69q3n7J87j3J10l3pq3K04j42m7Q1R1K5q1k21K12N6l1Q5j36J8j30J52
6898a6j89K10O3l3ml20K30K4q7j30K01m5l1K70k18O9o3J95k05MJ19KJ20K7j80
6923A3J43j48N9J96l61m6P3j16J89J37j99r6l5Q2M31m17M6L02j88P8m9n5n4K43
$$ plain form
6755 -171 13 132 7 -49 296 53 -279 -202 -255 525 50 -51 55 -93 -12 118 -294 -69 170 -11 92
6776 92 -15 -116 -43 -12 93 85 61 166 -66 100 -280 124 -25 104 50 -62 -154 -17 165 207 49 73 148 -101
6800 -101 -133 -190 -245 230 215 157 74 235 79 43 131 5 88 29 200 -241 157 24 34 -33 2 -96 39 -197 -117
6825 -117 -259 -247 -62 55 73 -1 -3 -5 17 24 75 -78 2 230 128 455 265 -25 143 -50 63 -179 72 5
6849 5 -18 -5 112 9 218 -44 212 -290 -116 -42 -24 -239 72 -158 199 -134 48 78 26 -217 -341 -186 90
6872 90 96 -173 -256 -313 -126 -139 -29 -62 -69 -152 52 -90 -137 -56 35 60 -21 -242 -30 26 -5 80 -56 -38 -168 -16
6898 -16 -205 5 68 35 31 -289 -59 -35 -122 -252 -51 -96 -127 143 -75 -6 -69 126 -79 -75 44 46 166 193 13
6923 13 156 8 67 263 -98 -144 -71 -187 2 139 -60 -156 -191 -109 322 -95 -49 253 65 143 94 39 -15 228
6947B28l45L61n8m9k24J86r2p5N2J26j32J09j94o8M3K27l19J20j7m1J76j3J39
6970A40k04J78l21J69J4O2r9J23k12q7L44j27J43k96K23rJ53N2j07p2k5%l8j96
6994a92L20m30M99m11K19J2q0J23J43l46J8P4K47k31N0K83j90P4j00k1R3m66L13
7017AP4K0J38k65kj47j79J02M23l72L22j3K41j89k87k9J21J59J5j19J23j90J51
7040I8k05O5p7rn3l0L42J5k24k59L70M2l51K7N9J52P9J33j54pJ24k94L53k83k4
7065a11K32l5k3k19K64m79M31j54M39k68r2O6j8L9j02J05j21j9n5J79J21k57n0
7088a27o3K66j93K22n7j58K61l93J76N37l95P6J02m17K05l07K89%r5mr3k3L69
7111A78J40m18J93j62O5J21j61M5K40n9j79J48k06J63j1k90m8J24Q1o6K03n44
$$ plain form
6947 228 -117 244 186 137 -87 99 7 -68 -16 110 -22 87 -107 -175 -132 95 -224 -104 -121 -162 14 1 140
6970 140 -64 114 -207 -38 -24 38 -61 62 -150 -237 107 -20 123 -173 50 41 194 246 139 67 42 42 4 -192
6994 -192 128 -302 197 -214 5 17 -63 60 203 -143 -125 -51 196 -35 15 298 108 182 82 61 154 -312 1
7017 1 75 95 233 -32 -34 -181 -360 -258 165 -207 115 102 343 154 -133 -162 -41 118 133 14 137 -53 98
7040 98 -107 -42 -119 -128 -181 -211 131 146 -78 -337 33 75 -276 -249 -190 -38 41 174 20 13 137 -157 196 -87 -111
7065 -111 121 86 63 -156 108 -371 60 -94 345 77 -15 51 33 72 -30 75 -46 -65 -120 59 180 -77 -127
7088 -127 -190 76 -117 105 48 -110 151 -242 -66 471 76 152 254 -163 42 -265 24 24 -71 -75 -168 -191 178
7111 178 318 -100 93 -69 -4 117 -44 1 241 182 3 151 -55 108 97 -193 -241 -117 -36 -102 101 -443
7133d43K44pK10r5J43k53p9M11k58N3J32pJ38k35nl6L61k30K48m48J19QJ8Q1J
7158G1lj58J39J08l76J50K42k27P8K10l3j17j60L1K53l20m5K27J10Q5K5l6l82
7181a28j00M04j25J7Q6l18L66k29M9N5j34L26k04N9K9M0j56J29k39J16l24L25
7203D4J20m2l84K01J25j02K28j25k37K88j46Pr9J17k9j06K71k72J69N3j05K26
7225B02j6o3k7k46j11M7M08l08n1K17j41j03J68J39j49J42Q6J03k09j73o2J86
7247C9k37M4q6K1L38k44N7j41R8P6j18J34j20K53J03k21OJ64j16m0J33k53J60
7270E0k01p4L08k7k45K23r8K06n7m4J62k28K00k74k32L89k80J00r3K19k6k42J04
7293a60J62Q8K08l23L08N7m55K07Qj55J77j98J08q3K71q8k97m8j37M51J36k10
$$ plain form
7133 -443 -199 -206 4 -91 52 -201 -280 131 -127 -74 58 51 189 -46 -51 -87 274 44 292 -156 -37 -29 -11 70 71
7158 71 68 -90 49 157 -219 -69 173 -54 24 234 201 84 -76 -45 208 -112 -157 70 180 265 290 254 -128
7181 -128 -228 176 51 68 154 -164 202 -27 22 77 -57 269 65 124 153 193 37 166 -73 43 -281 44
7203 44 164 122 -262 -61 64 -38 190 65 -172 116 -30 -23 -122 -5 -34 -140 131 -141 28 81 -24 202
7225 202 186 123 96 -150 -261 -214 194 -114 -165 52 -89 -192 -24 115 -34 108 194 297 88 -85 -147 39
7247 39 -198 -154 -240 -219 119 -125 -68 -209 -111 -35 -153 -19 -139 114 217 -4 2 166 50 10 143 -110 50
7270 50 -151 -225 83 56 -189 34 -64 142 85 41 203 -25 175 -99 -331 58 -222 -122 -215 4 -22 -264 -160
7293 -160 2 90 298 -25 283 340 -115 92 100 -55 122 -76 32 -51 220 132 -165 -213 -350 101 237 27
7315B7Q6m5J23Q2k65mm8r7J31j7J61mj96K15o2j32j66K31k26K39m8j04J31j87
7339a75P2J69r5L10m61R7k40K68K4m1L8p7L52n24J40Q7J0n5K82r0n5k27m3M01
7363A67o0o6r1J47J0l70L65L93l97P5k25J55M9k20j39K84Kj58J45J12k38J86q2
7386D4N9O5l4j55K86l17k28M51q7n4j68m3L27j6n0r7PL3Q1m5o2J0j70n9K05N7
7412D0j32K23n5J03k15L51k12k02N6K7J6m8NJ0m1m9L1J00J79k31J8K41m66J4L26
7437H9k70K77j86K22l3j73J56Qj69j5J75J81j92k08L17rL7n09K27k32K80p4j25
7460b26K34j31K0J68N2q1k64m4K80j31J46m4J46N1m2Rm2K10j19k35J02L37m00
7483dk3j34q9M91q0J27j27k20J59M0l3j41k6K45M0o0k45n3R8J61k47K00l17R8
$$ plain form
7315 27 113 68 191 273 8 4 -44 -141 -10 -27 134 130 -66 149 87 -45 -211 20 -206 33 -15 -119 12 -175
7339 -175 -103 66 -29 281 -180 -83 -323 -55 -31 -72 -34 -111 241 -283 -143 -56 -46 -101 181 91 36 -191 -234 167
7363 167 107 41 -50 97 107 -263 102 495 98 173 -52 103 152 -68 -207 77 79 -79 66 178 -60 126 44
7386 44 103 168 134 -21 265 -52 -280 171 84 30 -138 -181 146 130 80 -17 -10 23 104 59 -3 7 -163 -222 -17 40
7412 40 -92 131 76 179 -36 315 103 -99 -43 -16 0 -48 -43 -33 -74 -123 -92 8 187 -44 -26 215 -251 -237 89
7437 89 -181 96 -90 132 99 -74 82 90 -79 -94 81 262 70 -138 179 170 207 -302 -75 -307 -27 -101 -226
7460 -226 8 -123 -103 65 117 36 -228 -272 8 -123 23 -21 125 176 134 143 101 311 192 -43 59 396 -4
7483 -4 -27 -161 -250 241 161 288 161 -59 100 140 107 -34 -60 185 225 165 -80 -133 -35 126 -121 79 -238 -140
7507a40K98j17n1j65J79p3Lo8K28k42K13l6k38J05N8O0l87N82k07P7M4l5J05l46
7531a53J29j24N2N0K8R1j73J45j17K31n2l9J57J45m28r9J87k30K0k3j38L73j4
7554A8O6J55k15l2N2J56k15J56L5m21M23n1r8k3K37m62M02j73J42j04M5j73M1
7577c9J37j29M5l10R5j44K73P4l01L40L57l45K31k70J29k27LnL45l40J12O2q5
7600HJ8J40q1K35o40K50j33K32j06K18j0j8qK0j11R8j59J54k82L7R4J39K21l43
7624b7k24K37P6M3o2j84K43l94O2K30j4M45n21j13Q3J93l2q3K35n0q9p9K9j10
7648a06M11m52m8L36l01K61j02k62K24j57K84p8q2RJ24j70P0l3p9Q5L41o8Rk83
7672f7R3L3m3Q0r4k43M7L47n57J64K00l5O2J18n8l92K77K1k74K27K6K23M4l34
$$ plain form
7507 -140 158 41 -10 -175 4 -69 -66 -134 94 -148 65 29 -209 -104 -46 14 -373 209 2 79 123 88 193 -153
7531 -153 -24 -148 -96 -46 -18 73 -100 45 -72 159 107 68 225 370 -58 -157 30 -200 -180 -203 -341 32 18
7554 18 84 239 24 -8 44 200 -15 141 176 -245 178 127 29 6 243 -219 183 10 152 48 93 -80 -39
7577 -39 98 -31 14 -296 -201 -345 -72 2 -299 41 398 53 284 14 143 -84 -81 -86 259 -81 31 93 8
7600 8 26 166 85 320 -320 -70 -203 29 -77 141 131 113 105 125 14 112 -47 107 -175 -138 -44 95 316 -27
7624 -27 -251 -14 62 105 43 -141 102 -292 -230 0 -14 431 -90 -203 -120 73 41 -42 193 143 54 -25 4 -106
7648 -106 305 -147 -195 141 -160 101 -1 -263 -39 -196 88 10 -72 -63 61 -109 -39 -72 -151 -66 275 207 216 -67
7672 -67 26 59 16 96 2 -241 -194 153 -404 -240 -40 -75 -13 105 47 -345 -68 -47 -321 -94 -68 155 199 -135
7696a35K06K38l86L78L1l75QM4J7J94l33K4l65N92p3k56J35J49nj86L45m36K59
7719G0k37l0K44j47J85r9r2K02j13K27p0J8K6J24j48l1j29j28J5J5J48k83K12
7742b1J53l12q1K01n6oL16k29j56m0L68n01J26K56lO2j41j92K41k97K9K12K09
7765A38j29k07K72k51L21k02j15M57p3k62J62j61L02j50k52J59n1M01m16n9K45
7786A29J6L6r6k9J49O9L5j81J12l08K82q9m93M13k5l3q9q1L74j58J1K89k54k4
7810E5l6l8l1P5R6q2j15K22j25j86K79pl29J96j51L29j91k16L56l8j03J18M8j36
7834a0Q1o7q5j7k9K04j13K6j51J97P6j33jR1J81m47L30l6n9k45J96O4K72j37l37
7859a49J80j33M4J30O7q2j70J42P5m39J39K55j66J79j8K03k80L12k82l26L27j55
$$ plain form
7696 -135 71 309 -77 301 332 -43 -35 9 26 220 -113 -89 -454 138 65 -191 -56 93 88 -98 247 -189 70
7719 70 -167 -197 47 -100 85 -14 -106 96 -17 210 140 158 184 308 160 129 0 -128 -113 -98 50 -233 -21
7742 -21 132 -180 -261 -60 -116 -122 194 -35 -191 -231 137 -364 -238 18 15 77 -64 -256 -15 -312 -283 -71 138
7765 138 9 -198 74 -177 144 -58 -173 284 211 -51 111 -50 252 102 -150 9 -42 359 -57 -116 129
7786 129 145 181 85 56 205 274 309 128 240 -68 214 125 -368 45 20 -13 -102 -183 191 33 44 333 79 55
7810 55 19 -19 -50 25 121 39 -76 146 21 -165 114 107 -222 -26 -177 152 -39 -255 101 63 -40 78 126 -10
7834 -10 71 4 -81 -98 -127 77 -36 -10 -161 36 112 -21 -22 69 250 -197 133 97 38 -207 -11 53 325 188 -149
7859 -149 31 -102 -58 72 139 57 -113 29 104 -335 -196 59 -107 72 54 257 -23 289 7 -319 8 -147
7881a47J00M34n23l5K21l50K46N6l1K20k73M0M4k31R5J61J12j44L52l13k4K13
7903B23j18j13j62JJ61j0M28o95J6K24k53K57NK01Pj17n4k32M05l2l81K77m6J26
7927A18j60J00J59j36K6K7j2l53J88j70K61K06n12K27L6j54O6j74K99j51K13j11
7949gl7K64k28J65l12j6J8L15j31K04l15M0k14L54j86nM13n50K78P4j93j55O6
7972a58J16J50j04JJ31kl35K54J21k98J4J28P9k33K30j98J81N1j65K01j8m02L99
7995A43j78K32l12n0J15pJ37M1j46n5J32J10j30L02j36m34J92J46j89J63k47R3
8017g8L22l88n7K90j01j51K54k60M51l40N8j9k3j10K09R1j23K37l99K48j06PK06
8040B18Ok72r4p9J39J22J83k87J47K3k57J09J75k87K86k49L75j51p0K35l19Jj09
$$ plain form
7881 -147 -47 387 -136 -171 50 -300 -54 2 -29 191 -82 -42 2 -229 -134 27 139 -5 347 34 10 223
7903 223 105 -8 -170 -169 -8 -18 410 -285 -269 -45 -298 -41 -36 165 172 55 1 -231 174 142 -239 38 -8 118
7927 118 -42 58 217 81 107 134 122 -231 -43 -213 48 254 -258 -31 5 -149 -83 -257 42 -109 104 -7
7949 -7 -44 220 -8 157 -155 -171 -153 162 31 235 -80 -40 -254 100 -86 -91 322 -228 50 124 -69 -224 -158
7972 -158 -42 108 4 5 136 134 -201 53 174 -124 -110 18 97 -136 94 -104 77 128 -37 164 146 -256 143
7995 143 -35 197 -115 -165 -50 -57 80 121 -25 -80 52 162 32 334 198 -236 -44 102 -87 76 -171 -78
8017 -78 244 -144 -201 89 -12 -163 91 -169 282 -58 0 -19 -42 -152 57 148 25 262 -137 111 5 12 218
8040 218 224 -48 -142 -221 -82 40 223 -64 83 106 -151 -42 133 -154 132 -117 258 107 37 272 -47 -46 -155
8063a55P7K27j90K48l33K40j35J97k18j93OL9L9K01j96o1o4L54k60K50k25J70
8085A8K14k78J9K38l88Q0J64K35j96j48J97k97L23n16J74P9J86q4O7J54J64n62
8107a57L76j83k55R9J7O4j42L6L86J0k27r0M0l11L84j40Q4J2J55j28j00K28r8
8130F0M3m2MM2k73LJ80Q5k83K42j32jJ60k25L08j20k70N0P2J20j56J33l4J1J22
8155I9m4j50K54j80J16j36k7R4K47j23k41K0j03J40J45l21p3M11k25O1J40j49
8177d5Q4N5j06mm9j45K72m50O21j79j84L94m53L23
$$ plain form
8063 -155 -78 149 -41 207 -126 114 -21 176 -42 -235 -229 -190 -151 50 -146 -207 -271 83 -177 73 -152 18
8085 18 232 -46 -27 211 -177 -97 67 302 106 -42 155 -142 181 -335 -161 -82 104 20 87 241 405 -157
8107 -157 219 36 -219 -120 -103 -39 -181 -145 241 251 24 -66 -26 -337 47 -93 -9 3 158 30 -70 158 60
8130 60 103 61 65 107 -166 -163 17 102 -181 61 -71 -72 88 -137 171 51 -219 -169 -97 23 -133 0 -34 -23 99
8155 99 55 -95 159 -21 95 -41 -68 26 273 150 -91 -71 -174 -34 111 -210 -283 128 -97 -36 104 -45
8177 -45 39 94 -12 -16 -65 -210 62 -388 233 54 -130 264 -189 134
8191A34
$$ Imaginary data points
##PAGE= N=2
##DATA TABLE= (X++(I..I)), XYDATA
0@%%%pJ5j5J5j7K5l2M0n6O7p6R1j14J41j66J95k34K74l16L68m27M94n65O42p32
28c90Q34r43J061j194J339j499J674j866K077k306K559k839L146l483L857m271
44b244M730n245N826o488P244q114R138j0363J1858j3725J6137j9397K4067l1354
58a7930M4405p4862K68476J44492o01856j6742L69586P7077l40182p243K82569
69A27790J5097l01499k291K83817P7181k12640n5655J13382l3640j55160P4815
80f8803K04679k5345k15785j0621J91418N3794j38166l3298J06179k1565j76276
91a33789j3248K14161J04528j68392j36424J13554J33266p6399r5506P9990O0117
102H1858j42809j05980J48215J54108r6833j22070J01180R8002j39013j14989
$$ plain form
0 0 0 0 0 -7 8 -7 8 -9 16 -16 24 -32 35 -41 50 -64 77 -89 106 -128 146 -170 198 -229 265 -300 342 -390
28 -390 444 -499 562 -632 707 -792 882 -984 1093 -1213 1346 -1493 1653 -1830 2027 -2244
44 -2244 2486 -2759 3067 -3421 3823 -4291 4847 -5516 6342 -7383 8754 -10643 13424 -17930
58 -17930 26475 -48387 220089 364581 -237275 -254017 115569 192646 -147536 -154779 127790
69 127790 142887 -158612 -160903 122914 200095 -12545 -68200 45182 11542 -143618 -68803
80 -68803 135876 110531 -105254 -115875 75543 129337 -8829 -42127 64052 42487 -133789
91 -133789 -147037 67124 171652 3260 -133164 -19610 113656 37257 -58249 21741 81858
102 81858 -60951 -166931 -18716 135392 38559 -83511 17669 115671 -23342 -138331
112a38331J54030J35012j59130j65977J25156J55592r1358r0972J39172Q0214
122A43408j93842j25328J88558J44267j78743j57174J63627J62711j42447j49096
132a44059J51345J71771j30024j95546O3669J55230m1505j12942N4121J04799
142G6859n4268j01520N6023J15190l1258j11910o349O2484j9116m8791O2877R5129
154I5350n2209j30160K1159J43358J3568j36665l9050J12929K6083j27311k8940
165a01888J60291Q6915j31287j17040P1624Q9045m3958m3476N0055N067r1688
176f6340r075J24507N1469r3323n0725O0938P350p8410J0528J06879o8j22728
188e8998k5674J12799M8847p0178k2978N6495j4589r2921M18J09885L6694q6989
$$ plain form
112 -138331 15699 150711 -8419 -174396 -49240 106352 14994 -75978 63194 143408
122 143408 -50434 -175762 12796 157063 -21680 -178854 -15227 147484 5037 -144059
132 -144059 7286 179057 49033 -146513 -82844 72386 30881 -82061 -27940 76859
142 76859 22591 -78929 -22906 92284 61026 -50884 -57233 5251 -13865 -62656 221 95350
154 95350 43141 -87019 -65860 77498 91066 -45599 -84649 28280 54363 -72948 -101888
165 -101888 58403 145318 14031 -103009 -31385 57660 13702 -29774 20281 25348 -66340
176 -66340 -75415 49092 100561 7238 -43487 17451 24801 -53609 -43081 63798 63730 -58998
188 -58998 -84672 28127 76974 6796 -16182 40313 25724 -67197 -66779 43106 79800 -7189
200g189n4476N1842M6201k2273j1355L4959n150p3151l4551O5909O9953k2537
212C8182o1220j485L8786J479k2083J6112K7879l2352n7601J1760O0687Q694l5639
225f801Q978L4337l0253n6114L2242P6779k0300r1887r580P8197K4636m8318o527
238a4611M4961n768n4489p62M9524L398m1816n155K8791k943j8669K2239L1117
251C5817k1124m0022N903K6593q609k1054J5441K5756j3230k9197P882L3996R676
264B7828k6064k1745M301J2015j440o868P879J6305j710j7196l913J4586N105
277I083j1588l491N353j0014j4738J6637L3600j808l1854o910K1831J577j7874
290a0196M560J7785j2883k8168J2034L8843M014k6652n539J3631p189j8993J0965
$$ plain form
200 -7189 -61665 -9823 36378 14105 2750 37709 32559 -40592 -75143 -9234 60719 38182
212 38182 -23038 -24523 14263 15742 -6341 9771 37650 5298 -52303 -40543 20144 28838 -6801
225 -6801 2177 36514 6261 -49853 -17611 59168 38868 -53019 -62599 15598 40234 -8084 -14611
238 -14611 30350 24582 -29907 -30669 18855 22253 -19563 -24718 4073 1130 -17539 4700 35817
251 35817 14693 -25329 -19426 7167 -1442 -22496 -7055 18701 5471 -23726 -15844 18152 27828
264 27828 1764 -19981 -15680 -3665 -5105 -11973 -4094 12211 10501 -6695 -10608 3978 9083
277 9083 -2505 -5996 -643 -10657 -25395 -8758 24842 23034 -8820 -15730 6101 7678 -10196
290 -10196 -5636 12149 -734 -28902 -16868 21975 25989 -663 -6202 7429 240 -18753 -7788
303g788K6879n881k9327m685K4226J4090n221l371J76j2193j5841M853K2901J0610
317A9428j4093j6678K825J5437P217l676l100k330j2428j1967J1283K3192J996
330A7106j9565n313J5323K932j2739L340J7063j0295l0930m8L4038J3379k1647
343B644r623J5242K93j9093N052K5790n051l3996o048K9127J2713j7723k883J8422
357A4866l287k6166j385K6620M963k4582q954J9645P537j5284j31K1186J688k6566
371i850j1065K1458J3267j6848j3632J4460J2728j2338j0441J6942J2831j8852
383a340j9577J2264J8940j0658j6125J2712J8547j3053j9760J4414K2216j2916
395E664k5588R109K1774j1247k0638J5625K5899j3339k8676J0805K8618r323k7789
$$ plain form
303 -7788 19091 13210 -16117 -20802 3424 17514 12293 8922 9098 -3095 -18936 -14083 8818 19428
317 19428 5335 -11343 -8518 6919 14136 10460 7360 5030 -7398 -19365 -8082 15110 17106
330 17106 -2459 -7772 7551 10483 -2256 1084 18147 7852 -23078 -23126 10912 24291 2644
343 2644 -6979 8263 8556 -10537 -5485 20305 15254 -18742 -24790 4337 17050 -673 -3556 14866
357 14866 11579 -14587 -15972 10648 15611 -8971 -17925 1720 9257 -6027 -6158 15028 16716 -9850
371 -9850 -20915 543 13810 -3038 -16670 -2210 10518 -1820 -12261 4681 17512 -1340
383 -1340 -20917 -8653 10287 -371 -16496 -3784 14763 1710 -18050 -3636 18580 5664
395 5664 -19924 -10815 10959 -288 -20926 -5301 20598 7259 -21417 -10612 18006 8683 -19106
408a9106P856K5398j0263k6210J1961K9924o990k7606O039K3704q309k5253R576
421i279K6519r230k7890P048K9807j991k5742J987K2733m848k5308M220K6663
434A4689q48k6518j267K5924M183k2119k854K0850Q12k5158l197K5996P421k2935
448e021q220K1486P642k0554n495K3390N114k7905j0961K6258J4993k1723j2457
461a3453K0835J1178k3174j1562K4930J3728k5102j7747K1273J6614j7822j2267
473a2569K0417J1939k3119j4814K2141J5950k0557j6996J7722J4611j7391j1913
485a4579K0872J4433k1259j9185J6867J9004j3359j7106J1270J4378j2478j3518
497a4660J5532J6337j3461j9121Q293J6079q492j3410J1427J4977j3621j8448
$$ plain form
408 -19106 -11250 14148 3885 -22325 -10364 19560 12570 -15036 -8997 14707 6398 -18855 -9279
421 -9279 17240 8010 -19880 -12832 16975 14984 -10758 -8771 13962 9114 -16194 -11974 14689
434 14689 13841 -12677 -13944 11980 16163 -5956 -8810 12040 12852 -12306 -15503 10493 17914 -5021
448 -5021 -13241 8245 15887 -4667 -10162 13228 18342 -9563 -20524 5734 20727 -996 -13453
461 -13453 7382 18560 -4614 -16176 8754 22482 -2620 -20367 906 17520 -302 -12569
473 -12569 7848 19787 -3332 -18146 3995 19945 -612 -17608 114 14725 -2666 -14579
485 -14579 6293 20726 -533 -19718 -2851 16153 2794 -14312 -3042 11336 -1142 -14660
497 -14660 872 17209 3748 -15373 -7080 8999 507 -12903 -1476 13501 -120 -18568
509a8568J2068K2651o611k2475K337J7358m255j7188O879K0334m957k1376K004
522a1799K0271m82j6653K073J4071p739j7073R050K2219m849k2486K086K0358
535I047j717j8570K870J8490m094k0354R98K0782M037j4619l128R233j291r132
549g448M374J2121m631j4956J670J4910K065j1551m68J1261o69j4291l148J5319
563D558Q415j2150j0517O982R505l032n176M828K593p811m718Q051N724p307l365
578c420R364K166j2341l066J5500P136j6917j1947J3370J2539q666j1032Q194
591H80R255o925p863N279N412m599k183M681k500p397M513J2518k513j5416j222
606h080J4028L743j1750m933Q856N373o366n909L105N654J497l544m852j924L571
$$ plain form
509 -18568 -6500 16151 9540 -12935 -10598 6760 2505 -14683 -7804 12530 7573 -13803 -11799
522 -11799 8472 7990 -8663 -6590 7481 -258 -17331 -8281 13938 9089 -13397 -11311 9047
535 9047 7330 -11240 -8370 10120 6026 -14328 -13330 7452 11489 -3130 -6258 2975 1684 -7448
549 -7448 -3074 9047 4416 -10540 -8870 6040 8105 -3446 -3914 7347 6678 -7613 -10761 4558
563 4558 12973 823 -9694 -2712 6793 3761 -1415 3413 6006 -1805 -6523 1528 7252 -55 -3420
578 -3420 5944 8110 -4231 -7297 8203 15339 -1578 -13525 -155 12384 3718 -7314 880
591 880 10135 3210 -4653 626 6038 1439 -744 3937 1437 -5960 -1447 11071 8558 -6858 -8080
606 -8080 5948 9691 -2059 -6992 1864 7237 871 -5038 -1933 3721 5218 1674 -3178 -5102 -1531
621a531M952p95m062p20J739L35r08N2j12J153R27j455n277N68Q690L706q915
638a653p753N440Q019k793o308J434M049r02k194J153K30o27K768J396p884m691
654a0316Q535J0787n652j2281R88J0020K883n625k272l72p13K211L546k735m337
669e333N699P635p220j2137M557J5435p20j4652l622J0424N105m161k480K071
683F01K34o11L96k587k224N121O713o173j1239M830J5757M04j4647n753J0016
698H38O588o169o328L163N178J461k193k874q07L804M212k969q461j862P871P037
714H489l091p737j357O676N289l551q114n1O805J362p220j694Q153M255o547l795
730b128M507J256n117m04O058k209q024K882J0933j838j0552K087J0590k863j2844
$$ plain form
621 -1531 3421 2626 -1436 -2156 -417 -82 -990 -938 -1050 103 1030 -425 -5702 -5134 3556 7262 -1653
638 -1653 -9406 -3966 4053 1260 -5048 -3614 435 -467 -2661 -1508 -1278 -1905 863 2259 -5625 -10316
654 -10316 -1781 9006 3354 -8927 -7939 2081 4964 -661 -2933 -3305 -4018 -1807 1739 -996 -5333
669 -5333 366 8001 781 -11356 -6799 8636 7916 -6736 -10358 66 5171 1010 -1470 601
683 601 835 224 620 -1967 -4191 930 7643 1470 -9769 -4939 10818 11222 -3425 -9178 838
698 838 7426 1257 -5071 -1908 3270 4731 2538 -336 -1143 2661 6873 3904 -4557 -6419 1452 8489
714 8489 5398 -2339 -3696 2980 8269 4718 -3396 -3447 3358 4720 -2500 -4194 3959 8214 1667 -2128
730 -2128 2379 3635 -1482 -1886 4172 1963 -6061 -3179 7754 5916 -4636 -2549 8041 5178 -7666
745g666Q96J1934J050j1061k030Q913L697m186j913L04k150l25M917j66q407k231
761h424J0779O551r301q904O665J1202l610j2759k942R074P003m892o714J828
775d444O651J800m677k780J144O31m18N04r63k173K431N953J39p495k062Q795
791C036K338j1409n053J1607P307j0682q144J1434J0497q323j0871M861P928m638
805a12n913M590L302m943L39P958L75q506j622R073R10j0251l561Q894N496m901
821A128l863L005K957r41lK92l283l936J993N305J224l249j320K938K848j481
837C614m201n4K990p50n099o55O459M575l424l968K674K233l434k117L172N5m916
854b846j213N476K556j924K022K838o865o965O278R175n653j2303K565J2203J725
$$ plain form
745 -7666 -6770 5164 6214 -4847 -6877 2036 5733 1547 -366 -62 -2212 -2537 2380 2214 -6193 -8424
761 -8424 2355 8906 -395 -9299 -2634 8568 4958 -7801 -10743 -1669 5334 442 -6272 -4444
775 -4444 2207 4007 -670 -3450 -2306 -1675 -2093 -1589 -2552 -4725 -2294 3659 3798 -3697 -5759 3036
791 3036 5374 -6035 -11088 519 7826 -2856 -11000 434 10931 2608 -8263 -3402 4526 -112
805 -112 -6025 -1435 1867 -3076 -2737 5221 5596 -2910 -4532 4541 5451 -4800 -8361 533 6029 1128
821 1128 -2735 270 3227 2286 2283 2575 -708 -4644 -2651 2654 3878 629 -691 2247 5095 3614
837 3614 -587 -641 2349 1599 -3500 -4155 2304 6879 3455 -513 2161 4394 960 -1157 2015 2070 -2846
854 -2846 -4059 1417 3973 2049 4071 6909 44 -6921 -643 8532 2879 -9424 -6859 5344 7069
869G069p398J27O016k562p381L35M394p81k220K245J132l393P21P611J857p899
885a27o449K757K976j027n71L177k36l145J148N113J733m512m905j081P64J584
901b801J447Q32J76J101K95j228q35J700m71l924k544J045K513K483K328J083
917C200k588k768J490J958k717k457K39L0q00K912N480P73m664j531L386j58n665
934c880j982M086J616j697N18L423J177r66P17L15n602l768L799L428k401j869
950c086M420M088k254k536K111P99l650l176Q72P03r11K230N797J354l677l059
966B5J414R31j057j544j699j330n1L842M930J254k444k696j779q9K12K44o79n58
984a074j168N00M218M392L23l855m138j176p58m08K984L794j829n075K38P232
$$ plain form
869 7069 -329 -202 5814 3252 -4129 -3794 600 -181 -2401 -156 976 -2417 -1696 5915 7772 -127
885 -127 -6576 -3819 -843 -1870 -2441 736 500 -2645 -1497 3616 5349 837 -4068 -5149 -4385 -2801
901 -2801 -1354 -522 -346 755 1050 -178 -1013 687 216 -3708 -6252 -5207 -2694 -211 2117 3200
917 3200 612 -2156 -666 1292 -1425 -3882 -3643 -3613 -4413 -1501 3979 4752 88 -1443 1943 1785 -3880
934 -3880 -5862 -1776 -160 -1857 -1339 2084 3261 2295 3012 3327 -2275 -6043 -2244 1184 -1217 -3086
950 -3086 1334 5422 3168 632 2743 3542 -108 -3284 -2412 -1709 -2620 -390 5407 6761 3084 25
966 25 1439 2370 1313 -231 -1930 -3260 -3311 531 5461 6715 4271 1575 -204 -293 -81 163 -516 -1074
984 -1074 -2242 -1742 2476 6868 7191 3336 -802 -1978 -2736 -3144 -160 3634 1805 -3270 -3032 4200
1000D200M679l151o256l294j738L66M690L974k323l618K261L626o53k343J666
1015B086M21p187n955N317Q642J423m406j061J202q28j84K284K28n866m614K537
1031e961N266K140R15R88j748m317j394L644K379l606m506R20M221J686M3J399
1047B069J734k385m460j768K293J478m96o42M46L41J199L346K248l044n937j192
1063d770L633L23k629J113M346J426l396p11L195R31l133k179O61j643j722L019
1079a536O033J82l859l83K391j069l767J080L570k207n164J082O611K758k228
1094C494j332M48k083l119P70M123j44l602r69K612J966R73K472K82n567n732
1110e408O36O899K509l597l283J859K538l70J083K020j240n921l914K446M982
$$ plain form
1000 4200 8879 5728 -528 -3822 -5560 -5194 -504 3470 1147 -2471 -210 3416 2763 420 2086
1015 2086 2507 -4680 -10635 -5318 3324 4747 341 -720 482 -346 -530 1754 1982 -3884 -8498 -5961
1031 -5961 -695 1445 2360 3348 1600 -2717 -4111 -467 1912 -1694 -6200 -5280 -1059 627 670 2069
1047 2069 3803 1418 -3042 -4810 -2517 -1039 -1535 -2177 -1731 -1390 -191 3155 5403 2359 -3578 -4770
1063 -4770 -1137 -814 -3443 -2330 2016 3442 46 -665 2530 3461 328 -1851 -1190 -2833 -4555 -1536
1079 -1536 4497 4679 820 437 2828 1759 -2008 -928 2642 435 -4729 -3647 2964 5722 3494
1094 3494 2162 2610 527 -2592 -1822 2301 2157 -1445 -2414 198 2164 3137 5609 5891 324 -5408
1110 -5408 -4772 2127 4636 1039 -2244 -385 2153 1783 2866 4886 3646 -2275 -6189 -3743 1239
1125A239K252n99q26k231k070J897N419M94o304n316J346L342J538J429K831j006
1141C435o051k066N117M483l496n098n64J092O66J963M407M68m743l907K314K059
1157G9n82p65O61j485l208J702O541K534m120m312l41J619l87R9J905P83l076
1174b353j039K686L211j26k014j120j643j492J95L294J969j033j845N41J766p98
1190A99m90J043O52l652k404J609M254J155j707p38J182o84j559Q23J494m71k442
1207a736k98J575P40R29K249Q32m192l631K166M074l57l056k06J557p72k55L320
1224B939K489k167m540j046J488J028J354J833p39m230p40M340L616k657l136
1239a68m92n4j370N99M524J953k894l913M2K633K125O16j925l741k339K668M236
$$ plain form
1125 1239 3491 2892 2066 -165 -2235 -338 5081 5575 -729 -6045 -4699 -1357 181 1610 4441 3435
1141 3435 -2616 -4682 435 4918 1422 -3676 -4240 -3148 -2482 -519 3888 4356 -387 -4294 -1980 79
1157 79 -503 -1268 -607 -2092 -5300 -3598 2943 5477 1357 -2955 -3296 -1677 -2064 -1965 -60 723 -2353
1174 -2353 -3392 -706 2505 2379 365 -755 -2398 -3890 -3695 -401 1568 535 -1310 -769 997 199
1190 199 -291 752 1404 -2248 -4652 -3043 1211 2366 659 -79 1103 419 -1140 -317 1177 706 -1736
1207 -1736 -2034 -459 281 1210 3459 4291 99 -3532 -1366 2708 2351 -705 -911 646 -126 -381 2939
1224 2939 5428 3261 -1279 -2325 -837 191 1545 3378 2639 -1591 -2331 2009 5625 2968 -168
1239 -168 -660 -714 -2084 -1485 3039 4992 2098 -1815 -1773 860 2985 3601 1676 -2065 -4404 -1736 2500
1256B500J252j649j999m40M4q71Q59K592j92l559l258J643N088K655j612l701
1272f48j970M04J709J848n70j350j704J3J309O61J383J491r85m226l082L420M596
1289B299K53m345j768J774J915k09K12R98j417k520k47J059Q27J111J775p32m319
1306c334o75M779L381l437m671R97K792p04j138J737K395j390k756j07J811J072
1322G52o7k45j894k508J764M584J503l426k872J984J782j799j470K375K632k522
1338E73l521M09M470K348j567k499j459r0J120K074N51k047j815J411J983j133
1354H08o85K368J600l680m312J542N796J057l448k571J295J233P06M80P0j759
1370E00k050O38J485k28O73J677K04l937k684L790N027j305n809j557L685J785
$$ plain form
1256 2500 3752 2103 104 -336 -292 -1163 -304 2288 2096 -1463 -4721 -3078 2010 4665 3053 -648
1272 -648 -2618 -2214 -505 1343 773 -577 -2281 -2268 -959 -298 1085 2576 1591 -2635 -5717 -2297 2299
1289 2299 2552 -1793 -3561 -1787 128 -81 131 1129 -288 -2808 -3055 -1996 -1169 -58 1717 985 -3334
1306 -3334 -4009 770 4151 714 -3957 -2960 -168 -872 -2010 -273 2122 732 -2024 -2131 -320 752
1322 752 685 440 -1454 -3962 -2198 2386 3889 463 -2409 -425 1357 -442 -1912 463 3095 573
1338 573 -2948 -2539 1931 4279 2712 213 -1246 -1336 -216 1858 2409 362 -1453 -42 1941 808
1354 808 123 2491 4091 411 -3901 -2359 3437 4494 1046 -1525 -230 1003 1709 2189 2259 500
1370 500 -1550 -912 573 345 1018 2695 2899 -1038 -3722 68 5095 3790 -2019 -3576 109 1894
1386A894j494K06J037k98k341q97J719J626j09m78j841j716K48L934K771k458
1402A803n168k15L855J043k247q32K589K59l745p26L399L027j856l541o42J308
1418a689L17J571J747j810l237J29L355J283k337p41J709p80l562P04N127J251
1434C037l815k628J452J863k73R75P42k085k949J130L259O22j481K3L74j701j834
1451c289J875M341n37l757k197K295K487O94p79p34j286o82O04K014L59J7j343
1468H2n33j11J54J301K058n51l622k462K707M385k53k711j036J530m22j122J117
1485E11K561r61l791m07K443J677l11Q31m96k697k103L833K622k018l126R49K231
1502A748j891p01L133K108l895l157J357K946n92o76O65l97j805J1L121R46k360
$$ plain form
1386 1894 400 606 1643 1345 -996 -1893 -174 1452 1343 865 -976 -2692 -2444 1490 4261 1803
1402 1803 -3365 -3580 275 1318 -929 -1761 828 1087 -2658 -3384 15 3042 1186 -2355 -2997 -1689
1418 -1689 -1372 199 1946 136 -3101 -2972 383 1666 -671 -1412 297 -483 -4045 -3341 1786 3037
1434 3037 -778 -3406 -1954 -91 -364 611 1353 -732 -3681 -2551 708 1330 -151 -128 246 -1455 -3289
1451 -3289 -1414 2927 2390 -1367 -3564 -1269 1218 1912 1133 399 -887 -1569 -965 1049 1408 1425 82
1468 82 -451 -562 -408 893 2951 2400 -1222 -3684 -977 3408 3155 444 -592 938 516 -606 511
1485 511 3072 2111 -1680 -2087 356 2033 1722 2553 2057 -640 -2743 1090 3712 1694 -1432 -483 1748
1502 1748 -143 -844 2289 4397 502 -2655 -1298 1648 1056 380 1045 648 -1157 -1146 1975 2921 561
1519E61k031P25K64n01J158J450m31j726q36Q25J226P8j12j219j030r42J404K064
1537I27P23r20j896q30J214P46o3k69k04l90j192J52K648J151j188k186l64P97
1555a144j57P87J416r35k432j34K602Q09n91P1m1j653k384J638L891j21l173k55
1573a806J532M61n22J365M38k371k177R51K265N57k32Q67p48k489J43K677J604
1590B515k076j600p33N46J058J758J480j669k262n71J674J410k29n85p93n96l11
1607i84J277K085P83j435k074j361R54K174Q33j222j464k72N21J595J236R0j871
1624H65j747j56N82N89J524Q12j839k344R70L137J233k637j511M21k97o45Q07
1641b36K147oj667p75M75J96K80J374m88l360j200K789K869r42k057M22R17j104
$$ plain form
1519 561 -1470 -745 -481 -982 176 1626 1195 -531 -1367 -542 684 762 650 -569 -1599 -2541 -1137 927
1537 927 1650 730 -1166 -1996 -782 -36 -99 -368 -572 -962 -2154 -2002 646 1797 609 -1577 -1941 -1144
1555 -1144 -1301 -514 902 -33 -2465 -2599 3 812 221 292 251 -1402 -3786 -2148 1743 1622 -1551 -1806
1573 -1806 -274 187 -335 1030 1468 -903 -3080 -2129 136 693 461 1328 580 -1909 -1766 911 2515
1590 2515 439 -1161 -1894 -1348 -290 1468 2948 1279 -983 -1554 120 1530 1301 716 -77 -673 -984
1607 -984 293 2378 3161 1726 -348 -1709 -755 1419 2252 1030 -434 -706 -185 1410 2646 2736 865
1624 865 -882 -1038 -456 133 1657 2469 630 -1714 -744 2393 3626 989 -522 -101 -398 -1043 -236
1641 -236 1911 1905 238 -537 -62 134 414 1788 1300 -2060 -3260 -471 2398 1456 -601 -179 738 -366
1659c66j097J264J246r35j896k0J001O76J394J69j291j930j86J733L61n10o39
1676a026j08N09l44L82J302P53j172k354n48J315J364K17j347K33J67m29O48J152
1694G14J21j730q38L41J60l49J184K050q65k603m32L194J255k451j398P76j25
1711i96m81J154K048k33j968k84J202q72l67J589R27k636j764J650L019R40k403
1728E25p93M87j98p30Q20J394n54j573l37J345J207Q00m16j124j863m18J665J498
1746A735k59j311p08J003Q04k5L02L33o52k387j052J486K950J77k065m15J35P42
1764G93M27O99m97k292r49J212J484k17q1J523o77k429m63K428J438k204k248
1781b053L89J413rL92K060k86k755r81J531P04p06m20M99p83r46J450K416N23
$$ plain form
1659 -366 -1463 -199 1047 112 -1784 -1804 -803 -127 1267 1436 145 -1785 -1971 -238 123 -387 -1026
1676 -1026 -1134 -625 -969 -587 715 1468 296 -2058 -2606 -1291 73 290 -1057 -824 -657 -1086 -438 714
1694 714 835 -895 -1733 -1392 -1232 -1581 -397 1653 788 -1815 -2247 947 2202 -249 -1647 -871 -996
1711 -996 -1477 -323 1725 1492 -476 -760 442 -430 -797 792 1719 -917 -2681 -1031 1988 2928 525
1728 525 -268 219 21 -709 111 1505 951 -622 -959 386 1593 2393 1977 853 -1010 -1428 237 1735
1746 1735 1476 165 -543 460 1264 1239 1541 1874 1222 -1165 -2217 -731 2219 2396 331 -84 51 793
1764 793 1220 1919 1422 -870 -1819 -607 877 660 579 2102 1425 -1004 -1467 961 2399 195 -2053
1781 -2053 -1664 -251 -260 132 2192 1906 -849 -1830 -299 405 -301 -721 -222 -1005 -1951 -501 1915 2438
1799B438k907j450O92L4j25Q7R08K30j069p7P46J482k84p86j441o13q0J130J381
1818B96L17j222n15L25J421L34j596j75J1q55r42J356K450O03j988p99Q89M03
1836C13o83K36O09j447j701J035K673N30j117O17r1j567j229J792J453j110k118
1853a805O63J549N08j82J023K87j856j465K38J536k40K90j7m64n97J156J953N0
1871B627j940j538l78J184L81O71L71j07o06m68N11J087J03j340j684q51J418
1888e59J257O41J89j61r33m50N10R87m97q83q13k19m63J236K600K62k332j765
1906a393Q72J071q4n64J02p22n90L56J844N87l52p64j034r90l95K307J085j299
1924C7j833j63J897J176l41m88m08j538n73M91J276N22L8o54q04K11J454J071
$$ plain form
1799 2438 -469 -1919 -1227 -1193 -1318 -1231 -323 -93 -1162 -1239 -493 989 705 -81 -1522 -2135 -2215 -1085 296
1818 296 613 -609 -1124 -799 622 956 -640 -815 -804 -1659 -2601 -1245 1205 1808 -180 -979 -90 313
1836 313 -370 -134 475 -972 -2673 -1638 1035 1565 448 1065 974 -593 -1822 -30 1423 313 -1805
1853 -1805 -1142 407 915 733 1756 2043 187 -1278 -1040 496 256 546 529 65 -532 624 2577 2627
1871 2627 687 -851 -1229 -45 336 1007 1378 1271 665 197 708 1795 1898 558 -1126 -1977 -559
1888 -559 698 1339 1528 1367 434 -16 494 1481 984 101 -712 -931 -1394 -158 2442 2704 372 -1393
1906 -1393 -521 550 466 -98 4 -718 -1308 -952 892 1479 1127 363 -671 -1661 -2056 251 1336 37
1924 37 -1796 -1959 -62 1114 773 285 -123 -1661 -2234 -1743 -467 55 93 -561 -1365 -1154 300 1371
1942A371n13k097j367R76J133M25P0K82m35n85J03J97P64J78r08j978k52J878
1960g58J780L49j020j137m02J040M60k72p01J32J26k19k27R18K183n52j803j302
1978a405O38J111N3J4n01l38k82J660K66l17l70N3l31j479m6K238J218j330j288
1997d36L00J363m6j95N1p31r72O1P48P16J25M18j25j224o51P05J753l04j508j071
2017a023N90Q97P38K68p93m51p6j27l35N07J098o07j637l33J242R31P51o19j084
2036f3j563O62J554O46j171j089J175j22r81O29J962K04k813j239R41J152J5P18
2054F17O0j757r32J348J662k29j979M49O40j269j64J760J661j731j773K2J536
2071g9j00K37j30o83j302O22J547N88r21k16J84n85l25N82J126l07j063o11K22
$$ plain form
1942 1371 858 -1239 -2606 -1630 -497 -72 -2 280 -155 -740 -637 -440 324 502 -406 -2384 -2636 -758
1960 -758 1022 1371 351 -786 -1188 -148 312 40 -661 -529 -403 -622 -849 69 2252 1700 -103 -1405
1978 -1405 -767 344 397 411 -90 -428 -710 950 1216 899 529 582 251 -1228 -1274 964 2182 852 -436
1997 -436 -136 1227 1181 986 1037 306 -666 -605 143 859 984 1402 1277 53 -598 107 1860 1556 48 -1023
2017 -1023 -433 464 1202 1470 677 226 150 23 -312 195 1293 686 -951 -1284 -42 889 1640 1021 -63
2036 -63 -1626 -964 590 1236 65 -1024 151 29 -952 -323 1639 1843 -970 -2209 -1268 -116 -101 617
2054 617 677 -1080 -2012 -664 998 769 -1210 -761 -121 -1390 -1554 206 1867 136 -1637 -1615 -79
2071 -79 -179 58 -72 -755 -2057 -1435 112 700 -221 -437 -253 -838 -1163 -581 545 238 -825 -1436 -1214
2090a214J012J210M9j118r60J53P57M3k27N77K00j602rJ483M97l28l64j14p31
2109f86o56J889J116j105j317P01J214r05n79J411L11j393j377J214J398p80k11
2126B45R90m00j492O71J658m80j120n87J147J83j169R83J060k32j592n5O66J48
2144F24l47N18o3j163j86J061Q72o01m65l15k36K5J64J047j14n10m34l93J24J109
2164G17L42o88j107K57K95j85L90P21k48j232m07J489K66j045M46L88j044q59
2182a504J104J458o40j342J18Q08l57n83J248J60j258j497J507J064n35m51R51
2199B51j44j508j74J821N48j334p84N05J49j94O52O97n86j058O2R66L1j41N5q4
2219b70k09j96L48L29L82k04o29p71J016N80J86q85o9O34n40j42Q27N03j069m77
$$ plain form
2090 -1214 -202 1008 1057 -61 -1021 -868 -111 -68 -295 282 482 -1120 -1129 354 851 523 159 45 -686
2109 -686 -1342 547 1663 558 -759 -58 1156 251 -328 1083 1394 1 -1376 -162 1236 456 245
2126 245 1235 835 -657 14 1672 1192 72 -515 632 815 -354 629 1689 1457 -135 -190 476 624
2144 624 277 795 732 -431 -617 444 1316 715 250 -65 -301 -276 -112 935 821 311 -123 -516 -392 717
2164 717 1059 371 -736 -479 -184 -369 21 742 494 -738 -1145 344 610 -435 11 399 -645 -1504
2182 -1504 -400 1058 418 -924 -806 2 -355 -938 310 470 -788 -2285 -778 286 -249 -700 251
2199 251 107 -1401 -1575 246 794 -540 -1324 -819 -670 -864 -212 485 -101 -1159 -1097 -131 -100 -241 -186 -270
2219 -270 -479 -675 -327 2 384 180 -449 -1220 -204 376 562 -323 -392 242 -298 -440 387 890 -179 -656
2239f56O94N26o93K16J382l18j836LJ619M02j558m77J749n93q83o3J858j27j228
2258A7K07R06r72k24J123L76j215r40R61J091q71n37P34L18q60l45J020K47m45
2277E91n43N5l55J25R85J66r07k79L68K8k37K79K07m61k47K00K65n2J99O39j070
2298d4j218N91J227k6r74k28Q31k04p96N34J069r62q66M12N04n40q0J480l44j753
2318a387k83J783Q55j465q85Q21K32q08K90R11M29p04l38P68r32k08Q42L27j085
2337h37n23P84Q29k32n55J00R8o2l66L37r8P1M59k26o52L36P31N56j215l07O49
2358a23K84j67l05N37m54n3M60L67p34k1J009k11j353k76J762K85j047o39R99
2377C20L76p34K39N11n84n65O06O50q21J59J021J78j135o56R28O05m41n09N2J15
$$ plain form
2239 -656 38 564 -129 87 1469 1151 -685 -682 937 1339 -219 -696 1053 460 -423 -486 1372 1245 17
2258 17 224 1130 158 -66 1057 1433 218 -722 239 1330 459 -78 656 974 114 -231 789 1036 591
2277 591 48 103 -252 -127 858 1024 117 -162 206 234 -3 276 483 22 -225 -25 240 188 387 1026 -44
2298 -44 -1262 -671 556 530 -444 -672 159 -45 -841 -307 762 -200 -1066 -654 -150 -690 -770 710 366 -1387
2318 -1387 -1670 113 968 -497 -1382 -561 -329 -1137 -847 64 493 -211 -549 219 -713 -921 -79 248 -837
2337 -837 -1360 -576 253 21 -534 -434 -336 -398 -764 -427 -525 -454 5 -221 -873 -537 194 750 -465 -772 -123
2358 -123 161 -6 -311 226 -228 -281 179 546 -188 -209 800 589 -764 -1040 722 1007 -40 -679 320
2377 320 696 -38 201 712 128 -437 169 819 -2 157 1178 1356 221 -435 493 1098 657 148 200 315
2397C15k26m3N96K6l67M17k5n18m83J067j5n54k82J30Q30k87k37J9O2n20M65j42
2419B28l22o8O10p0m97k90R21N09j119l86K41L84k06p4J89j95k90M24Q5l01k45
2440d72L27L13j062k64O90P86q57j55L12L27k12M0p8j41m64M07P9l99J55P54%
2461H6n55l62P37K24q30K5N15k98j06O3M45L9n17N01J47q18l23P24O10o98n08
2482h99N56O26l80k4K80K24l52j93q4J25m15N91L24j06m08M23K22L6m34pq7k39
2504b21N56j48N9K0J69o1j07p4O53j52j028K04M60J78l26J03L96K6n44J40J37
2525D40r8n73L58K87k34k74O26L18m82n51O29L85j126L84J20K6j18j65R25n26
2545C51l63Q0M92o41m8M10J29o41pL71N04o46l93N83k70L2k17j0j36O5L23K19
$$ plain form
2397 315 89 46 642 668 301 718 693 175 -308 759 744 190 -92 38 868 581 344 363 425 -95 370 228
2419 228 -94 -162 448 378 -119 -409 512 1021 -98 -484 -243 141 -65 -139 50 -145 -435 -11 74 -227 -472
2440 -472 -145 168 -894 -1158 -468 318 -539 -694 -382 -55 -267 -227 -305 -446 -910 -503 -424 -823 -668 86 86
2461 86 -469 -831 -94 130 -700 -675 -160 -458 -564 -501 -56 -17 -534 -33 114 -704 -1027 -303 307 -391 -899
2482 -899 -343 283 -97 -121 159 383 31 -162 -246 -121 -536 55 379 273 -135 288 510 546 112 105 18 -221
2504 -221 335 187 246 266 435 374 267 193 846 694 -334 -130 330 508 182 285 681 707 163 303 440
2525 440 342 -231 127 414 180 -94 532 850 368 -183 446 831 -295 89 209 235 117 -48 877 351
2545 351 -12 68 560 -81 -129 281 410 -231 -238 133 637 -9 -402 181 -89 -57 -274 -284 -420 -355 -32 187
2567A87k20r9L14j46l84n5M8J57l09p5L79j84j47K38M04r95K14O47q8n80k35Q74
2589e5l10k43n1J032n95l65j59M52p7j28L80K15o61n14J094K40p07j40N85l2n39
2610e78m13J096L54j002J39L27J65p00P56P8l57p27O72P70m31n04O04J85k98J64
2630C00r4L69m93J39k85o2l5O99J01m23j21M05L86p43r9M40lm9k82J60j55J69
$$ plain form
2567 187 -33 -132 182 36 -348 -403 -355 -198 -507 -582 -203 -387 -534 -296 108 -887 -673 -26 -114 -694 -929 -55
2589 -55 -365 -608 -659 373 -222 -587 -746 -294 -371 -499 -119 96 -565 -1079 15 255 -452 -592 -7 -39 -578
2610 -578 -991 105 459 -543 -404 -77 88 -612 144 222 -135 -862 -190 580 149 -355 249 434 136 300
2630 300 206 575 82 221 -64 -126 -161 538 639 216 95 500 886 143 44 484 481 432 150 310 155 324
$$ [...]
8191B49
##END NTUPLES=NMR FID
##END=
