##TITLE=1H_Costus-Summ1-f24-f1
 CDCl3, 8 sc, 
 7.8.2020
##JCAMPDX= 6.0         $$ Bruker NMR JCAMP-DX V2.0
##DATA TYPE= NMR FID
##DATA CLASS= NTUPLES
##ORIGIN= UXNMR, Bruker Analytische Messtechnik GmbH
##OWNER= root
$$ XWIN-NMR		Version 3.5
$$ Fri Aug  7 11:06:09 2020 Russian Standard Time (UT+4h)  she@DPX200
##.OBSERVE FREQUENCY= 200.1314999998
##.OBSERVE NUCLEUS= ^1H
##.DELAY= (6, 6)
##.ACQUISITION MODE= SIMULTANEOUS
##.ACQUISITION SCHEME= undefined
##.AVERAGES= 8
##.DIGITISER RES= 18
##SPECTROMETER/DATA SYSTEM= spect
##.PULSE SEQUENCE= zg30
##.SOLVENT NAME= D2O
##.SHIFT REFERENCE= (INTERNAL, D2O, 0, 15.7039)
##AUDIT TRAIL= $$ (NUMBER, WHEN, WHO, WHERE, WHAT)
$$ ##TITLE= Audit trail, XWIN-NMR		Version 3.5
$$ ##JCAMPDX= 5.01
$$ ##ORIGIN= Bruker BioSpin GmbH
$$ ##OWNER= she
$$ F:/spectra/data/she/nmr/H-F/1/audita.txt
$$ ##AUDIT TRAIL=  $$ (NUMBER, WHEN, WHO, WHERE, WHAT)
(   1,<2020-08-07 11:05:10.35 +0400>,<she>,<DPX200>,
      <created by zg, POWCHK disabled, PULCHK disabled
       configuration hash MD5:
       00 E9 B6 7A A2 85 ED C7 34 08 36 98 17 FE 4E 26
       data hash MD5: 16K
       9D 89 C8 AD 38 0E 16 E0 9C 6F BD E8 CC 61 BA 9B>)
$$ ##END=
$$ 
$$ hash MD5
$$ D9 0A 40 E2 14 2F 0C 86 82 E6 DA 0A 57 35 06 6A
##$RELAX= 
##$RELAX= 
##$RELAX= 
##$RELAX= 
##$RELAX= 
##$RELAX= 
$$ Bruker specific parameters
$$ --------------------------
##$DU= <F:/spectra>
##$EXPNO= 1
##$NAME= <H-F>
##$PROCNO= 1
##$TYPE= <nmr>
##$USER= <she>
##$AMP= (0..31)
100 100 100 100 100 100 100 100 100 100 100 100 100 100 100 100 100 100 
100 100 100 100 100 100 100 100 100 100 100 100 100 100 
##$AQSEQ= 0
##$AQ_mod= 1
##$AUNM= <au_zg>
##$AUTOPOS= <>
##$BF1= 200.13
##$BF2= 200.13
##$BF3= 200.13
##$BF4= 200.13
##$BF5= 200.13
##$BF6= 200.13
##$BF7= 200.13
##$BF8= 200.13
##$BYTORDA= 1
##$CFDGTYP= 0
##$CFRGTYP= 5
##$CHEMSTR= <none>
##$CNST= (0..31)
1 1 145 1 1 1 1 1 1 1 1 1 1 1 1 1 1 1 1 1 1 1 1 1 1 1 1 1 1 1 1 1 
##$CPDPRG= <>
##$CPDPRG1= <>
##$CPDPRG2= <>
##$CPDPRG3= <>
##$CPDPRG4= <mlev>
##$CPDPRG5= <mlev>
##$CPDPRG6= <mlev>
##$CPDPRG7= <mlev>
##$CPDPRG8= <mlev>
##$CPDPRGB= <>
##$CPDPRGT= <>
##$D= (0..31)
0 1.2 0 0 0 0 0 0 0 0.06 0 0.03 0 0 0 0 0.0002 0 0 0 0 0 0 0 0 0 0 0 0 
0 0 0 
##$DATE= 1596783909
##$DBL= (0..7)
120 120 120 120 120 120 120 120 
##$DBP= (0..7)
150 150 150 150 150 150 150 150 
##$DBP07= 0
##$DBPNAM0= <>
##$DBPNAM1= <>
##$DBPNAM2= <>
##$DBPNAM3= <>
##$DBPNAM4= <>
##$DBPNAM5= <>
##$DBPNAM6= <>
##$DBPNAM7= <>
##$DBPOAL= (0..7)
0.5 0.5 0.5 0.5 0.5 0.5 0.5 0.5 
##$DBPOFFS= (0..7)
0 0 0 0 0 0 0 0 
##$DE= 6
##$DECBNUC= <off>
##$DECIM= 24
##$DECNUC= <off>
##$DECSTAT= 4
##$DIGMOD= 1
##$DIGTYP= 9
##$DL= (0..7)
0 120 120 120 120 120 120 120 
##$DP= (0..7)
150 150 150 150 150 150 150 150 
##$DP07= 0
##$DPNAME0= <>
##$DPNAME1= <>
##$DPNAME2= <>
##$DPNAME3= <>
##$DPNAME4= <>
##$DPNAME5= <>
##$DPNAME6= <>
##$DPNAME7= <>
##$DPOAL= (0..7)
0.5 0.5 0.5 0.5 0.5 0.5 0.5 0.5 
##$DPOFFS= (0..7)
0 0 0 0 0 0 0 0 
##$DQDMODE= 0
##$DR= 18
##$DS= 0
$$ [...]
##$SUBNAM2= <"">
##$SUBNAM3= <"">
##$SUBNAM4= <"">
##$SUBNAM5= <"">
##$SUBNAM6= <"">
##$SUBNAM7= <"">
##$SUBNAM8= <"">
##$SUBNAM9= <"">
##$SW= 24.9337058888022
##$SWIBOX= (0..15)
0 0 2 0 0 0 0 0 0 0 0 0 0 0 0 0 
##$SW_h= 4990.01996007984
##$TD= 16384
##$TD0= 1
##$TE= 0
##$TE2= 300
##$TE3= 300
##$TEG= 300
##$TL= (0..7)
0 120 120 120 120 120 120 120 
##$TP= (0..7)
150 150 150 150 150 150 150 150 
##$TP07= 0
##$TPNAME0= <>
##$TPNAME1= <>
##$TPNAME2= <>
##$TPNAME3= <>
##$TPNAME4= <>
##$TPNAME5= <>
##$TPNAME6= <>
##$TPNAME7= <>
##$TPOAL= (0..7)
0.5 0.5 0.5 0.5 0.5 0.5 0.5 0.5 
##$TPOFFS= (0..7)
0 0 0 0 0 0 0 0 
##$TUNHIN= 0
##$TUNHOUT= 0
##$TUNXOUT= 0
##$USERA1= <user>
##$USERA2= <user>
##$USERA3= <user>
##$USERA4= <user>
##$USERA5= <user>
##$V9= 5
##$VALIST= <valist>
##$VCLIST= <CCCCCCCCCCCCCCC>
##$VD= 0
##$VDLIST= <DDDDDDDDDDDDDDD>
##$VPLIST= <PPPPPPPPPPPPPPP>
##$VTLIST= <TTTTTTTTTTTTTTT>
##$WBST= 1024
##$WBSW= 4
##$XGAIN= (0..3)
0 0 0 0 
##$XL= 0
##$YL= 0
##$YMAX_a= 304978
##$YMIN_a= -205490
##$ZGOPTNS= <>
##$ZL1= 120
##$ZL2= 120
##$ZL3= 120
##$ZL4= 120
##$ABSF1= 10
##$ABSF2= 0
##$ABSG= 5
##$ABSL= 3
##$ALPHA= 0
##$AQORDER= 0
##$ASSFAC= 0
##$ASSFACI= 0
##$ASSFACX= 0
##$ASSWID= 0
##$AUNMP= <proc_1d>
##$AZFE= 0.1
##$AZFW= 0.1
##$BCFW= 1
##$BC_mod= 2
##$BYTORDP= 1
##$COROFFS= 0
##$CY= 11.3945322036743
##$DATMOD= 1
##$DC= 2
##$DFILT= <>
##$DTYPP= 0
##$F1P= 16.9975609425685
##$F2P= -3.02152046262296
##$FCOR= 0.5
##$FTSIZE= 0
##$FT_mod= 4
##$GAMMA= 1
##$GB= 0.15
##$INTBC= 1
##$INTSCL= 1
##$ISEN= 128
##$LB= 0.24
##$LEV0= 0
##$LPBIN= 0
##$MAXI= 10000
##$MC2= 0
##$MEAN= 0
##$ME_mod= 0
##$MI= 1.114404
##$NCOEF= 0
##$NC_proc= 0
##$NLEV= 6
##$NOISF1= 3.799351
##$NOISF2= 2.8
##$NSP= 1
##$NTH_PI= 0
##$NZP= 0
##$OFFSET= 15.70392
##$PC= 1
##$PHC0= -9802.267
##$PHC1= 24.20092
##$PH_mod= 1
##$PKNL= yes
##$PPARMOD= 0
##$PSCAL= 0
##$PSIGN= 0
##$REVERSE= no
##$SF= 200.130013532006
##$SI= 16384
##$SIGF1= 3
##$SIGF2= 2
##$SINO= 400
##$SIOLD= 16384
##$SREGLST= <1H.CDCl3>
##$SSB= 0
##$STSI= 0
##$STSR= 0
##$SW_p= 3612.71676300578
##$SYMM= 0
##$S_DEV= 0
##$TDeff= 0
##$TDoff= 0
##$TI= <>
##$TILT= no
##$TM1= 0
##$TM2= 0
##$TOPLEV= 0
##$USERP1= <user>
##$USERP2= <user>
##$USERP3= <user>
##$USERP4= <user>
##$USERP5= <user>
##$WDW= 1
##$XDIM= 8192
##$YMAX_p= 0
##$YMIN_p= 0
$$ End of Bruker specific parameters
$$ ---------------------------------
##NTUPLES= NMR FID
##VAR_NAME=  TIME,          FID/REAL,        FID/IMAG
##SYMBOL=    X,             R,               I
##VAR_TYPE=  INDEPENDENT,   DEPENDENT,       DEPENDENT
##VAR_FORM=  AFFN,          ASDF,            ASDF
##VAR_DIM=   8192,          8192,            8192
##UNITS=     SECONDS,       ARBITRARY UNITS, ARBITRARY UNITS
##FACTOR=    0.0002004,     1,               1
##FIRST=     0,             0,               0
##LAST=      1.6414764,     0,               0
##MIN=       0,             -205490,         0
##MAX=       1.6414764,     304978,          0
$$ Real data points
##PAGE= N=1
##DATA TABLE= (X++(R..R)), XYDATA
0@%%%%%%%%qJ6j6J6k4L2m0M8n6P2q7J02j19J40j62J86k16K48k83L22l66M15m70
$$ 0 0 0 0 0 0 0 0 0 -8 8 -8 8 -16 16 -24 24 -32 40 -47 55 -64 76 -86 100 -116 132 -151 171 -195 220 -250
31b50N33o00O71p48Q35r31J035j150J276j418J571j736J921k128K359k615K905
$$ -250 283 -317 354 -394 441 -490 545 -605 671 -747 824 -912 1009 -1119 1240 -1375 1530
48A530l236L615m053M570n191N947o894Q129r808J2230j6067K3228n7882K87289
$$ 1530 -1706 1909 -2144 2426 -2765 3182 -3712 4417 -5391 6839 -9228 14000 -43882 243407
62B43407K8556m30882j3096L22972L5997l13446l8269K42581M3382k08411j3652
$$ 243407 271963 -158919 -172015 150957 186954 -126492 -164761 77820 121202 -87209 -100861
73a00861J72156P061j52393K5577J48034k5108j59685N610J36078M317j24514
$$ -100861 71295 78356 -74037 -48460 99574 74466 -85219 -79609 56469 60786 -63728
84f3728n042J23833L3106j05240m2372Q7545M7458q5089o1663P1178O9724o4193
$$ -63728 -68770 55063 88169 -17071 -59443 28102 75560 -9529 -71192 -14 69710 5517
96E517p7472N4665Q1082m3079o4806N6474O3232p7379q2191P2881Q3959p3035
$$ 5517 -71955 -17290 63792 20713 -44093 12381 75613 -1766 -83957 -11076 72883 -152
108a52p5190R2217Q7592r6316r6148Q9687R0719r2017q5701R0772O9530j07139
$$ -152 -75342 16875 104467 8151 -87997 1690 92409 392 -85309 5463 74993 -32146
120c2146o1868J31111P9218j32075q5342J31922Q5554j41150j05411J29929J17136
$$ -32146 -94014 37097 116315 -15760 -101102 30820 116374 -24776 -130187 -258 116878
131A16878j09934j16426R5551J17746p3139j06461N8198R0682n6507r1186M0415
$$ 116878 6944 -109482 -13931 103815 30676 -75785 -17587 73095 16588 -74598 -34183
142c4183P9698l0627o2856L6053O3415k9711n9517K5297N1283l2265o0122K9514
$$ -34183 45515 14888 -47968 -11915 51500 21789 -37728 -12431 38852 6587 -53535 -24021
154b4021O8699k0896p5376J2812Q4576O076q1926k0585P3131K3743p4114l5985
$$ -24021 44678 23782 -51594 -38782 45794 51870 -30056 -50641 22490 46233 -27881 -63866
166f3866O3463M2867m4273k7726M2511J5011m9231r469N6125N039o5856o786O9959
$$ -63866 -403 42464 -1809 -29535 12976 27987 -21244 -30713 25412 30451 -35405 -42191 27768
179B7768Q877p1283n922P6973J0653p6448j5216O7082O265o6165p08P0942K065
$$ 27768 36645 -34638 -40560 36413 47066 -29382 -44598 22484 28749 -37416 -38124 32818 34883
192C4883o7593J561O9068j167o8771k579O3944L045o1238q250N5356J2886m3973
$$ 34883 -32710 -31149 37919 36752 -32019 -34598 29346 32391 -28847 -37097 18259 31145 -12828
205a2828r873M1062J1810l5778j8001K3208J4841j8282j1973J6151J4057j1372
$$ -12828 -22701 18361 30171 -5607 -23608 -400 14441 -3841 -15814 337 14394 3022
217C022r758J6508J4032j8749k0818J5489K1116k2366l1167K3569M4741j3970
$$ 3022 -6736 9772 23804 5055 -15763 -274 20842 -1524 -32691 -9122 35619 21649
229B1649m6360R014M5744p060m6418K386M2411j534l7052M119L1713p885k5785
$$ 21649 -24711 -15697 30047 22987 -23431 -21045 21366 19832 -17220 -13101 18612 10727 -15058
242a5058J6654K8434k0436l1206J6483K3883k1688k3082K6254K6287k1138k3725
$$ -15058 1596 30030 9594 -21612 -5129 18754 -2934 -26016 238 26525 5387 -18338
254a8338J9697J7889k0839j7201J9020J6082j6333j3130J3374J1098r477o191
$$ -18338 1359 19248 -1591 -18792 228 16310 -23 -13153 221 11319 1842 -4349
266d349P967J770j0099m219O309K705n221n02O600M287m008n276M22M998J746
$$ -4349 3618 5388 -4711 -8930 -2621 84 -5137 -5639 961 5248 1240 -4036 -3614 1384 3130
281C130o052m322L949L881n297l357Q256O376o123m221O349J064j3569p469J2369
$$ 3130 -2922 -7244 -3295 586 -4711 -8068 188 6564 441 -3780 2569 3633 -9936 -17405 -5036
296e036J0282q192o593R994P576q158p374O649N648n874o310L119K652l129J32
$$ -5036 5246 -2946 -9539 455 8031 -127 -7501 -852 4796 -1078 -7388 -4269 -1617 -4746 -4614
311d614O651K366m705l578K132J399k979j322L104P97j400M16K862K112o90l42
$$ -4614 2037 4403 -302 -3880 -1748 -349 -3328 -4650 -1546 -749 -2149 -1733 1129 3241 2551 2209
327B209j101k238p04J478p92j580L043N188k375n666J581M699k983o512L671Q384
$$ 2209 1108 -1130 -1834 -356 -1148 -2728 315 5503 3128 -2538 -957 3742 759 -5753 -2082 6302
343F302j475o886K849O155m105n688O512P642p515j0875M251Q045m642n065Q345
$$ 6302 4827 -2059 790 6945 2840 -2848 3664 11306 3791 -7084 -2833 5212 570 -4495 3850
358C850P303p460o902M954M518n907l835P416K748q681l324Q895O830n898n208
$$ 3850 11153 3693 -3209 1745 6263 356 -3479 3937 6685 -1996 -5320 3575 10405 4507 -701
373g01N114L561o821q013K749P000o25n314K176Q237l83r680j470R225J595j0380
$$ -701 4413 7974 1153 -6860 -4111 2889 2264 -3050 -874 7363 6980 -2700 -4170 5055 6650 -3730
389c730k083J1348K372j3360l775J4654M015j4292l120J4496R19j6619j837J7411
$$ -3730 -5813 5535 7907 -5453 -9228 5426 9441 -4851 -7971 6525 7444 -9175 -11012 6399
403F399K114j6984j283J5978Q49j5455Q52J5539j561j6063J526J3698j409j2342
$$ 6399 8513 -8471 -9754 6224 7073 -8382 -7530 8009 6448 -9615 -8089 5609 4200 -8142
417h142L827J2157m925j3280K482J2125k154j1190J234J1220l32r639N10J1148
$$ -8142 -4315 7842 2917 -10363 -7881 4244 2090 -9100 -7866 3354 3022 -6617 -6107 5041
431E041J718j0755l842Q995L820j0031m741J0547O503j0242o863J0785Q210j1731
$$ 5041 6759 -3996 -7838 1157 4977 -5054 -9795 752 7255 -2987 -9850 935 9145 -2586
445b586r494J1726R095j1886r551J2540J0514j2105r261J4187J1267j3565j2546
$$ -2586 -12080 -354 8741 -3145 -12696 -156 10358 -1747 -11008 3179 14446 881 -11665
458a1665J2174R982j2864r544J3993J0730j4038j1623J2266J2290j0727j0205
$$ -11665 509 10491 -2373 -11917 2076 12806 -1232 -12855 -589 11701 974 -9231
470i231J1955J1230j2292j3810R904J3913p490j0995P825J1122q281j2632P543
$$ -9231 2724 13954 1662 -12148 -2244 11669 4179 -6816 1009 12131 3850 -8782 -1239
483a239J2261q392j2324Q935J3072q778j3230R243J3257r032j4785Q803J5407
$$ -1239 11022 2630 -9694 -759 12313 3535 -9695 -452 12805 3773 -11012 -2209 13198
496A3198q063j3360P469J4130p715j4237O230J2901p157j2971O353J2938n617
$$ 13198 5135 -8225 -756 13374 5659 -8578 -2348 10553 3396 -9575 -3222 9716 4099
509D099j2596M831J2360l900j1676L524J2317k290j2753p68J1308J256j0617q58
$$ 4099 -8497 -3666 8694 4794 -6882 -3358 8959 6669 -6084 -6852 4456 5712 -4905 -5763
523e763J0808J357j0767j886J0988J145j1588k160J1171N30j3190J10J5189K481
$$ -5763 5045 6402 -4365 -6251 4737 5882 -5706 -7866 3305 3835 -9355 -9245 5944 8425
537H425j4699k190J4118J746j5148j968J4490J387j3633j475J2631N97j2263N16
$$ 8425 -6274 -8464 5654 7400 -7748 -9716 4774 6161 -7472 -8947 3684 4281 -7982 -7466
551g466J2215o69j2183N84J1854q06j1325k37J1818J694r927l158Q961L739q113
$$ -7466 4749 4080 -8103 -7519 4335 3529 -7796 -8033 3785 5479 -4448 -7606 1355 5094 -3019
566c019m058O288N476n575n972N353M742m665m779O190M021p330m985R070P543
$$ -3019 -7077 -789 4687 -888 -6860 -1507 3235 -1430 -6209 -19 4002 -3328 -8313 757 8300
581H300q977p385R832Q680j1141r183R806R857r325r452P775P981p440m611R450
$$ 8300 -677 -8062 1770 10450 -691 -9874 -68 9789 464 -8988 -1213 6768 -672 -5283 4167
596D167L025j0579k214J1139J643j2588j588J4392K924j4165l553J2516N478j0084
$$ 4167 7192 -3387 -5601 5538 7181 -5407 -6995 7397 10321 -3844 -7397 5119 10597 513
610E13n238P292M056n889l591L535J775k905K40M183o95l772r4M685Q11m293j785
$$ 513 -4725 2567 6623 734 -2857 678 2453 -452 -212 3971 3276 -496 -590 4095 4906 613 -1172
627a172M651K936n009o267L271P397o79o859q03O063K97n849n17N702R47m443
$$ -1172 3479 6415 1406 -4861 -1590 5807 5128 -1731 -2534 3529 3826 -2023 -2540 3162 4109 -334
643c34j9L122l204l779M387O633m426q293M577R810l908j1573Q88J0741N3r895
$$ -334 -353 2769 -435 -4214 173 6806 2380 -5913 -1336 8474 4566 -7007 -6119 4622 4675 -5220
659e220q90Q248J258n684J00M012j879l959M198M733o445o343O835Q102o328r467
$$ -5220 -6110 2138 3396 -2288 -2188 1824 -55 -4014 184 4917 -1528 -7871 -1036 7066 738 -8729
675h729M577R956l258r355J808P828q90n943p14L456O65k18J517j591l921K392
$$ -8729 -4152 5804 2546 -6809 -5001 2827 1937 -4006 -4720 -1264 -599 -817 700 -891 -4812 -2420
691b420N609j694p046J214Q001M19p671k873N732M598l938m798L68K841K641K46
$$ -2420 3189 1495 -5551 -4337 3664 4083 -3588 -6461 -729 3869 -69 -4867 -4499 -1658 983 1229
707A229k102j398K187K369n84k555j632J509K170J665k618m434K055P398M78q436
$$ 1229 -873 -2271 -84 2285 1701 -854 -2486 -977 1193 2858 240 -4194 -2139 5259 5737 -2699
723b699k836P599L847p117m750N479M579l807j186M322L1l571J539L978l827o221
$$ -2699 -5535 2064 5911 -1206 -5956 -477 4102 295 -891 3431 3462 -109 1430 5408 1581 -4640
739d640M287O991l933q650L640Q529j660o483N51M842m33k769R2L56q53K652K409
$$ -4640 -353 6638 2705 -5945 -2305 6224 4564 -1919 -1368 3474 3041 272 364 720 -133 2519 4928
756D928l659n171L796O715k103p998r98O669L567m954m625J838N932J604n488
$$ 4928 1269 -3902 -106 6609 4506 -3492 -4490 2179 5746 792 -3833 -1995 3937 5541 53
771E3n119L159N541n53n004l91K972J025o55M22j292k706J345M209k046p339J565
$$ 53 -5066 -1907 3634 3081 -1923 -2314 658 1683 1028 1450 158 -2548 -1203 3006 960 -6379 -4814
788d814Q518j13q199n28Q881P89q047j645O548J55n445O28M667j396l864L103
$$ -4814 3704 3591 -4608 -5136 3745 4534 -3513 -5158 1390 1545 -3900 -3272 1395 -1 -3865 -762
804g62L683l902l959M774L695n724n640L863O046k080m342J683M101L0k438q81
$$ -762 2921 -981 -4940 -166 3529 -2195 -7835 -3972 2074 -6 -4348 -2665 1436 1466 -972 -1853
820a853l59n8J415J846j322l243K54M117J640l269l514J890M624l23n505k178
$$ -1853 -2212 -2270 -855 991 -331 -3574 -3320 797 2437 -832 -4346 -2456 2168 1845 -3660 -5838
836e838N235M451k751m065J480L858m97l231p90J774O60j97R84q9k263J370K580
$$ -5838 -603 3848 1097 -2968 -1488 2370 1873 -1358 -2148 -374 286 89 1073 984 -1279 91 2671
853B671j19m374n16M440O39n098j757O640L600m298k982L024K863l635l709K833
$$ 2671 2552 -1822 -2338 2102 2741 -2357 -4114 2526 6126 1828 -1154 1870 4733 1098 -2611 222
869B22K290k273o68K883k57l010J144N188j108o636o95N896N56n071j180N542
$$ 222 2512 239 -429 2454 2197 -813 331 5519 4411 -2225 -2920 2976 3532 -1539 -2719 2823
885B823K092l275o47J936j48l127Q27J420j944k944K718L464q06l472Q47L323
$$ 2823 4915 1640 993 2929 2781 -346 481 1901 -43 -2987 -269 3195 2389 -1083 -236 3087
901C087j80k618j487R04R76o03q17J336J336k99j473K58K77j206j410R49J424
$$ 3087 2907 289 -1198 -294 682 79 -738 598 1934 1635 162 420 697 -509 -1919 -970 454
918D54k363j270L321K908k778l011L977K161n317m007M620M987m126m482M132
$$ 454 -1909 -3179 142 3050 272 -2739 1238 3399 -1918 -5925 -1305 3682 -444 -4926 -794
933g94M576l057l824K676J828m325k272L987J306l687J63N545N56m618o34M292
$$ -794 3782 725 -3099 -423 1405 -2920 -5192 -1205 101 -3586 -3423 2122 2678 -1940 -2574 1718
949A718K11m675j413K309J280j540Q20K054O32j996J18O99m20j301j410O51J132
$$ 1718 1929 -2746 -4159 -1850 -570 -2110 -1290 764 1396 -600 -482 217 -203 -1504 -2914 -2263 -1131
966a131N14o6J092J854j91k242p24J466p83k036Q64K478q48k514K111M203j161
$$ -1131 -617 -683 409 2263 2072 -170 -894 572 -211 -2247 -1383 1095 247 -2267 -156 4047 2886
983B886m424N64L061k233l339K661M236j748l817K800M226k162m139K196K706
$$ 2886 -1538 -974 2087 -146 -3485 -824 3412 1664 -2153 647 4873 2711 -1428 768 3474
998C474l183l741K392L962j429j938J784K326k097k487J859J831k891k856K556
$$ 3474 291 -3450 -1058 2904 1475 -463 1321 3647 1550 -937 922 2753 -138 -2994 -438
1013d38L332n98j996J569K376j840l064N38J854j878k174J300K458q86j146K085
$$ -438 2894 2296 300 1869 4245 2405 -659 -121 1733 -145 -2319 -1019 1439 553 -593 1492
1029A492K490j719m184P85K454j209k373J353K706p69j894J636K313j583l450
$$ 1492 3982 2263 -1921 -1136 1318 109 -2264 -911 1795 1026 -868 768 3081 1498 -1952
1044a952K92J780j205k167J030L291J16k378J9K282O19k849j314J544L21j578
$$ -1952 -1660 120 -1085 -3252 -2222 1069 1185 -1193 -1174 1108 1727 -1122 -2436 -892 -571 -2149
1060b149n64L027J398k426j769J477J708k388j346J709P69k052r07L248J595k497
$$ -2149 -2713 314 1712 -714 -2483 -1006 702 -1686 -3032 -1323 -554 -2606 -3513 -265 1330 -1167
1076a167m35K860m98m016j39L704K57l245J11L718J20k551J05K705j489l428Q04
$$ -1167 -1602 1258 760 -3256 -3395 309 566 -2679 -2568 1150 1270 -1281 -1176 1529 40 -3388 -2584
1093b584K828o74k299J106L442l99j740J74J983m71k695p12J388J229j362k2K139
$$ -2584 244 -430 -2729 -1623 1819 1420 -320 -146 1837 1366 -1329 -2041 -653 576 -786 -808 1331
1110A331M01j477j090K085J202k334j762J260J906j532o42K269K293j850k154
$$ 1331 1732 255 -835 1250 2452 118 -1644 -384 1522 -10 -652 1617 3910 2060 -94
1125i4J795O11k497j016K108J217k702o91L098J522k554o38J972l9k673l1K544
$$ -94 1701 2312 -185 -1201 907 2124 -578 -1269 1829 3351 797 159 2131 2092 -581 -612 1932
1142A932M63k587mL033jk519j44J626j85k197k56J346L14m67l29J118O28r88o42
$$ 1932 2395 -192 -196 2837 2836 317 173 1799 1614 -583 -839 507 821 354 25 1143 1771 783 141
1161A41O24N1r41r73J127J236m58j154R90R27r49k004Q26J464j367k194J365J655
$$ 141 765 816 -125 -1098 29 1265 807 -347 643 1570 621 -1383 -557 907 -460 -2654 -1289 366
1179C66n71r96J418J164j056j398M88O38j131p80J366P43j804n78J986J273j992
$$ 366 -205 -1201 217 1381 325 -1073 -585 53 -1078 -1858 -492 251 -1553 -2131 -145 1128 -864
1196h64q85J170J113j740j727Q36J982j64r35O01J215p75j553J183M30q05j512
$$ -864 -1749 -579 534 -1206 -2933 -2097 -115 -279 -1214 -613 602 -173 -1726 -543 -113 -918 -2430
1213b430J626J230j332j703K013K098j887j948J230J912j577k090J698K262o13
$$ -2430 -804 426 -906 -2609 -596 1502 -385 -2333 -1103 809 -768 -2858 -1160 1102 489
1228D89j383J355J265k090j147J572J204k392p79K592P56j998p61K533R40j887
$$ 489 -894 461 1726 -364 -1511 61 1265 -1127 -1906 686 1442 -556 -1317 1216 2156 269
1244B69j209J128R21j132j10M84J078r2l74N2m3l14j15J33M90p66j222R68J642
$$ 269 -940 188 1109 -23 -133 351 1429 1337 963 1015 972 658 543 676 1166 400 -822 146 1788
1263A788r4j746K69J903K23k696l65K323L71j697q59J452L91o73M18P34j135j430
$$ 1788 1694 -52 217 2120 2343 -353 -718 1605 1976 279 -580 872 1263 590 1008 1742 607 -823
1281h23J124J432j986j274J886J532r22k276P84K610n62j878p65J350K36p84n9
$$ -823 301 1733 -253 -1527 359 1891 969 -1307 -523 2087 1525 -353 -1118 232 468 -316 -375
1298c75N99j92k13K58L27p40j238P40J357p60k119J107K792k88k924o39K403J289
$$ -375 224 32 -181 77 404 -336 -1574 -834 523 -237 -2356 -1249 1543 1255 -1669 -2308 95 1384
1316A384k436q96J700L42j484j90J581r6j348J140J242j965k428J679K941j299
$$ 1384 -1052 -1948 -248 94 -1390 -1580 1 -95 -1443 -303 939 -1026 -3454 -1775 1166 -133
1332a33k714J150K672p81j846N44J380j92j304q6M27q40P66J238j57j191k97J661
$$ -133 -2847 -1697 975 194 -1652 -1108 272 80 -1224 -1310 -883 -1723 -957 281 124 -1067 -1364 297
1350B97O57j558j685J503J706l78j578k29J641O44j140j165J249J714r08j581
$$ 297 954 -604 -2289 -786 920 542 -1036 -1265 376 1020 -120 -1285 -36 1678 770 -811
1366h11K97M99k95P53O59o69j396K82K386m17k394M31K867K82k896j142K590J769
$$ -811 -514 -15 -310 443 1102 433 -963 -681 1705 1288 -1106 -675 2192 2474 -422 -1564 1026 2795
1384B795j596j504J043Q02j154J33k67J05RP96M79p18r19N56J529l45j886q01
$$ 2795 1199 -305 738 1540 386 519 252 357 366 1162 1641 923 4 560 2089 1744 -142 -943
1402i43K571J413j991j805J405J780n39k004K01J062q52p49Q10N56j103J78J790
$$ -943 1628 3041 1050 -755 650 2430 1891 -113 88 1150 298 -451 359 915 -188 -10 1780
1419A780k48k590k56L052P39k722j480K169J397j825j270J151J107j496q44J034
$$ 1780 1532 -1058 -1314 1738 2477 -245 -1725 444 1841 16 -1254 -103 1004 -492 -1336 -302
1435c02K80q25K25J365q21j640M62K314k34k296q6J816N52j507j161O17K032j011
$$ -302 -22 -847 -622 743 -78 -1718 -1256 1058 824 -1472 -1558 258 810 -697 -1858 -1241 791 -220
1453b20j354J55J016L19p53n41N36K1J89O35L32j465q01J785O41j421j221J225
$$ -220 -1574 -1419 -403 -84 -837 -1378 -842 -821 -632 3 335 -1130 -1931 -146 495 -926 -2147 -922
1471i22K159j343k629J494K061k29k005PQ60N11r09M60L95n33k03J535J57r43
$$ -922 1237 -106 -2735 -1241 820 591 -1414 -1407 -547 -36 -945 -485 -90 -623 -826 709 866 -77
1489g7j046J420J048j420j417Q74J859n55j565L43J228L59j279j73J138j80m45
$$ -77 -1123 297 1345 -75 -1492 -618 1241 686 -879 -536 692 1051 -228 -401 737 557 112
1506A12P2Q34n44j284J467Q93q31j611J147J775j214j735M80K422l03k116J00
$$ 112 184 1018 474 -810 657 1550 719 -892 255 2030 816 -919 -439 1983 1680 -436 -336
1523c36J465l09r17K10Q78m09l79M00P27q58m78J266P54j164j906O36J464j31
$$ -336 1129 820 -97 113 991 582 203 603 1330 472 -6 1260 2014 850 -1056 -420 1044 913
1541I13j311n4J293L70p92r18P73O58m08p08J46M53m68j17J069n0j408m7J226
$$ 913 -398 -452 841 1211 419 -499 274 932 524 -184 -38 415 -53 -170 899 849 -559 -606 620
1560F20K79j684m84J431M23j602n01J890L07k188L4J575M31j655L58J113l85j483
$$ 620 899 -785 -1269 162 585 -1017 -1518 372 679 -1509 -1475 100 531 -1124 -766 347 -38 -1521
1578a521M57J515o86q46L17J081j134p99M51J054k50p88J24O42L34n85J03L38
$$ -1521 -1064 451 -235 -1081 -764 317 -817 -1616 -1165 -111 -361 -1149 -1025 -383 -49 -634 -531 -193
1596a93n80k17J40M79n4k87o12P56R87j098o83M96R31n62p02O01R78m53m28M03
$$ -193 -773 -990 -850 -371 -425 -712 -1324 -568 419 -679 -1362 -866 65 -497 -1199 -598 380 -73 -501 -98
1616i8N95m92n19R81j6p97n76J115O11j288Q3J443K68j680l32J249M44p95p75
$$ -98 497 5 -514 467 451 -346 -922 193 804 -484 -401 1042 1310 -370 -702 547 991 196 -579
1635e79J260O38j108j14Q28O82r21n48O50J19p61j70J004J71q03l12J124P65j198
$$ -579 681 1319 211 97 925 1607 686 138 788 907 146 -24 980 1151 348 36 1160 1925 727
1654G27r70J043L00q96n48J182O25j041m21J321K82j405m34J227k12o30o88J178
$$ 727 -243 800 1100 204 -344 838 1463 422 1 1322 1604 199 -235 992 780 150 -538 640
1672F40L33p13l08P06J09m70j38L63k68m66q3M75K91m02J5K27J10m10m51j15P79
$$ 640 973 260 -48 658 767 297 159 522 254 -212 -295 180 471 69 84 311 421 11 -440 -555 224
1693B24j66p76j51Q18m7j30K24N88n02j194j58J521k94j261O71R89o24j273R42
$$ 224 58 -718 -869 -51 -98 -228 -4 584 82 -1112 -1270 251 -43 -1304 -633 356 -268 -1541 -599
1712e99J162q95j272O38O93m47o60Q51R76p66r25J075Q45j294l64M61K35p50P0
$$ -599 563 -332 -1604 -966 -273 -720 -1380 -529 447 -319 -1244 -169 676 -618 -982 -521 -286 -1036 -966
1731i66Q17j0l19j46L31K50k40k62k02L64j5l9O1J71O32l55Nl66M52m96rM54j16
$$ -966 -149 -159 -478 -624 -293 -43 -283 -545 -747 -383 -398 -437 -376 -205 427 72 77 -289 163 -333 -342 112 -4
1754dl63l64J508k96n27P7N03J03j240j11J611j40q33L75R03M9j379P74N38q36
$$ -4 -367 -731 777 481 -46 31 534 637 -603 -714 897 757 -76 299 1202 1251 -128 646 1184 348
1774C48j184J220P87j343l68R89Q18m45q53P75N56q25r49R48K73o44J45M25K49
$$ 348 -836 384 1171 -172 -540 449 1267 822 -31 744 1300 475 -474 474 747 103 248 673 922
1793I22j30m23K18K25n59m57K06M07n45J3P06K98j95q04M64L38l69o68K7N99r6
$$ 922 792 369 587 812 253 -204 2 409 -136 -123 583 881 686 -118 346 684 315 -353 -326 273 177
1814A77k35j00O06j3q30j94P94l99m20j6N00N5m62N3Q27pp98j88P22k37q40j59
$$ 177 -58 -158 448 435 -395 -589 205 -194 -614 -630 -130 -75 -537 -484 343 336 -462 -650 72 -165 -1005 -1164
1836a164R33K76j056PR59o0o18l19M45j8q19J51J226K31j199n5J542K44j819l3
$$ -1164 -231 45 -1011 -1004 -45 -105 -723 -1042 -597 -615 -1434 -1283 -57 174 -1025 -1080 462 706 -1113 -1146
1856a146J166k9j247K0J014L21r31O08Q03m86r78N68R20q78p72L51R73m60n1L43
$$ -1146 20 -9 -1256 -1236 -222 99 -832 -224 579 93 -885 -317 603 -275 -1047 -696 277 -183 -234 109
1876A09N96n01o62O96r4l92J84k95J13N57j80K91k18M27q4m01j71K90k32K57K87
$$ 109 705 204 -458 238 144 -248 -64 -359 -246 311 131 422 204 631 547 146 -25 265 33 290 577
1897E77jm4o58R25O78q52o34M6N32j09q58N93R30l88l30J62N96p04j87O59P0j380
$$ 577 576 532 -126 799 1477 625 -9 37 569 460 -398 195 1125 737 407 569 1165 461 274 933 1003 -377
1919c77K63J023P31j170m64R93K03q23k80K24L71m03m57N40J79n2OL83l44p05
$$ -377 -114 909 1640 470 6 999 1202 379 99 323 694 291 -166 374 553 501 507 890 546 -159
1939a59L46L55j73n87K24J54Or8l10M91M36j009m95J44Q58P2m75kJ98l9k16L0
$$ -159 187 542 369 -218 6 160 166 68 -242 249 685 -324 -819 -675 183 255 -220 -222 -24 -63 -279 -249
1961b49M06m43o53N76K13n30m51J176J40q22n03O23O52m54q77O25J31rk00J24
$$ -249 157 -286 -939 -363 -150 -680 -1131 45 185 -637 -1140 -517 135 -319 -1196 -571 -440 -449 -649 -525
1981e25L04q1k88N74k93n26L27J91K06n49n39Q23O63m64k98R1M95j62r27O07N01
$$ -525 -221 -302 -590 -16 -309 -835 -508 -317 -111 -660 -1199 -376 287 -177 -475 -384 111 -51 -978 -371 130
2002A30O5n40K21R9%m86Q90o6r17N5L57L76P5m49M97L68l21m79K09K22j25l76
$$ 130 195 -345 -124 -25 -25 -511 379 313 -604 -549 -192 184 259 -190 307 675 354 -125 84 306 181 -195
2024a95K40R3M47J08k15j05j33J1K12J40k8m65n4N12N25r86m57J201M49r75o78
$$ -195 45 138 585 693 478 373 240 251 463 603 575 110 56 568 1093 107 -350 851 1300 325 -353
2045c53R54J93k83n65J40N95m02J61M91k49j002P04Q04q42j137Q59R45j06j515
$$ -353 601 794 511 -54 86 681 279 440 931 682 -320 384 1188 346 -791 68 1013 907 -608
2064f08L01O99L08n52j61M36m87m1L70n0o32L11P92m19p36M6K03M74o96m7j04
$$ -608 -307 392 700 148 -13 423 -64 -105 265 215 -417 -106 686 267 -469 -423 -220 254 -442 -489 -593
2085e93M94L64J01r01l6O32L73q97l24N31l9k81j99O81q6l95M79m0r22o6J192
$$ -593 -99 265 366 -535 -571 61 434 -463 -787 -256 -295 -576 -775 -94 -180 -575 -96 -136 -1058 -1124 68
2106F8L3q46l63Q99N22p30m75O86L79q65p6L30J37o02L59P89k00j241Q93P53o03
$$ 68 101 -745 -1108 -209 313 -417 -892 -206 173 -692 -768 -438 -301 -903 -544 245 45 -1196 -303 450 -153
2127a53o54L78N58j23l46J60k8M02m40J71j73J8K52Q8k35j91N47J69pj58l32L86
$$ -153 -807 -429 129 6 -340 -180 -208 194 -246 -75 -248 -230 22 110 -125 -316 231 400 393 235 -97 289
2149B89P4J50n51J26J74K91n3m40J75P73k62n89N9K46q7q4j47J68n3Q8J98L24
$$ 289 363 513 -38 88 262 553 500 60 235 1008 746 157 216 462 375 291 144 312 259 347 545 869
2171H69n54k64Q80j65k50n08M38O22q37m36N80L68m8o98R3O29k99p14R63j18m64
$$ 869 315 51 931 766 516 8 446 1068 231 -205 375 743 695 -3 90 719 420 -294 669 551 87
2192H7j72Q70L65j398k96J261J74j273P6L68K32n37k39N37J31o23J66K28K54o48
$$ 87 -85 785 1150 -248 -544 717 891 -382 -306 62 294 -243 -482 55 186 -437 -271 -43 211 -437
2212d37L01L86o43K63p3L04l76j55K7L71k56M4o5k63R7L94m15jj40O45m71j56
$$ -437 -136 250 -393 -130 -203 101 -275 -430 -403 -32 -288 -244 -309 -572 -475 -81 -496 -497 -637 8 -463 -619
2234f19L55o2r4m55J021l63o54P8Q39K1j054J73J068n89n85J36J032k19j031M51
$$ -619 -264 -326 -420 -875 146 -217 -871 -793 46 67 -987 -814 254 -335 -920 -784 248 29 -1002 -551
2254e51O78n02n89Q19L53n86k57L35R37j106J06M83L50m22p44Q91J89n97l05L87
$$ -551 127 -375 -964 -145 208 -378 -635 -300 637 -469 -363 120 470 48 -696 195 384 -213 -518 -131
2274a31L51l62J85pL9N3j01J74L20m76QL52j76N40l39j08P8K19m24j48L58K67
$$ -131 220 -142 43 36 75 128 27 201 521 45 53 405 229 769 430 322 400 619 195 47 405 672
2296F72k36m91L62M50o23j26P28J07q84j18M94K28m24k99Q55l8o64K35L40O3p57
$$ 672 436 -55 307 757 134 8 736 843 -41 -159 335 563 139 -160 695 657 -7 228 568 631 -126
2317a26M59N04q45k98O24K51m33k74NM61O3m55K78J4j75k63j46N39j89p8J37j02
$$ -126 333 837 -8 -306 318 569 136 -138 -133 328 391 -64 214 228 53 -210 -356 183 -6 -84 53 -49
2339d9J05j02k5Q4j71l72J53J40K53k39P4K09k47K3m51L64P2q4k27j39L74j48
$$ -49 56 -46 -71 13 -158 -530 -377 -237 16 -223 -149 60 -187 -164 -615 -251 -179 -263 -490 -629 -255 -403
2361d03N5k0J41j06l97N38q8P2m1j12M16l74k23P1K64j99j58L06M1k11o23R99
$$ -403 -348 -368 -227 -333 -730 -192 -280 -208 -249 -361 55 -319 -542 -471 -207 -406 -564 -258 -217 -428 -1051 -52
2383e2j5k15m62P88J85l51m62L73L51j72l55M51M73m08j83K45L85q53j4N61l03
$$ -52 -67 -282 -744 44 229 -122 -584 -211 140 -32 -387 64 537 129 -54 191 576 -277 -291 270 -33
2404c3o9K36J88k38k96N59K00p72M33K18L80n64j91L37k07j38J73P75q66l2O49
$$ -33 -102 134 322 84 -212 347 547 -225 208 426 806 242 51 388 181 43 216 991 125 93 742
2425G42l14k02k9M50J62o40j73P23l12k45K99L36n29k87N44K23q99K20P51l76
$$ 742 428 226 197 647 809 169 -4 719 407 162 461 797 268 -19 525 748 -151 69 820 444
2445D44n14L21K99J82p79L41K36m94n5L57K8l03k85L26K30l40J58M6K86o85k01
$$ 444 -70 251 550 732 -47 294 530 36 -19 338 366 63 -222 104 334 -6 152 198 484 -201 -402
2466d02M34j10M9k75K87Pk20j09O63n00l76K26J31k50Q1K39j48q5J48J6M1j0l89
$$ -402 32 -78 -29 -304 -17 -10 -230 -339 324 -176 -552 -326 -195 -445 -364 -125 -273 -358 -210 -194 -153 -163 -552
2489e52J54q8o0N01J7l27o5L49k56l74M43k0j76q3Q8J18L7J41K02k81l38P3K22
$$ -552 -398 -486 -546 -45 -28 -355 -420 -71 -327 -701 -258 -278 -454 -537 -449 -331 -294 -153 49 -232 -570 -497 -275
2512b75J91m44J00M65l64j82J66M00q4k34j60N76k93l15N22N5J02n00L66K11k40
$$ -275 -84 -528 -428 37 -327 -509 -343 57 -27 -261 -421 155 -138 -453 69 124 226 -274 92 303 63
2533F3k49L19k37r3J6M76l9m9qK34r2j9k68L16R3m62j79M22p8k23N42j98p3j63
$$ 63 -186 133 -104 -197 -181 295 256 207 199 433 341 322 54 370 463 1 -178 244 166 -57 485 287 214 51
2557E1L00Mp0O1j75j25J90m3L96R2m05J63o8k87K28k84N84m19k4K74l40o1K95
$$ 51 351 355 285 346 171 46 236 193 589 681 276 439 371 84 312 28 612 193 169 443 103 42 337
2580C37M7m14n0M47N2p98J61K92J40j99l5M98k50m06L38J48j82l99K89O37r53
$$ 337 384 -30 -80 367 419 -379 -218 74 214 15 -20 478 228 -178 160 308 126 -273 16 653 -300
2601c00l08M24M86n45l27L56K76n49k29O46j25l34K37L25l29l18M55n2j32k55
$$ -300 -608 -184 302 -243 -570 -214 62 -487 -716 -70 -195 -529 -292 33 -296 -614 -159 -211 -343 -598
2621e98K3J51k4J00K78j71k93J98Lk11K39l0M47m89m34P31P0l67J09N09k52n26
$$ -598 -575 -424 -448 -348 -70 -241 -534 -336 -333 -544 -305 -335 112 -377 -811 -80 -10 -377 -268 241 -11 -537
2643e37M03nj95N4L03K03k70n75N24J77l87O4J69K39m14l4L80J78k30Q0K35O3
$$ -537 -134 -139 -334 -280 23 226 -44 -619 -95 82 -305 -241 -72 167 -247 -281 99 277 47 127 362 425
2665D25m85k9J78Q2j77J00O47l51n16L59N25r0o58K88P7L83k64k28L54m69J12
$$ 425 -60 -89 89 171 -6 94 741 390 -126 233 758 668 10 298 375 758 494 266 620 151 263
2686B63L43l4m56o9K87L43k39j56r1O9K02k92k3K59p4j17pj84L55K99j18j60R
$$ 263 606 572 116 47 334 677 438 282 191 260 462 170 147 406 332 215 208 24 379 678 560 400 409
2709D09R5k99OJ41j05j21RJ70l02k72L81J47P6l56O8J50l07l24L11M40l05j11
$$ 409 504 205 211 352 247 126 135 305 3 -269 112 259 335 -21 47 197 -110 -434 -123 317 12 -99
2731i9j26N30n91k69O39l22k36P4J35Jj92j05K83K24k47n01P26j08p0J28J33n15
$$ -99 -225 305 -286 -555 84 -238 -474 -400 -265 -264 -456 -561 -278 -54 -301 -802 -76 -184 -254 -126 7 -508
2753e08m5P2L98L3l76j6J94k34L4L4J20n9K94j28j79k02P72l68o2l0J35l08n4
$$ -508 -553 -481 -83 -50 -426 -442 -248 -482 -448 -414 -294 -353 -59 -187 -366 -568 204 -164 -226 -256 -121 -429 -483
2776d83M30J32l36J06N0m5l63N51J95j22m76M1P64l53l97R9O42k39m92J54O58
$$ -483 -53 79 -257 -151 -101 -146 -509 42 237 115 -361 -320 444 91 -306 -207 435 196 -296 -142 516
2797E16k51l75O6N1j73J11K32L10m40j69P36l20k48q0M87j2l66N6L10K54m83L75
$$ 516 265 -110 -44 7 -166 -55 177 487 47 -122 614 294 46 -34 453 441 75 131 441 695 212 587
2819E87n59K24J87J14m03K15k98O09m41K9L0L05l29k64K60l14j19N0N95j65l57
$$ 587 28 252 439 553 150 365 67 676 235 264 294 599 270 6 266 -48 -167 -117 478 313 -44
2840d4K60J59k90J30j00r5k29K92K1J00j19k64M84M5n30l3M60J77q05p7N09K52
$$ -44 216 375 85 215 115 20 -209 83 104 204 85 -179 305 350 -180 -213 247 424 -381 -458 51 303
2862C03l20l53L57J95m41k70P10n81k60K90L91k64q4Mk9J60l11L97j76j49J07
$$ 303 -17 -370 -13 182 -259 -529 181 -400 -660 -370 21 -243 -327 -323 -352 -192 -503 -106 -282 -431 -324
2883c24k0n0J39K24Q5j49j75K64j91l27M55k02o4K9j56K86K09k71K32j56j53j00
$$ -324 -344 -394 -255 -31 54 -95 -270 -6 -197 -524 -69 -271 -335 -306 -462 -176 33 -238 -6 -162 -315 -415
2905d15J22J91l9j33N70m1l93K07L07m0o67O1M92N2m16K40j8j99M7R0M26j05l28
$$ -415 -293 -102 -141 -274 296 255 -138 69 376 336 -331 -270 222 274 -142 98 80 -119 -72 18 444 339 11
2928A1N1K24k55q9N25p9m1k22n1L54m62K55J94J57m73n5O00j7m64J48M25l28l15
$$ 11 62 286 31 -58 467 388 347 125 74 428 -34 221 415 572 99 44 644 627 163 311 736 408 93
2951I3J66J4n2P5P2n5n3R7O9J87l49R2l74o8J54L00j44J59j38K08p2l29r4K72
$$ 93 259 273 221 296 368 313 260 357 426 613 264 356 -18 -86 68 368 224 383 245 453 381 52 -42 230
2975B30Jo08N46J19k88l14M50J32k55l7K97L9o31K4K20J28j50K94P0j84l53K8
$$ 230 231 -377 169 288 0 -314 136 268 13 -24 273 312 -319 -295 -75 53 -97 197 267 83 -270 -242
2997b42K65j29j87N22k82m70J96K27K76n80M27L7m30k9J07J68j38l27K25L31m23
$$ -242 23 -106 -293 229 -53 -523 -327 -100 176 -404 23 60 -370 -399 -292 -124 -262 -589 -364 -33 -456
3018d56Q0L43L8k26j59R1J7j48L59r0m0j9K37k80K27k84P6K78n37Q0L05pr7K70
$$ -456 -376 -33 5 -221 -380 -289 -272 -420 -61 -151 -191 -210 27 -253 -26 -310 -234 44 -493 -413 -108 -115 -212 58
3042E8j66J72j08j47N5L58l86K41o6L9l1J15K28l66k19M73j32k13M2J48K54l33
$$ 58 -108 64 -44 -191 -136 222 -164 77 11 50 19 134 362 -4 -223 250 118 -95 -53 95 349 16
3064A6J60O9J18l82J17J26j5J13k98K92j35Q5O3K7m33K93J51k35K84k38O6j1J80
$$ 16 176 245 363 -19 98 224 209 322 24 316 181 266 329 356 -77 216 367 132 416 178 244 233 413
3087D13p4N6k85Q3k0pJ15n9p0J8k23R5L47j69j54p6K01l86NK57j37K21l98J61
$$ 413 339 395 110 193 173 166 281 222 152 170 -53 42 389 220 66 -10 191 -195 -190 67 -70 151 -247 -86
3111h6m4O3K02k23J66l76l8M16k60J75mQ0l02J02o1K73m00k64L73J69l94Q6L34
$$ -86 -130 -67 135 -88 78 -298 -336 80 -180 -5 -9 71 -231 -129 -190 83 -317 -581 -208 -39 -433 -347 -13
3134a3k24K60j78K44k17n40K53N13m20p3K0M16p4n91N74m02K78l05K32J36j3J69
$$ -13 -237 23 -155 89 -128 -668 -415 98 -322 -395 -375 41 -33 -624 -50 -452 -174 -479 -247 -111 -124 45
3156D5j73J29r9j30R7J63K6l28L22j1j16j87J25M24l35o3j07r9M00K69l18O6K15
$$ 45 -128 1 -98 -228 -131 32 58 -270 52 41 -75 -262 -137 287 -48 -111 -218 -317 83 352 34 100 315
3179C15j96J03k07J86K6j65n2N0O2J31L8r2j57J23k19J26J81j08M5K1K52l57m2
$$ 315 119 222 15 201 227 62 10 60 122 253 291 199 42 165 -54 72 253 145 190 211 463 106 64
3202F4N56k70l03L37mk15J3J84L2k70K3J37Q2m66L62q3N9j22K87k49q2j9J02L93
$$ 64 620 350 47 384 380 165 178 362 394 124 147 284 366 -100 262 179 238 116 403 154 72 53 155 548
3226E48k67j20k03K79k36J33q2J75n7J36o5K78n64k0N24o52M7O1m4j83K84m02
$$ 548 281 161 -42 237 1 134 52 227 170 306 241 519 -45 -65 459 -193 -146 -85 -129 -312 -28 -430
3248d30J98MJ80k1r5j20rK43m06J1L40r5m37L17K20k6j39j71J80K44k73j69L56
$$ -430 -232 -228 -48 -69 -164 -284 -293 -50 -456 -445 -105 -200 -637 -320 -100 -126 -265 -436 -256 -12 -285 -454 -98
3271i8j44m10L79J08P3L5k9k14l50L87J69j80J07j21J92m26M49l41K60k05K19
$$ -98 -242 -652 -273 -165 -92 -57 -86 -300 -650 -263 -94 -274 -167 -288 -96 -522 -73 -414 -154 -359 -140
3292a40k89J37K12P1M6j24k92K7K18k27M36k7k9j80J05j01K13k68J12m2L19l35
$$ -140 -429 -292 -80 -9 37 -87 -379 -352 -134 -361 75 48 19 -161 -56 -157 56 -212 -100 -142 177 -158
3314a58j4M88l66L07m0k60J55n0J61j26J43r3J18k8l00K45k16K02K86l97J97o
$$ -158 -172 316 -50 257 217 -43 112 62 223 97 240 147 265 237 -63 182 -34 168 454 57 254 248
3336B48j79n9J76pQ1N4j22Nj64L08j42J23Ll95P7J54k08K51Q0j19l57L01j51L5
$$ 248 69 10 186 179 260 314 192 197 33 341 199 322 325 -70 7 161 -47 204 284 165 -192 109 -42 -7
3360gJ74J55l54MK47m96M88j82k62L36k15J39j39K10P0k04k75L03J26l08j1l5
$$ -7 167 322 -32 -28 219 -277 211 29 -233 103 -112 27 -112 98 168 -36 -311 -8 118 -190 -201 -236
3382b36J53Jk00k70K79J03R1j49k8j76L44O2N8j67l95K16L17j15j06j62N57k54
$$ -236 -83 -82 -282 -552 -273 -170 -79 -228 -256 -432 -88 -26 32 -135 -530 -314 3 -112 -218 -380 177 -77
3404g7k28O3J9O6K3m16P8J95j18J85O8M2l29J21J6K91lk55l7L32l80J43N5L15
$$ -77 -305 -242 -223 -157 -134 -550 -472 -277 -395 -210 -142 -100 -429 -308 -292 -1 -4 -259 -296 36 -344 -201 -146 169
3428A69m36p9L29N8j47j64N41m61M66j32m3j21K91j88n8M59n15L09j11l7J96k9
$$ 169 -267 -346 -17 41 -106 -270 271 -190 276 144 101 -20 271 83 25 484 -31 278 167 130 326 297
3450B97J40j58L6k63J90K06j60l56J74J75J10k58P4J82j56Q8m1k24J83j25K36
$$ 297 437 279 315 52 242 448 288 -68 106 281 391 133 207 389 233 321 280 56 239 114 350
3471C50J57m02l31M70K3j74NO4M5J24j68Q9q4R1n8N3k15J8j34J04M0N6j17J73
$$ 350 507 105 -226 244 267 93 98 162 207 331 163 252 168 259 201 254 39 57 -77 27 67 123 6 179
3495A79o3j12Q6J56l19K80r8O7k65j33K6J28p5k74L38j39J67r7j35J62o5O1j96
$$ 179 116 4 90 246 -73 207 109 176 -89 -222 -196 -68 -143 -417 -79 -218 -51 -148 -283 -121 -186 -125 -321
3518c21L63l05J38J88k13k75K74j04k37K32K90k55k30K70j80K63n1k11L4J24K28
$$ -321 42 -263 -125 63 -150 -425 -151 -255 -492 -260 30 -225 -455 -185 -365 -102 -153 -364 -330 -206 22
3539B2j21m5j15j38J62J64K9k63J25l1q4L3J07J78j92q4K18J79k05J1K4k44J61
$$ 22 -99 -144 -259 -397 -235 -71 -42 -305 -180 -211 -295 -262 -155 23 -169 -253 -35 144 -61 -50 -26 -270 -109
3562a09k14K74K0J50p2j15K24m48M14J45m51K03K08Kk04o7K38k7J3r1l9J09j14
$$ -109 -323 -49 -29 121 49 -66 158 -290 124 269 -182 21 229 231 27 -40 198 171 184 93 54 163 49
3585D9Q3J3l7J54rk83K33j26J59r6j70K6K97m72O06J09n69K67k03K20j54n8J18
$$ 49 132 145 108 262 253 -30 203 77 236 140 -30 -4 293 -179 427 536 -33 234 31 251 97 39 157
3608A57J69j66k10K18J17j07r6J20P4l82N8Q3j02K47k45M4K51k43j09K26r0J08
$$ 157 326 160 -50 168 285 178 82 202 276 -106 -48 35 -67 180 -65 -21 230 -13 -122 104 14 122
3630A22l1Q6k10P0j40O3J01o7k47J59j7l3j2j44M15l82J47l23L62N1l01K82K4
$$ 122 91 177 -33 37 -103 -40 61 -6 -253 -94 -111 -144 -156 -300 115 -267 -120 -443 -81 -30 -331 -49 -25
3653b5k32qJ23j90K05j27K81j39Q0k46K21N2j78J9K67n39K66N8k53K73j81O2M
$$ -25 -257 -265 -142 -332 -127 -254 27 -112 -32 -278 -57 -5 -183 -164 103 -436 -170 -112 -365 -92 -273 -211 -207
3676b07O02p07J43%p1K61j92j06o9N14J0j25k6k78K19R5K4l16K53P1J56j9k76
$$ -207 395 -312 -169 -169 -240 21 -171 -277 -346 168 178 53 27 -251 -32 63 87 -229 24 95 251 232 -44
3699d4J08N3N4m3L68m06M9l62K23j82K07N36n70Q0J53j07J66l13L54j00j0L7j20
$$ -44 64 117 171 128 496 90 139 -223 0 -182 25 561 -9 71 224 117 283 -30 324 224 214 251 131
3722A31J09k20j8l1K58l75L02J70k26K5N7P5j64J26p7K14r6j14j42L17l81Q4o2
$$ 131 240 20 2 -29 229 -146 156 326 100 125 182 257 93 219 142 356 260 146 4 321 -60 24 -38
3745c8K63k43L20j51k13N20l22k00L21m75K76j67K03m2J63k49p7j3j5J26K20K6
$$ -38 225 -18 302 151 -62 458 136 -64 257 -218 58 -109 94 52 215 -34 -111 -124 -139 -13 207 233
3767B33n58L46k98K29M2o5j54n7J38n4j42L78Lj74k95Q1M17k62j45mj45L89j90
$$ 233 -325 21 -277 -48 -6 -71 -225 -282 -144 -198 -340 38 41 -133 -428 -347 70 -192 -337 -341 -486 -97 -287
3790b87J92J44k59j8M37m95o3P49o66J25O4J66n59Q8L22k03M7j23M63k44j96O72
$$ -287 -95 49 -210 -228 209 -286 -349 400 -266 -141 -77 89 -470 -382 -60 -263 -216 -339 124 -120 -316 356
3812C56n96rJ25k84K58J3J80Om00K37K34o2j11J20J60Km7l51J40l3L08l63L02
$$ 356 -240 -249 -124 -408 -150 -137 43 49 -351 -114 120 58 -53 67 227 229 182 -169 -29 -62 246 -117 185
3835A85m40J91O7j42M69j87j11K42j14M1k0m54M77N4m5R1n08L33j05n7K77ko3
$$ 185 -255 -64 3 -139 330 143 32 274 160 201 181 -273 204 258 213 304 -204 129 24 -33 244 242 179
3858A79m1J99m30K73r1R1k13N5J01j4NJ91n18L29k7k61J09L46k41lK56k22j52
$$ 179 138 337 -93 180 89 180 -33 22 123 109 114 305 -213 116 89 -172 -63 283 42 39 295 73 -79
3881g9Ln7oK43M4r6rk36oQ0M5r8K57K0k23L72l35K05q6j31Q0m2k78M81j87j04
$$ -79 -76 -133 -139 104 148 52 43 -193 -199 -119 -74 -172 85 105 -118 254 -81 124 38 -93 -13 -55 -333 148 -39 -143
3907a43J18l3k9L6p5l8O1q8n8J91m3l28J55J45l11M53k17J71j72J39nJ19j02q3
$$ -143 -25 -58 -87 -51 -126 -164 -103 -191 -249 -58 -101 -429 -274 -129 -440 13 -204 -33 -205 -66 -71 48 -54 -137
3931a37N0r6q0J98j04R7J4l63M45k51Q4j68K14J12k37qJ91K11k93M02j69r2K28
$$ -137 -87 -183 -263 -65 -169 -72 -58 -421 24 -227 -143 -311 -97 15 -222 -230 -39 172 -121 281 112 20 248
3954B48m13K09j10J42K05j06lJ9j50K92m1n1j12l7M2m7J64j62M8L8K60k35l2q4
$$ 248 -165 44 -66 76 281 175 172 191 41 333 292 241 129 92 134 87 251 89 137 175 435 200 168 84
3978H4L68l19j05P8P3k9K17j68j86J89K24k75o8R9j62K57k71j5J25j81J19k9K55
$$ 84 452 133 28 106 179 150 367 199 13 202 426 151 83 182 20 277 6 -9 116 -65 54 25 280
4001B80k04J66k72K5K29K8P8m56J64q8M6J90Nm29J37Q7J94j22Q1M2k00j12n7N68
$$ 280 76 242 -30 -5 224 252 330 -126 38 -50 -4 186 191 -238 -101 -14 180 58 139 181 -19 -131 -188 380
4025C80k72m53J09J08r1J65P9Q3l97J91m8n1J21r5j26K11L9p1j06J55j71O2j8
$$ 380 108 -345 -236 -128 -219 -54 25 108 -289 -98 -146 -197 -76 -171 -297 -86 -47 -118 -224 -69 -240 -178 -196
4048a96j22m0J36o5K07k56L67k47P2K29j71q0J78p7j01Q3n0K08k41K98l10J23
$$ -196 -318 -358 -222 -287 -80 -336 31 -216 -144 85 -86 -166 12 -65 -166 -83 -133 75 -166 132 -178 -55
4070e5j92R5J69j63J22j71r6N53k19j14P8L44k15m8j94K33K17m18J97o7J37m4
$$ -55 -247 -152 17 -146 -24 -195 -291 262 43 -71 7 351 136 88 -106 127 344 -74 123 56 193 149
4092A49K5l7Q9k91J16j21J47k24L14J75m4k06q7L6L74j74j05J80j05j73J20m1
$$ 149 174 137 226 -65 51 -70 77 -147 167 342 298 92 5 41 415 241 136 316 211 38 158 117
4114A17j9K56R4k04j80k02K08L1r2L7k3J43J13n17K50K61m14j13L17J15Qj32l
$$ 117 98 354 448 244 64 -138 70 101 9 46 23 166 279 -238 12 273 -141 -254 63 178 186 54 51
4137E1m7J27j5O5p3j86K75j39j21M5O4R5l13P0J26j09L7Q3J71Jj27k75J03J3%
$$ 51 4 131 116 181 108 -78 197 58 -63 -18 46 141 -172 -102 24 -85 -48 35 206 207 80 -195 -92 -79 -79
4162g9K51l22j1M3l10M02j55J23K09k56l1k66L78l9o9j9r8R0K9j26K50j41P6N2
$$ -79 172 -150 -161 -118 -428 -26 -181 -58 151 -105 -136 -402 -24 -63 -132 -151 -249 -159 -130 -256 -6 -147 -71 -19
4186a9J1m89M32o1k59M59q4j14j18K95k39n8K05k93K42K20k5m30J04K44j99J22
$$ -19 -8 -497 -65 -126 -385 74 -10 -124 -242 53 -186 -244 -39 -332 -90 130 105 -325 -221 23 -176 -54
4208e4J97j6j60k58K53L03p1n3k99k7m5M0j28L04l0j06P7M2O8m5l4P7N8Or0j53
$$ -54 143 127 -33 -291 -38 265 194 141 -158 -185 -230 -190 -318 -14 -44 -150 -73 -31 37 -8 -42 35 93 99 9 -144
4234a44K20j59j43L21J8Lo6m2K60J68l74M7R9m21N09j98J44J37j61q3R8R1n47
$$ -144 76 -83 -226 95 113 116 50 8 268 436 62 109 208 -213 296 98 242 379 218 135 233 324 -223
4257b23K13K16j65j02K24P7j24k97L02O2l62J28J47n4l19L21j88J80J04k15k7
$$ -223 -10 206 41 -61 163 240 116 -181 121 183 -179 -51 96 42 -277 44 -144 36 140 -75 -102
4278a02J95k95J66J58R3l36J81j29q0J61k35K13J12l26K39j92J53l49Q0J6j7K77
$$ -102 93 -202 -36 122 215 -121 60 -69 -149 12 -223 -10 102 -224 15 -177 -24 -373 -293 -277 -294 -17
4300a7K3l19M24k95L11o85N02k37j1K15K42k7l32J42j49K9j07K4J25J12j86j5
$$ -17 6 -313 111 -184 127 -558 -56 -293 -304 -89 153 126 -206 -64 -213 -184 -291 -267 -142 -30 -216 -231
4322b31L90m4j68P8K2j94q8K34j24L02k46q1m0K77m5k13p9J36J73l76K22J76k8
$$ -231 159 115 -53 25 47 -147 -235 -1 -125 177 -69 -150 -190 87 42 -171 -250 -114 59 -317 -95 81 53
4345E3l1J05k64K82j42K29j71Q9j13nQ9j48M13j75k75O5K04J74l84p4o3k6J12
$$ 53 22 127 -137 145 3 232 61 150 37 32 121 -27 386 211 -64 1 205 379 -5 -79 -142 -168 -56
4368e6L0N5l6J02J97m52L98J02k89M7j9p3O0P6K8q8K44j32m7O8r2k88J42K84k48
$$ -56 -26 29 -7 95 292 -160 238 340 51 98 79 6 66 142 170 82 326 194 147 215 123 -165 -23 261 13
4393A3L37k99k44L03k0k38j13L39jj44MK40r7j41rk65M98l70NK29Q1k89j46J2
$$ 13 350 51 -193 110 90 -148 -261 78 77 -67 -63 177 80 -61 -70 -335 163 -207 -202 27 108 -181 -327 -315
4417c15K23K1j94M6J06j96J62K55j94K26j93j78k1L47n04J76j74N80l58K04j10
$$ -315 -92 -71 -265 -219 -113 -309 -147 108 -86 140 -53 -231 -252 95 -409 -233 -407 173 -185 19 -91
4438i1K5o4N6l32L44J30j83q2K03j22J11j7K86m4l84J47J28l01J46L16m19k4j63
$$ -91 -66 -130 -74 -406 -62 68 -115 -197 6 -116 -5 -22 264 220 -164 -17 111 -190 -44 272 -147 -171 -334
4461c34K01L39j30l84O38k7k07l98K31M9P8j48L87m29J48L1k16L12r4J04J77l48
$$ -334 -133 206 76 -308 330 303 96 -302 -71 -22 56 -92 295 -134 14 45 -171 141 47 151 328 -20
4483b0J95m80M14p3j77K59K36k95K6K42k35k95L17J10J00m18K16L51k64j7K94
$$ -20 175 -305 109 36 -141 118 354 59 85 327 92 -203 114 224 324 -94 122 473 209 192 486
4504D86l45J99k28J90j43n8K3K24m5l77K25M4l8oJ6j4K86m37P5J76j96j30m1J9
$$ 486 141 340 112 302 159 101 124 348 303 -74 151 195 157 151 167 153 439 2 77 253 57 -73 -114 -95
4528i5k38L62K12j27k91M3O5k0m24N27O2l47K10l64N31q7k21L86k20j75NK20p6
$$ -95 -333 29 241 114 -177 -134 -69 -89 -513 14 76 -271 -61 -425 106 19 -202 184 -36 -211 -206 14 -62
4551f2j19K00k83j44M39n1K3P6j34R5J10m08j24L43k96J95o4K03M1n3k03J97k24
$$ -62 -181 19 -264 -408 31 -20 3 79 -55 40 150 -258 -382 -39 -335 -140 -204 -1 40 -13 -216 -19 -243
4574b43Q8j07K08L2n7q4m2J62Q8K53m36j88J72K09l55L42r6R4jl14K39j85L45
$$ -243 -155 -262 -54 -22 -79 -163 -205 -43 45 298 -138 -326 -154 55 -300 42 -54 40 39 -275 -36 -221 124
4597A24N0j63k21M19o9k47L90l64J17j04r3J75K13k65j77J12M09n68L47j98M8
$$ 124 174 11 -210 209 140 -107 283 -81 36 -68 -161 14 227 -38 -215 -103 306 -262 85 -113 -65
4618f5K79k07o8K66m9O2O6j97p5J21j12K40k52J36j04M12k86k9j97K56n3r4n3
$$ -65 214 7 -61 205 156 218 284 87 12 133 21 261 9 145 41 453 167 138 -59 197 144 50 -3
4641cr0n7N65j95k24O6K14k89k30L81n6j69L4J39k7J01k30J56j34j30J2L66M5
$$ -3 -93 -150 415 220 -4 62 276 -13 -243 138 82 -87 -53 86 59 160 -70 86 -48 -178 -166 200 245
4664B45L3j54l40K12k9J02o3k51L80J11n07K7K76K4o5j76K48m7J16l66M32m39
$$ 245 278 124 -216 -4 -33 69 6 -245 135 246 -261 -234 42 66 1 -175 73 26 142 -224 208 -231
4686b31J64j16K50m6J27j21j00j61L21j65k47J07J48j70K22Nk7No6k0J22j93J88
$$ -231 -67 -183 67 21 148 27 -73 -234 87 -78 -325 -218 -70 -240 -18 -13 -40 -35 -101 -121 1 -192 -4
4709dR2k56Q0k94K32j42J72M35l86j04K99k69J37J05k12ln3r7L88O2j71m01M77
$$ -4 88 -168 -88 -382 -150 -292 -120 315 -71 -175 124 -145 -8 97 -115 -118 -171 -268 120 182 11 -390 87
4732H7l57M05l11J8L23J17l06K34o4p7J32l30K72j03L0J18j43j10J62jN4k38J48
$$ 87 -270 135 -176 -158 165 282 -24 210 146 69 201 -129 143 40 70 188 45 -65 97 96 150 -88 60
4755F0K35l01r9K68k74K84Q9m67N65l50J05q6j35N44l20j14r2ql7J81O4l52M47
$$ 60 295 -6 -105 163 -111 173 262 -205 360 10 115 29 -106 438 118 4 -88 -96 -133 48 112 -240 207
4778B07m4j97K08r4k86K80J02k78L92n23L93k61K37m22M40j06J82k49P6k33J36
$$ 207 163 -34 174 80 -206 74 176 -102 290 -233 160 -101 136 -286 154 48 230 -19 57 -176 -40
4799d0J07J26l73K71j19J24Mm16L34j48Q2j01J56k61K9J61J40J10m84K56J4k0
$$ -40 67 193 -180 91 -28 96 100 -316 18 -130 -48 -149 7 -254 -225 -64 76 186 -298 -42 -28 -48
4821d8O5J9m90K56O3J42j61l0J36P7j26j2P7k29L46l18J08M1P7l66M69J27l41
$$ -48 17 36 -454 -198 -135 7 -154 -184 -48 29 -97 -109 -32 -261 85 -233 -125 -84 -7 -373 96 223 -118
4844a18P8n1J67j44L25j89l17J93J3p4j00K77n6J91l99K60ro5K8q2l7J00M6m2
$$ -118 -40 -91 76 -68 257 68 -249 -56 -43 -117 -217 60 4 195 -204 56 47 -18 10 -72 -109 -9 37 -5
4868ej41L58l31L82p5k9K88l97J69k50K51j98J86m14Q1O8L01k46j21RJ7J18J00
$$ -5 -146 212 -119 263 188 159 447 50 219 -31 220 22 208 -206 -125 -57 244 -2 -123 -114 -97 21 121
4891A21J1m3j35L77k44P6k1l15M00l9L23o10K93k39L22j56K24j46r4l0p0j9J99
$$ 121 132 89 -46 331 87 163 142 -173 227 188 511 -99 194 -45 277 121 345 199 105 75 5 -14 185
4914A85j48m7Qj06Q6j73j51N83R1n06K89j7l2n1k98M87pk96J35J2Nj53m3j8j7
$$ 185 37 -10 -2 -108 -22 -195 -346 237 328 -178 111 94 62 11 -287 200 193 -103 32 44 49 -104 -147 -165 -182
4939a82j15L07j38l2M2L2R9q2p9j74M42m1Mq2k41K76k18J33n8m7J05j61R5j35
$$ -182 -297 10 -128 -160 -118 -86 13 -69 -148 -322 120 79 83 1 -240 36 -182 -49 -107 -154 -49 -210 -115 -250
4963b50M9J89j72K72k47l15L23J22p6l61M16NQ7oQ6k78J07J03j02M0L4j41K00
$$ -250 -201 -12 -184 88 -159 -474 -151 -29 -105 -466 -50 -45 42 36 122 -156 -49 54 -48 -8 26 -115 85
4986H5k89K35k77K46q9K10p6J33l45N3J43K82m96P9J57j19J00Q1l0P1k12J86J8
$$ 85 -204 31 -246 0 -89 121 45 178 -167 -114 29 311 -185 -106 51 -68 32 113 83 154 -58 128 146
5009A46j81J66j2O9m3j63j77K32J01j17P6K1n5J24j45j48K99J3p4Q3j12J64j82
$$ 146 -35 131 119 188 145 -18 -195 37 138 21 97 118 63 187 42 -106 193 206 132 215 103 267 85
5032H5qL5l52M46k51K54k76J42n7K81l5m30J29k77K89J46j70k22J41Q5j67L50
$$ 85 77 112 -240 206 -45 209 -67 75 18 299 264 -166 -37 -314 -25 121 -49 -271 -130 -45 -212 138
5054A38l08m4K34M2K35n65J77J31Qk27k20J48J69KjP8k80L63m16J23k07L63J50
$$ 138 -170 -214 20 62 297 -268 -91 40 48 -179 -399 -251 -82 -80 -81 -3 -283 80 -336 -213 -420 -57 93
5077I3K0l09L15j44j37K61l14M05l98J85R4O7k46P3R8l22L51l73J13K87k13j00
$$ 93 113 -196 119 -25 -162 99 -215 190 -208 -23 71 138 -108 -35 63 -259 92 -281 -168 119 -94 -194
5099a94MK32J34j18r9k4k71J56K32j11r5J12n2N7j02O8K87l39P9L98l13l50L94
$$ -194 -190 42 176 58 -41 -65 -336 -180 52 -59 -154 -42 -94 -37 -139 -71 216 -123 -44 354 41 -309 85
5122H5J6j27K34o6m47L13K36j25K72k53k90j96L73J57K8k52Q7K8J02m02K25O8
$$ 85 101 -26 208 142 -305 8 244 119 391 138 -152 -348 25 182 210 -42 45 73 175 -227 -2 66
5144F6j25J84j18LJ10j72K31k25J30j04J19l50J85K58n2k75K78p4M0m9j74r8M
$$ 66 -59 125 7 10 120 -52 179 -46 84 -20 99 -251 -66 192 140 -135 143 69 109 60 -114 -212 -208
5167b08K86L0n1Q5k27j31j53M03m4J75k00l8J89OJ0j18q3p2K25q2K9Q0j0M1k32
$$ -208 78 108 57 142 -85 -216 -369 34 -10 165 -35 -73 116 122 132 14 -69 -141 84 2 31 111 101 142 -90
5192i0K0J86j91k26K22J33M6j83j26J35J24r3K75k21j31N6N7k9L28n17L07j92
$$ -90 -70 116 -75 -301 -79 54 100 -83 -209 -74 50 -43 232 11 -120 -64 -7 -36 292 -225 82 -110
5214a10l0K33R0j19k4j32Q6m8l8K96j0Rm58L11j07J51j77p3J8J32k71rL12l0K66
$$ -110 -140 93 183 64 40 -92 -6 -54 -92 204 194 203 -255 56 -51 100 -77 -150 -132 0 -271 -280 32 2 268
5239B68l54K66l08Q1J54j31O2J12J35k43j02J30n0j15R4KKJ8J45m03M17j32M29
$$ 268 -86 180 -128 -47 107 -24 38 150 285 42 -60 70 20 -95 -1 1 3 21 166 -237 180 48 477
5262D77l12o1l30L66r3n4J11R9o6q5q9J27J26l02K56J88k79kP6j75N0j91K94k56
$$ 477 165 104 -226 140 47 -7 104 203 137 52 -37 90 216 -86 170 358 79 77 153 -22 28 -163 131 -125
5286a25K40j85J50n7J28J71l68K7J21K19k44L3j08N3P0L8l5p0K61m87M8n3L70
$$ -125 115 -70 80 23 151 322 -46 -19 102 321 77 110 2 55 125 163 128 58 319 -168 -120 -173 197
5309A97o5n8j50P3M2K7O7k61L36m88N12k11O7k11j97L49j46M31k55j05j28J8R5
$$ 197 132 74 -76 -3 39 66 133 -128 208 -280 232 21 88 -123 -320 29 -117 314 59 -46 -174 -156 -61
5332f1R7j23K79q1j52M9o5J67j23k23J43J65l65M03j49J30j61L8Pj72Q7oj09J35
$$ -61 36 -87 192 111 -41 8 -57 110 -13 -236 -93 72 -293 110 -39 91 -70 -32 -25 -197 -110 -116 -225 -90
5356i0K36k22K13l02L72l12K87j97j54p0L51L2k21L9j59M07k47J08j80K14k64
$$ -90 146 -76 137 -165 207 -105 182 -15 -169 -239 112 144 -77 -38 -197 210 -37 71 -109 105 -159
5377a59Q9l06L19J19k6j75J55k49l5L70J57o4l20J69K7pk28K16m9J29nK6Kj84
$$ -159 -70 -376 -57 62 36 -139 16 -233 -268 102 259 195 -125 44 71 64 -164 52 3 132 127 153 155 -29
5401b9L18l84K06k01N3j20M31k02j47L74k61J49OQ0j99o5J82l94M49j03j01l04
$$ -29 289 -95 111 -90 -37 -157 274 72 -75 299 38 187 193 273 74 9 191 -203 246 143 42 -262
5423b62K7J1J82J13q3O0P5K37n46N9L5J50L3j15q0l2L08j85p2p4L07m8J12j02
$$ -262 -235 -224 -42 71 -12 48 123 360 -186 -127 -92 58 91 -24 -104 -136 172 -13 -85 -159 148 100 212 110
5447A10j48rm0P4O5p6O8j42m2J18k16K35L65l13n7j16K93N6j10k9j5m1m29O74
$$ 110 -38 -47 -87 -13 52 -24 44 -98 -140 -22 -238 -3 362 49 -8 -124 169 225 115 86 71 30 -399 275
5471B75k92k6P0j37K64l98J14K22Q5m02J10J83j18j46P9K15k26q3K13l0J19o7
$$ 275 -17 -43 27 -110 154 -244 -130 92 177 -225 -115 68 -50 -196 -117 98 -128 -211 2 -28 91 24
5493B4JLL73m91l8N4P2j43N1J2K7K54j4j79j30J59J59m24M96q8k9j65j63J19K78
$$ 24 25 28 401 -90 -128 -74 -2 -145 -94 -82 -55 199 185 6 -124 35 194 -230 266 178 149 -16 -179 -60 218
5518B18r9L38m36j78K88o9J53L7k68J54j02J47l6Q3p5l9K60l59Q3M8J24k34k21
$$ 218 119 457 21 -157 131 62 215 252 -16 138 36 183 147 230 155 116 376 17 100 148 272 38 -183
5541a83o0N94l94K43j48P2J14j95j98K57J95m19M39j17j36K68n98L26L5k36K8
$$ -183 -243 351 -43 200 52 124 238 43 -155 102 297 -122 317 200 64 332 -266 60 95 -141 -113
5562a13K30J16n34J43J47j20PJ99j28J09J77k41r0K2O2m6Q2j0j0NM2j95L74m49
$$ -113 117 233 -301 -158 -11 -131 -124 75 -53 56 233 -8 -98 -76 -14 -60 22 12 2 7 49 -146 228 -221
5586b21K45k21R6o4L96j09j84L6K61l36oJ38pJ8j32q5M38l4l24K74l43J48r3K60
$$ -221 24 -197 -101 -165 231 122 -62 -26 235 -101 -107 31 24 42 -90 -175 263 229 -95 179 -164 -16 -109 151
5610A51m18K95J31j41L1r4l9J61mk83K14j80J17K98o17J44L35n0j75L46l56O9
$$ 151 -267 28 159 18 49 -45 -84 77 73 -210 4 -176 -59 239 -378 -234 101 51 -124 222 -134 -65
5632f5K37k3l97M05Q4k29K9j19K17l06J10l01L72K50J4j27k19n7K23J7m3K2l02
$$ -65 172 149 -248 157 241 12 41 -78 139 -167 -57 -358 14 264 278 151 -68 -125 98 115 72 94 -208
5655b08J63R1q8J01j10Q6j09J25o6J57J1k27K42j64J08p4j04p9L54P2j41n8k99
$$ -208 -45 46 -42 59 -51 35 -74 51 -15 142 153 -74 168 4 112 38 -66 -145 209 281 140 82 -217
5678b17Q7o8L44r7J44k14K7J77P5K52m05r8p8K73j30j73K90j32j18K50k24K37
$$ -217 -130 -198 146 49 193 -21 6 183 258 510 105 7 -71 202 72 -101 189 57 -61 189 -35 202
5700B02j64k50M33k16J30j00k87L51J11k78j51K5M14l64R1j56M25k38J04L1l86
$$ 202 38 -212 221 5 135 35 -252 99 210 -68 -219 -194 220 -144 -53 -209 216 -22 82 113 -273
5721b73L9m7m2K83M6k36JJ27K48l42J87J34k82J83j43L03m28J50J09Q9j65R0k35
$$ -273 -234 -281 -323 -40 6 -230 -229 -102 146 -196 -9 125 -157 26 -117 186 -242 -92 17 106 -59 31 -204
5744b04J72p0J14Lk30L69r5l8j78Q1J65q6J53j93k6K1N9L3j03J09j75M2L11q8
$$ -204 -32 -102 12 15 -215 154 59 21 -157 -76 89 3 156 -37 -63 -42 17 50 -53 56 -119 -77 234 146
5768A46l87L61j98n3L0J34J7J14R7l04O8mR3j87j3J27n13K56Q9J36k36K30K04
$$ 146 -241 120 -78 -131 -101 33 50 164 261 -43 25 21 114 -73 -86 41 -472 -216 -127 9 -227 3 207
5791B07n04M73p4J27l01K32M9J49l64J35m6r4j69O10k28ol04J62J63r8Lk88k5
$$ 207 -297 176 102 229 -72 160 209 358 -6 129 83 -11 -180 430 202 196 -108 54 217 119 122 -166 -191
5814a91K56K6P0l39N00m24j43K56k34L11K51o44M31j06k38Q3J42m8J27k86M42
$$ -191 65 91 161 -178 322 -102 -245 11 -223 88 339 -305 126 20 -218 -135 7 -41 86 -200 242
5835B42m12j48J82K97k88K11r6J4J99j70l81L77j91k02L72j83M20K4k77j02j56
$$ 242 -170 -318 -136 161 -127 84 -12 2 201 31 -350 27 -164 -366 6 -177 243 267 -10 -112 -268
5856b68J29L7o9J07j12K73l7K26n86K68k15J06J90j24K1p9O9J82j36N1pK83m67
$$ -268 -139 -102 -171 -64 -176 97 60 286 -300 -32 -247 -141 49 -75 -54 -133 -64 118 -18 33 26 309 -158
5879a58J78l6M9Q4j68J90m41K98J37qk9k64J19J80m2K14m97K2L0o7L47Ml46K37
$$ -158 20 -16 33 117 -51 139 -302 -4 133 125 96 -168 -49 131 89 303 -194 -172 -142 -209 138 142 -204 33
5903C3J16j57O7j38J31m14L99j64Q5J56l1l4J2o2o7O6J17j85L00m88M25j94j44
$$ 33 149 -8 59 -79 52 -362 37 -127 -42 114 83 49 61 -1 -68 -2 115 -70 230 -258 167 -27 -171
5926a71K27j06K25l35J95J31k2J0J00n55K38L86k29PM8j45L5j78K05p2R2L43n98
$$ -171 56 -50 175 -160 35 166 144 154 254 -301 -63 323 94 101 149 4 39 -139 66 -6 86 429 -169
5949a69L14j73n4rJ72j48J52n2q4j02K49L2j17j64N8M6jP9J17j50p5m6k53L68
$$ -169 145 -28 -82 -91 81 -67 85 33 -51 -153 96 128 11 -153 -95 -49 -50 29 146 -4 -79 -125 -378 -10
5973a0j14J76j20M2L61k35L3j33M5j54n7M36j88j04j0K21j55j99J78k16K70J35
$$ -10 -124 52 -68 -26 335 100 133 0 45 -109 -166 270 82 -22 -32 189 34 -165 13 -203 67 202
5995B02k48lJ44o7K80l10N4J04l00J98j48q5k13P6K90k14kL08j11J62l87M13j46
$$ 202 -46 -49 95 28 308 -2 52 156 -144 54 -94 -179 -392 -316 -26 -240 -242 66 -45 117 -270 143 -3
6018cJ13k09NK02j58p2L49m01j2K45J23k9j95j70K96M6j21j83K65k08K41j2J3
$$ -3 110 -99 -94 108 -50 -122 227 -174 -186 59 182 153 -42 -212 84 130 9 -174 91 -117 124 112 125
6041A25m2N1q2N2P1j32K42o6Q8k19j37R9j2m0r9l7J73K75j42j93K43j77j76o5
$$ 125 83 134 52 104 175 43 285 219 307 88 -49 50 38 -2 -101 -138 35 310 168 -25 218 41 -135 -200
6065b00R7K04r7K37k92Q3j6k58M36l15L6r9L17j36j52K93j21q5l8mQ6K44j34P6
$$ -200 -103 101 4 241 -51 32 16 -242 194 -121 -85 -184 133 -3 -155 138 17 -68 -106 -110 -24 220 86 162
6089A62l25N0J14j32L60j80l96M14l16L36l7j92K53r0J10j75j0K12k37j7K25Q6
$$ 162 -163 -113 1 -131 229 49 -347 67 -249 87 50 -142 111 21 131 -44 -54 158 -79 -96 129 215
6111B15k60r4J9K53p8Q6k64M88m20Q9Q9k04J6j96K29P5l03J29P8l7p9K85l41J25
$$ 215 -45 -139 -120 133 55 141 -123 365 -55 34 123 -81 -65 -261 -32 43 -260 -131 -53 -90 -169 116 -225 -100
6135a00L8J41On0k88K00K23l38J61M6L1r6J19k74J35K4O1k33M94l55k70L11J64
$$ -100 -62 79 85 35 -253 -53 170 -168 -7 39 70 -26 93 -181 -46 -22 39 -194 300 -55 -325 -14 150
6158A50k22pNJ42K86m49J59l13N39k24j3L3k60P37m10k32J38M9L4j36R0p1K03
$$ 150 -72 -79 -74 68 354 -95 64 -249 290 66 53 86 -174 563 153 -79 59 108 142 6 96 25 228
6181B28l66J13K45m05K17k66M56k00j59K99j01j43K26O9n0K86o82O3K72j83M9
$$ 228 -138 -25 220 -185 32 -234 222 22 -137 162 61 -82 144 213 163 449 -233 -170 102 -81 -32
6202c2j30o4k3N84n75m0L29k88L64j39K0k27M93l06J52l11J94N0J90m21J88K47
$$ -32 -162 -226 -249 335 -240 -280 49 -239 125 -14 6 -221 272 -34 118 -193 1 51 241 -180 8 255
6224B55m84K99r2J31r6MJ47k43j44Q9PL92k87m76M23J08k47J17J49o7P7J12j15
$$ 255 -229 70 -22 109 13 17 164 -79 -223 -134 -127 265 -22 -498 -75 33 -214 -97 52 -15 62 174 59
6247E9J12l04j16J73J1J22k20K27j01k62J69J79k5K25l58L74k10k81K64K2j02
$$ 59 171 -133 -249 -76 -65 57 -163 64 -37 -299 -130 49 24 249 -109 265 55 -226 38 60 -42
6268d2J18kj72j97J50pJ30J13m32N38r9n7J60k92j34K56r4K09o8K26k51j28m45
$$ -42 76 74 -98 -295 -145 -152 -22 91 -341 197 98 41 201 -91 -225 31 -63 146 78 304 53 -75 -520
6291e20L18L06N9q2j67o6m8qQ9L79j73J88p5j40k66P7L06k30L6J02r8K15j61J50
$$ -520 -202 104 163 81 -86 -152 -200 -208 -119 260 87 275 200 60 -206 -129 177 -53 -17 85 -13 202 41 191
6315A91j36k05J2K39M5q2j37J68j38J40j96L39j97j14J84l37O3K11r1lk7Q7r4
$$ 191 55 -150 -138 101 146 64 -73 95 -43 97 -99 240 43 -71 113 -224 -161 50 -41 -44 -71 16 -78
6338g8O2l7J81r1N2O9k33J7P6j59M75j14l25J56n7m38L88R8o9K09m12K02P1L07
$$ -78 -16 -53 128 37 89 158 -75 -58 18 -141 334 220 -105 51 -6 -444 -56 42 -27 182 -230 -28 43 350
6362C50k47j36K67j7j4n03L5L81k91L57j6q1k7l35L09m7j31NK9O6J03o2L7N1j47
$$ 350 103 -33 234 217 203 -300 -265 116 -175 182 166 85 58 -277 32 -15 -146 -141 -112 -46 57 -5 32 83 -64
6387f4R2N3k32P0jJ11P4J18j23l42K90k71K70K19m30j76M60j25o1J28j77J89j0
$$ -64 28 81 -151 -81 -82 29 103 221 98 -244 46 -225 45 264 -166 -342 118 -7 -68 60 -117 72 62
6410F2j19K07o4k09K78l27J76j0m8P6R0l35J28J49K09q4l39Q4L20j65j01L52k15
$$ 62 -57 150 86 -123 155 -172 4 -6 -54 22 112 -223 -95 54 263 179 -160 -76 244 79 -22 330 115
6433A15N3l07R0L33J2k38K7K8J10R9k59k74L64m28K36q2j32K70k0p8K3o3j34J88
$$ 115 168 -139 -49 284 296 58 85 113 223 322 63 -211 153 -275 -39 -121 -253 17 -3 -81 -58 -121 -255 -67
6457f7l7k60K70P2o5P5k53K33j53L81j26l5P9o1M5Nk40NL79j06J34j52N3l67k21
$$ -67 -104 -364 -94 -22 -87 -12 -265 -32 -185 196 70 35 114 53 98 103 -137 -132 247 141 275 123 176 -191 -412
6482d12Q41k89k05K24k08k10M11J21m72J5J13R3l23K35n9j38L20k26J37%j51r0
$$ -412 429 140 -65 159 -49 -259 152 273 -199 -184 -71 22 -301 -66 -125 -263 57 -169 -32 -32 -183 -273
6504b73M38j88j01J95j67j47N98m97J68k5j7n2M5k2J1o3J78J94l22q7L67p9j42
$$ -273 165 -23 -124 71 -96 -243 355 -142 26 1 -16 -68 -23 -45 -34 -97 81 275 -47 -134 233 154 12
6527A2l8k38L96k20J1k3J45r4K64J19J2p55O19k02J46K0j37j40J95M1j57J26k33
$$ 12 -26 -264 132 -88 -77 -100 45 -49 215 334 346 -409 210 8 154 174 37 -103 92 133 -24 102 -131
6550a31K54k83k33M55m2J72j29j47m17N01P6p9k5J07J09nk30m6l8J66J17r9J44
$$ -131 123 -160 -393 62 20 192 63 -84 -501 0 76 -3 -28 79 188 183 -47 -93 -131 35 152 53 197
6573A97j51o2l0J09p1m8R7r5P3p5J33K83k83j12J28o8j0J20J32j10r0k17K57j6
$$ 197 46 -16 -46 63 -8 -56 41 -54 19 -56 77 360 77 -35 93 25 15 135 267 157 67 -150 107 91
6597I1j51J0J3J08k32J36mQ5L2Q2m3m01K45L9M8o3l6K71k83P8K6m0j12J28k62
$$ 91 -60 -50 -37 71 -161 -25 -29 56 88 170 127 -274 -29 10 58 -5 -41 230 -53 25 51 11 -101 27 -235
6622b35q9J71K00J90j02j76k66L66r3l4L5j88J06J05k4j04J53J64m49L56n5k67
$$ -235 -324 -153 47 237 135 -41 -307 59 -34 -68 -33 -221 -115 -10 -34 -138 15 179 -270 86 31 -236
6644b36K30J32k41MO5J83J10l33K1n2J35k4r0K63j05J19j72J19q1l24O4J60K26
$$ -236 -6 126 -115 -111 -46 137 247 -86 -65 -117 18 -6 -96 167 62 181 9 128 47 -277 -213 -53 173
6667A73n3k73K32k79M1J18j21Q2O0p8m7M80o07L99l24R2N3K37Ll31K46J6j35N5
$$ 173 120 -153 79 -200 -159 -41 -162 -80 -20 -98 -145 335 -272 127 -197 -105 -52 185 188 -143 103 119 -16 39
6691C9m6P3q9m10K58K73j58K9J41j53j42m2K39k14J12O4KJ11L0j79L83l93j04
$$ 39 -7 66 -23 -433 -175 98 -60 -31 110 -43 -185 -227 12 -202 -90 -26 -24 87 117 -62 321 -72 -176
6714a76m0L42j32m3j01L32j61j02NK04n5k7l2J3j42j1l3J09n3K5L0j03M2r7K04
$$ -176 -216 126 -6 -49 -150 182 21 -81 -76 128 73 46 14 27 -115 -126 -159 -50 -103 -78 -48 -151 -109 -206 -2
6739bn9j51K46q0Q3k54J8K87j05K04q0m9j18J95k86J26n2k18K14K73l80M47n25
$$ -2 -61 -212 34 -46 37 -217 -199 88 -17 187 107 58 -60 135 -151 -25 -77 -295 -81 192 -188 259 -266
6762b66L70%j45K43m25J30K80l40J62K03j95M9k7N7l38K75j15J48j50O6k75K36
$$ -266 104 104 -41 202 -223 -93 187 -153 9 212 17 66 39 96 -242 33 -82 66 -84 -18 -293 -57
6784e7N1j43r7J43j11L24m4M8j01K2p7K10l59J33L49l37K57k82J43n3J7K0o9l2
$$ -57 -6 -149 -246 -103 -214 110 66 114 13 35 -42 168 -191 -58 291 -46 211 -71 72 19 36 56 -13 -45
6808d5K37j14k14K46j89K16k71J3j72K92j3j45L58J4l16m6L88l51K57k54K61l70
$$ -45 192 78 -136 110 -79 137 -134 -121 -293 -1 -14 -159 199 213 -103 -149 239 -112 145 -109 152 -218
6830b18L37j40j88K27M0q6R7j83K77j95j80j93L10J32Q6j10o8J35j23J31o1J69
$$ -218 119 -21 -209 18 58 -28 69 -114 163 -32 -212 -405 -95 37 123 13 -55 80 -43 88 27 196
6852A96k92m0m4K7J38j07n0m7M84m84L70q7j32K47j57j59J47J52l87K66L5j05
$$ 196 -96 -136 -180 -153 -15 -122 -172 -219 265 -219 151 64 -68 179 22 -137 10 162 -225 41 76 -29
6874b9q8K97j88L1O3k96J26l17M67l12K06K3m4M84p0k75P2p9j34K14k77L84l30
$$ -29 -117 180 -8 23 86 -210 -84 -401 66 -246 -40 -17 -61 423 353 78 150 71 -63 151 -126 258 -72
6897g2K9K03j40j19J83n3J56Q3k13Rk07J11J27k04k04M31K15m64j16K88r3L61
$$ -72 -43 160 20 -99 84 31 187 270 57 66 -141 -30 97 -107 -311 120 335 -129 -245 43 -50 311
6919C11k80k1j15j00N5J75j70jp7M98j83j03N1o5K72m02K45M06k04m34P6j18K57
$$ 311 31 10 -105 -205 -150 25 -145 -146 -223 275 92 -11 40 -25 247 -155 90 496 292 -142 -66 -184 73
6942G3j36K00k30K98j0k22J31j89K91m27L90j34j4l7j01L1O8R2q2K47j9M4p6r2
$$ 73 -63 137 -93 205 195 -27 104 -85 206 -221 169 35 21 -16 -117 -86 -18 74 -8 239 220 264 188 96
6966I6j75J65m2K5k93M38j36k14j8N7L41k02J66p9k40J16r6j36j4K90j21J70r3
$$ 96 -79 86 44 69 -224 214 78 -136 -154 -97 244 42 208 129 -111 5 -91 -227 -241 49 -72 98 5
6989EJ29J51m13K10rK52m81O3q6K63j7k60M26m10m9K46p2J74j66J74j99K27m51
$$ 5 134 285 -128 82 73 325 -156 -93 -179 84 67 -193 233 -177 -226 20 -52 122 -44 130 -69 158 -293
7012b93L47j23J33Q8q9j80L83k21k22J40k12J96J12k10l3p1K85m7P7j52j98M64
$$ -293 54 -69 64 152 63 -117 266 45 -177 -37 -249 -53 59 -151 -184 -255 30 -17 60 -92 -290 174
7034A74j12j26j6J41J79o1j33k0j98L8L23k76J50k08J53j16J07q3K94k37l5O9
$$ 174 62 -64 -80 61 240 179 46 26 -172 -134 189 -87 63 -145 8 -108 -1 -84 210 -27 -62 7
7056Gr6L39k36M72n73R1J05j40k46K15O3k46K92J34J83j22l79L9J38m7J1K38j32
$$ 7 -89 250 14 486 -87 4 109 -31 -277 -62 1 -245 47 181 364 242 -137 -98 40 -7 4 242 110
7079A10k42l2j61K26j14L61l0k60J70k15L18Mj02K1k26J71K29o46O91k67L4j3
$$ 110 -132 -164 -325 -99 -213 148 118 -142 28 -187 131 135 33 54 -172 -1 228 -418 273 6 40 27
7101B7k72K50j41j40M32k1r5l5j34P7p2l52N61k41K87k78Q2J14j8j8k85P2L85
$$ 27 -245 5 -136 -276 156 135 40 5 -129 -52 -124 -476 85 -156 131 -147 -65 49 31 13 -272 -200 185
7124A85k61m3k3J66N6p0K5j38K05n39M77j73K64k60R9j07K15j17P3j06p0K47j53
$$ 185 -76 -119 -142 24 80 10 35 -103 102 -437 40 -133 131 -129 -30 -137 78 -39 34 -72 -142 105 -48
7147d8J45J8J02j32j01j1J9l16L35R4o3K9j92K70o1j80K09j91L79k33J2Q1l68
$$ -48 97 115 217 85 -16 -27 -8 -324 11 105 42 71 -121 149 88 -92 117 -74 305 72 84 165 -203
7170b03L10Q6k22O4K69P8j74l88L57J0k85Q9J34j78j09L28J3Or2l5r3o8j01j0
$$ -203 107 193 -29 35 304 382 208 -180 177 187 -98 -9 125 -53 -162 166 179 185 93 58 -35 -103 -204 -214
7194b14K87k27J68Q8o3J47j42j31j67L19j27J28P9k90Q1k5J54r3K8nL6j58J78
$$ -214 73 -154 14 102 39 186 44 -87 -254 65 -62 66 145 -145 -64 -89 65 -28 0 -5 31 -127 51
7217E1o1Q6k3l16K99j09j23M37j56r3p2J04pj17l02L73J94R5m75K87J00j75R3
$$ 51 -10 76 53 -263 36 -73 -196 241 85 -8 -80 24 17 -100 -402 -29 165 260 -215 72 172 -3 90
7240I0j70R1j36K42j63j56K6N5J12M3j61L15k83p9J27L28j13j00j26q7K03J34
$$ 90 -80 11 -125 117 -46 -202 -176 -121 -9 34 -127 188 -95 -174 -47 281 168 68 -58 -145 58 192
7262A92k15K2j9N0k21J31J10J25j4l85K42K33j74K5K3J12k98L27p2k50J59n8j9
$$ 192 -23 -1 -20 30 -191 -60 50 175 161 -224 18 251 77 102 125 237 -61 266 194 -56 103 45 26
7285B6m19K79K29l05n6K92j85J06N6J27p5R5j99m5JK22l37j51L0L44m73M65M7
$$ 26 -393 -114 115 -190 -246 46 -139 -33 23 150 75 170 -29 -74 -73 149 -188 -339 -309 35 -438 27 74
7308G4q1J37k5k03L42j76J13k08K34k39oK98m15k3j49L10M0r5K60O1k16p9J50
$$ 74 -7 130 105 -98 244 68 181 -27 207 -32 -38 260 -155 -178 -327 -17 23 -72 188 249 33 -46 104
7331A04J9o6k79L28n6j34P8q5K98l50J71J0j36J00J7k03K4K67k91K81O1l77K93
$$ 104 123 57 -222 106 50 -84 -6 -91 207 -143 28 38 -98 2 19 -184 -160 107 -184 97 158 -219 74
7354G4n4L7k31M60j00k41j3L06j45L8j04J24l90K16k36R2K61k60L73r1J12k29
$$ 74 20 57 -174 286 186 -55 -68 238 93 131 27 151 -239 -23 -259 -167 94 -166 207 116 228 -1
7376aK46k48o5Q2R6j98L00k84K89l03K44n6l39L5J86J8J28O6j98K2k12K31o2M0
$$ -1 245 -3 -68 14 110 -88 212 -72 217 -86 158 102 -237 -202 -16 2 130 196 -2 20 -192 39 -23 17
7400A7M72o74m2J84j02n6Q1J38k19L40ok08k0K95j37j52n3M00k85J80kj11N0J8
$$ 17 489 -185 -227 -43 -145 -201 -120 18 -201 139 133 -75 -95 200 63 -89 -142 258 -27 153 151 40 90 108
7424A08k6k19k2J12P1o1K78k13J21j74J7J5oR7M7K1j24K7K34l08j44K15j83P1
$$ 108 82 -137 -159 -47 24 -37 241 28 149 -25 -8 7 1 98 145 166 42 69 303 -5 -149 66 -117 -46
7448d6N8k77M24j85J28j67r5K00K13l08k23N8M04k07L45m01n9J32k84K86r8j62
$$ -46 12 -265 159 -26 102 -65 -160 40 253 -55 -278 -220 184 -23 322 -79 -138 -6 -290 -4 -102 -264
7470b64M11k59R5j26R6J39O6l3l68K24P8n3K4Oj64K19K9l97L89Nk53J30Q2n9P6
$$ -264 147 -112 -17 -143 -47 92 158 125 -243 -19 59 6 30 36 -128 91 120 -277 112 117 -136 -6 76 17 93
7495I3l00K18j17K8J13j12J62k52L84k49p2P6O4L40k77j00K53l56J67r1Q9M8j19
$$ 93 -207 11 -106 -78 35 -77 85 -167 217 -32 -104 -28 36 376 99 -1 252 -104 63 -28 61 109 -10
7518a0L0j93P3Q2j38K99k54J61j41J44J40k07K34l66N3K39j25J34K1j33r4l7Q0
$$ -10 20 -173 -100 -18 -156 143 -111 50 -91 53 193 -14 220 -146 -93 146 21 155 176 43 -51 -88 -8
7541hO2m5j02mK35J2j89J10n9k7k6J52j21o6K59l92J34R2K38k73j0J16j14J18
$$ -8 54 9 -93 -97 138 150 -39 71 12 -15 -41 111 -10 -76 183 -209 -75 17 255 -18 -28 88 -26 92
7565I2K60l0m55J34j59j45L40j08K77l00J15k0O2k5k1J32k05J80j00k60K15J83
$$ 92 352 322 -133 1 -158 -303 37 -71 206 -94 21 1 63 38 17 149 -56 124 24 -236 -21 162
7587A62p7k69K68l3k2k81J13J58j56K17r6J67m83M04l6j6l54N63j37Q7l36RJ51
$$ 162 85 -184 84 51 29 -252 -139 19 -137 80 -16 151 -332 72 36 20 -334 229 92 179 -157 -148 3
7610Ck0J67m37K54R8k19K8K39l65K79K29l11j32Q7l05L87KJ37k92K3j43K80L7
$$ 3 -17 150 -287 -33 65 -154 -126 113 -252 27 256 -55 -187 -100 -405 -18 -16 121 -171 -148 -291 -11 26
7633B6%k1p4j45K87J39k43j2R4q8P0j39K35J16k45k72N42l21K27j79K61k90p2
$$ 26 26 5 -69 -214 73 212 -31 -43 51 -37 33 -106 129 245 0 -272 270 -51 176 -3 258 -32 -104
7656a04J55j22R2k5L7j8o3R2J03J21m31K16m4q6m4j8P3j91M38L0p0m08M08n3m0
$$ -104 51 -71 21 -4 33 15 -48 44 147 268 -163 53 9 -77 -121 -139 -66 -257 181 211 141 -267 141 88 48
7681D8J42j05N9l61L45j25j18K39p4J41n0n8m9j32R9Q8q0j48J62j07K80l17J21
$$ 48 190 85 144 -217 128 3 -115 124 50 191 141 83 34 -98 1 89 9 -139 23 -84 196 -121 0
7704@J54m47J76N16m21j9Q3l11L14j63R7j11J18L7L2J29o2J09k74j21J76Nl1O1
$$ 0 154 -293 -117 399 -22 -41 42 -269 45 -118 -21 -132 -14 23 55 184 122 231 -43 -164 12 17 -14 47
7728D7r4k45M15k19R5O3j70J37kr3j54J41Q4j31J28J77o5k81K90l95K32n9qJ35
$$ 47 -47 -292 123 -96 -1 62 -108 29 27 -66 -220 -79 5 -126 2 179 114 -167 123 -272 -40 -99 -107 28
7752B8K4R7k67L11k87M4pL06j03k2j52K49m8l69J95n6j05M35J1j26j88K37m11
$$ 28 52 149 -118 193 -94 -50 -57 249 146 124 -28 221 173 -196 -1 -57 -162 273 284 158 -30 207 -204
7775b04N72j62k48M2j1R1j11j53K85L4j16m3n2n5K45M4k26j52M18j65j29J86P6
$$ -204 368 206 -42 0 -11 80 -31 -184 101 135 19 -24 -76 -131 114 158 -68 -220 198 33 -96 90 166
7798A66k82R5R1R5j7po8J03l84M83j66K04n92N20m41L0j3j9K20P6J21l46P4J56
$$ 166 -116 -21 70 165 148 141 73 176 -208 275 109 313 -279 241 -200 -170 -183 -202 18 94 215 -131 -57 99
7822I9J16k75K0L3j5j72J72j20M17m34Q1K97l00K24Kk49P0p7J58j24LJ44Q3l7
$$ 99 215 -60 -40 -7 -22 -194 -22 -142 275 -159 -78 219 -81 143 145 -104 -34 -111 47 -77 -74 70 153 116
7846A16j11n7r0N7k8J2k30N63m47K52J57j93J8j46l7K90k30J1J95m1O6k36j16
$$ 116 5 -52 -142 -85 -113 -101 -331 232 -215 37 194 1 19 -127 -164 126 -104 -93 102 61 127 -109 -225
7869b25J66oO3MJ47l01J07J28k05M4j38L38q8k20K87j73l4k0l0K24o7j6J03k83
$$ -225 -59 -65 -2 2 149 -152 -45 83 -122 -78 -216 122 34 -186 101 -72 -106 -126 -156 68 1 -15 88 -195
7893a95J55N4J14j39j0N8O1j0o8qJ87q8N5oj8J91j15l00ML69k04M4k46L76l56
$$ -195 -40 14 128 -11 -21 37 98 88 20 12 199 111 166 160 142 333 218 -82 -78 291 87 131 -115 261 -95
7918i5J13k2L6N3k46L53k85r4K25p1j77M82Q6m8k27j71j76K03n8Q8m5K35J3m04
$$ -95 18 -4 32 85 -161 192 -93 -187 38 -33 -210 272 358 310 83 -88 -264 -61 -119 -31 -76 159 172 -232
7942b32J04M39l03l4k07L23R1l13J74k56N5K74j43J07k19K17k07J40J04l3p8l12
$$ -232 -128 311 8 -26 -233 90 181 -132 42 -214 -159 115 -28 79 -140 77 -130 10 114 81 3 -309
7964c09M54o3m3k29M78n11K06kJ11O9j30K45l14K23k29j4N09p46O4J32K04l2J6
$$ -309 145 82 39 -190 288 -223 -17 -19 92 161 31 276 -38 185 -44 -58 451 -295 -231 -99 105 73 89
7987H9j4m65L89J60r1k54l8M74l09Pq2J53K91l79k75M96j68J48k06j4j78K17O7
$$ 89 75 -390 -1 159 68 -186 -224 250 -59 -52 -134 19 310 -69 -344 152 -16 132 -74 -88 -266 -49 18
8010A8r4J0k04L84l10M50n6j25j90RLj60M04ok98J79k15L35J42m9l46L70j99j95
$$ 18 -76 -66 -270 114 -196 254 198 73 -117 -108 -105 -265 139 133 -165 14 -201 134 276 227 -119 251 52 -143
8034a43O58k46l24M9J14k89L61k79L96n03K40L3r3K92k65M1k30M64m26J37Om6
$$ -143 515 269 -55 -6 108 -181 180 -99 297 -206 34 67 -26 266 1 42 -188 276 -150 -13 -7 -53
8056e3J47k10P2l2J65j45kJ04J10j22K85j43l15J53J46N9N0j89m0j7l7O7j12k8
$$ -53 94 -116 -44 -76 89 -56 -58 46 156 34 319 176 -139 14 160 219 269 80 40 23 -14 53 -59 -87
8080h7K1J99L6j13j55M17j41j51l88K90j96K79P7J93k69m5rK79k3o0m65L31j22
$$ -87 -66 133 169 56 -99 318 177 26 -362 -72 -268 11 88 281 12 -33 -42 237 214 154 -311 20 -102
8103a02r4L73k21m4J66m83K64j05K27Q9r6J52j63M6K92l90J33j37J63J08k28M
$$ -102 -196 177 -44 -88 78 -405 -141 -246 -19 70 -26 126 -37 9 301 -89 44 -93 70 178 -50 -46
8125d6j44K12k61M3J87j60L93j69j82Q6l7M22r5N6j41j09Rj98N06n06J61l4N8
$$ -46 -190 22 -239 -196 -9 -169 224 55 -127 -41 -78 344 249 305 164 55 64 -134 372 -134 27 -7 51
8148E1j53jo0Kp0J72N3p6M7l38N46P6l74L83m98K57N3j9r8Nj09J24k2P3L0n4J64
$$ 51 -102 -103 -163 -161 -231 -59 -6 -82 -35 -373 173 249 -125 258 -240 17 70 51 -47 -42 -151 -27 -49 24 54 0 164
8175A64k33K27j41q7J7K6J19j01R2j36k10N37l01j23N05n95
$$ 164 -69 158 17 -70 -53 -27 92 -9 83 -53 -263 274 -27 -150 355 -240
8191b40
$$ Imaginary data points
##PAGE= N=2
##DATA TABLE= (X++(I..I)), XYDATA
0@%%%%QqQj6K4l2L2m0N6o7P8r9J20j39J63j94K32k70L10l60M16m75N41o17P03
$$ 0 0 0 0 0 8 0 8 -8 16 -16 16 -24 32 -35 43 -56 64 -75 88 -106 126 -144 166 -194 222 -253 288 -329 374
29C74p93Q92j005J127j260J409j573J750j942K156k392K649k931L245l593L980
$$ 374 -419 473 -532 595 -665 744 -829 921 -1021 1135 -1257 1392 -1539 1706 -1887 2093
45B093m413M902n458O091o826P689q720R977j1547J3581j6331K0267k6410L7418
$$ 2093 -2320 2582 -2876 3215 -3611 4078 -4642 5335 -6212 7369 -8962 11305 -15105 22313
59B2313o3110K25840J19935n10468Q757L37537M3113l37066k2785K68888N6039
$$ 22313 -40797 185043 304978 -205490 -196733 140804 183917 -153149 -175934 92954 148993
70A48993k30620j8922J83105J6982j65953J3536J41588k6356j60318J9356J47422
$$ 148993 -81627 -100549 82556 99538 -66415 -52879 88709 62353 -97965 -78609 68813
81F8813N519j28963K23J23143J9426j18908l9660R1601M4653q8077n3841P8330
$$ 68813 74332 -54631 -54408 68735 88161 -30747 -70407 21194 65847 -22230 -76071 2259
93B259O7703o7612p2156O0717Q2008m7558p3995M5487O0084o9396p2167P6868
$$ 2259 69962 2350 -69806 -9089 72919 25361 -48634 -3147 56937 -12459 -84626 -7758
105g758Q6862o9874p8223Q2002P9081r7365r4600R1451R3960r1148q8450R1104
$$ -7758 79104 9230 -68993 13009 92090 -5275 -99875 -8424 85536 -5612 -94062 -2958
117b958P9303r6141o2239J21180O9357j34665q5081J29728Q3406j36972r4498
$$ -2958 76345 -19796 -82035 39145 108502 -26163 -111244 18484 101890 -35082 -129580
128a29580J38588J13831j19116j16406J03278J16791q5472j14040O2728R6690
$$ -129580 9008 122839 3723 -112683 -9405 107386 21914 -92126 -29398 67292
138F7292n7957r0310N0624Q8505l2698o9184L3170O1984l4202o3384K5106N3863
$$ 67292 9335 -80975 -30351 58154 25456 -43728 -10558 51426 17224 -46160 -21054 32809
150C2809k8630n4234L2739O5507k4983p0985J8013Q0083m067q5528j5554P6669
$$ 32809 4179 -50055 -17316 48191 23208 -47777 -29764 50319 46252 -39276 -54830 21839
162B1839K1904p2438k8351P1359M3012n3035l6830M1118K0404m6239j2531N2575
$$ 21839 43743 -28695 -57046 14313 57325 4290 -32540 8578 28982 -17257 -29788 22787
174B2787O877o0573n325O8787R443p0418o924P3349O782p8111j3921P1423J1807
$$ 22787 29664 -30909 -36234 32553 41996 -28422 -35346 38003 44785 -33326 -47247 24176 35983
187C5983o4193j579O9473J373o9496p73O7208k397o9596j278O6681L040o3336
$$ 35983 -28210 -29789 39684 41057 -28439 -29212 37996 35599 -33997 -35275 31406 34446 -28890
200b8890m264N9441J1719m9549j1504M1080R302l9301j5738K9400J7359j8845
$$ -28890 -33154 26287 38006 -11543 -23047 18033 27335 -11966 -27704 1696 19055 210
212B10j2664J7923J3949j3832j1995J2344J0339j8671j9126J6373K1082j8176
$$ 210 -12454 5469 19418 5586 -6409 5935 16274 -2397 -21523 -5150 15932 -2244
224b244k4524K4594L8917j8724m7163J0599M5736q337m6678M549M4886j621l9467
$$ -2244 -26768 -2174 36743 18019 -29144 -18545 27191 18854 -27824 -23275 21611 19990 -19477
237a9477L016L4330n423k8862J2095K5867k0331l1309J7935K8206j7962k1913
$$ -19477 -16461 17869 12446 -16416 -4321 21546 1215 -30094 -12159 16047 -1915 -23828
249b3828K5512K5054k4333k5994J9511K0197j9943j7940K0789J6842j7467j4644
$$ -23828 1684 26738 2405 -23589 -4078 16119 -3824 -21764 -975 15867 -1600 -16244
261a6244J4999J2450j1859r134P349L611r367k670Q944M263m960p68O586J917
$$ -16244 -1245 11205 -654 -9788 -2439 1172 -8195 -10865 -1921 2342 -2618 -3386 3200 5117
275E117n635n294J567N479L56n806l255N400M660l978k879P411N031q029o117
$$ 5117 -518 -5812 -4245 1234 1590 -4216 -7471 -2071 2589 -1389 -4268 3143 8174 145 -5972
290e972M852J948j0162l111J4994R889r325q100Q804O936r716q061O645O582o345
$$ -5972 -1120 828 -9334 -12445 2549 12438 3113 -4987 3817 10753 1037 -7024 -379 6203 -142
305a42o282M638M786j664m03N028R48o494l503L662J673k366l69L206J546j421
$$ -142 -6424 -1786 3000 1336 933 5961 6909 415 -3088 574 2247 -119 -488 2718 4264 2843
321B843k27K426L33j953j623r58j707L18K219M9r48K489L529l331n510J148N405
$$ 2843 2616 5042 5375 3422 1799 841 -866 -548 1671 1720 772 3261 6790 3459 -2051 -903 4502
338D502j903n717M042P964k730p993J896O276l337o325M825O354p948r606N947
$$ 4502 2599 -3118 924 8888 6158 -1835 61 6337 3000 -3325 1500 7854 -94 -9700 -3753
353c753R832l433n532O153O144q554q106N845N879n750l868O521L109p959k393
$$ -3753 6079 2646 -2886 3267 9411 857 -7249 -1404 4475 -1275 -5143 1378 4487 -3472 -5865
368e865R189N509q506o212M549L282o699n471M889Q403m27o105J802O216j384
$$ -5865 3324 8833 327 -5885 -1336 1946 -4753 -10224 -5335 3068 2641 -3464 -1662 4554 3170
383C170r337j312R303J685r787k383J1289K290j2382k803J3966M435j4751l938
$$ 3170 -6167 -7479 1824 3509 -6278 -8661 2628 4918 -7464 -10267 3699 8134 -6617 -10555
397a0555J3693K226j5441j626J8082J684j6885j686J6815J328j6023J20J5252
$$ -10555 3138 5364 -10077 -11703 6379 8063 -8822 -10508 6307 7635 -8388 -8268 6984
410F984j386j5653J439J5008j083j2728K229J1820m110j3241L612J3700k041j1026
$$ 6984 5598 -10055 -8616 6392 5309 -7419 -5190 6630 2520 -10721 -7109 6591 4550 -6476
424f476J620J1444m64j0296J023J0172K05j1640k722R534L600q714m162J0614
$$ -6476 -4856 6588 6124 -4172 -3149 7023 7228 -4412 -7134 2400 6000 -2714 -6876 3738
438C738N536r949o939J0500P506j1187r120J1878R480j1767q937J2757J0532j2242
$$ 3738 9274 -675 -7614 2886 10392 -795 -9915 1963 11443 -324 -9261 3496 14028 1786
452A786j0030J3102R999j5167j2089J2886J0869j2003r554J3820R903j4099j1285
$$ 1786 -8244 4858 14857 -310 -12399 487 11356 -647 -10201 3619 13522 -577 -11862
465a1862J3507J2540j0979j1856J1283J0047j2506j2471J1261J4049q035j2414
$$ -11862 1645 14185 3206 -8650 2633 12680 174 -12297 -1036 13013 4978 -7436
477g436O952J1137q923j2708Q165J2565q183j1945Q699J2626q699j2808Q516J3539
$$ -7436 -484 10653 1730 -10978 -2813 9752 1569 -10376 -1677 10949 2250 -10558 -2042 11497
491A1497r412j4168R055J5031p897j4997P241J4078q504j4239P326J2481o319
$$ 11497 2085 -12083 -3028 12003 4106 -10891 -3650 10428 1924 -12315 -4989 7492 1173
504A173j2842O991J3055o026j2514N304J2657m373j2283L875J1599l429j2592
$$ 1173 -11669 -4678 8377 2351 -10163 -4859 7798 3425 -8858 -4983 6616 3187 -9405
517i405Q62J2112J051j0699n10J0012R28j0799j549J0588J354j1187j705J1625
$$ -9405 -8543 3569 4620 -6079 -6589 3423 4351 -6448 -7997 2591 3945 -7242 -8947 2678
531B678J371j1218R0J4344J027j4938k637J4481J600j4669j698J4789J790j4270
$$ 2678 4049 -7169 -7079 7265 8292 -6646 -9283 5198 6798 -7871 -9569 5220 7010 -7260
545g260j370J3503J425j2782L02J2315o82j1884Q35J1793o42j1430Q67J2035N93
$$ -7260 -8630 4873 6298 -6484 -6182 6133 5451 -6433 -5598 6195 5553 -5877 -5010 7025 7618
560G618j1002k459R584L376q655l710P052M930o163n389N404N072m528m491N139
$$ 7618 -3384 -5843 3741 7117 -1538 -5248 1804 6734 571 -4818 586 5658 1130 -3361 1778
575A778M727o222m990Q893O417r156p804R222P472j0316r182J0316J0013r625
$$ 1778 6505 283 -4707 4186 10603 1447 -6357 2865 10337 21 -9161 1155 11168 1543
589A543r757Q863Q763p352o111Q374L629j0342k991J1129J987j1939j394J3872
$$ 1543 -8214 649 9412 2060 -4051 4323 7952 -2390 -5381 5748 7735 -4204 -5598 8274
603H274J917j4351l578J3449M456j1906n823Q756M257o446l609M949K380k829
$$ 8274 10191 -4160 -7738 5711 10167 -1739 -7562 1194 5451 -995 -4604 345 2725 -104
617a04m28L124n75l685n0M334L05m668j641M039K321n203m397M199O799j522p117
$$ -104 -532 2592 2017 -1668 -1718 2616 2921 -1747 -3388 651 2972 -2231 -6628 -2429 4370 2848 -4269
634d269k99O093N16n850k56N843O44n309q42L790j240l554M151N929n191p593
$$ -4269 -4568 1525 2041 -3809 -4065 1778 2422 -2887 -3729 61 -1179 -4733 -582 5347 156 -7437
650g437M023R037m571j0765K200J1163j78r672m23R253J348o429j235M618j187
$$ -7437 -3414 5623 1052 -9713 -7513 3650 3472 -6200 -6623 2630 3978 -2451 -3686 932 -255
665b55l956L391M125n375n255O872P307o829q663N637R897m371r596K315Q764
$$ -255 -4211 -820 3305 -2070 -7325 -453 6854 25 -8638 -3001 6896 2525 -7071 -4756 4008
680D008q66p232K91N164R07j813P46j231k491J931M864j941o538J713P871r73
$$ 4008 3142 -4090 -3799 1365 2272 459 1205 -26 -2517 -586 4278 2337 -4201 -2488 5383 4410
696D410p932j498O985L292m354m630K106M074J723q48k928n76K185J627j549k879
$$ 4410 -3522 -5020 1965 5257 903 -3727 -1621 2453 4176 3328 400 -176 2009 3636 2087 -792
712g92l30K133J916K75l057k614K621O008r24q145k375Q228L825p480m447O485
$$ -792 -1122 1011 2927 3202 145 -2469 152 6160 5236 -2909 -5284 2944 6769 -711 -5158 1327
728A327M923m232k445L709M30m472K89L502k905n373M075P015m631p294L885Q377
$$ 1327 6250 2018 -427 3282 3712 -760 -471 3031 126 -5247 -1172 5843 1212 -6082 -2197 6180
744F180k482p339Q92N474m27l776k07J987m65J239J542l604m430M272N635l099
$$ 6180 3698 -3641 -2749 2725 2298 -1478 -1685 302 -163 1076 2618 -986 -5416 -1144 4491 1392
760A392p554J50P832K502n715l971L178N289j92o057l387M204N444j862n073l52
$$ 1392 -6162 -6012 1820 4322 -1393 -5364 -2186 3103 2911 -3146 -6533 -2329 3115 1253 -3820 -4172
776d172M719R32k544p06k72j928J561L604j737n605K026Q225m20q412j06Q548
$$ -4172 547 1479 -1065 -1771 -2043 -3971 -2410 1194 -543 -6148 -4122 4103 3683 -4729 -4835 3713
792C713P7q530j392P212Q51n374L21N509j042m349K160L916l757l758M038L815
$$ 3713 3790 -4740 -6132 1080 1931 -3443 -3122 2387 1345 -3004 -844 3072 -685 -4443 -405 3410
808C410m776n040N020O476k668m760J826M056o51l647n57R06O74J315O05j733
$$ 3410 -1366 -6406 -1386 5090 2422 -2338 -512 3544 2893 -754 -1311 -405 269 1584 2189 456
824D56k275J295L784M46l573k783K744L861q05n229p81N909L509l922m664K084
$$ 456 -1819 -524 3260 3706 133 -2650 94 3955 3150 -2079 -2860 3049 6558 2636 -2028 56
840E6M180j292m214p9K622Q87n29K92j14j741M61K489p15l902J59M497M58m512
$$ 56 4236 2944 -1270 -1349 1273 2160 1631 1923 1809 68 529 3018 2303 -1599 -1440 3057 3515 -997
858i97q84N981K630n459m193L555K852l844l346L614L039k456j332K550O75l402
$$ -997 -1881 4100 6730 1271 -2922 633 3485 -359 -3705 -91 2948 492 -840 1710 2385 -1017
874a017L88M207j572n941j28O326J132n541p12N469J312m143k025K366p0k939
$$ -1017 -629 3578 2006 -3935 -4063 2263 3395 -2146 -2858 2611 3923 -220 -2245 121 51 -2888
890b888M94K159j145k015K518L631k010l365Q44L026l37l309q37J643J202l91
$$ -2888 -2394 -235 -1380 -3395 -877 2754 744 -2621 -1777 1249 912 -2397 -3234 -1591 -389 -780
906g80p60J190O92p53j699O7N96o32q88J442J493j375j062L177K238l345l157
$$ -780 -1540 -350 342 -411 -2110 -2043 -1447 -2079 -2967 -1525 -32 -1407 -2469 708 2946 -399 -3556
923c556K629K685m240l457N498M916m652m869M504M734l989m506K890K746l680
$$ -3556 -927 1758 -2482 -5939 -441 4475 -177 -5046 -542 4192 203 -4303 -1413 1333 -2347
938b347j678M604K260l537r1M479j96n167p54M332p4m389r26L844J747j427J2
$$ -2347 -4025 579 2839 -698 -789 3690 3494 -1673 -2427 1905 1831 -2558 -3484 360 2107 680 692
955F92K009n10k082p06J127m81j044k44J422J610O14o12P19O47j212k140q35J574
$$ 692 2701 2191 109 -597 530 49 -995 -1239 183 1793 2407 1795 2514 3161 1949 -191 -1026 548
973E48r4j348N08K770k58k460J530L169k081m308L87L594j169k703K338M150k108
$$ 548 454 -894 -386 2384 2126 -334 1196 4365 2284 -2024 -1637 1957 788 -1915 423 4573 2465
990B465m033K008L690k531m431J542L327k189l056K334M474j604l072J400K148
$$ 2465 -1568 440 4130 1599 -2832 -1290 2037 -152 -3208 -874 3600 1996 -1076 324 2472
1005B472k601k210J818J792j964k115K828L188j372k855Q80J309j579l049J062
$$ 2472 -129 -2339 -521 1271 -693 -2808 20 3208 1836 -1019 -139 1170 -409 -3458 -2396
1020b396K333j107j757J679K890j149j580J345J882k870l587J458K868n80j951
$$ -2396 -63 -1170 -2927 -1248 1642 493 -1087 258 2140 -730 -4317 -2859 9 -571 -2522
1035b522J360K528q02k048Q01J938j963l366Q51K562p61j362J599L196o96k684
$$ -2522 -1162 1366 564 -1484 -683 1255 -708 -4074 -3223 -661 -1422 -2784 -1185 2011 1315 -1369
1051a369m06K379M7k888o70J988J130j450K52K160R59l044j486J739J613k006
$$ -1369 -1775 604 651 -2237 -2907 -919 211 -1239 -987 1173 2132 -912 -2398 -659 954 -1052
1067a052j112J892J476k091m59L264J027k429r34J581m9l305J0M033M59k869k82
$$ -1052 -2164 -272 1204 -887 -1346 1918 2945 516 -418 1163 1114 -2191 -2181 1852 2311 -558 -840
1084h40L478l04k864L4K260p30l039J380L297l79k551J078K987m96l001j42J848
$$ -840 2638 2334 -530 -496 1764 1034 -2005 -625 2672 2293 -258 820 3807 3311 310 168 2016
1101B016p46k436K65K224P88j303o5J706K6j974o42J621Q95k043j748K071J889
$$ 2016 1270 -1166 -901 1323 2111 808 743 2449 2475 501 -141 1480 2375 332 -1416 655 2544
1118B544j060r70J550J234k352k648J459J641j965j177K575Q79j818j122K745
$$ 2544 1484 514 2064 3298 946 -1702 -243 1398 -567 -1744 831 1710 -108 -1230 1515
1133A515J081k698j115K094M0k648P9K879L75k817J03K488l13k527m62J994k27
$$ 1515 2596 -102 -1217 877 917 -1731 -1652 1227 1602 -1215 -1112 1376 1063 -1464 -1926 68 -159
1150a59k039m1K234M28j332J88R99J00j254p47R13k3r51k91J442J308o42j571
$$ -159 -2198 -2239 -5 423 -909 -721 278 378 -876 -1623 -710 -733 -1684 -1975 -533 775 133 -1438
1168a438K45J578j589j601R54J745p77j842J279K055l47j252M56J505j656j604
$$ -1438 -1193 385 -1204 -2805 -1851 -106 -883 -2725 -1446 609 262 -990 -534 971 -685 -2289
1184b289R06Q17p81l92J694N76j459o47J732R29j731j153J159J328j681j354K177
$$ -2289 -1383 -566 -1347 -1739 -45 531 -928 -1575 157 1086 -645 -1798 -639 689 -992 -2346 -169
1201a69J750m70j508P05Q62r66j185Q58Q86j125n48Q38J721j103j583J694J890
$$ -169 1581 1111 -397 308 1170 204 -981 -123 763 -362 -910 -72 1649 546 -1037 657 2547
1218B547j597k364J486K363j472k538K410K423j437j810O08J491j905j306J799
$$ 2547 950 -1414 72 2435 963 -1575 835 3258 1821 11 619 2110 205 -1101 698
1233F98J113j916o96K344P24k171o03K359O63k577j030J421J254r41m38P71P13
$$ 698 1811 -105 -801 1543 2267 96 -507 1852 2515 -62 -1092 329 1583 642 204 975 1688
1250A688o51n57l29J81j22j44L16J26r10k85J032J459p75j346l2J487k89j987
$$ 1688 1037 480 151 332 210 66 382 508 -402 -687 345 1804 1029 -317 -349 1138 849 -1138
1268a138k62K420L57k372l06J250P42j534M15N06j133q24J025J473j226j527J791
$$ -1138 -1400 1020 1377 -995 -1301 -51 691 -843 -428 78 -1055 -1879 -854 619 -607 -2134 -343
1285c43J794j633k133R64K321r54k126J55J439N34r07j63J49K01l55m2M83m86
$$ -343 1451 -182 -2315 -1351 970 16 -2110 -1955 -516 18 -889 -1052 -903 -702 -1057 -1099 -616 -1102
1303a102o27P63J367j045j372Q96K458l20l168l13K798N75j701j280J925M60j224
$$ -1102 -1729 -966 401 -644 -2016 -1120 1338 1018 -2150 -2463 335 910 -791 -2071 -146 314 -910
1320i10p6J623j63j496L37J651j691j492J971K759j595k995J437K746p82k504
$$ -910 -986 637 474 -1022 -685 966 -725 -2217 -246 2513 918 -2077 -640 2106 1324 -1180
1336a180N09J773m15j326L17L59K88J57J024n51j224OJ751Q4j809r06J692J823
$$ -1180 -671 1102 687 -639 -322 37 325 482 1506 955 -269 -263 1488 1572 -237 -1143 549 2372
1354B372n94j918m3J798P49j715j486J820J053r84j617P86O53L10k56P75p89j417
$$ 2372 1778 -140 -183 1615 2364 649 -837 983 2036 1052 -565 221 874 1184 928 1703 914 -503
1372e03Q39J916m62k595J140K335o63k901n44L026J220k450j701J330O92n65n77
$$ -503 336 2252 1790 -805 335 2670 2007 -894 -1438 1588 2808 358 -1343 -13 679 114 -463
1389d63L48N07n8M18J50q14j182Q20J498m67j784M5J755O20k037j325J542J993
$$ -463 -115 392 334 752 902 88 -1094 -274 1224 757 -1027 -982 773 1393 -644 -1969 -427 1566
1407A566j373k129L99J541n73q80R58P53p02l34J094k12k426M99K762K96k944
$$ 1566 193 -1936 -1537 4 -569 -1449 -491 262 -440 -774 320 108 -2318 -1819 943 1239 -1705
1424a705j016K594J208j948j900J916J583j770j146J426O34p41l65J350o22j166
$$ -1705 -2721 -127 1081 -867 -2767 -851 732 -1038 -2184 -758 -124 -865 -1230 120 -502 -1668
1440a668M57K097o42k125J00K119N92j867j245J425J371m68j624N86J157J42j178
$$ -1668 -1211 886 244 -1881 -1781 338 930 -937 -2182 -757 614 146 -1478 -892 265 407 -771
1457g71m87J138K38j10M53o9j047m4J420N58j705j157J557K182j697j954J129
$$ -771 -1258 -120 118 8 461 392 -655 -699 721 1279 -426 -1583 -26 2156 459 -1495 -366
1474c66K144p23j795K7J612N1m12p1N38l79k59Q49L07j171q99J619M67j375j267
$$ -366 1778 1055 -740 -713 899 950 538 467 1005 626 367 1216 1523 352 -547 1072 1539 164 -1103
1493a103J443J659r03j676O39J379Q2j631J10J399o59m30K75R73q49q15K15J443
$$ -1103 340 1999 1096 -580 59 1438 1520 -111 -1 1398 739 309 584 1557 708 -107 108 1551
1511A551r44j887J298J627r62k361J059J972P6k115j2J304O3j105r9J295o23m87
$$ 1551 607 -1280 18 1645 683 -1678 -619 1353 1429 -686 -698 606 669 -436 -535 760 137 -350
1529c50N10M57j136k84R98Q28j626j221J050J179rj397j12J106Q44j498o57N21
$$ -350 160 617 -519 -803 195 1023 -603 -1824 -774 405 396 -1001 -1113 -7 837 -661 -1318 -797
1547g97P25n46n68J71P88l89j13M09K48r01k07R39j19j340k84J967M65j644l66
$$ -797 -72 -618 -1186 -1015 -227 -616 -729 -320 -72 -973 -1180 -241 -360 -1700 -1984 -17 448 -1196 -1562
1566a562K046K31j742n15J794K98j562k98J637m61j002K07J831p22j457P97P42
$$ -1562 484 715 -1027 -1542 252 550 -1012 -1310 327 -134 -1136 -929 902 180 -1277 -480 262
1583B62n25q86P73J524q46j068N18O96K6k73o7J46k22p0r4Q49k8p04q5P36M36
$$ 262 -263 -1149 -376 1148 302 -766 -248 448 474 201 134 280 58 -12 -106 743 715 11 -74 662 1098
1604A098r70k93M49R56r11n92R41Q12l45q44L86N11m99p28P28M41j376J05J226
$$ 1098 128 -165 284 1240 329 -263 678 1490 1145 301 687 1198 699 -29 699 1140 -236 -131 1095
1623A095L48q61n81J206J32j190k74J117N57j152m70Q52O50r05m60J032K9r38
$$ 1095 1443 582 1 1207 1339 149 -125 992 1549 397 -73 779 1429 524 64 1096 1125 187
1641A87q52J210P7k28o44O30O67p21p14Q78N54j192o27N90P81q74o22J024P71
$$ 187 -665 545 622 394 -250 380 1047 326 -388 490 1044 -148 -775 -185 596 -278 -900 124 895
1660H95j411l27R33L74r92o50R31L32r51o6P59O92j007j99P40j77p47J7L79k62
$$ 895 -516 -843 90 464 -528 -1178 -247 85 -866 -932 -173 519 -488 -687 53 -124 -871 -854 -475 -737
1680g37l88M7Q82l9k58p4k57or3k81K57O28k44m45j46P77O74j118j83J123n18
$$ -737 -1125 -1078 -196 -235 -493 -567 -824 -830 -923 -1204 -947 -319 -563 -1008 -1154 -377 297 -821 -1004 119 -399
1701c99q68j64J719l58r11M57R81p43r49R06R85o51j523Q51Q29l24n92J229O68
$$ -399 -1267 -1431 288 -70 -981 -524 457 -286 -1235 -329 656 5 -1518 -667 162 -162 -754 475 1143
1720A143r90q54R15M84j105l51P33K60n99K96P11o3o19j63P72K0l47m31L53K96
$$ 1143 153 -701 214 698 -407 -758 -25 235 -364 -68 643 580 -39 -202 570 590 243 -188 165 461
1740D61r0K64J7K93j80k53j0r7j3l06J5N65J28m15j23R34j05j181j9J138k13r41
$$ 461 371 635 652 945 765 512 502 405 392 86 101 666 794 379 256 1190 1085 -96 -115 1023 810 -131
1762a31O5J256k97j089N63J107p05j005M49J087j146j130P71J263r49p36J139
$$ -131 -66 1190 893 -196 367 1474 769 -236 213 1300 154 -976 -205 1058 109 -627 512
1779E12P59j109o96N82M51n91j031R73Q39q08n10R42K19o45n86L49J35j78n85
$$ 512 1271 162 -534 48 499 -92 -1123 -150 689 -119 -629 313 532 -113 -699 -350 -215 -393 -978
1798i78L39O57m51m8M24L71m12o69n9N03l09n78P72K31j1p8nK24k03n19j83K15
$$ -978 -639 18 -433 -481 -57 314 -98 -767 -826 -323 -632 -1210 -438 -207 -218 -296 -301 -77 -280 -799 -982 -767
1820g67K33o59K94N52L33l69j39Q61l63p05m31O63M15p68o7O82N17o60l63J103
$$ -767 -534 -1193 -899 -347 -14 -383 -522 339 -24 -729 -1160 -497 -82 -850 -917 -235 282 -378 -741 362
1840C62J43r64m48R86J02j116N40N53Q11r19m40J337k61j314k2J108J23j162L7
$$ 362 505 -459 -907 79 181 -935 -395 158 969 50 -390 947 686 -628 -650 458 581 -581 -544
1859e44J502L09j330M8Q17k2j167L29J061n41q26N36J351p33n35M43Q65p38q46
$$ -544 958 1267 -63 -15 802 780 -387 -58 1003 462 -364 172 1523 790 255 698 1563 825 -21
1878b1K22L64k50m6K93K32k39L74J20l64K78k36l91O0R1K55j37J18K94k30q82
$$ -21 201 565 315 269 562 794 555 929 1049 685 963 727 336 396 487 742 605 723 1017 787 -95
1899i5R22j4n95j069N16R70j45q80N66P20n45p18L17O06n85n33N85k5q64r4J740
$$ -95 827 813 218 -851 -335 635 490 -390 176 896 351 -367 -50 556 -29 -562 23 -2 -866 -960 780
1920G80j63r63l63M31M48q51n09O49M82l96m66O97N43l20l94J14k20l69N35p8
$$ 780 617 -346 -709 -278 170 -681 -1190 -541 -59 -455 -921 -224 319 -1 -395 -281 -501 -870 -335 -413
1940d13q1l47qM23K29j54p93O46r6r7o56M26P26L11n20j57j1K29J1K5J42l56j11
$$ -413 -494 -841 -849 -426 -197 -351 -1144 -498 -594 -691 -1347 -921 -195 116 -404 -561 -572 -343 -332 -307 -165 -521 -632
1963f32K12L50o17K00N66M20n10j073P00O94o18l40m3R99k0j66J4J85l75n1M01
$$ -632 -420 -70 -687 -487 79 499 -11 -1084 -384 310 -308 -648 -691 308 288 122 136 321 -54 -105 296
1984B96j98m45J32O16N04q39j61N31N35m64q99M06O14n92n6J78M55o5o03N58J92
$$ 296 98 -347 -215 401 905 66 -95 436 971 507 -392 14 628 36 -20 158 613 548 -55 503 695
2005F95j53l39K62j39m14k36J062J61m43j88j48P21n80k21L62J10k0j50k29K3
$$ 695 542 203 465 326 -88 -324 738 899 456 268 120 841 261 40 402 512 492 342 113 136
2025A36L59J52j16l66k32k6Q7L69j59k21j14Q32j25r39M53L97M71r10q02O15J064
$$ 136 495 647 531 165 -67 -93 -6 363 204 -17 -131 701 576 -363 90 487 958 48 -754 -139 925
2046I25r53n82L96M95o10J84N57q32o18L15J150n64q68L93R47k39j250M16J335
$$ 925 -28 -610 -214 281 -329 -145 412 -420 -1038 -723 427 -137 -1005 -612 335 96 -1154 -738 597
2065E97p85n79j2K87j89R6N42j56m71k29J123m75n80o9R85l79j55m78N58K23J79
$$ 597 -188 -767 -779 -492 -681 -585 -43 -199 -670 -899 224 -251 -831 -900 85 -294 -449 -927 -369 -146 33
2086C3l09n16L08J77M04o69j27M74M58p21K79o9K29m55N23Ok94j33R65J97j054
$$ 33 -276 -792 -484 -307 97 -572 -699 -225 233 -488 -209 -278 -49 -504 19 25 -269 -402 563 760 -294
2107b94o51J353N36j046k96O87N95p85n05Q27j75o7j74P01j23p02L54M47l51p33
$$ -294 -945 408 944 -102 -398 289 884 99 -406 421 246 179 5 706 583 -119 235 682 331 -402
2127d02K98J132j15q03K38L55k23k57K36j73L64j63m9rm89P46M2r9k92j13N04
$$ -402 -104 1028 913 110 348 703 480 223 459 286 650 487 438 429 -60 686 728 629 337 224 728
2148G28K37o20k26J22M40k6l55m15L44M16j90m11j00J7N23l08j74k7J49j01L16
$$ 728 965 345 119 241 681 655 300 -115 229 645 455 44 -56 -39 484 176 2 -25 124 23 339
2169C39j74k88j94M14L8k98m21N58O22o57m42n9P22k13o23L62Q0k03k58N22N28
$$ 339 165 -123 -317 97 135 -163 -584 -26 596 -61 -503 -562 160 -53 -676 -314 -234 -437 -695 -173 355
2190C55j024L05M74k93o41o3R34J49j197M6Q07J78q20J36N52j40n20L16P6R3o85
$$ 355 -669 -364 110 -183 -824 -887 47 196 -1001 -955 -148 30 -790 -654 -102 -242 -762 -446 -370 -277 -962
2211i62P94p0Lm47N7O88m75j3m2J19K62j29j9l88L78K16m73j66L17M37j27p34
$$ -962 -168 -238 -235 -682 -625 63 -412 -425 -467 -348 -86 -215 -234 -622 -244 -28 -501 -667 -350 87 -40 -774
2233g74M47M92l59k72Q11j11n87p4R40m7p74O5O94k9o67L4R95m09j067Q59Q73
$$ -774 -327 165 -194 -466 345 234 -353 -427 513 466 -308 -243 451 422 -245 -211 784 375 -692 167 1040
2254A040p84m73M79L79l82q12R93N01o94m30R77j64n48k98P25K46o80k5M77R4
$$ 1040 256 -217 262 641 259 -553 440 941 247 -183 794 630 82 -216 509 755 75 50 527 621
2274F21j86l32O41m4m33K13j51K61j70m07o3K30K71k73l39L19Q4j50l53O05K63
$$ 621 435 103 744 700 267 480 329 590 420 13 -50 180 451 178 -161 158 242 92 -261 344 607
2295F07l67r92R88K48o89K1M79L17n09n52M67K55p78k02Q91O0p92rP68k19l44
$$ 607 240 -752 236 484 -205 -184 295 612 103 -449 18 273 -505 -707 184 244 -548 -557 211 -8 -352
2316c52K9K79J14n30J34L31l10k55M43K84k64l57j3M48l09m17M36k3M9r3j53M34
$$ -352 -323 -44 70 -460 -326 5 -305 -560 -117 167 -97 -454 -467 -19 -328 -745 -309 -332 -283 -376 -529 -95
2338i5l18L5K67j43j72J30L3o7J74j82L97k36K6j19K3M0K61k59l34M14J94K47
$$ -95 -413 -378 -111 -254 -426 -296 -263 -330 -156 -338 59 -177 -151 -270 -247 -207 54 -205 -539 -125 69 316
2360C16k16j70oM33n55m4N55l72lm3N25j87p19O81K75p1p31J84Q06m40k96L56
$$ 316 100 -70 -76 357 -198 -242 313 -59 -62 -105 420 233 -486 195 470 399 -332 -148 658 218 -78 278
2382B78K79j18m45P78p6p25k7N42K09p13J9O18J48o81l2M17J4k01K82kl84j99
$$ 278 557 439 -6 772 696 -29 -56 486 695 -18 1 619 767 86 54 471 485 284 566 564 180 -19
2404a9L90Nq4j80P38m0k42m51L32q6l20O1J44K46k68M20l13k78lK88o6l39j2N32
$$ -19 371 376 292 112 850 810 568 117 449 363 43 104 248 494 226 646 333 55 52 340 274 -65 -77 455
2428D55l47l32K06M29k27k66K99J44o47k6L66J49o66P2N57m1o51J42O70m65o10
$$ 455 108 -224 -18 411 184 -82 217 361 -286 -312 54 203 -463 -391 166 125 -526 -384 286 -179 -789
2449g89L33K48j45m09N80K85l90j51J13M20p17p5M39p4k34j71N17J26m65r7L21
$$ -789 -456 -208 -353 -762 -182 103 -287 -438 -325 95 -622 -697 -258 -332 -566 -737 -220 -94 -559 -656 -335
2470c35M3k91J24L50o44K57J20J04Q2j48K8O2q8k0N1R7o7j19R0M3K23J63j33l28
$$ -335 -292 -583 -459 -109 -753 -496 -376 -272 -190 -338 -310 -248 -336 -356 -305 -208 -275 -394 -304 -261 -38 125 -8 -336
2494c36L26J76l22N4K12J94m51LM09m9j64J95J48j66l57L6M45m71K1M32Q5q4k69
$$ -336 -10 166 -156 -102 110 304 -147 -144 265 216 52 247 395 229 -128 -92 353 -118 -97 335 420 336 67
2517F7j24O98k22k68j11K79J9o4J11J59j03k92M15m1o13L07N2J94j95j83M63j02
$$ 67 -57 641 419 151 40 319 338 274 385 544 441 149 564 523 -90 217 269 463 268 85 548 446
2539D46j44j36P6J5l15R0M82l88k0K6J92R4l26K04N8j09l37j62L74K3j66k19K35
$$ 446 302 166 242 257 -58 32 514 126 106 132 324 418 92 296 354 245 -92 -254 120 143 -23 -242 -7
2562gM5j53K18J2l73L55l15K4QKK85l11M3L5j1k89L35J58p33L14J67l9l67K63
$$ -7 38 -115 103 115 -258 97 -218 -194 -186 -184 101 -210 -167 -132 -143 -432 -97 61 -672 -358 -191 -230 -597 -334
2586c34M55J4r72N73M18n06n01O96O0k60j02L95K97n76l52M77L74l83j52J82J66
$$ -334 121 135 -837 -264 154 -352 -853 -157 -97 -357 -459 -64 233 -343 -695 -218 156 -227 -379 -197 -31
2607c1k74l63M12L27j69j95L73k40j13J96J35k88j85J22K68K88k07j27R0j06k5
$$ -31 -305 -668 -256 71 -98 -293 80 -160 -273 -77 58 -230 -415 -293 -25 263 56 -71 19 -87 -112
2628a12J52K67k88K46l3m62J06K92L30k88r8J65j92k03J66M53j14n11L70J59l19
$$ -112 40 307 19 265 232 -230 -124 168 498 210 112 277 85 -118 48 501 387 -124 246 405 86
2649H6j34O87no63j84P03J42n65k1J83K80j35l18K79K39n77J79k8J30p0J61N31
$$ 86 -48 639 634 -29 -213 490 632 67 46 229 509 374 56 335 574 -3 176 148 278 208 369 900
2671I00j78q48J60L69j7n57J05N31K34n27O8j67J38J60j09l78J28o1K74k1n53
$$ 900 722 -126 34 403 386 -171 -66 465 699 172 240 73 211 371 262 -116 12 -49 225 204 -349
2692c49N2J34L51k48j54Q5P3J69j28o78M44o7M19n41k87M81J30k53j58N84p75
$$ -349 -297 -163 188 -60 -214 -129 -56 113 -15 -693 -249 -316 103 -438 -725 -244 -114 -367 -525 59 -716
2713g16Q1N63N1k76j27J11M34l80l99L53J63k0o47L10O80o00J95j0Q6J64n96K67
$$ -716 -635 -72 -21 -297 -424 -313 121 -259 -658 -305 -142 -162 -809 -499 181 -419 -224 -234 -148 16 -580 -313
2735c13K50n68j08O19K63p75J35P26P0p37L3K01j43r8L6N52l39k72M04J93j83
$$ -313 -63 -631 -739 -120 143 -632 -497 229 299 -438 -405 -204 -347 -445 -409 143 -196 -468 -64 129 -54
2756e4q9L00k5n65L38K80j22j25J22K50k71oN12l10m06N7N85l27l86L84N32l58
$$ -54 -143 157 132 -433 -95 185 63 -62 60 310 39 33 545 235 -171 -114 471 144 -242 142 674 316
2778C16j90P1J53o6j65O23m60l11J58O54l84m40j73Q66j00k15l97O16Q3o67K64
$$ 316 126 197 350 284 119 742 282 -29 129 783 399 -41 -214 652 552 337 -60 556 639 -28 236
2799B36J27q1J9J04K4k75k22M88o1k33j65M81qk20L2l91J95O5l50J62j58K26N1
$$ 236 363 282 301 405 429 154 -68 420 359 126 -39 442 434 214 246 -145 50 115 -235 -73 -231 -5 46
2822D6j58M4j94L05k26L02k09n0j01j00L88l79j57n9N11k82r5K83J77k43l26N6
$$ 46 -112 -68 -262 43 -183 119 -90 -140 -241 -341 47 -332 -489 -548 -37 -319 -414 -131 46 -197 -523 -467
2844d67M42k19j02L00Kk32j55K91K97p06K80J59r9l47M8N44l69J05j89R8Q2K71
$$ -467 -25 -244 -346 -46 -44 -276 -431 -140 157 -549 -269 -110 -209 -556 -508 36 -333 -228 -417 -319 -237 34
2866C4j40k70k78K68K73P6L80o61O2M49l57Q0j37J16Oj28j32L35r8P6N83k56l34
$$ 34 -106 -376 -654 -386 -113 -37 343 -318 -256 193 -164 -84 -221 -105 -99 -227 -359 -24 -122 -46 537 281 -53
2889e3m0J08J00K4Q8k04K80j31J26J79l86j22L02k4m24K06N29q5j32Q2N4l77K03
$$ -53 -93 15 115 139 227 23 303 172 298 477 91 -31 271 247 -177 29 558 473 341 423 477 100 303
2912C03M00k66m09M15o6j33k36M24K32j64o01L25K09k2l58J44L56l68j75K11M38
$$ 303 703 437 28 443 377 244 8 432 664 500 -101 224 433 411 53 197 553 185 10 221 659
2933F59o00J05R6J12k89J3N1Q9l77Q3L87k72r7K13k32J32k0j27Q7l85p1P53r1
$$ 659 59 164 260 372 83 96 147 236 -141 -58 329 57 -40 173 -59 73 53 -74 13 -372 -443 310 219
2956B19m13L36J51k24n34K0M21K44r89O62K32o15j2L38J20k36L1M31q25NN10Q5
$$ 219 -194 142 293 69 -465 -445 -24 220 -769 -107 125 -490 -502 -164 -44 -280 -249 182 -643 -638 -128 -43
2978d3J8r6l0K52k02m80O80l65q6l10N47j78m36M43K74L5o27J91L52j19k51L16
$$ -43 -25 -121 -151 101 -101 -581 99 -266 -352 -662 -115 -293 -729 -286 -12 23 -604 -413 -61 -180 -431 -115
3000a15N8j37l43L50K40k45j6K88k34l38J85K07K6j00J80K17j35n6m3n7J61q7
$$ -115 -57 -194 -537 -187 53 -192 -208 80 -154 -492 -307 -100 -74 -174 6 223 88 32 -11 -68 93 6
3022FJ7J13K41j54r1P3k87K52J30k59NK9K32k74J03K77j03j77K73l60L89k24j44
$$ 6 23 136 377 223 132 205 -82 170 300 41 46 75 307 33 136 413 310 133 406 46 435 211 67
3045F7L33j04k16M79p2m12K85J99J71o24k79J74Q1J59p1r2N2j61M42N9n55M17
$$ 67 400 296 80 559 487 75 360 559 730 106 -173 1 82 241 170 78 130 -31 411 470 -85 332
$$ [...]
8191a52
##END NTUPLES=NMR FID
##END=
