##TITLE=1H_Costus-Summ-f13-f6
 CDCl3, 8 sc, 
 7.8.2020
##JCAMPDX= 6.0         $$ Bruker NMR JCAMP-DX V2.0
##DATA TYPE= NMR FID
##DATA CLASS= NTUPLES
##ORIGIN= UXNMR, Bruker Analytische Messtechnik GmbH
##OWNER= root
$$ XWIN-NMR		Version 3.5
$$ Fri Aug  7 10:59:52 2020 Russian Standard Time (UT+4h)  she@DPX200
##.OBSERVE FREQUENCY= 200.1314999998
##.OBSERVE NUCLEUS= ^1H
##.DELAY= (6, 6)
##.ACQUISITION MODE= SIMULTANEOUS
##.ACQUISITION SCHEME= undefined
##.AVERAGES= 8
##.DIGITISER RES= 18
##SPECTROMETER/DATA SYSTEM= spect
##.PULSE SEQUENCE= zg30
##.SOLVENT NAME= D2O
##.SHIFT REFERENCE= (INTERNAL, D2O, 0, 15.7039)
##AUDIT TRAIL= $$ (NUMBER, WHEN, WHO, WHERE, WHAT)
$$ ##TITLE= Audit trail, XWIN-NMR		Version 3.5
$$ ##JCAMPDX= 5.01
$$ ##ORIGIN= Bruker BioSpin GmbH
$$ ##OWNER= she
$$ F:/spectra/data/she/nmr/H-F/1/audita.txt
$$ ##AUDIT TRAIL=  $$ (NUMBER, WHEN, WHO, WHERE, WHAT)
(   1,<2020-08-07 10:58:45.92 +0400>,<she>,<DPX200>,
      <created by zg, POWCHK disabled, PULCHK disabled
       configuration hash MD5:
       00 E9 B6 7A A2 85 ED C7 34 08 36 98 17 FE 4E 26
       data hash MD5: 16K
       2C C9 DE 04 1E BB 79 56 DB 47 9D 2E 79 9E 34 EC>)
$$ ##END=
$$ 
$$ hash MD5
$$ 1A 4C CB B6 7E 87 54 E1 9D FC 62 B1 C5 02 F6 72
##$RELAX= 
##$RELAX= 
##$RELAX= 
##$RELAX= 
##$RELAX= 
##$RELAX= 
$$ Bruker specific parameters
$$ --------------------------
##$DU= <F:/spectra>
##$EXPNO= 1
##$NAME= <H-F>
##$PROCNO= 1
##$TYPE= <nmr>
##$USER= <she>
##$AMP= (0..31)
100 100 100 100 100 100 100 100 100 100 100 100 100 100 100 100 100 100 
100 100 100 100 100 100 100 100 100 100 100 100 100 100 
##$AQSEQ= 0
##$AQ_mod= 1
##$AUNM= <au_zg>
##$AUTOPOS= <>
##$BF1= 200.13
##$BF2= 200.13
##$BF3= 200.13
##$BF4= 200.13
##$BF5= 200.13
##$BF6= 200.13
##$BF7= 200.13
##$BF8= 200.13
##$BYTORDA= 1
##$CFDGTYP= 0
##$CFRGTYP= 5
##$CHEMSTR= <none>
##$CNST= (0..31)
1 1 145 1 1 1 1 1 1 1 1 1 1 1 1 1 1 1 1 1 1 1 1 1 1 1 1 1 1 1 1 1 
##$CPDPRG= <>
##$CPDPRG1= <>
##$CPDPRG2= <>
##$CPDPRG3= <>
##$CPDPRG4= <mlev>
##$CPDPRG5= <mlev>
##$CPDPRG6= <mlev>
##$CPDPRG7= <mlev>
##$CPDPRG8= <mlev>
##$CPDPRGB= <>
##$CPDPRGT= <>
##$D= (0..31)
0 1.2 0 0 0 0 0 0 0 0.06 0 0.03 0 0 0 0 0.0002 0 0 0 0 0 0 0 0 0 0 0 0 
0 0 0 
##$DATE= 1596783525
##$DBL= (0..7)
120 120 120 120 120 120 120 120 
##$DBP= (0..7)
150 150 150 150 150 150 150 150 
##$DBP07= 0
##$DBPNAM0= <>
##$DBPNAM1= <>
##$DBPNAM2= <>
##$DBPNAM3= <>
##$DBPNAM4= <>
##$DBPNAM5= <>
##$DBPNAM6= <>
##$DBPNAM7= <>
##$DBPOAL= (0..7)
0.5 0.5 0.5 0.5 0.5 0.5 0.5 0.5 
##$DBPOFFS= (0..7)
0 0 0 0 0 0 0 0 
##$DE= 6
##$DECBNUC= <off>
##$DECIM= 24
##$DECNUC= <off>
##$DECSTAT= 4
##$DIGMOD= 1
##$DIGTYP= 9
##$DL= (0..7)
0 120 120 120 120 120 120 120 
##$DP= (0..7)
150 150 150 150 150 150 150 150 
##$DP07= 0
##$DPNAME0= <>
##$DPNAME1= <>
##$DPNAME2= <>
##$DPNAME3= <>
##$DPNAME4= <>
##$DPNAME5= <>
##$DPNAME6= <>
##$DPNAME7= <>
##$DPOAL= (0..7)
0.5 0.5 0.5 0.5 0.5 0.5 0.5 0.5 
##$DPOFFS= (0..7)
0 0 0 0 0 0 0 0 
##$DQDMODE= 0
##$DR= 18
##$DS= 0
$$ [...]
##$SUBNAM2= <"">
##$SUBNAM3= <"">
##$SUBNAM4= <"">
##$SUBNAM5= <"">
##$SUBNAM6= <"">
##$SUBNAM7= <"">
##$SUBNAM8= <"">
##$SUBNAM9= <"">
##$SW= 24.9337058888022
##$SWIBOX= (0..15)
0 0 2 0 0 0 0 0 0 0 0 0 0 0 0 0 
##$SW_h= 4990.01996007984
##$TD= 16384
##$TD0= 1
##$TE= 0
##$TE2= 300
##$TE3= 300
##$TEG= 300
##$TL= (0..7)
0 120 120 120 120 120 120 120 
##$TP= (0..7)
150 150 150 150 150 150 150 150 
##$TP07= 0
##$TPNAME0= <>
##$TPNAME1= <>
##$TPNAME2= <>
##$TPNAME3= <>
##$TPNAME4= <>
##$TPNAME5= <>
##$TPNAME6= <>
##$TPNAME7= <>
##$TPOAL= (0..7)
0.5 0.5 0.5 0.5 0.5 0.5 0.5 0.5 
##$TPOFFS= (0..7)
0 0 0 0 0 0 0 0 
##$TUNHIN= 0
##$TUNHOUT= 0
##$TUNXOUT= 0
##$USERA1= <user>
##$USERA2= <user>
##$USERA3= <user>
##$USERA4= <user>
##$USERA5= <user>
##$V9= 5
##$VALIST= <valist>
##$VCLIST= <CCCCCCCCCCCCCCC>
##$VD= 0
##$VDLIST= <DDDDDDDDDDDDDDD>
##$VPLIST= <PPPPPPPPPPPPPPP>
##$VTLIST= <TTTTTTTTTTTTTTT>
##$WBST= 1024
##$WBSW= 4
##$XGAIN= (0..3)
0 0 0 0 
##$XL= 0
##$YL= 0
##$YMAX_a= 154458
##$YMIN_a= -99461
##$ZGOPTNS= <>
##$ZL1= 120
##$ZL2= 120
##$ZL3= 120
##$ZL4= 120
##$ABSF1= 10
##$ABSF2= 0
##$ABSG= 5
##$ABSL= 3
##$ALPHA= 0
##$AQORDER= 0
##$ASSFAC= 0
##$ASSFACI= 0
##$ASSFACX= 0
##$ASSWID= 0
##$AUNMP= <proc_1d>
##$AZFE= 0.1
##$AZFW= 0.1
##$BCFW= 1
##$BC_mod= 2
##$BYTORDP= 1
##$COROFFS= 0
##$CY= 11.3945322036743
##$DATMOD= 1
##$DC= 2
##$DFILT= <>
##$DTYPP= 0
##$F1P= 16.9975609425685
##$F2P= -3.02152046262296
##$FCOR= 0.5
##$FTSIZE= 0
##$FT_mod= 4
##$GAMMA= 1
##$GB= 0.15
##$INTBC= 1
##$INTSCL= 1
##$ISEN= 128
##$LB= 0.24
##$LEV0= 0
##$LPBIN= 0
##$MAXI= 10000
##$MC2= 0
##$MEAN= 0
##$ME_mod= 0
##$MI= 1.114404
##$NCOEF= 0
##$NC_proc= 0
##$NLEV= 6
##$NOISF1= 3.799351
##$NOISF2= 2.8
##$NSP= 1
##$NTH_PI= 0
##$NZP= 0
##$OFFSET= 15.70392
##$PC= 1
##$PHC0= -9802.918
##$PHC1= 24.20092
##$PH_mod= 1
##$PKNL= yes
##$PPARMOD= 0
##$PSCAL= 0
##$PSIGN= 0
##$REVERSE= no
##$SF= 200.130013532006
##$SI= 16384
##$SIGF1= 3
##$SIGF2= 2
##$SINO= 400
##$SIOLD= 16384
##$SREGLST= <1H.CDCl3>
##$SSB= 0
##$STSI= 0
##$STSR= 0
##$SW_p= 3612.71676300578
##$SYMM= 0
##$S_DEV= 0
##$TDeff= 0
##$TDoff= 0
##$TI= <>
##$TILT= no
##$TM1= 0
##$TM2= 0
##$TOPLEV= 0
##$USERP1= <user>
##$USERP2= <user>
##$USERP3= <user>
##$USERP4= <user>
##$USERP5= <user>
##$WDW= 1
##$XDIM= 8192
##$YMAX_p= 0
##$YMIN_p= 0
$$ End of Bruker specific parameters
$$ ---------------------------------
##NTUPLES= NMR FID
##VAR_NAME=  TIME,          FID/REAL,        FID/IMAG
##SYMBOL=    X,             R,               I
##VAR_TYPE=  INDEPENDENT,   DEPENDENT,       DEPENDENT
##VAR_FORM=  AFFN,          ASDF,            ASDF
##VAR_DIM=   8192,          8192,            8192
##UNITS=     SECONDS,       ARBITRARY UNITS, ARBITRARY UNITS
##FACTOR=    0.0002004,     1,               1
##FIRST=     0,             0,               0
##LAST=      1.6414764,     0,               0
##MIN=       0,             -99461,          0
##MAX=       1.6414764,     154458,          0
$$ Real data points
##PAGE= N=1
##DATA TABLE= (X++(R..R)), XYDATA
$$ [...]
1963d47j03m7j22K7j74P1J2j25M6K18Q9r0k80j02K30J45m81l7M82M1j60J88O3
1986e56J3j94J7J70k73j49K82J5K00o7K58l0j71RK58j08p9j80P7M68j42j4k4K15
2010eM42k51k35o1M47K05m37j35J8Q70o9n23q6O9L70K36m35k74K62M78o1j66n14
2033A45K46Q16l74o56M05K66K09o29j4L74L76J4m24r2k20J49M09r1m74KM24J62
2055A023n80m07Q14K42m21p26J46L21m9P4k89L10l7j8k58j81J12J96K55n26n19
2076e18O07K15q2k86k78J68Q0J27k45k83K3R4j10k88K35O5O9l43j05M6J74qL2
2099f11r6nj70K47J97Q1m62K53j31m07l5P00j27k44K25M5m9j01k13L11j78n2O5
2122g57N09l50N3K32k9J9j99L10K0m23K36K53J72k18k64O18k30m51N70J07J19
$$ plain form
1963 -447 -550 -597 -719 -692 -866 -795 -783 -908 -862 -644 -555 -645 -925 -1027 -797 -652 -1133 -1170 -688 -647 -807 -619 -556
1986 -556 -543 -737 -720 -550 -823 -972 -690 -675 -475 -542 -284 -314 -485 -476 -218 -326 -405 -585 -508 -40 -182 -196 -220 -5
2010 -5 437 186 -49 -110 337 542 105 -30 -12 858 789 266 180 249 619 855 420 146 408 886 825 659 145
2033 145 391 1207 833 177 582 848 1057 428 414 788 1164 1178 754 662 442 591 1000 909 435 437 861 1023
2055 1023 443 36 850 1092 671 -55 91 412 363 437 148 458 421 403 145 -36 76 272 527 1 -518
2076 -518 89 304 222 -64 -342 -174 -94 33 -212 -495 -472 -378 -488 -776 -541 -476 -407 -750 -855 -809 -635 -643 -611
2099 -611 -707 -712 -882 -635 -438 -357 -819 -566 -697 -1104 -1139 -439 -566 -810 -585 -540 -589 -690 -903 -592 -770 -822 -757
2122 -757 -248 -598 -545 -313 -342 -323 -522 -212 -192 -615 -379 -126 46 -172 -436 182 -48 -499 71 178 297
2143B97o9l56K78Q6j48K41j27K56oN2m7k06J34K41J09ll54j27O66k71j06k18L97
2166G19K20k45k90j8K39L76q3l81M48o2j44k67l22N56J54k68O1Rk96J07J76k82
2188D07r7L83J34k11o86k40P94M08m90J47l70j04K40p06M44J16R2J61p56k80L45
2209b69L78Pp68m8K81N3Q7j70j46N50j36l21k42K06p4l6L3k07M37K4k21q8j77
2232h47M05l20M16j11k76J56j7k69q1N77J92l22k76m40M61L82k98J49L96Q8l39
2253c74p90N68M33M6m89L91r2l02K29K68j7J73Q2j90N2q71P04O06k59j75j8M01
2275C76j68k38J9N8K06J85q1n5J40K22j45r1m27N59K83l43op8J61J81K09n14L47
2298H00j55J11k87k17O17K35J43j082O2L55K82k03l18L06J75k62m35L87kK06l33
$$ plain form
2143 297 228 -128 150 236 88 329 202 458 452 504 457 251 385 626 735 732 378 251 917 646 540 322 719
2166 719 939 694 404 386 625 1001 918 537 985 923 779 512 190 746 900 632 693 702 406 513 689 407
2188 407 310 693 827 616 -70 -310 484 892 402 549 179 75 315 -391 53 169 261 422 -334 -614 -269
2209 -269 109 116 -652 -700 -419 -366 -279 -449 -595 -45 -181 -502 -744 -538 -612 -648 -615 -822 -385 -361 -582 -670 -847
2232 -847 -442 -762 -346 -457 -733 -577 -594 -863 -944 -367 -175 -497 -773 -1213 -752 -370 -668 -519 -123 -35 -374
2253 -374 -1164 -596 -163 -117 -606 -215 -307 -609 -380 -112 -129 44 126 -64 -12 -883 -179 427 168 -7 -25 376
2275 376 208 -30 -11 47 253 438 357 302 442 664 519 428 1 560 843 500 494 416 577 758 967 453 800
2298 800 645 756 469 252 869 1104 1247 165 227 582 864 661 343 649 824 562 127 514 512 718 385
2319C85J3j43j00J87J11k09k23N53K6p50pO1K64K55n12J7J94k73k43K21r7J93
2341g7K43l62j61j74L40n6k68K42m9j55K76l57K72l1P6J28p90J4L55R2p0l76K44
2364f44J29Q1n06J24M86R4m72J42P8j48l6L84m60N7J25M64l76k33O3M75l97n4
2386f24j50N92R2m30J52J42K15j23J35m8n8l33L34K30K3j09M01j11l07p0L41M9
2408C43p2N9R6N4k50J01l7K91j6J13n01K38j96N71l2l27K69k1J60m67K01O1N8
2431F96o5j46p9N2K97l21K35j70K90J64m64p2k62L50k6k30j38P60m34k85K9K15
2453C96n2o1J62k83j52j19P21l60k93L22q8J55m93k03K16Rl8k09K65k03L35m84
2475d57J57ln6j23o1j67J42M40l64q9j14L09l82N05j96O7l22J6K32m44K37K9J99
$$ plain form
2319 385 398 255 155 342 453 244 21 574 600 -150 -157 -96 168 423 -89 -72 122 -151 -394 -173 -270 -77
2341 -77 166 -196 -357 -531 -191 -247 -515 -273 -322 -477 -201 -558 -286 -317 -241 -113 -903 -889 -534 -442 -512 -888 -644
2364 -644 -515 -434 -940 -816 -330 -236 -708 -566 -488 -636 -672 -288 -748 -691 -566 -102 -478 -711 -648 -173 -570 -624
2386 -624 -774 -182 -90 -520 -368 -226 -11 -134 1 -47 -105 -438 -104 126 149 40 441 330 23 -47 294 343
2408 343 271 330 426 480 230 331 294 585 569 682 181 419 223 794 762 435 704 683 843 376 577 638 696
2431 696 631 485 406 458 755 434 669 499 789 953 489 417 155 505 479 249 111 871 437 152 181 396
2453 396 344 283 445 162 10 -109 612 252 -41 281 193 348 -145 -348 -132 -123 -161 -370 -105 -308 27 -457
2475 -457 -300 -303 -359 -482 -543 -710 -568 -128 -492 -581 -695 -386 -768 -263 -459 -392 -714 -698 -466 -910 -673 -644 -445
2498d45k50J56l03L46L9o1k33J33L1R4J11J99l43K73p3N6n26M15K05j65P5l60
2520f26M75J19l30n5O55o93K25M19O3l94K75L9k49k36P73K4l09k8J4J00o9k41
2542d9M82J34J56j64j73K61n5q0k28j0q7N51Q3m79J54L8L59j64m77J32M68n62
2564B90n9L13Q5N1J18m05k37K13J91L03n61N3J15j02r0j92K39K30j62q5p61O01
2586A48N2K97o34o6J03M55j77j92k04J10M99l33l86J33P6Qk54J05M17P4l18l69
2608d56K8j42L64L17j85l93P1J39j59m47M63N96l31o01J40RK36Q2k00n2R7j23
2630e47j22Q4j29M03m1j39l33r3P21k46j83K47o7K13M1m11J59j6L03ql95K29L22
2653hM5n36K15K80J05j0j40k72J20L28j45J38J99o6k31k47M26K12L8o1j01k59
$$ plain form
2498 -445 -695 -539 -842 -496 -457 -518 -751 -618 -587 -493 -382 -183 -526 -253 -326 -270 -796 -381 -176 -341 -266 -626
2520 -626 -151 -32 -362 -417 238 -455 -230 189 252 -142 133 172 -77 -313 460 484 175 147 161 261 192 -49
2542 -49 433 567 723 559 386 647 592 512 284 274 187 738 821 342 496 534 893 729 252 384 852 290
2564 290 231 544 629 680 798 393 156 369 560 863 302 355 470 368 278 86 325 555 393 308 -453 148
2586 148 200 497 -137 -203 -100 355 178 -14 -218 -108 391 58 -328 -195 -119 -111 -365 -260 157 231 -87 -456
2608 -456 -428 -570 -206 111 -74 -467 -396 -257 -416 -863 -400 196 -135 -736 -596 -587 -351 -269 -469 -521 -424 -547
2630 -547 -669 -585 -714 -311 -352 -491 -824 -917 -196 -442 -625 -378 -445 -232 -191 -602 -443 -459 -156 -164 -559 -330 -8
2653 -8 37 -499 -284 -4 101 91 -49 -321 -201 127 -18 120 319 253 22 -225 201 413 451 390 289 30
2675C0K29J02j70J68J78J69m86j8p2M12j5J05j29K66k70j45K93l45j19L28jj62
2697C48k43K88K31j73p6L0N20n39N5k26Ml1N29l38Q9k14%j46k51J19N21k43k95
2720d1l54J65M29p6K25l74k06J45j27o8N9RM4K21l63j49L41K03l19l92R8L80r0
2743b40k20l22J53J54J70k40J82j17r0M14o67R0K10K79k13k18J57P7N09o88L82
2764b38k85K48k9k93m5J24L84k37O7K9NJ21j54J40K10q9N4kJ7l01J64J62M1m34
2788c41N64J16j20k58J3L95m70K55K32k31L15k53L9K01r2p4K3J11m8R3K3o6K4
2811D51k8r6M57l96J95J18k68O5o0k55J49n7K07M2r1j71n4K1R3L21j37k07O1o
2835C54l1k97L97L48n46L61q0l27o7l14M26q8j85K17l74J54M9l86K27K9L27m22
$$ plain form
2675 30 259 361 191 359 537 706 220 202 130 542 527 632 503 769 499 354 647 302 183 511 510 348
2697 348 105 393 624 451 375 405 925 386 441 215 219 188 717 379 468 254 254 108 -143 -24 497 254 -41
2720 -41 -395 -230 199 123 348 -26 -232 -87 -214 -282 -223 -214 -170 51 -312 -461 -120 83 -236 -628 -530 -150 -240
2743 -240 -460 -782 -629 -475 -305 -545 -363 -480 -570 -156 -823 -733 -523 -244 -457 -675 -518 -441 68 -620 -238
2764 -238 -523 -275 -304 -597 -642 -518 -134 -371 -304 -275 -270 -149 -303 -163 47 -42 12 10 27 -274 -110 52 93 -341
2788 -341 223 339 219 -39 -26 369 -101 154 386 155 470 217 256 457 365 291 314 425 377 470 493 427 451
2811 451 423 327 784 388 583 701 433 498 438 183 332 275 482 524 433 262 208 229 322 643 506 299 360 354
2835 354 323 26 423 771 225 586 506 179 112 -202 224 136 -49 168 -206 -52 -3 -389 -162 -133 194 -228
2857b28K57l48J25j08L35j71k18L3K06k92k07N8N30K22q86J15J94J3J03k74k1
2878e62N7K02n61K44M0M26l66J10j39l5P6K8r2O6J45K34M0l68k02K79k00L46j75
2901d07O5J39N2l38k42L31L35J35j92j48K11L0n0k6K06J57j90n4m96K39K57J79
2923A93L38n62J16K30k73o3K51L43l21j52J69J28r1j9j34L96Jj26J04%k59JL55
2946F25J70n98P3K71m12K81O0J1K12n32R4l5k8K96p4k57o7L04N3m60k23M29n3
2969A40K79m97M56j54p2k44M65j69l22J57j84n5J11K72q1r6m0j97J34j54J01j43
2991b93J46R7J17l11j13J84p7Qo4P3j48L39o73J48L05m12J62K10j28L15n42O0
3013e97L25j69L0m4L76o72J44L81J41k40p9q8K04k77OL53P6k22J2P6L93m12M0
$$ plain form
2857 -228 29 -319 -194 -302 33 -138 -356 -323 -117 -409 -616 -558 -28 194 -692 -577 -383 -370 -267 -541 -562
2878 -562 -505 -303 -864 -620 -580 -154 -520 -410 -549 -584 -508 -480 -572 -506 -361 -127 -87 -455 -657 -378 -578 -232 -407
2901 -407 -342 -203 -151 -489 -731 -400 -65 70 -122 -270 -59 -29 -79 -105 101 258 68 14 -482 -243 14 193
2923 193 531 -31 85 315 42 -21 230 573 252 100 269 397 306 287 153 549 550 424 528 528 269 270 625
2946 625 795 197 270 541 129 410 470 481 693 161 255 220 192 488 414 157 90 394 447 -13 -236 193 140
2969 140 419 -78 378 224 152 -92 373 204 -118 39 -145 -200 -89 183 102 6 -34 -231 -97 -251 -150 -293
2991 -293 -147 -50 67 -244 -357 -173 -250 -242 -306 -233 -381 -42 -715 -567 -262 -674 -512 -302 -430 -115 -657 -597
3013 -597 -272 -441 -411 -455 -79 -751 -607 -226 -85 -325 -404 -492 -288 -565 -559 -206 -130 -352 -340 -264 129 -283 -243
3036b43K53o8j2K11k47j90j17L22J27q9K34K3K1pj34Qj9L74p9k99k74L23M58k88
3060B88j64k7J90k3OK15J27m72J43J87K47qo97L41L1K8R2P5j68O7m81M32Q2m04
3084A07M47k31N9m5k82l1K67j24J24k72J15j80K06l5J05l3O3K71m05j60j36K89
3106A19j2j52J90j35j61J17k28K07O4L0k40kr5J58o7l8K47k92L11j92J23j52r5
3129b95K22l95j54J18L55l37P9j14K12J42j7m26M52j43k57R4P9J33k36J18J82
3150a88n71O6L13kJ73j19M7K52nl95J40J34P3L1k49q7M88J43k24k5j35M2L5J40
3174G7j71rN46l67j31J04p9J35r0K83l70M14j32J80k01j57M68K11n21j36J90q9
3196A55L26k59j37K14N24l74p0k27K47j08L50l37l27K92M4k6l58O00K52o20J53
$$ plain form
3036 -243 10 -58 -70 141 -106 -296 -413 -91 36 -53 181 204 225 218 84 92 73 447 368 69 -205 118 576 288
3060 288 124 97 287 264 270 485 612 140 283 470 717 709 12 353 384 412 504 579 411 478 -3 429 511 107
3084 107 554 323 382 337 55 24 291 167 291 19 134 -46 160 125 230 197 260 531 126 -34 -170 119
3106 119 107 -45 145 10 -151 -34 -262 -55 9 39 -201 -203 -298 -140 -207 -245 2 -290 21 -171 -48 -200 -295
3129 -295 -73 -468 -622 -504 -149 -486 -407 -521 -309 -167 -184 -610 -158 -301 -558 -464 -385 -252 -488 -370 -188
3150 -188 -759 -693 -380 -382 -209 -328 -281 -29 -34 -429 -289 -155 -82 -51 -300 -387 101 244 20 -5 -140 -98 -63 77
3174 77 -94 -103 443 76 -55 49 -30 105 15 298 -72 342 210 390 189 32 500 711 190 54 244 155
3196 155 481 222 85 299 823 449 379 152 399 291 641 304 -23 269 313 287 -71 529 781 161 314
3217C14K0J24J44l78JJ20J44k18k6Pj94J89q2J5j11M8J69ql13Q5o6J18l49O1J70
3242a6L8N2J03m36J79N4k62p0N2M15m5m20M6j34P5K91n4l41M71l94j20J99k92
3265f09L69l5J14j94j32J28Q1m7n16O26q8K60l65j43J63K57k21nM71k96J04n26
3287f04J35R5K15J48m15O1M05k63L6k28L53J91L3j69k64k0O15l4j63p6J69j77
3309D3K04l40J3L30M2k71m3K47o7J8k41N34r8J77m80o8N0M15L7J46n07O8P4Q4
3333C67J78n25L68po0j92J41o2L51m4m36P9J77K9k4k85L3K36k85N03k99j62oR1
3357A66j88K96j18l91K52J31K2J50l21M57n37l5j45K2N0j41J51K05K02p52K43
3378b81k3j02J28L62j82p3k23k3L02l99L14k01q7J28J35l7k70R3J32j6j02N4j76
$$ plain form
3217 314 334 458 602 224 225 345 489 271 245 252 58 247 165 180 69 117 286 278 -35 50 -16 102 -247 -186 -16
3242 -16 22 74 177 -259 -80 -26 -288 -358 -306 109 64 -356 -310 -444 -369 -78 -132 -473 -2 -396 -516 -317 -609
3265 -609 -240 -275 -161 -355 -487 -359 -278 -325 -841 -215 -303 -43 -408 -551 -388 -131 -352 -357 114 -182 -78 -604
3287 -604 -469 -374 -159 -11 -426 -365 40 -223 -187 -415 -62 129 162 -7 -271 -291 324 290 127 51 220 43
3309 43 247 -93 -80 250 292 21 -22 225 158 176 -65 469 371 548 68 0 50 465 502 648 141 209 283 367
3333 367 545 20 388 381 321 129 270 208 559 515 79 158 335 364 340 55 88 324 39 542 243 81 75 166
3357 166 -22 274 156 -235 17 148 170 320 -1 456 -81 -116 -261 -239 -189 -330 -179 26 228 -524 -281
3378 -281 -304 -406 -278 84 -98 -171 -394 -417 -115 -514 -200 -401 -488 -360 -225 -262 -532 -439 -307 -323 -425 -371 -547
3401e47K28m7J24o2l00J87J20J97k66J49L64m85n2p5K60M9K90k03l95L65M5P0
3423A6n40L23l7K52p2l55K2L40j9o8j34J87K90j34L1j03J93J23r4k87J04L1L67
3446D36j69R8j54Q5K90l80J5j9J02m7q9J16o1J37K91n09jJ59k00M68m10L50j84
3469C24j07R9j02J46N5J4j83l10K17J66L4j03N3l75J50J0K78k12N3K4j33k22N
3492a19K19M2l7Q4l85m3K59J61k41j37J79j88K82k66K97q5l57J86J34K1J56o52
3514d90L11k45J36j12j9q6M48n8j55j35N4M2K86l96L50l76J72J18j67K81l3k96
3536c70K66l85K00J98l4Pm44L74J69o2r4J91Rk50R4J02j39J7m8k6J05kJ78J0J86
3561B52o42J92M88m01J55J3K08J32o90K62P6J9J14Qr4L2K75k36J61j49J86j34
$$ plain form
3401 -547 -319 -366 -242 -304 -604 -417 -297 -100 -366 -217 147 -338 -390 -465 -205 -156 134 -69 -464 -99 -54 16
3423 16 -524 -201 -238 14 -58 -413 -391 -51 -70 -138 -272 -85 205 71 102 -1 192 315 221 -66 38 69 436
3446 436 267 365 211 296 586 206 221 202 304 257 168 284 223 360 651 142 141 300 100 568 158 508 324
3469 324 217 316 214 360 415 429 246 -64 153 319 353 250 303 -72 78 88 366 154 207 231 98 -124 -119
3492 -119 100 142 105 189 -196 -239 20 181 -60 -197 -18 -206 76 -190 107 22 -335 -149 -15 6 162 -490
3514 -490 -179 -424 -288 -400 -419 -505 -57 -115 -270 -405 -351 -309 -23 -419 -69 -445 -273 -155 -322 -41 -74 -370
3536 -370 -104 -489 -289 -91 -125 -118 -562 -188 -19 -81 -175 16 25 -225 -131 -29 -168 -151 -199 -225 -120 -122 56 66 252
3561 252 -390 -198 290 -111 44 57 265 397 -293 -31 45 64 178 186 92 124 399 163 324 175 361 227
3583B27l6k1J36k33L61k39j58J89q0K34j78q2R1k1N9j49N5j40L21m6k03K00N7
3606C44j56J23j53k9L27q3l3j97J91k03J01j48r0K74m07K83j62KJ14k1m84L06
3628a01M4J70l28k3K57k23J23k6k12J43K43m6j91j48J7L07m8k48k54P2K96j43
3650c19k1R6J20l58K84k41R1Q2kn5l50M98k4K1l38K56j9K36r8m9k1l0n4Q5P1k17
3676c56K12K89m76J07K30m3j02j34J09J75k6o5j26J51RR8j78n7L20M7K0j95K61
3699B70k57K42j70j14j05J18J1K79r8KQ3pk46R8K15n7J22l46k6M8L10j38K21k70
3723A85J32L7n02J94p4L60L8j43l04L21Rm46M67j73P2J44l67j99K86R8J04j43
3745I6j0J63R2j88k44J64j87K41k93O5k0r5K72K20q8l45K74r9n11M32p4o2J52
$$ plain form
3583 227 191 170 306 73 434 195 37 226 146 380 202 120 211 190 249 100 155 15 336 290 87 287 344
3606 344 188 311 158 129 456 373 340 143 334 131 232 84 -6 268 -139 144 -18 -16 98 77 -407 -101
3628 -101 -57 113 -215 -238 19 -204 -81 -107 -319 -176 67 21 -170 -318 -301 6 -42 -290 -544 -472 -176 -319
3650 -319 -340 -244 -124 -482 -198 -439 -348 -266 -268 -323 -673 -175 -199 -178 -516 -260 -279 -43 -141 -190 -211 -241 -295 -210 -139 -356
3676 -356 -144 145 -331 -224 6 -37 -139 -273 -164 11 -15 -80 -206 -55 -46 52 -126 -183 137 184 204 9 270
3699 270 13 255 85 -29 -134 -16 -5 274 176 178 261 254 8 106 321 264 386 40 14 62 372 234 455 185
3723 185 317 354 -148 46 -28 332 370 227 -77 244 253 -193 274 101 173 317 -50 -249 37 135 239 96
3745 96 86 249 341 153 -91 73 -114 127 -166 -101 -121 -216 56 276 188 -157 117 18 -493 -61 -135 -197 -45
3768d5k40J42pj11J19N5J10j86J07K2j32j01J02K04l72K8L76k11j31j53M14l33
3790c43N7n9n5K16l06O40m77j6L96o6Q1m45K05NJ30j64J9J7j48K0N77j99p8R8
3814A05r1p0j31J32J65k21j12J72q5K41j18J28j26jK92k38J7P0R3k5M9m3k83J25
3838D5q2Rj7M88o8M3j81j92J29M9l06J77J33j40P8m5K35rP1J39l04m2J9J74k40
3863A63K59l56N91k76l95J46L48m88K78K7l1J73j51l15J28l09L15%k47J55l56
3884c41M06m08K69J50K87q7k21l67L59J11N5l50O1l36L45n3J49n45O25m3k60j27
3906c21Q2L2K8l8p1J89R9k59k29L65o6R5k87L64m69K58k3j23R3L78j90q2R4k30
3930c11L2K38J39q2j11m0j76K08l0J76l25J00J09R3l98J92K0M24l14k12M25l4
$$ plain form
3768 -45 -285 -143 -150 -261 -142 -87 23 -163 -56 -34 -166 -267 -165 39 -333 -305 71 -140 -271 -424 -10 -343
3790 -343 -286 -345 -400 -184 -490 150 -327 -343 53 -13 68 -377 -172 -167 -37 -201 -182 -165 -313 -293 284 85 7 105
3814 105 14 -56 -187 -55 110 -111 -223 -51 -136 105 -13 115 -11 -12 280 42 59 129 222 197 246 203 -80 45
3838 45 -37 -28 -45 443 375 418 237 45 174 223 -83 94 227 87 165 120 355 346 417 556 252 210 229 403 163
3863 163 422 66 657 381 -14 132 480 -8 270 297 266 439 288 -27 101 -208 107 107 -140 15 -341
3884 -341 65 -343 -74 76 363 276 55 -312 47 158 213 -137 -76 -412 -67 -120 29 -516 109 66 -194 -321
3906 -321 -239 -207 -179 -217 -288 -99 0 -259 -488 -123 -189 -94 -381 -17 -486 -228 -251 -374 -281 97 -93 -175 -81 -311
3930 -311 -279 -41 98 16 -95 -135 -311 -103 -133 43 -282 -182 -73 20 -378 -186 -166 258 -56 -268 157 123
3952A23k79r1R5o0N06l38K44q2k60M17O3j84J52k57J63Nj40n2K38j1q0O1Q0J00
3976D13k91J73m3N0j20Q5J33k40Q3j14j19K92J78l38l16M78o7k23J18Q2pj61L85
3999D31m53L42k46L96j97J86n02L2N57p76M67K8k96j06J35j7j4l0J15j11l18O23
4021B46j26l55k1O3K64J7q3j67j6L02l55j33L78j05J6J16j52k90J7K63k5l0l45
4044e21M36l00p0K26j52L74k19l12M95n1j23J10j24L2J8p0J80j97O2J18j23Q3
4066a28J51J73n9rk80J25K59l94K19j33j54M95q2l22rJ65Q5k36K22j41j1J77j44
4089c1J97k15J32q2K38o7k18O7MK34k72J02rJ54j42o9L00K46m41j52J24K95l25
4112G0M4l66M99O1R3n48M20j07o5M1j76J93j08L53k37J10k89L31l60Q8k1j01J72
$$ plain form
3952 123 -156 -247 -152 -212 294 -44 200 118 -142 275 338 154 306 49 212 217 77 25 263 252 172 233 313 413
3976 413 122 295 252 302 182 267 400 160 243 129 10 302 480 142 -174 304 237 14 132 214 207 46 431
3999 431 -22 320 74 470 273 459 -43 -11 546 -230 237 265 -31 -137 -2 -19 -33 -63 52 -59 -377 246
4021 246 120 -235 -256 -193 71 88 5 -162 -178 124 -231 -364 14 -91 -75 41 -111 -401 -384 -121 -146 -176 -521
4044 -521 -85 -385 -455 -229 -381 -7 -226 -538 -43 -94 -217 -107 -231 -199 -181 -251 -71 -268 -206 -88 -211 -128
4066 -128 23 196 137 128 -152 -27 232 -162 57 -76 -230 265 183 -139 -148 17 102 -134 88 -53 -64 113 -31
4089 -31 166 -49 83 1 239 172 -46 21 25 259 -13 89 80 234 92 23 323 569 128 -24 100 395 70
4112 70 114 -252 247 308 401 -147 273 166 101 142 -34 159 51 404 167 277 -12 319 -41 47 26 -75 97
4135I7M9j06PN7j0R4k61L07m34K8J20J28j77Nl3p0K48j40j8L3n0J29k87N9j29
4160c54p2K34K49k52L2K14m33K06K81k42jJ54j34j92J84k76J94Q5k43J6J67J3
4182a70k53L82j46l8NJ25j25j33K54J04j81m0J25L09l58M7L04k00K32m31r9M13
4204A26j23J53k22R8K5k31PM0K3J91Q1O1k89J07%J46j43L8J19k77K87M3K4j02
4228A82j59J96j36K47j37N4k12J08j17O1K18n08M96j88Q2K6R7j42J59n7j70Q6
4250A86k15J70J26m3m6J79l68K29o8l78K07L32l95K42j18P7N1l0k48L97J23m36
4272b6J6j05J73l5j60J56OJ12K98k66k80J56k42J33J59L0k35j38K05k75L68J3
4294F3j33m3K73j55k11O3K68m84K16j2L95n89K12l90O03l58J9J09jJ55Jl38K77
$$ plain form
4135 97 146 40 47 104 94 188 -73 234 -200 -172 -52 76 -101 -96 -129 -199 49 -91 -109 -76 -126 3 -284 -225 -354
4160 -354 -426 -192 57 -195 -163 51 -382 -176 105 -137 -138 16 -118 -310 -126 -402 -208 -123 -366 -350 -183 -170
4182 -170 -423 -41 -187 -225 -220 -95 -220 -353 -99 5 -176 -216 -91 218 -140 -93 211 11 243 -188 -287 126
4204 126 3 156 -66 32 57 -174 -167 -127 -104 87 168 229 -60 47 47 193 50 88 207 -70 217 260 284 182
4228 182 23 219 83 330 193 247 35 143 26 87 305 -203 293 105 187 213 310 168 327 270 100 186
4250 186 -29 141 267 224 178 357 -11 218 150 -228 -21 311 -84 158 40 117 168 138 -110 287 410 -26
4272 -26 -10 -115 58 23 -137 19 25 137 435 169 -111 45 -197 -64 95 125 -110 -248 -43 -318 50 63
4294 63 -70 -113 160 5 -206 -143 125 -359 -143 -155 240 -349 -137 -527 76 -282 -263 -154 -155 0 1 -337 -60
4317f0j06J41j37K33j03R0rj13J82R7o78N17j0nk17K24j30P4K03j10j29p2J12
4340fj06L24P2k89j23L58Q3k73k18K97j83J08n3K41j22J18k03j8M16l26J41J03
4362C41k87K23j47p8L74j78K83m98OJ01j57L79j18k7k7j16J42k07M05m61K35K8
4384B16j31J33k51O4j1L07j09O9j38J9r2j42L91o07O9L15m3PJ92k66k50N4J18
4407h6m1J79m1j34jL92m22M4J25L9j25k6j09%M72k83o4K9K71j23r4j79O5r6k3
4432b31J77l6P7k06K15p5N6k77L55Q1r9r7N0k0k10K93j52K7j19R9j18q0J48J69
4456B7j56J79pj32J29l03J84q3M02j36l03K25J16o8k33J63J94l33K40K55j42l38
4478a20J14J92q4k74J69K74J4j67j09j05L52j10J37k68P8M2k95k7M88m56L99l40
$$ plain form
4317 -60 -166 -25 -162 71 -32 58 49 -64 118 215 -463 54 44 39 -178 46 -84 -10 193 83 -46 -118 -6
4340 -6 -112 212 284 -5 -128 230 313 40 -178 119 -64 44 -9 232 110 228 25 7 423 97 238 341
4362 341 54 277 130 52 426 248 531 33 39 140 -17 362 244 217 190 74 216 9 414 -47 188 216
4384 216 85 218 -33 31 20 327 218 287 149 168 76 -66 325 -282 -213 102 59 66 258 -8 -258 -204 -86
4407 -86 -127 52 11 -123 -124 268 -154 -110 15 54 -71 -97 -206 -206 266 -17 -81 -52 219 96 2 -177 -112 -208 -231
4432 -231 -54 -90 -13 -219 -4 -79 -23 -300 55 136 37 -60 -10 -30 -240 53 -99 -72 -191 -92 -210 -290 -142 27
4456 27 -129 50 43 -89 40 -263 -79 -162 240 104 -199 26 142 74 -159 4 198 -135 105 360 218 -120
4478 -120 -6 186 102 -172 -3 271 285 118 9 -96 256 146 283 15 93 135 -160 -187 301 -155 244 -96
4500i6J28rK83J29m57M08l53j23K87J73m14J06K05j22j55K62j04nLj32k0J81j82
4523gj85N64n28J40J46q0j0K28l96J16j26J07L82m18J69r0l76J94J64j10Mk39
4545c51K49K84m84J81M5rL3l4J94j06r4L1j5k64L05N9k60j3J88r5r9j20j01O47
4569A71N2l93K6J23o2j05J33k46M35o4m7r1j92K48j92J58j97n9M2K85n9M2j18
4592a10%L25j83l06P9K05mk03k4N0N85k88k12K50L4j73J15j64j33K44m6j48J24
4615A7p6n3j6P4J75K60l77J75j91K97m4k3mr7L15m03o4K63j59K08L8p7k3m25M22
4640B12n21K64j3L93j33j13J14Q4l7p1j23l25K31J89l10JJ87J16j91O0J2r3l1
4663i8j20J97Q6O1j36J61j42j56j09M65m64J70j06Q7m6L5R2j30J67k08L6j46J56
$$ plain form
4500 -96 32 23 306 435 -22 386 33 -90 197 370 -44 62 267 145 -10 252 148 143 146 14 -6 175 -7
4523 -7 -192 372 -156 -16 130 50 40 268 -128 -12 -138 -31 351 -67 102 12 -364 -170 -6 -116 -112 -351
4545 -351 -102 182 -302 -121 -76 -85 -52 -86 108 2 -92 -61 -76 -340 -35 24 -236 -249 -61 -156 -255 -375 -476 171
4569 171 223 -170 -144 -21 -83 -188 -55 -301 134 70 23 -68 -260 -12 -204 -46 -243 -302 -260 25 -34 8 -110
4592 -110 -110 215 32 -274 -195 10 6 -197 -221 -171 414 126 -86 164 198 25 140 -24 -157 87 41 -107 17
4615 17 -59 -112 -128 -54 121 381 4 179 -12 285 241 218 214 117 432 29 -35 228 69 277 315 238 215 -210 212
4640 212 -309 -45 -58 335 202 89 203 287 250 179 56 -269 -38 151 -159 -158 29 145 -46 14 26 -67 -98
4663 -98 -218 -21 65 126 -10 151 9 -147 -256 209 -255 -85 -191 -104 -150 -115 -23 -153 14 -194 -158 -304 -148
4686a48J91k55J55j02j28J9o1J46K36n5k25nJ81J00j46L17l85P4J4J15L3k30j61
4709c20L42O5k24J69Q1kJ67m36K92R5k49K4K19l02J61O4J93l72J47K7M3k47l40
4732d03M36N8R3k44r0M3L31%j08J70k51K63j34k52rK03J68j80J86l58L49p4j77
4755B0j20j30K72K41k49O4K37j05j40n7q3L03kk01K33l70P1p0M22n0k15J4n1j00
4779f6J02k43K2R6J59Q5j33J58k28Kk8K3r2K42R6j96J00j59Jq6K97j25j1j60J84
4804D0j20K40n37L94j28K0j26k6J97k14L48j84K64k08j64J46n7J77l35N29n26
4825b70M1N9j83L19j28J73j37L15l62j13N4J01l0j26J37LJ55j33J35J12k75J17
4847c6l0J85j67kJ66o1j01N5M6j42J36J58n2R0k39qlk04J44J35k71K53J1j64l4
$$ plain form
4686 -148 43 -212 -57 -159 -287 -268 -329 -183 53 -2 -227 -232 -51 49 -97 220 -165 -91 -77 38 71 -159 -320
4709 -320 22 87 -137 32 113 111 278 -158 134 229 -20 4 223 -79 82 146 339 -33 114 141 184 -63 -403
4732 -403 33 91 184 -60 -150 -107 224 224 116 286 35 298 164 -88 -97 106 274 94 280 -78 271 197 20
4755 20 -100 -230 42 283 34 98 335 230 90 33 -50 253 251 50 283 -87 -16 -86 336 286 71 85 34 -66
4779 -66 36 -207 -185 -89 70 155 22 180 -48 -46 -74 -51 -143 99 195 -1 99 -60 -59 -145 152 27 16 -144 40
4804 40 -80 160 -377 17 -111 -91 -217 -243 -46 -260 88 -96 168 -40 -204 -58 -115 62 -273 256 -270
4825 -270 -229 -170 -353 -34 -162 11 -126 189 -173 -286 -232 -131 -161 -287 -150 -147 8 -125 10 122 -153 -36
4847 -36 -66 119 -48 -50 116 55 -46 9 55 -87 49 207 155 245 6 -2 -5 -209 -65 70 -201 52 63 -101 -135
4872a35J50Q3J55j94J22j30l6L7j77K28q1j64M17k94j23N4K89p1k03Q5nl69N16
4895A54l57J90L0J85k59K2K49L2l9m0l63L50k67K85l11o7K86k6J8k80P8j0M05
4918B65l31qo7O5k18J37J37J01m5k08Q6P7j92J37q8K17l8J52l36K20j21L1J33
4941A06j31J4j22J29ln6J65j82q8L4J32j82j20K99j00l7J61k10N7M7O6k04J50
4964g5M7k43J12J38J9m5K11j90J84j47o5J34k05M5K02l55Q1k2L2j14M83k06M3
4987F4K7o0Jr6Q5m4J72p6q8J9j61K07k52%K58J47p4J60l7j66m54P92o49J76L00
5012B51Jq6q4j28j52M30j38n7j62O8j6K25K2J16l39J57o0K43o09O47j50m9J1n1
5036I0k0l27K55j57K50p2O13n52k41o8K83j38J25K00KP7m18n2L59j36Mq0k14P9
$$ plain form
4872 -135 15 98 253 59 181 51 15 52 -125 103 22 -142 275 -19 -142 -88 201 130 -73 12 7 -362 154
4895 154 -203 -13 17 202 -57 -35 214 246 207 167 -196 154 -113 172 -139 -206 80 54 72 -208 -130 -140 265
4918 265 -66 -74 -141 -76 -294 -157 -20 81 36 -172 -86 -9 -201 -64 -152 65 27 179 -157 63 -58 -27 106
4941 106 -25 -11 -133 -4 -7 -63 102 -80 -168 -134 -2 -184 -304 -5 -105 -142 19 -191 -134 -87 -21 -225 -75
4964 -75 -28 -271 -159 -21 -2 -47 164 -26 158 11 -54 80 -125 -80 122 -233 -152 -174 -142 -256 227 21 64
4987 64 91 31 32 -64 21 -23 149 73 -15 4 -157 50 -202 -202 56 203 129 289 252 86 -368 424 -225 -49 251
5012 251 252 166 82 -46 -198 232 94 37 -125 -57 -73 152 174 290 -49 108 48 291 -318 329 179 130 141 90
5036 90 70 -257 -2 -159 91 19 632 80 -161 -229 54 -84 41 241 243 320 -98 -150 209 73 77 -3 -217 -138
5060a38J75p6q3M8j43J97J53L0n1l36Oj09K21L35m75j46N06m02L16J14j37P5J74
5083B54Q5n79K53j05O6j32M2J41k08J19q3j24K45J12L19m46k12N4K06J02j42j14
5105a47p3L01K98l83rM2j3J02L6Lj85N8j94J84l11K89j45L50l4p6J10O6J6l23
5129c8J88L0J5l62K92k7j15L15j95k00J04j81J65LL4j15RM10l23M27l32Om7j12
5153d9O0no8n1J09j59J22K87J4k03kJ2j15J31M3j58j20n2j47K53L9J73R9k03O6
5178G6l07K42j87J94j74J43Rl3J44j56J07j90o4J38J94l13L98m79J37o8M79j86
5200A04n1k22j5J50k4l1j42j0L78j13k82K40j22J77l97J64K12j44l7k46M13q1
5222g9J98J33k18m49M76nk09K90l35K68j20J25P4j87J35j35j15K01J87l43K80
$$ plain form
5060 -138 37 -39 -122 -74 -217 -20 133 163 112 -224 -218 -327 -106 229 -246 -392 114 -288 28 142 5 80 254
5083 254 339 -240 13 -92 -26 -158 -116 25 -183 -64 -147 -271 -26 86 405 -41 -253 -199 7 109 -33 -147
5105 -147 -220 81 379 -4 -13 29 16 118 154 157 -28 30 -164 20 -291 -2 -147 203 169 93 203 269 285 -38
5129 -38 150 180 195 -167 125 98 -17 298 103 -97 7 -174 -9 -6 28 -87 -78 332 9 436 104 110 63 -49
5153 -49 11 6 -62 -113 -4 -163 -41 246 260 57 55 67 -48 83 126 -32 -152 -204 -351 -98 -59 114 213 10 76
5178 76 -231 11 -176 18 -156 -13 -4 -37 107 -49 58 -132 -196 -58 136 -177 221 -258 -121 -189 290 104
5200 104 53 -169 -184 -34 -58 -89 -231 -241 137 24 -258 -18 -140 37 -360 -196 16 -128 -165 -411 2 -79
5222 -79 119 252 34 -415 61 56 -153 137 -198 70 -50 75 149 -38 97 -38 -153 48 235 -108 172
5243A72J83m06J62j87Q4M4K9q0L2R7l61J22m6M56j01j88J70n5o6k6J2l70M77J86
5267C40j50l98j52J08L26r7L5L6k29K43oP0r7J7K17m39J95J6J29p9l96L41j9J63
5291A74k24M6K8j19N2P0k71K30j71K66ml43O02m98K09L5r7p2QM07l41L2J75j8
5315A76k46p3l3J34o2K29jj86J61k8K4m12j25K89L22k47J91j48o2O9r8o5l6J01
5339a26K8L25l69jO9N8K12k85n9J7J85j20k24M17N0j98L2J65L3n46L42l0PO8m7
5364CM62m84J1j57K69R2M5l44K03J6k12r2K24K39j91J00k22J44K3L5l57M76j98
5387H5ON9k36M3m8j75K95J4J89k76J0L99m79J73L00l43j34M39k67k00K46j52J63
5410A11j73k79L12K3J55q2j31K06k10L44q3k36j37N20l99J26K78n85J57K42j55
$$ plain form
5243 172 355 -51 111 -76 8 52 81 1 33 130 -231 -109 -155 301 200 12 182 127 61 35 47 -323 154 340
5267 340 190 -208 -360 -252 74 -23 12 48 -181 62 56 126 29 46 263 -176 19 35 164 85 -311 30 11 174
5291 174 -50 -4 24 -95 -43 27 -244 -14 -185 81 77 -266 336 -162 47 82 -15 -87 -79 328 -13 19 194 176
5315 176 -70 -143 -176 -42 -104 125 124 -62 99 71 95 -317 -442 -153 169 -78 113 -35 -97 -28 -126 -191 -227 -126
5339 -126 -98 227 -142 -143 -74 -16 196 -89 -148 -131 54 -66 -290 127 177 -21 11 176 209 -337 5 -25 -18 50 3
5364 3 465 -19 -8 -165 104 196 241 -103 100 116 -96 -188 36 275 84 184 -38 106 129 164 -193 283 85
5387 85 91 150 -86 -43 -91 -266 29 43 232 -44 -34 365 -114 59 359 16 -118 321 54 -146 100 -52 111
5410 111 -62 -341 -29 -6 149 67 -64 142 -68 276 193 -43 -180 340 -59 67 345 -240 -83 159 4
5431DJ61N6j46k91K32lJ34l0j75j65K3N7l4M4k36O48j20%k90J07j94j13K75J19
5455F3N9l14K69N7k58nL97n11K77J98k63L5m00L51j81L32r1j32j50j10M15j78
5477a40R2j4j17J23j27KO3j94K82j28N58n48L46o8k63M25Kl81J08J42n0j67M29
5500C75k94j70L10j80k75M12o1l37K47K79k32r3J24Q5q2J21m23M28r4k53K01K24
5522C12j93O9k76L34o5l78P8L01l44K88o9J94k89q3J88O3j64O5m8q4J72j44K07
5545A34j67J21J0j30K14o6j40j62N20l27m3L6M7J75k72J60k37j06K44Q9M5k44
5567i9j40J31n9K9j45L01q4J07j38P6k50K03J08J9K50q0m1m77M00l28L22m57M34
5590H2j0r5M4N7k70J15R5j16O7l06J16J61p4M07j74o0M8k1j47j7J66O6n4n10L27
$$ plain form
5431 4 165 221 75 -216 16 13 147 117 -58 -223 -200 -143 -177 -133 -369 279 159 159 -131 -24 -218 -331 -56 63
5455 63 122 -192 77 134 -124 -129 268 -243 34 232 -31 4 -396 -45 -226 106 15 -117 -267 -377 38 -140
5477 -140 -48 -62 -179 -56 -183 -181 -118 -312 -30 -158 400 -148 198 130 -133 292 294 -87 21 163 113 -54 375
5500 375 81 -89 221 41 -234 178 117 -220 27 306 74 -19 105 190 108 229 -194 234 140 -113 88 312
5522 312 119 188 -88 246 181 -197 -119 182 -162 126 57 251 -38 -121 67 130 -34 31 -17 -101 71 -73 134
5545 134 -33 88 98 -32 182 116 -24 -186 334 7 -36 0 47 222 -50 110 -127 -233 11 100 145 -99
5567 -99 -239 -108 -167 -138 -283 18 -66 41 -97 -21 -271 -68 40 59 309 229 188 -289 111 -217 105 -352 82
5590 82 72 -23 21 78 -192 -77 18 -98 -31 -337 -221 -60 -134 273 99 39 87 66 -81 -98 68 134 80 -430 -103
5615a03J26k33K35j78J01Lp5J1J29J76k07pP7j82R5kr6K50k49L57l13J99l6p3
5639EK81m21O6OJ15or1j42K1pJ59N9J82k3m6j60O1K57j50l02M62l86pJ31Pk5j30
5666h4K51k66J52j20J95j11LJ66j29l39M46q7k20K35k17J41M2J30j37j60K5J40
5688E6k5O3j79O7M7nj8l1j47L23m5k73J3L86q0p4k39K86k02j35N20n20P9K15j33
5713e1J48j70L4r1J04J19j3j76j6j53K47P7l5J10l71L97k30L3p0k2P9K83j36j7
5737H0m17J23K21l8L71j02k16L25m24j85m1K89J10k36R6J12j36J22o7J26k9J12
5759A96j70K80j55qk42K58q8L6l5J72k27p3J74mj37lo3K61N8k10J98l06J47k51
5783a92K68q3J13p6L7j50m3M2k5J96q9L1Rn6j8J19j51J8K10k03m0K66k80J39L55
$$ plain form
5615 -103 23 -210 25 -153 -52 -49 -124 -113 16 192 -15 -22 55 -127 -32 -34 -130 120 -129 228 -85 114 78 5
5639 5 286 -135 -69 -63 52 46 -45 -187 -166 -173 -14 45 227 204 158 -2 59 316 166 -136 326 -60 -67 64 71 46 -84
5666 -84 167 -99 53 -67 128 17 20 186 57 -282 164 77 -143 92 -125 16 58 188 51 -109 -84 56
5688 56 31 94 -85 -18 29 24 6 -25 -172 151 106 -167 -154 232 152 78 -161 125 -77 -212 308 -212 -133 82 -51
5713 -51 97 -73 -39 -130 -26 93 80 -96 -112 -265 -18 59 24 134 -237 160 -70 -37 -107 -129 -50 233 97 80
5737 80 -337 -214 7 -31 340 238 22 347 -77 -262 -303 -14 96 -140 -44 68 -68 54 -13 113 84 196
5759 196 26 306 151 143 -99 159 71 107 72 244 17 -56 118 114 -23 -26 -89 172 230 20 218 -88 59 -192
5783 -192 76 -7 106 30 67 -83 -126 -84 -109 87 -2 29 38 -18 -36 83 -68 -50 160 -43 -83 183 -97 42 397
5808C97j85k57J9K35k30q7Q0Pj47N1k67M27j88J40j49P1K30J49k55j79J59J79
5830B00j83J63pk89j50K70P7j63J03l9O2n2o7K53j00j79L35l64J62j16J40k74
5852b18R9K29l83M09l67R1K30p3o6L46l47Kj11J38k65L93p9k21K92k75K39m25
5874c62J63L6M24n27L14j4Lj39L37k63K17J64n88K63J02k1n2Oj35J86j37K0J57
5897A54o2j18k23L85l35O1O2J22J14J28k69J54Kq5K67k36j54rJ52j22M6n8p0J77
5921H3J65k89J67oj19O4J08k36Q2J4J64j40k04J87j09r9K57k03J07j21K20j9j58
5944h5R8%Q8k23J03k3nJ27j08L5j55K11j48j14M57m80M49m95j31L08J46j80J88
5967F3L9J81l26RP3l8kj77J65j23P1j97J45J78L4n2p7J48j79J26Q8j72J93n8j08
$$ plain form
5808 397 212 -45 -26 209 -21 -108 -28 -21 -168 -117 -384 43 -145 -5 -154 -83 147 296 41 -138 21 200
5830 200 17 180 173 -116 -266 4 81 -82 21 -18 44 -8 -75 178 78 -101 234 -130 32 -84 56 -218
5852 -218 -119 110 -273 136 -231 -140 90 17 -49 297 -50 -48 -159 -21 -286 107 28 -193 99 -176 63 -362
5874 -362 -199 -163 261 -266 48 34 37 -102 235 -28 189 353 -235 28 130 109 57 63 -72 114 -23 -3 154
5897 154 92 -26 -249 136 -199 -138 -76 46 160 288 19 173 175 90 357 121 -33 -42 110 -12 34 -24 -94 83
5921 83 248 -41 126 120 1 65 173 -63 19 33 197 57 -147 40 -69 -168 89 -114 -7 -128 92 73 -85
5944 -85 13 13 101 -122 -19 -42 -47 80 -28 7 -148 63 -85 -199 258 -222 227 -268 -399 -91 55 -125 63
5967 63 102 283 -43 -34 39 1 -1 -178 -13 -136 -65 -262 -117 61 95 43 -34 114 -65 61 149 -23 170 112 4
5992Dj13l3J26J02o5p6Q7j31N3J75k86m3K33j63J00j0J10j09l85O17j26j16O6
6015A7j19L6j08K92K06o72N22j53Q2j95J50P8l78L09j08j50K06n5J02l8k8o6l1
6038a01l4K77Ol06K49j2R1oJ5j18O5p8K99k38j98P2j4k05M15m79L16k20K52r3
6062d5K36m19K83K29J26l92M9q4q4J00MP4j05R9j22Ml0K02l9K2mk07J02Pj09J15
6088A2n9L7n7Om1k90O17l71L17j91J5J09k39K45m6k13L05J21l86j37k9O1O8K86
6112A40r5J5m61J36L43j21J73j48O2k70K92J34j21mj62K74j76o1j86Q1K87j2m0
6135H0k16K64k84N4O0J7K68k10j40P3j78L31k46k7k3N9L01k54J47K6k74QK05J24
6159A65j26l4R1M8rq5k41P1R6k48Q0K55j29J40k29M96m62K66R8p3j80j67K51j70
$$ plain form
5992 4 -109 -142 -16 86 21 -55 32 -99 -46 129 -157 -200 33 -130 -30 -40 70 -39 -424 193 67 -49 17
6015 17 -102 -66 -174 118 324 -348 174 21 103 -92 58 136 -242 67 -41 -191 15 -40 62 24 -4 -70 -101
6038 -101 -135 142 148 -158 91 79 170 164 179 61 126 48 347 109 -89 -17 -31 -236 179 -300 16 -204 48 -45
6062 -45 191 -228 55 284 410 18 67 -17 -101 -1 3 77 -28 71 -51 -47 -77 125 86 108 104 -103 -1 6 -103 12
6088 12 -47 -10 -67 -61 -102 -392 225 -146 171 -20 -5 104 -135 110 64 -149 156 277 -109 -246 -275 -214 -146 140
6112 140 45 60 -401 -265 78 -43 130 -18 44 -226 66 200 79 75 -87 187 11 -50 -236 -155 132 120 80
6135 80 -136 128 -156 -102 -42 -25 243 33 -107 -34 -212 119 -127 -154 -177 -118 183 -71 76 102 -172 -164 41 165
6159 165 39 5 96 144 135 50 -191 -120 -24 -272 -192 63 -66 74 -155 341 -121 145 243 170 -10 -177 74 -96
6183i6Q6p2P1LM17m35j43K85k24o7J30L42k18m9j54K44j42k68K59l89O22o4k86
6206a48J96L6n3k69K97J41j82k02L00o5Q1k63L08l13K09j54O7k87M15j98R1J76
6228A83o4R1k37k3j58O9Q6K2p8K72k04K23l54J04m2J62k01J63K63l49J24m8j10
6251a06K45k95L59m14J73p1J74j04j35R6m6j33L04k34K76j20LJ59l77L4N1J63
6273Bk61M92k79q6J16J12l83J35K08p3J3Q0j14J72Q9j04O4l90K65j34J84k52M99
6296C55l70Qr2P8M0J82k09M4kK53l9m7j23kk7o4K07j90Pj55Q7J08Pk6j66J58j32
6323a10K31k0n3m3k7R5k51J98p9L44l68J01K2k2j49P9n3J64j71m3J42j43q9Q1
6347a64L52m60J32J50J74k73l8J28j57L69l54J32J84m15O85k72m36L56k53J09
$$ plain form
6183 -96 -10 -82 -11 -8 409 -26 -169 116 -108 -175 -45 297 79 30 -124 120 -22 -290 -31 -420 202 138 -148
6206 -148 48 84 31 -238 59 200 18 -184 116 51 132 -131 177 -136 73 -81 -14 -301 114 -84 7 183
6228 183 119 210 -27 -50 -208 -139 -53 -31 -109 163 -41 182 -172 -68 -110 52 -149 14 277 -72 52 4 -106
6251 -106 139 -156 203 -211 -38 -109 65 -39 -174 -78 -124 -257 47 -187 89 -31 -28 131 -246 -212 -161 2
6273 2 -259 233 -46 -132 -16 96 -287 -152 56 -17 -4 76 -38 134 223 119 183 -207 58 -76 108 -144 355
6296 355 -15 -7 -99 -21 19 201 -8 36 34 287 248 201 78 76 49 -15 192 2 9 -146 -59 49 56 30 -136 22 -110
6323 -110 121 101 48 5 -22 73 -178 20 -59 285 -83 18 40 18 -131 -52 -105 59 -112 -155 -13 -156 -245 -164
6347 -164 188 -272 -140 10 184 -89 -127 1 -156 213 -141 -9 175 -240 445 173 -263 93 -160 -51
6367e1l0P3L79m82O8L4j43o4M9J36M5j6J00j36K33k65rL6J9J34p1O3m2l3lj5J34
6394A43qj58J54j17O8N6mj09j54P3M6rj04R4J06K18l81N8N1J63j4J41j80j3p5
6419D5l41M35j38N4n9k00J89Q8J27k25Q6j4j14J12K24k22K66k09q7L6L5n2N7l77
6443b84J62J59P4K1n6j75l8P8K19j88K16k6n6M0l31J48M1K0j74J97k23L87o8o8
6467G5J0j71M4K46j3r2j36l6R7J13l39K94k64K66k7p6R6k2K52n42P4J27K15k8
6491A63k24L4R9l00J84l8J65k53qL45k3k40L09j51o3j5l4K26p6j13J0l12J80K67
6515A32p9l9J1j2K04k29r1j25N20q2k38k95N25j96k11J48O4j27K58k00o8M16n91
6538c05L86L0M0q2oP2k05j25L04j02O9J65r4j98j27n4K50L5R5J6k73J17K38o25
$$ plain form
6367 -51 -81 -8 371 -111 -43 -9 -152 -216 -167 -31 14 -2 98 -38 195 -70 -79 -43 -24 110 39 102 60 27 24 9 143
6394 143 135 -23 131 14 82 138 134 25 -129 -56 -10 -19 -123 -29 77 295 -86 -28 23 186 172 313 133 120 45
6419 45 -296 139 1 55 -4 -204 -15 73 200 -25 61 47 -67 45 269 47 313 104 17 53 88 36 93 -284
6443 -284 -122 37 111 132 76 -99 -137 -59 160 -28 188 162 106 146 -185 -37 4 24 -150 47 -176 211 143 75
6467 75 85 -86 -42 204 191 99 -37 -73 24 137 -202 92 -172 94 67 -9 87 65 317 -225 -151 -24 191 163
6491 163 -61 -27 72 -228 -44 -82 83 -170 -178 167 144 -96 213 62 -1 -16 -50 176 100 -13 -3 -315 -135 132
6515 132 53 14 25 13 217 -12 -103 -228 292 210 -28 -323 202 6 -205 -57 7 -120 138 -62 -130 286 -305
6538 -305 81 111 151 69 63 135 -70 -195 109 7 76 241 147 -51 -178 -232 18 53 148 164 -109 8 246 -379
6562c79K99J05J57j81K10k51O2j86L49m40J59K86k70L4J05k8Jj10P5L6K1k22k6
6585a94J8j6J83n4pj02K7J23K43r7k79j28L02k30L65k82J80M4j26Q2l85L49j99
6608a83j28Q1M10o7j84l24M45L0j77J77m59N82j74l29L67m1M8m6L0o6k69K49j64
6631a92L94j33k26J75j66M39l27R9j33j80K80j11j2K10P9j65k5K11j45j11j40
6652a79J03P9j09L2j48K88j34J30m4Q1k33L7R5j23J07K3J8R1l08K92M7l56K86
6675G5k23m4L00k26L5j23N07l99L26k91J64O9k21J9j43K26j08m19M39j99K60q3
6697e9P1j72K03k7Ql85M33k16n9l5L23k15p2J90J31j53P1J16j46M4J28k71L8N3
6721am6J98j5l43q5L70r1j83J01J22l70J19K96j96L95j42n5n0j62J24K07o4l11
$$ plain form
6562 -379 -80 25 182 1 211 -40 22 -164 185 -255 -96 190 -80 -46 59 31 32 -78 -3 33 54 -168 -194
6585 -194 -176 -192 -9 -63 -70 -172 -145 -22 221 124 -155 -283 19 -211 154 -128 52 96 -30 52 -333 16 -183
6608 -183 -311 -230 180 113 -71 -395 50 80 -97 80 -379 203 29 -300 67 26 74 28 58 -8 -277 -28 -192
6631 -192 202 69 -157 18 -148 291 -36 63 -70 -250 30 -81 -93 117 196 31 6 217 72 -39 -179
6652 -179 -76 3 -106 -74 -222 66 -68 62 18 99 -134 -97 -2 -125 -18 5 23 114 -194 98 145 -211 75
6675 75 -148 -192 108 -118 -83 -206 301 -98 228 -63 101 170 -51 -32 -175 51 -57 -476 -37 -236 24 -59
6697 -59 12 -160 43 16 24 -361 72 -144 -203 -238 85 -130 -202 -12 119 -34 37 153 7 51 179 -92 -54 -1
6721 -1 -47 151 136 -207 -292 78 -13 -196 -95 27 -343 -224 72 -124 271 129 74 24 -138 -14 193 129 -182
6744a82J44j16L68J51k3n46m2L83j44P9n2k14M47j89k10J16n4OP1K80l35j0N1
6767b1r7J08J2K26j69o4j21r1M36j36k04O0n7J73N7ok94K18J91l62J12K00j76
6790ek36M87k88j25J37Q1Q9r6N7M9n6r0J59k39J89l7p5J43j58r0J66QM4J8k85
6815a53n1J20K67k07k0m3Q6N9N1J09k55P6r6Q2j69L61k46L19k61J24K9k43N8J00
6839I7k34J40K0k83J96m7K82n2O4j99j91lK9O6mJ36jk90M44l05p4J64j18J37M5
6864A9J04k65J13k48L1J37J93m2Q9j99k26K60o8R7j89qK04j7K23k62M0k02P3L09
6888A66m25K70J01l40K79n2r8k53K00J37K42l48J05j61J59J8p4J53j34J04m6J72
6910A75k51K02q5k79L27pr7o2k5J05q9K20k33j8N0k4J10K5m17M15K23l95L48m65
$$ plain form
6744 -182 -38 -154 214 365 342 -204 -246 137 -7 72 20 -194 253 64 -146 -30 -84 -78 -7 273 -62 -72 -21
6767 -21 -118 -10 2 228 59 -5 -126 -217 219 83 -121 -61 -118 55 112 106 -188 30 221 -141 -29 171 -5
6790 -5 -241 246 -42 -167 -30 51 140 44 101 150 94 4 163 -76 113 76 1 144 -14 -104 62 70 114 132 -153
6815 -153 -204 -84 183 -24 -44 -87 -1 58 109 218 -37 39 -57 25 -144 217 -29 290 29 153 182 -61 -3 97
6839 97 -137 3 23 -260 -64 -111 171 119 183 -16 -207 -210 -181 -115 -119 17 16 -274 170 -135 -209 -45 -163 -26 19
6864 19 123 -142 -29 -277 -246 -109 84 42 131 -68 -294 -34 -102 -5 -194 -202 2 -15 208 -54 -14 -216 -143 166
6888 166 -259 11 112 -228 51 -1 -99 -352 -152 -15 227 -121 -16 -177 -18 0 -74 79 -55 49 3 175
6910 175 -76 126 41 -238 89 82 -15 -77 -102 3 -86 134 -99 -117 -67 -91 19 44 -373 42 265 -130 218 -247
6934b47j81M67L9K13l97n7J44K32l83M23m42K81l14M33p1l11k5L44O5m69K60%
6956Dj43j47L06k46K43K29J74m79q1J71J69o4j50p6J96J7k89J5J80l9Ql8P7M9
6980H6K36m77l6K97j36j98L00n8J67k30Jj7L2J1r3K20J8k41J55j03J15j60K43
7003A32L8M7k52k6P7J17j7k23K05j15J54n90P54j69j42M0rJ81j81j6Nk4K37k52
7027b9kL9J9j30R8J60j30r2k9K24k01J54k34J09k14K76n5K54k17J67m2L9lk41
7051h0M8k3R5j43J0j46K31j3L00k60OP7K1j48L1m4J46j48N9j15l6J82o6M42m00
7076B6J10l55K74j81M00l74J48M7k68N8L52l18N6M0M20m97j15L23k01m6j0J41
7098C0j04R5j57k9J64M2q1j73J64j71J04J65j79j34J42J21j90Q6k5K12l89J65
$$ plain form
6934 -247 -428 39 78 291 -106 -163 -19 213 -170 253 -189 92 -222 211 140 -171 -196 148 213 -256 4 4
6956 4 -139 -286 20 -226 17 246 420 -59 -140 31 200 136 -14 -90 106 123 -166 -151 29 -10 -2 -40 37 86
6980 86 322 -155 -191 106 -30 -228 72 14 181 -49 -48 -65 -33 -22 -115 105 123 -118 37 -66 49 -111 132
7003 132 170 217 -35 -61 16 133 116 -107 98 -17 137 -453 301 132 -10 30 21 202 21 5 10 -14 223 -29
7027 -29 -31 8 27 -103 -5 155 25 -67 -96 128 -73 81 -153 -44 -258 18 -37 217 0 167 125 164 161 -80
7051 -80 -32 -55 40 -103 -93 -239 -8 -21 279 19 25 102 123 -25 6 -38 108 -40 19 -96 -132 50 -16 426 26
7076 26 136 -219 55 -126 274 -100 48 95 -173 -115 237 -81 -25 15 435 -62 -177 146 -55 -101 -111 30
7098 30 -74 21 -136 -165 -1 41 -40 -213 -49 -220 -116 49 -130 -264 -122 -1 -191 -105 -130 82 -307 -142
7120a42j0L92j13j80R6J7p7L73j73m1k48K58j14Q5K02n82M83k12j46R8Oj17K99
7143A54m2j55K15j63J60l06K96p7O2j20j40L14j67K40l05J12o7k49J21j03L57
7164A37k65J40q1j15M19k24M7o7n2P5K00j6o1L7j47N9J80l59K14n3k8k34K16J21
7188A43R2l05K66j89O5j67K1p0Q0O2J26m0k30K40J78Jl12Q7m82K65K36m50L14
7211f9M3R1J58j01j85O8N0L27m56l42N50J2l25K42j99J85J2J8J2rq5r8Q6l94K42
7236a67J0J24K1j31K54k9j30N2j67L65j13j02n8J37k35L9J33P8j17n3j87J32M61
7259C17m66Q6Q4J63m45k9J62K77k67N4O6L3K0k7N1P6l1R9j32J41k59K9J22j70
7283d6K51j10J51l74R3M1K97j62k02P8K4R1k30J48l45K7L42J0m73M09N9J5p3N
$$ plain form
7120 -142 -152 240 127 -53 43 60 -17 356 183 142 -106 152 38 123 325 -257 226 14 -132 -34 -28 -145 154
7143 154 112 -43 172 9 169 -137 159 82 144 24 -116 198 31 271 -34 78 11 -238 -117 -220 137
7164 137 -128 12 -69 -184 235 11 58 -9 -61 14 214 198 137 174 27 86 266 -93 121 68 40 -194 22 143
7188 143 235 -70 196 7 72 -95 -74 -144 -64 -2 124 84 -146 94 272 273 -39 48 -434 -169 67 -383 -69
7211 -69 -26 65 223 122 -63 5 55 382 -74 -416 134 146 -179 63 -136 49 61 79 91 82 -3 -101 -15 -409 -167
7236 -167 -157 -33 -12 -143 111 82 -48 4 -163 202 89 -13 -71 66 -169 -130 3 81 -36 -89 -276 -144 317
7259 317 -149 -63 21 184 -261 -290 -128 149 -118 -64 2 35 55 28 79 155 124 223 91 232 -27 2 124 -46
7283 -46 205 95 246 -128 -35 6 303 141 -61 17 41 132 -98 50 -295 -268 74 84 -389 20 79 94 21 26
7307B6K42j97K42k15N5j23j45J15qq2R6J58k01R4o3j39J44J06J28q1j87M2M6O9
7331A22j67q0K8j39L77J83l62r9r1K67O4m12M89k85J68r8J62k74R4L71l15L20
7353C23m84M77n72K64M2J20l01K29O2k31R6k03K61J88m98J27J30l73L78l0m91
7374d86M17L4k4K64j63J09j8j11n7L78k36k84K39p2J03pJ55j80Q8J0k35J43l34
7397b67L87j65K99l45J05J15k0l23K05J98j48J77m43P5J54QN7J56m17J92m2j38
7419a80R2Q1q6j0R6k59L18J0J82k02ON9q7J96J6l23K71K42l85J10j92J86o1j28
7443d8J55j61l1J10p3l8L14j48n4j5Q6J03l7k95J27j45o8J12J68r8r9j57K93j35
7467a34q4J13J66m0j86J20n4J23P6j81n6K87J40j96o7o9k81L49N1j85K82k88J20
$$ plain form
7307 26 268 71 313 98 153 30 -115 0 -8 -90 6 164 -37 57 -6 -145 -1 105 233 152 -35 7 53 122
7331 122 -45 -125 -97 -236 141 324 -38 -137 -228 39 103 -309 180 -105 63 -35 127 -147 -53 318 3 323
7353 323 -161 316 -256 8 50 170 -131 98 160 -71 25 -178 83 271 -227 -100 30 -343 35 5 -486
7374 -486 -69 -35 -59 205 42 151 133 22 -35 343 107 -177 62 -10 93 86 241 61 149 159 -76 67 -267
7397 -267 120 -45 254 -91 14 129 109 -214 -9 189 41 218 -225 -150 4 12 69 225 -192 0 -42 -180
7419 -180 -88 -7 -93 -103 -7 -266 52 62 244 42 48 107 20 216 232 -91 180 422 37 147 -45 141 80 -48
7443 -48 107 -54 -85 25 -48 -86 228 80 26 11 97 200 163 -132 -5 -150 -218 -106 62 -36 -135 -292 1 -134
7467 -134 -218 -105 61 21 -165 -45 -99 24 100 -81 -137 150 290 94 27 -42 -323 26 77 -108 174 -114 6
7490Fj87K09L4k97J57J97j84Q7K2m9j91J86j4J19M7l82K81j98P3J62m89M07j36
7513a40J33P0j9J62j52m47K51N17m23J10J20j66q8n4K54j26J26j45l04K05j60
7534b76O69n27m9R9j00J69k43K92j36p3K54K72l24k83K45J07L3k54O9o7j09J71
7556f1K98q9l04J67J26k1K09l41N6J96l62L65m6j71j88O6L44k74j51J75J78k47
7578g5J63k33J52k5J82m71K70j39L44R5n5j91k33P0J00K2k79K24Jr5j91K62J04
7601BK38J70k94K4k49L0k6p8P4K78j42K08l62J11J63l92pJ84j37J36M4j27J34
7624a8nP1n1J52p5j5j32K3L21k32J48k06K06k48p1J76L82l57J1K4k5m39K36L7
7648h7l7J14p7K20k60K58m6r6O8j30R0r2j74M27n00O78j66j37j04L0K95j12p1
$$ plain form
7490 6 -181 28 62 -235 -78 119 -65 22 44 -5 -196 -10 -24 95 142 -240 41 -157 -84 78 -411 -4 -140
7513 -140 -7 63 44 206 54 -393 -142 375 -48 62 182 16 -72 -126 128 2 128 -17 -321 -116 -276
7534 -276 393 -134 -183 -84 -184 -15 -258 34 -102 -175 79 351 27 -256 -11 96 129 -125 -56 -123 -232 -61
7556 -61 237 148 -156 11 137 116 325 -16 40 236 -126 239 193 22 -166 -100 244 -30 -181 -6 172 -75
7578 -75 88 -145 7 -18 164 -307 -37 -176 168 263 208 17 -216 -146 -46 -24 -303 -79 -78 -173 -364 -102 2
7601 2 240 410 116 140 -109 -79 -105 -183 -109 169 27 235 -127 -16 147 -245 -252 -68 -205 -69 -25 -152 -18
7624 -18 -23 48 -3 149 74 59 -73 -50 271 39 187 -19 187 -61 -132 44 426 69 80 104 79 -360 -124 -87
7648 -87 -124 -10 -87 133 -127 131 85 -11 57 -73 17 -75 -249 178 -322 356 190 53 -51 -21 274 162 91
7671I1K3j95j77J54p9M12l4l20J46R1J44m75L5j36K04K84k12J08m62J53n0J53
7693a42L54k75Q6J62j22R9l1o2l6L2j8j47J83j96J92n75M91j54K22kQj14J77k16
7717h4R0O7q7Q0j57K63k62N2q4M1Q4R0j51Q6m7J93J22l96j6J57Oq7O7N3Jl2J05
7744A54p5k2J70j10k82J94J87l61K2L29j28O2k22J79j64Q1k77J33K63j79mj96
7766b46L04Qj95O2K89M4k07O3k57J41j62O6P1M9j22P2J7j04J11Q2k85M08n01L6
7790b56K98J43k02o8L48n7N0o3k72L75m62J93p7QM41j96k63J64o2rqj81n3K06
7814cr8Q0L4J53p1k65R3K34j81J22j09l47N45L3k09Q3O9O1k56P1J4n7M0l81J68
7839a77J58J28j25K84k69M5J33J42l79j50K52O5j93J36j66K86l7M2l82j32N26
$$ plain form
7671 91 114 -81 -258 -104 -183 229 195 -125 21 112 256 -219 -184 -320 -116 168 -44 64 -398 -245 -295 -142
7693 -142 212 -63 23 185 63 162 131 69 33 65 47 -100 83 -113 79 -496 -5 -159 63 61 69 -45 132 -84
7717 -84 6 73 -14 66 -91 172 -90 -38 -122 -81 3 93 -58 28 -19 174 296 -100 -116 41 47 -40 27 80 81 49 154
7744 154 79 57 227 117 -165 29 216 -145 -123 206 78 140 -82 97 -67 14 -263 -130 133 -46 -50 -246
7766 -246 58 66 -129 -67 222 266 59 122 -135 6 -156 -90 -19 30 -92 -20 -3 -107 4 86 -199 209 -292 -256
7790 -256 42 185 -17 -85 263 206 256 193 -79 296 -166 27 -50 -42 399 203 -60 104 42 33 25 -156 -209 -3
7814 -3 -101 -21 13 166 95 -170 -77 157 -24 98 -11 -358 187 220 11 94 163 224 -32 39 53 -4 36 -345 -177
7839 -177 -19 109 -16 268 -1 44 177 319 -60 -210 42 107 -86 50 -116 170 133 175 -207 -339 187
7860A87k51J54j68J9J49o2j94P0K07j21J44K8k38J1k77K35L81l36J65p2o7L03
7882B67l16M7R6j00j46j64K41J79j8N0j45j84J84j63J67k97J74J66j89K33k51
7903a69K62m1J7q1K23R9m87L29o1j95L24k73J99j13j6Q4j21p4N0K42l12J79j26
7926f1L03k10o1J47j34J1l6J8Rj3K0lK06k77p4K09j36M36n62J75l06M98k89J50
7950B0J71R4k98J56o9j30J63j84o3J89j62M9J7N4j33l6K58j35J98j54M9j13L10
7973B51k61k85K05L06J32k70K1j29l5l1M8p9O8j49K35p5K49m90K47j7j4o6J78
7996C9r0M2J53q5k87J56n3R6N5K90o38L45J55j71R0m38R6K5J88k6P1m8L6j47K97
8021A51k32J83J03m54O98l30p3q1o4K01M5j26M5L5K3k11J79K00l28J2K07k49J39
$$ plain form
7860 187 -64 90 -78 -59 90 28 -166 -96 111 -10 134 162 -76 -65 -342 -107 274 -62 103 31 -36 267
7882 267 -49 -2 94 -6 -152 -316 -75 104 86 136 -9 -193 -9 -172 -5 -302 -128 38 -151 82 -169
7903 -169 93 52 69 -12 211 310 -177 152 91 -104 220 -53 146 33 17 101 -20 -94 -44 198 -114 65 -61
7926 -61 242 32 -29 118 -16 -5 -41 -23 -14 -27 -7 -10 196 -81 -155 54 -82 354 -208 -33 -339 159 -130 20
7950 20 191 285 -13 143 74 -56 107 -77 -140 49 -113 -64 -47 7 -126 -162 96 -39 159 5 54 -59 251
7973 251 -10 -295 -90 216 348 78 99 -30 -65 -96 -48 -127 -59 -208 27 -48 201 -289 -42 -59 -73 -139 39
7996 39 -51 -9 144 59 -228 -72 -125 -29 26 316 -322 23 178 7 97 -341 -245 -220 -32 -58 13 -35 1 -146 151
8021 151 -81 102 205 -249 449 119 46 -35 -99 102 147 21 66 101 124 -87 92 292 -36 -24 183 -66 73
8044G3ooj79k21L74K61l51J54J68j52pl1j84OJ00K59j63j75m9j5j39M3K65J90
8068B15l03K45J19m72J16M67o3j23K1k29R7r4J52j61pR8o8J35r9K74o72J33K52
8091C3n6R4j18k62M25j06l51K36l3J20j98J70J31p0Om2J4j73m8L19j85k3K8N7
8115c2j77K80P9l6M4k54L19N0k4k53L5m7p7Q9l56M46J04k54j82M63m09K39q6n6
8139i5M4K5K2k23J62K69j75j81J71P9j71k34M86k7K5J92l13q7J02K5l64L61l68
8162b75L14k39K14j1L21j63j65Nl1L47j94j09J27j43Q2q7J63j14k05K22j75K2
8184i4J86o5N2o1l2j08J47
$$ plain form
8044 73 67 61 -118 -339 35 296 -55 99 267 115 108 77 -107 -101 -1 258 95 -80 -129 -144 -283 -240 25 215
8068 215 -88 157 276 -196 -80 387 324 201 222 -7 90 -4 148 -13 -20 78 10 145 46 320 -352 -219 33
8091 33 -23 71 -47 -309 116 10 -341 -105 -138 -18 -216 -46 85 15 21 -21 -7 -180 -228 91 -94 -117 -89 -32
8115 -32 -209 71 150 114 158 -96 223 273 249 -4 31 -16 -93 -4 -360 86 190 -64 -246 217 -192 47 -39 -95
8139 -95 -51 -26 -4 -227 -65 204 29 -152 19 98 -73 -307 179 152 177 369 56 -31 71 96 -268 93 -275
8162 -275 39 -200 14 3 324 161 -4 1 -30 317 123 14 141 -2 80 -7 156 42 -163 59 -116 -94
8184 -94 92 27 79 18 -14 -122 25
8191B5
$$ Imaginary data points
##PAGE= N=2
##DATA TABLE= (X++(I..I)), XYDATA
0@%%%%%%%qJ6j6J6k3L1l2M0m8N6p2Q6j00J18j36J55j79K08k38K71l09L51l98M48
31B37n03N65o31P03p87Q78r74J081j199J328j471J629j804J997k215K461k738
48a443L056l425L859m374N001n789O805q176J0138j3201J8690l1516J15150N9683
62A54458k41163j2756J45230M2843j35533k2041J08937L5101j02420k9495P8377
73B1538L9625n5994j8488L2980m585n0686J0597N6753L961n1715m469M4557R177
86C3251m0056q867L2969L483m2859r514M5756K4211l9084k9994L0350L1701k3295
99H052k4067K4348J7379l9831l0776L9456M0409k8666l2647L2554K8769m3914
111h934l7153M4993M2926m2682m6880L5414M0160l3937k8943M8447L2861n6537
$$ plain form
0 0 0 0 0 0 0 0 0 -8 8 -8 8 -15 16 -16 24 -24 32 -40 46 -54 64 -72 83 -96 112 -126 145 -164 187 -211 237
31 237 -266 299 -332 371 -416 462 -512 569 -630 698 -773 856 -948 1049 -1166 1295 -1443
48 -1443 1613 -1812 2047 -2327 2674 -3115 3690 -4486 5652 -7549 11141 -20375 94775 154458
62 154458 -86705 -99461 45769 88612 -46921 -68962 39975 75076 -27344 -56839 21538
73 21538 61163 5169 -13319 19661 15076 -35610 -25013 31740 35701 -16014 -20483 24074 33251
86 33251 -6805 -15672 17297 20780 -22079 -31593 14163 38374 -710 -30704 -354 31347 8052
99 8052 -16015 8333 25712 -14119 -44895 -5439 34970 6304 -26343 6211 34980 -8934
111 -8934 -46087 -1094 41832 -850 -47730 -12316 27844 -6093 -35036 13411 46272 -10265
123a0265m5174N0333M5501m9287m7173M7032N2168m0010m9871L5829N1360k9213
135A1230n0946J7401M1966j4034l3294J3721K9620j3475k5877J7124L0280j3019
147A0697l2272L328K3048o684k0135J4424L0105r835l7615J382L9865R165l4475
160i002j4037K8719J0063l2776j2099L7169K4363k7380k3647J8040J4413j9522
172e696q166K4874P385l0119r069L2190J4365k7494j1527K6288Q723k8385r448
185a6079K5857P746k5278n002K6825O637k3874l678K3713K83k8091l508K8787
198A4338Q218k5924j1683K0994J2540j4548q851J3909P863j5953j3668R973J4408
211A1616m022r840L894P825m508p706N257Q002o963j0963N341J1080p000j2706
$$ plain form
123 -10265 -55439 -5106 40395 -8892 -56065 -9033 43135 3125 -46746 -10917 40443 11230
135 11230 -39716 -22315 19651 5617 -27677 -13956 15664 2189 -23688 -6564 23716 10697
147 10697 -21575 -18247 4801 -1883 -22018 -7594 22511 12676 -24939 -23557 16308 25473 -9002
160 -9002 -23039 5680 15743 -17033 -29132 8037 32400 5020 -18627 -587 13826 -5696
172 -5696 -13862 11012 18397 -11722 -20791 11399 25764 -1730 -13257 13031 21754 -6631 -16079
185 -16079 9778 17524 -7754 -12756 14069 20706 -3168 -6846 16867 17150 -10941 -14449 14338
198 14338 22556 -3368 -15051 5943 18483 3935 -4916 8993 16856 903 -12765 -2792 11616
211 11616 7594 -2246 1648 9473 4965 -2741 2516 10518 3555 -7408 -2067 9013 2013 -10693
225a0693R701J8549o931k2199J170K1737p36k2362l220K0255N176j6042l318J4544
239E631J481j3789r68J1112k283j1844K638J1640m224j1573N841J4197k974j3228
253h343M38R113m191r575M408J2531j853j0676m20Q696J201n673o45L711p95n705
269g778m43M179K666j59J03J370j170l818j236L866K660l060l284K033M501j388
285i58l810K632N540k058n991J136M939j660o161L206Q293m44o794Q77O391j649
301C489o089Q66O003o60n363J016M181j256k068M149M364l956o760O57M955K50
317C778k549R64K719N73k570n52R88J751j449k275m89J816J278n65r52J978J337
334E781j723j464J231N86l596j293L238J830k775j11L772q79n584J50O312Q42
$$ plain form
225 -10693 -992 17557 10626 -11573 -10403 11334 10598 -11764 -14984 5271 10447 -5595 -8913 5631
239 5631 7112 -6677 -7645 3467 1184 -10660 -8022 3618 -606 -12179 -6338 7859 4885 -8343
253 -8343 -7905 1208 -2983 -12558 -8150 4381 2528 -8148 -8568 128 1329 -4344 -4989 -1278 -2073 -7778
269 -7778 -8221 -4042 -1376 -1535 -1432 -62 -1232 -5050 -6286 -2420 240 -2820 -6104 -4071 430 -958
285 -958 -4768 -2136 3404 1346 -4645 -3509 1430 -230 -6391 -3185 5108 4664 -2130 -1253 5138 3489
301 3489 -2600 -1734 4269 3609 -1754 -738 3443 2187 119 4268 8632 4676 -2084 -1427 3528 3778
317 3778 1229 2193 4912 5485 2915 2363 3351 5102 3653 1378 889 2705 3983 3418 2466 4444 5781
334 5781 4058 2594 3825 4411 815 -478 2760 4590 1815 1704 5476 4597 -987 -837 5475 6317
350F317o591l378N357K066m524j700N800K506m998l448K193J014k514m29K902
365E73M0l604l41L949Q73l123o34K780n39m074j807L472L132k940k114K715L050
382A408k559m683J295L877q43m422M17M371O35l780j64L524k6l188k28L429k077
399c014m147K455N148j033n337J595O126j885o567P47P741kp581o96P204J240
415A994n900j57O701K79o459j273N485J026l767m49N366J17m928M68N528k67o148
432b384K45O056M98n886q39O579J974n970k573N598L519n359l355L744M010l316
448B541k829L751K672m018k489L579K784l823k834M012K881m968l079N696M322
463H198n554m805M998M877m398n732M324N360m106n888L516O212l023n352K246
$$ plain form
350 6317 -274 -3652 1705 3771 -753 -2453 3347 5853 855 -2593 -400 614 -1900 -2329 573
365 573 613 -2991 -3332 617 1490 -1633 -2267 513 -26 -4100 -5907 -2435 697 -2243 -4357 -1642 1408
382 1408 -1151 -5834 -4539 -662 -1505 -5927 -5510 -1139 -504 -4284 -4448 -924 -950 -4138 -4366 -937 -3014
399 -3014 -7161 -4706 442 -591 -5928 -4333 1793 -92 -6659 -5912 1829 1827 -5754 -6450 754 1994
415 1994 -3906 -4063 2638 2917 -3542 -4815 670 1696 -2071 -2520 2846 2963 -1965 -1497 4031 3764 -2384
432 -2384 -2139 3917 4415 -1471 -2310 4269 6243 273 -2300 3298 6817 1458 -1897 1847 5857 2541
448 2541 -288 3463 6135 2117 -372 3207 5991 2168 -666 3346 6227 1259 -1820 3876 8198
463 8198 2644 -2161 2837 7714 3316 -2416 1908 7268 3162 -2726 790 7002 3979 -1373 873
478H73M084l291m420L473L889l794m881M466M793m178n245L521N155l864o421
493e840L274O492k994n829J781N805j839n531J578M538j123n138J059M577j325
508e15m928J395M889r34n455R42N602n72o656pO708K73o084r38O515O80n963j152
526f200N850Q62n512r47N639P80n878l68O434R87o187j087O247Q40o332q84O656
543I00J451n320j685N552J608m646r82N097Q85n154j268M209K312l991j045M288
559B211J905m688k127M417K558l284k900L268K379k140k356L268K201k604k855
574g47K920K677l496k619L719L644l368m065L537M849l018n752K517N350j983
589D165m368J499L749j523l300K340K720k916k866L043K826m189l531M818M273
$$ plain form
478 873 4957 1666 -2754 719 4608 814 -4067 399 5192 1014 -4231 -710 4445 581 -5840
493 -5840 -2566 3926 932 -4897 -3116 2689 850 -4681 -3103 1435 312 -4826 -3767 810 -515
508 -515 -5443 -4048 841 -93 -5548 -4606 996 424 -6232 -6239 469 742 -5342 -6280 235 915 -5048 -6200
526 -6200 -350 512 -5000 -5947 -308 472 -5406 -5774 660 1647 -4540 -5627 620 1460 -4872 -5756 900
543 900 2351 -2969 -4654 898 2506 -2140 -3122 1975 2860 -2294 -3562 647 2959 -1032 -2077 2211
559 2211 4116 -572 -2699 1718 4276 992 -1908 1360 3739 1599 -757 2511 4712 2108 -747
574 -747 2173 4850 1354 -1265 2454 6098 2730 -1335 2202 7051 4033 -1719 798 6148 4165
589 4165 -203 1296 5045 3522 222 2562 5282 2366 -500 2543 5369 1180 -2351 2467 6740
604F740m497n648L298N387k005n200J088M240r22l797K65K938n78j635O88O8k044
621a614l55K324R64k496j792K506K325k554k645R10L446l02l947r03L387K052
637A306k800k508J480J921q31j376L24M10j053K70K241n96k963N74L851m83n206
654e439m85N591J780n271k529M311L100k447k448J987R62j801k06K012l66j517
670b766J195K505j493l027J355L733r25l584L39L207R34k408o30J707J323j050
686D15m37l78R51K73p9o86P5J111J066k55j246k18L78R59K79r60p18O59R42R04
706C035j522NJ510L87j808P6N50K26q10P23J160j433j305J704K140j681k772P90
724I75K139m7j876r8J006J3j49J85l24r93J52J893j371l106J292K984J44l267
$$ plain form
604 6740 2243 -3405 -107 5280 3275 -1925 -837 3403 2481 -1316 -1051 1887 1309 -326 362 430 -1614
621 -1614 -1969 355 1319 -1177 -2969 -463 1862 -692 -3337 -2427 1019 717 -3230 -4133 -746 1306
637 1306 -1494 -4002 -2522 -601 -1432 -2808 -2484 -2074 -3127 -2857 -616 -1212 -4175 -3601 250 -233 -5439
654 -5439 -5924 -333 1447 -3824 -6353 -2042 1058 -1389 -3837 -1850 -888 -2689 -2895 -883 -1249 -2766
670 -2766 -1571 934 -559 -3586 -2231 1502 577 -3007 -2668 539 1473 -935 -1565 142 1465 415
686 415 -22 -400 551 824 745 59 134 1245 2311 2056 810 592 970 1929 2208 1248 530 1189 2131 3035
706 3035 1513 1518 3028 3415 1607 1683 2233 2459 1649 2372 3532 2099 794 2498 4638 2957 185 975
724 975 3114 3067 1191 1093 2099 2112 1963 2148 1824 831 983 2876 1505 -1601 -309 2675 2819 -448
742d48r08K484J336j841j597J095O75n96p83p32K17J866R47k266k392J190L211
759A458m95l553j132K906J545j786j873O25K020N05j777j958NJ853J277j577k181
776d138M99K706R13j945j371L42J559Q1j273p68P89J848j57k223N0K236J466k620
794b006j310J189J235r98n56J487P32r57k49J120J35j233M51J192q62j733J082
811a281K650k53k172N20J865m93j332P56M81n96m46J381N32j460L3K192N56k228
829G05q49J339J483r33j255K16J144Q15k4k4o72l77L02L22m07n41J46Q42J36J33
849B501o65K35O92K90j442j056P36Q52q05o30J564R62j547j372J101J463k029
866H50j529J634Q63j490p35J765Q07j783m94K160l96k667j019J558P06j007J77
$$ plain form
742 -448 -1356 1128 2464 623 -974 121 796 200 -583 -1315 -1098 768 1715 -551 -2943 -1753 1458
759 1458 963 -2590 -3722 -816 729 -1057 -2930 -2305 -285 220 -1557 -3515 -3510 -1657 -380 -1957 -4138
776 -4138 -3639 -933 -20 -1965 -3336 -2994 -1435 -1354 -2627 -3395 -2606 -758 -915 -3138 -3088 -852 614 -2006
794 -2006 -3316 -2127 -892 -1890 -2446 -959 -227 -1184 -1433 -313 -178 -1411 -960 232 -630 -2363 -1281
811 -1281 1369 1116 -1056 -536 1329 836 -496 260 741 145 -301 1080 1612 152 185 2377 2933 705
829 705 -144 1195 2678 1745 490 706 1850 2665 2641 2617 1945 1568 1870 2192 1785 1244 1390 2232 2368 2501
849 2501 1836 2071 2763 3053 1611 555 1291 2143 1338 708 2272 3234 1687 315 1416 2879 850
866 850 -679 955 1818 328 -407 1358 2165 382 -112 2048 1652 -1015 -2034 -476 230 -777 -600
883f00J806m49k435N09J527m25j740Q14J055j725k342J339L548N53k983j134Q27
900a855Q29p11n96J96J92n9r0L17M96K15J71n07p72n89j70J282L87j696N9J723
920a178J737j075j815L07J246j019j457J355K263n71k388K07K396P52j023j74
936d37N6j432k98J589R76j172k28J847J315k508j359K547J404k442j843J598K389
953B002m91j514O66J523l0r34N80kj591j002R70J934M38N5K38n14j381k28J287
972B006J341j143j726j01J338l1k98J148J765o95l184j160J830R07p13j59O29
989A754K80j041n2R81L9j063j92P13j225j484J022K074K54j659k42J999p75k343
1007i60m28J939J05j977k07J881R41j760q43J102N47o11p56O6j025r52Q38K145
$$ plain form
883 -600 1206 757 -1678 -1169 358 -67 -1807 -993 62 -1663 -4005 -2666 882 1435 -1548 -2682 -1855
900 -1855 -1026 -1737 -2333 -2137 -1945 -2004 -2094 -1777 -1281 -1066 -895 -1402 -2174 -2763 -2933 -1651 -1264 -2960 -2901 -1178
920 -1178 559 -516 -2331 -2024 -778 -1797 -3254 -1899 364 -207 -2595 -2388 8 760 -263 -437
936 -437 -381 -1813 -2111 -522 454 -718 -946 901 2216 -292 -1651 896 2300 -142 -1985 -387 2002
953 2002 1511 -3 663 2186 2156 1222 1802 1800 209 -793 177 2111 2549 2604 2842 2328 947 719 2006
972 2006 3347 2204 478 377 1715 1684 1386 2534 4299 3604 420 -740 1090 1997 1284 1125 1754
989 1754 2034 993 941 1922 1961 898 706 1419 194 -1290 -268 1806 2060 401 159 2158 1383 -960
1007 -960 -1388 551 656 -1321 -1528 353 1294 -466 -1309 -207 340 -271 -1027 -961 -1986 -2938 -2100 45
1025D5J46j136j28P23j229j515K56K037M84j844r41J332J021l12m53J99L29o53
1043a639j015Q9Q19k70k92J055O49j07m61L39n14j160K50J599N05j256q09J405
1061h13N61k67j09P19R00j759j798L39J993O98l05O5K84n30l41O62L98l28j80
1080A89N36j3r25L55J225J142j049l04K93K83j276j054J423J307k80o54J72N15
1098A885q8p43M78O21n50k46j63l64J59O67R87P9j018p38K28P18j002m56Q20Q13
1118B087l59j278p2R85O60o75m46J04Lj104l38P32K73M01j33M25q09j42k58K65
1138C21q27k96L94O47p26o61O33J280m55j193j69L08j63q24j30N68L87K5L95n52
1158a038l10k05L21k1m51j36P69J70j257m01R26R90m9p92n2l65K0k40O91J25O26
$$ plain form
1025 45 191 -945 -1073 -350 -1579 -3094 -2838 -801 -317 -2161 -3102 -1770 -749 -1061 -1514 -1315 -986 -1639
1043 -1639 -2654 -2565 -1746 -2016 -2308 -1253 -604 -711 -1172 -833 -1347 -2507 -2257 -658 -153 -1409 -2218 -813
1061 -813 -252 -519 -628 91 991 -768 -2566 -2227 -234 464 159 224 508 -22 -363 299 697 369 189
1080 189 725 712 -213 142 1367 2509 1460 1156 1449 1732 456 -598 825 2132 1852 1198 1370 1885
1098 1885 1797 1054 1532 2153 1603 1357 1194 830 989 1656 2643 2722 1704 966 1194 1912 910 454 1274 2087
1118 2087 1728 450 378 1363 2023 1348 902 1006 1009 -95 -433 299 572 973 840 1265 456 314 56 321
1138 321 -506 -802 -408 239 -487 -1148 -515 765 310 -883 -1052 -744 -907 -1731 -1861 -1293 -906 -881 -486 -1038
1158 -1038 -1348 -1553 -1232 -1253 -1704 -1840 -1071 -901 -2158 -2559 -1633 -643 -692 -1484 -1536 -1901 -1881 -2121 -1430 -1305 -679
1179f79k56p52J59M8L73M12o7l72n30R4N75k29L06Q89Q26j121j253K28R70L50
1199b9k5m83O05L72k27n6J24M9M27k38K0q81p1J080N60j68l97M88J012q67j293
1220BK28J207K77p65J9J69Q7j78O11K57k65p4J44k4j400K58R75J158j131l32K34
1241A457M55r12p91Q41Q10j67j110j02M04N05m53K11K47l58o47J22N9k98k65Q58
1261H66L99m69p46N6M19p27m03M15O18m23o25r6K80J51n69Q27K51m18j579m48
1281b221J230J42M71l15l78k3o11J56M16K92J2m01n71n56K93Q23J008m49j535
1300b217N10R54P8j405K24O70Q70j116q55J194Q11k71j146J86L75L91M42o01p71
1319a677k09J419P78k3j406P51M43l86j185N8K055P02j478j105P93J179M81o58
$$ plain form
1179 -679 -935 -1687 -1528 -1480 -1107 -695 -762 -1134 -1664 -1570 -995 -1224 -918 -29 797 -324 -1577 -1349 -379 -29
1199 -29 -54 -537 68 440 213 157 281 330 757 519 539 -342 -413 667 1227 1059 662 1150 2162 1295 2
1220 2 230 1437 1714 949 968 1137 1224 1046 1657 1914 1649 1575 1719 1695 295 553 1528 2686 1555 1223 1457
1241 1457 1912 1000 209 1050 1860 1693 583 481 885 1390 937 1148 1395 1037 390 512 571 273 8 866
1261 866 1265 796 50 106 525 -202 -605 -190 428 5 -620 -716 -436 -285 -854 -27 224 -194 -1773 -2221
1281 -2221 -991 -849 -378 -693 -1071 -1094 -1705 -1549 -1133 -841 -829 -1230 -1801 -2357 -2064 -1241 -233 -682 -2217
1300 -2217 -1707 -753 -675 -2080 -1856 -1186 -316 -1432 -2287 -1093 -282 -553 -1699 -1513 -1138 -747 -305 -906 -1677
1319 -1677 -1886 -467 311 288 -1118 -367 76 -310 -1495 -1437 618 1320 -158 -1263 -470 709 1190 532
1337E32j16J26J02n52R1J75Q09K23p0n65r00R65J318k16j515l83J111J023j130
1356A028o09R09Q42m06r37j72J156j94m53n10L0L17L42N68o79r95K21J031L18
1375A807p38n22P88J37j150o21J058J334q80r65q5M13k2j33M3N57n72m41q0O66
1395E94k28n07L32j65k85o81P81K64k22p63K00N31n72j23J77L53o95m78N38Q53
1415i6j68j501M32O82m50m77L45P41Q2j121n92J027N2j5k0N5n63n00R70R31q13
1436i99q25J081N79j115o59P30J021o0j466k01J259P26o04n47K27L15J87j61P0
1455d42K2r4M91j71l41R2R08M93q00p74J30J196L32r55j69N47O07o92j85L02R31
1476A428k90m52j64N51k47J23J40q3m14L26O51K29q27l11Q07K70r26k36Q65N35
$$ plain form
1337 532 416 542 644 92 183 358 1167 1390 1320 755 -145 820 2138 1922 407 24 1135 2158 1028
1356 1028 419 1328 2170 1764 827 655 1811 1617 1164 654 684 1001 1343 1911 1232 237 458 1489 1807
1375 1807 1069 547 1335 1472 322 -299 759 2093 1213 248 163 576 554 421 464 1021 449 8 -72 594
1395 594 366 -141 191 26 -259 -940 -159 105 -117 -880 -680 -149 -721 -844 -667 -314 -1009 -1487 -949 -96
1415 -96 -264 -1765 -1333 -651 -1101 -1578 -1233 -492 -410 -1531 -2123 -1096 -1044 -1059 -1079 -1024 -1587 -2087 -1117 -186 -999
1436 -999 -1824 -743 -164 -1279 -1938 -1208 -187 -247 -1713 -1914 -655 71 -533 -1080 -853 -538 -351 -512 -442
1455 -442 -420 -514 -23 -194 -535 -443 465 958 158 -616 -486 710 1042 87 -82 465 1072 380 195 497 1428
1476 1428 1138 686 522 1073 826 949 1089 1006 592 918 1569 1798 971 660 1467 1737 811 575 1440 1975
1496A975o18p50K52M95k39KK62l95l68J3J008n53m53j13R05p61l93LJ177j69j237
1517D3m7L80J07J56j17k03r5k18k2k15NlN0J10j92m54M86K93j17q44j01L38K98
1540c62j78l45j4L30Q3o44j6Q25l76o34J7K00K58n37L19J29K19o59oL37P5j7n1
1563a047M2l34k4P13M09p06k38M03L75m60l52K35Q25k14n68p3P78J42n54j21N81
1584a88k59L01K6j22k65L52M43J18l10J61O19l51p93j71R99N65n16q06J71N62
1604E36M96m78j14L64L12m52j74J3M32N78k55l99j46L90j08K33k82j16K01M8N0
1625A129p48K48R19n8j097K64K46M63o70n02N27L81j54k46J43jk05k85J69j4k5
1646D84K98k26o33k89Q88L58k71q51L30j57k25J02k75P26J35l59p11J21K37K35
$$ plain form
1496 1975 1357 607 859 1354 1115 1117 1379 984 616 629 1637 1084 631 518 1423 662 269 272 1449 1280 43
1517 43 -4 376 483 639 522 319 224 6 -16 -231 -226 -229 -179 -69 -261 -715 -229 64 -53 -897 -998 -660 -362
1540 -362 -540 -885 -899 -569 -486 -1130 -1146 -321 -697 -1331 -1314 -1114 -856 -1393 -1074 -945 -726 -1385 -1391 -1054 -979 -996 -1047
1563 -1047 -1005 -1339 -1363 -650 -241 -947 -1185 -782 -407 -867 -1219 -984 -159 -373 -941 -1014 -236 -94 -648 -769 -188
1584 -188 -447 -146 -120 -242 -507 -155 288 406 96 257 876 525 -268 -439 560 1125 609 -197 -26 536
1604 536 1032 554 440 804 1116 664 490 503 935 1513 1258 859 713 1103 995 1228 946 830 1031 1079 1129
1625 1129 381 629 1548 1490 393 657 903 1366 696 194 721 1102 948 702 845 844 639 354 523 509 484
1646 484 782 556 -77 -366 522 880 609 -242 88 -69 -294 -192 -467 259 394 35 -676 -555 -318 -83
1666h3l09q2k70P2O1l83J3J70K49K59m92n00M21p0k00l56L35R53j55k09r93O37
1688i32L99l89m47K64O00o09k50j15O47M31j1J82r33n22N28M13L62l80l6O35k49
1709d12q26M24J105k24n37m64PP76O4l49M60j57k4L54K62k35j07K35M5n12J21
1730FP01O17o64l58K77N35j41k09k76K9o1K23j18M35L98n26k89J83n9K18M92k76
1752A137k22m49M32K15M85l72j83L25n83m60K44M29Q5l63k83J89O13n20j66j93
1772C60J7j20N6J30j81k82o6K96J00j05K48L04o25r84K71N38L10m56l05L07J29
1793e8n04k57N97M17o93l93K40j09J03n4N13m49n4l6M0n0l67K23j55L17m29pL66
1816g99K46l57n3O2K69L4o96K67J5L63jm3K00J18n02J90J68r8n5j14O11n45j80
$$ plain form
1666 -83 -392 -474 -744 -672 -611 -994 -981 -811 -562 -303 -795 -1295 -874 -944 -1144 -1500 -1165 -212 -367 -576 -1569 -932
1688 -932 -533 -922 -1369 -1105 -505 -1114 -1364 -1479 -832 -401 -412 -230 -1163 -1685 -1157 -744 -382 -762 -798 -163 -412
1709 -412 -1238 -814 291 67 -470 -934 -927 -151 -87 -436 24 -133 -157 197 459 224 117 352 397 -115 6
1730 6 707 1324 660 302 579 1114 973 764 488 517 456 679 561 996 1394 868 579 762 703 921 1413 1137
1752 1137 915 466 898 1113 1598 1226 1043 1368 785 325 569 998 1083 720 437 626 1239 719 553 360
1772 360 377 257 313 443 262 -20 -86 210 310 205 453 757 132 -852 -581 -43 267 -189 -494 -187 -58
1793 -58 -562 -819 -222 195 -498 -891 -651 -760 -657 -711 -198 -647 -701 -737 -697 -747 -1114 -891 -1046 -729 -1158 -1165 -799
1816 -799 -553 -910 -963 -901 -632 -598 -1294 -1027 -1012 -649 -650 -693 -493 -375 -877 -687 -519 -617 -672 -786 -175 -720 -900
1839i00O91N04l99n30qM96P1n81P06K00j93j25j26N25j55L89n9j81l4k42L85K09
1861F43m72J32O82n3l09j49P65m44l45m95K26J308m84n21O1L30L49n54K80j49
1881H01m8P4p6P7K6L82l5l40j83k55K55K95k21o91J71N71J44n03KQ04k49o03l00
1904I8O9N19k76n82l65O09L14k20J83k70o37M71Lo6k33M2N70k99o34K17N84K14
1926C11j091Jj33J47M91k73r5J44r5J42m33K63j07J15q9l96j60L27N44l33m08
1947a128N6L67n0n6l80N89j84K59n08L23J64K26n70K77J92j28j5j20K43j64M9
1968e58M32l0RN8p9J37m99K4N81r0l12L21K65J46l76N7N10M5m06l83K74L01J34
1991E61J53m27J7K05J50L00k94k48M02km40j84M60O16k91o51j72Q20L20l22m40
$$ plain form
1839 -900 -209 295 -104 -634 -642 -146 -75 -656 50 250 57 -68 -194 331 176 565 506 325 291 49 434 643
1861 643 171 303 985 932 623 474 1239 795 450 -45 181 1489 1005 484 545 875 1224 670 950 801
1881 801 753 827 751 828 854 1236 1201 861 678 423 678 973 752 61 232 803 947 444 446 1250 1001 398 98
1904 98 167 686 410 -172 -537 72 386 166 349 79 -558 -87 -84 -150 -383 -341 229 -70 -704 -487 97 311
1926 311 -780 -779 -912 -765 -274 -547 -642 -498 -593 -451 -884 -621 -728 -613 -702 -1098 -1258 -931 -387 -720 -1128
1947 -1128 -1072 -705 -755 -811 -1191 -602 -786 -527 -1035 -712 -548 -322 -892 -615 -423 -551 -566 -686 -443 -607 -558
1968 -558 -126 -156 -147 -89 -168 -31 -530 -506 75 -15 -327 -6 259 405 29 86 596 641 235 -148 126 427 561
1991 561 714 287 304 509 659 959 665 417 819 817 377 193 653 1269 978 327 155 975 1295 973 533
2012E33NL65r8k80o1K58M99m23l50K2J65L64k22j75m42M10L40J56r86O8L66K79
2034G93l48l56j03O14j44o14j85N98R7j91o54K06J97k2J3j68o4j62N35J9o96q3
2056g18P21%o19m59M63M93j73n57j0J29J69k00k22K29j56M53k23k21k01L51J57
2077e94k29j11m9M53n13L81m16L39q6r7O14n3L4ml23L1J20K14K10o69M55J25l98
2100e66K29K76J93n63q8L04L23k58L12K59j86o1Q7k42M93n72L15L02n37o3J84
2121A41Q99k62n65K85L84k53L1k27J7J60O8J26k35j56M33kj86k96J66L99j7k14
2143F96n70N81K86n98K66J29k12r3O5j81K24J77M3j80N0l03M5j15K75J1j98j60
2165B38J56J77o72P0J22L20j18n60J66M46n20N7k4J45j08j20K04l83j91K05M79
$$ plain form
2012 533 538 903 805 525 464 722 1221 798 448 470 635 999 777 602 160 570 910 1066 80 148 514 793
2034 793 445 89 -14 600 456 -158 -343 255 352 161 -493 -287 -90 -112 -99 -267 -331 -493 42 61 -635 -718
2056 -718 3 3 -616 -1075 -612 -119 -292 -849 -859 -730 -561 -761 -983 -754 -910 -457 -680 -901 -1102 -751 -594
2077 -594 -823 -934 -983 -530 -1043 -662 -1078 -739 -825 -922 -308 -361 -327 -331 -654 -623 -503 -289 -79 -748 -293 -168 -566
2100 -566 -337 -61 132 -431 -519 -215 108 -150 162 421 235 174 261 19 512 -60 255 557 20 -43 141
2121 141 1040 778 213 498 882 629 660 433 450 610 678 804 569 413 846 844 658 362 528 927 910 696
2143 696 126 707 993 395 661 790 578 485 550 369 593 770 813 633 683 380 425 310 585 596 398 238
2165 238 394 571 -101 -31 91 411 293 -267 -101 345 -175 -118 -142 3 -105 -225 -21 -404 -595 -390 89
2186H9o48M4l3K50Qq16K27Q89j46l42n25L55k47P4J79p0K34n2k85K25m36M10L72
2209b44j34o47K80K08K50k43n40N86J65K05n18j64L91K14l05J63l82M60j5N8m3
2230b55q3M86k14L8Q9j26l8k31M40l13N36J4K27m87l94P31L38n00l18N70M57q63
2252A04j38N78L89r9p53O42r8k71K12K04M2l39P1R7k65KM99R4j97k55Q7J29o1
2275F74l1l01L07K21j52k21k00L83L2j90j18N1K42K7m56j96L14K26k57N9l23l67
2297b76L78L73m06k08Q1L99k94o61J07O82O4n64n70N84R7k64l42O87l89P4J43
2318c05L5l02q4K70J47m91k7J61J52k04l30L18L42j54k26j20K64q2k68N5L76J1
2340d62j75J19l43L21m1L20m06P8L38J5j74k64L43K79k77k5j65J90j0K04J56k35
$$ plain form
2186 89 -559 -515 -548 -298 -290 -1106 -879 10 -136 -478 -1003 -648 -895 -821 -642 -712 -478 -530 -815 -590 -1026 -616 -244
2209 -244 -378 -1025 -745 -537 -287 -530 -1070 -484 -319 -114 -632 -796 -405 -191 -496 -333 -715 -255 -270 -212 -255
2230 -255 -338 148 -66 -28 61 -65 -103 -334 106 -207 329 343 570 83 -311 420 758 258 -60 510 967 104
2252 104 -34 544 933 834 81 723 625 354 566 770 812 473 544 641 376 378 877 971 774 519 606 735 674
2275 674 643 342 649 870 718 497 297 680 712 522 404 455 697 724 268 72 386 612 355 414 91 -276
2297 -276 102 475 69 -139 -58 341 47 -614 -507 175 239 -325 -895 -311 -214 -478 -820 -133 -522 -448 -305
2318 -305 -270 -572 -656 -386 -239 -730 -757 -596 -444 -648 -978 -660 -318 -472 -698 -818 -554 -636 -904 -849 -473 -462
2340 -462 -637 -518 -861 -540 -581 -261 -667 -589 -251 -236 -410 -674 -331 -52 -329 -354 -519 -329 -339 -135 21 -214
2362b14K01J1q6j24M5K31M61n94J45j32J94P7o5J83m65M13R2m58M78j0M59k55
2384E87o33K10K20N31p93M06%K70j10l20L57Q9n8M2j54j17K92L2j92k29K2K67
2406G19M2l51O4K29J22k73l64lM20N4j26m73J36j15N79q2k30k27K29Q8l94m5K26
2429B25j00k63j22J57kj7L61n00j71J46J44o8j37m19N54Q6m47k62O87l45N0NJ17
2452c21j58k33M60l47P5l20N38q7k2J46k03j39J81l31J79L67l61l8j82K77l1j7
2474e67K20k48J12j15l5K64N5K98j13r2j46P4J90l69L69j71J24q1K0K81J65l59
2496a24O42n81k36J89L62J6k42l01L84L77J4j85J70j28J46m6j43L6P9J94L1l70
2518B84J89J14K65m23k28M75k25O7R6N7p9K0m24Q5K20L43k65J4r0n5M55k14k26
$$ plain form
2362 -214 -13 -2 -88 -212 -167 64 525 -69 76 -56 138 215 150 333 -132 281 373 -85 393 383 842 587
2384 587 -46 164 384 915 122 528 528 798 688 368 725 814 756 798 644 527 819 851 659 430 452 719
2406 719 761 410 474 703 825 552 188 185 605 659 533 60 196 81 660 578 348 121 350 438 44 -1 225
2429 225 125 -138 -260 -103 -105 -122 239 -261 -432 -286 -142 -210 -347 -766 -212 -126 -573 -835 -148 -493 -443 -438 -321
2452 -321 -479 -712 -252 -599 -524 -844 -306 -393 -415 -269 -472 -611 -430 -761 -582 -215 -576 -614 -796 -519 -550 -567
2474 -567 -347 -595 -483 -598 -633 -369 -314 -16 -129 -221 -367 -293 -103 -472 -103 -274 -150 -231 -211 70 235 -124
2496 -124 518 -63 -299 -110 252 268 26 -275 109 486 500 315 485 357 503 457 314 350 429 623 654 284
2518 284 473 587 852 429 201 676 451 518 614 671 592 612 188 273 493 836 571 585 495 440 895 681 455
2541D55o5J25J04j53L3j16J56j77l5j46j2J99j29j20N7M9OJ37m82k20N49j55k16
2564a56l04O73P1l44l08r9J39L23J19m33j17j42K17p3j34O27j67k69o42N35P5
2585d09L41k85k62N8L70N0m26j07n4K57P2P0l60J53K04J33l89k65P03j7k05l93
2607g61K97j35N81j42k54j79K27J04j02k46K72O73q09k63L82R1K93q0j07J43O8
2628E3Q5j89M21m66J90K30l35L86l2o7K39j50j63J30J62k30J19J17O8R8m3k17
2650D06k96N69j12j50l85M71M26o76J99j37L10o7l07M40M3j57k96J3K7M6N46j20
2672G93n79q5L70j85J04j28N7J60o84K82l3N32l15l14J2j54J98J23l23j70M32
2693I3j71L77l0k74j47J6j45Q8J25K08l37k11l43L02J63N01n00j74j35Lj71O6
$$ plain form
2541 455 390 515 619 466 499 383 539 362 327 181 169 368 239 119 176 225 231 368 -114 -334 215 60 -156
2564 -156 -460 213 284 -60 -368 -467 -328 -5 114 -319 -436 -578 -361 -434 -568 59 -108 -377 -1019 -484 -409
2585 -409 -68 -353 -615 -557 -187 -137 -563 -670 -724 -467 -395 -325 -685 -532 -328 -195 -584 -849 -146 -163 -368 -761
2607 -761 -464 -599 -18 -160 -414 -593 -366 -262 -364 -610 -338 335 -474 -737 -355 -264 29 -51 -158 -15 53
2628 53 138 -51 370 -96 94 324 -11 375 343 276 515 365 202 332 494 264 383 500 568 666 623 406
2650 406 110 679 567 417 32 503 929 253 452 315 625 558 251 691 734 577 281 294 321 367 913 793
2672 793 214 129 499 314 418 290 347 507 -177 105 72 604 289 -25 -13 -167 31 154 -169 -339 93
2693 93 -78 299 269 -5 -152 -136 -281 -193 -68 140 -197 -408 -751 -449 -286 215 -285 -459 -594 -591 -762 -696
2715f96j13N90J07n37m8O9K22J77J57l97j15K6j48M36k6m90O03O4n28m8M00K86
2737in85R2L86j18n3k33L58j04K31L5j36l52J00R3M67m23J42N0N27n31k2j99M11
2760A27J04j21%n4K17j1k01L20L6K42l8m76L51l86N34l85L79k10J10q4k07J5l5
2783B27L87o6o6k93L3L17L0j62k3L18j87k03O2nJ34k61nL44k22l37K42Qr8J61
2807C35j6J90q38j08M48J05O6m1J94k50L5l02J69J95l00J61J12m11K09k00m1K57
2829c1l50L74k7k66k36Q3M8J30N5k30k74K12m0kL23k3K45o45k10L26J92N9l61
2852f48r9P88k85ml35J76q3OJ96r5J3J51j00K68o67L78L68k20j89k4L11j0k90
2875c94L67q9o0q4K45j29m99O15J16k4l53J02L63n8k5P7K69j05j21L8l67K00J94
$$ plain form
2715 -696 -809 -219 -112 -649 -697 -628 -406 -229 -72 -469 -584 -558 -706 -270 -296 -786 -183 -119 -647 -695 -295 -9
2737 -9 -594 -502 -116 -234 -287 -520 -162 -266 -35 0 -136 -488 -388 -295 172 -251 -109 -59 468 -63 -85 -284 127
2760 127 231 110 110 56 273 262 61 381 417 659 621 145 496 110 644 259 638 428 538 454 247 262 227
2783 227 614 548 482 189 222 539 569 407 384 702 515 312 374 369 503 242 237 581 359 22 264 272 174 335
2807 335 319 509 -329 -437 11 116 182 141 335 85 120 -182 -13 182 -118 43 155 -256 -47 -247 -288 -31
2829 -31 -381 -7 -34 -300 -536 -453 -405 -275 -220 -450 -724 -512 -552 -554 -231 -254 -9 -654 -864 -538 -346 -287 -648
2852 -648 -747 41 -244 -248 -583 -407 -490 -484 -288 -383 -370 -219 -319 -51 -718 -340 28 -192 -381 -405 -94 -104 -394
2875 -394 -27 -116 -176 -260 -15 -144 -643 -28 88 64 -289 -187 176 118 93 170 439 334 213 251 -116 84 278
2898B78J28l19Q6K20J87l52j7N5P12l47On19M77m32j79L56J8K28k60K51k24l3
2920C20L77k5m07k42M20K34k65j32M1J31J29m51LJ52n1P9Q5j16r1K42o6j55k81
2943f9J42J11q4k57P1M92m28j08J2K18j75j42J01r5J45Q3j99k03m6J15K41j15
2965a90o36N03L41m39J59j51J13Mk7o7k62K29j3K38m58pL43qk04j57K92N5j6J13
2989b45j81J50lk64K84J53J91j66j48k53J15L32l01M7q3R7J51j64l5J7K28K2K63
3012B07k63J31j02m9K73k47J10J08J29k73o0J29K90m59M66k29J08L09l83p4J65
3033B86m5M7M1J35j18O5J61n91j4M97K27l90N1n8kL3N2J68kj73L5j4j73J35k90
3058F3L52l30J91O6Q8l7n24M48L07k99k80k39J78J96O9m9l25K84l07k7J19Q3r3
$$ plain form
2898 278 406 87 173 393 580 228 211 266 978 631 637 118 595 163 -16 340 358 586 326 577 353 320
2920 320 697 672 265 23 443 677 412 280 321 452 581 130 133 285 234 313 398 282 191 433 367 212 -69
2943 -69 73 184 100 -157 -86 406 -22 -130 -118 100 -75 -217 -116 -211 -66 17 -182 -385 -431 -316 -75 -190
2965 -190 -826 -323 18 -421 -262 -413 -300 -296 -323 -390 -652 -423 -436 -198 -656 -663 -320 -328 -532 -689 -397 -342 -358 -245
2989 -245 -426 -276 -279 -543 -259 -106 85 -81 -229 -482 -367 -35 -336 -289 -372 -275 -124 -288 -323 -306 -78 -56 207
3012 207 -56 75 -27 -76 197 -50 60 168 297 24 -36 93 383 -76 390 161 269 578 195 121 286
3033 286 241 288 329 464 346 411 572 -19 -33 464 691 301 352 294 292 325 377 545 543 370 405 391 218 353 63
3058 63 415 85 276 342 430 393 -131 317 624 325 45 -194 -16 180 249 200 -125 159 -148 -175 -56 27 -66
3081f6Jo1j78K91J91l72j40OK01N6j62J48k21k7j4J6K08k07M32l15k38k94O29
3104a16l56J91j95o2K85k49L50m28K02j30L63m09q7L23l6l2L6N9k10K42m5l0J03
3127b31J32j97N1j46K40m89Q42k47k32M23k21L9j42j6K43j32M9j02J79J31m4l0
3149A00r0J36l2P2J36k88n4M86M09o94P4L48j32J43q4k45K35r0q6R2m75K86M31
3172F78k86K2j03L2j89L50J70j33j42l8M1k51k9L12k25j66P7M27O4k59k41K02
3194C13Nk78K5pL03l72l37K38nJ01J62k09O3k41K21J34K8n34K31J57j40R2m18
3217d68K84J36l71J84K29k04K9m34M04P8Q4q2j28l6r0k1J81j75o8K20J74k69m72
3240h15M91K41j74lJ30j07J02j85k06K15K51o0p2l32K34j68L67l31L13J52l10
$$ plain form
3081 -66 -65 -126 -304 -13 178 -194 -334 -328 -127 -71 -233 -85 -306 -333 -347 -331 -123 -330 102 -213 -451 -745 -116
3104 -116 -472 -281 -476 -538 -253 -502 -152 -580 -378 -508 -145 -554 -641 -318 -354 -386 -350 -291 -501 -259 -304 -334 -231
3127 -231 -99 -296 -245 -391 -151 -640 202 -45 -277 146 -75 -36 -178 -194 49 -83 -34 -136 43 174 130 100
3149 100 10 146 114 186 322 34 -20 466 875 181 255 603 471 614 530 285 520 430 344 436 -39 247 678
3172 678 392 414 311 343 154 504 674 541 399 361 402 151 122 434 209 43 120 547 611 352 111 313
3194 313 318 40 65 58 361 -11 -348 -110 -115 -14 148 -61 2 -239 -18 116 144 -390 -159 -2 -142 -50 -468
3217 -468 -184 -48 -419 -235 -6 -210 -181 -615 -211 -133 -49 -131 -259 -295 -385 -406 -225 -400 -468 -248 -74 -343 -815
3240 -815 -324 -83 -257 -260 -130 -237 -135 -320 -526 -311 -60 -120 -192 -524 -290 -458 -91 -422 -109 43 -267
3261b67K36l75L22J40j67Q6L8R1n0p4j14l42M07L60k47p5j54N48k2k24O1J83p9
3284B82P6r8k23K69J55K6j25k97J45L47m37L2J39M89k08n08L5J16L23K0m37j41
3306b0K39J55Jp4O6K11k17k36J74k83M07%k53k15K77l4Q4j94o3M60p9k5l8m11
3330f8k04M80J19p13O13l60K4J48k85NK66R4l88j6L40k65L0J15k9k73K76r0l31
3353e12N44p0j87M5qj51l7r3O5j6J35l05J73n9J36j5q9l8K27L53k06k44p6O0N9
3378c09L49m68J00j18L59l11J78L7k29N36j1m85K1M40j14K4l98M55k69J97KJ95
3400A81n78M05K24k73l19N91j29J44J56m23L10k48K62m15J15L6M73l33M8QL16
3421E51n39J74P9N7q3j36J50J59k11J25l8n5M66j94J78m99j19L64Lj30j80L65
$$ plain form
3261 -267 -31 -406 -84 56 -111 -25 13 104 54 -20 -134 -476 -69 291 44 -31 -185 363 341 117 178 361 282
3284 282 358 260 37 306 461 487 362 65 210 557 120 152 291 780 572 64 99 215 538 558 121 -20
3306 -20 219 374 375 301 367 578 361 125 299 16 423 423 170 -45 232 198 282 88 25 485 406 381 343 -68
3330 -68 -272 208 327 -386 227 -133 -109 39 -246 -241 25 119 -269 -285 55 -210 -180 -65 -94 -367 -91 -181 -512
3353 -512 32 -38 -225 -180 -188 -339 -376 -469 -404 -420 -285 -590 -417 -476 -340 -355 -444 -482 -255 98 -108 -352 -428 -368 -309
3378 -309 40 -428 -328 -446 -87 -398 -220 -183 -412 124 113 -372 -351 89 -25 -1 -399 56 -213 -16 -14 181
3400 181 -397 8 232 -41 -360 231 102 246 402 -21 289 41 303 -112 3 39 512 179 227 235 551
3421 551 12 186 265 322 239 103 253 412 201 326 288 233 699 505 683 184 65 429 432 302 122 487
3443D87l13J24N1k70K47q4m15L29K53n21L20O2L6rr5j06j99K53j84N0j35L37q9
3466A29l24J19J35J9K22k50k20j27rP2P5L41l14Pl24J13J80K73l74M7j65q2J46
3489c11l08L64oL08k96j17J93nj29k43J10J74N8m1k22k2J05L93k80J83k64K16
3511a40M43m71%k71K07j37K69k5J72j26k04K9J5M30k72k30K94j7r0K79k40R2k62
3534b55R4P6L96k52L55Mm59J64P4J07l1k37KM42l09k10K15k50M31r7L3k70J90
3557B13k52K28Kk02K52J5J22l28L10K08r6r7j42l66N72l38j51K08J38m0K1j46
3579A31l3k35O70j23m30k51L49K27k87j81M32j78M8m03L04J52q0j7n15N68j92
3600d4j8K86m69L80j43m08K41k21J34mL37k99j82L01mk20o9J59J22j51j67K89
$$ plain form
3443 487 174 298 349 79 326 242 -173 156 409 -112 208 270 306 297 202 96 -103 150 -34 16 -119 218 129
3466 129 -195 -76 59 78 300 50 -170 -297 -306 -234 -159 182 -132 -125 -449 -336 -156 117 -257 -210 -375 -457 -311
3489 -311 -619 -255 -261 47 -249 -366 -173 -178 -307 -550 -440 -266 -208 -249 -471 -493 -388 5 -275 -92 -356 -140
3511 -140 303 -168 -168 -439 -232 -369 -100 -125 47 -79 -283 -254 -239 191 -81 -311 -17 -34 -124 155 -85 7 -255
3534 -255 -161 -85 311 59 414 418 -41 123 197 304 273 36 38 480 171 -39 176 -74 357 260 293 23 213
3557 213 -39 189 191 -11 241 256 378 50 360 568 472 375 233 -133 439 101 -50 158 296 256 277 131
3579 131 98 -137 533 410 -20 -271 78 305 18 -163 269 91 139 -264 40 192 112 95 -420 148 -44
3600 -44 -62 224 -245 135 -8 -416 -175 -396 -262 -266 71 -228 -410 -109 -113 -333 -402 -243 -121 -272 -439 -150
3622a50q2J88k21QJ41K54l47l45J68K30j32k80K54J52K15k05j2l04L15jp2j3k31
3645d70K79J82O9r3j98M76k00o9q1R5n3M06l67l22N52k43j48L49n42K82M46j93
3667A57Q0j60L8J67j56j69L8K2K89p1j38n5QK05p6N7R7O0J04m79L12J12m57K21
3691B06N4l12L15M19m57N2k0j10K12j61l15L47r3R7j19J29j20L67m49Q5j12M0
3713E5r9L13j73j91J40p8Q7j73n5K57L5l12o1L85j04m9j66L32l30K55j95P6J06
3736E5j48O0j61j43Q5J5J73K66m91k01L88k09M94k54k19K59l77J0L33m92K71l
3758b89j20K38L28j64k25n5L06j21M64o17K9K37l30M15j41J22l46Q1j24J62L09
3779A59j36J2l75M8J83l6l7j15J1M74L8n5Q1l65K76l90N42l2j55k58J57J38K05
$$ plain form
3622 -150 -232 -44 -265 -257 -116 138 -209 -554 -386 -156 -288 -568 -314 -162 53 -152 -164 -468 -153 -154 -226 -239 -470
3645 -470 -191 -9 60 -33 -231 245 45 -24 -105 -10 -63 343 -24 -346 206 -37 -185 164 -378 -96 350 157
3667 157 237 77 115 282 126 -43 -5 17 306 235 97 42 50 255 179 236 333 393 497 18 330 442 -15 206
3691 206 260 -52 263 682 225 277 257 147 359 198 -117 230 137 234 115 244 124 491 42 127 15 55
3713 55 -44 269 96 -95 45 -33 54 -119 -174 83 118 -194 -255 130 26 -23 -189 143 -187 68 -127 -51 55
3736 55 -93 -33 -194 -337 -252 -237 -64 202 -289 -490 -102 -311 183 -71 -290 -31 -408 -398 -65 -557 -286 -289
3758 -289 -409 -171 157 -7 -232 -287 19 -102 362 -255 -226 11 -319 96 -45 77 -269 -188 -312 -150 159
3779 159 23 35 -340 -292 -109 -145 -182 -297 -286 188 226 171 252 -113 163 -227 315 283 128 -130 27 165 370
3802C70l22K57j59k91L53r3K04l01J95j89K92J94k61j4J42p7P8k65J49j03J73
3823C32k47L45j23m6j80J45j25L8M10l5k80r8o5O3R5j22k34J24J07O4k68K42J64
3846C06L4l38L9J56j71K9k71N9K64q3J72j77k31J82N6q7l48M74j84J82j28k91
3868c56N9R1J79k52q0K03Lj16j19K15j76K09K03k24K2J01l34K98j82J7j7k38K56
3891b38Q3K40j72k85K87k51M43k45J1k52K33p3q8k0K69k45K98j78J3K46n9j69
3913a52l73L87j33J57N8M1j82K69k02J56l38J34J13K25k66K49j06K82l60K30l3
3934A56L3j80j5L27k11L67k07J2l25J21l3J59L02j30op8J24k45M5j83J41L19k88
3957B05m8K6K46m48K67l49K67Q2j19j5K40N3k36j43j20j25J57J4nj17l3L86o7
$$ plain form
3802 370 48 305 146 -145 208 115 319 18 213 24 316 510 249 235 377 300 378 113 262 159 332
3823 332 85 430 307 261 81 226 101 139 549 514 234 136 71 134 229 107 -127 -3 104 168 -100 142 306
3846 306 340 2 41 197 26 55 -216 -157 107 24 196 19 -212 -30 26 -61 -409 65 -119 63 -65 -356
3868 -356 -297 -206 -27 -279 -359 -156 -153 -269 -388 -173 -349 -140 63 -161 -139 -38 -372 -74 -256 -239 -256 -494 -238
3891 -238 -155 85 -87 -372 -85 -336 107 -138 -127 -379 -146 -219 -307 -327 -58 -303 -5 -183 -170 76 17 -152
3913 -152 -525 -138 -271 -114 -56 -15 -197 72 -130 26 -312 -178 -65 160 -106 143 37 319 -41 189 156
3934 156 189 9 -6 321 110 477 270 282 -43 78 45 204 506 376 370 292 416 171 216 33 174 493 205
3957 205 157 183 429 -19 248 -101 166 248 129 114 354 407 171 28 -92 -217 -60 -46 -51 -168 -201 185 118
3980A18l86N4K56M8k29J40j24J19j39j10L80j74L1k81J93m5L15j33l07K72J42
4001A40n7j34j41p3jL32k03j9k51J17K06j83q7K79J6j97jj85j9N79m40r4N2M59
4025I5Q6k20k21o3K23q1n0K21l19K17j73M0N6K55l15J29N7r3ll1J19J39K73m15
4049g4K21k79J70QL54l09k30J83M9K46j41n6m04L01J32r3K00j16j26K51p6N0O
4072B67j99Mr3J0L18o8n6j33J14N54m75K8J17k5j75l6j55M3K79j35P8k33N5J6
4096A00L9k48K40J82k20OO3J7j05j01j29K14L2n65N97j78l08L98Q7j37Q9j25J43
4119I1k54L30j14k19qJ09N6j29n5m8J9K10k88m3L18M0l61K29j97J80M0j93J42
4142a45K62k20K22l89J62J97j08k43p4J47k31N08m18o0M09j64p5j3P5O4K50l82
$$ plain form
3980 118 -268 -214 42 90 -139 1 -123 -4 -143 -253 127 -47 -16 -297 -104 -149 166 33 -274 -2 140
4001 140 83 -51 -192 -265 -266 66 -137 -156 -407 -290 -84 -267 -354 -75 -59 -256 -257 -442 -461 118 -322 -416 -364 95
4025 95 181 -39 -260 -323 -100 -181 -231 -10 -329 -112 -285 -245 -189 66 -249 -120 -63 -156 -159 -190 -71 68 341 -74
4049 -74 147 -132 38 46 400 91 -139 44 93 339 198 142 -262 39 171 78 278 162 36 287 211 261 267
4072 267 68 72 -21 -11 307 239 183 50 164 718 243 271 388 363 188 152 -3 40 319 184 262 29 84 100
4096 100 139 -109 131 313 93 99 162 179 74 -27 -156 58 90 -475 122 -56 -364 34 121 -16 73 -52 91
4119 91 -163 167 53 -166 -174 -65 -9 -138 -193 -241 -222 -12 -300 -343 -25 15 -346 -117 -314 -134 -94 -287 -145
4142 -145 117 -103 119 -270 -108 89 -19 -262 -336 -189 -420 88 -330 -390 19 -145 -220 -233 -158 -94 156 -226
4164b26N8K75j49L7k70M13l21K01k98kL91k05K5O5J44l59M35k94J38k0J02l21
4186a81m6K90n3k79J54L12L1j55j83M68k68Jl0j07K75k74J33J82O7j09nj29j53
4209e9L23K4n2j33J48ol05L44p0N4n5k94L75oK12l32k72J66Q4P1j25p8m8K75k42
4234aj86L33J33o1J20n47K91L04n64J84p3L35m82J25J35J2K91j84k17nP7j47J54
4257B7k08jj92K30J15M1k73P6K39j47o4L1j03J96j50M7K72q6k5j86O0m14O8K70
4281a77q1q0K45J46N5N8j54k00j33M37j36L88l87R0j13j19L64M8l01J54k82p8
4303b56j85K98K13m6N7J5J4k36J55j71L86J44m13j8M63m77k44K13L09j09J12j95
4325B9M9N7J24l19lN5L6L60l50p1R9l7on6J32J75l92J09J53J43j97J03j44j31
$$ plain form
4164 -226 -168 107 -42 -5 -275 138 -183 18 -280 -282 109 -96 -71 -6 138 -221 214 -80 58 38 140 -181
4186 -181 -227 63 10 -269 -115 197 228 73 -110 358 90 91 61 -46 229 -45 88 270 337 228 223 94 -59
4209 -59 264 288 236 103 251 245 -60 284 214 268 213 -81 294 288 500 168 -104 62 146 217 92 14 -34 241 -1
4234 -1 -187 146 279 218 338 -209 82 386 -178 6 -67 268 -214 -89 46 58 349 165 -52 -57 20 -127 27
4257 27 -181 -182 -374 -144 -29 12 -261 -185 54 -93 -157 -126 -229 -33 -183 -136 136 50 25 -161 -101 -515 -447 -177
4281 -177 -258 -338 -93 53 108 166 12 -188 -321 116 -20 368 -19 71 -42 -161 203 251 -50 104 -178 -256
4303 -256 -441 -143 70 24 81 96 110 -126 29 -142 244 388 -25 -43 420 -57 -301 -88 221 112 224 29
4325 29 78 135 259 -60 -63 -8 28 388 38 -33 66 29 23 -33 99 274 -118 -9 144 287 90 193 49 -82
4349h2R0k2m5K24j43l6L17k9j22n0o6j19J93q9j01Jq7P0O6j81J51k11L33j37O5
4374a0J39k59l9J37j33J78j37j44J13K09j79P9j0j01Q0j06l61P55j87l03N4J57
4396f8K12p8k27k09L67p1k67K68O8j26k33J03K20j42J90Lk85m3J76k75K29J39
4418d9P1M8j9k40K26l08Q7J27j06K74l28J37P3r0J95r5j20N9l6K54q9N5L8l60
4442a96M29j24K48l36K21k88L24j93N9n1PM18l26j43l0r9K0M90m74K16o0k07J25
4465C0K71q3l59Q9K55l02k0K35J26k37R2pj21J61k20N6K7J9K61n6k86K85j01j46
4489c1J87l41o2k8L89pj27M52m82K50j95%M1r1n8J53J63j15k07R1J29l17K31k7
4513bl67R5K07J0j76L17k01j48M3J27j45J50K25m31J76n7J65r0j45K57j37j19
$$ plain form
4349 -82 8 -14 -59 165 22 -14 303 274 152 102 36 -83 110 21 -80 -79 -166 -96 -30 -211 -60 -271 62 -75 -10
4374 -10 129 -130 -169 -32 -165 13 -124 -268 -155 54 -125 -46 -56 -157 -77 -183 -544 211 24 -279 -225 -68
4396 -68 144 66 -161 -370 -3 -74 -341 -73 -5 -131 -364 -261 -41 -183 7 10 -275 -318 -142 -417 -188 -49
4418 -49 22 70 51 -189 37 -271 -184 -57 -163 111 -217 -80 -7 -97 98 3 -117 -58 -94 160 71 126 164 -196
4442 -196 233 109 357 21 242 -46 278 85 144 93 100 518 192 49 19 -80 -60 430 -44 172 112 -95 30
4465 30 301 218 -141 -52 203 -99 -119 116 242 5 97 90 -31 130 -90 -34 -7 12 273 217 -69 216 115 -31
4489 -31 156 -185 -247 -275 114 107 -20 432 -50 200 5 5 46 -45 -103 50 213 98 -109 -18 111 -206 25 -2
4513 -2 -369 -274 -67 -57 -233 84 -117 -265 -222 -95 -240 -90 135 -296 -120 -177 -12 -102 -247 10 -127 -246
4535b46j7J49N6j56L39k59l05L77J2M2J5nj49N5R4k95J78j01k9K67o2J25l17M63
4559B31n11J98K50n1j49ljL21l92K89k99K91J21j80l64J49J61j26J35K61l28K4
4581B7K78N3l71L30l14n3L67l08J19J08j97J80j81K15n3J62k90Q3K14l8l00J19
4603A50J33J67k17o0j01l5K24k27J19n9J96j80l46K88mk10R6O1J79m8o2L9l97
4626b94N70l63J84m5j86K08j99p5J86j38K03l86L45p7j27k32J74j7j64J32J23
4647a78K57k81J4p4L41r6K0k28M40k50r5L68n74M27j69O4j34J62M6m09M90l68
4669b27m2J10K49q7k8k8j13K94p3k78K90j53J96k60j8j21J97L9k28K48j98K46
4691A5o4j44m1K53R5Qj03j00K49j00o7n9J90J0L3r2J59k5k41J98j82J10M8m9l31
$$ plain form
4535 -246 -263 -114 -58 -214 125 -134 -439 -62 -50 -8 7 2 -147 -92 2 -293 -115 -216 -245 22 -40 85 -232 231
4559 231 -280 -82 168 117 -32 -35 -36 285 -107 182 -117 174 295 115 -249 -100 61 -65 70 331 3 27
4581 27 305 358 -13 317 3 -50 317 9 128 236 39 219 38 253 200 362 72 155 369 331 31 150
4603 150 283 450 233 173 72 37 261 34 153 94 290 110 -236 52 48 -162 -66 -5 174 126 64 103 -294
4626 -294 276 -87 97 52 -134 74 -125 -200 -14 -152 51 -335 10 -67 -194 -426 -252 -269 -433 -301 -178
4647 -178 79 -202 -188 -262 79 -17 3 -225 215 -35 -130 238 -336 91 -78 -14 -148 14 60 -349 141 -227
4669 -227 -269 -159 90 3 -25 -53 -166 128 55 -223 67 -86 110 -150 -168 -289 -92 -53 -281 -33 -231 15
4691 15 -49 -193 -234 19 114 122 19 -81 168 68 1 -58 132 142 175 83 242 217 -24 174 -8 102 150 101 -230
4716b30J90J41j35j0m2L96l7k56K73l41l21L43J04k47M79l4j16J08m26K98J3j20
4738C0q6M01k08l90M69r2j41K04m7j20M7p9p9J49j84J83Qk18L11l83J31j4J37
4761B9j53r7K51j34j8J54j21K19j59N4j27J58K0jj96r2M00n26J00J67k3J6k2K13
4785A12j32L9l51Q0L51j68m9n1J72m0j74J65M6j9P5j02j5q7L11k44J5j97M07p1
4809G3%j39J87j54K41k57M5n7L32n07L36k28j0K24l40K88K7l3m8J19j04P2lj09
4833d5J20l14J76M48k05r9L1M2j34L14m28L46l8j19r4L22k52J06j99j6J01j01
4855c8J34K94j43P6l94K84k91K15K6L20l37O7K0m2p8J24k55L38k20k44J73O8l12
4878b15M98j32o2K7l27J98j52Q0j03o5K63N7k18J17K39o6j34N6j02Q2j32J39J65
$$ plain form
4716 -230 -40 101 -34 -44 -86 310 273 17 290 -51 -372 -29 75 -172 307 273 157 265 -161 137 150 30
4738 30 -56 345 137 -253 216 124 -17 187 140 20 67 -12 -91 58 -126 57 65 -153 158 -225 -94 -108 29
4761 29 -124 -221 30 -104 -122 32 -89 130 -29 25 -102 56 76 75 -121 -213 187 -339 -239 -72 -95 -79 -101 112
4785 112 -20 19 -332 -252 99 -69 -118 -169 3 -37 -211 -46 0 -19 56 -46 -61 -148 163 -81 -66 -263 144 73
4809 73 73 -66 121 -33 208 -49 -4 -61 271 -236 100 -128 -138 86 -254 34 61 28 -20 99 -5 67 64 -45
4833 -45 75 -239 -63 385 180 81 112 154 20 334 -94 252 214 95 1 323 71 177 -22 -38 63 -38
4855 -38 96 390 247 323 -71 213 -78 137 163 483 146 213 233 191 113 237 -18 320 100 -144 29 97 -215
4878 -215 283 151 89 116 -211 -13 -165 -85 -188 -253 10 67 -151 -34 205 139 5 61 -41 41 -91 48 213
4901B13k39J23N1l03J84n8R9j84q1N6J92O9N7j48l12L05L3l12kK66J3j22j44Q0
4925a64k27J93J24J4L22k96J57p9J21j12p1l18L28J62R1m05J65m3K36n3j16k15
4947a86L62R4k71Jk7K84j12l46K7J18K3l7J30j11J53l07K55n43M58L1j20L21k5
4970A72j29j58j8Q8K1R9J49k69K96o3k25J16R6j50L32l54K50l55L57r9j48J8O
4993C2j22j21K99j92K86m2r1O1j14M1L0n4K0J82n8m72K41J56R5j49l15K27pJ96
5017A29k9m18M15o0j29L14l62Q0L3L11r4L1l11o5K17j3J25n74L78j46J07j36K77
5040H0l47L08Jo0JQ9m81K23k6L1J93k93M55k61J42J36Q4m52K13J83l76n9Q5J79
5064D8n8j61O5O9q4PJ1n1K82j97Kk60K86k03L13L02l39q2K82l94N5j3N2K4%R5
$$ plain form
4901 213 -26 97 148 -155 29 -29 70 -114 -195 -139 53 122 179 31 -281 24 57 -255 -257 9 22 -100 -244 -164
4925 -164 -391 -198 -74 -60 262 -34 123 44 165 53 -18 -336 -8 154 245 -160 5 -38 198 145 29 -186
4947 -186 176 270 -1 0 -27 257 145 -201 -174 -56 -33 -70 60 -51 102 -205 50 -493 -35 -4 -124 197 172
4970 172 43 -115 -133 -45 -24 75 224 -45 251 188 -37 79 175 25 357 3 253 -102 255 156 8 26 32
4993 32 -90 -211 88 -104 182 140 49 110 -4 37 67 13 33 215 157 -315 -74 82 177 28 -287 -60 -67 129
5017 129 100 -318 97 37 -92 222 -140 -60 -27 284 190 221 -90 -155 62 49 174 -400 -22 -168 -61 -197 80
5040 80 -267 41 42 -18 -17 72 -409 -186 -212 -181 12 -281 174 -87 55 191 275 -177 36 219 -157 -216 -131 48
5064 48 -10 -171 -106 -37 -121 -114 -103 -154 128 -69 -67 -327 -41 -244 69 371 32 -50 232 -162 -107 -120 -68 -44 -44 51
5090E1j14k1M7K77n25M63o9j02j04K22k13K90j76J23l09J10k4K6J01L02n45K59
5112F9K6j31j17L34J74k94j68J84j56J59J01k81J20L4L54l56r0q7J32j20K59L4
5134A80m4j80j08L1K60J07l31p6J77K27k36j12O0K22j97j15l73M05J58j82K90
5155A63j77J45j20k82J50Nj00L1L54l79L21L2k13j32J60l9K49m59J38L22k00K16
5177A85j04k49N5j32K81j47N4n5Q3n9J01j2J81j78J88j99L59l01j24O8k84L82
5199I3j00Q0j92k06L20l35J93j24M24l01O4J12q5K75m22K83J5q0M7j52K30k02
5221f3j21O3K7j75K65J48j56n1J61l52J43K3K87n9j30o0L06k53o1N66m89j4J16
5244A21k42J8J10L6J14j19j14o9R1K41q3j13M2J04o8P0m8m9j65L09l60L04O5Q4
$$ plain form
5090 51 -63 -84 -37 240 -285 178 109 7 -97 125 -88 202 26 149 -160 -50 -74 -48 53 355 -190 69
5112 69 95 -36 -153 181 355 61 -107 77 -79 80 181 -100 20 54 408 52 -38 -125 7 -113 146 180
5134 180 136 -44 -152 -121 139 246 -85 -161 16 243 7 -105 -45 177 -20 -135 -508 -103 55 -127 163
5155 163 -14 131 11 -271 -121 -116 -216 -185 169 -210 111 143 -70 -202 -42 -81 168 -291 -153 169 -31 185
5177 185 81 -168 -113 -245 36 -111 -57 -112 -29 -88 13 1 182 4 192 -7 352 51 -73 -5 -289 93
5199 93 -7 73 -119 -325 -5 -340 -147 -271 153 -148 -84 28 -57 218 -204 79 94 14 61 -91 139 -63
5221 -63 -184 -121 -94 -269 -4 144 -12 -63 98 -254 -111 -88 199 140 10 -50 256 3 -58 508 19 5 121
5244 121 -121 -103 7 43 157 38 -76 -145 -54 187 104 -9 33 137 69 139 91 42 -123 186 -174 130 195 279
5268B79j45k71R2J24j74K5l5M5m4%J45k97M75j07l26R7K42l2k53J38J13K4j07
5291Hk80L17J93k05k6Q4j71K3J25l63M16m23M98m32J28K7j00K01j04k6J7j37K10
5314b0j44J93J8k4r5K67k79j09L27k57K17j94O3r8L46k90K37K3j12j52m9J96j5
5337D9p4K03j87j36L89l10J61o1J26K9l54J7N39o65L07K24K9k93J31k9j88K24
5359A31J04j06j21J23M6l86Q1nL34k3m0Q9k79J98n6j51J46n4P2q9m8J66k13J28
5383D7k59J42J18l17K92O9j46%j87K29L46j67l35n7J62N36m00j13J06O4j78J47
5405I9p5J09M3k40J44j02P1M6nJ5k12J81N2j06Pj25j27L23l7l47K53O7j86M35
5429B83l46p2Q1K57k56j19J25L3r1rK38k12j71J68r5J27J80l0p0j82J55Q1n6m
$$ plain form
5268 279 134 -137 -45 79 -95 -70 -105 -60 -104 -104 41 -256 219 112 -214 -117 125 93 -160 -22 91 115 8
5291 8 -272 45 238 33 7 91 -80 -57 68 -295 121 -302 196 -236 -108 -81 -181 20 -84 -110 -93 -230 -20
5314 -20 -164 29 47 23 -72 195 -84 -193 134 -123 94 -100 -37 -135 211 -79 158 181 69 -83 -132 64 49
5337 49 -25 178 -9 -145 244 -66 95 34 160 189 -165 -148 391 -274 33 257 286 -7 124 95 -93 131
5359 131 235 129 8 131 177 -209 -128 -133 201 178 138 227 -52 146 90 -61 85 31 103 14 -34 132 -81 47
5383 47 -212 -70 48 -269 23 92 -54 -54 -241 -12 334 167 -168 -225 -63 473 73 -40 66 130 -48 99
5405 99 24 133 176 -64 80 -22 49 95 90 105 -107 74 126 20 27 -98 -225 98 61 -286 -33 34 -152 283
5429 283 -63 -135 -54 203 -53 -172 -47 -14 -105 -114 124 -88 -259 -91 -186 -59 121 91 21 -161 -6 75 19 15
5453A5J2k55J17j57K63k92K93O8k58k19K98K10O6k01L1p4J73J2Q0l39K19P0O5
5476A97j88p4KK19k3KJ86l10K03j35k1j03l05M29L27k69n4k04K14l45M19l89K40
5499A8K3l4L0J03k41R0J21j44p3o7M91k24J77k01j03j02L23J02j68j35j95M1J06
5522f2K01k73J30j6k16J46Q6J30mk24k45L28Kj27L42j07m1p7r2J00k37M28m4k84
5546a56J30P8j06j50L06j36J97j41r6K9k31M2P9J08r7L18k5j62K87m05r2k1j48
5569c92M39j54j72K61j21oJ50k6J82j56K16n69J45Q4m7K34j27K32j03l31N02k98
5591e7M1n10P57l57J59l2pk21L34q0j32K98j85K38r0m7j12O6k99K36M1L6m4o3
5615c0L23j56K3j41k04M32j83J09j21J79r6j28j08K32R8j03k6j22RJ02j50N72
$$ plain form
5453 15 27 -228 -111 -268 -5 -297 -4 64 -194 -413 -115 95 161 -40 -9 -83 90 102 182 -157 62 132 197
5476 197 9 -65 -63 156 133 135 321 11 214 79 58 -45 -350 79 406 137 83 -121 93 -252 167 -222 18
5499 18 41 7 37 140 -101 -11 110 -34 -107 -174 317 93 270 69 -34 -136 187 289 121 -14 -209 -168 -62
5522 -62 139 -134 -4 -20 -236 -90 -4 126 122 -102 -347 -19 -17 -144 198 91 50 -27 -119 -19 -256 172 128 -156
5546 -156 -26 52 -54 -204 102 -34 163 22 -74 -45 -276 -234 -155 -47 -144 174 149 -13 274 -131 -223 -244 -392
5569 -392 47 -107 -279 -18 -139 -145 5 -21 161 5 221 -348 -203 -119 -166 68 -59 173 70 -261 241 -57
5591 -57 -16 -526 231 -126 33 1 -6 -227 107 27 -105 193 8 246 156 109 -3 63 -236 0 41 77 33 -30
5615 -30 293 137 160 19 -185 247 64 173 52 231 135 7 -101 131 229 126 100 -22 -13 89 -61 511
5637E11m56l07M06K33n33J77O4j80j46K27k64K29J58M3j49j32j26K92o5l17M24
5658H9J74o23K35L14m6J48m58M60l33N8N9j28K09J53k50Q0k71m05O07m1k75O2
5680a82K39l38K16lj43L31j04k16O6k14K45J63l67O8L91k02j79K11N8j99J7M7
5702i5K7L07l71K4J70l07K42r3n8m2M2L35k18Jn7N6Q2J38j84n7L6l0K32j56o7
5727d3J68J9K80j63l07L60j71J91k40J41j01j06j74J67O7j7o0m8M29m90L4j03
5749a67K93j54K95O2k71J33M8p4j90L8P0L9j3J78k43LK50m55J40J76m10M54l71
5772a69Q1L8k7P6m6J93PL7k16j20K60j64j18K70j27L10k49J67l11k27J51K22Q8
5795A26j60j62J80J69j03J76p1Mj67j49K06J55P0k27j25L33l38r9QJ48L2k27J11
$$ plain form
5637 511 55 -252 154 387 -146 31 95 -85 -231 -4 -268 -39 119 162 13 -119 -245 47 -18 -335 89
5658 89 263 -360 -125 189 143 291 -167 293 -40 18 77 -51 158 311 61 141 -130 -535 72 31 -244 -182
5680 -182 57 -281 -65 -68 -211 120 16 -200 -134 -348 -103 60 -307 -239 152 -50 -229 -18 40 -159 -142 -95
5702 -95 -68 239 -132 -108 62 -245 -3 -96 -154 -196 -154 181 -37 -36 -93 -37 45 183 -1 -58 -22 -52 180 24 -43
5727 -43 125 144 424 261 -46 314 143 334 94 235 134 28 -146 21 88 71 11 -37 392 -98 -64 -167
5749 -167 126 -28 267 329 58 191 239 165 -25 13 83 122 109 287 44 47 297 -158 -18 158 -252 202 -169
5772 -169 -88 -50 -77 -1 -47 146 153 190 -26 -146 114 -50 -168 102 -25 285 36 203 -108 -335 -184 38 126
5795 126 -34 -196 -16 153 50 226 155 159 -8 -157 49 204 274 47 -78 255 -83 -182 -174 -26 6 -221 -110
5818a10M62n66J93J67Q3j38j30l7J73k41R3r0R3Q2k52J45j53J47K11j8K16m30
5840a00j30K37J9j4n0m2j18J80o8J92o8j80K40m4j08l4l06J69J55K28k52J36k26
$$ plain form
5818 -110 352 -214 -21 146 229 91 -39 -76 97 -144 -51 -141 -48 34 -218 -73 -226 -79 132 114 330 -100
5840 -100 -230 7 26 12 -38 -80 -198 -18 -86 106 38 -142 98 54 -54 -88 -394 -225 -70 158 -94 42 -184
$$ [...]
8191f8
##END NTUPLES=NMR FID
##END=
