##TITLE=1H_Costus-F-acetone
 CDcl3, 8 sc, 
 30.5.2019
##JCAMPDX= 6.0         $$ Bruker NMR JCAMP-DX V2.0
##DATA TYPE= NMR FID
##DATA CLASS= NTUPLES
##ORIGIN= UXNMR, Bruker Analytische Messtechnik GmbH
##OWNER= root
$$ XWIN-NMR		Version 3.5
$$ Thu May 30 13:06:23 2019 Russian Standard Time (UT+4h)  she@DPX200
##.OBSERVE FREQUENCY= 200.13155
##.OBSERVE NUCLEUS= ^1H
##.DELAY= (6, 6)
##.ACQUISITION MODE= SIMULTANEOUS
##.ACQUISITION SCHEME= undefined
##.AVERAGES= 8
##.DIGITISER RES= 18
##SPECTROMETER/DATA SYSTEM= spect
##.PULSE SEQUENCE= zg30
##.SOLVENT NAME= CDCl3
##.SHIFT REFERENCE= (INTERNAL, CDCl3, 0, 15.7039)
##AUDIT TRAIL= $$ (NUMBER, WHEN, WHO, WHERE, WHAT)
$$ ##TITLE= Audit trail, XWIN-NMR		Version 3.5
$$ ##JCAMPDX= 5.01
$$ ##ORIGIN= Bruker BioSpin GmbH
$$ ##OWNER= she
$$ F:/spectra/data/she/nmr/H-F/1/audita.txt
$$ ##AUDIT TRAIL=  $$ (NUMBER, WHEN, WHO, WHERE, WHAT)
(   1,<2019-05-30 13:04:50.56 +0400>,<she>,<DPX200>,
      <created by zg, POWCHK disabled, PULCHK disabled
       configuration hash MD5:
       00 E9 B6 7A A2 85 ED C7 34 08 36 98 17 FE 4E 26
       data hash MD5: 16K
       33 21 16 B4 D2 42 26 AE EE 07 C9 42 BC 5A F0 68>)
$$ ##END=
$$ 
$$ hash MD5
$$ 4F 92 4A 1C F6 C1 91 0C 00 55 F9 60 2E 91 60 A5
##$RELAX= 
##$RELAX= 
##$RELAX= 
##$RELAX= 
##$RELAX= 
##$RELAX= 
$$ Bruker specific parameters
$$ --------------------------
##$DU= <F:/spectra>
##$EXPNO= 1
##$NAME= <H-F>
##$PROCNO= 1
##$TYPE= <nmr>
##$USER= <she>
##$AMP= (0..31)
100 100 100 100 100 100 100 100 100 100 100 100 100 100 100 100 100 100 
100 100 100 100 100 100 100 100 100 100 100 100 100 100 
##$AQSEQ= 0
##$AQ_mod= 1
##$AUNM= <au_zg>
##$AUTOPOS= <>
##$BF1= 200.13
##$BF2= 200.13
##$BF3= 200.13
##$BF4= 200.13
##$BF5= 200.13
##$BF6= 200.13
##$BF7= 200.13
##$BF8= 200.13
##$BYTORDA= 1
##$CFDGTYP= 0
##$CFRGTYP= 5
##$CHEMSTR= <none>
##$CNST= (0..31)
1 1 145 1 1 1 1 1 1 1 1 1 1 1 1 1 1 1 1 1 1 1 1 1 1 1 1 1 1 1 1 1 
##$CPDPRG= <>
##$CPDPRG1= <>
##$CPDPRG2= <>
##$CPDPRG3= <>
##$CPDPRG4= <mlev>
##$CPDPRG5= <mlev>
##$CPDPRG6= <mlev>
##$CPDPRG7= <mlev>
##$CPDPRG8= <mlev>
##$CPDPRGB= <>
##$CPDPRGT= <>
##$D= (0..31)
0 1.2 0 0 0 0 0 0 0 0 0 0.03 0 0 0 0 0 0 0 0 0 0 0 0 0 0 0 0 0 0 0 0 
##$DATE= 1559207089
##$DBL= (0..7)
120 120 120 120 120 120 120 120 
##$DBP= (0..7)
150 150 150 150 150 150 150 150 
##$DBP07= 0
##$DBPNAM0= <>
##$DBPNAM1= <>
##$DBPNAM2= <>
##$DBPNAM3= <>
##$DBPNAM4= <>
##$DBPNAM5= <>
##$DBPNAM6= <>
##$DBPNAM7= <>
##$DBPOAL= (0..7)
0.5 0.5 0.5 0.5 0.5 0.5 0.5 0.5 
##$DBPOFFS= (0..7)
0 0 0 0 0 0 0 0 
##$DE= 6
##$DECBNUC= <off>
##$DECIM= 24
##$DECNUC= <off>
##$DECSTAT= 4
##$DIGMOD= 1
##$DIGTYP= 9
##$DL= (0..7)
0 120 120 120 120 120 120 120 
##$DP= (0..7)
150 150 150 150 150 150 150 150 
##$DP07= 0
##$DPNAME0= <>
##$DPNAME1= <>
##$DPNAME2= <>
##$DPNAME3= <>
##$DPNAME4= <>
##$DPNAME5= <>
##$DPNAME6= <>
##$DPNAME7= <>
##$DPOAL= (0..7)
0.5 0.5 0.5 0.5 0.5 0.5 0.5 0.5 
##$DPOFFS= (0..7)
0 0 0 0 0 0 0 0 
##$DQDMODE= 0
##$DR= 18
##$DS= 0
##$DSLIST= <SSSSSSSSSSSSSSS>
$$ [...]
##$SUBNAM2= <"">
##$SUBNAM3= <"">
##$SUBNAM4= <"">
##$SUBNAM5= <"">
##$SUBNAM6= <"">
##$SUBNAM7= <"">
##$SUBNAM8= <"">
##$SUBNAM9= <"">
##$SW= 24.9336996594482
##$SWIBOX= (0..15)
0 0 2 0 0 0 0 0 0 0 0 0 0 0 0 0 
##$SW_h= 4990.01996007984
##$TD= 16384
##$TD0= 1
##$TE= 0
##$TE2= 300
##$TE3= 300
##$TEG= 300
##$TL= (0..7)
0 120 120 120 120 120 120 120 
##$TP= (0..7)
150 150 150 150 150 150 150 150 
##$TP07= 0
##$TPNAME0= <>
##$TPNAME1= <>
##$TPNAME2= <>
##$TPNAME3= <>
##$TPNAME4= <>
##$TPNAME5= <>
##$TPNAME6= <>
##$TPNAME7= <>
##$TPOAL= (0..7)
0.5 0.5 0.5 0.5 0.5 0.5 0.5 0.5 
##$TPOFFS= (0..7)
0 0 0 0 0 0 0 0 
##$TUNHIN= 0
##$TUNHOUT= 0
##$TUNXOUT= 0
##$USERA1= <user>
##$USERA2= <user>
##$USERA3= <user>
##$USERA4= <user>
##$USERA5= <user>
##$V9= 5
##$VALIST= <valist>
##$VCLIST= <CCCCCCCCCCCCCCC>
##$VD= 0
##$VDLIST= <DDDDDDDDDDDDDDD>
##$VPLIST= <PPPPPPPPPPPPPPP>
##$VTLIST= <TTTTTTTTTTTTTTT>
##$WBST= 1024
##$WBSW= 4
##$XGAIN= (0..3)
0 0 0 0 
##$XL= 0
##$YL= 0
##$YMAX_a= 135209
##$YMIN_a= -238866
##$ZGOPTNS= <>
##$ZL1= 120
##$ZL2= 120
##$ZL3= 120
##$ZL4= 120
##$ABSF1= 10
##$ABSF2= 0
##$ABSG= 5
##$ABSL= 3
##$ALPHA= 0
##$AQORDER= 0
##$ASSFAC= 0
##$ASSFACI= 0
##$ASSFACX= 0
##$ASSWID= 0
##$AUNMP= <proc_1d>
##$AZFE= 0.1
##$AZFW= 0.1
##$BCFW= 1
##$BC_mod= 2
##$BYTORDP= 1
##$COROFFS= 0
##$CY= 11.3945322036743
##$DATMOD= 1
##$DC= 2
##$DFILT= <>
##$DTYPP= 0
##$F1P= 18.9103706918063
##$F2P= -1.10871071338519
##$FCOR= 0.5
##$FTSIZE= 0
##$FT_mod= 4
##$GAMMA= 1
##$GB= 0.15
##$INTBC= 1
##$INTSCL= 1
##$ISEN= 128
##$LB= 0.24
##$LEV0= 0
##$LPBIN= 0
##$MAXI= 10000
##$MC2= 0
##$MEAN= 0
##$ME_mod= 0
##$MI= 1.114404
##$NCOEF= 0
##$NC_proc= 0
##$NLEV= 6
##$NOISF1= 3.799351
##$NOISF2= 2.8
##$NSP= 1
##$NTH_PI= 0
##$NZP= 0
##$OFFSET= 15.70392
##$PC= 1
##$PHC0= -8490.524
##$PHC1= 4.20023
##$PH_mod= 1
##$PKNL= yes
##$PPARMOD= 0
##$PSCAL= 0
##$PSIGN= 0
##$REVERSE= no
##$SF= 200.130013532006
##$SI= 16384
##$SIGF1= 3
##$SIGF2= 2
##$SINO= 400
##$SIOLD= 16384
##$SREGLST= <1H.CDCl3>
##$SSB= 0
##$STSI= 0
##$STSR= 0
##$SW_p= 3612.71676300578
##$SYMM= 0
##$S_DEV= 0
##$TDeff= 0
##$TDoff= 0
##$TI= <>
##$TILT= no
##$TM1= 0
##$TM2= 0
##$TOPLEV= 0
##$USERP1= <user>
##$USERP2= <user>
##$USERP3= <user>
##$USERP4= <user>
##$USERP5= <user>
##$WDW= 1
##$XDIM= 8192
##$YMAX_p= 0
##$YMIN_p= 0
$$ End of Bruker specific parameters
$$ ---------------------------------
##NTUPLES= NMR FID
##VAR_NAME=  TIME,          FID/REAL,        FID/IMAG
##SYMBOL=    X,             R,               I
##VAR_TYPE=  INDEPENDENT,   DEPENDENT,       DEPENDENT
##VAR_FORM=  AFFN,          ASDF,            ASDF
##VAR_DIM=   8192,          8192,            8192
##UNITS=     SECONDS,       ARBITRARY UNITS, ARBITRARY UNITS
##FACTOR=    0.0002004,     1,               1
##FIRST=     0,             0,               0
##LAST=      1.6414764,     0,               0
##MIN=       0,             -238866,         0
##MAX=       1.6414764,     135209,          0
$$ Real data points
##PAGE= N=1
##DATA TABLE= (X++(R..R)), XYDATA
$$ [...]
2451C11r7J121K50j040r01N76O55j17j129l22R68J37k84j431M12J031k35r16r35
$$ 311 214 1335 1585 545 -356 220 875 758 -371 -693 275 412 128 -1303 -891 140 -95 -1011 -1946
2470a946J106P18n17j403J28J860j16j785l33J450O47j368q27R77O05J33j335
$$ -1946 -840 -122 -639 -2042 -1914 -54 -170 -1955 -2288 -838 -191 -1559 -2386 -1409 -804 -671 -2006
2487b006J15J240L68n05p32Q2J115P68j210n17P16J349m83j756P97J917Q8j499
$$ -2006 -1891 -651 -283 -788 -1520 -1438 -323 445 -765 -1282 -566 783 300 -1456 -659 1258 1346 -153
2505a53l57J744N81q61n43N25P07J04n69l47P24R11o36q82Q3J113N13j384p71
$$ -153 -510 1234 1815 954 411 936 1643 1747 1178 831 1555 2466 1830 948 1031 2144 2657 1273 502
2524E02P96J161k91k085P44R74o5j718l57J085M60p20j337O14J000n40j491l40
$$ 502 1298 2459 2168 83 827 1801 1736 18 -339 746 1206 486 -851 -237 763 223 -1268 -1608
2542a608O41P32p15p00m56Q40O48q62j384Q58J250p18j337L2J776j35j394m91
$$ -1608 -967 -235 -950 -1650 -2106 -1266 -618 -1480 -2864 -2006 -756 -1474 -2811 -2779 -1003 -1138 -2532 -3023
2560c023J420O94l13r34O82Q28M71j043l32R14Q67N6o16l06J379J098j200n05
$$ -3023 -1603 -909 -1222 -2156 -1474 -646 -175 -1218 -1550 -636 231 287 -329 -635 744 1842 642 137
2578A37J101J432r25j212P17J552K5j533l82J506N83r18q20K58J033r7p51r00
$$ 137 1238 2670 1745 533 1250 2802 2827 1294 912 2418 3001 2083 1263 1521 2554 2457 1706 806
2596H06N20J074o18j173r3R53J55j451j077P31R09n40j432l15J435j62j293n16
$$ 806 1326 2400 1782 609 516 1469 1624 173 -904 -173 736 196 -1236 -1551 -116 -278 -1571 -2087
2614b087P85P59j233p04L02M79L07n95q36O84J033n29r16k7J122Q02j120p03J247
$$ -2087 -1302 -543 -1776 -2480 -2178 -1699 -1392 -1987 -2823 -2139 -1106 -1635 -2551 -2578 -1456 -654 -1774 -2477 -1230
2633a230J255n84j314N39J983j63q88m57J114R79m25q09L65J120M32j216m33J022
$$ -1230 25 -559 -1873 -1334 649 486 -402 -859 255 1234 809 0 365 1485 1917 701 268 1290
2651A290J297n70r80P1Q86N92j155p01R35J179q62j097q2J257j21r44o08L99Q14
$$ 1290 2587 2017 1037 1108 1994 2586 1431 730 1665 2844 1982 885 803 2060 1939 995 387 786 1600
2670A600q64q21r8P36L13q63j150J001N91m18j301l4J014L81r07j117M94J107
$$ 1600 736 -85 -183 553 866 3 -1147 -146 445 27 -1274 -1308 -294 87 -820 -1937 -1443 -336
2688c36l12j152k79J569j16m98r48P24P21m05q13j8J027O70o27r17M73J138k01
$$ -336 -648 -1800 -2079 -510 -626 -1124 -2072 -1348 -627 -1032 -1845 -1863 -836 -166 -793 -1710 -1237 -99 -300
2707c00q19j43J108O95p15q53O38J518k53j205k39J649N6n52o50M48R43Nr52o2
$$ -300 -1119 -1262 -154 541 -174 -1027 -389 1129 876 -329 -568 1081 1137 585 -65 383 1326 1331 379 317
2727C17J000P31q32j039L77J237k11j236R3J023N90j003p67N67J012K9j734mQ00
$$ 317 1317 2048 1216 177 554 1791 1580 344 437 1460 2050 1047 280 847 1859 1888 154 150 950
2746I50K75n66q30K50J149n34j246k22Q85O17q70j274M81Q92j70j336j89J125
$$ 950 1225 659 -171 79 1228 694 -552 -774 111 728 -142 -1416 -935 -43 -213 -1549 -1738 -613
2764f13L68p96r89L01O57L00j216k64J015P39j093q06Q13J192j70j527K20O86
$$ -613 -245 -1041 -2030 -1729 -1072 -772 -1988 -2252 -1237 -498 -1591 -2397 -1584 -392 -562 -2089 -1869 -1183
2782a183J063m85q15N07J160r1q31oJ071M99m94o46L83J155K66n96o12R16J008
$$ -1183 -120 -605 -1420 -913 247 156 -675 -681 390 889 395 -251 132 1287 1553 957 345 1261 2269
2801B269n24q88L54R50K62r90o43J298N36j238p67N81J052k44j238j40L28P57
$$ 2269 1745 857 1211 2161 2423 1433 790 2088 2624 1386 619 1200 2252 2008 770 630 958 1715
2819A715q61q25J05P34R8j409m59M12R44o68j288J67J027k80j388k20J054N31
$$ 1715 854 29 134 868 966 -443 -902 -490 454 -214 -1502 -1335 -308 -588 -1976 -2196 -1142 -611
2837f11q22q12K02R31r5j263q1Q27N88n44n11M6J212J55p57j92P44J075m68q62
$$ -611 -1433 -2245 -2043 -1112 -1207 -2470 -2551 -1724 -1136 -1680 -2191 -2145 -933 -778 -1535 -1727 -983 92 -376 -1238
2857a238L68J147K26p98j52J076J130p85o69O56J050j1j256k1J141P62p17r66
$$ -1238 -870 277 503 -295 -447 629 1759 974 305 961 2011 2000 744 723 1864 2626 1909 943
2875I43J12J185K69q80p18P72N15o93q83K46J143k21j419k74O63O09j038q53J82
$$ 943 1055 2240 2509 1629 911 1683 2198 1505 622 868 2011 1790 371 97 760 1369 331 -522 -340
2894c40P43j75q56m33M66Q39j198o64k66R40L63j184p13J160Q64p51j170L17J055
$$ -340 403 228 -628 -1061 -595 244 -954 -1618 -1884 -944 -581 -1765 -2478 -1318 -454 -1205 -2375 -2058 -1003
2913a003Kq60l06R16R81q71j44r0J126L81j109j88O46R91j03r78J1J317M48p71
$$ -1003 -1001 -1861 -2167 -1251 -270 -1141 -1285 -1375 -249 132 -977 -1165 -519 472 369 -609 -598 719 1167 396
2933C96n26N72J189o61o86K06J162J71r60o69J006O27m09j088N16J005J26q95
$$ 396 -130 442 1631 970 284 490 1652 1823 863 194 1200 1827 1418 330 846 1851 1977 1082
2951A082n46M50O79l14r84j35Q23M45j155p06O73J243r05j364J59J249R1j226
$$ 1082 536 986 1665 1351 367 232 1055 1500 345 -361 312 1555 650 -714 -555 694 785 -441
2969d41q26J240M67o76r18J1P96K94p88o61N62O86m17p57j75R54K94q31r44J037
$$ -441 -1267 -27 440 -236 -1154 -1143 -347 -53 -841 -1502 -940 -254 -671 -1428 -1603 -649 -355 -1186 -2130 -1093
2989a093Q71m26q55k29J272M09r29n23P31Q18l65q92Q5J299L16n65l24K83R95
$$ -1093 -222 -648 -1503 -1732 -460 -51 -980 -1503 -772 46 -319 -1211 -1126 173 489 -76 -400 -117 878
3008H78m63n55L2R30K72n91p77J161P29j60j095J67J195N48j416l58P73P88m68
$$ 878 415 -140 -108 822 1094 503 -274 887 1616 1456 361 528 1723 2271 855 497 1270 2058 1590
3027A590j037N9Q89L7n19p86O20Q91j82j120ON48j18p97m69N21L58q1j436j56
$$ 1590 553 612 1501 1538 1019 233 853 1744 1562 442 448 996 878 81 -388 133 491 410 -1026 -1182
3047a182J080K60q22r35N30R14o38r97n6R22k34n95n03P65O02o50m23k22P40O11
$$ -1182 -102 158 -664 -1599 -1069 -155 -793 -1790 -1846 -924 -1158 -1753 -2256 -1491 -889 -1539 -1962 -2184 -1444 -833
3067h33n42o34P40Q74L68j187l4R10P79o66o33N84J369j81q60l3J356n0o9p96
$$ -833 -1375 -2009 -1269 -395 -27 -1214 -1248 -338 441 -225 -858 -274 1095 914 54 21 1377 1327 1258 462
3087D62N79J258m44n16l26Q70L71l65q19L05Q44m88r21R5Q81K87q73p79L69P20
$$ 462 1041 2299 1855 1339 1013 1883 2254 1889 1070 1375 2219 1731 810 905 1786 2073 1200 421 790 1510
3107A510m08j151l5P11k3q67p21L79P10m99q62r6M97K76o61j041N46P49Q6j038
$$ 1510 1102 -49 -84 627 604 -263 -984 -605 105 -394 -1256 -1352 -855 -579 -1240 -2281 -1735 -986 -900 -1938
3127a938n13J043O17p55n79M09J082k16j325M88R49L07m03n72N45O25Q6m22k92
$$ -1938 -2451 -1408 -791 -1546 -2125 -1716 -634 -850 -2175 -1687 -738 -431 -834 -1406 -861 -236 -150 -572 -864
3146h64Q33R56l94q52M66J007K30r67l28J102Q45o88n63L13J034m25r37l9J231
$$ -864 -31 925 531 -321 145 1152 1382 415 87 1189 2034 1346 783 1096 2130 1705 768 729 1960
3165A960k8o17p87O20O85m42r87k2N67L84l12r25j22P92K40j240l11O45O28q95
$$ 1960 1932 1315 528 1148 1833 1391 404 382 949 1333 1021 96 -26 766 1006 -234 -545 100 728 -167
3185a67j014L24R95m87j027k71J130N43q85o10M07O80l14l05q40O59Q90m61q21
$$ -167 -1181 -857 138 -349 -1376 -1647 -517 26 -859 -1469 -1062 -382 -696 -1001 -1841 -1182 -292 -753 -1574
3204a574k20J432K39j203l72J026J243j022q98M25J393k75j162M70O89O55o91
$$ -1574 -1794 -362 -123 -1326 -1698 -672 571 -451 -1349 -924 469 194 -968 -498 191 846 155
3221A55p54M23Q56j01j25m99O50N93j21q73K44R83K20j173n17J313M40p60o90
$$ 155 -599 -176 680 579 454 -45 605 1198 1077 204 448 1431 1651 478 -39 1274 1714 954 264
3240B64J96R92J44j294J44Q45L72q73l39k63O13J91n78l94J16N93j40j107jQ71
$$ 264 460 1452 1596 302 446 1291 1663 790 451 188 801 992 414 20 136 729 589 -518 -519 352
3260C52N09j332p96Q84O09o26j036O50P59k28q94m02O90N66n54n72pN60K38m91
$$ 352 861 -471 -1267 -383 226 -400 -1436 -786 -27 -255 -1149 -1551 -861 -295 -849 -1421 -1428 -868 -630 -1121
3280a121o78L97R50j96j016J39Q47Q35j134n65J147P54o58q64O60J090J99r64
$$ -1121 -1799 -1402 -452 -648 -1664 -1525 -678 157 -977 -1542 -395 359 -299 -1163 -503 587 786 -178
3298a78l08Q58O07M7o32K08O10K67k38m36J28J261k89j039n9R66L58j048o39O18
$$ -178 -486 372 979 1026 394 602 1212 1479 1241 805 933 2194 1905 866 807 1773 2131 1083 444 1062
3318A062J049o83q88Q0P38P6j055k50P51J09o88n78q5K34M91p04m73l36P11J55
$$ 1062 2111 1428 540 620 1358 1434 379 129 880 989 301 -277 -362 -128 363 -341 -814 -1150 -439 -284
3338b84j066n01J049N20j169m64L27J054q11q85K94Q95%r64J95K63J091k98n39
$$ -284 -1350 -1851 -802 -282 -1451 -1915 -1588 -534 -1345 -2230 -1936 -1041 -1041 -2005 -1810 -1547 -456 -754 -1293
3357a293k50Q59J88l50m45N57J214k77m04r7R78O60r86l88O89J349p45p71J5J392
$$ -1293 -1543 -684 -496 -846 -1291 -734 480 203 -201 -298 680 1340 354 -34 655 2004 1259 488 503 1895
3377A895j29m35n01K12O66J05o23k99O86L45n01r68L32N28K17j328m21J092N06
$$ 1895 1766 1331 830 1042 1708 1813 1190 891 1577 1922 1421 453 785 1313 1530 202 -219 873 1379
3396A379r61q92O46N00p64m45m6M33K99q33n71O4Q71k90o27j27N44K55l85j186
$$ 1379 418 -474 172 672 -92 -537 -583 -150 149 -684 -1255 -1191 -320 -610 -1237 -1364 -820 -565 -950 -2136
3416b136P48Q39k60p23k40R09N71q17n90Q88L50J06n83p4J187lo82M6L91O77J65
$$ -2136 -1388 -549 -809 -1532 -1772 -863 -292 -1109 -1699 -811 -461 -355 -938 -1012 175 172 -510 -464 -73 604 769
3437G69o05o66R12Q46q38n37M04J184k46j026P1Q30L75n66q06N77J113l58n88
$$ 769 164 -502 410 1256 418 -119 285 1469 1223 197 268 1098 1473 907 101 678 1791 1433 845
3456H45n84Q41K26o23o39O00N17l14q68j21P36O31r89p03M50O87m57m75k57L95
$$ 845 261 1102 1328 705 66 666 1183 869 1 -120 616 1247 258 -445 5 692 235 -240 -497 -102
3476a02M31o88p12M63J91K05p85qM35N47o11l59j33P37Q6q61k30P75N63l67q99
$$ -102 329 -359 -1071 -608 -417 -212 -997 -1005 -570 -23 -634 -993 -1126 -389 -303 -1164 -1394 -619 -56 -423 -1322
3497a322K56O99%p97q0Q28N61n93m32L16Q64j20p93j18O71O46k25q02M86M80M98
$$ -1322 -1066 -367 -367 -1164 -1244 -416 145 -448 -880 -564 300 180 -613 -731 -60 586 361 -441 45 525 1023
3518A023q86k09O85O53q38l51K31Q31j1p13N0N97L72j72n78j80Q01J23j026o15
$$ 1023 137 -72 613 1266 428 77 308 1139 1128 415 465 1062 1434 1262 684 504 1305 1428 402 -213
3538b13Q79O95m94r95K80R09J61j176l25L48M91l32q20J41M37J02p20p43P77K77
$$ -213 666 1361 867 -128 152 1061 1222 46 -279 69 560 228 -592 -451 -14 88 -632 -1375 -598 -321
3558c21m73p17J37Q61Q3j057l38Q63L74m87p24K6R99M06r78k59P67P54p54n56
$$ -321 -794 -1511 -1374 -513 -430 -1487 -1825 -962 -588 -1075 -1799 -1773 -774 -368 -1346 -1605 -838 -84 -838 -1394
3578a394M07J134j59j96n25Q88O04o42k40p3J204J72m47o61P35Q31k96p89L20
$$ -1394 -987 147 -12 -208 -733 155 759 117 -123 -196 1008 1180 733 72 807 1638 1342 553 873
3597H73R43j00o23k99N02M74m00l36o2K59K60o12j96J11K77l68p16K4P03p9m33
$$ 873 1816 1716 1093 794 1296 1770 1370 1034 972 1231 1491 879 683 794 1071 703 -13 11 714 635 202
3618B02r29L73M75m54p09O9O35K84j322J52M17j1j39o80j11R07j3m87q93R98N55
$$ 202 -727 -354 121 -333 -1042 -973 -338 -54 -1376 -1224 -807 -818 -957 -1637 -1748 -841 -854 -1341 -2234 -1236 -681
3639f81k06n95n9Q78M40p07j84J039M90q58n48N22P96O4l80k61N15J122p43n45
$$ -681 -887 -1482 -1541 -663 -223 -930 -1114 -75 415 -443 -991 -469 327 391 11 -250 265 1387 644 99
3659I9K14O88M97n31p20M41P45j48m60l63R59j2m24r12R58O00l09j121K7O77J42
$$ 99 313 1001 1498 967 247 688 1433 1285 825 462 1421 1409 985 73 1031 1631 1322 201 228 905 1047
3680A047p87j50K97L78n05n58r6L86N64q67m08q2J026m67q35k16J273J53j118
$$ 1047 260 110 407 785 280 -278 -374 12 576 -291 -699 -781 245 -222 -1057 -1273 0 153 -965
3699i65k70J46J044l89j036J14J171j37p66l37P57M00l23o16K03M19J044j022
$$ -965 -1235 -1089 -45 -434 -1470 -1356 -185 -322 -1088 -1425 -668 -268 -591 -1207 -1004 -585 459 -563
3717e63m96K28J331n38o16M2O85Q19q07n83K47P62j57m90j82R00L0k18n72O18
$$ -563 -1059 -831 500 -38 -654 -612 73 892 85 -498 -251 511 354 -136 -318 582 612 394 -178 440
3737D40O49j01l82l84L44O20l84j82j35R00k88n78k99N55O99j111k77N69K43l28
$$ 440 1089 988 606 222 566 1186 802 620 485 1385 1097 519 220 775 1474 363 86 655 898 570
3757E70p67K78L38N50o98n89L64M20j00p90p8L46L90q6j251K64P54N4r53j62Q09
$$ 570 -197 81 419 969 271 -318 46 466 366 -424 -502 -156 234 148 -1103 -839 -85 -31 -984 -1146 -337
3778c37N3n40o24O21M77k8r59n7Q58L29n37p74K26J012M3j020N16J73O40m42l60
$$ -337 -284 -824 -1448 -827 -350 -378 -1337 -1394 -536 -207 -744 -1518 -1292 -280 -237 -1257 -741 -568 72 -370 -730
3799g30M62Q73j42n71n53J173K10m56n11N40Q79m4n03n17J114K22m44n73M90M87
$$ -730 -268 605 463 -108 -661 512 722 266 -245 295 1174 1130 627 110 1224 1446 1002 429 919 1406
3819A406j97o46j04P70K38l64o77K17M48K08j065j90N44O78r70p11K26R18k41
$$ 1406 1209 563 459 1229 1467 1103 426 643 1091 1299 234 44 588 1266 296 -415 -189 729 488
3838D88q11o78P01O41r39p84N25Q56o12p89k15P03L79n49l64m6O66Mo58k10N48
$$ 488 -323 -1001 -300 341 -598 -1382 -857 -1 -613 -1402 -1617 -914 -535 -1084 -1448 -1494 -828 -824 -1482 -1692 -1144
3859a144N56k55n97K84P61L37j010k06J087J39P1p11N64Q65Q9q91j11N51R55m54
$$ -1144 -588 -843 -1440 -1156 -395 -58 -1068 -1274 -187 -48 23 -688 -124 741 830 -61 -172 379 1334 880
3879H80p25O47M37N65j071j92O36J43K16j017J50J124j88o55n61P10J09m46m96
$$ 880 155 802 1239 1804 733 541 1177 1320 1536 519 669 1793 1605 950 389 1099 1208 762 266
3898B66J38O38K04j156m02O32J15l85l80m33Q62r5p13o18P99M02l36j121L89R68
$$ 266 404 1042 1246 90 -312 320 435 50 -330 -763 99 4 -709 -1327 -528 -126 -462 -1583 -1194 -226
3918b26j45p18m09O62M17n14m90L33O25j83l66j20O56J70K99q24Q9M70K48m67
$$ -226 -371 -1089 -1498 -836 -419 -933 -1423 -1090 -465 -648 -1014 -1134 -478 -308 -9 -833 -744 -274 -26 -493
3938d93l38R05M47k36o04K36P95P4p83j82L69P50j46n18O6M53M86n03l39J75N74
$$ -493 -831 74 521 285 -319 -83 712 786 3 -179 190 940 794 276 342 795 1281 778 439 614 1188
3959A188k81o89J45R36k5l58j137N98O57l22q05J53Q46pq47m78M65N23o11m70
$$ 1188 907 218 363 1299 1274 916 -221 377 1034 712 -93 60 906 899 52 -426 39 562 -49 -519
3979e19L50M33l33j72l90m2R07k30m84n33P76M23j008l22M63N40J4q74j77N36
$$ -519 -169 264 -69 -241 -631 -673 234 4 -480 -1013 -237 186 -822 -1144 -681 -141 -127 -1001 -1178 -642
3999f42O05q36j98O07N58k20q82L09M71N7k54n09O16J68L72q27J71L65P88o51
$$ -642 -37 -873 -1071 -464 94 -126 -1008 -699 -228 -171 -425 -934 -318 -150 222 -605 -434 -69 719 68
4019F8n64N91O92k7j051K13R36K53p53o12J068L31k15p32J71N47N10r53j55L16
$$ 68 -496 95 787 760 -291 -78 858 1111 358 -254 814 1145 930 198 369 916 1426 473 318 634
4039F34M25L49r38k09M70L98o85o38M82Q94n26r27K24N81m3k94j061O42N93l32
$$ 634 1059 1408 470 261 731 1129 444 -194 288 1182 656 -271 -47 534 491 197 -864 -222 371 39
4059C9q48N4L52J49k80n30N60J12k41m91k90N99j12L5k24l61J136o2r70K66P04
$$ 39 -809 -755 -403 -254 -534 -1064 -504 -392 -633 -1124 -1414 -815 -927 -892 -1116 -1477 -341 -403 -1373 -1107 -403
4080d03L29q42k61N62N91O4p96K7N28M16k12j24J51M90J07l20nL32N06m86m24
$$ -403 -74 -916 -1177 -615 -24 40 -756 -729 -201 215 3 -121 30 520 627 307 302 634 1140 654 230
4101B30N15M91L34j185p2J210k98m77k17K59M15j07m64r7L18L70o11n19J68M15
$$ 230 745 1236 1570 385 313 1523 1225 748 531 790 1205 1098 634 537 855 1225 614 95 263 678
4121F78l43n73k04M58N03o46p88K27O22M3j294K63J89M40m60n37L36L85j47m09
$$ 678 335 -238 -442 16 519 -127 -915 -688 -66 -23 -1317 -1054 -865 -425 -885 -1422 -1086 -701 -848 -1257
4141a257LN82J23m02n62L10N67K37p06N1O03M08k55n66M78Q23l32m25k75P38R94
$$ -1257 -1254 -672 -549 -951 -1513 -1203 -636 -399 -1105 -1054 -451 -43 -298 -864 -386 437 105 -320 -595 143 1137
4162A137p21l30M85L53l1m37k16N80O63n79m92L6P75j10p95k85P51N57o12o23
$$ 1137 416 86 571 924 893 456 240 820 1483 904 412 448 1223 1113 318 33 784 1341 729 106
4182A06M64O08l12m94o5K31J48n04l65K17J16j8n71J0K26J40l2o12o5O26K29j130
$$ 106 570 1178 866 372 307 538 686 182 -183 34 150 132 -439 -429 -203 -63 -95 -707 -772 -146 83 -1047
4204a047N8M73L66m23n51L18M62k72l05k02O27L7o7m39Q9Q26j88l51j44N18M44
$$ -1047 -989 -516 -150 -573 -1124 -806 -344 -616 -921 -1123 -496 -459 -526 -965 -876 -50 -238 -589 -733 -215 229
4225B29j53p48K91L58L25m89l04K72P80m67k81K61K56L32m12k76M09M44l50o29
$$ 229 76 -672 -381 -23 302 -187 -491 -219 561 94 -187 74 330 662 250 -26 383 827 477 -152
4245a52L66N95M6n95k46M99L36J41r56N09L09J61n22l43M66K21m28n23n2R60k19
$$ -152 214 809 855 260 14 513 849 990 34 543 852 1013 491 148 614 835 407 -116 -168 792 573
4266E73l88k71kN63m65k17M5J8N23q58j34K38N99l33p93q6M29M84n37j99J47L31
$$ 573 185 -86 -88 475 10 -207 -162 -144 379 -479 -613 -375 224 -109 -902 -988 -559 -75 -612 -811 -664 -333
4288c33j56o76M8Q73j40l28m76O13L23j05p73N29N18j34k93j79M39K90qm10M6
$$ -333 -489 -1165 -1117 -244 -384 -712 -1188 -575 -252 -357 -1130 -601 -83 -217 -510 -689 -250 40 32 -378 -332
4309c32O43L06l40m42O42M27j26q17O99L46P5m29m83N91L16J0p95L63N22k50m26
$$ -332 311 617 277 -165 477 904 778 -39 660 1006 1081 652 169 760 1076 1086 291 654 1176 926 500
4330E00J03J35N71l76o93Q8K98K69p42l94N23L21k94m89l33N93K88q31k68M2N28
$$ 500 603 738 1309 933 240 328 626 895 153 -241 282 603 309 -180 -513 80 368 -463 -731 -689 -161
4351a61j93p09j95P38J46m40m38m0N94j53o98N14J94N95q34j20L64N50J41p45
$$ -161 -354 -1063 -1258 -520 -374 -814 -1252 -1292 -698 -851 -1549 -1035 -841 -246 -1080 -1200 -836 -286 -145 -890
4371h90j69J035L3L7l76M14J72J90o82j4O20L85l16l34L98L98k8l25M4Q57k75
$$ -890 -1059 -24 9 46 -330 84 256 446 -236 -250 370 755 439 105 503 901 873 548 592 1449 1174
4392A174j57p14O67M51n25o75L97N38q9l51n38K30K43j81l82P7L61J76n35n77
$$ 1174 1017 303 970 1421 896 221 618 1156 1067 716 178 408 651 470 88 165 526 702 167 -410
4412d10J36O67j80q83j14M10K49n62l55K17L52J15o13K45J21K99k30n50K2P59
$$ -410 -274 393 213 -670 -784 -374 -125 -687 -1042 -825 -473 -358 -971 -726 -605 -306 -536 -1086 -1064 -305
4432c05J4p75q2O77M05n86m39O77M75j8p39M14J13N58m36p6K35L38J55p46L60
$$ -305 -291 -1066 -1148 -471 -66 -652 -1091 -414 61 43 -696 -282 -169 389 -47 -123 112 450 605 -141 219
4453B19M86J08l45p28Q43K95o5m88j03O08J43l68l77K31L51J52n20k50K87O31
$$ 219 705 813 468 -260 583 878 813 325 222 830 973 605 228 459 810 962 442 192 479 1110
4473A110p66l94K29M18Q3n94k98K94O18n16l74r3M35n2n85K91LL40q60k28M82
$$ 1110 344 -50 179 597 680 86 -212 82 700 184 -190 -283 152 100 -485 -194 -191 149 -711 -939 -457
4494d57K17J53o17k2L57K61p6q38M03L55n9o65l5Q23R4k08o80M89K52J74m38k24
$$ -457 -240 -87 -704 -726 -369 -108 -184 -1022 -619 -264 -323 -988 -1023 -200 -106 -314 -994 -505 -253 -79 -517 -741
4516g41P63K9j26n01M57N02j64n62Q3J48N94l0n72J39R6N91m32k91M77L36m8n79
$$ -741 22 51 -75 -576 -119 383 219 -343 -260 -112 482 452 -120 19 115 706 274 -17 460 796 748 169
4538A69O7P37L2l42n19O19J79k92m89J46N14L2o35M0L03M2r1m49m7P90L3p82m29
$$ 169 236 973 1005 663 144 763 942 650 161 307 821 853 218 258 561 603 512 63 16 806 839 57 -372
4561c72L58L92m85m15L00K14J95q59m12O61J40k19m37K29J60k19k07o2P1N26n9
$$ -372 -14 378 -107 -522 -222 -8 187 -672 -1084 -423 -283 -502 -939 -710 -550 -769 -976 -1038 -967 -441 -500
4582e00q34M75L30K28o29m7O37L91l08l11j77J001j22n49m8M33L31R1m95K75K46
$$ -500 -1334 -859 -529 -301 -930 -977 -340 51 -257 -568 -745 256 134 -415 -463 -30 301 392 -103 172 418
4603D18N55m91k89N70K76l67l78L11M84pm88j29J65O55n37j16k05P65j97k91p42
$$ 418 973 482 193 763 1039 672 294 605 1089 1082 594 465 630 1285 748 632 427 1192 995 704 -38
4624c8K85M51j46l24l60P62k66p83m5L50K03n00q13N03M62L56p88l75M27L60m16
$$ -38 247 698 552 228 -132 630 364 -419 -464 -114 89 -411 -1224 -721 -259 97 -691 -1066 -639 -279 -695
4645f95k55m63R74J43m93k53L0M75J81m66M9N70P4n95J01K97M76l32l89J49N83
$$ -695 -950 -1413 -439 -296 -789 -1042 -1012 -537 -356 -822 -773 -203 -129 -724 -623 -326 150 -182 -571 -422 161
4666A61M32k87l17R7L75J06m33K36N80M7m23m54N01J90J39o14O3R1O95m30n54
$$ 161 593 306 -11 86 461 567 134 370 950 997 574 120 621 811 950 336 399 490 1185 755 201
4687B01N09j59j33j88j74L58K57o59P5K36M6j1p57q4N03K73n42o27K17P68l95
$$ 201 710 551 418 230 56 414 671 12 87 323 369 358 -399 -483 20 293 -249 -876 -659 109 -286
4708b86p90M24L51K10m96k59K30J28L00p44J10N82J81n36j26J69K06R3o97Q1N86
$$ -286 -1076 -652 -301 -91 -587 -846 -616 -488 -188 -932 -822 -240 -59 -595 -721 -552 -346 -253 -950 -869 -283
4729b83M52m17o54M61O77m09k34K63M62N6l35k64l4P35r7m39J0O07P0k46m79M79
$$ -283 169 -248 -902 -441 236 -173 -407 -144 318 374 39 -225 -259 476 379 -60 -50 557 627 381 -98 381
4751C81L12j51j53m07O31K33k44o96M40M64k18k59j01K69K18m20o9o3M60j78n10
$$ 381 693 542 389 -18 613 846 602 -94 346 810 592 333 232 501 719 299 230 167 627 449 -61
4772f1o0l9P12n65l74K28K30R6m87m17M85K17l32l87J14O89l79m91J64K41M49
$$ -61 -121 -160 552 -13 -387 -159 71 167 -320 -737 -252 -35 -367 -754 -640 49 -330 -821 -657 -416 33
4793C3q03J8J29M48j23n82j06L93M18j88l71K25L40K63q25r6O61M12l70l15J02
$$ 33 -770 -752 -623 -175 -298 -880 -986 -593 -175 -363 -734 -509 -169 94 -731 -827 -166 246 -124 -439 -337
4814c37Q95j5o17JL78M37n44j97L23R9L40m94p3K04O80k60m31J78L85n7k10j63
$$ -337 558 543 -74 -73 305 742 198 1 324 423 763 269 196 400 1080 820 389 567 952 895 685 522
4836E22n0N81m42n60L51N53k31m04j13K08l2n5n76K64K51q5n78j88K38K17p4m50
$$ 522 472 1053 611 51 402 955 724 320 207 415 383 328 -248 16 267 182 -396 -584 -346 -129 -203 -653
4858f53M1K01q9l34j59J33M50j30n60k4O05N5o60L08M03N9n7n92J84O97J08l00
$$ -653 -612 -411 -500 -834 -993 -860 -410 -540 -1100 -1124 -519 -464 -1124 -816 -413 -354 -411 -1003 -819 -122 -14 -314
4880c14l41L15O63j41n39J57N63L25n32k01L07O96j63o48O13L06k34n20Q2L37
$$ -314 -655 -340 323 182 -357 -200 363 688 156 -45 262 958 795 147 760 1066 832 312 394 731
4900G31L00k49o11L41N43l59j04l99N5P94o69l86K96M25n5n38j86K14K10m97k87
$$ 731 1031 782 171 512 1055 696 592 193 248 1042 373 -13 283 708 653 115 -71 143 353 -144 -431
4921d31Q1K76k30J24m65k1K73m8l87N5N1L73m68J51l6M07M2l31l32Q43k62n07
$$ -431 -350 -74 -304 -180 -645 -666 -393 -441 -828 -773 -722 -349 -817 -666 -702 -295 -253 -584 -916 -73 -335 -842
4943h42j46O40L39k66j16m6M18J15k23J5K03k10M55m42K38L49j01j69k5L18Q5
$$ -842 -988 -348 -9 -275 -391 -437 -19 96 -127 -112 91 -119 336 -106 132 481 380 211 186 504 589
4964E89O0m97J75R9P27o00o45R26j39k84r9r7L35J97k16n72N51J54m2l78k34J01
$$ 589 649 152 327 426 1153 553 -92 834 695 411 312 215 550 747 531 -41 510 664 622 244 10 111
4986A11N17q23r8J89M43Q2j138K81M25K99o37k59M02J78k09n89J06N94l7m49j07
$$ 111 628 -195 -293 -104 339 421 -717 -436 -11 288 -349 -608 -206 -28 -237 -826 -720 -126 -163 -612 -719
5007g19M65R2k23l92OL63M33m15m08J98Q00o19m5RN62J18l45k27K06K45j13n52
$$ -719 -254 -162 -385 -777 -771 -408 25 -390 -798 -600 200 -419 -464 -455 107 225 -120 -347 -141 104 -9 -561
5029e61N23M5L62k44k31L47n1j58k93J94N20M0j23l87M57N87l08m99J07N76pn19
$$ -561 -38 7 369 125 -106 241 190 32 -261 -67 453 493 370 -17 440 1027 719 220 327 903 896 377
5051C77l24L66L58m37l42M49J07O4m09k21J40N05l33l51n95O48L8l74O5o4N84
$$ 377 53 419 777 340 -2 447 554 618 209 -12 128 633 300 -51 -646 2 40 -334 -269 -333 251
5072B51q1o03j02L33J69k34n18l9O86k55o33K10N39O6l32p58P15L77o0o78J68
$$ 251 170 -433 -535 -202 -33 -267 -785 -824 -138 -393 -1026 -816 -277 -211 -543 -1301 -586 -209 -269 -947 -779
5093g79M62L1o7j23J97N79l95n70O89K8M24k47m33L19L61j2k72j61N43J43m31
$$ -779 -317 -286 -353 -476 -279 300 -95 -665 24 52 476 229 -204 115 476 464 192 31 574 717 286
5114B86m0L95M9L32o31l8K75L58j75m54L04j86K93p71J73L66j13l34N0L2J76o7
$$ 286 246 641 690 1022 391 353 628 986 811 357 661 475 768 -3 170 536 423 89 139 171 347 280
5136B80o61L2J64J31q6l53j3L01K93o79j24L26M1m43k0J18K78K2j45m02K98L27
$$ 280 -381 -349 -185 -54 -140 -493 -506 -205 88 -591 -715 -389 -348 -791 -811 -693 -415 -393 -538 -940 -642 -315
5158c15k83j18L05M00k87J5k80M09L94m43l18L14K84J57o18K71K31O02l28k14
$$ -315 -598 -716 -411 -11 -298 -283 -563 -154 240 -203 -521 -207 77 234 -384 -113 118 720 392 178
5178A78N35J56m71j31r0N36j0P5m20n0M98j39r3k93L29L16l36n32K41J59K41o26
$$ 178 713 869 398 267 177 713 703 778 358 308 806 667 574 281 610 926 590 58 299 458 699 73
5200G3j97M64K80m01n07k8N85j05o34K52J54nk12m50M29J53r2k19l16K02K83j71
$$ 73 -124 340 620 219 -288 -316 269 164 -470 -218 -64 -69 -281 -731 -302 -149 -241 -460 -776 -574 -291 -462
5222d62k96L48M76j87m57o9K77L13l24p2J89K25J58l63n15O06K36k66l27J33M83
$$ -462 -758 -410 66 -121 -578 -647 -370 -57 -381 -453 -264 -39 119 -244 -759 -153 83 -183 -510 -377 106
5243A06K30l30k15J72M27k70n02K75L55L88k94k24L04K88j32n41l6M89K92n87
$$ 106 336 6 -209 -37 390 120 -382 -107 248 636 342 118 422 710 578 37 1 490 782 195
5263A95K44m05N79Q7p35J38N27Rj90n76L68L26j96k74j52K88J55n38l0J70L20
$$ 195 439 34 613 700 -35 103 630 639 449 -127 241 567 371 97 -55 233 388 -150 -180 -10 310
5284C10k12m34K6M91k62k22k36K23K97m28K16k31L84K3k6o17J91K17J05o20K39
$$ 310 98 -336 -310 181 -81 -303 -539 -316 -19 -447 -231 -462 -78 -55 -81 -698 -507 -290 -185 -805 -566
5305e66L12j39k64j67P51j35J36m71R6N55j16l5k30L27J41n4m29k54O86L19m30
$$ -566 -254 -393 -657 -824 -73 -208 -72 -543 -447 108 -8 -43 -273 54 195 141 -288 -542 144 463 33
5326C3j07K34O76k81m69P2K44J88j13k78K97K09L02o65m5K13n4K60n93M70K3n4
$$ 33 -74 160 836 555 86 158 402 590 477 199 496 705 1007 342 297 510 456 716 123 593 616 562
5348E62l16K06m15O21q10Km1N27q4m01l43M53r0k79k98J92r9J65l37J56M69J07
$$ 562 246 452 37 658 -152 -150 -191 336 252 -149 -492 -39 -129 -408 -706 -514 -613 -448 -785 -629 -160 -53
5370e3l30l23J45J98k21j07n4M37O3j70q9J17N73l01j50q2K35P3j14k81M22M45
$$ -53 -383 -706 -561 -363 -584 -691 -745 -308 -245 -415 -504 -387 186 -115 -265 -347 -112 -39 -153 -434 -12 433
5392D33l65jK14p9K76J29n78N32m6L37q54j7N59L89k59k80K04M04j72l98m29O35
$$ 433 68 67 281 202 478 607 29 561 515 852 -2 -19 540 929 670 390 594 998 826 428 -1 634
5414F34j82p4k15q8O92n75j06m14Q04k52l28k56O7L56k66l59J81J08O3n6l90L98
$$ 634 452 378 163 75 767 192 86 -328 476 224 -104 -360 -293 63 -203 -562 -381 -273 -210 -266 -656 -258
5436b58k06J8k24J8K47M70p39j4m7P48l02l03J66n7K66j98k55K93L60n6k09J23
$$ -258 -464 -446 -670 -652 -405 65 -674 -688 -735 13 -289 -592 -426 -483 -217 -415 -670 -377 -17 -73 -282 -159
5458a59N03L2k53k64L44J52J48m27P5rL04Q7n28L26N36l98l30k8M20K13m40j14
$$ -159 344 376 123 -141 203 355 503 76 151 142 446 533 5 331 867 469 139 111 531 744 304 190
5480A90K98K66k10k97L6M5k6j82N6m9L28m3l45j33K74K16j11o40J6O21n15n0j45
$$ 190 488 754 544 247 283 328 302 120 176 127 455 412 67 -66 208 424 313 -327 -311 310 -205 -255 -400
5503d00K72J13k99o9n9M59j62j97j60N1L84n0l30R2J72j79M9k97L11M48j95o99
$$ -400 -128 -15 -314 -383 -442 17 -145 -342 -502 -451 -67 -117 -447 -355 -183 -362 -313 -610 -299 149 -46 -745
5525g45M05L33J05n30O4p1N14j36l54J13L66J19l44pL14J7L61j022K77N01J44
$$ -745 -340 -7 98 -432 -368 -439 75 -61 -415 -302 64 183 -161 -168 146 163 524 -498 -221 280 424
5546D24n83Q2O54J39m67n8j31O20m53o4p8J95K91l23R5l27M73K67o72l14L44J67
$$ 424 -159 -77 577 716 249 191 60 680 227 163 85 280 571 248 343 16 489 756 84 -230 114 281
5568B81J30l94K07O1j9k48j12k39N59l19j82J2L63k19n61L18Q6J84l78l6k08K87
$$ 281 411 17 224 285 266 18 -94 -333 226 -93 -275 -263 100 -119 -680 -362 -276 -92 -470 -506 -714 -427
5590d27J01J2n10J64J75K95k36q9N04j98R2j21R7O8Q0n59K93O15l25j24P4j12
$$ -427 -326 -314 -824 -660 -485 -190 -426 -515 -11 -209 -117 -238 -141 -73 7 -552 -259 356 31 -93 -19 -131
5612a31N66mk17q5n1M56k05j35K98J93l39l10K42L17M47p85m5L18M10p07J81l38
$$ -131 435 431 214 129 78 534 329 194 492 685 346 36 278 595 1042 257 212 530 940 233 414 76
5634G6O18j45j80l31J16K49q0l09L9l0J17l51j5k71O20k61m97P2L7K84k47o8j9
$$ 76 694 549 369 38 154 403 323 14 53 23 140 -211 -226 -497 123 -138 -635 -563 -526 -242 -489 -557 -576
5657e76M74m49J73m40K69K56m12R4J1K11k1M7r4K23L32k45l42L61M75l86m7l38
$$ -576 -102 -551 -378 -818 -549 -293 -705 -611 -600 -389 -410 -363 -457 -234 98 -147 -489 -128 347 -39 -86 -424
5679d24N01M27l67k00M59J61k97j0OM56J51l21m60R9K57J85m65n6M64M7j91l07
$$ -424 77 504 137 -63 396 557 260 250 256 712 863 542 82 181 438 623 158 102 566 613 422 115
5701A15j32N27j19l45J78m4K54k15m68L73Qj10k31L2J38J46k83m03L9L63j60K23
$$ 115 -17 510 391 46 224 180 434 219 -249 124 132 22 -209 -177 -39 107 -176 -579 -540 -177 -337 -114
5723a14m97K94L48m41o9K23J84l2l51k5K50J03m70K52L24k96K76k05k35L61J31
$$ -114 -611 -317 31 -410 -479 -256 -72 -104 -455 -480 -230 -127 -597 -345 -21 -317 -41 -246 -481 -120 11
5744A1j96l4P7K27J81k58m82L72L82j48j44J17M48k56m76J33O35k21l97l60M05
$$ 11 -185 -219 -142 85 266 8 -474 -102 280 132 -12 105 553 297 -179 -46 589 368 -29 -389 16
5765A6O88l09j49j73N43k90K0n43O21P6l4m82K30O6j3j2l19%J17N21o22r8J77
$$ 16 704 395 246 73 616 326 346 -197 424 500 466 -16 214 280 267 255 -64 -64 53 574 -48 -146 31
5788C1M27n47k28K57J10R1p5o50M61R0l20J75n18N41J03l38o4j2N7n5J39l09N11
$$ 31 458 -89 -317 -60 50 141 66 -584 -123 -33 -353 -178 -696 -155 -52 -390 -454 -466 -409 -464 -325 -634 -123
5811a23q6l97j08M04K89n2o40L29K99j79j27q6L39K12j7l06J85K64Q9m26L77k
$$ -123 -209 -606 -714 -310 -21 -73 -713 -384 -85 -264 -391 -477 -138 74 57 -249 -64 200 289 -137 240 238
5833B38M49m68k54P3M58nl8k25J02J31k00N0R7L14k03k81J19K02O7j81l90J87
$$ 238 687 219 -35 38 496 491 453 228 330 461 261 311 408 722 519 238 357 559 626 445 55 242
5855B42%J50j76k88J57J68k35l26J51K71N0l95j46L47k2j28n8l12K32q2m2j30
$$ 242 242 392 216 -72 85 253 18 -308 -157 114 164 -231 -377 -30 -52 -180 -238 -550 -318 -400 -442 -572
5877e72q5M01j89m8r7L99K37n92k24L18L52k76o8K24L7m6K14j87L00L62q3p68
$$ -572 -657 -256 -445 -493 -590 -191 46 -546 -770 -452 -100 -376 -444 -220 -183 -229 -15 -202 98 460 377 -391
5899c91N20J32J77l27j34J67N61m22o0K38j47L91n97R7L11LO4k17O2J87J54k35
$$ -391 129 261 438 111 -23 144 705 283 223 461 314 705 108 205 516 519 583 366 428 615 769 534
5921E34k29o1K33pl58J63l74K49L5n40M23N4j74k11j54L01K72n49j35N04q5o0
$$ 534 305 244 477 470 112 275 -99 150 185 -355 68 122 -52 -263 -417 -116 156 -393 -528 -24 -109 -169
5943a69n79M90m3M43p39j95M77N70j94n76L6K82K28j83l56N05K07m17j92j85Q27
$$ -169 -748 -258 -301 142 -597 -792 -315 255 61 -515 -479 -197 31 -152 -508 -3 204 -213 -405 -590 237
5964B37k59l08J63M76q3K25o98L94P3p8O6j04J53N32o75N7J64J3J91m88K17l7
$$ 237 -22 -330 -167 309 226 451 -247 147 220 142 208 104 257 789 114 171 335 348 539 51 268 231
5986B31K94J2k63l65N67J16j27p36L69R9j76l05J02L49J43k90l34K76M67k35l88
$$ 231 525 537 274 -91 476 592 465 -271 98 197 21 -284 -182 167 310 20 -314 -38 429 194 -194
6007a94Mk30M61J82o77J69J78k28M13l84K61j01l82m2L46J46O0n47j2M20K82n60
$$ -194 -190 -420 41 223 -454 -285 -107 -335 78 -306 -45 -146 -528 -570 -224 -78 -18 -565 -577 -157 125 -435
6029d35K0M98J16m55j10J39K02J68k12n6j3K80K2l49K68LL08m64p4K95N53o94
$$ -435 -415 83 199 -256 -366 -227 -25 143 -69 -125 -138 142 164 -185 83 86 394 -70 -144 151 704 10
6051A0J66M7J03J88j94l37K78L63k84k14P6J36M5o5j00r1K62O6l92L39j09R1N5
$$ 10 176 223 326 514 320 -17 261 624 340 126 202 338 383 318 218 127 389 455 63 402 293 384 439
6074D39n65n8O07m9n87K61J76J98n78J24r0J93j4k76l14N52j38j55r4J52q7Jr0
$$ 439 -126 -184 423 374 -213 48 224 422 -156 -32 -122 71 57 -219 -533 19 -119 -274 -368 -216 -303 -302 -392
6097c92m62M17L13k29l09J17L31J88k01j82J5O09n35O2K6K37P8m60K18P9K4q4
$$ -392 -854 -437 -124 -353 -662 -545 -214 -26 -227 -409 -394 215 -320 -258 -232 5 83 -377 -159 -80 -56 -140
6119a40J72j6N40j76m27o1L70K4K83l6m70K74q5K72j67j56M93o5m47o5O25k71
$$ -140 32 16 556 380 -47 -108 262 286 569 533 63 337 252 524 357 201 694 629 182 117 742 471
6141D71m06n0J45K20q5l92J96J93l77q3L2K10N9rp97J99M71k00j03l05J4L96k69
$$ 471 65 15 160 380 295 -97 99 292 -85 -168 -136 74 133 124 -673 -474 -3 -203 -306 -611 -597 -201 -470
6164d70J00j40J37K9k3k35L53O7l08r4P9N13k79j36j6L05K74k94J45l38M74L32
$$ -470 -370 -510 -373 -344 -367 -602 -249 -182 -490 -584 -505 8 -271 -407 -423 -118 156 -138 7 -331 143 475
6186D75o64kJ40M87j05k11J37M49l60l13p2M96Kj68j02L3L80j77R8l57L71K2k76
$$ 475 -189 -191 -51 436 331 120 257 706 346 33 -39 457 459 291 189 222 602 425 523 166 537 559 283
6209B83l81nK95L26m46j08K43J01r2k37j87K56J24k56l55M67m2J00n52J83M05
$$ 283 -98 -103 192 518 72 -36 207 308 216 -21 -208 48 172 -84 -439 28 -14 86 -466 -283 122
6230A22j44k20j81M27l08j40J6QL21m14K28m26L36L07l97P1j10L72J76J38n03
$$ 122 -22 -242 -423 4 -304 -444 -428 -420 -99 -513 -285 -711 -375 -68 -465 -394 -504 -132 44 182 -321
6251c21J30N39l46k43Q0L72K4p7n9j14L61J51n58K0K86O9J60p39J99M96j89k82
$$ -321 -191 348 2 -241 -161 211 235 158 99 -15 346 497 -61 -41 245 314 474 -265 -66 430 241 -41
6273d1J05P8O24p26m2K01N61l99o35L44L60P7k33K4j7R0k87j62QJ00r6J34j27
$$ -41 64 142 766 40 -2 199 760 361 -274 70 430 507 274 298 281 371 84 -78 -70 30 -66 68 -59
6296e9o9L55k44j55p9L87K80o83r7L21l11N43p66J06K29k00O0j1j07J31K06k31
$$ -59 -128 227 -17 -172 -251 136 416 -267 -364 -43 -354 189 -577 -471 -242 -442 -382 -393 -500 -369 -163 -394
6318c94K86l2J63m25q9L09J16Q3n29K98J27O9j01k20p6O15k30o9j00K21M00m53
$$ -394 -108 -140 23 -402 -491 -182 -66 17 -512 -214 -87 -18 -119 -339 -415 200 -30 -99 -199 22 422 -31
6340c1R4J71j44J83k2K4K70j04N6m46J81kL30n07K22N6J42j19l23k3M33o5l84
$$ -31 63 234 90 273 251 275 545 441 497 51 232 230 560 53 275 331 473 354 31 8 441 376 -8
6363hj80P28k83rl24K59j96L96o93j45M39j28p8J10J1N8j15j33m6k69J71p0l88
$$ -8 -188 540 257 248 -76 183 -13 383 -310 -455 -16 -144 -222 -112 -101 -43 -158 -291 -337 -606 -435 -505 -893
6386h93Q01K3l87Mj91M55k1J5m87P20k89L46o31K26M2O73m32k91N3P88j32k26
$$ -893 -92 -69 -456 -452 -643 -188 -209 -194 -681 39 -250 96 -535 -309 -267 406 -26 -317 -264 524 392 166
6408A66m9J06J6K8l24M03J78j94l45J79K85R7l8k31J58n4L51m99R1j0J27k91k25
$$ 166 117 223 239 267 -57 346 524 330 -15 164 449 546 508 277 435 381 732 233 324 314 441 150 -75
6431g5j15N99l34k29L4j27M70m94p2K07J44m7m18K68N3K5k15l30K38K96k39n6
$$ -75 -190 409 75 -154 -120 -247 223 -271 -343 -136 8 -39 -457 -189 -136 -111 -326 -656 -418 -122 -361 -417
6453d17L36Mk53k34K32q5J15J45l83J77J29M02l9l45p8M77n3l90J88L62r8j01
$$ -417 -81 -77 -330 -564 -332 -417 -302 -157 -540 -363 -234 168 129 -216 -294 183 130 -260 -72 290 192 91
6475I1l94K86J20J05j01R9L3P6Lm96M18J40r1k08n1K29K07lk38j6L83k28l10q9
$$ 91 -303 -17 103 208 107 206 239 315 318 -178 240 380 289 81 30 259 466 463 225 209 592 364 54 -35
6499c5L51L08n75k67L04J79K40n20J52m3j79L98k75k17L17K07o30O4J13J05r8
$$ -35 316 624 49 -218 86 265 505 -15 137 94 -85 313 38 -179 138 345 -285 -221 -108 -3 -101
6520a01J52l89K47l12k29M82j98O03n46L7j20L78k0n42P6L0M71Ln58K62l0M70
$$ -101 51 -338 -91 -403 -632 -150 -348 255 -291 -254 -374 4 -16 -558 -482 -452 19 22 -536 -274 -304 166
6542A66m26r4K79J23J15m80N76J1j23n85N55k71N43j59j23j24L23k3j26J38l1
$$ 166 -260 -354 -75 48 163 -317 259 270 147 -438 117 -154 389 230 107 -17 306 283 157 295 264
6563B64M9j12j02M6K19K0k41P5j8L22j77m30M26o0K72k82l82K46Q9j15j88N2J41
$$ 264 313 201 99 145 364 384 143 218 200 522 345 -85 341 281 553 271 -111 135 224 109 -79 -27 114
6586A14J32j74j34K7j37K00l80k02O62k74j93M3j59R1L51k51j90M98Kn15L84l51
$$ 114 246 72 -62 -35 -172 28 -352 -554 108 -166 -359 -316 -475 -384 -33 -284 -474 24 26 -489 -105 -456
6608d56K62J23k90k03K11K84Jl97M50o0L6j08P7k0L38l31K70k57L79J17m65r9
$$ -456 -194 -71 -361 -564 -353 -69 -68 -465 -15 -75 -39 -147 -70 -90 248 -83 187 -70 309 426 -39 -138
6630a38L00K47l9j01J2K24O7k99j58k05L89J21l40J00N2L68m31j04K11K92l48
$$ -138 162 409 370 269 281 505 572 273 115 -90 299 420 80 180 232 600 169 65 276 568 220
6651B20m83L33L90m06k71J62K90k90j71R9m01L94j33p5k23K31k70N80p43J80L41
$$ 220 -263 70 460 54 -217 -55 235 -55 -226 -127 -528 -134 -267 -342 -565 -334 -604 -24 -767 -587 -246
6672b46K65n99j1O07j2l81j19K77N5L1k68K66O0J52j11j84lM61l10o1K16L49j24
$$ -246 19 -580 -591 16 4 -377 -496 -219 -164 -133 -401 -135 -75 77 -34 -218 -221 240 -70 -131 85 434 310
6695C10k47j55K78k4M23o16K78L92k58J38l30J66j44L86m49p0M77o2j17o95M30
$$ 310 63 -92 186 162 585 -31 247 639 381 519 189 355 211 597 148 78 555 493 376 -319 111
6716A11L03l20N1j68Q2K26k83pj98L52l26lQ5k2K87k76j23J73K48j62m82R2J32
$$ 111 414 94 145 -23 59 285 2 -5 -203 149 -177 -180 -95 -117 170 -106 -229 -56 192 30 -452 -360 -228
6739b28K05o3n13K23N49m51k00J85M00J18o24K46j35K58J30l03k16K45P0K29m25
$$ -228 -23 -86 -599 -376 173 -278 -478 -293 107 225 -399 -153 -288 -30 100 -203 -419 -174 -104 125 -300
6760c00J07L77J94m25O2pj3J6Nj01L26K32n14K8N6J39m7k96J15J27O2j29J24j10
$$ -300 -193 184 378 -47 15 8 -5 11 16 -85 241 473 -41 -13 43 182 135 -161 -46 81 143 14 138 28
6784B8M34m27M9q1L82J28j29k99N7L71l65j94j6N88l77pk58J02K91l59n28M77
$$ 28 462 35 84 3 385 513 384 85 142 513 148 -46 -62 526 149 142 -116 -14 277 -82 -610 -133
6806a33J53J10J9l31K89l73L06l01qJ33K49k52k33l6K77q2j53n3L13L8j33l77
$$ -133 20 130 149 -182 107 -266 40 -261 -269 -136 113 -139 -372 -408 -131 -213 -366 -419 -106 -68 -201 -578
6828e78O38jm69j17L61L55m04j71Q5N87K00o97L24m48M55J68k06O2L11L9p5n60
$$ -578 60 59 -410 -527 -166 189 -215 -386 -301 286 486 -211 113 -335 120 288 82 144 455 494 419 -141
6850a41O3N36J67n82q3J88J81Q0j8j17K7J52k49j46M38p8j79j67jJ03j78J87N2
$$ -141 -78 458 625 43 -40 148 329 409 391 274 301 453 204 58 496 418 239 72 71 174 -4 183 235
6873B35l9j9o2l63J20K94k53k3j44K99o4ol00q8j29N51Q6n29L20J11k38l29K89
$$ 235 196 177 115 -248 -128 166 -87 -110 -254 45 -19 -25 -325 -413 -542 9 95 -434 -114 -3 -241 -570 -281
6896b81l1O0l42J88J36K85m11j6J05M40M1m37J48K76l1Q6m01J72K94J6j62j87
$$ -281 -312 -252 -594 -406 -270 15 -396 -412 -307 133 174 -263 -115 161 130 216 -185 -13 281 297 135 -52
6918e2K87J12K40k36l36N07j36Mj88r1L26j32P6m39L86j35k41o9L46K03k39m14
$$ -52 235 347 587 351 15 522 386 390 202 111 437 305 381 -58 328 193 -48 -117 229 432 193 -221
6940b21L19k19N00n06jJ69J12k22j80J07k96K19O6o9L0J64J11l89j68L07K52n77
$$ -221 98 -121 379 -127 -128 41 153 -69 -249 -142 -438 -219 -153 -222 -192 -28 83 -306 -474 -167 85 -492
6962d92K30L67j73J86n8m82L31R4l52N8M7k2L1J0J49K48o1J69l56n7M46k92j21
$$ -492 -262 105 -68 118 60 -422 -91 3 -349 -291 -244 -266 -235 -225 -76 172 111 280 -76 -133 313 21 -100
6985a00o4L65R2j49j22J59j50N82n45k3K15K55l37j92j42K71P7j83o1K29J13k33
$$ -100 -164 201 293 144 22 181 31 613 68 45 260 515 178 -14 -156 115 192 9 -52 177 290 57
7007E7j73J83J11M9r8m84J22L28k23J66R7m1l1j66j00J36K26n55M7J30K50q3l48
$$ 57 -116 67 178 227 129 -355 -233 95 -128 38 135 94 63 -103 -203 -67 159 -396 -349 -219 31 -52 -400
7030d00K75j59NO5l16L23M93n99j66K92n9J29r4O9l0L43k94l7M6j23N24j79j39
$$ -400 -125 -284 -279 -214 -530 -207 286 -313 -479 -187 -246 -117 -211 -142 -172 171 -123 -160 -114 -237 287 108 -31
7053c1n3N0J67p6k62L88k04M55m40k3L45k04l78K40M37J26n92O4j21N23J02j60
$$ -31 -84 -34 133 57 -205 183 -21 434 -6 -29 316 112 -266 -26 411 537 -55 9 -112 411 513 353
7075C53l59K78n3o5k66L52J39j19Jk12K92j51j10J36j90MJ88j19k94J51K33k76
$$ 353 -6 272 219 154 -112 240 379 260 261 49 341 190 80 216 26 30 218 99 -195 -44 189 -87
7097h7k48K75k3J75n41K24j02M03m19K12j77p2O4P5j71O2L21j41o0N8p0K82k41
$$ -87 -335 -60 -83 92 -449 -225 -327 76 -343 -131 -308 -380 -316 -241 -412 -350 -29 -170 -230 -172 -242 40 -201
7120b01K5K93r9K42p16kN47j13Jk31K06K0J27J76P1k69J13l11K42n5K52k19L9
$$ -201 -176 117 18 260 -456 -458 89 -24 -23 -254 -48 -28 99 275 346 77 190 -121 121 66 318 99 138
7143A38l4P4K64o50N24j50L12k59J77j27K41k56l44Q6p9L30j78lP4j37k56l1J95
$$ 138 104 178 442 -208 316 166 478 219 396 269 510 254 -90 -4 -83 247 69 66 140 3 -253 -284 -89
7166h9K80j23l69J23o0L1R2l85J59J02r8L1q7j33N38Q5n32K04r6K92o6K9j87N11
$$ -89 191 68 -301 -178 -238 -207 -115 -500 -341 -239 -337 -306 -393 -526 12 97 -435 -231 -327 -35 -101 -72 -259 252
7190B52l77j45J78K21J50l06j73J66L13l5l99K20m2K16l97J72l05R03j44J37k96
$$ 252 -125 -270 -92 129 279 -27 -200 -34 279 244 -155 65 23 239 -158 14 -291 612 468 605 309
7211C09k12J52p5o5J8K08k02P4k2p4K35P8l95J73K69L9m68m3L0M73l87l83L68
$$ 309 97 249 174 109 127 335 133 207 185 111 346 424 29 202 471 510 42 -1 29 502 115 -268 100
7234A00k53J99n2j06p6K25j67j30j6L0K71n2j91J46N6j34l70K34J7J37o2o6K79
$$ 100 -153 46 -6 -112 -188 37 -130 -260 -276 -246 25 -27 -218 -72 -16 -150 -520 -286 -269 -132 -194 -260 19
7257A9j5M17p04O1P2Q2j92K36n6j99J63M34j55j02j64J61J72j8J69o3m29K98K7
$$ 19 4 421 -283 -222 -150 -68 -260 -24 -80 -279 -116 318 163 61 -103 58 230 212 381 318 -111 187 214
7280B14j98J70j19J06L6j50M38k74M8p0qK88k89L26m73j28K81m04O49m28k61N27
$$ 214 16 186 67 173 209 59 497 223 271 201 193 481 192 518 45 -83 198 -206 443 15 -246 281
7302B81q7k92J65q0J3L5j87j64O2L26j57p3QL33j36k45K21q3M9J56j95r9n5O6
$$ 281 194 -98 67 -13 0 35 -152 -316 -254 72 -85 -158 -150 183 47 -198 23 -60 -11 145 -50 -149 -204 -138
7326a38l9j26J96K54j53m42K56R0J54n8m55L49j30J83j95K29j45R0O5j14J58j84
$$ -138 -177 -303 -107 147 -6 -448 -192 -102 52 -6 -461 -112 -242 -59 -254 -25 -170 -80 -15 -129 29 -155
7348a55L34k85J24J81k02L70l92J18j4K1k54K25K91j70N2l21J13L10l02L41m99
$$ -155 179 -106 18 199 -3 367 -25 93 79 100 -154 71 362 192 244 -77 36 346 44 385 -114
7369a14K29L44k23l38J82J49j9j91K7j70L27j46l55N44j93J71k40k08M2K47l86
$$ -114 115 459 236 -102 80 229 210 19 46 -124 203 57 -298 246 53 224 -16 -224 -182 65 -321
7390c21J37l98L66M8l75J71J12K1o3o9j00L46K28o55J23M16k14L27k58jj97M01
$$ -321 -184 -582 -216 -168 -543 -372 -260 -239 -302 -371 -471 -125 103 -552 -429 -13 -227 100 -158 -159 -356 45
7412D5k02O9J60J58l04j5Q9J00j9n4J54J89K2m66J37L39n6k10J49k35Q1J79k37
$$ 45 -157 -88 72 230 -74 -89 0 100 81 27 181 370 392 -74 63 402 346 136 285 50 131 310 73
7435G3K28n5j01n4p0k30M86K16k30J22k75J3l6k3j12R3K76j69m54K49J57P5l71
$$ 73 301 246 145 91 21 -209 277 493 263 385 110 123 87 64 -48 45 321 152 -302 -53 104 179 -192
7458a92J00p4o4K02q9ok5J88n30j1K04L94k43l23K43n6L63j73j58L6J70K14j79
$$ -192 -92 -166 -230 -28 -117 -123 -148 40 -490 -501 -297 97 -146 -469 -226 -282 81 -92 -250 -214 -44 170 -9
7481il01K44J83k16j42M25j19k00j96N30q4k36N4R0J68k6j2l8K1k6J46k84q4N48
$$ -9 -310 -66 117 -99 -241 184 65 -135 -331 199 115 -121 -67 23 191 165 153 115 136 110 256 -28 -112 436
7505D36m48R9k12J4N51k61M5l7k47J17J25l7n4p3K18r7k37m2K97j30j07k92N10
$$ 436 -12 87 -125 -111 440 179 224 187 -60 57 182 145 91 18 236 139 -98 -140 157 27 -80 -372 138
7528A38r7K6j39k6nk19o3J83N32k62k59q9K29J91k21j73R1j55K04k82P7L29M4
$$ 138 41 67 -72 -98 -103 -322 -385 -202 330 68 -191 -280 -51 140 -81 -254 -163 -318 -114 -396 -319 10 54
7551E4j61o9qk77N24m3n0o1M1M1J13n1K42l49J15p5j87N92O9j02l72r2N58l65
$$ 54 -107 -176 -184 -461 63 20 -30 -91 -50 -9 104 53 295 -54 61 -14 -201 391 460 358 -14 -106 452 87
7575H7r9o6L99l26J39K1J45k94K39m24L72j62M9J2k23M78J44j13m73J44L22l70
$$ 87 -12 -78 321 -5 134 155 300 6 245 -179 193 31 80 92 -131 347 491 378 -95 49 371 1
7597Aj51K04M04n29K46j02k13L08j62n24N17J49l78J5r2M80m28L68m62J60P5R4
$$ 1 -150 54 458 -71 175 73 -140 168 6 -518 -1 148 -230 -215 -307 173 -255 113 -349 -189 -114 -20
7619b0l54l3r8L92j85K13p7n5L89k11r5k78L92q8J5k4J52n5L11m97K23Q4N5L26
$$ -20 -374 -407 -505 -113 -298 -85 -162 -217 172 -39 -134 -412 -20 -108 -93 -117 35 -20 291 -206 17 101 156 482
7643D82l60Q5K76m99J37J34j57M99j09k53q6j4o5O0J01K82j65j66k17N06k83j65
$$ 482 122 207 483 -16 121 255 98 597 488 235 149 135 70 130 231 513 348 182 -35 471 188 23
7665B3j02K86j08j53j39L28k17p4P3N6k14o3O8Q0j09P6J00j96j4J38J88o8k39
$$ 23 -79 207 99 -54 -193 135 -82 -156 -83 -27 -241 -304 -236 -156 -265 -189 -89 -285 -299 -161 27 -41 -280
7688b80o8J3M58k17j1J52j28l57O6PJ94K72lJ19k24q2m3L29k73L98m40Q9J91m3
$$ -280 -348 -335 123 -94 -105 47 -81 -438 -372 -365 -171 101 98 217 -7 -89 -132 197 -76 322 -118 -29 162 119
7712A19K28l03J53k15J68J17J24l54K01L04n74N81p01L19Q8j40j80K72o5J41k20
$$ 119 347 44 197 -18 150 267 391 37 238 542 -32 549 -152 167 255 115 -65 207 142 283 63
7733F3o9L48L88p70l09K71k03L64p3k40n0L62j75j77J29K22l49j81K36L97k50
$$ 63 -6 342 730 -40 -349 -78 -281 83 10 -230 -280 82 -93 -270 -141 81 -268 -449 -213 184 -66
7754f6j21M2L03J5k45k77L29j34M57m84j58J26M18m69K99l74L33Q0P8k74M05j43
$$ -66 -187 -145 158 173 -72 -349 -20 -154 303 -181 -339 -213 205 -264 35 -339 -6 74 152 -122 283 140
7776A40q1j37j35K54K24q9l12J40j22L68l51L05k09K97l51J81L2l1k16J57j93
$$ 140 59 -78 -213 41 265 176 -136 4 -118 250 -101 204 -5 292 -59 122 154 123 -93 64 -129
7797a29N55l2m8l53MK23l0P0n39K70L12m98J19J52J46l35J69j83J49L00m83J19
$$ -129 426 394 346 -7 -3 220 190 260 -279 -9 303 -195 -76 76 222 -113 56 -127 22 322 -161 -42
7819d2j65M00m15K30l73J11L58k31l9J60j31K70k30L9k7rJ03L8l43L08j31o1j78
$$ -42 -207 193 -222 8 -365 -254 104 -127 -166 -6 -137 133 -97 -58 -85 -94 9 47 -296 12 -119 -180 -358
7842c58K10J8J16oj85Q0K11n0q6j29K93M9m6j06o0K1J23j76J52j41M07l19j59
$$ -358 -148 -130 -14 -20 -205 -125 86 36 -50 -179 114 163 117 11 -49 -28 95 -81 71 -70 337 18 -141
7865a41M72j83k06J61j54L08J59l07l38N56j19J16l86K1M96k48m23M57k34K77
$$ -141 331 148 -58 103 -51 257 416 109 -229 327 208 324 -62 -41 455 207 -216 241 7 284
7885B84K38m74l7K75L7k99p1J60j45j91K29j31m08N32Lj02R5j3l20j08L02J81
$$ 284 522 48 11 286 323 24 -47 113 -32 -223 6 -125 -533 -1 2 -100 -5 -18 -338 -446 -144 37
7907C7K6k24r3J32L71m54J3K18j73J25k7m99N80J05l45J16K72l08K71n9j57J54
$$ 37 63 -161 -254 -122 249 -205 -192 26 -147 -22 -49 -548 32 137 -208 -92 180 -128 143 84 -73 81
7929H1k4k33K47J22p2N0j73K3j32N04k96K7j35J55J37k01j42K69j47R4K6l26K08
$$ 81 57 -176 71 193 121 171 -2 21 -111 393 97 124 -11 144 281 80 -62 207 60 154 180 -146 62
7952F2L9m4K26l81K37q4k09J62K49k32o4R8l18J14l36M13k19K69Q5l1m36M83J2
$$ 62 101 57 283 -98 139 55 -154 8 257 25 -39 59 -259 -145 -481 -68 -287 -18 67 36 -400 83 95
7975I5j89m0Rj15p3p8L21j0J4k30l0j73P50l3l22K3K36l3R2k96J14K46k91k3J23
$$ 95 -94 -134 -125 -240 -313 -391 -70 -80 -66 -296 -326 -499 251 218 -104 -81 155 122 214 -82 32 278 -13 -36 87
8000H7J68p6n0j52K15J93j49l45K22j36J6J29k55N3M33j71J14k03L15m02pm02
$$ 87 255 179 129 -23 192 385 236 -109 113 -23 -7 122 -133 -80 353 182 296 93 408 6 -1 -403
8022d03M75j05J21j12J0K11k12L7m54M81J34Jj60j26R3P8L46p59J82R8q2k01o8
$$ -403 72 -33 88 -24 -14 197 -15 22 -432 49 183 184 24 -102 -9 69 415 -344 -162 -64 -146 -347 -415
8045d15M93j83k05J06K43k27J49j06j62L26mk36J25J13O9K26o03K16K47j61N5
$$ -415 78 -105 -310 -204 39 -188 -39 -145 -307 19 15 -221 -96 17 86 312 -291 -75 172 11 66
8066F6K9j58K2P8O0k54J28J27q2j61M48J37j23m75J82M80n13J04j57K12q0K81
$$ 66 95 -63 -41 37 97 -157 -29 98 16 -145 303 440 317 -158 24 504 -9 95 -62 150 70 351
8088C51k44J51J56Qm59L30k15J25l72K64O4ok7j79N9o3m3n9J63j1r0K35m01J03
$$ 351 107 258 414 422 -37 293 78 203 -169 95 159 153 126 -53 6 -57 -100 -159 4 -7 -97 138 -263 -160
8112a60q5K32Q5j56p0k08M0K20l06L04Kj34R1l57N43J23k99q7K06k94N10j95n33
$$ -160 -245 -13 72 -84 -154 -362 -322 -102 -408 -104 -102 -236 -145 -502 41 164 -135 -222 -16 -310 200 5 -528
8135e28L36Q0l26N23j26j51K30l24J63L31j84n4k23J62JK2r3J99p3N13k72r5r4
$$ -528 -192 -112 -438 85 -41 -192 38 -286 -123 208 24 -30 -253 -91 -90 -68 -161 38 -35 478 206 111 17
8158A7M2l8J78m95L82J51r8j39K49j6K06j78l09k33L57N4j6k21k8L04n15K49l2
$$ 17 59 21 199 -296 86 237 139 0 249 233 439 261 -48 -281 76 130 114 -107 -135 169 -346 -97 -129
8181a29J92j66J8q5L35m48J03k96K48J50
$$ -129 63 -103 -85 -170 165 -283 -180 -476 -228 -78
8191g8
$$ Imaginary data points
##PAGE= N=2
##DATA TABLE= (X++(I..I)), XYDATA
0@%%%%%%%%oJ4j6J6j6J7k5L2l9M7n5O3p2Q7j01J15j32J51j72J96k22K50k81L14
$$ 0 0 0 0 0 0 0 0 0 -6 8 -8 8 -8 9 -16 16 -23 24 -31 32 -40 47 -54 61 -71 80 -92 104 -118 132 -149 165
32A65l53L96m40M91n46O06o72P45q25R13j011J120j242J379j532J707j910K143
$$ 165 -188 208 -232 259 -287 319 -353 392 -433 480 -531 589 -653 726 -806 901 -1009 1134
50A134k419K753l162L681m361N294o663Q867j2985K3220r1957j62268K32302J41773
$$ 1134 -1285 1468 -1694 1987 -2374 2920 -3743 5124 -7861 15359 -76598 -238866 -6564 135209
64A35209j46500j17805J28028Q2116r5826o5301P0604K7545m9845m856L9869j5584
$$ 135209 -11291 -129096 -1068 81048 -14778 -80079 -9475 18070 -31775 -36631 3238 -12346
76a2346k4749L0674K5202l8954k2948L3559J8683k6506n426K9543P685k6918p380
$$ -12346 -37095 -6421 18781 -20173 -43121 -9562 9121 -17385 -22811 6732 14417 -12501 -19881
89a9881K5134J4811j8305j4476J5897K0313j2634k2530Q236K4762k538j6240P840
$$ -19881 5253 20064 1759 -12717 3180 23493 10859 -11671 -3435 21327 18789 2549 10389
102A0389J3525r523q183J2215P96j7569O356K2448j2610k5610J8582K6490k6532
$$ 10389 23914 14391 6208 18423 19219 1650 8006 30454 17844 -7766 10816 37306 10774
115A0774l2764K8641L1065l1364k9451L2716K5740l4828k4686K8979J5078l0426
$$ 10774 -21990 6651 37716 6352 -23099 9617 35357 529 -24157 4822 19900 -10526
127a0526j1546K6489L590k3598K926K0670j0585k1393J3157J8317j8017j9271
$$ -10526 -22072 4417 8007 -15591 -12665 8005 -2580 -23973 -10816 7501 -10516 -29787
139b9787J9313J9152j8323j7639J7373J6965j5611j6387J3168J5355r739j2556
$$ -29787 -10474 8678 -9645 -27284 -9911 7054 -8557 -24944 -11776 3579 -6160 -18716
151a8716R068J1834n721q366N804Q026m329n187M236L889k315J811P380k254q153
$$ -18716 -9648 2186 -3535 -11901 -6097 1929 -2400 -7587 -3351 538 -1777 34 7414 5160 -2993
166b993M086R820n571j0144P863J2740p731j3875R095J5910n860j3145N437Q688
$$ -2993 1093 10913 5342 -4802 3061 15801 8070 -5805 3290 19200 13340 195 5632 14320
180A4320n638o932O701L046n890N96N434m950p821P883Q778j0613j1588J0757
$$ 14320 8682 1750 8451 11497 5607 6203 11637 6687 -1134 6749 15527 4914 -6674 4083
194D083J3673j1034j4819Q124J3400q059j5388M078J3191k716j2304j428R110
$$ 4083 17756 6722 -8097 27 13427 5368 -10020 -5942 7249 4533 -7771 -9199 -89
207h9K721n826m956L72K683K094j337n414k037P903M058j0278r116R681J2057
$$ -89 2632 -3194 -8150 -7778 -5095 -3001 -4338 -9752 -11789 -3886 172 -10106 -19222 -9541 2516
222B516q731j4190P932J6882m415j6276J336J4319K19j0392j48Q830K541l225
$$ 2516 -6215 -20405 -12473 4409 -6 -16282 -14946 -627 -408 -10800 -10948 -2118 423 -2802
236b802j086R69P78M171K458m412l253P492O369o682o325Q186R251n415r863M789
$$ -2802 -3888 -2919 -2141 2030 4488 76 -3177 4315 10684 4002 -2323 5863 15114 9699 -164 4625
252D625J0923j818r180R73Q432P62o002k611L509K890j708l311l033J117N633
$$ 4625 15548 13730 4550 5523 13955 14717 8715 6104 9613 12503 10795 7484 4451 5568 11201
267A1201L51q558n048R021M825j1425r620R907J0197j0532j3797N595J1714n383
$$ 11201 11552 2994 -2054 6967 11792 367 -9253 654 10851 319 -13478 -7883 3831 -1552
281a552j1316J555Q019p13o558j459K644Q47P90k643l908M59O391K0o960j149
$$ -1552 -12868 -11313 -3294 -4007 -10565 -12024 -9380 -8533 -7743 -10386 -14294 -13835 -7444 -7424 -14384 -15533
297a5533Q899M315p314m614P979P517n036p342M203R770n69p623P88Q941L122
$$ -15533 -6634 -2319 -9633 -14247 -6268 1249 -3787 -11129 -6926 2844 2275 -5348 -4560 4381 7503
312G503m670k888M448M619p37k824N06K772M385J3n453k654O519N454p372p988
$$ 7503 2833 -55 4393 9012 8275 5451 5957 8729 13114 13127 7674 5020 11539 16993 9621 1633
328A633O748J0662n939j1297L365J0720m109j1575J58Q270k28o975j773K076j76
$$ 1633 8381 19043 13104 1807 5172 15892 11783 208 366 8636 8408 1433 -340 1736 1560
343A560p33r41l538k196N154J615q324n723Q245O380r338r076P441R261p029r459
$$ 1560 827 -114 -3652 -5848 -694 921 -7403 -13126 -4881 1499 -7839 -16915 -9474 -213 -7242 -16701
359a6701M616R352k465q046P14P418K406m849l873K741N584J21l467j075M481
$$ -16701 -12085 -2733 -5198 -13244 -12530 -5112 -2706 -7555 -11428 -8687 -3103 -2982 -6449 -7524 -3043
374c043M633j950m105J57O382L439m779m697N512R129k601r694J469J0718L58
$$ -3043 1590 -360 -4465 -4308 2074 5513 734 -3963 1549 10678 8077 -1617 -148 10570 10928
389A0928r565j517R591K796o792j969M382J191j838k49j689k254L406L799n686
$$ 10928 1363 -154 9437 12233 5441 3472 7854 9045 7207 6958 5269 3015 6421 10220 4534
404D534o683O842P816p853r864O538R615p227j0852M652R489m044q546J458O360
$$ 4534 -2149 4693 12509 4656 -5208 1330 10945 3718 -7134 -2482 7007 2963 -5583 -4125 2235
419B235j540n269j371J632J977R62k241k787Q37L897p81n989j505O191L572n125
$$ 2235 695 -4574 -5945 -4313 -2336 -1374 -3615 -6402 -5565 -1668 -2449 -8438 -9943 -3752 -180 -5305
435e305o022M655Q117k934r321R97J0244R46q546j915Q120K585n984k103M701
$$ -5305 -11327 -6672 1445 -1489 -10810 -9813 431 1377 -7169 -9084 -964 1621 -4363 -6466 -1765
450a765J991r10Pj69j494K759M734l457n363M976Q029m988q515M759J0733m147
$$ -1765 226 -684 -677 -846 -2340 419 5153 1696 -3667 1309 9338 4350 -4165 594 11327 7180
466G180j0128L347J0650j771p642N37O612J94m895r95K401R39L36p42k415l36
$$ 7180 -2948 399 11049 9278 1636 2173 8785 8979 4084 3089 5490 6429 6765 6023 3608 3272
482C272K631J923m941l963M504M631m479p426K600P420j955r555j191Q662J394
$$ 3272 5903 7826 2885 -1078 3426 8057 3578 -3848 -1248 6172 4217 -5338 -6529 2133 3527
497C527q680l745O652L383n764l978K648K159j490j433m01j498J084L002j942
$$ 3527 -5153 -8898 -2246 1137 -4627 -8605 -5957 -3798 -5288 -6721 -7122 -8620 -7536 -4534 -6476
512f476m673K449P680j923q803K267R856n62j0422R67J0752J391q302q72P989
$$ -6476 -11149 -8700 -1020 -2943 -11746 -9479 377 -185 -10607 -9640 1112 2503 -5799 -6671 1318
527A318K715m735j349L654J882j4O56m97p41L556K964l326m524M651O718l381
$$ 1318 4033 -702 -2051 1603 3485 3471 4127 3630 2889 6445 9409 6083 1559 6210 12928 9547
543I547p303K021Q649k06q444j780P383K469p285m078M177L956k862m734L00J942
$$ 9547 2244 4265 12914 12708 4264 2484 9867 12336 5051 973 5150 9106 6244 1510 1810 3752
559C752k32j665k714j037J743J615l332m913J641N545k278q332k72Q298L79r019
$$ 3752 3520 1855 -859 -1896 -153 1462 -1870 -6783 -5142 403 -1875 -10207 -10479 -2181 -1802 -10821
575a0821k137Q852K530q463l182O381M019m127l457K330K789M65n06q62j72L737
$$ -10821 -12958 -4106 -1576 -10039 -13221 -6840 -2821 -6948 -10405 -8075 -5286 -4821 -5327 -6189 -6361 -2624
591b624K327k310l793M132O757k292o747K150Q838P72p564j438Q281L001n412
$$ -2624 -297 -2607 -6400 -2268 4489 2197 -4550 -2400 6438 7210 -354 -1792 6489 9490 4078
606D078l614M776N008j800m329L46L254J290j471k872n66L467J760m062m325L311
$$ 4078 464 5240 10248 8448 4119 4465 7719 9009 7538 4666 4100 7567 9327 5265 940 4251
622D251M991l262o730P84O857p77p599j978N721J881n777m217L754M067k591m949
$$ 4251 9242 5980 -750 34 6891 6114 -1485 -3463 2258 4139 -1638 -5855 -2101 1966 -625 -5574
638e574k86L071J276k813k643N35L547R29l737l085K405M607j042o320J15P760
$$ -5574 -5860 -2789 -1513 -4326 -6969 -6434 -2887 -1958 -5695 -8780 -6375 -1768 -2810 -9130 -9015 -1255
654a255K089p075k904O495M721n054n283M499O150k019m934J310M097J050j494
$$ -1255 834 -6241 -9145 -2650 2071 -2983 -8266 -3767 2383 364 -4570 -3260 837 1887 393
669C93j583L69K878K282k150l581K649N488j440o185L81P643N49o571j409N623
$$ 393 -1190 -821 2057 4339 2189 -1392 1257 6745 5305 -880 -499 7144 7693 1122 -287 5336
685E336K580m605l332M121L044j912l472m1J979J823j424l204Q8L152J730l699
$$ 5336 7916 3311 -21 4100 7144 5232 1760 1719 3698 5521 4097 893 981 4133 5863 2164
701B164l492J910M387j789n548l56N289J406n564l675M223L911l461n364J703
$$ 2164 -1328 582 4969 3180 -2368 -2724 2565 3971 -1593 -5268 -1045 2866 -595 -5959 -4256
716d256N012q03n110l82L386J107k797j937P07J813O62j695k262L36M003O63m420
$$ -4256 756 -47 -5157 -5539 -2153 -1046 -3843 -5780 -5073 -3260 -2598 -4293 -6555 -6219 -2216 -1553 -5973
733e973j342N032K862n071l667N360M890m032m296L784N062j827l756J230L606
$$ -5973 -7315 -2283 579 -4492 -8159 -2799 2091 -1941 -6237 -2453 2609 782 -2974 -1744 1862
748A862M45j020k28K60J798J859j122k506R61M919r1n112o50N681K498m603l552
$$ 1862 2307 1287 1059 1319 3117 4976 3854 1348 2309 7228 7137 2025 1375 7056 9554 4951 1399
765A399L729M258k613m752N63M623j69m063j986L027J394k411k580R3J162L73
$$ 1399 5128 9386 6773 2021 2584 7207 7038 2975 989 4016 5410 2999 419 512 1674 2047
781B047j334k605j218K933J325m564l202K933L851m244n240L557N132l681n383
$$ 2047 713 -1892 -3110 -177 1148 -3416 -6618 -3685 166 -4078 -9318 -5761 -629 -4310 -9693
796i693J604N140j395l979N37K760L50m24p54p20J638K561j84l139J16N380J693
$$ -9693 -8089 -2949 -4344 -8323 -7786 -5026 -4676 -5100 -5854 -6574 -4936 -2375 -2559 -5698 -5582 -202 1491
813A491m580j883N304M227l076l718L110N225j212m218K40N215J367k874j900
$$ 1491 -3089 -4972 332 4559 1483 -2235 875 6100 4888 670 910 6125 7492 4618 2718
828B718K417K559n92k188q9J166R41k03j875j272K804K186l811m312K570M830
$$ 2718 5135 7694 7102 4914 4825 5991 6932 6729 4854 3582 6386 8572 4761 449 3019 7849
844G849l475o069J639N357k412o155Q22M562j578l968m40J823j56p76m92j911
$$ 7849 4374 -1695 -56 5301 2889 -3266 -2444 2118 540 -3428 -3868 -2045 -2201 -2977 -3469 -5380
860e380l38K753P46n106j414N315K660n936l516N586M442m601m412M078M724j521
$$ -5380 -5718 -2965 -2219 -7325 -8739 -3424 -764 -6700 -10216 -4630 -188 -4789 -9201 -5123 -399 -1920
876a920m205N80M335J283j966j664J042K779J203j811j130K445K654n59l077R0
$$ -1920 -6125 -5545 -1210 73 -1893 -3557 -2515 264 1467 -344 -1474 971 3625 3066 -11 79
892G9M705J682m086k837L698M546k537n094K448N297j057n925j75N535N40m194
$$ 79 4784 6466 2380 -457 3241 7787 5250 156 2604 7901 6844 919 744 6279 6819 2625
908B625j462K120J256j174j140j218K55K027N58m582k273M999L448o202m442M920
$$ 2625 1163 3283 4539 3365 2225 1007 1262 3289 3847 -735 -3008 1991 5439 -763 -5205 -285
924b85M480m649n753L920M842k477n529Q86L996j60k311j561P11J270R39j548
$$ -285 4195 -454 -6207 -2287 2555 78 -5451 -4565 -569 -729 -3040 -4601 -3890 -2620 -1681 -3229
940c229k038J054L373o84m158K1M382J827m286k589L960L780k603m002J771M930
$$ -3229 -5267 -4213 -840 -1524 -5682 -5661 -1279 548 -3738 -6327 -2367 1413 -1190 -5192 -3421 1509
956A509q38l753m04M352J621k640j737J786K691o90j767l31J425K636l19k879
$$ 1509 671 -3082 -3486 866 2487 -153 -1890 -104 2587 1897 130 -201 1224 3860 3541 662
972F62j007M171L092l905l805L661M917l419m623K205N290j477n089K68M309M78
$$ 662 -345 3826 6918 3013 -792 2869 7786 4367 -256 1949 7239 5762 673 941 5250 5728
988E728k961j486P98P63M40o23k055n7K211J0m288j305L821K029m803l067L219
$$ 5728 2767 1281 2079 2842 3282 2659 604 547 2758 2768 -1520 -2825 996 3025 -1778 -4845 -1626
1005a626L354l040m494J539L880j584l565p77L258J237k620j825R64K003K71j910
$$ -1626 1728 -1312 -5806 -4267 -387 -1971 -5536 -6313 -3055 -1818 -4438 -6263 -5299 -3296 -3025 -4935
1021d935j062J589K546n79k991l82M147J928k715k821L097M339j955l268J304
$$ -4935 -5997 -4408 -1862 -2441 -5432 -5814 -1667 261 -2454 -5275 -2178 2161 206 -3062 -1758
1036a758M695P5l178j83L398J598j370j627J505J233J172r42j446M43K716K89
$$ -1758 2937 3012 -166 -349 3049 4647 3277 1650 3155 4388 5560 4618 3172 3615 6331 6620
1052F620k641j402L243J869l142k841J837L763k714l768P30L240q47l531j495
$$ 6620 3979 2577 5820 7689 4547 1706 3543 7306 4592 824 1554 4794 3947 416 -1079
1067a079K633P67j773k400n30J925L69k322j921L60K434j69l842j319L350J618
$$ -1079 1554 2321 548 -1852 -2382 -457 -88 -2410 -4331 -3971 -1537 -1706 -5548 -6867 -3517 -1899
1083a899l186k966K586L408j251l903N39L947M70k954j296K713K077q69j331K40
$$ -1899 -5085 -8051 -5465 -2057 -3308 -7211 -6672 -2725 -2255 -5209 -6505 -3792 -1715 -2584 -3915 -3675
1099c675K092K070q36j967J133K868J097k620r05L469K474k376k417K261L542
$$ -3675 -1583 487 -349 -2316 -1183 1685 2782 162 -743 2726 5200 2824 407 2668 6210
1114F210j365l220N49L162J346k493k061K147K184j129k567k3J908K80j326k461
$$ 6210 4845 1625 2174 5336 6682 4189 2128 4275 6459 5330 2763 2740 4648 4928 3602 1141
1130A141P49J986R2l220j612K000K160k502m185J932L607j421m143m75L273O96
$$ 1141 1890 3876 3968 748 -864 1136 3296 794 -3391 -1459 2148 727 -3416 -3891 -618 78
1146G8l427j692K102J416o97j960n02J611J318j306k204N46K893P34l198r02K852
$$ 78 -3349 -5041 -2939 -1523 -2220 -4180 -4682 -3071 -1753 -3059 -5263 -4717 -1824 -1090 -4288 -5190 -2338
1163b338K007j742k859J772L275j19k846p02L442J750k144k243K491K744q92k488
$$ -2338 -331 -2073 -4932 -3160 115 -4 -2850 -3552 -110 1640 -504 -2747 -256 2488 1596 -892
1179h92J51K778J353k105j331J190K334N80k519j336K278K779j828l503J319L913
$$ -892 -741 2037 3390 1285 -46 1144 3478 4058 1539 203 2481 5260 3432 -71 1248 5161
1195E161l9l992j053L661J598l238k023J708K085o82k180o24J305J453r98k617
$$ 5161 5122 1130 77 3738 5336 2098 75 1783 3868 3186 1006 382 1687 3140 2142 -475
1211d75m61K984K42l142j733K386K222k279k867O96K748n52k870r67K675J308
$$ -475 -936 2048 2290 -852 -2585 -199 2023 -256 -3123 -2427 321 -231 -3101 -4068 -1393 -85
1227h5j912k896J405K729m09l176r62L503R92k243j792J262K146K6k196q01J911
$$ -85 -1997 -4893 -3488 -759 -1168 -4344 -5306 -1803 -811 -3054 -4846 -3584 -1438 -1412 -3608 -4409 -2498
1244b498K227j059k485N59L721J092l491j324L589K794k576k381K179K726n43
$$ -2498 -271 -1330 -3815 -3256 465 1557 -1934 -3258 331 3125 549 -1832 347 3073 2530
1259B530j756M05J210J539n40j761L15K041J374k038j752K233K156j385k879L36
$$ 2530 774 1179 2389 3928 3388 1627 1942 3983 5357 3319 1567 3800 5956 4571 1692 2028
1275B028K952J49l016r28K083J242j815k380M23K289k49l271p66J620P44j422
$$ 2028 4980 5129 2113 1185 3268 4510 2695 315 738 3027 2778 -493 -1259 361 1105 -317
1291c17k569Q97J641m33k274j654J373J874r24k865j90K960J043l646j625K501
$$ -317 -2886 -1989 -348 -781 -3055 -4709 -3336 -1462 -2386 -5251 -5441 -2481 -1438 -5084 -6709 -4208
1307d208K463j890k652J772K702p83j397l53J920Q92p5r43L6J740J759q74j746
$$ -4208 -1745 -3635 -6287 -4515 -1813 -2596 -3993 -4346 -2426 -1534 -1609 -2552 -2516 -776 983 109 -1637
1324a637J598L336o27k790O58L203R91k618q70K514K142j618j900J024J791L81
$$ -1637 -39 3297 2670 -120 538 3741 4732 2114 1244 3758 5900 4282 2382 3406 5197 5578
1340E578j973q22J280J545p95k187l73J767M57j642k380J233J719q86l142m92
$$ 5578 3605 2783 4063 5608 4813 2626 2253 4020 4477 2835 455 1688 3407 2521 -621 -1113
1356a113K790L18k988k361J986J934j637l312M67K357r1k113j055J061J479o50
$$ -1113 1677 1995 -993 -3354 -1368 566 -1071 -4383 -3916 -1559 -1650 -3763 -4818 -3757 -2278 -2928
1372b928j616q16K041J426j576j902J227L019n25k863k18L236J334k202j303K305
$$ -2928 -4544 -5360 -3319 -1893 -3469 -5371 -4144 -1125 -1650 -4513 -4731 -1495 -161 -2363 -3666 -1361
1388a361K390j344j531P15K625K92j582m99J229J948M7j969rK007J677j739j845
$$ -1361 1029 -315 -1846 -1131 1494 1786 204 -295 934 2882 2929 960 951 2958 4635 2896 1051
1405A051J067K848o05l091j13L243M95k422j502J162J898m54k422r61K555O80
$$ 1051 2118 4966 4361 1270 1157 4400 4895 2473 971 2133 4031 3577 1155 194 2749 3429
1421C429j720k198J033J863n25k470q48J990Q09j611k342Q54K351m95k498q11
$$ 3429 1709 -489 544 2407 1882 -588 -1436 554 1363 -248 -2590 -1736 615 120 -2378 -3189
1437c189K090J039k016k313J596K546p76k815p0K110J073j919j619J353K149l90
$$ -3189 -1099 -60 -2076 -4389 -2793 -247 -1023 -3838 -3908 -1798 -725 -2644 -4263 -2910 -761 -1151
1453a151k441l84K491J563j502k136P81L111j24k376m19K642J673k214j651J675
$$ -1151 -3592 -3976 -1485 78 -1424 -3560 -2779 332 208 -2168 -2587 55 1728 -486 -2137 -462
1469d62K704m28k484k46K253J295j185j810J427K542m03k239j89K016J320j657
$$ -462 2242 1814 -670 -916 1337 2632 1447 -363 1064 3606 3203 964 775 2791 4111 2454
1485B454j667J196K535o99k454m48K263J043j939j526Q15J757j13k655o69J993
$$ 2454 787 1983 4518 3819 1365 917 3180 4223 2284 758 1573 3330 3217 562 -107 1886
1501A886J181j981k487J505K062q72l344n21K316P59j868k115J114J495p9k473
$$ 1886 3067 1086 -1401 104 2166 1294 -2050 -2571 -255 504 -1364 -3479 -2365 -870 -949 -3422
1517c422o93J765J078j395k632R54K621J6k986p59K658J555k119j217J327K162
$$ -3422 -4115 -2350 -1272 -2667 -5299 -4345 -1724 -1708 -4694 -5453 -2795 -1240 -3359 -4576 -3249 -1087
1533a087M2j760m52K213J459j312j288P67K873j92j679j87K191J805j562j144
$$ -1087 -1045 -2805 -3257 -1044 415 -897 -2185 -1418 1455 1263 -416 -603 1588 3393 1831 687
1549F87J075K373j53j861m03K014J408j286k148Q80K893m02k979k52K294R81k279
$$ 687 1762 4135 3982 2121 1718 3732 5140 3854 1706 2586 5479 5077 2098 1846 4140 5121 2842
1566B842j404P80J209l17k262p24R24J382j568k201k64K421m0k301k182K204J697
$$ 2842 1438 2218 3427 3110 848 124 1048 2430 862 -1339 -1603 818 778 -1523 -3705 -1501 196
1583A96k435k591J177K146q18k255k46J896M70r30j385L74J615N84j654r65J710
$$ 196 -2239 -4830 -3653 -1507 -2325 -4580 -4826 -2930 -2460 -3390 -4775 -4401 -2786 -2202 -3856 -4821 -3111
1600c111K170j109k024J040K688N49k140o11K651J921j554j826J283K647k90j624
$$ -3111 -941 -2050 -4074 -3034 -346 203 -1937 -2548 103 2024 470 -1356 -73 2574 2284 660
1616F60j78K140J046r62q54K80J621O47j232q59N38J974p03k491l17K718R29k844
$$ 660 482 2622 3668 2706 1852 2132 3753 4400 3168 2309 2847 4821 4118 1627 1310 4028 4957 2113
1634B113j964K524J299k106k043R34J984j036k103m3R21L80r90j173m82N58J163
$$ 2113 149 2673 3972 1866 -177 757 2741 1705 -398 -441 480 860 -130 -1303 -1785 -1227 -64
1651f4j595j433O44K036p08k735J88K361L97k380j295K321J429j800j093Q16J949
$$ -64 -1659 -3092 -2448 -412 -1120 -3855 -3667 -1306 -909 -3289 -4584 -2263 -834 -2634 -3727 -2911 -962
1668i62o1j860l47J554J395p14j507O62J452O73q39j153Q73K343k83j929n03K569
$$ -962 -1023 -2883 -3230 -1676 -281 -995 -2502 -1840 -388 285 -554 -1707 -834 1509 1226 -703 -1206 1363
1686A363J529k318j603K158K357j733j792J052K091l53j561m29J152J166l05j271
$$ 1363 2892 574 -1029 1129 3486 1753 -39 1013 3104 2751 1190 761 1913 3079 2774 1503
1702A503n69J581Q03j005k301R52K324m94k799l58K882O13k725j594K005J487
$$ 1503 934 2515 3318 2313 12 964 3288 2794 -5 -363 2519 3132 407 -1187 818 2305
1718B305j497j838M72J378N8j757p36M67J463k57k125k11J334J194j746j746N32
$$ 2305 808 -1030 -558 820 878 -879 -1615 -1148 315 58 -2067 -2278 -944 250 -1496 -3242 -2710
1735b710K513p15k597l11K552P13j916j578J695J907j323j599M64K007J65j486
$$ -2710 -197 -912 -3509 -3820 -1268 -555 -2471 -4049 -2354 -447 -1770 -3369 -2905 -898 -733 -2219
1751b219m94J368R41Q3j063n63J376J856r72j585J021K738k87k434J56K581J193
$$ -2219 -2713 -1345 -404 -321 -1384 -1947 -571 1285 313 -1272 -251 2487 2200 -234 -78 2503 3696
1768C696k483j266K352J594j248j524J113J099O47j250o81K77J396p5j923r53
$$ 3696 1213 -53 2299 3893 2645 1121 2234 3333 3980 2730 2049 2326 3722 3647 1724 771
1784G71J932J514j711k263N27K434o25l052o15K406L55k114j574J189J429j484
$$ 771 2703 4217 2506 243 770 3204 2579 -473 -1088 1318 1673 -441 -2015 -826 603 -881
1800h81j436n37J545J70j461j307R34P95K62j563r55J806R23j490j507Q98K288
$$ -881 -2317 -2854 -1309 -1139 -2600 -3907 -2973 -2178 -1916 -3479 -4434 -2628 -1705 -3195 -4702 -3804 -1516
1817a516k27k341j32K668R32j788p27K012J840r67j467Q35J390Q33n35q52R15
$$ -1516 -1743 -4084 -4216 -1548 -616 -2404 -3131 -1119 721 -246 -1713 -878 512 1345 810 -42 873
1834H73J437P20j545q33J868J730j141k105J028K588j23k255n53J887J006j695
$$ 873 2310 3030 1485 652 2520 4250 3109 1004 2032 4620 4497 2242 1689 3576 4582 2887
1850B887j800J279J366n40j786O3P97N80r06j689j06J600l47j798j121R98J168
$$ 2887 1087 2366 3732 3192 1406 1469 2266 2846 1940 251 145 1745 1398 -400 -1521 -523 645
1867F45j155k444N82K022m62k291q81J915Q85j365j653Q40J353K92k150j02J981
$$ 645 -510 -2954 -2372 -350 -812 -3103 -3984 -2069 -1184 -2549 -4202 -3362 -2009 -1717 -3867 -3969 -1988
1884a988N18r45j123N15J921J99j504n56J803J396o98j595Q69K281K71j800k90
$$ -1988 -1470 -2415 -3538 -3023 -1102 -903 -2407 -2963 -1160 236 -462 -2057 -1188 1093 1364 -436 -726
1901g26J542J611j173j255R78J670J18j298l98J286J137r57j174J97J943J56k108
$$ -726 816 2427 1254 -1 977 2647 2765 1467 1069 2355 3492 2535 1361 1558 3501 3657 1549
1918A549q89J676Q93r33j922K72J920k81j834n04J355Q20j089j713K78J626q8
$$ 1549 660 2336 3229 2296 374 646 2566 2285 451 -53 1302 2122 1033 -680 -402 1224 1136
1935A136j653j092R24J204n56k036J69J741R5j788r59J366J028q54j819O00J838
$$ 1136 -517 -1609 -685 519 -37 -2073 -1904 -163 -68 -1856 -2815 -1449 -421 -1275 -3094 -2494 -656
1952f56N8j907n63J123J562j045j442L22J632O43j423j128J631J766j087j637
$$ -656 -598 -2505 -3068 -1945 -383 -1428 -2870 -2548 -916 -273 -1696 -2824 -1193 573 -514 -2151
1968b151M77J863M19j315r67J704J098p98r92K16J817K75j277q85J289J954j088
$$ -2151 -1674 189 608 -707 -1674 30 1128 330 -662 -446 1371 1646 369 -516 773 2727 1639
1985A639j333M56J767J81j592l76J163J084o23j888K14K235Q1j645j142J602J168
$$ 1639 306 762 2529 2710 1118 742 1905 2989 2366 478 692 2927 3008 1363 221 1823 2991
2002B991r50j755m9J958Qj850r04J130R73o17k010n1J141Q37j887j220Q97J417
$$ 2991 2041 286 237 2195 2203 353 -551 579 1552 935 -1075 -1126 15 852 -1035 -2255 -1358 59
2020E9q62k065N18J596Q3j780o97Q14R33m98j322kJ311N87r84j621J470J826m31
$$ 59 -803 -2868 -2350 -754 -671 -2451 -3148 -2334 -1401 -1899 -3221 -3223 -1912 -1325 -2309 -3930 -2460 -634 -1065
2039a065j966L64K009P77j564o57J166J833n72j434L16J968O17j091m58J005J593
$$ -1065 -3031 -2667 -658 119 -1445 -2102 -936 897 325 -1109 -793 1175 1792 701 243 1248 2841
2056B841j9j863J96J789Q11j565r15J344J180m99j517k18J461O00j189j118N60
$$ 2841 2822 959 1155 2944 3755 2190 1275 2619 3799 3300 1783 1565 3026 3626 2437 1319 1879
2073A879J329m82k413J3J933O5j589j388Q65J314q57k174o7J030O15j640j254
$$ 1879 3208 2726 313 326 2259 2324 735 -653 212 1526 669 -1505 -1572 -542 73 -1567 -2821
2090b821K89J919m20k400l29K191K02j737r93J360J348o41j537M17J595L43j253
$$ -2821 -2532 -613 -1033 -3433 -3762 -1571 -1369 -3106 -4099 -2739 -1391 -2032 -3569 -3152 -1557 -1214 -2467
2107b467o44O33J738K19j488QJ566J312j129r75J212J771k82j545J64J717J012
$$ -2467 -3111 -2478 -740 -521 -2009 -2001 -435 877 -252 -1227 -15 1756 1474 -71 93 1810 2822
2124B822j288j129R11J921l39j434j88J802M58j240r12Q04J021l99j337k87J496
$$ 2822 1534 405 1316 3237 2898 1464 1276 3078 3536 2296 1384 2188 3209 2810 1473 1186 2682
2141B682r8m83j905N56J168J95k115o21J591P57j914j154Q67R04o03j631n0J025
$$ 2682 2584 2101 196 752 1920 2115 0 -621 970 1727 -187 -1341 -474 430 -173 -1804 -1854 -829
2159h29L96j263q29L77J254m0j685n15J374R83j183j466Q95J865m03j467l22J555
$$ -829 -433 -1696 -2525 -2148 -894 -934 -2619 -3134 -1760 -777 -1960 -3426 -2531 -666 -1069 -2536 -2858 -1303
2177a303J051j002r10R63Q66L72j467j12J407R34o47j269Q79J654p7j432k30J710
$$ -1303 -252 -1254 -2164 -1201 -335 37 -1430 -1542 -135 799 152 -1117 -238 1416 1339 -93 -323 1387
2195A387N37r69r21P47J265Q9j111q55J625R05q78j525Q60J257m4j629m07J390
$$ 1387 1924 955 34 781 2046 2135 1024 169 1794 2699 1821 296 1156 2413 2369 740 333 1723
2213A723O69j014j082K74J242k43j469l94R81J226j125j195J59J368k44j258p85
$$ 1723 2392 1378 296 570 1812 1569 100 -294 687 1913 788 -407 -248 1120 876 -382 -1167
2230a167J033P09q24j275O8J474%j462q77R40J191q89j402M72J378l26j148n35
$$ -1167 -134 575 -249 -1524 -1456 18 18 -1444 -2321 -1381 -190 -1079 -2481 -2009 -631 -957 -2105 -2640
2248b640Q23J209j002r20N55J086K65j387l58J556O16m24j146L40J552L69r39
$$ -2640 -1817 -608 -1610 -2530 -1975 -889 -624 -2011 -2369 -813 -197 -621 -1767 -1427 125 494 -445
2265d45o08J568J075q45j148O73J243M86r76p36R32J552p29j139K29J175L99p47
$$ -445 -1053 515 1590 745 -403 270 1513 1999 1023 287 1219 2771 2042 903 1132 2307 2706 1959
2283A959q62P59J285l92j734K19J429K55j786q10Q42J483j318j400K52Q31J47
$$ 1959 1097 1856 3141 2749 1015 1234 2663 2918 1132 322 1164 2647 1329 -71 181 1012 1159
2300A159j281q04O67O03q73j251K3R21N50j519j175P20J554p59j702r1J804N0
$$ 1159 -122 -926 -259 344 -529 -1780 -1757 -836 -286 -1805 -2980 -2260 -706 -1465 -3167 -3258 -1454 -1404
2318a404j561o11J240J277j028j211K98J824k01m58q06J518Q00m0q23J31J128
$$ -1404 -2965 -3576 -2336 -1059 -2087 -3298 -3000 -1176 -1377 -1835 -2641 -1123 -323 -363 -1186 -1055 73
2335G3P69o41j095J445J300j84j551L55K003K06j016q82J262J371p28j320M51
$$ 73 842 201 -894 551 1851 1667 116 471 2474 2680 1664 782 2044 3415 2687 1367 1818
2352A818J518m26r99j47N54N03k52j182m60R80N64j371j123O51J408q60j959j2
$$ 1818 3336 2910 1911 1764 2318 2821 2569 1387 927 1907 2471 1100 -23 628 2036 1176 -783 -795
2370g95J515N7j774r80J177P45j116j344J89J156J51j200o43M41R83l00j276L5
$$ -795 720 777 -997 -1977 -800 -55 -1171 -2515 -2326 -1170 -1019 -2219 -2862 -2421 -1438 -1738 -3014 -2979
2388b979J138Q97j184q43R10J886p25j401L4J581P46j013j024J169J608o03j292
$$ -2979 -1841 -944 -2128 -2971 -2061 -175 -900 -2301 -2267 -686 60 -953 -1977 -808 800 197 -1095
2405a095O63J226K35m58l87P48P55P5q40m79J386O09o28j356Q82J723n90k190
$$ -1095 -432 794 1029 571 184 932 1687 1762 922 443 1829 2438 1810 454 1336 3059 2469 279
2423B79M27J940L11j884q19J422M93j076p89P6P50M67j121o22J82J147j18j545
$$ 279 706 2646 2957 1073 254 1676 2169 1093 304 380 1130 1597 476 -146 36 1183 1065 -480
2441d80m90J387P35j409j545P81J532q26j578K49J190L93j194q57Q12J292p98
$$ -480 -970 417 1152 -257 -1802 -1021 511 -315 -1893 -1644 -454 -61 -1255 -2112 -1300 -8 -806
2458h06j427L07J045J14o24m74L10Q80K93j334j14Q21J267j054j198Q78J706l43
$$ -806 -2233 -1926 -881 -767 -1391 -1865 -1555 -675 -382 -1716 -1830 -1009 258 -796 -1994 -1116 590 247
2476B47j506J74J264O62j511o24J529J191p44j198K94J371K27m94l71K38R37L02
$$ 247 -1259 -1085 179 841 -670 -1294 235 1426 682 -516 -222 1149 1376 882 511 749 1686 1988
2494A988j147p47J523R01p98j658Q72J467l37j736j69K015J29j557p58J012O59
$$ 1988 841 94 1617 2518 1720 62 934 2401 2064 328 159 2174 2303 746 -12 1000 1659
2511A659l43r93n79R53M62o68r45J18P85R0j140p13P92R17j135j584N17J336p7
$$ 1659 1316 323 -256 697 1159 491 -454 -336 449 539 -601 -1314 -522 395 -740 -2324 -1807 -471 -548
2530e48k022N9J424M22j477n65P43R76n28r16o2R49M45m11p81K70J270L86p86
$$ -548 -2570 -2511 -1087 -665 -2142 -2707 -1964 -988 -1516 -2432 -2494 -1545 -1100 -1511 -2292 -2022 -752 -366 -1152
2549a152p05J095J208m34j490O40K171l47j456kJ615P33r13m36N14J244o1o74
$$ -1152 -1857 -762 446 12 -1478 -838 1333 986 -470 -472 1143 1876 963 527 1041 2285 2224 1550
2567A550M3N71M29kj254q0J540L8j186r50R89J007r37j364K29J774p28j557k66
$$ 1550 1593 2164 2593 2591 1337 1257 2797 2835 1649 699 1688 2695 1758 394 623 2397 1669 112 -154
2586a54R18J49p78j118L71O36P6j349m73P37N51n84j351Q6P25M99r73j103R57
$$ -154 764 913 135 -983 -612 24 100 -1249 -1722 -985 -434 -1018 -2369 -2283 -1558 -1059 -2032 -3135 -2178
2605b178J192q51j109L91J391m9j209P1J198L84p08n90M21J360J76q40R0O22J284
$$ -2178 -986 -1837 -2946 -2555 -1164 -1213 -2422 -2351 -1153 -769 -1477 -2067 -1646 -286 -110 -950 -860 -238 1046
2624A046m09j010M16J434L48j152k25Q40J564q34j247N03J417L5j635k30J322
$$ 1046 637 -373 43 1477 1825 673 448 1288 2852 2018 771 1274 2691 2726 1091 861 2183
2641B183O62o64j006j5J186k13r75q07Q89P35o66j597M9J639k14j234j031O24
$$ 2183 2845 2181 1175 1160 2346 2133 1158 351 1240 1975 1309 -288 -239 1400 1186 -48 -1079 -455
2659d55J308q44j572M25J088j20j295p80Q85R20o14r96L2J090K21r44n81O88P49
$$ -455 853 9 -1563 -1138 -50 -170 -1465 -2245 -1360 -440 -1054 -2050 -2018 -928 -707 -1651 -2232 -1544 -795
2678g95l24j018M54O58O31j004r12J081J334o47j176O97J130M22r63r75J235J238
$$ -795 -1119 -2137 -1683 -1025 -394 -1398 -2310 -1229 105 -542 -1718 -1021 109 531 -432 -1407 -172 1066
2696A066p26n76J3J283M30r74m47P86Q13l60j017M61J312j01o87r51O45J038m26
$$ 1066 340 -236 -223 1060 1490 516 69 855 1668 1308 291 752 2064 1963 1276 325 970 2008 1582
2715A582j445o0J602M97j407p12P75P35n18j347N50P80m8p81p89O67R18k70j294
$$ 1582 137 77 1679 2176 769 57 832 1567 1049 -298 252 1032 984 203 -586 81 999 729 -565
2734e65j39R42J48p25p12O17M94l00j169J75P01R2p19q40P00R85m43j048l23J293
$$ -565 -704 238 386 -339 -1051 -434 60 -240 -1409 -1234 -533 -441 -1160 -2000 -1300 -315 -758 -1806 -2129 -836
2754h36N49j176p59P36J035n7j403M5J248N48p89p52Q02J062k45r29pJ159O55
$$ -836 -287 -1463 -2222 -1486 -451 -508 -1911 -1866 -618 -70 -859 -1611 -809 253 8 -921 -928 231 886
2773H86n14q16M69J286k73o54K9J011P18j007l45M37J015K8j414J04J043k0m62
$$ 886 372 -444 25 1311 1038 384 413 1424 2142 1135 790 1227 2242 2270 856 960 2003 1983 1521
2792A521o67K97J070l59j182m7Q01N23p86j217M52J000k15j468m76J299K22j256
$$ 1521 854 1151 2221 1862 680 633 1434 1957 1171 -46 406 1406 1191 -277 -753 546 768 -488
2810d88r41Q86P39n95j091l70P98L15p21o23K83O93k04j029m26J148N21m52r99
$$ -488 -1429 -543 196 -399 -1490 -1860 -1062 -747 -1468 -2091 -1808 -1115 -1319 -2348 -2774 -1626 -1105 -1557 -2556
2829b556N09J297l94p23k59J055P56n67p42O88J265m01l70l59J307R05j139k66
$$ -2556 -2047 -750 -1144 -1867 -2126 -1071 -315 -882 -1624 -936 329 -72 -442 -801 506 1411 272 6
2847FO78J033K02j071O8J293K78q82k84p4J199J0j593J11J176N01j002q73K80
$$ 6 684 1717 1919 848 916 2209 2487 1605 1321 1247 2446 2456 863 974 2150 2651 1649 776 1056
2866A056J219l62j219k77Q10L38q28r73J30J123m64j162r10J130L24n60q98j64
$$ 1056 2275 1913 694 417 1227 1565 737 -236 -106 1017 553 -609 -1519 -389 -65 -625 -1523 -1687
2884a687J288n86j080j67R00N13q45o82L82P68P0q57p14J164Q29n89r33P51J059
$$ -1687 -399 -985 -2065 -2232 -1332 -819 -1664 -2346 -1964 -1196 -1126 -1983 -2697 -1533 -704 -1293 -2226 -1475 -416
2903d16K01j011k62Q99J036n97j021R44Q87M72j219j53J188N27o56p72O70N84
$$ -416 -215 -1226 -1488 -589 447 -150 -1171 -227 660 1132 -87 -240 948 1475 819 47 717 1301
2921A301J84o60m46R35R76n88j181N70Q71K4j166l03Q34P31n55j599P67R43j02
$$ 1301 1485 825 379 1314 2290 1702 521 1091 1962 1986 820 517 1351 2082 1527 -72 695 1638 1536
2940A536j309n72J125L69q31j197O38P39l40r26n6N30N80n45j215K48R02J30r11
$$ 1536 227 -345 780 1149 318 -879 -241 498 158 -768 -824 -294 286 -259 -1474 -1226 -324 -194 -1105
2959a105n58Q48L86l51j231N97J021L9j016k53P22O67n93q57K87J039o8m16m37
$$ -1105 -1663 -815 -429 -780 -2011 -1414 -393 -354 -1370 -1623 -901 -234 -827 -1684 -1397 -358 -426 -842 -1279
2978a279N94P82o1j323M42J167O7r88n69J253P18k73q06O2J288K01r69k95O33
$$ -1279 -685 97 36 -1287 -845 322 389 -599 -1168 85 803 530 -276 -214 1074 1275 306 11 644
2997F44R44q12o03M02J290m16p35l74Q56O76m38j172L83R06L14o92j094O50P15
$$ 644 1588 776 173 575 1865 1449 714 340 1196 1872 1434 262 645 1551 1865 1173 79 729 1444
3016A444m54q94K37P14J79j004p12P37O70p82j092J72R63J7p86q30O07P08p10
$$ 1444 990 96 333 1047 1226 222 -490 247 917 135 -957 -785 178 195 -591 -1421 -814 -106 -816
3035h16j028L71J156l19p10m02M2R56l29r82l2J738j24j005n28J184L48l76q37
$$ -816 -1844 -1473 -317 -636 -1346 -1748 -1706 -750 -1079 -2061 -2093 -355 -479 -1484 -2012 -828 -480 -856 -1693
3054a693L67J304R7p59j75N48J335n28m15q0P08N92o01m30N78R91l15p37K36P40
$$ -1693 -1326 -22 75 -684 -859 -311 1024 496 81 1 709 1301 700 270 848 1839 1524 787 1023 1763
3074A763N07o18r31Q69J040q03q75L0R33L90j480m48O81Q41o34j013k23Q51K36
$$ 1763 2270 1652 721 1590 2630 1827 952 982 1915 2305 825 377 1058 1899 1265 252 29 880 1116
3093A116p76j052M16N69j73j117k08P59N06p99j380Q59Q41p57q14l45J115O43
$$ 1116 340 -712 -296 273 100 -1017 -1225 -466 40 -759 -2139 -1280 -439 -1196 -2010 -2355 -1240 -597
3111e97j023p85M34R58m56o60J97J153k3k65p62N89R15K90j157K39P41M74q1j253
$$ -597 -1620 -2405 -1971 -1013 -1469 -2129 -1932 -779 -802 -1067 -1829 -1240 -325 -35 -1192 -953 -212 262 181 -1072
3131a072R75J399k6j267J15J040Q35q23n45P38N81m12n94J88M72K82n90m10j57
$$ -1072 -97 1302 1276 9 124 1164 1999 1176 631 1369 1950 1538 944 1132 1604 1886 1296 886 729
3150G29J070j28q99l88J064P22j259j199P77Q52n30j252Q9Q06K37j227j42K74
$$ 729 1799 1671 772 384 1448 2170 911 -288 489 1341 811 -441 -352 454 691 -536 -678 -404
3168d04M23n33o69J4L67N03o32r57L70R08r9r31m82J181P58j102o93Q07R50l69
$$ -404 19 -514 -1183 -1169 -802 -299 -931 -1888 -1518 -610 -709 -1640 -2122 -941 -183 -1285 -1978 -1171 -221 -590
3188e90j281L74J032L74p17m12O50O35l19l77n7R04M17l15o76J59J194j07p58
$$ -590 -1871 -1497 -465 -91 -808 -1220 -570 65 -254 -631 -688 216 633 318 -358 -199 995 888 130
3207A30n45J177R17r12j075J047P91l26q78j72J259Q0o64k90JJ056l08o87q2J70
$$ 130 -415 762 1679 767 -308 739 1530 1204 326 154 1413 1493 829 539 540 1596 1288 601 519 689
3227F89O74n97p59Q5Q57K85j350p89J470P31j304q09O59J018n63q48o66J439k75
$$ 689 1363 766 7 92 949 1234 -116 -905 565 1296 -8 -817 -158 860 297 -551 -1217 222 -53
3246e3m76n30N9J138n91k98p14P52L88k08r12J24Q40L45j327j72P62O26q47p17
$$ -53 -529 -1059 -1000 138 -453 -751 -1465 -713 -325 -533 -1445 -1321 -481 -136 -1463 -1635 -873 -247 -1094 -1811
3266a811O35J085k25q01j92J076J44n69q8N11M90J13m85m56N16J088l45q73M23
$$ -1811 -1176 -91 -316 -1117 -1309 -233 -89 -658 -746 -235 255 368 -117 -573 -57 1031 686 -187 236
3285B36J023L71q72o13J094Q40r66r88P09J339l90j054k60R10J18n31l36L30L65
$$ 236 1259 1630 758 145 1239 2079 1113 125 834 2173 1783 729 469 1379 1497 966 630 960 1325
3304A325k53q4o69K58Q25q42o45J08O07J70j461m07P34O61o99j040K16N32J19
$$ 1325 1072 988 319 577 1402 560 -85 23 630 800 -661 -1068 -334 327 -372 -1412 -1196 -664 -545
3323e45q25m60P33M06o26l68k25Q73K61o13p98M66J113m93n77R1R95O67j119p34
$$ -545 -1370 -1830 -1097 -691 -1317 -1685 -1910 -1037 -776 -1389 -2187 -1721 -608 -1101 -1678 -1587 -592 75 -1044 -1778
3343a778J210J157p62q77P48P22J76m79l00P92O39J0o17J85O11M46m66n03j7J110
$$ -1778 -568 589 -173 -1050 -302 420 596 117 -183 609 1248 1258 641 826 1437 1883 1417 914 897 2007
3363B007j76j176j40J499J45j140n69P43P18k56j250J15P04K84j089n30N41j10
$$ 2007 1831 655 515 2014 2159 1019 450 1193 1911 1655 405 520 1224 1508 419 -111 430 320
3381C20L3p33n10Q49ln42p88N10N68m44j042J49J049L57j330p17O49R29o93m72
$$ 320 353 -380 -890 -41 -44 -586 -1374 -864 -296 -740 -1782 -1633 -584 -227 -1557 -2274 -1625 -696 -1389 -1861
3401a861m7J353j63p77p4P59L74l43n68K89N65P95q89j53L51R70k38p79j17J547
$$ -1861 -1908 -555 -718 -1495 -1569 -810 -436 -779 -1347 -1058 -493 302 -587 -740 -389 581 343 -436 -553 994
3421I94L17j127k78P15P22k54n15K12O55K43r58m52Q76L44j29q33r7P46L82r92
$$ 994 1311 184 -94 621 1343 1089 574 786 1441 1684 726 274 1150 1494 1365 532 435 1181 1563 571
3441E71k07K08R14o81q19k15J091J23j071m45N00P35n81q85k8Q38J05q49l11M95
$$ 571 364 572 1486 805 -14 -229 862 985 -86 -531 -31 704 123 -762 -790 48 153 -696 -1007 -512
3461e12N43k79q35l06N86P25q84m89L00R92m61p08m0O86N53r87m03O91O33n9q03
$$ -512 31 -248 -1083 -1389 -803 -78 -962 -1451 -1151 -159 -620 -1328 -1368 -682 -129 -1116 -1519 -828 -195 -254 -1057
3482a057J0P99N74q23n67O19N81j95n43J83P90L55o67l63Q56K16K74r43k73J300
$$ -1057 -1047 -248 326 -497 -1064 -445 136 -59 -602 -419 371 726 59 -304 552 768 1042 99 -174 1126
3502A126L06p37m11L84Q25l79p54J29P03L36n66m27L83P24l09r15o5Q76J51o06
$$ 1126 1432 695 284 668 1493 1114 360 489 1192 1528 962 535 918 1642 1333 418 353 1229 1380 774
3522G74r48N53P20j41j330J89P09M78j136m92K70P32j50o80k76J94P02j097k39
$$ 774 -174 379 1099 958 -372 -183 526 1004 -132 -624 -354 378 228 -452 -728 -534 168 -929 -1168
3541a168J73P74l14p68j88N31N28o70o86K67J283m34n28m26Q82M53l68o93K98
$$ -1168 -995 -221 -535 -1303 -1491 -960 -432 -1102 -1788 -1521 -238 -672 -1200 -1626 -744 -291 -659 -1352 -1054
3560a054P55L01p75j74Q86P57n70p69Q77O71J32q64L1Q01N76k82r09K97P95K08
$$ -1054 -299 2 -773 -947 -61 696 126 -643 234 905 1037 173 204 1005 1581 1299 390 687 1482 1690
3580A690q94J0N20L68l14o23R7P00K56q23n64O65M32l90j037n0J100l1j017n01
$$ 1690 796 806 1326 1694 1380 757 854 1554 1810 987 423 1088 1520 1130 93 43 1143 1112 95 -406
3600d06N85K50n94m69k15P05p8o17p21Q92O1l94p13M15N23Jr40l67Q81M03m50
$$ -406 179 429 -165 -634 -849 -144 -222 -839 -1560 -668 -607 -1001 -1714 -1299 -776 -775 -1715 -2082 -1201 -798 -1248
3621a248o08N11O89K29q19l56R53M09k33q08L32Q86L43o02k30N76R41k29q25L05
$$ -1248 -1856 -1345 -656 -427 -1246 -1602 -649 -240 -473 -1281 -949 -63 280 -322 -552 24 965 736 -89 216
3641B16Q01M22p77m61J123J93l66n66L23N48p5m04j45N29N82n55q10k31R04K86
$$ 216 1017 1439 662 201 1324 1517 1151 585 908 1456 1381 977 832 1361 1943 1388 578 347 1251 1537
3661A537n05j033L94Q46o52p46m64J342Q3j272l66O28P71p42j144N19M42J92j027
$$ 1537 1032 -1 393 1239 587 -159 -623 719 802 -470 -836 -208 563 -179 -1323 -804 -362 -170 -1197
3680a197l43M10P15k01p41j36P28N13o82k48J18R66k86j021O5R75L51q43k69O87
$$ -1197 -1540 -1130 -415 -616 -1357 -1493 -765 -252 -934 -1182 -1064 -98 -384 -1405 -1340 -365 -14 -857 -1126 -439
3700d39N54m44k83j90J161N0m64n89P73L74J32n19l9R02j67l96p93Q06Q17k56
$$ -439 115 -329 -612 -802 359 409 -55 -644 129 503 635 116 77 979 812 416 -377 429 1246 990
3720I90j032O2J172j14o92k93P39M44j86p24j02Q31L39j184m09N52O31k44r78
$$ 990 -42 20 1192 1078 386 93 832 1276 1090 366 264 1095 1434 250 -159 393 1024 780 -198
3739a98J08O52k9n07o44K51Q61j02p69k07R26K4q37m68K86P93l03j104N79J28
$$ -198 -90 562 533 26 -618 -367 494 392 -377 -584 342 366 -471 -939 -653 140 -163 -1267 -688 -560
3759e60M32n42l18j63J095m82n30k3L73L07j31p99L54J038j95q13l94J221K45
$$ -560 -128 -670 -988 -1151 -56 -538 -1068 -1091 -718 -411 -542 -1341 -987 51 -144 -957 -1351 -130 115
3778A15o12l27N00O56j47p82J97Q58O11p55n51N79Q94o7o26m89Q72L02k89o73
$$ 115 -497 -824 -324 332 185 -597 -400 458 1069 314 -237 342 1236 1169 543 54 926 1228 939 266
3798B66L97Q63j74n10n25Q02M85r04m36L03R23l36j215K69N81L04q51n85N10L08
$$ 266 663 1526 1352 842 317 1119 1604 700 264 567 1490 1154 -61 208 789 1093 242 -343 167 475
3818D75j10o17n37O90M27q71k69k29Q54l51n57k6L01M87n15o07K89N17l35l42
$$ 475 365 -252 -789 -99 328 -543 -812 -1041 -187 -538 -1095 -1121 -820 -333 -848 -1455 -1166 -649 -984 -1326
3838a326m7N30J77o5r95O60P54l02m83j19Q59M26n94n58P21O80M60j077j74R67
$$ -1326 -1373 -843 -666 -731 -1726 -1066 -312 -614 -1097 -1216 -357 69 -525 -1083 -362 318 778 -299 -473 494
3858D94O96n26o44O47O84k33k78j75O99J3m40o00R16M91l3j082K02J99L48m61
$$ 494 1190 664 20 667 1351 1118 840 665 1364 1377 937 337 1253 1744 1711 629 831 1030 1378 917
3878I17o44K17N91J84r87k5L23K49p32n02K93K24J48r92r2J22M33l96p00P13L18
$$ 917 273 490 1081 1265 278 253 576 825 93 -409 -116 108 256 -736 -828 -706 -273 -669 -1369 -656 -338
3899c38m7q50m30N37M43m32m30L22Q14k49n28k27P61N60m75n05K18R04J90j052
$$ -338 -385 -1235 -1665 -1128 -685 -1117 -1547 -1225 -411 -660 -1188 -1415 -654 -94 -569 -1074 -856 48 238 -814
3919h14J4O52N19n88l01O70O97j10p63p3J026K53o53M1r0P27J09p03k38O02N93
$$ -814 -800 -148 371 -217 -518 152 849 739 -24 -97 929 1182 529 570 480 1207 1316 613 375 977 1570
3940A570o37o40J71P95Q4q45k50P39K74n69p59N55K39k14m87n3J78K65j27p60
$$ 1570 933 293 464 1259 1343 498 248 987 1261 692 -67 488 727 513 26 -27 151 416 289 -471
3960d71O41j95K40o47k42O27O2j49r78J34O30J28n33l69Q17L35p71k21r3Q67k68
$$ -471 170 -25 215 -432 -674 -47 15 -134 -1112 -978 -348 -220 -753 -1122 -305 30 -741 -962 -1055 -188 -456
3981d56k26j56M91J88j27m50j37K91O88l94o89N26P69l89n34qJ342k76j007j0
$$ -456 -682 -838 -347 -159 -286 -736 -873 -582 106 -288 -977 -451 318 -71 -605 -613 729 453 -554 -564
4001e64Q34N25k68q88N46Q57n60k76n0N23J75j18l9l89Q45J4p37n64R24O75k29
$$ -564 270 795 527 -361 185 1042 482 206 156 679 854 736 697 308 1153 1167 430 -134 790 1465 1236
4022A236j162K87M36O6m96n43R26N46q77n38j13O31J35q09o9J60L49j85m58l05
$$ 1236 74 361 797 863 367 -176 750 1296 419 -119 -232 399 534 -275 -344 -184 165 -20 -478 -783
4042g83P17J79m17o91M08M06k28r28J30O51k28m41J9N24K73j59q11K20Q60jn90
$$ -783 -66 113 -304 -995 -587 -181 -409 -1337 -1207 -556 -784 -1225 -1206 -682 -409 -568 -1379 -1159 -299 -300 -890
4063h90k48M27P91k31o41J54J86M70j26l78N28N49L4q87J48J144j47o8q26P36
$$ -890 -1138 -711 80 -151 -792 -638 -452 18 -108 -486 42 591 625 -262 -114 1030 883 815 -11 725
4083G25O02k76m14j10R12l69j86l94K75P12j14q03k89N06O00o94p41M82O69l81
$$ 725 1327 1051 637 527 1439 1070 884 490 765 1477 1363 560 271 777 1377 683 -58 424 1093 712
4103G12r49k26Q00K9n56o00Q39J66o65j20k22K99K48p67k59J00P57q7q98Q0O19
$$ 712 -237 -463 337 366 -190 -790 49 215 -450 -570 -792 -493 -245 -1012 -1271 -1171 -414 -501 -1399 -1319 -700
4124g00J16r08l07P88O96k84p23k68J294J70n43k63P00Q1Q8m37K70M82J64j02
$$ -700 -584 -1492 -1799 -1011 -315 -599 -1322 -1590 -296 -126 -669 -932 -232 -151 -63 -500 -230 252 416 314
4144C14k87K7R60L2r71M0O47N96k41o76J32O28m9o29R4P41J0m56m97M71J79l77
$$ 314 27 54 1014 1046 75 115 762 1358 1117 441 573 1201 1152 523 617 1358 1368 912 415 886 1065 688
4166F88l70J26K02K89o59l65N33J60J39r84j20K46M91p59n92K67L04O5o40k6Q44
$$ 688 318 444 646 935 276 -89 444 604 743 -241 -361 -115 376 -383 -975 -708 -404 -339 -979 -1005 -161
4187a61Q9p67k69L28M21k44m76k03O60J10K57q96M50K60M50q02K3Q32j4q0q72
$$ -161 -72 -839 -1108 -780 -359 -603 -1079 -1282 -622 -512 -255 -1151 -701 -441 9 -793 -770 62 48 -32 -904
4208i04O14N74j66n34j18Q27M17k04m79N06K63k69o66M00K72K64r9m34j19Q00
$$ -904 -290 284 118 -416 -534 293 710 506 27 533 796 527 -139 261 533 797 698 264 145 945
4228I45J06q44k14Q28J20j39p26M03O45k55p78n9P92k39j59o97L62M87k5o60j96
$$ 945 1051 207 -7 821 941 802 76 479 1124 869 91 32 824 585 426 -271 91 578 553 -107 -303
4249c03O60j73J9n10k49P26K85r10l40J63R06o97k99J67N23j50o41K28LL46m58
$$ -303 357 184 203 -307 -556 170 455 -455 -795 -632 274 -423 -722 -555 -32 -182 -823 -595 -592 -246 -704
4270g04j94K03J47K26n86n1M30L21K76p95L17K42M4l79j78O15P6m39O8k12R34
$$ -704 -898 -695 -548 -322 -908 -959 -529 -208 68 -727 -410 -168 -124 -503 -681 -66 10 -429 -361 -573 361
4291C61K83q20P7N99M02m94n59L27R87k26m52K46J94j88m9m24J8Q54ll46l64L06
$$ 361 644 -176 -99 500 902 408 -151 176 1163 937 485 731 925 737 688 264 282 1136 1133 787 423 729
4313G29L60n91j37l0L01J51n45k17J19N47k26q86K10M39k91l52l79L78M80l71
$$ 729 1089 498 361 331 632 783 238 21 140 687 461 -425 -215 224 -67 -419 -798 -420 60 -311
4333c11p53Q1L11O28q72k78L79O02n56n68K7P02k39l73m7O26K59n16O6O5N34K74
$$ -311 -1064 -983 -672 -44 -916 -1194 -815 -213 -769 -1337 -1310 -608 -847 -1220 -1267 -641 -382 -898 -832 -767 -233 41
4355D1o14m59Q57K58j05m75K36Q00K42q34K07J36O02m8o37L83L45M92p05m4K26
$$ 41 -573 -1032 -175 83 -22 -497 -261 539 781 -53 154 290 892 844 207 590 935 1427 722 678 904
4376I04O34k09p55K1K45K23j20m24K72N35q47k18j38N62l9m35o36N77K71n67k92
$$ 904 1538 1329 574 595 840 1063 943 519 791 1326 479 261 123 685 646 211 -425 152 423 -144 -436
4397d36n9K14L52j013J76k0O76m72l30m1R8M10l14q16O44O42m63k49j69O31Lk26
$$ -436 -495 -281 71 -942 -766 -786 -110 -582 -912 -953 -855 -445 -759 -1575 -931 -289 -752 -1001 -1170 -539 -536 -762
4419g62m25M31P38m10m24K72M98N5k67j70M40N47k94l55J49N06L33o59l85P39
$$ -762 -1187 -756 -18 -428 -852 -580 -82 -27 -294 -464 -24 523 229 -126 23 529 862 203 -182 557
4439E57L56k0p46K85N43Lk18n02M11L09J9r28J65L91K95m29m24j8N04L12q03j62
$$ 557 913 893 147 432 975 978 760 258 669 978 997 69 234 625 920 491 67 49 553 865 62 -100
4461a00N69K97o47p07N05M82k18p36P0N28P3n86n66P05L00k55m55k22N11L78m18
$$ -100 469 766 119 -588 -83 399 181 -555 -485 43 116 -470 -1036 -331 -31 -286 -741 -963 -452 -74 -492
4482d92m61L0L84J50k98j18M89L69m19o17O60Mj0l85q5Q26jl57k28K69N84j49
$$ -492 -953 -923 -539 -389 -687 -805 -316 53 -366 -983 -323 -319 -329 -714 -799 27 26 -331 -559 -290 294 145
4504A45j61m58O27J86j69l66M35M56l10j09j83M04J50q1j45Q5K97k0n32k50P72
$$ 145 -16 -474 153 339 170 -196 239 695 385 276 93 497 647 566 421 506 803 783 251 1 773
4525G73L33m05m54J49M73M7k54o89L98L43j64l72j28P09l56o30J06J24M73m44
$$ 773 1106 701 247 396 869 916 662 -27 371 714 550 178 50 759 403 -227 -121 3 476 32
4545C2l64J62J79ql47m97M02N92o94o37L49N29Qp21J90J47P18o75n74J55M50M10
$$ 32 -332 -170 9 1 -346 -843 -441 151 -543 -1180 -831 -302 -294 -1015 -825 -678 40 -635 -1209 -1054 -604 -194
4567a94p68J00J82O09m71j22J54L11M62n04k68J82O67K7o58L47L44K71l21j73
$$ -194 -962 -862 -680 -71 -542 -664 -510 -199 263 -241 -509 -327 340 367 -291 56 400 671 350 177
4587A77L49J86L41r69M32N85K9m16k69M66M38m11p06M36J1N37m29o30L51K10j69
$$ 177 526 712 1053 84 516 1101 1130 714 445 911 1349 938 232 668 679 1216 787 157 508 718 549
4608E49l38N0L81r5p42m8k3L24j35m22K5M88k64m70j47L25ln5o67K44L47J10o45
$$ 549 211 261 642 547 -195 -243 -266 58 -77 -499 -474 14 -250 -720 -867 -542 -545 -600 -1267 -1023 -676 -566 -1211
4631a211J09L01M53l37m19k23J198l49j35m48O01M41Q1p78L60N84Q3k5l47L30
$$ -1211 -1102 -801 -348 -685 -1104 -1327 -129 -478 -613 -1061 -460 -19 62 -716 -356 228 311 286 -61 269
4651B69M47l01k67N5K99K65m80l65P77M22m46j50J58K49K54n01k84L21N02n24
$$ 269 716 415 148 203 502 767 287 -78 699 1121 675 525 683 932 1186 685 401 722 1224 700
4671G00p02J46O73l6o45j58J54N80n58k06j04N78n5m59n39L29K38j47n81J43L76
$$ 700 -2 144 817 781 136 -22 132 712 154 -52 -156 422 367 -92 -631 -302 -64 -211 -792 -649 -273
4692b73j88k0o81P04M3p8l45j08P75m62j52j28L97j8j17j46K91O15J01q89j99
$$ -273 -461 -481 -1162 -458 -415 -493 -838 -946 -171 -633 -785 -913 -516 -534 -651 -797 -506 109 210 -679 -878
4713h78O66r0N74p61K58O48o2m13l27P23L70l47m18P0N36K84m93o3J46K39j01
$$ -878 -212 -302 272 -489 -231 417 355 -58 -385 338 708 361 -57 13 549 833 340 277 423 662 561
4734E61k29l02N40L33l44n96O09M26p45l09J62L08L52p16k88L54L52j43k88k97
$$ 561 332 30 570 903 559 -37 572 998 253 -56 106 414 766 50 -238 116 468 325 37 -260
4754b60L53M65m41l71K17L81l55n77K16M97r1l78k42Q7J88J29n95l4N98K11n35
$$ -260 93 558 117 -254 -37 344 -11 -588 -372 125 34 -344 -586 -499 -311 -182 -777 -811 -213 -2 -537
4775e37q6J4L49J8o46O8O99N2l34m18J24N04L29q81M25L32k6j76k71N13j01L81
$$ -537 -623 -609 -260 -242 -888 -820 -121 -69 -403 -821 -697 -193 136 -745 -320 12 -14 -190 -461 52 -49 332
4797C32n26j89P73r6p7k83L05N24k82k32n2J75M31l19j64K88L35j49n86R3K60
$$ 332 -194 -383 390 294 217 -66 239 763 481 249 197 372 803 484 320 608 943 794 208 301 561
4818E61N50q81o3L92K47l26n85j7P76P4o16m88M26N15l42l44m70N96R5l90n39
$$ 561 1111 230 167 559 806 480 -105 -122 654 728 112 -376 50 565 223 -121 -591 5 100 -290 -829
4839h29O22O7m6n98l09P27K29m12n55M18J90j30n7j87L42K02J35n88J80L54k4
$$ -829 -207 -140 -186 -784 -1093 -366 -137 -549 -1104 -686 -496 -626 -683 -870 -528 -326 -191 -779 -599 -245 -269
4860b69N8n52O57J15m41p3L59K94J75k05L8M48R7m07N7J18L48k07r1m46P90L23
$$ -269 -211 -763 -106 9 -432 -505 -146 148 323 118 156 604 701 294 351 469 817 610 519 73 863 1186
4882A186k45l03l24R08j31m02m22N81J36n75k82L62L39k99m57j67M93P6p51P5
$$ 1186 941 638 314 1222 1091 689 267 848 984 409 127 489 828 529 72 -95 398 474 -277 -202
4902b02O0K03j70l95j8O2M09k79m54ON67Oo64k49N74K6m15j19L19L15K46o13p5
$$ -202 -142 61 -109 -504 -522 -460 -51 -330 -784 -778 -211 -205 -869 -1118 -544 -518 -933 -1052 -733 -418 -172 -785 -860
4925h60K23L25O8l87j64O26L78n46oJ97O56k85n96K03P31k19%m78L07N67k24o19
$$ -860 -637 -312 -244 -631 -795 -169 209 -337 -343 -146 510 225 -371 -168 563 344 344 -134 173 740 516 -103
4947a03N77N70o67K66j88K62L49n69k22J61K71j38j29l77J72L36j9p11K92K24
$$ -103 474 1044 377 643 455 717 1066 497 275 436 707 569 440 63 235 571 552 -159 133 357
4967C57P7o01k38P41L94m99o22J16M00k30m04K15J71J5Kn77q3L48N9j40k55K68
$$ 357 434 -167 -405 336 730 231 -391 -275 125 -105 -509 -294 -123 -108 -106 -683 -766 -418 -359 -499 -754 -486
4989d86N07l18o43N03L17N6o22P9M80K17l37j15j50N12k6l11l3O33K3l40l84K24
$$ -486 21 -297 -940 -437 -120 -64 -686 -607 -127 90 -247 -362 -512 0 -26 -337 -370 263 286 -54 -438 -214
5011b14K41M12k28k22O0M07N4o76M95J71J08j20o60N48J03J53l42j7K53J39l33
$$ -214 27 439 211 -11 49 456 510 -166 329 500 608 488 -172 376 479 632 290 273 526 665 332
5032C32j00L53R7o1k62l19M82J67j82p85L99L54r4o22K97J62M98o80l71N41j10
$$ 332 232 585 682 621 359 40 522 689 507 -278 121 475 381 -241 56 218 716 36 -335 206 96
5053I6j5o28k28O63M65p80l90M25L60l09k46j0J47K68m00o09P84N27n41l02J0
$$ 96 81 -547 -775 -112 353 -427 -817 -392 -32 -341 -587 -597 -450 -182 -582 -1191 -407 120 -421 -723 -713
5074g13L64M7j23j78NQ43m43k85L65K40Mk57j46K58N62k47m50J34L91M60l87k79
$$ -713 -349 -302 -425 -603 -598 245 -198 -483 -118 122 126 -131 -277 -19 543 296 -154 -20 371 831 444 165
$$ [...]
8191b52
##END NTUPLES=NMR FID
##END=
