##TITLE=1H_Costus-F-ACN-f8
 CDCl3, 8 sc, 
 10.7.2020
##JCAMPDX= 6.0         $$ Bruker NMR JCAMP-DX V2.0
##DATA TYPE= NMR FID
##DATA CLASS= NTUPLES
##ORIGIN= UXNMR, Bruker Analytische Messtechnik GmbH
##OWNER= root
$$ XWIN-NMR		Version 3.5
$$ Fri Jul 10 10:26:25 2020 Russian Standard Time (UT+4h)  she@DPX200
##.OBSERVE FREQUENCY= 200.1315
##.OBSERVE NUCLEUS= ^1H
##.DELAY= (6, 6)
##.ACQUISITION MODE= SIMULTANEOUS
##.ACQUISITION SCHEME= undefined
##.AVERAGES= 8
##.DIGITISER RES= 18
##SPECTROMETER/DATA SYSTEM= spect
##.PULSE SEQUENCE= zg30
##.SOLVENT NAME= CDCl3
##.SHIFT REFERENCE= (INTERNAL, CDCl3, 0, 15.7039)
##AUDIT TRAIL= $$ (NUMBER, WHEN, WHO, WHERE, WHAT)
$$ ##TITLE= Audit trail, XWIN-NMR		Version 3.5
$$ ##JCAMPDX= 5.01
$$ ##ORIGIN= Bruker BioSpin GmbH
$$ ##OWNER= she
$$ F:/spectra/data/she/nmr/H-F/1/audita.txt
$$ ##AUDIT TRAIL=  $$ (NUMBER, WHEN, WHO, WHERE, WHAT)
(   1,<2020-07-10 10:24:40.17 +0400>,<she>,<DPX200>,
      <created by zg, POWCHK disabled, PULCHK disabled
       configuration hash MD5:
       00 E9 B6 7A A2 85 ED C7 34 08 36 98 17 FE 4E 26
       data hash MD5: 16K
       0F 24 E7 D0 09 3B 13 3B 35 A8 D9 DD 13 62 33 60>)
$$ ##END=
$$ 
$$ hash MD5
$$ 5F F9 86 27 4F 2B C8 A8 AF C8 7E AE 08 96 85 C3
##$RELAX= 
##$RELAX= 
##$RELAX= 
##$RELAX= 
##$RELAX= 
##$RELAX= 
$$ Bruker specific parameters
$$ --------------------------
##$DU= <F:/spectra>
##$EXPNO= 1
##$NAME= <H-F>
##$PROCNO= 1
##$TYPE= <nmr>
##$USER= <she>
##$AMP= (0..31)
100 100 100 100 100 100 100 100 100 100 100 100 100 100 100 100 100 100 
100 100 100 100 100 100 100 100 100 100 100 100 100 100 
##$AQSEQ= 0
##$AQ_mod= 1
##$AUNM= <au_zg>
##$AUTOPOS= <>
##$BF1= 200.13
##$BF2= 200.13
##$BF3= 200.13
##$BF4= 200.13
##$BF5= 200.13
##$BF6= 200.13
##$BF7= 200.13
##$BF8= 200.13
##$BYTORDA= 1
##$CFDGTYP= 0
##$CFRGTYP= 5
##$CHEMSTR= <none>
##$CNST= (0..31)
1 1 145 1 1 1 1 1 1 1 1 1 1 1 1 1 1 1 1 1 1 1 1 1 1 1 1 1 1 1 1 1 
##$CPDPRG= <>
##$CPDPRG1= <>
##$CPDPRG2= <>
##$CPDPRG3= <>
##$CPDPRG4= <mlev>
##$CPDPRG5= <mlev>
##$CPDPRG6= <mlev>
##$CPDPRG7= <mlev>
##$CPDPRG8= <mlev>
##$CPDPRGB= <>
##$CPDPRGT= <>
##$D= (0..31)
0 1.2 0 0 0 0 0 0 0 0.06 0 0.03 0 0 0 0 0.0002 0 0 0 0 0 0 0 0 0 0 0 0 
0 0 0 
##$DATE= 1594362279
##$DBL= (0..7)
120 120 120 120 120 120 120 120 
##$DBP= (0..7)
150 150 150 150 150 150 150 150 
##$DBP07= 0
##$DBPNAM0= <>
##$DBPNAM1= <>
##$DBPNAM2= <>
##$DBPNAM3= <>
##$DBPNAM4= <>
##$DBPNAM5= <>
##$DBPNAM6= <>
##$DBPNAM7= <>
##$DBPOAL= (0..7)
0.5 0.5 0.5 0.5 0.5 0.5 0.5 0.5 
##$DBPOFFS= (0..7)
0 0 0 0 0 0 0 0 
##$DE= 6
##$DECBNUC= <off>
##$DECIM= 24
##$DECNUC= <off>
##$DECSTAT= 4
##$DIGMOD= 1
##$DIGTYP= 9
##$DL= (0..7)
0 120 120 120 120 120 120 120 
##$DP= (0..7)
150 150 150 150 150 150 150 150 
##$DP07= 0
##$DPNAME0= <>
##$DPNAME1= <>
##$DPNAME2= <>
##$DPNAME3= <>
##$DPNAME4= <>
##$DPNAME5= <>
##$DPNAME6= <>
##$DPNAME7= <>
##$DPOAL= (0..7)
0.5 0.5 0.5 0.5 0.5 0.5 0.5 0.5 
##$DPOFFS= (0..7)
0 0 0 0 0 0 0 0 
##$DQDMODE= 0
##$DR= 18
##$DS= 0
##$DSLIST= <SSSSSSSSSSSSSSS>
$$ [...]
##$SUBNAM2= <"">
##$SUBNAM3= <"">
##$SUBNAM4= <"">
##$SUBNAM5= <"">
##$SUBNAM6= <"">
##$SUBNAM7= <"">
##$SUBNAM8= <"">
##$SUBNAM9= <"">
##$SW= 24.9337058887773
##$SWIBOX= (0..15)
0 0 2 0 0 0 0 0 0 0 0 0 0 0 0 0 
##$SW_h= 4990.01996007984
##$TD= 16384
##$TD0= 1
##$TE= 0
##$TE2= 300
##$TE3= 300
##$TEG= 300
##$TL= (0..7)
0 120 120 120 120 120 120 120 
##$TP= (0..7)
150 150 150 150 150 150 150 150 
##$TP07= 0
##$TPNAME0= <>
##$TPNAME1= <>
##$TPNAME2= <>
##$TPNAME3= <>
##$TPNAME4= <>
##$TPNAME5= <>
##$TPNAME6= <>
##$TPNAME7= <>
##$TPOAL= (0..7)
0.5 0.5 0.5 0.5 0.5 0.5 0.5 0.5 
##$TPOFFS= (0..7)
0 0 0 0 0 0 0 0 
##$TUNHIN= 0
##$TUNHOUT= 0
##$TUNXOUT= 0
##$USERA1= <user>
##$USERA2= <user>
##$USERA3= <user>
##$USERA4= <user>
##$USERA5= <user>
##$V9= 5
##$VALIST= <valist>
##$VCLIST= <CCCCCCCCCCCCCCC>
##$VD= 0
##$VDLIST= <DDDDDDDDDDDDDDD>
##$VPLIST= <PPPPPPPPPPPPPPP>
##$VTLIST= <TTTTTTTTTTTTTTT>
##$WBST= 1024
##$WBSW= 4
##$XGAIN= (0..3)
0 0 0 0 
##$XL= 0
##$YL= 0
##$YMAX_a= 277311
##$YMIN_a= -123388
##$ZGOPTNS= <>
##$ZL1= 120
##$ZL2= 120
##$ZL3= 120
##$ZL4= 120
##$ABSF1= 10
##$ABSF2= 0
##$ABSG= 5
##$ABSL= 3
##$ALPHA= 0
##$AQORDER= 0
##$ASSFAC= 0
##$ASSFACI= 0
##$ASSFACX= 0
##$ASSWID= 0
##$AUNMP= <proc_1d>
##$AZFE= 0.1
##$AZFW= 0.1
##$BCFW= 1
##$BC_mod= 2
##$BYTORDP= 1
##$COROFFS= 0
##$CY= 11.3945322036743
##$DATMOD= 1
##$DC= 2
##$DFILT= <>
##$DTYPP= 0
##$F1P= 16.9975609425685
##$F2P= -3.02152046262296
##$FCOR= 0.5
##$FTSIZE= 0
##$FT_mod= 4
##$GAMMA= 1
##$GB= 0.15
##$INTBC= 1
##$INTSCL= 1
##$ISEN= 128
##$LB= 0.24
##$LEV0= 0
##$LPBIN= 0
##$MAXI= 10000
##$MC2= 0
##$MEAN= 0
##$ME_mod= 0
##$MI= 1.114404
##$NCOEF= 0
##$NC_proc= 0
##$NLEV= 6
##$NOISF1= 3.799351
##$NOISF2= 2.8
##$NSP= 1
##$NTH_PI= 0
##$NZP= 0
##$OFFSET= 15.70392
##$PC= 1
##$PHC0= -9788.833
##$PHC1= 7.200921
##$PH_mod= 1
##$PKNL= yes
##$PPARMOD= 0
##$PSCAL= 0
##$PSIGN= 0
##$REVERSE= no
##$SF= 200.130013532006
##$SI= 16384
##$SIGF1= 3
##$SIGF2= 2
##$SINO= 400
##$SIOLD= 16384
##$SREGLST= <1H.CDCl3>
##$SSB= 0
##$STSI= 0
##$STSR= 0
##$SW_p= 3612.71676300578
##$SYMM= 0
##$S_DEV= 0
##$TDeff= 0
##$TDoff= 0
##$TI= <>
##$TILT= no
##$TM1= 0
##$TM2= 0
##$TOPLEV= 0
##$USERP1= <user>
##$USERP2= <user>
##$USERP3= <user>
##$USERP4= <user>
##$USERP5= <user>
##$WDW= 1
##$XDIM= 8192
##$YMAX_p= 0
##$YMIN_p= 0
$$ End of Bruker specific parameters
$$ ---------------------------------
##NTUPLES= NMR FID
##VAR_NAME=  TIME,          FID/REAL,        FID/IMAG
##SYMBOL=    X,             R,               I
##VAR_TYPE=  INDEPENDENT,   DEPENDENT,       DEPENDENT
##VAR_FORM=  AFFN,          ASDF,            ASDF
##VAR_DIM=   8192,          8192,            8192
##UNITS=     SECONDS,       ARBITRARY UNITS, ARBITRARY UNITS
##FACTOR=    0.0002004,     1,               1
##FIRST=     0,             0,               0
##LAST=      1.6414764,     0,               0
##MIN=       0,             -123388,         0
##MAX=       1.6414764,     277311,          0
$$ Real data points
##PAGE= N=1
##DATA TABLE= (X++(R..R)), XYDATA
0@%%%%%%%%qJ6j6J6k3L1l2M0m8N6p1Q4r8J14j32J53j75K01k32K65l00L39l83M33
32B30m86N43o08O79p59Q45r37J039j152J276j411J562j731J918k127K365k635
49a389K944l303L730m243M870n665O710q149J0272j3766K0849o0675J63404O9148
63A84737k48105o0020J52048P3126j44718p7129Q2806P2995m7824k2720M6288
74A1484J9600m3351j283L4339j2069n7679K746N6266K3113k4176L575K4053j5660
87B0958m3602R013M9477O297m4071p095M4661J4093m8458k4392M0474K8176l3942
100A1589k2851M1392L2327l7419l5476L7747M3881l0969m7720J7205M2810o275
112D6241k5647R504J3067k2100j1501L2482J5276l7056k1446M2123L1129l9432
$$ y = [0, 0, 0, 0, 0, 0, 0, 0, 0, -8, 8, -8, 8, -15, 16, -16, 24, -24, 32, -39, 45, -53, 61, -71, 82, -93, 108, -124, 141, -159, 180, -203, 230, -256, 287, -321, 358, -401, 444, -493, 546, -606, 670, -741, 821, -910, 1008, -1119, 1246, -1389, 1555, -1748, 1982, -2261, 2609, -3056, 3654, -4495, 5777, -7989, 12860, -47815, 115589, 184737, -63368, -123388, 28660, 101786, -42932, -120061, -37255, 35740, -12084, -34804, 11484, 31084, -12267, -13550, 20789, 8720, -48959, -46213, 10053, 33166, 8990, 12565, 36618, 20958, -22644, -13631, 35846, 42143, -1928, -9023, 35638, 49731, 1273, -23119, 17355, 45531, 11589, -11262, 30130, 62457, 25038, -10438, 27309, 71190, 40221, -7499, 9706, 52516, 46241, 20594, 30098, 43165, 21065, 9564, 42046, 57322, 20266, -1180, 40943, 72072, 32640]
124C2640m1316K7315M6844l564k8808p45Q766j0477l381J9953N05l6131j3426
137a825L8584L0924k5312l3084J4544L0506r620k9481N19K4490R180r482o454
150C3489k605o919r55J1890O234j0883r075O029O893n994p191L483J711p433k954
165A5720J0439J2416K074l125l179q046r955k079L667k246m243R564J7060j290
179C6777k0480q597J4430Q453j4997j6118O764J5341L783l116K857Q77o552m438
193A4984K370n232j3426m74J6062P453j0813p381O208L341m857M25N690o485j1264
208c399Q063J7142m707k0366j95J7099o04k2225o055J8538J0460j1248q227N882
222A58K765r875n079N826N042l042N98N697l95o293o54L457o497j2689l01J2078
$$ y = [32640, -8676, 18639, 65483, 61919, 33111, 32366, 41132, 30655, 27274, 47227, 47732, 11601, -1825, 36759, 67683, 42371, 9287, 23831, 54337, 44717, 15236, 15755, 40245, 49425, 39943, 33489, 30884, 23965, 23010, 34900, 41134, 30251, 21176, 27205, 34098, 28104, 20913, 24396, 26107, 18674, 15720, 26159, 38575, 40649, 37524, 34345, 26299, 16344, 14265, 17932, 15686, 11443, 21007, 38067, 36777, 16297, 7700, 22130, 30583, 15586, -532, 6232, 21573, 25356, 22240, 25097, 25974, 19422, 14984, 17354, 12122, -1304, -1778, 14284, 21737, 10924, 3543, 9751, 13092, 8235, 8660, 14350, 7865, -3399, 4664, 21806, 17099, -3267, -3462, 13637, 13033, -9192, -15247, 3291, 13751, 2503, -5724, 158, 2923, -6952, -12031, -6205, -1163, -4205, -3607, 2090, 1695, -4598, -5252, -1795, -8292, -20981, -21282, -9204]
238i204K024j0992k278J4450N842j4231j1645Q530Q247q591o875R983Q488j0022
252a6274j0797P230P354r825j0359P257R993n488q724M058M300p877m876Q155
266b5873M132p892n98J4790N359j5977j1999Q669P234j1472j0696R458J3379k949
280b4435q930L989P892n866j0083J935P902r89n884L529Q035r88o116Q73N260
295b3876k286o282Q99L819l600o058M377Q437K61m039M473P962k154q131n60M460
311b2298k205o358L407J0653L506m549j750L193m91n913l384L163M519K725L850
326a1932L550k62k756j09J537j833l153L346Q308J885m990k089L368P1n887j354
342a2300P522N693j927m96P185L996o524p062L042N521j673k018M169O728m4m061
$$ y = [-9204, -7180, -18172, -20450, -6000, -158, -14389, -26034, -17504, -9257, -17848, -24723, -14740, -6252, -16274, -27071, -19841, -12487, -22312, -32671, -25414, -15421, -20909, -29633, -25575, -21275, -29152, -34028, -25873, -21741, -29633, -30231, -15441, -10082, -26059, -38058, -29389, -22155, -33627, -44323, -34865, -21486, -24435, -33365, -29376, -21484, -27350, -37433, -35498, -27596, -28585, -34469, -30940, -22905, -23893, -30009, -29136, -23876, -26162, -32444, -31545, -27726, -31326, -37384, -33007, -24570, -24309, -28348, -23875, -15913, -18067, -26198, -26758, -22298, -24503, -30861, -27454, -16801, -13295, -17844, -19594, -16401, -16892, -22805, -26189, -23026, -18507, -15782, -11932, -8382, -8644, -11400, -11509, -9972, -11805, -14958, -11612, -3304, -1419, -6409, -8498, -5130, -5059, -10946, -12300, -4778, 915, -1012, -1508, 5677, 9673, 3149, -3913, -871, 4650, 2977, 959, 5128, 11856, 11812, 7751]
358G751k029l33j051K93K311K138P86K945K830j521l503M93M116J125k569Q60
374A4642M726K433n423o602j15L911J539j778J544O122L974j364l947k707p26
389A6229o64N49J343J416L198M827J015n564n015p0J001l599k688M578N942j31
405B2367k562K700L997k022n649n39L089L52k793o69J902J206j117p13N2N27K19
422B0347q46j145j592l14J089J224K94M50K688J740j979l181m04Q18k555n264
438A1370R1O165L228l401j890K601K65m575l069L245L168k95m79K310l5l384k295
455A3020O63q26k694o2K570J504p36L56K46l898m659o0L739J440j163J333M619
472A5392O98o509n374Q74K216j746l507J027L377N1k841o67J773o01k246j565
$$ y = [7751, 5722, 5389, 4338, 4631, 6942, 9080, 9866, 12811, 15641, 14120, 10617, 11110, 15226, 16351, 13782, 14642, 19368, 21801, 16378, 9776, 9661, 13572, 15111, 13333, 14877, 20999, 24973, 23609, 19662, 16955, 16229, 15565, 16114, 17457, 18873, 22071, 26898, 27913, 22349, 17334, 17264, 18265, 14666, 11978, 16556, 22498, 22367, 19805, 22505, 26502, 24480, 18831, 18292, 21381, 21733, 18940, 18271, 20173, 21379, 20262, 19549, 19601, 20128, 20347, 19501, 18356, 16764, 16450, 17539, 18763, 19057, 19507, 22195, 23935, 21956, 18775, 18371, 19189, 16634, 11370, 11461, 17626, 20854, 17453, 15563, 18164, 18429, 13854, 10785, 14030, 17198, 16903, 16424, 18734, 18699, 15315, 13020, 13683, 12857, 10163, 10101, 12671, 14175, 13439, 13795, 14041, 10143, 5484, 5424, 9163, 10603, 9440, 10773, 15392, 16090, 9581, 4207, 5081, 7297, 5551, 2044, 3071, 6448, 6499, 3658, 2991, 4764, 4163, 1917, 352]
488C52Q5Q49J510n6k226k488Q06J700k003l577J466M704j515p926l768L965K284
505e838k834j541L611K730k439l444L30J989j139k967k503p36R60J122m87r66
521a4152J64J329j300m153k567K544M503j104o208k061M901M778k360m183J130
536a8739K992k732n804j299L341K059j399q40J269Q5j164o0J395k53j716l36L16
553b2885O43K291J796j289m173j903L298K294k347j826L897L441k976o081O53
568b5167O066L014l572j881L703L301k327k843K459K695k521l649R31L688K569
583a3534m60K81p95j420L03K147K130l38J609J834o89l688o98L045L645N16O8
600f044m2q09j270J040K206j20k949M2L973M151K1j548J609K257k50n833l005
$$ y = [352, 437, 1286, 2796, 2740, 514, -1974, -1168, 532, -1471, -5048, -3582, 1122, -393, -8319, -12087, -8122, -5838, -8672, -10213, -6602, -3872, -6311, -9755, -9425, -7436, -8575, -11542, -14045, -14781, -13821, -12699, -13186, -14152, -13988, -12659, -13959, -18112, -20679, -18135, -13632, -14736, -20944, -23005, -18104, -13326, -15686, -19869, -18739, -15747, -18479, -24283, -25582, -22241, -20182, -21581, -22421, -21152, -21067, -22231, -22291, -20896, -21149, -22865, -23201, -22885, -22242, -19951, -18155, -19444, -23617, -25520, -22222, -19928, -22275, -24101, -20204, -16763, -19739, -25820, -25167, -19101, -16087, -19659, -21540, -17837, -14536, -16863, -19706, -17247, -14552, -17073, -20722, -19791, -16103, -13534, -13994, -13713, -14508, -15928, -15625, -13478, -11348, -11686, -10077, -8243, -8932, -12620, -13318, -10273, -6628, -6112, -6044, -6086, -6895, -8165, -7125, -4919, -5039, -7988, -7946, -3973, 178, 199, -1349, 260, 2517, 2267, -3566, -6571]
617f571L841O303K146k009p49L31n64j348Q63J050K022J659R66k204k368K051
633E419L628l38l109P05M256Q15l168l70M013K82n608k930K611N066J792R71J627
650A5662o98m547k208J418J480j18J026L008R50j902r03O90m54k791j48K628J435
667A4528j646Q62L854K31m947l469K764L969R0k183K54K048J266j852k474k011
683A1284K87K768K018l99n52R56M03j743l884M5L683L193j448k941O43J971q37
700A5447k670o17K960J182j898j829J366K559r63k837j955J289J439J910j28q65
716A4390j87o1j812k849P95K783r87k484K079N204j082o338k677L182J719l402
732H273j018M126K083k433k675p91r28P21K105j02m212k050M424K928m341m753
$$ y = [-6571, -2730, 3573, 5719, 3710, 2961, 3292, 2728, 1380, 2243, 3293, 5315, 6974, 7940, 5736, 3368, 5419, 9047, 8709, 5600, 6305, 10561, 11376, 8208, 7838, 11851, 12133, 6525, 3595, 6206, 11272, 13064, 14035, 15662, 14964, 10417, 8209, 9627, 11107, 10989, 12015, 15023, 15973, 14071, 13168, 13858, 13404, 10613, 10465, 13093, 14528, 12882, 13744, 17598, 17829, 12882, 9413, 12177, 16146, 16236, 14053, 14307, 16355, 17621, 15769, 13295, 11284, 11571, 14339, 16357, 15958, 15406, 16362, 16765, 15022, 11138, 11183, 14866, 18059, 16611, 13670, 14313, 16284, 15447, 12777, 12160, 15120, 16302, 14404, 12575, 13941, 16500, 15537, 12700, 10745, 12034, 13473, 15383, 15255, 14390, 14203, 14142, 12330, 9481, 10276, 13059, 12072, 9588, 11667, 16871, 15789, 9451, 6774, 9956, 11675, 8273, 7255, 11381, 13464, 11031, 8356, 7565, 6637, 7358, 9463, 9361, 5149, 3099, 7523, 10451, 6110, 1357]
748A357K782M198m122m557K951O182j971p191j662M364j56n057J24N880J127n852
764a603k414L352O42n039k177M460J559l590k129L125J088m870j502L817%n365
780a0646m46N012r91o760J121Q135k59j0717l142R291L712q737m060Q017L891
795f579q244o124P002N944n204o038L147L410m459l611O069N166m304n241K593
810a6473J959m886k486O120M057n208m313N202N206o295o111N561N967n860o644
825b4204N542R619k797q369J444P459k843q485J388R273J010n770J66N467j416
840a2516n599O81O068j622m236L653P075k261p910J604P989j157q117J019R254
855f075R83p776p85P759K000o637k028O134K468m584q44N459K193m689j950L807
$$ y = [1357, 4139, 8337, 4215, -342, 2609, 8791, 6820, -371, -2033, 2331, 2175, -2882, -2758, 3122, 4249, -1603, -4017, -665, -23, -5062, -7239, -2779, -1220, -4810, -6939, -3814, -2726, -7596, -9098, -5281, -5281, -10646, -11092, -6080, -7071, -13831, -12710, -4575, -4834, -15551, -18693, -9402, -5690, -14427, -18487, -10470, -6579, -14823, -20947, -13945, -8001, -13205, -19243, -16096, -12686, -17145, -20756, -14687, -9521, -13825, -19066, -16473, -14514, -19400, -21886, -15766, -11709, -16917, -21230, -16028, -10822, -17117, -23228, -17667, -11700, -17560, -24204, -18662, -9043, -11840, -20209, -18765, -11306, -14149, -22634, -21246, -11973, -10963, -16733, -16567, -11100, -12516, -18115, -17434, -11366, -12988, -17224, -13571, -6496, -8757, -16667, -15063, -7074, -8231, -16348, -15329, -6075, -5092, -12868, -13653, -5894, -3894, -10531, -12559, -6425, -3957, -8541, -9385, -3926, -1733, -6422, -8372, -4565]
871d565J390k464O40M095O8m594k01M453J029l102L02M852J232m813j781M065
887F06K696l041k362L531M523j728l970O79L163J21k630p17K460K240K50q4L57
904F094p14j46k65r95n32J420L436J809j412j518O6m12j566q78J748K225J433
921I793k90l24P72J74o47k372p95K147K111j52o24J447J892j863m218M0K991P88
939A0870j789J074L434J66k949j332K697r9k491j25L464J451j510j152R64n00
955A2173k486p3K343N60k048J435L001k67l631j081L895J205m683j564N080L314
971A7173m495l570L642K811m598l341L685M305l165m049K078M043k403l185K285
986A1216K972k102k299K639J583m286l256L712K838m254l760M321M877l523n403
$$ y = [-4565, -3175, -5639, -4999, -904, -836, -5430, -5631, -1178, -149, -3251, -2949, 1903, 3135, -1678, -3459, 606, 3302, 261, -2101, 1430, 5953, 4225, 255, 934, 4097, 4218, 1588, 871, 3331, 5571, 5821, 5737, 6094, 5380, 5234, 4969, 3974, 3442, 4862, 8298, 10107, 8695, 7177, 7243, 6831, 5265, 4387, 6135, 8360, 9793, 9503, 9179, 9951, 10125, 9478, 7106, 6311, 8458, 10569, 10417, 9793, 11240, 13132, 11269, 7051, 7091, 10082, 10870, 9081, 10155, 13589, 13755, 10806, 9474, 12171, 12072, 9581, 9456, 12920, 14371, 12861, 11709, 12673, 12173, 9687, 9614, 11957, 12517, 10469, 11904, 14905, 14638, 11007, 9926, 13821, 15026, 10343, 8779, 13859, 17173, 12678, 9108, 12750, 15561, 10963, 7622, 11307, 15612, 12447, 8398, 10476, 14519, 12116, 8931, 11216, 14188, 12086, 9787, 12426, 14009, 9723, 6467, 10179, 13017, 8763, 5003, 9324, 14201, 10678, 5275]
1001E275K245L699l194n352K688O232j099n603M81M335j398n390m67L681j1l586
1017B536m70K681J93l034m40K027j160l537J272M215q08m252j73K798j152n325
1033d629m58M819N88m661j928M040J546n053k683L414K287l356l363K808L446
1048c183j602k915R14Q43k936k180J775J758k060j828R60J352j883j816J601K069
1064i131j701j827J431Q45j794j401J911K136k610l504J334L514n80l181n25K247
1080a2836L13k798j000K981K008o62j369N44N48j36j158M97L97n3j49o17p50l13
1098a4553K252J372j104k384J38K787J622j703q97J347J905j366j704R71K717
1113h600P05j145q36Q8k29l75M72Q87O37q46l69J552J497N94M71K1n47j232N85
$$ y = [5275, 7520, 11219, 8025, 2673, 5361, 11593, 10494, 4891, 5372, 9707, 8309, 2919, 2452, 6133, 6122, 2536, 2066, 4747, 4940, 1906, 1466, 3493, 2333, -1204, 68, 4283, 3475, -777, -950, 1848, 696, -4629, -5087, -268, 320, -4341, -6269, -2229, -683, -5736, -8419, -5005, -2718, -6074, -9437, -6629, -3183, -4785, -7700, -6786, -5943, -8879, -11059, -9284, -7526, -9586, -11414, -10454, -9102, -10985, -12801, -11200, -9131, -10832, -12659, -11228, -10383, -12177, -13578, -11667, -9531, -12141, -15645, -14311, -10797, -11377, -14558, -15083, -12836, -12523, -15321, -16321, -13340, -11332, -11994, -13363, -12819, -12271, -12407, -13565, -13068, -12671, -12724, -12873, -13490, -14240, -14553, -12301, -10929, -12033, -14417, -14279, -11492, -9870, -11573, -12470, -11123, -9218, -10584, -12288, -11317, -8600, -7895, -9040, -9876, -9788, -10017, -10392, -9920, -9033, -8396, -9242, -9611, -8059, -6562, -5968, -5497, -5476, -6023, -7255, -6670]
1132f670P22J21R9J049J072j037q80J39J936M11j443m64J012J568l49K10J892
1149f12J256m93j816o97J665J127n04j004K34M34L00k87m70J150J866O28p38m24
1167A615P31N59O13k12o64p39J077P04K44L69M87K02j054j488l08J181Q93K51
1185D461R91K117q52j531K93K268R02k259r67J194J119q70j371R24J513J53j640
1202F445k01J100J768N09m80o62l56L49R07l83j66J691K125o43l258k046K170
1219H869K502j990k501J163L466O96k535l61L093J170k565k346J647K157k24j364
1235A0877L76J18q90n59K04K11M07K17N67r19j277O46J193p30j835J481K760Q7
1253A2934k979O9K252l16m685j951L071K069j971j844K047K212j265k756l07J348
$$ y = [-6670, -5948, -5827, -5728, -4679, -3607, -4644, -5524, -5385, -3449, -3038, -4481, -4945, -3933, -2365, -2714, -2504, -612, 644, 151, -1665, -2362, -697, 430, -74, -1078, -844, -410, -110, -397, -867, 283, 2149, 2777, 2039, 1615, 2346, 2905, 3518, 3306, 2642, 1903, 2980, 3684, 3928, 4297, 4784, 4986, 3932, 2444, 2136, 3317, 4210, 4461, 5452, 7569, 6717, 5186, 5479, 7747, 8649, 6390, 5423, 6617, 7736, 6866, 5495, 6419, 7932, 8085, 6445, 6244, 7344, 9112, 9621, 9141, 8479, 8123, 8472, 9379, 8996, 8830, 10521, 12646, 12003, 8745, 6699, 8869, 11371, 9381, 6880, 8043, 11509, 12205, 9670, 9309, 12402, 13572, 11007, 8661, 10308, 12465, 12241, 10877, 11253, 11371, 10481, 9922, 10126, 10337, 10744, 10961, 11528, 10609, 9332, 9978, 11171, 10441, 8606, 10087, 12847, 12934, 9955, 10024, 12276, 11960, 7275, 5324, 8395, 10464, 8493, 6649, 8696, 10908, 9643, 6887, 6580, 7928]
1269G928K29q83K08J22m72l66j01j060j471N75J629j032k780Q5K140l01l096j206
1287A48K598J611j945j535K703J574k830l725L79J433j307k002Q35J721p64k176
1303c282J68J353j189p09N7n1r88LJ999j26k556r88J976mk804j122K949J126l544
1322g732l356J229K485p88j321J560J695r85j469P00J92j347j226N00M23j615
1338a1055j40J910J200k084j528J168J064k437j045K510J652j023k144J756J854
1353h342r96k149J371J957j258k304N52J013j234j314J902K062r91j356J768J451
1369g868j205j256J849J304k177j872K240K586j690j616K168K143k531l293J580
1384i638L048o43j829J176K432o45j461J773J868n77j319M01R52j777j036J515
$$ y = [7928, 8157, 7274, 7482, 7604, 7132, 6766, 6665, 5605, 4134, 4709, 6338, 5306, 2526, 2611, 4751, 4450, 1354, 148, 2746, 4357, 2412, 877, 3580, 5154, 2324, -1401, -1022, 411, -896, -2898, -2063, -342, -1106, -3282, -3114, -1761, -2950, -3659, -3602, -3653, -4641, -4638, -2639, -2765, -5321, -6309, -4333, -4337, -7141, -8263, -5314, -4188, -7732, -11088, -9859, -7374, -8162, -9483, -7923, -6228, -7213, -8682, -7982, -7790, -9137, -10363, -9863, -9440, -11055, -11195, -9285, -8085, -10169, -11697, -10529, -9465, -11902, -12947, -10437, -8785, -9808, -11952, -10196, -8342, -9338, -11487, -10116, -8159, -9417, -11721, -11169, -10156, -11390, -12704, -10802, -8740, -9731, -11087, -9319, -7868, -9073, -10329, -8480, -7176, -9353, -11225, -8985, -6399, -8089, -9705, -7537, -5394, -7925, -11218, -9638, -6590, -7233, -9062, -7886, -5454, -6099, -7560, -5787, -3919, -4496, -5815, -5414, -4462, -6239, -7275, -5760]
1400e760J023r62o84J771K067j492j941K310K834j924k732J414K911k88k763J343
1416b873L401l15k825k13J875l19j634N70J411l29r75Q41J827J24j97J987P01
1433C057k257k233J921K012j207k124K163K184j592k396J520L139o9l203j7K759
1449C657R8k105O34L260L43j838k83J656N98j288QN17j181j445J502J850p13j518
1467C752K377K702q44k469J042L155j492l312L51L721O35k519o39K234M74j937
1483G231n59K104R9j241l29O34O55l99J693J732q78k151O09J898q58j586M36Q45
1501I935j027k314L39L050R78j840P7J546l77k177k76K195P86j246j301Q52Q88
1518A0088p93o39N93k31j078q23l46L72o50Q86P44L0j137J99P03L51j337K36P94
$$ y = [-5760, -4737, -5699, -6383, -4612, -2545, -4037, -5978, -3668, -834, -2758, -5490, -4076, -1165, -1453, -4216, -2873, 528, 213, -2612, -2825, -950, -1269, -2903, -2333, -922, -1251, -2226, -1385, 442, 566, 369, 2356, 3057, 800, -1433, 488, 2500, 1293, -831, 1332, 3516, 1924, -472, 1048, 4187, 4118, 915, 898, 3657, 3755, 1650, 2284, 5544, 5887, 4049, 3766, 5422, 6020, 4732, 4740, 5257, 4076, 2631, 4133, 5983, 5270, 3752, 6129, 8831, 7987, 5518, 6560, 9715, 8223, 4911, 5262, 8983, 9618, 7099, 6460, 8694, 9168, 7231, 6672, 8776, 8875, 7634, 7305, 7939, 8594, 8195, 9888, 11620, 10742, 8591, 9200, 11098, 10240, 8654, 9090, 9935, 8908, 6594, 6933, 9983, 10961, 9121, 9198, 10744, 10367, 8190, 7914, 10109, 10895, 9649, 8348, 9200, 10088, 9295, 8656, 9249, 9018, 7940, 7117, 6771, 7143, 6493, 7379, 8123, 8153, 7016, 7215, 7918, 8269, 6932, 7168, 7962]
1537G962q07k933j335J327J486m00r95Q0M95j041r65m30P64J85n39j143k66N89
1555B034J040J74q52m18q75n90j748m72Q64M35r36j597L36J208K46m46k58L51
1573a504J67j223r89m81J98Q36o51j645n14J295J043r88k178LJ410l46k329j46
1591h042K129J461j121j420O02J421r94j277l29Ml83p81r7k5M48L67R66l47j212
1610h630J0K031N20k130j380K037O92j849j105K214K189j648k393N54J750j201
1626h339k062J287J590o58j347P72K749K21r14n1M62n65j231J00J153j00o86K34
1644g385R53o58j327J821K118r35k458L53K809j77k490p0L400J109k579j347K286
1661d577J470j791j750J326R94j412j467K056J994k62n35Q06J256j464q75J189
$$ y = [7962, 7155, 4222, 2887, 4214, 5700, 5300, 4305, 4385, 4880, 3839, 2874, 2444, 3208, 3393, 2854, 1711, 1445, 2034, 3074, 3248, 2396, 1978, 1103, 513, -1235, -1707, -843, -408, -1344, -2941, -2605, -1397, -1151, -1597, -1855, -1504, -1337, -2560, -3549, -4030, -3832, -2996, -3647, -5292, -5806, -4511, -3468, -4456, -6634, -6631, -5221, -5567, -7896, -8042, -5913, -4452, -5573, -6993, -6391, -4970, -5964, -7241, -7570, -7566, -7949, -8730, -8827, -8852, -8404, -8037, -7071, -7418, -8630, -8620, -6589, -6069, -8199, -9579, -7542, -6850, -8699, -9804, -7590, -5401, -7049, -9442, -8888, -7138, -8339, -10401, -9114, -7524, -8182, -9529, -8757, -6008, -5787, -6701, -6752, -6290, -6855, -8086, -7986, -6833, -6933, -7619, -7385, -6432, -7090, -8417, -6596, -4478, -5413, -7871, -7518, -4709, -4886, -7376, -7446, -4046, -2937, -5516, -6863, -4577, -3107, -4898, -6648, -5322, -4328, -5740, -7207, -5151, -3157, -3419, -3954, -3148, -1892, -3356, -4231, -3042]
1677c042R80j124j267J102Q47o32o24K204J343j857k083J142J880m46j749J262
1693b064K604l65k137Q84K566L70k175j086J974M7j847m80K027R27p31n04J213
1710A223K71m02P45J471n07j586K06J956O41j630m40J576J093j402j182J324J756
1727E113j015k043J405J344p68p51J420K258l91j243J96J206K5j636q8Q85j8o50
1745E249N27J035K88n46M61J250p46j129M5J258K94q48L15J716n7j591J23J774
1763I418k95j940j036J144J282j298j002J502J932m78j622N17O59k3m03l45M09
1780H421o54r57M81J172p75q38K66M92n29j036L49J250q71j384M23J425m61j520
1798E254M70K040m90j958j527J341M89j511j237O86P62o39j021R52J064l26j232
$$ y = [-3042, -2062, -3186, -4453, -3351, -2504, -3136, -3760, -1556, -213, -2070, -4153, -3011, -1131, -1577, -3326, -2064, 540, 175, -1962, -1078, 1488, 1858, -317, -1403, 571, 618, -1229, -1709, 318, 1245, 514, 10, 1223, 1494, 1092, 1837, 3308, 2801, 1215, 1421, 3377, 4018, 2388, 1948, 3524, 4617, 3215, 2033, 3357, 5113, 4098, 2055, 3460, 4804, 4036, 3285, 4705, 6963, 6572, 5329, 5525, 6731, 6756, 5120, 5032, 5917, 5899, 5249, 5776, 6811, 7099, 6553, 7014, 8264, 7518, 6389, 6434, 7692, 7986, 7138, 7453, 9169, 9112, 7521, 7644, 9418, 9123, 7183, 6147, 7291, 8573, 7275, 6273, 7775, 9707, 9229, 7607, 8124, 8783, 8760, 8357, 8012, 8421, 7767, 6810, 7291, 8463, 7688, 6850, 7116, 7608, 7079, 6043, 6392, 7642, 6771, 5387, 5810, 7235, 6774, 5254, 5724, 7764, 7274, 5316, 3789, 5130, 5619, 4108, 2871, 3557, 4319, 3680, 2659, 3611, 4675, 4349, 3117]
1815C117l71N30o90j013r0O45p03n8M21j67j177m15M24J38j393j661P33J844o64
1834e50j236L49J805k75j788p57P54K27j659o03R28K58j073l64N98O31j115l80
1852d250Q2L81o61l22K49L79p50m39J115l5j275l15J333K42j779j191R97J329
1870d910j323j203J093J626m62j351P48J286j53j761k57P25k2q42r6P33K14k67
1888f222j8K82l30o15K96M55m86q73J211J241J10n56l61J018m08j326k94Q59K76
1907e741p27p10J348R62m80r16R29Q60l32j088K89R25K92o85K2O0N77n03N8N4
1927d806K76j00L7q2nj93M65K08k29j0P23R75l93k03N2O38P0j177n78L93J010
1948b929j0n61L90J487L06j244o64J684j3p68j23N30J068m49q7L89R45j63p10
$$ y = [3117, 2746, 3276, 2586, 1573, 1483, 2128, 1425, 1367, 1788, 1621, 444, 29, 453, 591, -802, -2463, -1730, 114, -550, -1786, -1437, 368, 93, -1695, -2452, -1698, -1471, -3130, -3733, -2805, -2547, -3620, -3984, -3386, -2755, -3870, -4250, -4168, -3787, -4448, -4770, -4521, -4142, -4892, -5331, -4216, -4251, -5526, -5841, -4508, -4266, -6045, -7236, -6239, -4910, -6233, -7436, -6343, -4717, -5179, -6530, -5782, -4496, -4649, -6410, -6667, -5942, -5964, -6806, -6902, -6169, -5955, -6222, -6240, -5958, -6288, -6903, -6607, -6152, -6638, -7511, -6300, -5059, -4949, -5505, -5866, -4848, -5256, -6582, -6876, -6017, -5741, -6468, -7178, -5830, -4868, -5348, -6264, -5335, -4475, -4807, -5895, -5606, -4681, -4389, -5074, -5052, -4992, -4415, -4918, -4860, -4806, -4530, -4630, -4593, -4675, -4680, -4873, -4408, -4200, -4429, -4439, -3716, -2741, -3134, -3337, -3285, -2647, -2577, -3754, -4332, -3939, -2929, -2939, -3500, -3110, -1623, -1317, -2561, -3225, -1541, -1554, -2322, -2445, -1915, -847, -1296, -1383, -994, -49, -212, -922]
1967i22q2M28l13m55J093P4K1J82J051M64j004n9J480M93j463j051J692J442j112
1986A959j601J602J935p88j625O18K005j39j874K74J437M06r85K02J066N24o26
2003D390N28R19p07j083M71O86k89o62P22J707o63j319R40J768m94j327J11J457
2021G155k58k021L08K839Q3j820m79J755J13j647k86J543J48j259j53J616n0j012
2039F575M4J234j92j536K22J553k72k216l0K441J28k666m95K128O74k244m44J814
2057F718O99j876j516J389Q05j202k57P06J52j500l39J531R6j439r94J020l32
2074C661k049K60K841O18k496j048J399P14k161j474J744J076k135j442J703J476
2090B687j450j111J114J56j795n80J256K22j356k50J188K69j729k93J584J60k329
$$ y = [-922, -1004, -576, -889, -1344, -251, -177, -156, 26, 1077, 1541, 537, 478, 1958, 2451, 988, -63, 1629, 3071, 1959, 358, 1960, 3895, 3107, 1482, 2100, 4105, 3966, 2092, 2366, 3803, 4209, 3224, 3426, 4492, 5016, 4390, 4918, 5837, 5130, 4047, 4518, 5204, 4915, 4253, 4975, 6682, 6019, 4700, 5640, 7408, 6914, 5587, 5698, 7155, 6897, 4876, 5184, 8023, 8106, 6286, 5807, 7562, 7675, 6028, 5742, 7285, 7433, 6174, 6021, 7637, 7587, 6575, 6619, 7853, 7661, 6125, 6347, 7900, 7628, 5412, 5382, 7823, 7951, 5285, 4790, 6918, 7592, 5348, 4904, 6718, 7417, 5541, 4025, 5414, 6219, 5017, 4760, 5466, 5618, 4118, 3779, 5310, 5406, 3967, 2973, 3993, 3661, 1612, 1872, 4713, 5331, 2835, 1787, 3186, 3900, 1739, 265, 2009, 3085, 950, -492, 1211, 2687, 1237, 126, 1240, 1396, -399, -979, 277, 499, -857, -1107, 81, 350, -1379, -1672, -88, 72, -2257]
2107b257r35K157N95k331j425J971J296j622j089J592J240j861j839J242J534
2122a732j324j076O83O40j164p56J738N31j510r75P65N64j113m23J160O23j603
2139d972p58J701J301j695j603J685J409j549j653J027J417j158j209Q36J750
2154c471q60j042L16N35p07l58J078O76j210j051J115L77p80k07J692P51k184
2171e330j559J802J614j067j467O46J258p95j230J363J625p29j277K8M04o02j22
2188e438R65O15o81l82J022L87q45r08J650N84j874p24J476J210j058j129J887
2205c243J024j227j390Q56J163n50q35R45J093n70q90M97O78l32L16M89M7q29
2223b758j00J007L64q65l34J381J140j798p10J545J565j294j228Q17J826r79j180
$$ y = [-2257, -3192, -1035, -440, -2771, -4196, -2225, -929, -2551, -3640, -2048, -808, -2669, -4508, -3266, -1732, -3056, -4132, -3449, -2809, -3973, -4729, -2991, -2460, -3970, -4945, -4180, -3616, -4729, -5152, -3992, -3369, -4972, -5730, -4029, -2728, -4423, -6026, -4341, -2932, -4481, -6134, -5107, -3690, -4848, -6057, -5221, -3471, -4331, -5373, -5057, -4522, -5229, -5587, -4509, -3833, -5043, -6094, -4979, -4602, -5382, -5589, -3897, -3146, -5330, -6889, -5087, -3473, -4540, -6007, -5361, -4103, -4898, -6128, -4765, -3140, -3869, -5146, -5118, -4714, -5316, -5438, -4473, -3858, -4539, -4921, -3899, -3512, -4357, -5265, -3615, -3031, -4905, -5629, -4153, -2943, -4001, -5130, -3243, -2219, -3446, -4836, -3980, -2817, -3367, -4202, -3257, -2164, -2734, -3624, -3127, -2449, -2781, -2465, -1976, -1929, -2758, -2858, -1851, -1487, -2352, -2686, -1305, -165, -1963, -2673, -1128, 437, -857, -2085, -1268, 558, -421, -1601]
2240a601N93J620K13j377R84R08o49q10P92R08n01k04Q64O75q78k47J576O85j403
2259B148q49J377M80r64p89K028J619j462j269O61J902j060n97J101Q99n19j336
2276C370O38J174K7q12M22N14m87o40J262O76m68j227J050N11q18n22R56J367
2294F993q76j095N68J383o09j456J69J497m01j171L29J020J7r25J68O55m39n18
2312E309M25J96o26l65R11O14j486m80M89P76m83j287M25Q45n32q96J77R49m8
2331D913r38jM07k11n60J7j65L01r16J02K87m13l65L95o2p59n58R95L60r05p02
2352A222K52P79p13j171R23P81j152j077K96Q17k54r50J5N57k78q57K24L14O0
2371b12n05J62j04m89j63P53L5j254k04Q96L33j292r18Q60J012j044j190P03J414
$$ y = [-1601, -1008, 612, 825, -552, 432, 1340, 691, -119, 673, 1581, 1080, 876, 1740, 2415, 1537, 1290, 2866, 3551, 2148, 1299, 2676, 3156, 2192, 1403, 3431, 5050, 3588, 2319, 2980, 4882, 3822, 3225, 4326, 5225, 4706, 3370, 4008, 5182, 5209, 4397, 4819, 5333, 4846, 4206, 5468, 6144, 5676, 4449, 5499, 6010, 5192, 4670, 5626, 6993, 6117, 5022, 5590, 6973, 6364, 4908, 5077, 6574, 6173, 5002, 5331, 6351, 6368, 5443, 5611, 6266, 5827, 5309, 5734, 5930, 5304, 4939, 5850, 6464, 4978, 4498, 4987, 5763, 5280, 3993, 4418, 5263, 4731, 3835, 4012, 4961, 4913, 3975, 3974, 4381, 4170, 3610, 3627, 3462, 3763, 2847, 2949, 3236, 2823, 2458, 2853, 2791, 2032, 1474, 2469, 2829, 1924, 1222, 1474, 2253, 1540, 369, 1292, 2073, 921, -156, 140, 957, 703, -247, -232, 325, 47, -810, -586, -272, -212, -717, -555, -659, -1148, -1311, -558, -523, -1777, -1981, -1085, -752, -2044, -2962, -2102, -1090, -2134, -3324, -2621, -1207]
2390a207m88j005k47J041m88p73r1M76K11m21R7p8pp09O50l14p21J1Q56N63q41
2411c485q70J174M60p14j369J018J185q82j253J65J659n67j135l94Q76K86n89
2428d435m62O89L96m70k27N90O1n06K11M84m54o71K64J011l12j349K06O79M74
2447c821r57m67J398N83j299m54J113L49p36m53R56J98m21o11M78N36q37m8K8
2466d465Q51l20PL79j38k36J20O25j69J36j79N80M33r77k97Q11J87o3q98L98R89
2487b226Mq60L21R76J25n51O6N42Q53m81n16K74O19j74l49J44P42n0M6P8P9K07
2509a31p9N97o0j54O27J19N78o47M3M27O49l63p15J009M36k85l23l03J084L41
2529B850p89O7R06P25m16m08M48L72J58n64N04j94J86J77j06J12j00r9P53j39
$$ y = [-1207, -1695, -2700, -2947, -1906, -2394, -3167, -3258, -2782, -2571, -2992, -2895, -2973, -2980, -3689, -3039, -3353, -4074, -4063, -3207, -2644, -3485, -4355, -3181, -2721, -3435, -4804, -3786, -2601, -3483, -4736, -4571, -2912, -3479, -4614, -5008, -4132, -3846, -4435, -4897, -4208, -3812, -4282, -4509, -3919, -3858, -4364, -4153, -3669, -4123, -4794, -4530, -3519, -3831, -5180, -4974, -4295, -3821, -4778, -5245, -3847, -3264, -4563, -5017, -3904, -3555, -4291, -4744, -3788, -3590, -4011, -4622, -4144, -3608, -4445, -4493, -4465, -3614, -3934, -3927, -3548, -3686, -3922, -3802, -3177, -3346, -3210, -3389, -2809, -2376, -3353, -3650, -2839, -2652, -2715, -3613, -3215, -2226, -2222, -3082, -2761, -1785, -1660, -2211, -2145, -1603, -750, -1231, -1747, -1473, -854, -1028, -1377, -1233, -491, -541, -495, -417, -338, -131, -210, 387, 327, 173, 800, 919, 1497, 850, 893, 1320, 1969, 1606, 891, 1900, 2336, 2051, 1728, 1425, 2509, 2850, 2061, 2128, 3034, 3759, 3343, 2935, 3383, 3755, 3913, 3349, 3853, 3659, 3845, 4022, 3916, 4028, 3928, 3829, 4582, 4443]
2549D443Pm81Q26M67p86j18P84N48l89r54O35N73o4r77Q5Q78k00q24j37Q62K30
2570E408o17l43P76jj69k70N26j91m39j16N36k51o26K24J38rn41l55M48N00r58
2591C670n50R72M53o97o47K33J371r57j374L96R24k64j023m00J326j42j393L20
2609B218N36k18m13m81O40J33n08M30k90N7r68O94q0n68p42R5O10l48p91k37J319
2630A088k4j306m34J206J62o17p14N85O32p45j164N88O11m66n38k55M72n84j46
2649a649L29M58o06M6L92l02k49o37R28K75q13p18O38M12m88p89L23K05o08k85
2669c138M7J158J07j067KJ32M91r88l30N64N81m78L6m5QJ29n53l65l22L35k28
2690c924M21m2l6N48J51l42m11l23O46k80j55j68N69k73n91j04P5M59J00m85K5
$$ y = [4443, 4450, 3969, 4795, 5262, 4476, 4358, 5142, 5690, 5301, 4347, 4982, 5555, 5491, 4514, 4599, 5477, 5277, 4453, 4316, 5178, 5408, 4791, 4448, 5224, 5223, 5054, 4784, 5310, 5119, 4680, 4564, 5100, 4849, 4223, 4447, 4585, 4576, 4035, 3680, 4128, 4628, 3670, 3120, 4092, 4545, 3848, 3201, 3434, 4805, 3848, 2474, 2870, 3794, 3530, 2507, 2107, 3433, 3291, 1898, 2218, 2754, 2536, 2123, 1642, 2282, 2415, 1907, 2337, 2047, 2104, 1136, 1830, 1750, 1182, 440, 535, 1145, 797, 6, -231, 1088, 1064, -242, -676, 530, 692, 75, -639, -54, 578, -167, -1331, -743, -132, -598, -1136, -1391, -919, -1503, -1649, -1320, -862, -1468, -1422, -1030, -1332, -1581, -2218, -1290, -1015, -1828, -2546, -1908, -1496, -1984, -2773, -2450, -2245, -2853, -3138, -3091, -1933, -1826, -2893, -2891, -2759, -2268, -3256, -3586, -3022, -2441, -2919, -2883, -2928, -2920, -2791, -3344, -3709, -4031, -3696, -3924, -3503, -3545, -3581, -3033, -2882, -3224, -3635, -3958, -3312, -3592, -3747, -3915, -3346, -3619, -4210, -4314, -4239, -3780, -3680, -4165, -4140]
2711d140P5M32l22l30j27J051q8m73k68M57K12j10l87p0k0m8k27MO67K2l45O4
2733c971K18N34j05o7j1l97LQ59K30n90j06N19J26n03j08L48J020p34r76N60R34
2754b217N43o85L62P33J49o15k42Q42M1j14p72O21N2j14N52N15Qn55M87P44n5
2775B80r18N23J053J05p10K36Q73J75j141k57J677J25r53o59J257M65n77K27P57
2794B538N19q63m78Q15N69K32o7M19o75r24J35J319K92p88k53J289L7j321K4J348
2814D167J139j705j020J435Q66n23q19J146Q41j416q59L33R99p31j97L35R7k98
2832C790l64J147Ko53J44N70M91j404p37J443J137j550l99M57R32q68j590J106
2850C654P23l73j052J41O62k4o27L48O71l44q40K05N69n88q52O43L28r25q58O59
$$ y = [-4140, -4065, -3633, -3955, -4285, -4412, -3361, -3449, -3922, -4190, -3733, -3521, -3631, -4018, -4088, -4108, -4156, -4383, -4379, -3712, -3690, -4035, -3971, -3753, -3219, -3324, -3391, -3402, -3799, -3796, -2937, -2707, -3297, -3403, -2884, -2758, -3261, -3369, -3021, -2001, -2735, -3711, -3151, -2217, -1674, -2359, -1997, -1264, -1115, -1730, -1972, -1130, -1089, -1203, -1975, -1354, -1302, -1416, -864, -349, -341, -896, -409, 335, 280, -638, -115, 938, 1043, 333, 569, 1442, 1617, 476, 219, 1896, 2021, 1068, 409, 1666, 2131, 1554, 1781, 2538, 3057, 2194, 1716, 2531, 3100, 3332, 3265, 3684, 3009, 2085, 2220, 3539, 3831, 3043, 2790, 4079, 4116, 2795, 2819, 4167, 5306, 3601, 2581, 4016, 4882, 4359, 3540, 4686, 5527, 4111, 3252, 3585, 4584, 3853, 3656, 3991, 4088, 3790, 3426, 4573, 4575, 3922, 4066, 4636, 5127, 3723, 2986, 4429, 5566, 4016, 3617, 4074, 5006, 4138, 2548, 3654, 4377, 4004, 2952, 3093, 3755, 3731, 3104, 3452, 4123, 3779, 2939, 3144, 3713, 3125, 2273, 2916, 3244, 2319, 1461, 2120]
2870B120O57p60l31R83Q67q33j379M85Q09k22j392L13R99l85q15K47L51k63o35
2889H16m99Q42l14r18M47N91j01l66M13L65o80n04L80K81m86j132P05O86m95r00
2909h69k1J162o26p99l1J141k11j056L79O41o6p98K65L83j39o28J10J45j05p65
2929a888j69K57k16m90N09R03n16r53N98O26j1q43j39P45m33r04k52J227n36l8
2949b523m50N02j0n26p03M25L49j34J10J43q2k42M56J46l67p49M12N29q33r52
2969d499N07P14J18j020J71Q76j76n05k58O68K08n07l64Q7M30J14j28P2j12l0
2989c634n1k69j40k5N76J77l94k08L34N31J69q32P18M00k70l51l49O16n1J73m99
3010c379L03L08J82l9O8J38J23M2o2n7M00K73L21n24K95L90J34j83k74j85P48
$$ y = [2120, 2777, 2017, 1686, 2669, 3536, 2703, 1324, 1809, 2618, 2396, 1004, 1317, 2316, 1931, 1116, 1363, 1714, 1451, 816, 317, 1159, 845, -73, 374, 965, 864, 498, 911, 1276, 596, 92, 472, 753, 267, -865, -160, 526, 31, -869, -890, 272, -354, -1153, -1184, -43, -254, -1310, -931, -290, -356, -1154, -889, -506, -645, -1273, -1163, -1018, -1123, -1888, -2057, -1800, -2016, -2506, -1997, -1094, -1610, -2563, -1965, -1339, -1350, -2193, -2332, -1587, -2020, -2924, -3176, -1949, -2485, -2523, -2973, -2471, -2481, -3007, -3710, -3285, -2936, -3070, -2960, -2817, -2899, -3141, -2685, -2539, -2906, -3655, -3243, -2714, -3547, -4499, -3992, -3278, -3160, -4180, -4009, -3133, -3309, -3814, -4072, -3404, -3196, -3703, -4067, -3980, -3550, -3436, -3564, -3492, -3604, -3634, -3685, -3954, -4094, -4119, -3543, -3366, -3760, -3968, -3634, -3103, -2934, -3766, -3048, -2648, -2918, -3269, -3618, -3002, -3053, -2880, -3379, -3076, -2768, -2586, -2625, -2557, -2419, -2296, -2254, -2316, -2373, -1973, -1700, -1379, -1903, -1608, -1218, -1084, -1267, -1541, -1726, -978]
3031i78m2n33l1P53L46K32j82L95K13RP4J60k60K32L4p5P5K54N14k71k70O5M52
3054A166M39k65l76L59M08K29k91L21M06L99m06r9L02l48k08J44MJ99O8J30J48
3075B729M49K57J7k97m3J85P8N11q11K5L07M00m02l30K64K76J38q22J95M00L3
3096C559l49k3L53K56J5k55L27R%m64n63L65Q6O1j47m27J91P20k5p62r7M07m1
3119C196n72J12J12J8M16l56o6K65j20j86p17K50P8l54j40o5N67k05m8k53J67
3140B099L64j97j1o45J09L26j47n22j08J45L20k15l09J92j00p1l70n91O66L87
3160A322k52l93R9M13J64j04o53p0K97k37p99K45N8j28K04l29j13M74J6k85k21
3181b92J81K00n85M1l31J81L56q4n24n6k5L73p01o1J63k39K09l23L6L52j71O3
$$ y = [-978, -1020, -1553, -1584, -831, -485, -253, -435, -40, 173, 182, 256, 416, 156, 388, 422, 347, 422, 676, 1190, 919, 649, 714, 1166, 1605, 1340, 964, 1323, 1731, 1960, 1669, 1990, 2396, 2795, 2389, 2290, 2592, 2244, 2036, 2180, 2184, 2383, 2451, 2581, 2729, 3178, 3435, 3452, 3155, 3112, 3297, 3375, 3886, 3075, 3100, 3407, 3807, 3405, 3075, 3339, 3615, 3753, 2931, 3126, 3526, 3559, 3210, 3187, 3540, 3796, 3811, 3556, 3883, 3892, 3892, 3428, 2865, 3230, 3316, 3377, 3230, 2803, 2994, 3714, 3689, 2927, 2830, 3237, 3196, 2624, 2736, 2848, 2866, 3282, 2926, 2860, 3125, 3005, 2819, 2102, 2352, 2430, 2076, 1936, 1871, 2438, 2233, 2185, 1932, 2099, 2463, 2266, 2255, 1610, 1719, 2045, 1898, 1376, 1268, 1413, 1733, 1518, 1209, 1401, 1301, 1230, 860, 269, 935, 1322, 1070, 677, 776, 1189, 1353, 1249, 596, 526, 823, 586, -213, 32, 90, -38, 166, -163, -276, 198, 214, -71, -292, -111, 89, -496, -455, -786, -605, -249, -333, -857, -913, -938, -565, -1266, -1327, -1164, -1403, -1194, -1517, -1481, -1129, -1300, -1237]
3203a237l39%L82l06k34o38K94j61K78l25L7J6p3j64o0K79k64OQ0m75J71K97n31
3226b967kJ73L48o6l54n88J69Q7J1m11J35J68J44k46J65J62J47J58l82k24q3K37
3248c219j66j15k43M56J34m96J04M23q0k06k63J31K46K52J21r5J3M87R4o33J73
3269b882N7J03j92q9k04L66K56j29J70K28J28M31j70l02M59K03j58l03K66K48
3289a514J57j21q0N43o1o4m8M2K95j01p6L42L9M79J28j07j72L19N78k46l31R0
3311I1j25L22Q4K3N21J1J59k32K01Q6J52j78m3L21L82P4n55K33Q25m49L33m22
3333A814K80J61m28K34N9Q2K02k29L24J42K13j90L3K4k01J59J82k61n05L56K02
3354B653O48p15N4J56N91q22l66N24M60o93l7L26M95l0o20j4N25R1p59J93%k59
$$ y = [-1237, -1576, -1576, -1194, -1500, -1734, -2372, -2078, -2239, -1961, -2286, -2249, -2233, -2306, -2470, -2530, -2251, -2515, -2509, -2429, -2904, -2733, -2436, -2967, -2969, -2796, -2448, -2514, -2868, -3456, -3287, -3200, -3189, -3600, -3465, -3297, -3153, -3399, -3234, -3072, -2925, -2767, -3149, -3373, -3456, -3219, -3385, -3500, -3743, -3287, -3153, -3649, -3545, -3122, -3202, -3408, -3671, -3540, -3294, -3042, -2921, -3016, -3003, -2516, -2422, -3055, -2882, -2825, -2722, -2914, -3003, -3207, -2841, -2585, -2714, -2544, -2316, -2188, -1757, -1927, -2229, -1770, -1567, -1725, -2028, -1762, -1514, -1357, -1478, -1558, -1015, -1076, -1140, -1188, -1146, -851, -952, -1028, -686, -647, -168, -40, -147, -319, 0, 578, 332, 1, 91, -34, 288, 372, 395, 916, 927, 1086, 854, 1055, 1141, 1293, 1115, 1072, 1393, 1775, 1849, 1294, 1527, 2352, 1903, 2236, 1814, 2094, 2255, 1827, 2061, 2120, 2202, 2404, 2175, 2499, 2641, 2854, 2664, 2697, 2721, 2520, 2679, 2861, 2600, 2095, 2451, 2653, 3301, 2586, 2640, 2796, 3387, 2565, 2199, 2723, 3183, 2490, 2453, 2779, 3274, 3244, 2624, 2610, 3135, 3226, 2467, 2660, 2660, 2401]
3376B401J38K8n5K0J97J46Kn9l79L14J82n98o37R44m36Q3Rl26P12J62j291m4N97
3399B110L72p29l49M30L59l85l32J84N00j03l43J15k58l43PK17j49l1j94K60J78
3420A516l08Q3J32L96p79m80K67O16j011M9M15K55l20m83J32J29j67l04k64M56
3440C30J16n0k47L21R1m40j22J96n27r1J10j5J11l86M81K06o42k63J80J78k87
3461g50m17k1N56m54j32j55N74p3k67j13m6J50m11j53j86m4r5J97l50r4J32K79
3483a873J06k63l25L20q6j7o81K23M46j18l06m96L59L87j86l10j70K24J31l55
3503b990j18QM21J98k8p26K87J5O4m88L44R0j10k37P4j7O31k21Q7l62J83k25K8
3526c092K01K64j92J08M7j90J26M75K12l75ml32N88m23J02L96M94k29p48M85M71
$$ y = [2401, 2539, 2567, 2512, 2532, 2729, 2875, 2877, 2818, 2439, 2753, 2935, 2337, 1700, 2644, 2208, 2291, 2300, 1974, 2686, 2848, 1557, 1513, 2110, 2482, 1753, 1404, 1834, 2193, 1808, 1476, 1660, 2160, 2057, 1714, 1829, 1571, 1228, 1235, 1452, 1303, 1272, 1078, 1338, 1516, 1208, 1291, 1423, 1819, 1040, 560, 827, 1443, 432, 481, 896, 1151, 831, 348, 480, 609, 442, 138, -126, 330, 446, 396, 149, 470, 561, 121, -1, 195, -332, -423, -313, -328, -217, -603, -122, 84, -558, -821, -641, -463, -750, -1167, -1188, -632, -1086, -1218, -1373, -799, -872, -1139, -1252, -1298, -1148, -1559, -1712, -1898, -1942, -2037, -1840, -2190, -2284, -2152, -1873, -1767, -2030, -2355, -2035, -2121, -2138, -2819, -2596, -2150, -2268, -2574, -3070, -2711, -2324, -2510, -2820, -2990, -2766, -2635, -2990, -3108, -3100, -2679, -2481, -2509, -3235, -2948, -2933, -2869, -3357, -3013, -2923, -3033, -3270, -3196, -3213, -2582, -2803, -2716, -3078, -2895, -3120, -3092, -2891, -2627, -2819, -2711, -2664, -2854, -2728, -2253, -2041, -2416, -2420, -2752, -2164, -2587, -2485, -2089, -1595, -1824, -2572, -2087, -1616]
3547a616L12p75K62O28k91l49m74P18N98m63K07K45K55k67j82Q75n1p7k9P2K67
3568a35m75M10N74K48j179N33P46j80l61p42J029P18q45o07J166N35j65q41N14
3587I43M91k25p21P10L29k44l83M08K53k69j71P01R0n15j91N60M35l09m25M30
3607A897O93q47o96J105P66o67p33L87Q64o26l23N78O50l67q72J41N66L14l73
3626B457r5M71n99r82Q36P48q86L96j4M06o69m19P51P31l68j077L74L79k1p18
3646A701M09J045o67n43n01J012J6o63k03L44M38o01O2O09l74l73K74L27l65m15
3666A532j45Q53Pp92K26N35k16o46r2R35j48r29Q6M27K87p13j23M78K44o77j89
3687I40N15R2k02k22L87o44k22J60L16K12o46J38K77J30p54j82O00k58m94j46
$$ y = [-1616, -1304, -2079, -1817, -1189, -1480, -1829, -2303, -1585, -987, -1450, -1243, -998, -743, -1010, -1192, -317, -368, -445, -474, -402, -135, -610, -200, 374, 622, -557, -24, 722, 542, 181, -561, 468, 1186, 341, -266, 900, 1435, 1270, 429, 943, 1434, 1209, 488, 1198, 1527, 1283, 900, 1308, 1561, 1292, 1121, 1822, 1912, 1397, 1206, 1766, 2201, 1892, 1467, 1897, 2590, 1743, 1047, 2152, 2918, 2251, 1518, 1905, 2769, 2143, 1820, 2398, 3048, 2681, 1809, 1950, 2516, 2830, 2457, 2362, 2833, 2234, 1252, 2088, 2836, 1950, 2346, 2332, 2738, 2069, 1650, 2401, 3132, 2764, 1687, 2061, 2440, 2419, 1701, 2110, 3155, 2488, 1945, 1444, 2456, 2472, 1809, 1606, 1950, 2388, 1787, 1849, 2458, 2084, 1711, 1985, 2312, 1947, 1532, 1387, 2240, 2247, 1455, 1681, 2216, 2000, 1354, 1262, 2197, 2049, 1120, 1206, 1633, 1920, 1207, 1084, 1562, 1806, 1129, 940, 1455, 1547, 1345, 1123, 1510, 866, 644, 804, 1120, 1332, 686, 824, 1101, 1231, 477, 295, 895, 637, 143, -3]
3707cP76r9n48k25K90M53l85p54M02J23l81j27K40J51r2k96Q9J45j89l71K82k35
3729g54k57q0M03k23l95J11R6J96n61l02N26K34p83P2J23K11P0o31O9J48J5l40
3751b052K17k10O3j85m7k40L22j82J08l16K26k24K39j44j44K56j8j23l61m21M73
3772b763N42k81j91k79K76J56k85J16o8J39l76K49nqO72m44j28j00k72Q78j98
3793b370j28J79OM4m04M91K77J59j79k25J30K40l9k36J73P6K66r4j56K85K34J05
3815a166k63J10j59K00L77m38N3M20K4Nk76N87J14K03n54M6n8P83k81m16M29L23
3837F3J17k8M3m8K59j52lJ86Q0j53K77K1k79J24L79j18k0p9L33K56m05j01R11
3860A663k81J8j06j11J94j60l00J46J92K17l41K97k44K08J84N7r2q5L52K57l49
$$ y = [-3, 773, 674, 126, -99, 191, 644, 259, -495, -93, 30, -351, -478, -238, -87, -179, -475, -386, -241, -430, -801, -519, -754, -1011, -1091, -688, -911, -1306, -1195, -1099, -903, -1464, -1766, -1240, -1006, -1789, -1717, -1594, -1383, -1313, -1944, -1875, -1727, -1712, -2052, -1835, -2045, -1982, -2167, -2214, -2454, -2132, -2314, -2206, -2522, -2296, -2520, -2281, -2425, -2569, -2313, -2331, -2454, -2815, -3236, -2763, -2221, -2502, -2693, -2972, -2696, -2540, -2825, -2709, -2777, -2638, -3014, -2765, -2770, -2778, -2106, -2550, -2678, -2778, -3050, -2172, -2370, -2498, -2319, -2313, -2269, -2673, -2182, -1905, -1746, -1925, -2150, -2020, -1780, -1819, -2055, -1882, -1806, -1540, -1634, -1790, -1505, -1271, -1166, -1429, -1319, -1478, -1278, -901, -1339, -1286, -866, -842, -837, -1113, -526, -412, -209, -763, -717, -775, 8, -273, -689, -260, 63, 180, 152, 195, 147, 406, 254, 251, 437, 517, 364, 641, 662, 383, 507, 886, 768, 748, 669, 1002, 1258, 853, 752, 1663, 1382, 1400, 1294, 1183, 1377, 1217, 917, 1063, 1255, 1472, 1131, 1428, 1184, 1392, 1576, 1633, 1541, 1456, 1808, 2065, 1716]
3881A716J14m49N10L63m39j01O4K94k80l88L77m4K21m81L09L15k09j87J9L42J58
3902B224k78j36M00l69K59j56J18L5k35k50L52j27J0L81k67j39k00L13N65l93
3922B107l97N8K93K8n83o0K91P8l14n5L67n9j23J17j85L17j27m50P23m76K6K54
3944A830o5l15L2j92J88p8l32K54J83N1n34k11L00N47p03k29N23J27l20j89K26
3965A093j0l40Q2K3p55O69m61L68k03l07K5j7k01j05N51m5l02J43j22k39mk39
3987c96Q1m9k39L02n61Q7K87k20k78J5j19R4K15R0q1l29o7k28o9K45l10J09j82
4010a603k94K71n5k04j49j1K89J30k35J75p1p6j99O9j32k01J31J73%k50QJ60m1
4033b115l56K9J6K21l37q3K77J68j9m25L35O4P0j96r6L00j26K04l87l1K79l64
$$ y = [1716, 1830, 1381, 1891, 2254, 1815, 1714, 1778, 2072, 1792, 1404, 1781, 1737, 1958, 1477, 1786, 2101, 1892, 1705, 1724, 2066, 2224, 1946, 1810, 2210, 1841, 2100, 1944, 2062, 2097, 1862, 1612, 1964, 1837, 1847, 2228, 1961, 1822, 1622, 1935, 2500, 2107, 1710, 1768, 2061, 2089, 1506, 1446, 1737, 1815, 1501, 1446, 1813, 1754, 1631, 1748, 1563, 1880, 1753, 1303, 2026, 1550, 1576, 1830, 1765, 1450, 1482, 1290, 1478, 1400, 1068, 1322, 1505, 1556, 1022, 811, 1111, 1658, 955, 726, 1249, 1376, 1056, 867, 1093, 1083, 743, 825, 848, 93, 762, 301, 669, 466, 159, 184, 167, -34, -139, 412, 367, 65, 208, 86, -153, -157, -396, -315, -364, -603, -301, -862, -775, -488, -708, -986, -971, -1090, -996, -781, -691, -772, -1101, -1168, -1396, -1465, -1220, -1530, -1421, -1603, -1897, -1626, -1681, -1885, -2034, -2045, -1756, -1626, -1861, -1686, -1757, -1833, -2032, -1963, -2095, -2296, -2165, -1992, -1992, -2242, -2234, -2074, -2115, -2471, -2442, -2426, -2205, -2542, -2625, -2348, -2180, -2199, -2624, -2289, -2225, -2155, -2351, -2447, -2147, -2273, -2069, -2456, -2487, -2208, -2572]
4055b572K61L98k01m04M53K72m65M64m6L28r9m05K91J13K0k72j9M99m23K31j25
4076a701O09om94L67J99N6n27K99M12J10J9n03K69N4q1L17j48O0k91M25o6K41
4098c80n3P5M99o33K8L92o0K37j61m5J71J83k41O3J52J77J40k27n9J71J01n9L09
4121G80N9J0p3K21j0o2J25l87O4J86O9o7p7k47K03M41j39n2J08K29j16k0L2K42
4145A519K22k33j44rj5L43j14J6j61k57K34J68j86mL77L91o06rj4N19k34n00K68
4168A571M24J7l73l14O17J48k63m48J61K1J62NJ5J63n56M94q8K28m87N27mo8n11
4191A441L30M3J05m56J5O7K0k6l93L59L62m20j60J79L89l71p4K97j40L7k44J4
4213A374P7k40r2L01j34k83J40p2J77p2J69j74J05m48J6K02J91n02j73J31O5j04
$$ y = [-2572, -2311, -1913, -2114, -2518, -2065, -1793, -2258, -1794, -1840, -1512, -1611, -2016, -1725, -1612, -1592, -1864, -1883, -1384, -1807, -1576, -1701, -1092, -1098, -1592, -1225, -1026, -970, -1497, -1198, -786, -676, -657, -1160, -891, -837, -918, -601, -749, -689, -980, -555, -621, -380, -433, -358, 141, -492, -464, -72, -132, 105, -56, -101, 70, 253, 12, 75, 227, 404, 544, 317, 258, 429, 530, 471, 780, 839, 849, 776, 997, 987, 925, 1050, 663, 727, 913, 982, 915, 838, 591, 794, 1235, 1096, 1044, 1152, 1381, 1265, 1245, 1277, 1519, 1741, 1508, 1364, 1355, 1340, 1683, 1569, 1585, 1424, 1167, 1401, 1569, 1383, 1379, 1756, 2147, 1541, 1532, 1518, 2037, 1803, 1303, 1571, 1995, 2012, 1639, 1325, 1942, 2090, 1827, 1379, 1540, 1561, 1723, 1728, 1743, 1906, 1350, 1844, 1756, 1984, 1497, 2024, 2020, 1952, 1441, 1771, 1814, 1919, 1463, 1478, 1545, 1565, 1539, 1146, 1505, 1867, 1447, 1287, 1466, 1855, 1484, 1410, 1707, 1567, 1604, 1360, 1374, 1451, 1211, 1119, 1420, 1286, 1003, 1143, 1071, 1248, 1176, 1345, 1171, 1276, 828, 844, 1046, 1237, 735, 562, 693, 758, 654]
4235F54o6J76j76p6k86J36L6Q3k13r1o9N0j29L9J19j1l30L56n20j84L41l69K17
4258c13o30J8K25l32M94j50J3n1Rj18K4l68K89P7o18O51l45j32m97P2L38J25k08
4281a427k21ml5j05L82k92j8K14j98J4o00O24m27L74k02k2nJ99r0k35L28k7Ok12
4305a979j94O0L63l99M55l71r7L63k37j27K49M8j7k82J89L01J18o57J44N58l6
4326a548J60j88K8K13k39K61k13m10K90M00J96p50J86P70k57m14j5M91k1K04n57
4347a413N12n4k40j28N72L60l48J73m81L73k81K4M03Q7j74P9Q3M62j78o3j97M46
4369A7j43k71N52n0l20q6M76M54o75J30J96j73K3J7L89q5M3j94J62K80j47n6J48
4392F87K54m56o1K37Oj20l80M93L71l36k6L03L17k44k70K29L61l45k91l5M55J95
$$ y = [654, 588, 764, 588, 512, 226, 362, 398, 481, 268, 177, 108, 158, 29, 68, 187, 176, -154, 202, -318, -502, -161, -530, -313, -943, -925, -700, -1032, -538, -688, -675, -726, -717, -835, -811, -1179, -890, -813, -1431, -780, -1125, -1257, -1754, -1682, -1344, -1219, -1427, -1648, -1652, -1687, -1792, -1410, -1702, -1720, -1506, -1704, -1690, -2290, -1666, -2093, -1719, -1921, -1943, -1948, -1749, -1839, -2074, -1746, -1773, -1767, -1979, -2173, -2113, -1750, -2149, -1694, -2065, -2162, -1799, -2036, -2163, -1914, -1866, -1883, -2165, -1976, -1675, -1557, -2214, -2070, -1512, -1548, -1388, -1576, -1548, -1335, -1574, -1313, -1526, -1936, -1646, -1246, -1050, -1800, -1614, -844, -1101, -1515, -1530, -1039, -1060, -856, -1413, -901, -955, -1195, -1323, -751, -391, -739, -566, -1047, -674, -955, -931, -528, -441, -615, -536, -453, 9, -169, -232, -429, 17, -126, -397, 155, 105, -215, -301, 175, 629, -46, 84, 280, 107, 130, 147, 536, 451, 494, 300, 462, 742, 595, 539, 687, 941, 485, 424, 661, 667, 547, 167, 660, 1031, 695, 669, 972, 1289, 1045, 775, 1004, 1365, 1020, 729, 694, 1149, 1344]
4414A344o86N30j14lk3o7K28j12J19O2J14j11k57M07l44L86o8J25K13o63K21o9
4436A232M65k14l22j3O04j91m4K8L71j67l55L7K39L6l74M79o35M69l84L16k5j33
4458A419j81J72J63k29k47K12O87l79N7j43K66j01n54K53J59j72j15k68L81J04
4478A484K51o13%J18K49j18l42j6M6j74N51l02j54r1N8L33l63l83L44j89K9j25
4500E93mJ17l94K15j6Q6j75m4P9L0pj82l51M8R1M9l02q5O8p5J14j21l11L25k39
4525d91K62o41M32R1j82J44l36j88J72j89j52R7Nk12J92J8l57J59K58l56K03r7
4547a168j79J29J06k11K72j37j73p9lj36m1K14j86j32q8J24K07Q1k28l52N75j16
4569a521j65K76ol05K27l0q7J81k94J71L38m91p0N0L56K03l71k76J20M74k58l09
$$ y = [1344, 658, 1188, 1074, 1071, 1048, 981, 1209, 1097, 1216, 1278, 1392, 1281, 1024, 1431, 1087, 1473, 1405, 1530, 1743, 1080, 1301, 1232, 1697, 1483, 1161, 1148, 1752, 1561, 1517, 1545, 1916, 1749, 1394, 1431, 1670, 1706, 1332, 1811, 1176, 1645, 1261, 1577, 1552, 1419, 1238, 1410, 1573, 1344, 1097, 1309, 1996, 1617, 1674, 1531, 1797, 1696, 1142, 1395, 1554, 1382, 1267, 999, 1380, 1484, 1735, 1122, 1122, 1240, 1489, 1371, 1029, 1013, 1059, 885, 1436, 1134, 980, 889, 947, 1280, 917, 534, 878, 689, 718, 593, 589, 706, 312, 527, 511, 597, 422, 378, 457, 487, 480, 298, -53, -5, 86, 135, -167, -252, -184, -259, -145, -266, -577, -252, -491, -229, -870, -438, -347, -529, -385, -721, -909, -737, -926, -1078, -981, -976, -1188, -996, -978, -1335, -1176, -918, -1274, -1071, -1168, -1347, -1218, -1112, -1323, -1051, -1188, -1361, -1440, -1443, -1579, -1620, -1406, -1592, -1724, -1812, -1688, -1481, -1400, -1628, -1980, -1405, -1521, -1686, -1410, -1416, -1721, -1494, -1524, -1611, -1430, -1724, -1553, -1215, -1706, -1776, -1726, -1370, -1167, -1538, -1814, -1694, -1220, -1478, -1787]
4591a787L51M81j26qj64J26j26j7j04j47M17l07L9K21J7J45L1J92k79MO9L71j80
4614g81j44M5J87J2n27M01n5K69l62J68M89j20l77L4L59J2J51l29K67Lj17K02
4636b13j39J91l01k5M81k18k2J53L4N50k87j98N04J4m63m4j32L30p9l0J2K16J94
4659E28p6j13n2J89j13j31J88J03R9r7M00k83L22l79L9j02j11J79J7L8l94N65
4681H16J50j65J37j89J97K87m36J73k6L33n13K66o0N6pJ36J3L3K9j98L8L0k08
4704H92N81k38n6L17K29k06L1k16m15O07n22L09J7L09j65l08M18j69JK3K67l12
4726A394r9l4K32J55k19L88l84n2k15K72r8K22l53J5Qk30K2o3Q6P7Q9J34j40o
4750A201J58m38k94M46r8j08R2l5J42l13R9Q2J31l09Ml68j4J26K02l83J79j66
$$ y = [-1787, -1436, -955, -1081, -1089, -1253, -1127, -1253, -1270, -1374, -1521, -1104, -1411, -1372, -1151, -1134, -989, -958, -766, -1045, -1041, -972, -601, -781, -925, -880, -693, -681, -1208, -807, -862, -593, -955, -787, -298, -418, -795, -761, -402, -390, -239, -568, -301, -298, -415, -213, -352, -161, -462, -487, -6, -224, -246, -93, -59, 491, 204, 6, 510, 524, 61, 17, -115, 215, 136, 106, 118, 334, 528, 452, 339, 287, 476, 363, 232, 420, 523, 622, 525, 925, 642, 964, 585, 624, 522, 411, 590, 607, 645, 251, 816, 966, 801, 938, 749, 946, 1233, 797, 970, 944, 1277, 764, 1030, 970, 1026, 1019, 1155, 1168, 1201, 1230, 1032, 1070, 1100, 892, 1473, 1235, 1179, 1496, 1725, 1519, 1550, 1334, 919, 1526, 1004, 1313, 1330, 1639, 1474, 1166, 1584, 1415, 1416, 1439, 1706, 1394, 1295, 1261, 1493, 1648, 1429, 1817, 1433, 1381, 1166, 1438, 1340, 1562, 1209, 1224, 1232, 1002, 1024, 961, 1047, 1124, 1213, 1347, 1207, 1201, 1359, 921, 627, 1073, 975, 867, 959, 924, 1066, 753, 852, 934, 1065, 756, 760, 392, 378, 504, 706, 323, 502, 336]
4772C36j58K53k49j26K07p2j53J69l50M18l66N2k26M5j38oK54l07m2K10j27j28
4794e04R5k41k11L19j06l59N4J30r8rN0m6p1q4J19mR4k96Q4L19l45Ok95J60Nl61
4820a595N92J1k98p9P3K32o24N20k4J0j01j53J46j76K22l49M55O2k06l77K63L88
4842a008o08q7K21J96k5J80M0j9l0m60J35N22k30j87J15M3Q2L56l26l9J0j74J56
4865a137J6K43l64M9M68k29j55K0L34k42M9K9j29K28n1pj11K47K83j63J27j7m59
4888i71M91j04l92J55J49K71k91n6J72K31N2j63j2M34k73J26l6R4j93k06J98K96
4910b8j55j00n5L3K42N3j85J97J92j64j02r4L39k12J88R3R7j86l5M73l76k19N5
4933E1M09K76m32k26N84l11K8j47J63M92j54k44K33n9r1N5N5j2M1mM7M56r00P12
$$ y = [336, 178, 431, 182, 56, 263, 191, 38, 207, -143, 275, -91, -39, -265, -220, -358, -364, -110, -417, -459, -249, -376, -504, -409, -650, -861, -542, -648, -1007, -953, -823, -921, -930, -880, -926, -997, -1081, -962, -966, -872, -1168, -1084, -765, -1110, -1104, -1399, -1239, -1234, -1595, -1003, -992, -1290, -1369, -1296, -1064, -1688, -1168, -1192, -1182, -1283, -1436, -1290, -1466, -1244, -1593, -1138, -1076, -1282, -1659, -1396, -1008, -1616, -1703, -1482, -1286, -1311, -1131, -1091, -1110, -1140, -1600, -1465, -943, -1173, -1360, -1245, -1202, -1120, -764, -1090, -1129, -1119, -1293, -1137, -1121, -878, -1242, -1193, -725, -954, -1109, -1089, -755, -997, -948, -919, -1048, -820, -871, -878, -989, -742, -459, -622, -495, -512, -971, -480, -584, -976, -821, -672, -401, -692, -748, -576, -345, -293, -456, -468, -34, -307, -181, -217, -123, -316, -522, -324, -28, -183, -283, -338, -305, -63, -10, -195, 2, 194, 30, -72, -166, 173, -39, 149, 242, 339, 153, 118, 591, 215, -4, 51, 460, 736, 304, 78, 662, 351, 379, 232, 395, 887, 733, 489, 722, 663, 572, 627, 682, 670, 711, 707, 754, 1210, 310, 1022]
4957A022k1P8k06P1L16r4l07q0K28M39k33n10K90K11nRJ71k66M15l18k3k52K93
4980A228O9j75J8k63N59l3Q6m97J70J55J79k22q7O63n21m49J52R4J0K08m22M02
5002A324Q9m8m91L15L86l57j46Mm9KqJ63nL5j69J02k7l08p8K59m1k19l32L68O3
5027H32l36n7K34n7k92l5J17M00n11l1J12M8k65O2K86n86K69o7K48l90j03J2p9
5050a89K75m49K36l7J34k97r2K85j34p8m65O4L59k8j11k38K35l79J42j01K22N1
5072e95l48J52J10j53q1L51j89j94j57K32K09m24k02N48k27q6l67L14K01l56J00
5093a162J77K25q5J09l93l18N35l0l74K76j70J99N0l75M74l86J63r6j4J33K2K38
5115h02k07m6j19K29r5n9Q9p5j48j83N18k27J91q4J56j9k22K30j97j46K81J39
$$ y = [1022, 1001, 1079, 873, 944, 1260, 1166, 859, 779, 1007, 1446, 1213, 703, 993, 1204, 1199, 1208, 1379, 1113, 1528, 1210, 1187, 935, 1228, 1297, 1122, 1140, 877, 1436, 1403, 1489, 992, 1162, 1317, 1496, 1274, 1187, 1850, 1329, 880, 1032, 1126, 1136, 1344, 922, 1324, 1413, 1365, 874, 1189, 1575, 1218, 1072, 1076, 1027, 1029, 1021, 1184, 1179, 1214, 1045, 1147, 1120, 812, 734, 993, 952, 733, 401, 769, 832, 496, 439, 673, 616, 324, 289, 406, 806, 295, 264, 376, 424, 159, 221, 507, -79, 190, 123, 371, -19, -122, -110, -189, 86, -363, -127, -164, -30, -327, -419, -134, -268, -346, -811, -747, -388, -416, -527, -765, -530, -909, -767, -868, -646, -595, -943, -791, -681, -834, -915, -564, -753, -947, -1104, -872, -663, -1087, -1289, -741, -968, -1054, -1421, -1107, -906, -1262, -1162, -985, -760, -845, -736, -1129, -1447, -912, -942, -1316, -1040, -1210, -1011, -961, -1336, -862, -1248, -1085, -1181, -1195, -1062, -1040, -802, -1009, -1055, -1174, -945, -1040, -1099, -1010, -1085, -1233, -1416, -898, -1125, -934, -1018, -862, -881, -1103, -873, -1070, -1216, -935, -796]
5137g96k89J71M9J60j62M40k57k20M1J21j79O1L12J07l50K16l40L56k23O3j38
5158h57L26J6j03J73k05L23J14M6k62k95k5K66o3K66j99j41J73q0O1M43j42j44
5180c09n3n0N29k02j28k6k5L3M13k90L7n5M38n7j82lo6P9J43j86k91M55J9J31
5204C54r8j32K99K7q2R6k19K91m0J06k2k21K44J4L2r8K70l65j0N73n4k01K51J0
5228A025j98J09l67%J48L94m27j44K72J26L4J05J74k91K14k16J61K1J31l04J64
5249A131p0j44L93J88j68k94J49Q8j9j03jq4M6j37J16o1q5Q2L51k67J85n17K14
5272I93P1j01K64j20k47L0J19M9J61k71K74m24J25j17q6J16J38k94j13Jp9K08
5294F97m37N74r6m23J56rk05J25j87L87k41k19K29J79m79K20q0J43jk62j25J68
$$ y = [-796, -1085, -914, -865, -705, -867, -427, -684, -904, -863, -742, -921, -860, -548, -441, -791, -575, -915, -559, -782, -719, -857, -531, -515, -618, -445, -650, -327, -213, -167, -429, -724, -749, -483, -546, -280, -479, -620, -447, -527, -466, -23, -165, -309, -362, -412, 117, -85, -213, -239, -264, -231, 182, -108, -71, -126, 312, 255, 73, 70, 4, 83, 226, 40, -251, 204, 223, 354, 256, 124, 423, 450, 368, 464, 245, 536, 496, 602, 580, 359, 603, 617, 649, 551, 821, 456, 446, 1019, 965, 764, 1015, 1025, 827, 936, 569, 569, 717, 1111, 684, 540, 812, 938, 972, 1077, 1251, 960, 1174, 958, 1119, 1140, 1271, 967, 1131, 1061, 917, 1310, 1498, 1330, 1036, 1185, 1273, 1254, 1151, 1150, 1066, 1112, 975, 1091, 1030, 945, 1027, 1378, 1111, 1296, 779, 993, 1064, 963, 1227, 1107, 860, 890, 1009, 1058, 1219, 948, 1222, 798, 923, 806, 720, 836, 974, 680, 567, 568, 489, 697, 260, 834, 738, 315, 471, 462, 257, 382, 195, 582, 341, 122, 351, 530, 51, 271, 191, 334, 333, 71, -54, 114]
5316A14k31%q8O4J61k33Q1o3P4l83L00J62j08mk51J73J74k50M7j85J88l15km6
5340f21K75K60p01N49m6j51n29M46j33Kk80L1J05L59q8q0j69r6K40q3M3p7k27
5363i71L51l12l2M72m06K42R3o1l58K06j8l11P0L83r2J14k51q1K21k03k6q1L48
5386g03l12J11J61l19N66l15k26P9R3L9n7M2k73L32k97K82L32k30Q5k62K73k39
5408h38J67L51m52r1L22l21K41j42j91J55M9k63L72J88K89m82K69l51J16J40L92
5429h0n61P8k1k2L78j91R7j86j59K2L7K27K26o5j96j72K49R7k4K10k05J88j70
5452b43k9q3K89k31M37k01j69J37R7k73P0K97J81P5k11J36n0q0j74M73M8O3l41
5475B18k20M90k15l29M38j44J68QJ33L0J23k06M83l14K63l46J52L19m37n7L35
$$ y = [114, -117, -117, -205, -141, 20, -213, -132, -195, -121, -504, -204, -42, -150, -154, -405, -232, -58, -308, -261, -446, -258, -573, -575, -621, -346, -86, -787, -238, -284, -435, -964, -518, -651, -649, -929, -898, -793, -434, -522, -602, -771, -867, -627, -710, -667, -744, -971, -620, -932, -964, -492, -898, -656, -563, -624, -982, -776, -794, -1105, -1035, -652, -744, -630, -881, -962, -741, -944, -970, -1051, -703, -1015, -904, -743, -1062, -496, -811, -1037, -958, -865, -826, -883, -841, -1114, -782, -1079, -797, -465, -695, -610, -872, -599, -838, -671, -320, -772, -863, -541, -862, -621, -763, -954, -799, -750, -1013, -641, -453, -164, -646, -377, -728, -612, -472, -80, -641, -563, -584, -606, -228, -419, -322, -508, -667, -645, -608, -381, -155, -220, -416, -588, -339, -242, -266, -56, -261, -73, -243, -272, -355, -66, -297, 140, -61, -230, -93, 4, -269, -199, 98, 279, 354, 143, 279, 229, 149, -25, 448, 496, 559, 218, -2, 488, 273, -56, 382, 238, 406, 414, 547, 577, 700, 494, 977, 663, 926, 580, 732, 1051, 614, 557, 892]
5496H92j86Q8n08L27J05J22o3K53o8J93k04k83L36k27K31N1k02J65l1J08k03J89
5518A085j71j95J16k3J20K37m23K69j79R0j14K22j31qk9O5o0M1j8L3o3l6k03%
5542F25K24M5j30N1R3m4K57k71r0O0k05l8N3J56l41q1J00K16k37J80l44k6K5Q7
5566C65o8j3L6oP7k90L72j79J5j54k27jL35k93J68k30J72j01j59K07J55m31J22
5589a28J50m6j11Oj32K05k99o7l8K19K31n11M4L28l52j57j3L19Q8k70J04N2J38
5612b40m5k58J39k65N93n98L93l83O0o1K4J41l02K90J39q7k50J69nK03l61r0p9
5635h73M18k61l14L44J41k1p1k01O7l8K65pJ1P6l59J17L00k42N2K08o30L10k29
5658i37L29L5l65J17K30N0m32L80J45k56j33R7P7K91l62k85M21M9j14k32O40k88
$$ y = [892, 706, 794, 286, 613, 718, 840, 777, 1030, 962, 1155, 951, 668, 1004, 777, 1008, 1059, 857, 1022, 991, 1099, 896, 1085, 914, 719, 835, 812, 932, 1169, 746, 1015, 836, 926, 812, 1034, 903, 895, 866, 931, 871, 912, 894, 927, 864, 828, 625, 625, 849, 894, 764, 815, 908, 864, 1121, 850, 760, 820, 615, 577, 630, 786, 445, 364, 464, 680, 443, 623, 279, 253, 278, 365, 297, 284, 320, 314, 391, 101, 473, 294, 309, 155, -72, -73, 262, -31, 137, -93, 79, -22, -181, 26, 181, -250, -128, 22, -24, -135, -129, -261, -56, -355, -422, -460, -241, -10, -521, -477, -149, -501, -658, -671, -352, -264, -534, -430, -378, -240, -285, -543, -404, -669, -76, -674, -281, -664, -604, -665, -641, -500, -802, -512, -373, -460, -710, -541, -546, -343, -704, -794, -873, -455, -716, -1030, -686, -545, -566, -637, -838, -771, -809, -544, -551, -540, -464, -823, -706, -406, -648, -596, -388, -1018, -708, -937, -608, -573, -938, -821, -591, -541, -973, -593, -448, -704, -837, -740, -663, -372, -734, -1019, -598, -549, -663, -895, -255, -543]
5680e43j16N04l52m91R5L66J97l01L8k00L01J30R2k64L66m3l50K05k17J39j36
5701e80P2K42J33m03j14L3K12N1M5M2K19n71P0M60j00pn2J31J97j40j38K55Om05
5725c42l7K84L14n00M41M2J49k47l8L7j95K39j02K59P5k10J31K3M51q89M13J53
5747D51k07K06P7j24nJ19j08M23k5o4k50J57J23l61PN03r3l76P2K08lO0R3m3k6
5772H14K9j40M4q5%J7K50j01j6j37J36K72n19j65M40J19l43J58K9j11L40j85P6
5795I22o0Q8l46j88L86K07n15N13k85p9Q0L8j69K20l05n6O6N6r6M26q5l33K02
5818F87k0J39l88j42K30J81o8n39J61n8Q3L9j02J68Pj12J48j43K00k01l10L13
5840B73o4K76k50J43l99J45rO3J70l40oK19k82j29J24K49j03k26j81l6J08L39
$$ y = [-543, -659, -155, -507, -998, -903, -537, -340, -641, -603, -803, -502, -372, -280, -544, -178, -221, -571, -366, -583, -444, -580, -508, -266, -133, -536, -650, -617, -405, -354, -309, -267, -48, -619, -549, -89, -189, -196, -248, -117, 80, -60, -198, 57, 63, -342, -379, -95, 219, -281, 160, 202, 351, 104, 66, 103, -92, 147, 45, 304, 379, 169, 300, 323, 774, -115, 298, 451, 244, 450, 527, 403, 398, 517, 409, 832, 807, 743, 493, 650, 773, 412, 419, 922, 829, 453, 525, 733, 730, 790, 883, 840, 814, 843, 703, 747, 662, 662, 679, 929, 828, 812, 675, 811, 1083, 564, 399, 839, 958, 615, 773, 802, 691, 1031, 846, 922, 862, 950, 604, 416, 802, 1009, 494, 1007, 722, 643, 723, 761, 592, 812, 507, 451, 517, 573, 477, 903, 818, 485, 687, 667, 806, 418, 276, 506, 687, 619, 80, 241, 183, 266, 305, 203, 371, 378, 266, 414, 271, 471, 270, -40, 273, 209, 485, 235, 378, -21, 124, 115, 178, 348, 8, 2, 221, -61, -190, -66, 183, 80, -146, -327, -363, -255, 84]
5862H4l00n5j26K02k6J44o0J20l83J05K5j33k3J68J5j87Q8J26q4j80K75n2k61
5885e18J58n0j45n4O8J65k3J60r5P7k22R7j09J63j49Q6j28j39o1j5MJ15lL2k1
5910f07pj31J84l41K26N6K22k07J12PK0j54P9n4Q9k75N6l7r5J39J06j47Qn1J81
5935f21j05j70K11n5J30J70k04K4K2R5O2k98N0j86K62K7J09l8J73j21K37l07k18
5958g51J41K28j82O7p9J02Q2J41m14J38L34n2l68R5P6J83J1m6J51j38k78K63n0
5981c46j17M14j96J05j78p0L56j17L5K08j17k26J04k0L76j30j4m9j12j13L9M87
6003C19m77J04j62M16l61L16L74n39N14j94j33K21J2K2J32n4K9j51ML09m46J72
6025D27lK10P0n21M35J4l6K80j73J2k41o9L73n8r5N08m30nK7L4M6n27K55J69k0
$$ y = [84, -216, -271, -397, -195, -221, -77, -137, -17, -400, -295, -270, -403, -426, -258, -243, -430, -342, -216, -300, -480, -205, -257, -518, -360, -410, -555, -609, -541, -376, -399, -239, -334, -257, -479, -382, -491, -328, -477, -391, -519, -658, -719, -734, -730, -615, -618, -586, -607, -614, -745, -561, -902, -676, -620, -398, -605, -493, -486, -466, -620, -541, -595, -506, -781, -725, -762, -857, -718, -612, -759, -751, -802, -621, -726, -896, -685, -740, -610, -440, -644, -620, -598, -503, -441, -739, -689, -875, -613, -586, -477, -515, -342, -463, -226, -533, -751, -610, -382, -564, -497, -576, -474, -392, -251, -665, -527, -193, -245, -613, -518, -442, -259, -248, -294, -143, -281, -559, -296, -346, -463, -49, -245, -140, -318, -388, -32, -149, -114, 94, -23, -249, -145, -165, 211, 81, 67, 18, -94, -207, -168, 319, -158, -54, -216, 200, -161, 155, 529, -10, 504, 310, 177, 398, 410, 432, 564, 510, 539, 388, 392, 701, 255, 427, 424, 634, 704, 183, 618, 632, 596, 876, 703, 715, 474, 405, 778, 720, 625, 1133, 703, 698, 725, 759, 805, 278, 533, 702, 682]
6050F82J77k14k11L93l53l8L32r8n7q6N5M1k22L52OJ47l93J66J74j52j96o2L33
6073G76l6p2j37k3K15k96j37k3L19l6Pj51J40P4k31KK3N4n6m8J24l35J13j5NJ12
6099C68l10K15j08K30m38K44k92L67K3k68J25L15m12N2K6j69K42j12j02J14p0
6120D0k52K6J57Q3q0R8k67M0K2J04j38m2N9p5L18n0k94M0K64k46J84j53q1o5K8
6145b80L32q3k99k5J59O2k33L53m94L38R7l20j76J34L10j7p6r2j89j19M46m24
6167e96K46J39J21k78p3J06j0J27j1j14k41J07K03l36j5K02R9j61j68j04K15M4
6189d98R9k99r4L33N1j79K4K42j73Lm0l8K1j49K62k8n4N0j97K92l68L84l23O2
6213f17K25K6K06k15j65J16l82K63l7J50k19J38J03J40q2L3l30P6l5K67R5L6k82
$$ y = [682, 859, 645, 434, 827, 474, 436, 768, 670, 613, 527, 582, 623, 401, 753, 759, 906, 513, 679, 853, 701, 505, 443, 776, 740, 668, 531, 508, 723, 427, 290, 267, 586, 550, 557, 406, 546, 620, 389, 391, 414, 468, 412, 364, 488, 153, 266, 251, 256, 368, 58, 273, 165, 395, -43, 201, -91, 276, 299, 31, 156, 471, 59, 111, 137, -32, 210, 98, -4, 110, 40, -212, -186, -29, 54, -26, 72, -195, -155, -133, -29, -167, -209, -150, -225, 93, 43, -251, -211, 53, -193, -9, -162, -243, -308, -280, 52, -31, -330, -355, -196, -134, -367, -14, -508, -170, -73, -393, -569, -435, -125, -142, -218, -310, -499, -618, -172, -596, -350, -211, -90, -368, -441, -335, -345, -218, -229, -343, -584, -477, -274, -610, -625, -423, -324, -485, -653, -757, -542, -498, -399, -698, -792, -459, -408, -587, -563, -321, -494, -491, -531, -569, -548, -697, -435, -463, -517, -467, -664, -372, -740, -356, -679, -617, -392, -366, -160, -375, -540, -424, -806, -543, -580, -430, -649, -511, -408, -268, -350, -317, -647, -571, -606, -339, -244, -208, -490]
6236d90JJ24l51M52k3R6l57M85j11k30K09lk90K01o1j39K64j68K78J14k0J66o8
6259G9k47k16K34K80k74J98J31k80M45m23J3M2K05j20O8R3L1r7k14J40J90nL18
6282E91j26k31l4L44l36J21n6K20K99n47K18j47Q3J25k7J54p4j25j71O4M29k27
6304E47k21R0N3N8J43m36L48m85L34k35M79N3O5q5l12O4mO7J34j74K96l32J17
6327E64R6j40K41l69L5K10m41P19k96p6Jj92K25J04k61j67L16j51l0j8J83m15
6349A38r4L50l16L18k17J97K31l65k8o3L82o29K04J17M12k54L09o69J31J02j23
6370A33P2l7N0J08m37L58J98m2l71J10J50l16O8j31K17K59n14K8J87O3P4j11k35
6393a19P4O8L39m68j40Q3k41N52n54L51k87K65O1j36J88k57K02J3qL2k83J24k30
$$ y = [-490, -489, -365, -716, -264, -287, -191, -548, -63, -174, -404, -195, -198, -488, -287, -348, -487, -223, -391, -113, 1, -19, 147, 79, -168, -384, -150, 130, -144, 54, 185, -95, 350, -73, -60, -18, 187, 67, 135, 228, 259, 162, -52, 88, 278, 273, 591, 465, 234, 200, 544, 208, 329, 273, 493, 792, 245, 463, 316, 399, 524, 497, 651, 577, 452, 281, 345, 774, 547, 326, 416, 469, 527, 670, 234, 582, 97, 431, 196, 675, 728, 793, 708, 396, 460, 456, 523, 657, 483, 779, 447, 564, 660, 520, 761, 392, 427, 637, 196, 915, 619, 543, 544, 352, 577, 681, 420, 253, 569, 418, 388, 370, 553, 138, 44, 394, 78, 396, 179, 376, 607, 242, 214, 151, 533, -96, 108, 225, 637, 383, 692, 23, 154, 256, 133, 205, 168, 218, 326, -111, 247, 445, 403, 32, 142, 292, -24, 44, -87, 130, 389, -125, -97, 90, 153, 227, 116, -119, -45, 23, 362, -106, -246, -163, -404, 148, -406, -55, -342, -77, -16, -152, 36, -221, -19, -6, -14, 18, -265, -141, -371]
6416c71M90l55J62rK6N3j68k83K64o9l11L42k90m8M3N05k86l96k4M09J78p5k68
6439d81K26k1J01m25M17n33L25J04q0n1j10K98j31j88M3K93J28m18M6j67R6K51
6461b77k60r7L71l11K13j99J04N3j86M79l30R0j06j0J22J34m66O6J15K67l72L30
6483b70j49J57k83K09j19j39L00k9k30Q1J3R0j53p8L15k03L89k84j2K89k32J9
6505c19j7q6K68J02J9l6j65k77J90k00O47j35k44J21j22L73j97o3N3K10l17J85
6527a0k65M38J38k07J55n9J22l31L12p5j8l0M4l34J34j13Q0N03l02K26k23J85
6549C70l19K49j68K88j4n13L09M8J91j71J16j57j08K63n3n2l9J08J55k44R3N4
6571D06N3J17k64J50k50K45k08j33K60L54k70L8k25N35m45p4J85j14K67l97J68
$$ y = [-371, 119, -236, -74, -83, -57, -4, -172, -455, -191, -260, -571, -229, -519, -567, -524, -19, -305, -701, -725, -316, -138, -213, -481, -255, -276, -175, -600, -183, -716, -391, -287, -367, -418, -528, -230, -361, -549, -506, -213, -85, -503, -457, -624, -528, -277, -537, -634, -263, -574, -361, -560, -456, -403, -589, -110, -440, -350, -456, -466, -344, -210, -676, -610, -495, -228, -600, -270, -419, -262, -545, -336, -455, -594, -294, -323, -553, -472, -459, -369, -522, -600, -285, -488, -99, -383, -395, -106, -338, -319, -336, -422, -154, -52, -33, -69, -234, -511, -321, -521, 126, -9, -253, -132, -254, 119, -78, -141, -88, 122, -195, -10, -275, 163, 301, 94, 249, 190, 312, -19, 293, 218, 200, 170, 214, -120, 14, -99, -19, 484, 182, 408, 185, 370, 51, 300, 132, 420, 406, -107, 202, 250, 441, 270, 386, 229, 121, 384, 331, 279, 240, 348, 503, 259, 352, 406, 459, 576, 312, 462, 212, 457, 249, 116, 376, 730, 460, 498, 273, 808, 363, 289, 474, 360, 627, 230, 398]
6592C98J5J17p9m78P36j59k33K72k30J98k12K09p6L2J91n6l09r1K68k99J44r4
6614B64k4P0r5K76k07J57j00q6J36%j58J98J0m7m48J44k12M69j18M48q04K13o
6637H0J26N0J35l7l13o3O3O9k41J72L51k36J85k00M6q3k5j79N27m32qL29k59k03
6661a46J43N8j18J7j53J93P1J6j83L42k85q1R8J28j02r9J1L9j08j32L52m39K67
6684a11l2M9l17N10l40J65j3j70OJ7J25m76L74%k26K53p5M0j89M0R5K03k21N5
6708b38n8q7J29l5j54J14P5n7m25L47m4J20j09k1n6j7L24m58J40K48J37k09k81
6731f15J85j56M77j20k80J11J41j41L2k96J30j86N41j60m1k26J72K95k81j05R0
6752d33L62m07k0L5J74r7j04K59J59L0%k48j33J20l7M0J36k78R4L97l90K33Rj04
$$ y = [398, 413, 530, 451, -27, 709, 550, 317, 589, 359, 557, 345, 554, 478, 510, 701, 645, 336, 245, 513, 214, 358, 264, 240, 310, 215, 491, 284, 441, 341, 255, 391, 391, 233, 431, 441, 394, -54, 90, -122, 347, 229, 677, -127, 86, 80, 206, 256, 391, 354, 41, -22, 41, 110, -131, 41, 392, 156, 341, 141, 187, 104, 79, -100, 427, -5, -13, 316, 57, -146, -3, 55, -63, -46, -199, -6, 65, 81, -102, 240, -45, -126, -28, 100, -2, -101, -90, -51, -159, -291, 61, -378, -111, -143, -94, -411, 99, -241, -76, -89, -259, -253, -236, -111, -587, -213, -213, -439, -186, -261, -221, -410, -370, -275, -72, -293, -238, -296, -383, -254, -289, -443, -329, -254, -311, -736, -389, -433, -313, -422, -443, -499, -516, -192, -650, -510, -262, -125, -334, -615, -430, -586, -109, -229, -509, -398, -257, -398, -366, -662, -532, -718, -177, -337, -378, -604, -432, -137, -418, -523, -433, -71, -478, -498, -463, -289, -386, -490, -231, -72, -42, -42, -290, -423, -303, -340, -300, -164, -442, -348, 49, -341, -108, -99, -203]
6776b03j63j07K87O2M1J8j67j32L14j41j77L53l3j77M2L4K11k7K6lo9o2J86P5
6800A88p5j92K57R9k89O1J2L58k43r3K25r4Q0K15l51L4k2q8K03O8k68R3Nj46J78
6825B15K59j14j62L75j99j12K14l47K20Q7P8j01k4l42M05q0k19k5K15j43J89P5
6847D64N0j92J50K24l81j57M00k16O7l55jL27k8k40Q9Jj6O8J89k1m48M35l77O26
6871F58l46j79K11M1J28l76K16p9j31J38j95L11k82j30M59q0k57L05k8k40J17
6892B61J22j46r5m9j00PK88J08k52R6j7J4l71K41l2K81j4l39R8j10K5N21m75j35
6916g3M9K90K29l85o2O6J14m28M79m66M06k95j28L15j68M30l23O6n08L11O5Q2
6938F6M7j84L9j22o9J26Q5q6m4j78J10j62L56o4j89L52m16J28K14K08o45M87k73
$$ y = [-203, -366, -473, -186, -124, -83, -65, -232, -364, -50, -191, -368, -15, -48, -225, -183, -149, 62, 35, 61, 58, -11, -73, 113, 188, 113, -79, 178, 277, -12, 49, 61, 419, 176, 83, 308, 214, 294, 509, 158, 192, 170, 82, 285, 353, 85, 178, 183, 37, 215, 474, 360, 198, 573, 374, 262, 476, 129, 349, 436, 514, 413, 389, 47, 452, 372, 153, 128, 343, 200, 389, 464, 514, 322, 472, 696, 315, 158, 558, 342, 409, 54, 53, 380, 352, 112, 201, 202, 186, 254, 443, 422, -26, 409, 32, 658, 312, 133, 344, 385, 513, 137, 353, 274, 143, 281, 86, 397, 115, -15, 444, 364, 107, 412, 384, 144, 261, 383, 237, 142, 93, -7, 0, 288, 396, 144, 240, 223, 237, -134, 107, 75, 356, 342, 3, 101, -9, 16, 537, 62, -73, -24, 266, 495, 110, 48, 114, 228, -200, 279, -187, 219, -76, -204, 111, -57, 373, 50, 116, -392, -81, -16, 66, 113, -71, -32, -154, -223, -97, -12, -98, -142, -320, -210, -372, -16, -80, -269, 83, -333, -205, 9, 217, -428, 59, -214]
6961b14k7K23j84J8J36j70k54K53m30L17L7jL19m41K13k4m6N9J23k85K39Nm57
6984e91K79l1n4O4R6j82j54q2L58J0m4j88K69J44m81L31k69K18L8j89rK76J24
7007f7k15p8K4K83l16L5M19k21q1j44J32l12M42J33l60K27j80k2J28k23K15j68
7029c49K83p9J02k41K35j85K31m7l59M16k01k2J23n2J7J7o0M51n18J25J83o4K27
7052B33k32K53m19r9J22K48m4k56J60k68M93M0P9k32o4L69l82o2K09j99J30l9
7074D0L68m09J85J34r3J57k79k43K47J47j15M67m16M8L1o9k61J36K48q8J62j31
7096B66p3J21l35N0O66j58k74q1M97o32jL54m34K68k22j5L15N5n24L79J50m43
7118g1L07K51O7m70M12j09j11o4k76L48j48L98q2NQ9k68K32l07j6K18k46L25j77
$$ y = [-214, -241, -18, -202, -184, -48, -218, -472, -219, -649, -332, -295, -296, 23, -418, -205, -229, -275, -216, -93, -378, -139, -134, -591, -312, -343, -397, -333, -237, -419, -573, -655, -297, -287, -331, -519, -250, -106, -587, -256, -525, -307, -269, -458, -467, -191, -67, -282, -360, -336, -53, -369, -334, 85, -136, -217, -361, -229, -541, -99, 34, -326, -99, -279, -301, -173, -396, -181, -349, -66, -145, -43, -284, -49, -234, -3, -50, -409, 7, -194, -216, -93, -145, -128, -111, -171, 280, -238, -113, 70, 6, 233, 1, 254, -165, -264, -142, 106, 62, -194, -34, -302, 191, 231, 310, 78, 14, 383, 1, -61, 148, -51, 79, 40, 408, -1, 184, 318, 225, 382, 103, -140, 107, 254, 139, 606, 190, 238, 269, 200, -61, 75, 323, 235, 397, 266, 193, 314, -21, 29, 695, 537, 263, 182, 679, 47, 46, 400, -34, 234, 12, -3, 312, 367, -157, 222, 372, -71, 236, 487, 554, 84, 496, 387, 276, 212, -64, 284, 136, 534, 452, 457, 546, 278, 510, 203, 187, 405, 159, 484, 307]
7141C07j42J8k8j90J94j04K21j40K17l90O6K05j19Q2l09L93k23N2j06J34j41L35
7163C32j65K25l52J01N3p5M7J39k96K21k45L59k73O6j61J12O6l9J95j39J98Q0
7185D49m42q6J20m6K17j85k0Mo1j10L78j72n1K7J34O1l05K84k80rl7L14k22j48
7209a86OK81j29K37j16j10j72N02m04o5K2R2n1k61j63J87O9Q9j00NK04o8J08j49
7233a72l0J33j31j51K18q9K7J64k40P8nk2P7j62J91k27L8K2J0K9j89MJ01L28k10
7258b08J15k13K13l56K94O0l37j34K76j77K37l04L22%Nl26K31J16kL37m78K03
7280a26J76l27o8%M90k60j3Rk36K46k77M0k8L21k0k08J94j06J34J18m04J92j49
7303c02J53j48O0K00O3n1j03jJ67q7k12nJ40K55k86p9J79J47j37K20j46K2r2L8
$$ y = [307, 165, 183, 155, -35, 159, 55, 276, 136, 353, -37, 29, 234, 115, 197, -112, 281, 58, 110, 4, 138, -3, 332, 167, 392, 40, 141, 194, 119, 166, 305, 9, 230, -15, 344, 71, 137, -24, 88, 154, 115, 310, 171, 369, 449, 7, -79, 41, -5, 212, 27, 7, 11, -50, -160, 218, 46, -5, 22, 156, 217, -88, 196, -84, -93, -130, 184, -38, -186, -180, 101, -28, 209, 93, -17, -189, 313, -91, -156, -134, -42, -93, -354, -517, -330, -261, -172, -272, -267, -63, -131, -23, -172, -202, -69, -200, -351, -133, -222, -195, -31, -271, -193, -198, -220, -143, -305, -114, -341, -303, -281, -271, -242, -431, -427, -326, 2, -208, -93, -306, -93, -449, -155, -95, -432, -566, -290, -467, -230, -534, -212, -212, -207, -533, -302, -186, -188, 149, -329, -126, 50, -277, -345, -345, 145, -115, -128, -119, -355, -109, -386, -346, -374, -53, -73, -281, -87, -193, -59, 59, -345, -153, -302, -149, -297, -237, -37, 26, -25, -128, -129, 38, -49, -261, -266, -126, 129, -157, -236, -57, 90, -47, 173, 27, 49, -43, -5]
7327eK89j40l83K22J53M40k89k14p2M5J57l4NK15k40J85k48J62j49Q2j3Lm44O40
7351C67K76p29L41j46P7k09%M44l9l19J35k06PM64p2q6l21K58L01J1k87j73%k6
7375F8J30R2n2r1P8p9r2K30q1j00K23J2k19k45N3L4L76k36N7J43J91l04j66L15
7399C37k03J58k31L69l91M83l26p1QJ34j3j16K83m17L10k27L6Q3p4J09M9k42j5
7422C3K2J75k27J23J52k50K51k57R4J5L47m87J53N7Mj13L04k90j1K4N1J82n7m16
7446a21j7L21J02J68l0l61P2K7M3m77K14L76l80L67k85J46j18P6l39N21j81k29
7468a05K54j15Q2j49j08J05j64R5O1k40J18J82J55m00N12m80J8M7k4L68k85J04
7490C1Q1m38K9j56J8M63j97M8O9l42L23j96J63q7l60K60N4o7J87l9k87K15j87
$$ y = [-5, 284, 144, -239, -17, 136, 576, 287, 73, 1, 46, 203, 169, 174, 389, 149, 334, 86, 248, 99, 181, 168, 171, -273, 367, 643, -86, 255, 109, 186, -23, -23, 421, 382, 63, 198, -8, -1, 463, 391, 305, -16, 242, 543, 554, 267, 94, 94, 68, 198, 290, 238, 147, 225, 146, 54, 284, 203, 103, 326, 338, 119, -126, -73, -39, 337, 101, 158, 301, 492, 188, 22, 337, 134, 292, 61, 430, 39, 522, 196, 125, 133, 267, 254, 138, 421, 4, 314, 87, 123, 206, 132, 241, 290, 48, 33, 55, 230, 3, 126, 278, 28, 279, 22, 116, 131, 478, -9, 144, 201, 205, 92, 396, 106, 95, 119, 170, 352, 295, -121, -138, 183, 285, 453, 423, 62, 134, 161, 204, -273, -59, 317, -63, 304, 19, 165, 47, 123, -216, 305, 124, -105, 149, 34, 116, -33, -141, -36, -200, -105, -44, -284, -166, 16, 171, -229, 283, -197, -179, -132, -156, 212, -73, 31, 112, -326, -297, -453, -435, 28, -169, -121, -52, -394, -71, -267, -104, -191, -551, -291, -237, -304, -117, -156, -443, -228, -415]
7513d15K39m0j96K14J06J91n18J81j13J1L01l02Kk2M07l68K92l61K74R3o02K63
7535c63J54j0J05k1j19J67p1m29L65L67m61n2L04l23L56J2k40r5P8q8K91O2k66
7558b77M6N8j83K27K2K27n61L65k68J68R9j9l6K38m38L37nj38l7J81J0K49j48
7581A17J3q1k18n5M22M1k50q9J52j11R8p8J29J06k2n7O4l03M37j41l92K84j92
7604a26L36R6k58pL1O5J90l25J52M8j29N6J1K01Q8O9m91L2K49r1k0m6l0pJ75l37
7630f8L04qk48o9K87r4m6K58n5j25j96L01N9r2l1MJ50m59J06O8J10R3j81K6mk03
7656a13M55m8k05K99l12k31M61m1p1J70l8l55J13J12J92Q1r7k71r7L32j02O4k9
7679B69J36l47L65k84J45l42J26J95m03M17r5J2Kl4j57J81j31K47o1k65l8J14
$$ y = [-415, -176, -216, -412, -198, -92, 99, -419, -238, -351, -340, -39, -341, -339, -361, 46, -322, -30, -391, -117, -24, -626, -363, -209, -219, -114, -135, -254, -87, -158, -587, -222, 145, -316, -368, -64, -387, -31, -19, -259, -354, -276, -364, -73, -11, -277, -231, -173, -356, -129, -107, 120, -441, -76, -344, -176, -77, -96, -132, 106, -332, 5, 0, -138, -175, 6, 16, 265, 117, 130, 49, -169, -224, 198, 239, -11, -100, 52, -59, 39, -39, 90, 196, 174, 117, 181, -122, 315, 174, -218, 66, -126, 210, 306, 48, 41, 72, 137, 327, 2, 154, 202, 73, 129, 140, 341, 429, 498, 7, 39, 288, 197, 177, 131, 101, 94, 269, -68, 236, 228, -20, -89, 198, 104, 58, 316, 261, 136, -60, 241, 300, 208, 177, 181, 331, -128, -22, 46, 156, 249, 68, 94, 90, -113, 342, 294, 89, 388, 76, -155, 306, 265, 194, 364, 326, -29, 84, 196, 388, 469, 372, 101, 4, 336, 234, 298, 269, 405, 58, 423, 139, 284, -58, 68, 263, -140, 277, 182, 194, 196, 162, 5, 186, 55, 302, 241, -24, -62, 52]
7701E2j3K24j7l93K45M1PJ52l00j07L26j61R4Pl61L25o9k02K50l34J15L16k79
7724h2Q1L35k65j78J65Q8k99J66J38l68M15k70j55L35o9j3k62M8L9M6n9R0K53
7747A79k22q3L50m82N95o22J66j41q4p9L78K51j29j21l42K82J5k44L36k91k9K28
7769h9l54P18n53q5N01m53J34r4J37M8k18N0O7J46J32k63jQ4j80j2J43J35j93
7792b00J70j52M7J52l63K14K9j71J99J6k29j56m9M60j77Ml1L07q8k58L9l10N88
7815D1k65J31l44L17r7J58l02L28j34q0J94j03J0K3j97L26m8j99J67M4N3J96j14
7838A05j59J67k18K77l5j48k58N57k95m4K2J94k76L5j91M31n9N1m0J54k01k78
7860b09J23lq5n0J97J26k80L67m0j88N03m56K49k39k59J81R9Q3m7J56j27rj44
$$ y = [52, 39, 263, 246, -147, 98, 139, 146, 298, -2, -109, 217, 56, 150, 157, -204, 121, 52, -150, 100, -234, -119, 197, -82, -1, 334, 69, -109, 56, 144, -155, 11, 149, -219, 196, -74, -229, 106, 37, 24, -238, -190, -151, -105, -164, -74, 179, -43, -126, 224, -258, 337, -285, -119, -260, -344, -423, -45, 206, 77, -44, -386, -104, -89, -333, 3, -288, -317, -89, -443, 275, -278, -363, 138, -315, -181, -275, -138, -90, -308, -258, -191, -45, 87, -176, -177, -93, -273, -285, -142, -7, -200, -30, -182, -135, 17, -346, -132, -103, -274, -75, -59, -288, -444, -493, -33, -210, -206, -237, 70, -18, -276, -237, -547, 41, -224, -93, -437, -120, -217, -59, -361, -33, -167, -247, -53, -156, -146, -123, -320, 6, -42, -241, -74, -30, 23, 219, 105, -54, 113, -105, 172, 137, -11, -269, 288, -7, -51, -29, 165, -111, -76, -267, 164, 105, 156, 116, 270, 69, -209, -86, -89, -174, -224, -27, 99, -181, 186, 146, -42, 461, 5, 254, 15, -244, -63, 36, 119, 72, 228, 101, 92, -52]
7883e2L4k0m3k7O4K6M3J18M6j31M4J60k33j16J06K63O6n26K78j27p2L16k87K00
7907A30P2j17J23J0o4J88J46l07q1n9J35Q4k24J73N1J98n26L16j54Q0J22k10P0
7930A56p6J23J57j95r5J30J21l28P4J41R9l65K30K4n4l9L14p8j64R2R6j53o6K6
7954A70j7j99L95P0m2k22J25m1j32k58K95Q5k64K76J00l51K18k93J62k42J64J27
7976A26R6j20K71j77j96M0r8L00l09L1m2j68R4J90m6k98J16K8J02j08M8K17k30
7999a33N6l64N31j8K2J10j4k38j18J60N7j58mK6J59j70J92k37Q0K9j07m5J08P7
8023AN2%j85p1J39L1j24k7m2m7J93k86J14M56n60K51k18j09L45m2k87L12q7j1
8047b02J17K33l51P2P6k40K52KR9j71J43k39L42M2N4l95o8K82k32k70J22J76j14
$$ y = [-52, -18, -38, -81, -108, -44, -18, 25, 143, 189, 58, 102, 262, 29, -87, 19, 282, 348, -178, 100, -27, -99, 217, -70, 130, 202, 85, 208, 218, 154, 342, 488, 181, 100, 41, 176, 260, 36, 209, 260, 458, -68, 248, 94, 174, 296, 86, 156, 80, 203, 360, 165, 70, 200, 321, -7, 67, 208, 307, -58, 172, 196, 142, 103, 417, 339, 175, 267, 363, 210, 144, 170, 153, -46, 349, 419, 377, 155, 280, 239, 107, -151, 144, 229, -35, 241, 341, -10, 208, -85, 77, -165, -1, 126, 222, 102, 373, 196, 0, 40, -58, 242, -67, -36, -78, -246, -152, 38, -8, -306, -190, -162, -60, -168, -120, 97, -133, -77, -441, 90, 72, 94, 204, 190, -48, -166, -6, 51, -107, -111, -85, 74, -96, 96, -141, -61, -32, -139, -184, -76, 1, 53, 53, -132, -203, -64, -33, -157, -184, -226, -273, -80, -366, -252, 204, -356, -105, -323, -432, -87, -129, -416, -104, -191, -202, -85, 148, -203, -131, -55, -295, -43, -41, 58, -113, 30, -209, 133, 175, 229, -166, -234, 48, -184, -454, -332, -156, -270]
8070b70r2R8J52L0j53J09M37l61pL8j33L42n06P45k22k50l23R0J62K13j49p6P4
8093e2N3j00k4J87p2J8k73K19J95mj97r1j72J39k19N77j03l00J80J97l87J96j01
8116a34m8L17j43jm85O41m30L86p0K44l08k12K12o6J65j26J06Nj69j92L06mr3
8139i9L47j73K19l16Q7L0j86M09l82M86j69n2J6l70P7L04j56J34j28K40j83J92
8161C27k70k5k6k3p3L71J11m88K06J16J5k66J50k73L01%J33j50m3j5J26l2m4J43
8185B71n0k54K74o7L5k27
$$ y = [-270, -362, -264, -112, -82, -235, -126, 311, -50, -57, -19, -152, 190, -316, 429, 207, -43, -366, -276, -114, 99, -50, -126, -52, 1, -99, -123, 64, -8, 10, -263, -44, 151, 147, -50, -141, -313, -174, -393, 184, 81, -219, -39, 158, -229, -33, -134, -182, 135, -8, -9, -494, 147, -283, 103, 33, 277, -31, -243, -31, -97, 68, -58, 48, 53, -116, -308, -2, -6, -99, 248, 75, 294, -22, 65, 95, -91, 318, -64, 422, 253, 201, 217, -153, -76, 228, 72, 206, 78, 318, 135, 327, 57, 32, 6, -17, -90, 281, 392, -96, 110, 226, 241, -25, 125, -148, 153, 153, 286, 136, 93, 78, 204, 172, 128, 271, 221, -33, 241, 174, 209, -18]
8191a8
$$ Imaginary data points
##PAGE= N=2
##DATA TABLE= (X++(I..I)), XYDATA
0@%%%%%%Qj6J6j6K4l2M0m9N7p2Q8j05J27j51J78k09K41k78L19l65M17m76N41o09
30c22O85p71Q65r69J082j207J347j495J656j837K036k255K498k766L062l394L770
47A985m198M686n248N910o705P670q875J0437j2543J5558k0267K8722m8578J77908
61A46462J30849l26428m4845J66559Q0448j63045o2713J08495R0496o5371m0155
72B0752L9150K2291n1830r979L2240l609m7279J5574O0802J6780m1846j2086J6575
85E7535j2689l6365J4418M7339M30m8311p564M1899R072m8745j9158M5215K8099
98G1175l5971k4860L7012K6888m1591l5023L6891L7450l6630m7622K3350M6208
110E7277j1470l5697N131J7359j6245j1887K7249J2427l5487j7728L9725K4629
$$ y = [0, 0, 0, 0, 0, 0, 0, 8, -8, 8, -8, 16, -16, 24, -25, 32, -40, 48, -57, 70, -81, 97, -112, 129, -149, 170, -195, 222, -254, 287, -322, 363, -408, 457, -512, 570, -637, 710, -785, 871, -966, 1070, -1185, 1313, -1453, 1609, -1785, 1985, -2213, 2473, -2775, 3135, -3570, 4100, -4775, 5662, -6881, 8677, -11590, 17132, -31446, 146462, 277311, -49117, -93962, 72597, 153045, -10000, -72713, 35782, 126278, 60907, 20752, 59902, 82193, 30363, 20384, 52624, 49015, 1736, 17310, 78112, 94892, 53046, 40960, 57535, 44846, 8481, 22899, 70238, 70668, 22357, 14793, 56692, 65764, 17019, -2139, 43076, 71175, 35204, 10344, 47356, 74244, 32653, -2370, 34521, 71971, 35341, -12281, 11069, 57277, 45807, 10110, 15241, 32600, 16355, 4468, 31717, 44144, 8657, -9071, 30654, 55283]
122E5283m2094l6668L4098M5369j6515m1074l030J5852n925n993J4063Pk8464
135a5091n541L9512K3133l3691l4161J8475L0519j2523l0338M996K7762M253j8766
148a461j0831O44j076J289J0304L135j2445q925P416P830o488p515M087M785m326
163a3577j089J0117P940n585j1380o736n517n365L239Q222J728j563P695J0327
177a544p756k1159n281J6285Q805j4744j1710J2307J7584k93r681k413m09p212
191b7221m666K845j215o764M046J6442M916j3439q352Q204N615n631j776M558
205b2438l899q020P976J3683p608j9946J965J7890m27j9905j605K1525R017j4493
219b6285j0532P741M890p381l689Q988O458l561k378L487r67p591j491L371l085
$$ y = [55283, 13189, -23479, 10619, 55988, 39473, -1601, -4631, 11221, 5296, -697, 13366, 13373, -15091, -20632, 18880, 42013, 8322, -25839, -7364, 23155, 10632, -19706, -14710, 13052, 17305, -1461, -12292, -11648, -12724, -11435, -1131, 2004, -10441, -19366, -11950, -4120, -10608, -18123, -14036, -9251, -13577, -14666, -4549, 3391, -2194, -13574, -20310, -25827, -31192, -27953, -19731, -18003, -19566, -11871, -1544, -9300, -30459, -35740, -19455, -10650, -25394, -37104, -24797, -7213, -7506, -17187, -19600, -20009, -27221, -31887, -29042, -30257, -37021, -32975, -16533, -11617, -25056, -33408, -25204, -19589, -25220, -26996, -22438, -26337, -34357, -26381, -12698, -20306, -40252, -38287, -20397, -20824, -40729, -42334, -20809, -11792, -26285, -36817, -29076, -24186, -31567, -35256, -26268, -19810, -23371, -25749, -22262, -23229, -30820, -32311, -28940, -32025]
234c2025p477M666J3924K329j0567j208J3055L583j4696r365J1684J0413p478
247b3162o685R427P843j0368r770Q323R328p802q518R914J1277o259q953N095
261b0310O990m882k751Q883N781o905j264J1374J767j6340r555J2091J0724q321
275a2718p211J2617J4048m912j0648L364P771n004q438N115J0589k6n190L179
289B536P149j778p106R24N548j357n863K520O188r32l108N524R252n05n229K123
305A5886N629l830q497L70O607O9l651M506J0191N55p849l489L152N71m512k01
321A5507O271O059J469N91q2k542m265l16J510l25j362L164O246p08p030k786
337B1401L584J177m167J31Q168M608m531l115M109J195q312o408M619O516j302
$$ y = [-32025, -39502, -34836, -20912, -18583, -29150, -30358, -17303, -13720, -28416, -37781, -26097, -15684, -23162, -29847, -20420, -12577, -22945, -32715, -24392, -15064, -22866, -31384, -21470, -10193, -16452, -25405, -20310, -13320, -18202, -20953, -12070, -6289, -13194, -14458, -3084, -1317, -17657, -27212, -15121, -4397, -12718, -19929, -7312, 6736, 1824, -8824, -5460, 2311, -2693, -11131, -6016, 4573, 4547, -643, 2536, 9685, 7907, 801, 1725, 7273, 5916, 53, 2573, 8761, 7829, 4721, 10245, 19497, 18992, 13763, 15886, 21515, 17685, 9188, 9558, 16165, 16234, 12583, 17089, 27280, 27835, 19986, 16497, 19649, 20220, 15708, 15507, 21778, 27837, 29306, 29897, 29815, 27273, 23008, 22692, 24202, 23877, 22515, 25679, 31925, 31217, 24187, 21401, 24985, 26162, 21995, 22126, 30294, 34902, 30371, 27256, 31365, 32560, 24248, 17840, 22459, 28975, 27673]
352B7673l571L291L742l034o792k267J616P51P19K849J309q03J1M16l575l379
368A8956M21L616k38l608q13K386m9o530n071K303N565J730j758Q09K827P03n005
385A6244o035k141P91J310J319J451O50O78J025k869o931n168J786L054j254j087
401B823N349M853k278n237O65J972l171o335L7L983L82l067q53J676N01j440j564
418a704K30L65l15j481o89j460J004J484R66l83j80J8j7l614l685p42J914j481
436i770l010J799O515J959n455l076J929M82l856j532M204L414j952k178O13j437
452a1351l476k372J694J021j549O53L112O28k183j170o97k618k970K502N390J029
468a2357k552J97J983j562p111m200L417L569j008k073J526M096p36l331p33K067
$$ y = [27673, 24102, 27393, 31135, 28101, 21309, 19042, 20658, 21409, 22128, 24977, 26286, 25483, 25494, 25910, 22335, 18956, 19377, 22993, 22755, 19147, 18334, 20720, 20671, 14141, 9070, 11373, 16938, 18668, 16910, 17719, 20546, 21249, 16244, 10209, 8068, 8859, 10169, 11488, 12939, 13589, 14267, 15292, 12423, 5492, 324, 2110, 5164, 3910, 2823, 8172, 13025, 10747, 5510, 6175, 8147, 4976, -1359, -1322, 2661, 3043, -24, -877, 799, 1300, -140, -1704, -1474, -1109, -1424, -2905, -3594, -5054, -4050, -2566, -1600, -1983, -2163, -2145, -2162, -5776, -9461, -10203, -8289, -9770, -12780, -10981, -4466, -2507, -7962, -11038, -9109, -8627, -12483, -14015, -9811, -6397, -8349, -10527, -9914, -11351, -14827, -17199, -15505, -14484, -16033, -15380, -12268, -11640, -13823, -14993, -15690, -18308, -21278, -18776, -13386, -12357, -14909, -14712, -12729, -14291, -21402, -25602, -22185, -18616, -19624, -21697, -20171, -16075, -16811, -20142, -20875, -18808]
484a8808K4k480q56J731J506L17n44j832j880J471K136j393k709J815L822j780
500a9460o935j217O764L947k261j312L357K225l152l523R26K159j58k657o48J767
516b0178K752J357k31n14j11J364l29k524j94L833M467j047n026j18O179M083
532f237l174m465J144L757j648m095J049O151L040j935p54J843R88n38K41J611
548c022J61r87O96J785J726J141R83j900l091L11M928K265j594r36L346K862l046
565E628m320K651P009K237m541j897M011K237k422k567K159K897k396k228K484
580A0942M894J283j913q78l89o59R27K895J296q23k6Q83j564l068N10M419K374
597B1103r75k237l44o90p22J486J809p64k113J226L531K758k592l085K22J594
$$ y = [-18808, -18784, -21264, -22120, -20389, -18883, -18566, -19110, -20942, -22822, -21351, -19215, -20608, -23317, -21502, -17680, -19460, -26395, -27612, -20848, -16901, -19162, -20474, -17117, -14892, -18044, -21567, -20641, -18482, -18640, -21297, -21945, -20178, -17426, -16069, -16300, -16814, -16925, -15561, -15890, -18414, -18608, -14775, -10308, -11355, -16381, -16499, -10320, -6237, -9411, -13876, -12732, -8975, -10623, -14718, -13669, -7518, -4478, -6413, -7167, -5324, -4336, -4874, -4633, -3022, -2861, -3848, -3152, -1367, 359, 1500, 2483, 583, -2508, -2197, 2731, 4996, 3402, 2466, 5812, 8674, 5628, 1308, 3959, 10968, 13205, 8664, 6767, 10778, 13015, 10593, 8026, 10185, 13082, 10686, 8458, 10942, 15836, 17119, 15206, 14328, 13939, 13280, 14207, 17102, 18398, 17575, 17549, 18432, 16868, 13800, 14310, 18729, 21103, 20128, 17891, 17547, 16857, 16135, 17621, 19430, 18666, 16553, 17779, 21310, 24068, 21476, 18391, 18613, 20207]
613B0207j703m896o71N823N076m90m704j848J21k35j113J604J173Q39Q6j189k709
630A5371j386J681K787q40l683K16L429k64m271j214L061m60m493j934M444N223
646A7667p9k539r83k662l883j053K645K458m79j4J446k87l563j872R02k09j891
663E604L12K443J144k225k57J801j291m835k121L577L996j238l434k09J629m47
679D449k453k528j81J599K837J224j428k419l30L86k563k142Q40M384J453l145
695a7l375L08J792o74k831l96K757R67k727j240J456J229k080k814o22K044J995
712d228L14j581j971o03o5j784j566J692K757l88l045J449K989k138o773j112
728a6053M618K356l362n86L252J290l992l006k2J211N54J329l56l858q51M141
$$ y = [20207, 18504, 13608, 12937, 18760, 23836, 23346, 18642, 16794, 16915, 16680, 15567, 17171, 18344, 19183, 19269, 18080, 15371, 13985, 15666, 18453, 17613, 13930, 14146, 17575, 17311, 13040, 11826, 14887, 14427, 9934, 8000, 12444, 17667, 17588, 15049, 14066, 11404, 7521, 6468, 9113, 11571, 11092, 11078, 12524, 12237, 8674, 6802, 7704, 7495, 5604, 5916, 8359, 9503, 7278, 7021, 8822, 7531, 2696, 575, 4152, 8148, 6910, 3476, 3267, 4896, 4449, 1996, -532, -713, 886, 3723, 4947, 3519, 1100, 770, 1156, -1407, -3549, -2709, 1675, 3128, -17, -3392, -3084, -1292, -1966, -4797, -5193, -2436, -1469, -4196, -5436, -3980, -2751, -4831, -7645, -8267, -6223, -4228, -3914, -5495, -7466, -8069, -8134, -9918, -11484, -9792, -7035, -7423, -10468, -9019, -6030, -8168, -14941, -16053, -11435, -9079, -12441, -13027, -9775, -8485, -12477, -15483, -15505, -14294, -13740, -12411, -12767, -16625, -17476, -13335]
744a3335K271m379m080L068M010l141l971L494N390l107p406k31O041P38m204
759a8842M35N610L65o174k268M488J385m086r82N193K246m560j538L409J446m106
775a7979q90M013J010m017r6N407j23n303J297P767j118r524n65J0407L665q610
791a4659l576Q452M457q093m501Q516O273n754o078M072N284l068k631N721M857
806g28m950n009L118L766k685j653O421M139n656l581N380M729n381n470O066
821a494O761m677n498O286Q920m182r120J997Q212j906p424L119R703O23p527
836C793m42N641p32n525J686O316k26m598L061O018l668p427K018Q625j278p406
852E856J643Q839j14p719q05P696J225p171j627O560K717m889j841M975J766n937
$$ y = [-13335, -11064, -15443, -19523, -16455, -12445, -15586, -19557, -16063, -10673, -13780, -21186, -21417, -15376, -14638, -18842, -18407, -12797, -12432, -18606, -20874, -16386, -15001, -19087, -20069, -14876, -12630, -17190, -18728, -15319, -13873, -17979, -18869, -14856, -13846, -17863, -17959, -12552, -12675, -17978, -16681, -8914, -10032, -19556, -20121, -9714, -6049, -14659, -18235, -9783, -5326, -13419, -17920, -9404, -3131, -8885, -14963, -10891, -5607, -8675, -11306, -5585, -728, -5678, -10687, -7569, -3803, -6488, -8141, -1720, 2419, -3237, -6818, -1438, 3291, -2090, -7560, -1494, 5267, 590, -4908, 1378, 10298, 6116, -3004, -1007, 7205, 5299, -2125, 994, 10697, 11320, 3793, 3351, 8992, 8260, 2735, 4421, 10737, 10511, 5913, 8974, 14992, 11324, 3897, 5915, 14540, 13262, 5856, 7499, 16338, 16224, 8505, 7700, 15396, 16621, 9450, 7823, 14383, 17100, 12211, 10370, 15345, 17111, 11174]
868A1174j493M121J960k562n43L148m46l939l68M212J260l559l29L987J71n198
884A1596j411M243J880l079k779L594L227k985m557R20L313l41k976j17L322J152
900A5002j106j350o95o39n84j46l11R4J111K255K13l031k511k6L86o14M6J693
918I787K386n00j504q72k66n15j315j258K50J645K051j090j646M04M21k500k789
935B689P28L529L12j497J82K039p08m064q81J996O06k217l57K761Q66k989j651
952A344L32R5j948K75K423J27j579L5J991r74m287n26L563R08m347j795M614K130
970B381n009l596L516K310l920l457L999L945l488m606K390L376k324l884K223
985f144K776k430l223J915J379l967k596L912K960l665l809M535M050m882n185
$$ y = [11174, 9681, 13802, 15762, 13200, 12657, 15805, 15359, 11420, 11052, 15264, 16524, 12965, 12636, 16623, 16794, 11596, 10185, 14428, 16308, 13229, 10450, 14044, 17271, 14286, 9729, 10649, 13962, 13621, 10645, 10528, 13850, 15002, 13896, 12546, 11851, 11212, 10628, 10482, 10171, 10265, 11376, 13631, 13844, 10813, 8302, 8276, 8662, 8048, 8094, 9787, 12173, 11673, 10169, 9297, 9031, 8516, 7201, 5943, 6193, 7838, 9889, 8799, 7153, 7557, 7978, 5478, 2689, 3417, 6946, 7258, 5761, 5943, 7982, 7274, 3210, 2329, 4325, 4931, 2714, 2357, 5118, 5984, 2995, 1344, 1676, 1771, -177, 98, 2521, 2648, 1069, 1104, 3095, 2121, -2166, -2692, 871, 1779, -2568, -4363, 251, 2381, -2628, -6224, -2708, -398, -4318, -7775, -3776, 169, -3319, -7925, -5535, -2159, -4483, -8367, -6144, -3368, -5798, -9021, -7106, -5727, -9694, -12290, -8378, -5418, -9083, -12892, -8357, -4307, -9189, -14374]
1000a4374K537M436k646m941L509N487k345o443N73M312j243n109K48M798K42
1015a0959l631n80L522j13l089j10K279m79k657J395M155r25m620n37L534q66
1031a3681l735Q18M721Q46n069r97M784J490m284k187M314L321l188k746L420
1046a2173L430k048l471J301J476j529j622L018K653k387j604K695J752j221j132
1061a0862K283K032j594j599K123J672j617j247K480K180k387k454K396L656n84
1076c522k908L34L429L06j662J79L023J916j384j460N61J013J04n71O94P29P1
1093H52k82J1K50O98K263R84j245j532O63K897J397j833j187J527J634j316j573
1110D208J488K528pk038j226P78O03L00R28Q02Q52j005K56J519P84k43n67n54
$$ y = [-14374, -11837, -7401, -10047, -14988, -11479, -5992, -8337, -14780, -14207, -9895, -11138, -16247, -15999, -11201, -10959, -14590, -15170, -11648, -11761, -14850, -14960, -12681, -13160, -15817, -14422, -10267, -11192, -15812, -16349, -12815, -13681, -17416, -16598, -11877, -11031, -16100, -17097, -12313, -10823, -15107, -17294, -12980, -9659, -12847, -15593, -12173, -8743, -10791, -14262, -12961, -11485, -13014, -14636, -11618, -8965, -11352, -12956, -10261, -8509, -9730, -10862, -8579, -6547, -8141, -9740, -7617, -5945, -7562, -8809, -6329, -4149, -6536, -8990, -6594, -2938, -3522, -6430, -6096, -2667, -2361, -4023, -3844, -821, 1095, -289, -1749, -1188, -175, -71, -642, 52, 781, 852, 570, 581, 831, 1529, 3792, 4776, 3531, 1999, 2662, 5559, 6956, 5123, 3936, 5463, 7097, 5781, 4208, 5696, 8224, 8217, 6179, 4953, 5731, 6334, 6634, 7562, 8364, 9216, 8211, 8467, 9986, 10770, 10527, 9960, 9406]
1128I406j111l58N37J243J1J66N52K54j063j197O89J863L7j457o76J960Q73k11
1146A1518o82J072L23j227k472M64J332R40j087j088P1Q41M81j164L28J388J169
1163A2207n50j321q05O89R3K7q98n75j68K83J291k09o88p7q56o45n97N01J855
1182I557J12k86O96O96j688j784k31K096l6k396j191J237J152r34j472R99J141
1199G668l82j558m86J845R65o38j549q65k69N84O53o81l03M89N36j444l327r51
1217B87K728J992k224k203J952L001l86l563q21K611O6k802j992J475K273j475
1233I19j941k54Q2m10n66O75K48l4k98j35j277j011O39J098r93j389J132J799
1251a716j336l626l44K262q12l902r09L861K457k365j937J670K039k427k746K13
$$ y = [9406, 8295, 7937, 8474, 9717, 9728, 9894, 10446, 10700, 9637, 8440, 9129, 10992, 11029, 9572, 8896, 10856, 11729, 11518, 10836, 11908, 12231, 11004, 8532, 8996, 10328, 11268, 10181, 9093, 9164, 10005, 10486, 9322, 9650, 11038, 12207, 11657, 10336, 9531, 10220, 10313, 10340, 9442, 8867, 8699, 8982, 10273, 10064, 9376, 9299, 8443, 7798, 7201, 7702, 9557, 9669, 9383, 10079, 10775, 9087, 7303, 7072, 9168, 9132, 6736, 5545, 6782, 7934, 7000, 5528, 6527, 7668, 7286, 5728, 5242, 7087, 8052, 7414, 5865, 5000, 4731, 5315, 5968, 5287, 4984, 5473, 6009, 4565, 1238, 287, 3015, 5007, 2783, 580, 2532, 5533, 5147, 1584, 763, 3374, 3440, 638, -1354, 121, 2394, 919, -1022, -1276, -1194, -1604, -2170, -1495, -1247, -1281, -1579, -1714, -2991, -4002, -3363, -2265, -3258, -4647, -3515, -1716, -3052, -6678, -7022, -4760, -5572, -9474, -10383, -6522, -4065, -6430, -8367, -6697, -4658, -7085, -9831, -9618]
1267i618K025J98j152n46J00l15j175K77r29r91J042J699q45k238R4K741l28k817
1285a2778l98L461J440k353j761J874J226l341k870J304K532n01j267J126K072
1300a0234n63j767N39J411n67j144O84O87K13L0J340Q1k236p02K011J030k069
1317a1256p39L249J151l094k212L391L276p19j581K004J578j112k030N98J150
1332f346q97j089J568J175l24l2J740P39j494q70J486J362j118L3K223K010j474
1349a308j894J672K105j423k009J659J940j139j911J121J606k10o62K083K305
1364C935j016j401J549J168j172j445J567J251j795r71K357K100j596j863J601
1379D269J980k353k212K269L578r33j905R51K357q30j717J439J727r05k118q4
$$ y = [-9618, -7593, -7395, -8547, -9093, -8993, -9308, -10483, -10206, -11135, -12126, -11084, -9385, -10230, -12468, -12374, -9633, -9961, -12778, -13176, -9715, -8275, -10628, -12389, -10515, -9289, -12630, -15500, -14196, -11664, -12165, -13432, -12306, -10234, -10797, -12564, -12025, -10614, -11181, -12325, -11641, -10954, -10741, -10711, -9371, -9290, -11526, -12228, -10217, -9187, -11256, -11995, -8746, -7595, -10689, -12901, -9510, -6234, -6953, -8534, -6530, -4952, -6064, -8094, -7496, -6346, -7243, -8332, -6764, -5589, -5913, -5945, -4205, -3466, -4960, -5830, -4344, -2982, -4100, -4067, -1844, 166, -1308, -3202, -1530, 575, -848, -2857, -1198, 742, -397, -2308, -1187, 419, 209, -453, 1630, 3935, 2919, 1518, 3067, 4235, 3063, 1618, 3185, 4436, 2641, 1670, 4027, 6127, 4531, 2668, 4269, 6249, 3896, 1684, 3953, 7531, 6598, 4693, 5644, 8001, 7171, 5454, 6893, 8620, 7715, 5597, 5513]
1395E513J293j239n92J771J357j165j159K377J239j574j549K223J820k258k401
1410E656J781L102j241k739J450K259j351k717m61K456K07j760M80J734j66o53
1426H037M80J505m18p32O37p0k215k088J864K533j367k039J508K364k132j964
1442E903J794K781j062l657K22L159L64k385J9K808k14k782j107J759N21j831
1458F292m70Q09j021p91J588J803j175j272J784J679j828k978P68K305j540l391
1474B562Q26L670Q9l459q08K035K24k242m24J545J24j157k83R36J16n1K81L40
1492D324j791k431O55J429j013k030k06J265o41j343Q34K886j99k224j119R90
1508f14m37j889n90K034N69j984j294Q19M99l75j430j57K36r14r85N89K61L37
$$ y = [5513, 6806, 5567, 4975, 6746, 8103, 6938, 5779, 8156, 9395, 7821, 6272, 8495, 10315, 8057, 5656, 7437, 10539, 9298, 6559, 8009, 10268, 8917, 6200, 5739, 8195, 8402, 6642, 7122, 8856, 8690, 8037, 8517, 10022, 9604, 8872, 9509, 9439, 7224, 5136, 7000, 9533, 8166, 6127, 7635, 9999, 7867, 5903, 7697, 10478, 9416, 5759, 5981, 9140, 9504, 7119, 7138, 9946, 9732, 6950, 5843, 7602, 8123, 6292, 5822, 6631, 5610, 4819, 6407, 8210, 7035, 5763, 7547, 9226, 7398, 4420, 5188, 7493, 5953, 2562, 3388, 7058, 7147, 3688, 2880, 4915, 5139, 2897, 2473, 4018, 4142, 2985, 2702, 3638, 3754, 3703, 3984, 4324, 2533, 102, 757, 2186, 1173, -857, -1063, 202, -439, -1782, -948, 1938, 1739, -485, -1604, -614, -1051, -2940, -3530, -1496, -927, -2911, -4205, -3386, -2887, -3262, -4692, -4849, -4613, -5527, -6512, -5923, -5662, -5325]
1526e325L14N73j82j700j27P70m25j131p00R70q95k303l33K033J430n98j304M17
1544h516O88r88j069M07O72O79r94q31K05R23R81o21j239q51j63p1o27J41J587
1563i687J132j045q88Q24J592N41j039m80M9N27j138p10L93J013Q00k58r78j49
1581i501J540R91j013j637P54K230J66j499O01K651R41j919j426R95J485r69j514
1598g124M23J081K60k97J86J070M77M88J220o20r66O20J642J76k078o86K146J502
1616d80j725q58K472J782j925k338R83K255l87j656J458K229l69r49P52K356l42
1633C258j849m71Q76q55q89J063J940l45q29M82J143m89q02J482J854j247k739
1650A583J061K915m51k026K80K850M84k988j648K697J611j821k053K055J236j088
$$ y = [-5325, -5011, -4438, -4620, -6320, -6447, -5677, -6102, -7233, -7933, -6963, -7858, -10161, -10494, -8461, -7031, -7629, -8933, -8516, -7828, -8816, -9885, -9478, -8806, -8127, -9121, -9952, -9747, -8824, -7843, -8464, -9703, -10554, -10717, -10788, -11415, -11274, -9687, -8555, -9600, -10488, -9664, -8072, -7531, -8570, -9050, -9001, -8474, -9612, -10322, -9929, -8916, -8116, -8374, -9352, -9501, -7961, -6970, -7983, -9620, -8866, -6636, -6470, -7969, -7368, -4717, -3776, -5695, -7121, -6126, -4641, -5610, -7124, -6701, -5620, -5360, -5657, -5471, -4401, -3924, -3436, -2216, -2836, -3802, -3182, -1540, -1364, -3442, -4128, -1982, -480, -2205, -3063, -591, 1191, -734, -3072, -2089, 166, -221, -1877, -419, 1810, 1441, 492, 1244, 3600, 3258, 1409, 938, 1814, 959, 70, 1133, 3073, 2728, 1899, 2381, 3524, 3035, 2233, 3715, 5569, 4322, 1583, 2644, 5559, 5108, 3082, 3362, 6212, 6696, 3708, 2060, 4757, 6368, 4547, 2494, 4549, 5785, 4697]
1666D697o10K153J717p67j555N24R75j459j045J374J049j624j045J590J020j059
1682E935m08J661J032j934k181J499K401o42j424J241J793r05k270N85K155l85
1698H153k501q87J706P32j505L5J604J208q38j091P11L38l50J40L29k80j640R4
1716E958J612M85k180m89J812O17j919p35J146J314j330j570J100J176l60j260
1732E377J262J478j101k171Q1Q53p02j629M68N68lo62M53R00k24q38j65L88q29
1751C504j469N74J270q3j166j04Q75l22j914l46R36J72k541p01J387J485j087
1768D70j341J296J291r91k167m6P31k41j113j86L53j021j45L17J31m59o13pM62
1787c279n61j014O60P19o28j019K8J203q06j027RJ467r19k350m83J642N76j499
$$ y = [4697, 4087, 6240, 7957, 7190, 5635, 6159, 7134, 5675, 4630, 6004, 7053, 5429, 4384, 5974, 6994, 5935, 5527, 7188, 8220, 6286, 4105, 5604, 8005, 7363, 5939, 7180, 8973, 8068, 5798, 6383, 8538, 8153, 5652, 4765, 6471, 7203, 5698, 5733, 7337, 8545, 7707, 6616, 7327, 7665, 7315, 7455, 7784, 7504, 5864, 5958, 7570, 8055, 5875, 5386, 7198, 7815, 5896, 5161, 6307, 7621, 6291, 4721, 5821, 6997, 6637, 5377, 6639, 8117, 7016, 4845, 4926, 5779, 5077, 3448, 3916, 4484, 4481, 3819, 4272, 5172, 4948, 4110, 3945, 4333, 3504, 2035, 2609, 3879, 3796, 2630, 2526, 3401, 3079, 1165, 819, 1755, 1927, -614, -1315, 72, 1557, 470, -871, 425, 1716, 725, -1442, -1488, -757, -998, -2111, -2297, -1944, -2965, -3110, -2793, -2662, -3121, -3734, -3741, -3279, -3840, -4854, -4194, -3475, -4103, -5122, -5094, -3891, -4697, -5724, -5715, -4248, -5167, -7517, -8000, -6358, -5782, -7281]
1805g281r40J223J036m85p29N21P01l81j285k83K68j43p53K41R32j83l89M57l61
1824g834m55n75Q38O86j201p23J220K405r48j670O27J773k75k190n87J297O11
1841g001q74o05J590L93p62k44J207R07q20q42J042N87o25k46J201K30q06j1J180
1860d499J87q85k89J059M45j350m56J628J436p58j097J125J953o44j061N74J263
1877a369o04j809L81J299J44o8n8J037N94r44K55N77m34l93N11M33L04n04R39
1896B91J593o34q86k60Q57p7j333K66J101Q77o26o05J419J044r85o13O75N97K1
1915B722j145N67Q63k1l31n49Q35K67k85J17j16M89J26o4J73l93r5J032P9P7l18
1936D030P89M78l63q67P1J020j24j370k95J316R55k24p38L66J562k07j621n78
$$ y = [-7281, -8221, -6998, -5962, -6447, -7176, -6655, -5954, -6335, -7620, -7903, -7635, -7778, -8531, -8290, -7358, -7541, -7930, -7473, -7834, -8289, -8864, -8026, -7340, -8541, -9264, -8044, -5639, -6587, -8257, -7630, -5857, -6132, -8322, -8909, -7612, -7001, -7875, -8480, -6890, -6497, -7259, -7503, -6296, -5389, -6209, -7051, -6009, -5422, -6047, -6293, -5092, -4862, -5668, -5679, -4499, -4312, -5197, -5486, -4427, -3982, -5332, -5788, -4160, -2724, -3482, -4579, -3454, -1501, -2145, -3206, -2632, -1369, -1973, -3782, -3401, -2102, -1958, -2026, -2084, -1047, -453, -1397, -1142, -565, -999, -1392, -881, -448, -144, -648, 291, 1884, 1250, 364, 104, 961, 884, -449, -183, 918, 1795, 1169, 564, 1983, 3027, 2042, 1429, 2104, 2701, 2722, 1577, 2144, 3007, 2986, 2655, 2106, 2941, 3208, 2923, 3040, 2924, 3413, 3539, 3475, 3648, 3255, 3160, 4192, 4271, 4348, 4030, 4819, 5297, 4934, 4067, 4138, 5158, 5034, 3664, 3369, 4685, 5640, 5416, 4678, 5044, 6606, 6399, 4778, 4200]
1954D200J542K16q29m51J339N74m18n38K38Q53p34q21rM88J92k57O28Q38m51k00
1974F400N47J08j511m8J290K39j522n56J577P75j638j200J607J527j486j406Q48
1991E551J491p29j700J57J097N04j152o6O01J45q69m67M62m84r64J79J011j31
2009D636p22N55J038q86j931Q97J098n48k664K86J835n41j761k49K464N3k217
$$ y = [4200, 5742, 5958, 5129, 4678, 6017, 6591, 6173, 5635, 5873, 6726, 5992, 5171, 5162, 5650, 5842, 5585, 6213, 7051, 6600, 6400, 6947, 7055, 5544, 5496, 6786, 7025, 5503, 4947, 6524, 7299, 5661, 4461, 6068, 7595, 6109, 4703, 5551, 7042, 6313, 4613, 4770, 5867, 6371, 5219, 5153, 5754, 5899, 5030, 4563, 5025, 4541, 3577, 3756, 4767, 4636, 3914, 4469, 5507, 4621, 2690, 3587, 4685, 4137, 1473, 1759, 3594, 3053, 1292, 1043, 3507, 3560, 1343]
$$ [...]
8191c1
##END NTUPLES=NMR FID
##END=
