##TITLE=1H_Costus-F-ACN-2
 CDcl3, 8 sc, 
 30.5.2019
##JCAMPDX= 6.0         $$ Bruker NMR JCAMP-DX V2.0
##DATA TYPE= NMR FID
##DATA CLASS= NTUPLES
##ORIGIN= UXNMR, Bruker Analytische Messtechnik GmbH
##OWNER= root
$$ XWIN-NMR		Version 3.5
$$ Thu May 30 13:19:13 2019 Russian Standard Time (UT+4h)  she@DPX200
##.OBSERVE FREQUENCY= 200.13155
##.OBSERVE NUCLEUS= ^1H
##.DELAY= (6, 6)
##.ACQUISITION MODE= SIMULTANEOUS
##.ACQUISITION SCHEME= undefined
##.AVERAGES= 8
##.DIGITISER RES= 18
##SPECTROMETER/DATA SYSTEM= spect
##.PULSE SEQUENCE= zg30
##.SOLVENT NAME= CDCl3
##.SHIFT REFERENCE= (INTERNAL, CDCl3, 0, 15.7039)
##AUDIT TRAIL= $$ (NUMBER, WHEN, WHO, WHERE, WHAT)
$$ ##TITLE= Audit trail, XWIN-NMR		Version 3.5
$$ ##JCAMPDX= 5.01
$$ ##ORIGIN= Bruker BioSpin GmbH
$$ ##OWNER= she
$$ F:/spectra/data/she/nmr/H-F/1/audita.txt
$$ ##AUDIT TRAIL=  $$ (NUMBER, WHEN, WHO, WHERE, WHAT)
(   1,<2019-05-30 13:18:06.28 +0400>,<she>,<DPX200>,
      <created by zg, POWCHK disabled, PULCHK disabled
       configuration hash MD5:
       00 E9 B6 7A A2 85 ED C7 34 08 36 98 17 FE 4E 26
       data hash MD5: 16K
       53 01 23 5F 69 80 55 51 A2 EF 04 D7 F2 98 B0 FB>)
$$ ##END=
$$ 
$$ hash MD5
$$ 0B FC 61 07 29 13 FC C3 4B 1B 0B 93 01 BB BF 25
##$RELAX= 
##$RELAX= 
##$RELAX= 
##$RELAX= 
##$RELAX= 
##$RELAX= 
$$ Bruker specific parameters
$$ --------------------------
##$DU= <F:/spectra>
##$EXPNO= 1
##$NAME= <H-F>
##$PROCNO= 1
##$TYPE= <nmr>
##$USER= <she>
##$AMP= (0..31)
100 100 100 100 100 100 100 100 100 100 100 100 100 100 100 100 100 100 
100 100 100 100 100 100 100 100 100 100 100 100 100 100 
##$AQSEQ= 0
##$AQ_mod= 1
##$AUNM= <au_zg>
##$AUTOPOS= <>
##$BF1= 200.13
##$BF2= 200.13
##$BF3= 200.13
##$BF4= 200.13
##$BF5= 200.13
##$BF6= 200.13
##$BF7= 200.13
##$BF8= 200.13
##$BYTORDA= 1
##$CFDGTYP= 0
##$CFRGTYP= 5
##$CHEMSTR= <none>
##$CNST= (0..31)
1 1 145 1 1 1 1 1 1 1 1 1 1 1 1 1 1 1 1 1 1 1 1 1 1 1 1 1 1 1 1 1 
##$CPDPRG= <>
##$CPDPRG1= <>
##$CPDPRG2= <>
##$CPDPRG3= <>
##$CPDPRG4= <mlev>
##$CPDPRG5= <mlev>
##$CPDPRG6= <mlev>
##$CPDPRG7= <mlev>
##$CPDPRG8= <mlev>
##$CPDPRGB= <>
##$CPDPRGT= <>
##$D= (0..31)
0 1.2 0 0 0 0 0 0 0 0 0 0.03 0 0 0 0 0 0 0 0 0 0 0 0 0 0 0 0 0 0 0 0 
##$DATE= 1559207885
##$DBL= (0..7)
120 120 120 120 120 120 120 120 
##$DBP= (0..7)
150 150 150 150 150 150 150 150 
##$DBP07= 0
##$DBPNAM0= <>
##$DBPNAM1= <>
##$DBPNAM2= <>
##$DBPNAM3= <>
##$DBPNAM4= <>
##$DBPNAM5= <>
##$DBPNAM6= <>
##$DBPNAM7= <>
##$DBPOAL= (0..7)
0.5 0.5 0.5 0.5 0.5 0.5 0.5 0.5 
##$DBPOFFS= (0..7)
0 0 0 0 0 0 0 0 
##$DE= 6
##$DECBNUC= <off>
##$DECIM= 24
##$DECNUC= <off>
##$DECSTAT= 4
##$DIGMOD= 1
##$DIGTYP= 9
##$DL= (0..7)
0 120 120 120 120 120 120 120 
##$DP= (0..7)
150 150 150 150 150 150 150 150 
##$DP07= 0
##$DPNAME0= <>
##$DPNAME1= <>
##$DPNAME2= <>
##$DPNAME3= <>
##$DPNAME4= <>
##$DPNAME5= <>
##$DPNAME6= <>
##$DPNAME7= <>
##$DPOAL= (0..7)
0.5 0.5 0.5 0.5 0.5 0.5 0.5 0.5 
##$DPOFFS= (0..7)
0 0 0 0 0 0 0 0 
##$DQDMODE= 0
##$DR= 18
##$DS= 0
##$DSLIST= <SSSSSSSSSSSSSSS>
$$ [...]
##$SUBNAM2= <"">
##$SUBNAM3= <"">
##$SUBNAM4= <"">
##$SUBNAM5= <"">
##$SUBNAM6= <"">
##$SUBNAM7= <"">
##$SUBNAM8= <"">
##$SUBNAM9= <"">
##$SW= 24.9336996594482
##$SWIBOX= (0..15)
0 0 2 0 0 0 0 0 0 0 0 0 0 0 0 0 
##$SW_h= 4990.01996007984
##$TD= 16384
##$TD0= 1
##$TE= 0
##$TE2= 300
##$TE3= 300
##$TEG= 300
##$TL= (0..7)
0 120 120 120 120 120 120 120 
##$TP= (0..7)
150 150 150 150 150 150 150 150 
##$TP07= 0
##$TPNAME0= <>
##$TPNAME1= <>
##$TPNAME2= <>
##$TPNAME3= <>
##$TPNAME4= <>
##$TPNAME5= <>
##$TPNAME6= <>
##$TPNAME7= <>
##$TPOAL= (0..7)
0.5 0.5 0.5 0.5 0.5 0.5 0.5 0.5 
##$TPOFFS= (0..7)
0 0 0 0 0 0 0 0 
##$TUNHIN= 0
##$TUNHOUT= 0
##$TUNXOUT= 0
##$USERA1= <user>
##$USERA2= <user>
##$USERA3= <user>
##$USERA4= <user>
##$USERA5= <user>
##$V9= 5
##$VALIST= <valist>
##$VCLIST= <CCCCCCCCCCCCCCC>
##$VD= 0
##$VDLIST= <DDDDDDDDDDDDDDD>
##$VPLIST= <PPPPPPPPPPPPPPP>
##$VTLIST= <TTTTTTTTTTTTTTT>
##$WBST= 1024
##$WBSW= 4
##$XGAIN= (0..3)
0 0 0 0 
##$XL= 0
##$YL= 0
##$YMAX_a= 289385
##$YMIN_a= -565876
##$ZGOPTNS= <>
##$ZL1= 120
##$ZL2= 120
##$ZL3= 120
##$ZL4= 120
##$ABSF1= 10
##$ABSF2= 0
##$ABSG= 5
##$ABSL= 3
##$ALPHA= 0
##$AQORDER= 0
##$ASSFAC= 0
##$ASSFACI= 0
##$ASSFACX= 0
##$ASSWID= 0
##$AUNMP= <proc_1d>
##$AZFE= 0.1
##$AZFW= 0.1
##$BCFW= 1
##$BC_mod= 2
##$BYTORDP= 1
##$COROFFS= 0
##$CY= 11.3945322036743
##$DATMOD= 1
##$DC= 2
##$DFILT= <>
##$DTYPP= 0
##$F1P= 18.9103706918063
##$F2P= -1.10871071338519
##$FCOR= 0.5
##$FTSIZE= 0
##$FT_mod= 4
##$GAMMA= 1
##$GB= 0.15
##$INTBC= 1
##$INTSCL= 1
##$ISEN= 128
##$LB= 0.24
##$LEV0= 0
##$LPBIN= 0
##$MAXI= 10000
##$MC2= 0
##$MEAN= 0
##$ME_mod= 0
##$MI= 1.114404
##$NCOEF= 0
##$NC_proc= 0
##$NLEV= 6
##$NOISF1= 3.799351
##$NOISF2= 2.8
##$NSP= 1
##$NTH_PI= 0
##$NZP= 0
##$OFFSET= 15.70392
##$PC= 1
##$PHC0= -8494.744
##$PHC1= 9.80023
##$PH_mod= 1
##$PKNL= yes
##$PPARMOD= 0
##$PSCAL= 0
##$PSIGN= 0
##$REVERSE= no
##$SF= 200.130013532006
##$SI= 16384
##$SIGF1= 3
##$SIGF2= 2
##$SINO= 400
##$SIOLD= 16384
##$SREGLST= <1H.CDCl3>
##$SSB= 0
##$STSI= 0
##$STSR= 0
##$SW_p= 3612.71676300578
##$SYMM= 0
##$S_DEV= 0
##$TDeff= 0
##$TDoff= 0
##$TI= <>
##$TILT= no
##$TM1= 0
##$TM2= 0
##$TOPLEV= 0
##$USERP1= <user>
##$USERP2= <user>
##$USERP3= <user>
##$USERP4= <user>
##$USERP5= <user>
##$WDW= 1
##$XDIM= 8192
##$YMAX_p= 0
##$YMIN_p= 0
$$ End of Bruker specific parameters
$$ ---------------------------------
##NTUPLES= NMR FID
##VAR_NAME=  TIME,          FID/REAL,        FID/IMAG
##SYMBOL=    X,             R,               I
##VAR_TYPE=  INDEPENDENT,   DEPENDENT,       DEPENDENT
##VAR_FORM=  AFFN,          ASDF,            ASDF
##VAR_DIM=   8192,          8192,            8192
##UNITS=     SECONDS,       ARBITRARY UNITS, ARBITRARY UNITS
##FACTOR=    0.0002004,     1,               1
##FIRST=     0,             0,               0
##LAST=      1.6414764,     0,               0
##MIN=       0,             -565876,         0
##MAX=       1.6414764,     289385,          0
$$ Real data points
##PAGE= N=1
##DATA TABLE= (X++(R..R)), XYDATA
0 0 0 0 0 0 8 -8 8 -9 16 -24 24 -32 40 -49 64 -73 89 -105 128 -150 176 -207 239 -272 314 -361 409 -467
28 -467 530 -601 675 -759 850 -953 1065 -1185 1318 -1466 1627 -1801 1997 -2209 2447 -2709
44 -2709 3002 -3330 3697 -4116 4597 -5156 5812 -6596 7557 -8764 10329 -12453 15519 -20354
58 -20354 29141 -50226 204682 14889 -463756 -53716 208307 -30749 -268353 7651 200478
69 200478 55929 -84350 34852 55556 -58142 -73408 33182 4233 -51947 35709 141429
80 141429 38288 -101909 -78402 11492 -12510 -44165 18065 59027 -25306 -78830 4955 83735
92 83735 19820 -45899 17230 79955 1236 -79892 -27119 27876 -34600 -63559 34802 76387
104 76387 -25149 -57838 57682 89247 -40626 -93673 11959 68082 11250 -808 33774
115 33774 -10218 -63792 -1949 53665 -22567 -73373 24023 88721 -8796 -83205 1195 85031
127 85031 41156 -22855 -23948 -17977 -17496 17512 29171 -36721 -73907 4421 78102 23668 -58297
140 -58297 -32155 41561 32009 -34643 -41844 19441 53646 17606 -32375 -38004 -12162 3770 4811
153 4811 8823 9290 -6651 -19265 -10083 5030 6226 6495 16285 20863 14484 10490 7777 -8848 -32963
168 -32963 -38756 -17433 12292 27377 22395 16655 20533 8638 -30470 -44894 3930 49693 21170
181 21170 -25884 -5244 39695 20572 -32435 -40689 -19948 -15318 -6881 18771 20293 -1181 8469
194 8469 36131 13913 -34388 -31800 6794 10811 -10792 -9793 -3286 -13039 -10474 8257 -1058 -23120
208 -23120 -604 40760 27285 -15179 -7126 26693 8826 -37173 -34221 6139 17985 3575
220 3575 3258 10840 -1759 -17429 -8682 9661 10775 6772 16635 25712 15634 10 -5626 -15250
234 -15250 -34045 -31138 2435 21600 3598 -4531 21331 31633 -853 -22512 -4522 9687
246 9687 -3010 -6044 6391 -3466 -24167 -13390 7710 -2317 -13032 8717 22174 -5596 -22732
259 -22732 760 11972 -9121 -7706 22291 21556 -8792 -9018 7594 -16921 -52828 -29038 27968
272 27968 38941 11243 8611 25265 13354 -16402 -21514 -8154 -6395 -7599 8918 24250 14231
285 14231 -3133 -4974 -2937 -11219 -12728 3941 16757 7814 -1733 7687 14193 2020 -8340 -2047
299 -2047 828 -11487 -17232 -6989 -904 -3603 1844 13338 13648 5101 -830 -8559 -19875 -15758
313 -15758 4507 13221 2981 -2702 5665 4457 -11429 -21128 -14305 -3171 6833 15831 18958 9474
327 9474 -3960 -10273 -7764 -2409 2957 8058 10867 7812 -1484 -9908 -13173 -11681 -6412 5364 19226
342 19226 23214 16005 9487 1227 -15378 -25589 -12048 9847 10915 1317 4462 11861 1351 -16763
356 -16763 -18999 -8913 448 9185 16865 14364 2710 -4383 -6029 -9182 -9432 -4147 -2557 -7783 -7494
371 -7494 -1111 384 -3442 -1475 6724 14169 16355 10678 -3780 -16132 -15380 -9503 -8797 -3662 13425
386 13425 22449 8533 -9367 -8826 937 -440 -7725 -2743 15028 26410 17832 -700 -9963 -8195
400 -8195 -9491 -15021 -11171 2572 10231 7856 7141 10610 7105 -1851 -4811 -932 322 -1004 -2188
415 -2188 -6384 -10029 -3816 4456 1496 -6354 -4080 1519 -1953 -4468 3226 9096 3800 -1688 497
430 497 63 -5208 -6683 -6519 -11267 -9780 4755 14693 6958 -2340 631 2407 -3550 -2639 8690 11631
446 11631 3494 -307 1821 -2016 -11657 -13080 -3769 7049 12674 11150 5809 3745 4457 -959 -10825
461 -10825 -10492 708 8875 7188 5432 5899 -99 -11487 -17705 -13562 -2174 9594 11390 4490
475 4490 822 2911 669 -4480 -4274 -2416 -7139 -10084 -1353 5724 -9 -4848 -1155 -445 -4512 1428
491 1428 9989 1813 -9470 -1217 10511 1270 -8846 3691 16117 2298 -13995 -7921 1741
504 1741 -2869 -5219 5207 12007 6273 2738 5728 6392 3848 475 -4971 -10917 -8092 1186 6101
519 6101 4371 3525 3258 -2326 -7939 -5235 4162 9162 911 -9333 -4709 10755 12958 -3358 -15170
534 -15170 -10324 -4609 -7105 -5099 4322 7147 2168 1065 587 -3520 -2044 6102 5112 -4910 -6112
549 -6112 1077 15 -6804 -3890 1892 -1904 -3321 7710 14210 5042 -1556 2718 560 -9936 -7745
564 -7745 8087 14760 6726 -813 -4065 -7604 -8932 -1581 6295 6387 2595 1082 2670 5880 7342
579 7342 1140 -8250 -10107 -3682 463 -221 -1699 -2173 -3990 -4063 1611 7542 6432 90 -4573 -6005
595 -6005 -8139 -9208 -1712 12780 15238 -2155 -15474 -6544 3878 -5174 -15483 -1533 18181
608 18181 15174 -51 -1801 3597 916 -4470 -5872 -6731 -3930 9330 17995 4784 -11742 -7662
622 -7662 2894 905 -1111 11163 16337 655 -13804 -7463 3593 3091 757 2786 2688 -222 -1040
637 -1040 -1537 -5484 -6478 -3679 -1427 2663 10732 13135 2291 -10945 -14227 -9930 -5805 1633 8657
652 8657 6955 -1074 -3657 -1764 -4489 -8784 -5648 3655 10259 9254 1914 -4978 -5696 -2754 -2865 -4215
668 -4215 373 8535 10700 3995 -2614 -7156 -7131 -1434 5143 5922 6584 10848 10275 -2105 -13083 -10334
684 -10334 -1877 3281 6595 6691 1318 -785 2694 -354 -9437 -5286 10032 8360 -9433 -8785 8797
699 8797 7694 -11679 -12484 4894 6759 -6227 -4160 7553 2668 -12855 -12188 1838 8608 7207
713 7207 5982 1252 -9787 -13542 -3740 5987 3769 -1763 179 4869 3879 939 1261 -159 -6353
728 -6353 -7117 3745 13130 7755 -120 -86 -3154 -11131 -5363 13788 16199 -3605 -11588 2576 8399
743 8399 -3297 -6638 4036 4260 -4718 -627 9724 3813 -10372 -8836 -431 -1142 -93 7283 7549
758 7549 -4332 -8904 -851 1789 -5193 -6215 1329 4592 557 -744 586 -2479 -6492 -3364 3639
773 3639 3957 -1781 -1653 4230 2152 -6724 -4282 8646 7651 -7988 -8793 9783 13606 -5459 -11378
788 -11378 4790 9362 -3413 -4863 8260 7964 -5129 -5680 4678 4042 -4032 -2047 3501 829
802 829 -1757 2489 4090 -233 -1127 247 -4964 -8847 -1975 6270 4196 -654 72 533 -3702 -6432
818 -6432 -3904 368 747 -1062 -954 3654 6449 -119 -10216 -8818 -763 1409 135 5460 8980
833 8980 -99 -8487 -2845 3077 -205 -1034 5131 3345 -3540 660 9611 1073 -12856 -6030 9582
848 9582 9362 -62 1298 4790 -2209 -6881 148 5477 2205 -731 1135 -35 -2812 -1380 379
863 379 -2057 -3098 427 4303 3374 -562 -4619 -5263 -1557 1093 -676 -65 2832 -942 -8341 -5675
879 -5675 3596 2204 -5308 -1547 7126 3382 -4600 -1932 2120 -3258 -4853 4432 8575 -232 -5251
894 -5251 -687 357 -3419 -727 5600 5592 2772 3982 2581 -4238 -5714 -490 2626 878 2895 6334
910 6334 4409 -2568 -6479 -5452 -1530 2255 2974 3250 6010 5738 -2617 -9003 -5272 -1076 -2990 -853
926 -853 6536 4999 -5677 -6220 892 -1533 -8076 -835 8890 3892 -3058 2634 3213 -10454 -14337
941 -14337 1134 10134 1457 -2065 5273 3776 -7532 -7833 1965 3720 -105 3012 8733 5687 -1951
956 -1951 -3666 -2178 -4108 -4082 1674 7844 7072 1023 -3016 -666 1606 -547 -799 3054 4433 110
972 110 -1329 1319 -2432 -8939 -4331 6108 4539 -3625 -551 4177 -3555 -9361 1104 7905 -1630
987 -1630 -6211 5332 7502 -7482 -13025 -367 3205 -6442 -4944 8867 8559 -3807 -4383 3565
1001 3565 1191 -5360 -347 7409 2083 -4512 -781 4526 -966 -6448 -985 6413 4772 -811 -224
1016 -224 2698 869 -1599 2050 6252 2884 -3343 -727 4064 348 -7096 -5364 836 110 -341 5320
1032 5320 7678 -929 -5962 248 2836 -2999 -3828 2871 1729 -7732 -5859 4001 2879 -5824 -4647
1047 -4647 2399 1070 -3070 1371 6125 -62 -5331 236 5434 1266 -3802 -2746 -900 -3744 -4120
1062 -4120 426 3150 2425 4186 7372 4237 -2670 -3071 2545 3676 -1191 -3685 1145 3169 -1907
1077 -1907 -3204 2564 4770 -2208 -5169 2685 7895 2698 -1581 1569 2616 -3113 -3890 2387 2592
1092 2592 -5137 -8332 -3777 -1226 -1374 2227 5554 1772 -3194 -934 4147 2000 -3755 -4503 -1834
1107 -1834 -1816 -2815 -934 -125 -1157 -348 1926 754 -2498 -1021 4850 5945 139 -2331 2762 4628
1123 4628 -816 -4176 -1168 532 -4585 -5799 2257 8656 5585 1498 1868 1646 -1329 19 4214
1138 4214 2655 -3582 -4415 -389 -586 -3333 -1160 2736 -555 -5696 -479 7796 5503 -4033 -5580
1153 -5580 946 2337 -1777 -1490 2213 -480 -6839 -6691 -1618 -2050 -3035 1796 7790 4643 -1341 183
1169 183 4620 857 -5469 -3407 1731 -195 -2637 471 3255 -359 -3685 -541 2179 962 2064
1184 2064 7309 6778 -1114 -5072 -357 4083 2466 -916 -894 -1042 -4162 -4636 -558 2342 910 552
1200 552 4035 5744 4019 1247 -1104 -5390 -8384 -4050 2399 956 -3806 -1875 3008 -1441 -8102
1215 -8102 -3447 7160 5621 -2181 -921 4662 1912 -5234 -3997 1087 -364 -3180 -1493 -641 -3887
1230 -3887 -2312 3981 4636 680 1744 8014 7340 1173 -2535 -3070 -5116 -5907 -1088 4826 4302 -63
1246 -63 -677 1830 1330 -1075 -342 3542 3755 585 -216 3506 3269 -4225 -8243 -3216 216 -2615 -3760
1263 -3760 631 3048 -281 -772 2983 4020 1704 841 173 -2613 -5047 -5357 -5192 -4258 470 5604
1279 5604 3419 -1248 -722 2127 693 -1934 473 2846 1437 906 4150 3544 -2540 -6128 -3975 -1244
1295 -1244 -894 1221 4146 4024 1738 825 2945 4987 3939 467 -3300 -3256 -665 -526 -2905 -3698 -717
1312 -717 1964 2872 2291 1774 -699 -2726 -2466 -213 1444 1419 48 -197 389 -1422 -3814 -4953 -3958
1329 -3958 -3419 -2242 1885 5090 3780 87 417 1942 378 -932 283 -994 -5196 -4719 309 2547
1345 2547 -6 -87 2125 1749 877 3301 2994 -1150 -2272 3228 4921 61 -761 3139 1295 -5711
1361 -5711 -6377 -539 1132 -1430 327 5169 4517 1596 1725 3237 1175 -3043 -3958 -4255 -4462 -2364
1377 -2364 494 17 -2098 -1220 951 1666 130 328 1396 -466 -3363 -2182 3076 4224 -1153 -5307
1393 -5307 -4350 -1838 -2571 -1673 1402 1601 -1354 1533 8289 8514 1242 -2201 13 -1679 -4590 -2339
1409 -2339 1129 -1563 -4412 671 6111 4798 1885 1870 982 -1493 490 3391 1000 -2611 -1302 1180
1425 1180 -739 -2178 -386 -1522 -5988 -4647 3059 5837 1650 -282 1591 1978 54 -563 -794 -3885
1441 -3885 -7186 -5514 -1713 371 875 841 1197 1701 2772 3655 2056 -1345 -3609 -2653 -138 543 1297
1458 1297 2094 1409 -2119 -3548 -524 2402 477 -453 2483 4430 2524 1896 4586 2651 -2899 -4181
1474 -4181 -1122 -1364 -3630 -666 2224 26 -2133 2851 6742 2226 -1598 232 -335 -5515 -5128 1758
1490 1758 3380 -1565 -3009 112 -145 -2396 -1391 -480 -3557 -4516 1626 6420 3987 152 857 733
1506 733 -2996 -4861 -1649 353 -2213 -4027 -271 4470 4128 1778 1985 2763 1793 400 372 -432 -2446
1523 -2446 -2075 1242 2767 951 685 572 -1725 -3879 -326 3756 1360 -2476 1503 7357 6236 559
1539 559 -2337 -4020 -5940 -5111 -1288 209 -2008 -2114 1332 3265 2516 3226 2866 -1186 -5146 -3209
1555 -3209 219 535 -1778 -2611 -1772 -732 708 1347 570 -1449 -2567 -1139 1820 4658 5384 3061
1571 3061 1762 1112 -1412 -4321 -4456 -2212 -1734 -1781 892 4435 5549 4875 4250 3544 616 -2955 -3085
1588 -3085 -994 -36 -611 -1600 -1927 -862 322 1618 2200 605 -2849 -2889 11 2715 2571 2127 2440
1605 2440 -528 -4361 -3946 -637 -1810 -6718 -6477 51 4720 4829 4496 4098 590 -1870 -1184 -524 -2301
1622 -2301 -3072 -977 -175 -886 473 3101 2289 -683 -326 1663 1627 1005 840 1390 1669 2290 2762 977
1640 977 -1757 -2888 -2048 -630 -716 -1699 -1317 1816 3611 3599 3235 3086 263 -3786 -3911 -1082 -193 -3018
1658 -3018 -3448 -628 776 585 1330 773 -2052 -3297 -926 1048 -160 456 3553 2203 -2032 -2111 592
1675 592 -156 -4118 -4564 -1122 587 488 2113 3248 3713 3897 2512 -322 -2493 -1438 798 537 -1203
1692 -1203 -2018 -192 1233 1568 1448 1329 687 -1048 -1092 2129 4435 2523 -878 -949 569 -513 -2423
1709 -2423 -1060 -1038 -4720 -5662 -516 3698 3109 2020 3010 1570 -1314 -489 884 -2170 -5735 -3225
1725 -3225 203 -1062 -2444 557 2378 69 -1247 1222 2861 152 -515 1906 3606 958 -2152
1740 -2152 -1838 -259 43 -1447 -1586 -1174 -429 218 3021 5230 4455 2477 1883 1437 -1780 -1766 1141 -258
1758 -258 -6017 -6424 1490 5555 1702 -974 2188 2605 -1763 -1998 2040 1243 -3421 -2969 1309 957 -2309
1775 -2309 -1583 -257 -3011 -5001 -1394 1487 233 -463 3177 4967 1397 -1122 468 587 -2962 -5172
1791 -5172 -2009 535 -1349 -1392 2593 6296 3274 -797 -1042 735 24 -1708 1790 3107 -385 -2694
1807 -2694 2298 4777 278 -3950 -2329 -779 -1992 -524 4270 4308 43 105 3614 2435 -2899 -3257
1823 -3257 -280 -1872 -4847 -2147 2631 2089 -1070 -1085 1764 1078 -1219 -1183 -237 -316 -1026 432 1210 -898
1841 -898 -1883 -218 1688 -572 -3622 -3157 -273 773 53 2941 5386 2012 -1546 1053 4043 -36
1857 -36 -5680 -3743 348 -3 -719 3364 5395 608 -2016 1548 2755 -958 -1918 1891 2104 -1555
1873 -1555 -539 3570 1276 -4320 -4310 -185 -791 -3055 -617 3629 1938 -653 1640 3098 -954 -4157
1889 -4157 -2018 664 -1888 -4655 -2720 844 563 -467 1906 3002 -535 -2842 728 3163 -197
1904 -197 -2663 -73 2414 -156 -1546 2348 2468 -3066 -5235 -42 3946 1567 1149 3743 4124 609
1920 609 -172 1493 -470 -3965 -3293 211 529 -881 1706 3881 903 -2453 303 3023 -330 -4107
1936 -4107 -885 3043 892 -3108 -2041 810 -290 -2654 -1935 877 -342 -2422 -237 2961 1255
1951 1255 -1223 -590 378 -714 -663 991 574 -2539 -3428 -396 1777 431 499 2531 2021 -332 568
1968 568 2710 479 -3455 -2162 1964 2441 17 240 2619 926 -2812 -1022 2474 794 -2483 -754
1984 -754 3856 3241 -574 -1101 1259 -127 -2755 -1731 428 -1123 -3421 -737 2148 660 -1182 343
2000 343 1119 -1389 -1445 1076 393 -3490 -3468 715 2064 -556 -143 2049 -253 -4156 -1555 2266 1074
2017 1074 -2669 -308 4264 3239 -350 -163 2003 -1100 -4343 -1963 2578 1963 -314 1011 3103
2032 3103 1156 -1090 590 2110 -427 -1553 1323 1849 -1279 -1595 1577 1926 -1991 -2630 1047 2197
2048 2197 -1470 -1817 1713 707 -2216 -1196 2525 1168 -2342 -2219 -357 -1600 -2961 -70 1628
2063 1628 -1182 -2866 1063 4073 1725 -1243 -926 -285 -2090 -2109 1245 2228 -857 -1836 1510 3488
2079 3488 1481 -481 -727 -967 -1429 637 3547 2425 178 -357 847 984 -60 -366 -1433 -2691
2095 -2691 -1205 2775 4445 1269 -548 -338 -1072 -1700 -4 1475 -897 -4040 -1689 2540 2810 30
2111 30 -1092 -1588 -2247 -807 1263 573 -2534 -1998 -35 444 679 2262 1659 -2397 -4297 -1222 2003
2128 2003 233 -1243 557 1522 383 1499 2872 499 -2872 -2063 678 700 48 2454 3644 237
2144 237 -1605 762 2160 -1262 -3022 494 2563 878 -696 833 1534 -15 -1040 270 -212 -2449
2160 -2449 -1591 1053 942 -903 -866 771 -466 -1900 -644 1669 -156 -3120 -1307 494 -783 -1846
2176 -1846 495 2234 -1335 -3002 577 2046 -980 -2278 691 1283 -1348 -782 2947 2715 -1133 -568
2192 -568 1946 -668 -3404 800 4062 320 -2957 845 3948 922 -1033 1736 1036 -3819 -3579 2432
2208 2432 4408 446 -964 810 -651 -2501 425 3211 -216 -4457 -1459 1736 592 -752 1527
2223 1527 2016 -3057 -5125 162 3795 882 -3569 -1294 852 -613 -1142 1578 2162 -1544 -3314 -539
2239 -539 1106 -55 145 1918 495 -2022 -508 3132 1410 -1506 -202 1148 -1314 -2817 1978
2254 1978 4773 1264 -2023 805 1663 -738 -490 3254 2192 -3023 -2697 2016 2636 -720 -200 1300
2270 1300 -1032 -3820 -744 3291 1656 -2243 -1709 481 -727 -986 1445 818 -2570 -3449 408 1240
2286 1240 -452 -945 -110 -1130 -1645 680 2790 680 -1592 -362 1162 -846 -2366 -296 2069 215
2302 215 -865 2096 2889 -1218 -2622 261 2535 141 -829 1914 1845 -137 -216 2009 478 -3218 -2418
2319 -2418 1082 2097 524 1871 2035 -1545 -2413 520 3160 -360 -2844 -719 454 -1522 -1147 1539
2335 1539 860 -3102 -2249 1313 1017 -1634 -333 1315 -302 -2449 69 2520 258 -2573 -994 901
2351 901 -1155 -1823 731 2634 95 -673 917 1507 120 -451 1583 979 -757 -470 697 677 -92
2368 -92 448 934 -707 -1610 1211 3023 773 -1804 570 1928 -94 -1096 1017 2187 -1131 -3830
2384 -3830 -899 1536 -358 -1517 306 1331 -364 -599 756 276 -1510 -1205 256 -40 -1833 -1023
2400 -1023 -184 -1417 -1979 231 1063 -739 -432 1144 1669 217 -863 13 -285 -1004 870 2004 656
2417 656 -1600 -1361 686 1047 -251 443 1606 1437 622 965 2333 871 -1844 -1816 -120 1062 139
2434 139 286 444 -843 -1439 -238 1465 508 -134 -39 801 69 -319 -243 -1200 -1577 -1272 -337 -887 -1200 -568
2454 -568 560 -28 -822 218 565 -273 -729 37 942 -179 -938 -607 -526 -346 40 105 -475 -916 646
2473 646 2500 1605 157 112 1163 1172 -227 28 688 -62 -1152 -667 570 1301 300 -347 467 629 812
2492 812 924 1095 26 -873 -52 702 -554 -1643 -1106 -33 -946 -1565 -322 890 -346 -903 491
2509 491 1310 722 -532 -997 -645 -873 -1033 -686 -692 -955 -460 234 652 148 -91 105 835 1156 1043 588
2529 588 48 -325 -347 73 -190 -573 -671 302 471 586 1274 1630 777 -103 636 1815 900 -1128 -1177 -555
2549 -555 -587 -1167 -507 171 -853 -805 16 1189 330 -172 43 363 -731 -752 131 -354 -1531 -1476 -530 6
2569 6 -817 -1320 -284 62 360 691 1237 899 113 -170 607 316 -1133 -1992 -628 251 119 -95 1257
2588 1257 1616 -20 -197 1151 1946 297 -790 480 1026 135 -118 293 -198 -1419 -384 617 421
2605 421 -234 289 1136 386 278 156 259 -917 -1576 -539 -319 -1872 -2275 -744 671 111 -433 839
2623 839 578 -869 -909 700 1051 -886 -1760 -323 480 -799 -996 471 9 -1412 -621 1679 1690 -300
2641 -300 -284 1928 1970 -189 578 1851 158 -2599 -1277 983 291 -979 578 2345 902 -41 1280
2658 1280 1754 -799 -1531 1185 1844 -973 -1809 543 710 -1602 -2021 -164 -243 -1152 -234 2415 1518 -1062
2676 -1062 -547 912 -614 -1678 564 1118 -2105 -3921 -1192 1360 -43 -1528 1050 2508 579
2691 579 -180 1785 2370 -1596 -3026 -261 1474 -201 -319 971 685 -1856 -1307 1458 1597 -427 608
2708 608 3042 1913 -352 150 1328 221 -2167 -1621 -523 -948 -659 771 1432 -223 -528 754 1072
2725 1072 206 199 578 -615 -2231 -1438 44 216 -844 -1043 -542 -1269 -853 991 1560 -565 -1086 555
2743 555 1543 911 -112 290 -1463 -2037 -969 711 -256 -1436 -14 1975 1100 656 1997 2313 -91
2760 -91 -1219 468 1255 -686 -1829 124 1151 -186 -256 1080 -129 -1645 -166 2168 1168 -87
2776 -87 592 905 -578 -653 472 -27 -3323 -3749 -281 958 -339 -580 884 -5 -1150 1170 2992
2793 2992 503 -2820 -1731 904 -1144 -2560 204 1830 -1462 -3082 738 3443 139 -2167 295
2808 295 2389 306 -99 2448 2442 -1435 -2687 253 725 -2281 -1247 1650 1161 -1088 1033 4144 1768
2825 1768 -1768 413 2782 -428 -3262 -363 1892 -1041 -3194 488 2027 -1002 -2321 1165 2084
2840 2084 -1732 -1895 2330 2351 -1682 -1215 1960 134 -3995 -2561 916 -831 -4370 -1099 3691 1681
2856 1681 -1410 1284 3700 221 -2845 481 2853 -1507 -4420 -162 2733 -111 -1419 1543 1428
2871 1428 -2529 -1385 3634 3506 -897 -744 3340 2186 -1536 -462 2019 -1070 -4994 -1756 2804
2886 2804 1437 -1313 270 1802 345 -739 2492 2854 -1558 -3090 -241 280 -1854 -1846 750 -355
2902 -355 -2694 -629 2966 1510 -1883 -1176 1387 782 -970 845 2322 102 -2533 -1643 148 -1580
2918 -1580 -2823 29 1505 446 759 2721 3326 -30 -1159 1034 721 -1461 -919 1561 910 -2022
2934 -2022 -1076 1039 629 -522 602 2255 884 -828 344 1819 684 -855 1 46 -1094 -1125 -57
2951 -57 -1088 -2461 -1496 350 1054 237 1572 2374 64 -1389 46 927 -1194 -2866 -1485 -318 -402
2968 -402 -408 664 429 -760 -326 1098 1572 -108 -318 824 390 -81 923 1219 -496 -2090 -914 -4
2986 -4 -105 -286 842 981 723 1432 2792 1839 -723 -1139 -10 -549 -1907 -570 483 -893 -1409 960
3004 960 2298 377 -1309 -160 1187 -667 -767 1114 1071 -1414 -1568 812 722 -2134 -2702 -491 -642
3021 -642 -1785 21 2345 1819 328 1525 2435 -239 -2420 -1001 320 -1939 -2214 507 1839 504
3037 504 -257 1751 2182 -113 -1155 951 1500 179 -48 1301 326 -829 97 1405 -245 -2695 -1625
3054 -1625 438 483 10 1731 2664 1164 -905 150 1294 -1102 -3684 -2358 -556 -715 -693 890 1219
3071 1219 -370 -373 895 706 -1109 -1239 -293 -470 -714 702 1923 39 -2128 -1162 418 -421 -1736
3088 -1736 -390 1794 1583 643 1984 2796 597 -1773 -1225 241 -153 -918 -855 353 530 869 1910
3105 1910 1392 151 -2 432 154 -78 -99 372 -392 -597 646 972 -344 -1972 -1387 -379 -828 -382
3123 -382 941 1265 655 94 1031 667 -1068 -2512 -1255 -881 -1043 -623 368 1034 -13 -94 1048 1085 -564
3142 -564 -1098 -93 391 188 -132 98 296 189 191 119 104 -845 -700 107 835 1353 1479 872 825 630 374
3163 374 -102 -1281 -1310 -869 -382 36 316 726 647 410 42 373 338 -408 -866 -582 -19 242 346 -576 -909
3184 -909 -779 -401 -349 -873 -928 -375 89 440 1140 730 1011 -337 -825 -450 -154 -1152 -1376 -845 95 643
3204 643 919 1111 989 476 200 743 659 -19 -472 -654 -90 276 554 278 -131 -107 90 -102 354 455 -184
3225 -184 139 1492 1261 347 -560 -491 -487 -1230 -1466 -984 -389 -941 -852 961 1688 803 -389 -501 -6 -441
3245 -441 -1140 -1054 -466 -934 -561 285 822 334 -134 -619 -242 157 628 885 444 440 641 828 439 -187 -442
3266 -442 -826 -606 -585 209 785 1267 1047 682 1333 1002 35 -763 -679 -436 -445 -360 -390 -286 189 730 531 -313
3288 -313 -470 -681 -1103 -831 176 1045 497 -661 -428 100 -141 -1473 -1889 -1036 -412 -24 533 1293 661
3307 661 95 -120 467 338 -565 -848 -434 -424 115 287 883 446 -438 318 677 113 -455 -219 375 1132
3327 1132 1076 913 1043 544 -251 -480 -336 -262 -744 -704 237 1452 1749 823 -191 -423 -556 -649 -541 -296
3347 -296 -611 -871 -834 191 931 277 -579 -749 -734 -318 -56 -77 42 32 602 884 577 -50 -730 -1113 -1547
3368 -1547 -1035 -205 579 862 1016 792 1257 1252 47 -300 -619 -232 155 72 -144 16 148 283 278 -136 555
3389 555 -30 -176 -123 746 857 331 -271 -141 639 49 -1009 -1318 -995 -1082 -861 428 1111 842 -89 128
3409 128 131 -242 -875 -1104 -1165 -783 -109 529 116 -11 -113 194 268 36 304 318 -26 178 400 696 -200 -117
3431 -117 -161 17 473 204 -294 -453 -66 1136 1430 1096 244 54 533 -224 -251 -193 -508 -962 -769 314
3451 314 1141 61 -395 -242 -202 -82 351 216 -551 -1178 -634 408 679 -98 -370 -498 -766 -674 -219 423
3471 423 -294 -454 -94 1082 833 -223 -432 -379 -252 -353 -156 868 -33 -357 -47 704 617 155 182 -179
3491 -179 -317 341 597 638 -11 -40 794 399 -116 278 199 -690 -914 -128 596 414 34 705 602 19 -384
3512 -384 -124 -242 -1196 -1013 40 -11 -367 -23 601 257 -1088 -938 -284 -113 -653 -262 601 -51 -225 170
3532 170 719 596 -415 -1059 -969 -662 -65 1267 1032 389 84 682 713 210 -291 -432 -845 -777 543 1536
3552 1536 1110 -5 -38 450 44 104 632 114 -1030 -1053 980 1262 -150 -872 106 64 -656 -868 366
3571 366 -251 -1354 -932 1253 1747 136 -563 -530 -968 -1458 -549 139 -466 -1288 193 1626 905 -557
3589 -557 80 323 -1063 -1143 666 1248 -516 -913 557 1245 -123 -220 820 811 -757 -833 1082 1094 -291
3608 -291 -371 1365 1018 -325 -137 740 -12 -1447 -773 866 175 -273 999 1390 -484 -1760 -809 433
3626 433 -475 -1092 364 1130 -319 -1340 560 1052 -627 -2230 -1037 554 -232 -141 479 59 -1327
3643 -1327 -1097 968 1377 -315 -594 -172 -290 -849 375 1496 735 -1054 -560 1074 854 -128 -599 -69
3661 -69 -22 -569 801 1999 1116 -352 -91 464 594 -444 -373 29 -48 -2 690 613 12 -363 -189 -487 -546
3682 -546 -366 287 -72 -415 74 468 4 -762 -1102 -496 76 -416 -437 -323 -12 -7 -296 38 464 -486 -713
3703 -713 -437 230 452 -455 -115 232 57 400 392 633 -18 -446 -310 147 291 -234 567 798 442 182 1003
3724 1003 712 -262 -1212 79 667 -588 -540 1317 1546 67 -706 175 106 -922 -1121 261 630 -919
3742 -919 -907 677 614 -468 -602 110 -395 -777 -404 1262 435 -1277 -930 111 227 -413 -205 296 -570
3761 -570 -1569 339 1357 452 -937 -86 788 410 406 1214 507 -1153 -1441 373 1338 -58 -351 690
3779 690 1030 -143 -239 1065 935 -1292 -590 1220 1056 -729 -684 645 -221 -1092 -340 634 276 -903
3797 -903 44 1062 -23 -911 -148 474 -621 -1556 18 649 -979 -1746 5 845 -170 -668 586
3814 586 695 -85 -395 763 553 -715 -853 126 989 166 -322 366 199 -521 -46 783 517 -222 270
3833 270 1326 312 -153 33 399 -153 -1095 -372 770 86 -519 589 1112 125 -373 -203 -91 -166 -465
3852 -465 445 448 -753 -1028 -251 350 -398 -1259 -341 154 -357 -472 313 500 -624 -791 570 893 -350
3871 -350 -955 -387 -283 -666 -442 363 927 -18 -192 846 940 -67 -102 296 607 -193 -197 912 375 -792
3891 -792 -272 747 428 -316 -216 800 686 70 484 736 105 -616 -98 662 -101 -1066 -719 -279 -701
3910 -701 -468 390 798 -321 -705 -9 596 -313 -604 -459 -266 -578 -482 146 -81 -976 -635 441 775 28
3930 28 300 837 420 -372 67 954 685 -320 -50 337 144 -808 18 109 229 156 856 1208 494 -171 298
3951 298 563 173 -582 -190 316 229 -577 -177 362 -357 -422 56 961 588 -67 -270 67 -593 -188 52 -184
3972 -184 -693 -993 -326 -20 -435 -581 -118 -311 217 277 594 354 -121 -325 -331 270 104 -379 -33 -73 -413
3993 -413 246 114 -213 -19 669 1045 525 38 267 541 -11 -617 -71 117 -85 -710 -10 775 180 -274
4013 -274 53 619 376 204 588 419 -267 -971 -263 223 -261 -823 -772 -356 -345 -516 60 334 -124 -77 513
4034 513 626 20 -531 -235 -673 -871 -534 532 67 -581 -107 663 834 256 250 777 560 683 458 177
4054 177 -625 -452 65 316 -6 10 313 219 58 159 1100 665 196 -92 401 424 -215 -423 -283 -447 -847
4075 -847 -109 86 -415 -298 -27 391 169 80 210 -80 -527 -391 -17 -322 -662 -721 259 47 -613 -295 233
4096 233 229 96 383 536 421 -187 -51 -170 30 -121 -519 -215 -288 240 768 230 -121 108 510 244 92
4117 92 825 883 -345 -679 151 214 -332 -886 -102 105 -355 -235 843 223 -930 -127 759 644 -297 -403
4137 -403 -51 -458 -1105 -454 54 -362 -851 -122 560 206 -395 45 45 -396 56 1010 587 -798 -797 -178 -93
4158 -93 -647 -292 238 -310 -520 550 1416 775 -269 -46 354 61 -321 150 302 -463 -963 328 784
4177 784 190 -223 243 540 -119 193 881 499 -354 49 790 -137 -1081 -794 -89 -582 -1123 -433 638 485
4197 485 -558 277 763 91 -412 119 121 -276 -686 -467 -512 -1087 100 489 113 -496 196 1043 654 -396
4217 -396 156 791 177 -355 697 1150 84 -900 -427 -233 -126 368 1241 854 -98 222 929 679 -430
4236 -430 -655 79 -200 -634 -39 211 -386 -1160 83 454 82 109 447 283 -664 -747 106 308 -525 -681
4256 -681 -254 -35 -588 -169 -214 -424 -651 254 945 -67 38 582 516 -516 -961 307 478 -517 -719 362
4276 362 597 -20 -33 723 768 -380 -150 910 222 -255 447 619 -473 -752 57 698 -132 -909 -185 597
4296 597 89 -264 933 1027 -505 -538 126 -166 -586 -734 -130 -381 -868 -365 674 172 -1070 -494 363
4315 363 582 -236 326 -19 -726 -903 68 595 -210 -818 231 101 -551 -44 393 343 -340 344 1321 1126
4335 1126 329 165 222 -688 -1181 149 619 -60 -546 61 1184 372 -284 103 95 -275 -69 674 524 -311
4355 -311 -820 -152 -201 -403 -274 -200 -678 -495 345 864 283 -378 134 421 -8 -181 -499 -431 -1132 -1118 -137
4376 -137 144 303 535 232 -133 -111 961 766 -280 -751 -187 336 91 -192 376 445 -535 -695 272 616
4396 616 49 278 978 740 161 423 706 226 -722 -722 -144 -562 -630 629 830 -9 -413 179 32 155 -360
4417 -360 260 -55 -1030 -714 311 36 -924 -956 -233 -198 -482 500 537 -170 -839 -147 623 606 -137 238 217
4438 217 -790 -709 -7 317 -855 -726 290 1176 690 605 683 381 -507 -341 533 280 -771 -485 747
4457 747 225 -397 -111 773 -446 -698 -207 1015 665 -221 210 576 -53 -674 -273 -107 -797 -1089 -113
4476 -113 531 -71 -365 106 306 -198 18 654 276 -817 -437 642 -291 -1015 -821 -213 102 -258 120
4495 120 524 250 -461 25 434 623 194 333 780 424 -186 -566 -404 -1169 -502 242 639 597 482 754
4515 754 918 171 -478 -283 31 -379 -111 388 597 -508 -997 -232 17 -46 -77 472 270 -33 -1 329 342
4536 342 -768 -930 -151 -345 69 -659 -840 -603 -369 159 973 936 585 400 331 156 -395 -321 -472 -222 -278
4557 -278 -173 1102 609 -139 -121 100 155 265 120 642 272 169 682 428 -57 -770 -400 -276 -441 -828
4577 -828 116 530 -207 113 691 735 -164 -507 -480 -183 -464 -676 171 74 -527 -189 183 276 -526 -680 212
4598 212 403 32 -89 94 -323 -363 -444 50 455 -344 -557 -401 -109 -241 -77 702 368 229 939 804 49
4619 49 -996 -707 113 -173 -307 559 855 166 -234 197 476 -582 -765 63 889 417 309 432 -206 -969
4639 -969 -894 87 202 -737 -764 138 334 -210 -56 175 14 -343 11 615 -152 -967 -719 -228 -527 -201 47
4660 47 594 157 -397 -75 607 64 -544 80 442 409 203 511 468 -21 -652 -144 228 -481 -332 767 950
4681 950 855 221 600 426 -368 -631 166 -99 -612 -196 458 201 70 -154 92 -417 -535 317 802 199
4701 199 -642 -285 179 -359 -630 -404 -61 -692 -705 -350 236 145 -374 52 635 312 280 426 -156 -386 -845
4722 -845 -19 51 -440 -299 228 752 214 -210 501 242 -229 156 364 479 105 -225 129 55 -259 -198 46
4743 46 107 -582 6 453 409 234 59 184 207 -210 -350 -334 -464 -739 -697 -173 516 -72 -164 16 73 88 -175
4766 -175 -18 -192 -576 41 477 2 -7 -258 131 90 -141 -172 162 -293 -306 278 768 649 -235 344 760 -113
4788 -113 -631 -247 -267 -91 -35 501 1130 88 -689 -24 368 -99 -282 -108 89 -249 12 726 506 -487
4808 -487 -601 -266 -170 -635 -91 498 -289 -574 -174 616 263 -848 -556 212 -75 -902 -188 49 -296 -356
4828 -356 507 814 247 -361 150 376 -473 -323 723 162 -272 -255 705 439 -491 -518 75 -44 -306 490
4848 490 913 388 -41 342 1158 -78 -554 -94 -184 -172 -180 152 570 -67 -104 250 183 -526 -498 -183 -112 -506
4870 -506 -463 67 312 -120 -93 -178 -399 -892 -593 38 -159 53 364 471 -174 -290 420 105 -508 -583 -200
4891 -200 -109 18 242 670 639 75 13 608 770 -223 -55 -31 -144 -118 441 529 109 -216 5 145 -137 -73
4913 -73 -33 -135 -145 146 931 15 -397 -448 -357 -576 -569 -2 407 -93 -191 236 428 -283 -466 -596 -310 -467 -159
4936 -159 287 -251 -611 -76 220 -140 -375 35 483 -146 -501 247 405 -99 -259 403 456 26 106 157 221
4957 221 -419 128 538 100 -523 212 1094 468 -532 35 717 36 -658 -107 584 2 -687 136 901 -170
4977 -170 -709 -62 345 -635 -536 284 203 -454 -182 1056 33 -346 -477 397 -15 -829 187 572 -368 -1105
4997 -1105 -131 715 222 -470 -72 459 -393 -372 575 844 -367 -519 651 1023 -85 277 235 -195 -472
5016 -472 -66 999 456 65 107 682 105 -398 136 357 -442 -590 420 987 209 -265 241 136 -653 -273
5036 -273 346 19 -523 -330 528 233 -301 -330 316 -593 -532 32 464 -116 -565 225 162 -31 -139 62 55 -480
5058 -480 -720 363 197 -241 -76 444 334 -523 519 661 117 -378 -135 656 123 -390 348 834 -5
5077 -5 -366 462 482 -559 -453 -18 284 -413 64 855 472 -318 -583 16 -63 -737 -81 613 216 -399 34
5098 34 720 -69 -975 -529 -150 -509 -364 554 739 -430 -690 242 25 -99 -164 284 -588 -639 -14 829 543
5119 543 -541 -241 567 367 -125 576 646 -490 -913 318 860 341 -216 274 205 -132 -207 476 123 -696
5139 -696 -391 549 414 -44 34 -69 -391 -644 -355 244 -165 -506 -89 474 265 -152 142 54 -672 -532 -273
5160 -273 177 -123 -247 218 18 71 51 258 -105 -442 29 565 181 42 -86 481 441 -80 185 138 -103
5181 -103 -248 367 541 -236 -335 272 317 46 365 483 -75 -565 272 171 7 -305 -224 389 -103 -106 4 192
5203 192 -326 -426 186 129 -87 -44 340 -56 -87 -142 -259 -470 -134 -172 204 -125 -180 -215 263 -33 161 307
5225 307 74 -92 -223 275 440 162 -143 168 188 -149 79 328 134 -272 -108 471 183 225 145 134 112 -183
5247 -183 -182 1 -148 -605 -130 173 91 -72 214 282 -37 -365 8 -402 -276 -213 -144 -100 -182 -33 -175 -158 -615
5270 -615 41 225 -363 -678 232 399 74 -181 -25 217 -510 -279 57 -10 -73 -334 3 366 414 10 145
5291 145 81 -173 330 440 180 -489 -49 304 24 -15 63 689 16 -127 -8 284 84 -188 -178 377 214
5312 214 -8 100 -197 -364 -685 -169 135 -168 -93 411 540 392 57 225 -308 -700 -578 -36 89 -161
5332 -161 -524 -171 216 -61 145 -94 57 -296 4 356 524 415 -153 258 -40 -49 -117 672 -284 193 13
5353 13 478 587 -126 213 787 246 -18 270 34 -214 -535 -166 76 -64 -165 -135 438 95 -320 -184 -137
5374 -137 -260 -403 266 178 -146 -408 -189 -39 -504 -533 -175 -204 -319 -134 756 452 -71 -572 -11 333 -100
5395 -100 -296 256 314 -292 -327 -24 444 -152 -30 277 479 305 -28 365 375 -24 176 455 -170 -542 -125
5416 -125 524 -9 -373 -269 6 288 -284 136 883 56 -702 -505 396 37 -395 -639 322 -171 -269 -140
5436 -140 93 -534 -393 140 507 183 -280 9 231 -353 -563 6 -218 -407 -882 486 428 -105 -64 657
5456 657 656 -308 -386 236 614 -242 -129 241 202 -437 -134 400 219 -286 150 469 500 -519 -12 382 7
5477 7 -711 -34 377 -62 -559 25 515 -390 -716 -86 593 -40 -121 222 249 -289 -431 153 161 -733 -916 145
5499 145 327 -239 -197 397 145 -430 123 871 731 -247 -283 552 266 -377 -98 379 -105 -533 156 353 627
5520 627 -304 -4 375 216 -121 755 560 -212 -553 186 144 -315 -488 357 221 -98 -152 485 113 -619 -143
5541 -143 565 81 -568 -257 232 -258 -517 126 -166 -55 -307 177 -104 76 -184 353 33 -247 -278 -15
5561 -15 6 -198 -277 133 -105 -58 -99 289 290 43 287 368 169 403 285 328 155 -137 -72 -409 290 449 -85
5584 -85 36 -298 -100 129 249 331 373 75 -15 5 -166 58 -326 110 -293 73 77 99 -92 -389 -535 380 247
5607 247 -35 -195 29 -667 -604 -413 77 -60 -913 -100 383 47 -191 629 545 -70 -177 201 663 -127 -165
5628 -165 440 603 -128 -497 396 291 -507 -27 288 168 48 -71 597 298 -527 -283 498 92 -463 -174
5648 -174 931 -246 -364 -127 649 -187 -622 -304 577 -246 -639 -151 414 -284 -772 -223 453 -492 -709
5667 -709 382 234 -244 -371 318 534 -691 -213 647 144 -709 -391 393 -198 -730 95 690 -189 -561
5686 -561 162 890 392 -410 347 385 -122 -409 376 490 -378 -1063 -5 495 -62 -175 577 177 -674 0
5706 0 794 387 -326 -330 438 167 -730 76 233 -330 -960 -187 371 -209 -377 8 389 128 -528 148 355
5727 355 -430 -764 280 366 -159 -514 118 281 -215 -200 469 603 -103 212 266 151 -21 -84 506 313 -362
5748 -362 223 -188 114 -365 167 294 -67 8 249 293 -262 298 83 -75 -134 -275 316 118 -350 -403 283
5769 283 -148 -43 -144 380 -78 -61 -24 306 43 -542 -93 -59 -172 -498 -13 -431 -332 -126 338 452 69
5790 69 66 137 -14 -246 450 81 -477 -503 -205 348 469 49 277 193 -253 191 366 190 -255 -270 38 275
5812 275 -320 89 25 -236 -542 54 297 154 -137 402 489 173 -295 391 440 -609 -715 -122 -42 -280 -432
5833 -432 287 -287 -281 -164 443 38 -466 135 368 167 -156 -36 181 -187 -545 -69 119 -144 -280 311 513
5854 513 282 -84 523 285 -26 -110 393 -223 -766 -163 -5 173 39 24 202 271 -24 438 670 262 72
5875 72 144 140 119 -90 -63 -92 -378 -340 -279 -150 -280 -151 66 283 -122 212 208 79 -96 -129 155 -250 -486 -41
5899 -41 167 52 -121 286 127 -270 24 435 400 96 -96 258 201 46 -260 -119 -184 -570 -32 356 381 7
5921 7 246 12 224 172 -118 -193 -384 39 274 177 -262 -344 10 -76 -105 252 60 89 -318 -150 -72 195 -451
5944 -451 -413 -184 -108 -124 -371 65 -140 -391 -310 -145 -224 228 107 331 -15 420 63 -14 -428 -255 285 193
5966 193 -152 -62 165 321 4 21 554 82 -142 161 -1 30 275 82 -201 159 -185 -103 4 -199 -376
5987 -376 90 214 -214 156 358 4 -117 11 361 -602 -398 -257 144 23 -221 221 312 -43 -336 -148
6007 -148 285 -67 -63 -192 126 184 -186 -100 -15 -128 128 206 443 -63 -110 196 581 132 414 30 188 17
6029 17 -300 405 62 -155 43 260 82 415 314 23 63 -113 -169 89 -145 -41 97 206 162 -259 -308 -268
6051 -268 -186 -33 -108 -72 339 -11 -194 29 94 64 -167 8 -96 -87 336 112 -127 -65 1 262 132 -11 -52
6074 -52 48 177 -29 84 -83 67 -190 49 183 72 -34 -19 42 -135 130 232 446 -25 -19 126 104 -329
6096 -329 103 99 -246 -202 -184 -18 -62 -226 94 338 399 -138 -50 -169 -101 -166 -298 443 20 -121 -277 73 -75
6119 -75 -296 -9 -19 148 226 258 333 121 -78 -115 -124 -106 -64 -137 307 162 165 370 374 -60 -40 187 97 248 109 255
6145 255 299 -169 91 179 -156 -83 -61 124 16 35 138 71 -2 93 -38 -199 45 -22 -319 -164 -146 -227 -271 97
6169 97 18 113 180 307 13 -83 -98 50 85 74 -169 52 -68 -94 281 203 324 -275 170 406 461 221 -61 317
6193 317 -206 54 209 -73 -349 -193 -31 322 58 -235 303 357 178 89 201 56 -196 -70 182 -68 -132
6214 -132 -190 -1 -101 -111 -182 -5 103 -354 37 378 148 120 -257 193 53 -255 -100 304 -258 -78 -47 62
6236 62 130 98 140 -20 20 -22 230 83 -168 -127 187 65 134 9 690 179 -232 -115 374 356 -149 33 292
6259 292 400 -368 254 47 -281 -270 352 170 -205 -95 129 316 233 -44 143 -57 -648 -323 -148 -69 -440
6280 -440 -258 183 -142 112 167 117 -126 -517 -143 106 129 -153 207 174 71 -174 -136 183 -246 145 175 -20
6302 -20 170 -368 162 184 68 188 77 193 80 272 -110 -137 288 -50 120 -9 87 271 263 -202 -99 -171
6324 -171 -1 120 296 181 -25 120 106 12 -576 -287 156 59 -294 43 -154 -298 -146 -27 -110 -260 -216 -42
6346 -42 103 -18 -210 -56 59 -116 -137 262 187 -273 -86 200 401 189 -29 628 318 -25 200 471 44
6367 44 -532 -62 199 200 -2 539 679 -217 -572 398 390 -13 -481 78 463 -252 -88 537 -137 -464 -371 370
6389 370 241 -273 -137 350 -82 -718 -47 543 -215 -835 -230 478 24 -638 401 534 -457 -404 345 618
6409 618 -125 -682 288 164 -202 -130 492 512 -187 -331 898 322 -315 -391 470 87 -446 138 74 156 -407
6430 -407 -160 284 -91 -527 46 528 -107 -549 192 691 -55 -183 414 129 -378 -677 212 510 -393 -422
6450 -422 263 -53 -457 -171 594 -40 -936 -146 325 243 -250 7 506 127 -72 293 254 60 -483 211 336
6471 336 210 -125 392 55 -353 -113 612 303 -134 -335 49 354 243 166 121 -3 -15 320 -34 271 -22
6492 -22 46 167 59 -41 65 33 -4 -309 59 -11 19 -281 -217 -322 127 -150 11 -50 -282 -414 -346 218 -214
6515 -214 -225 334 109 204 259 -233 -15 -33 75 153 57 -97 80 -163 -91 134 412 -21 13 -25 -50 -348 -23
6538 -23 274 212 -34 -97 328 200 -174 -97 331 -204 319 404 110 166 78 121 -180 -570 -353 76 -79 -281 -131
6561 -131 472 -255 -342 131 -158 -10 -53 -140 -123 -367 -238 137 -96 -393 -128 287 296 -298 -209 41 266 -223
6583 -223 247 382 174 -298 -85 -17 204 -211 60 416 -39 118 264 420 148 -444 56 207 -58 -182
6603 -182 175 297 -310 -174 134 434 -171 -177 -101 170 -41 -25 89 97 -9 -60 82 -46 -422 -78 -295 -208 -358
6626 -358 -29 256 192 -339 111 288 185 -468 -113 377 -295 -366 -109 54 -10 129 -29 342 410 -21 274
6647 274 404 -102 -127 147 204 24 52 161 -47 -56 -131 200 27 -217 -176 265 148 -267 64 100 11 -225 -411
6670 -411 1 82 -139 -18 9 -113 -69 175 -281 -69 -131 -258 8 8 10 -105 -151 -118 198 289 52 -36 -84 79
6694 79 288 330 111 278 85 -160 31 109 -6 4 -139 -30 527 587 -102 85 69 -36 22 -14 135 -35 227
6717 227 38 38 -106 -232 -158 -290 31 -20 59 -86 -153 -142 -27 2 -134 -366 41 -5 -52 15 -346 77 -275 4
6741 4 199 -110 -107 287 175 141 -71 6 147 139 -273 138 210 -117 16 23 168 75 57 126 420 167 363 -51 242
6766 242 385 136 -134 -29 143 -378 -20 -84 136 156 -330 316 -142 -74 -23 -10 31 -90 103 61 -242 -227 59
6789 59 -236 35 -27 -158 211 156 85 -2 -139 170 179 223 -225 -160 -326 -117 14 -271 -101 85 -120 45 -160
6812 -160 116 105 405 -176 168 431 -277 -149 62 -110 -290 -261 3 90 -42 13 -107 194 -43 377 -128
6833 -128 -153 -42 -21 120 -103 -322 -95 -372 -82 97 55 -153 -102 157 -222 -50 -84 -43 -68 16 -200 78 -175
6856 -175 -167 75 364 41 167 231 16 -71 48 291 484 127 -252 -203 -220 1 -2 -152 302 386 71 39 6 50
6880 50 -66 -56 -218 -80 -68 43 118 -278 34 207 -21 -228 -28 50 58 -25 -123 -215 -125 -20 -239 -34 -54 -263
6904 -263 -266 -173 -74 -44 36 134 146 -66 118 184 57 -152 -24 388 -24 155 153 48 53 461 -43 136 155 166 272
6929 272 41 91 -136 164 -106 -96 166 277 -225 76 -87 -85 -324 -239 143 69 -123 373 25 175 -250 -232
6951 -232 -302 -213 -187 -49 -54 -345 -278 -299 112 -270 -90 141 237 -26 -233 217 74 -483 -158 212 124 -268 -62
6974 -62 137 -269 141 8 5 352 53 31 294 121 63 -193 -85 -128 25 86 213 12 -359 515 53 -73
6996 -73 -246 -21 490 9 84 -159 200 -326 -270 -160 -305 92 120 -155 174 146 89 -176 74 44 -202 -203 36
7019 36 62 -80 -167 -164 79 -280 -12 234 -43 -95 84 389 43 87 93 119 78 -48 110 192 303 -94 10 143
7043 143 221 -131 -69 317 88 -26 -257 48 -50 -32 5 25 -43 -226 -147 7 -79 12 313 -19 -142 -69 106 65
7067 65 179 -208 -156 329 -183 -26 -223 -110 -113 -220 -29 -146 287 121 21 -142 -131 152 -135 -26 162 -49
7089 -49 226 104 58 257 181 213 133 24 373 81 -132 202 427 -68 -4 94 72 -270 -6 203 -46 -355 30
7112 30 276 -99 -161 20 501 -134 -51 81 57 -258 -156 90 193 106 -49 -116 100 -55 -141 121 337 -68
7134 -68 218 -15 202 -232 6 14 31 137 359 207 146 -147 162 612 437 -142 -188 11 95 104 93 383 169
7157 169 -20 -108 -26 391 52 -121 184 4 173 331 260 -49 -74 -210 33 -33 -52 -282 -150 115 196 -39
7179 -39 171 -125 158 -438 103 -34 -109 -66 -44 121 -420 -416 132 -250 47 90 146 498 10 157 -14 -80 -52
7202 -52 99 126 152 86 -157 174 413 -136 155 23 55 103 137 433 -39 -25 33 328 100 315 85 -216 -56
7225 -56 -374 -5 66 -536 -28 138 -75 -208 87 16 -171 -245 1 20 -225 20 -83 251 76 -30 48 217
7247 217 -17 -210 -3 -104 108 -43 197 176 -246 -331 -158 109 120 433 263 163 134 -8 181 316 -26
7268 -26 -337 22 -152 -112 294 338 95 -324 114 -25 364 -80 22 196 -264 34 147 -287 -111 -233 -132
7289 -132 -50 -178 -14 -2 31 -159 -141 -50 -25 -21 150 -25 -48 -103 113 -182 92 -126 -59 239 126 -180 -162 -5
7313 -5 420 -33 -86 -87 -60 77 -50 -25 431 -70 -109 340 7 106 -259 64 115 -122 55 56 207 -329 -141 -198
7337 -198 263 -19 -216 -60 -231 6 -212 58 -18 121 16 -89 -21 -319 -117 -35 47 -132 -282 64 23 -305
7359 -305 65 124 102 -311 72 410 -99 3 90 -218 -254 -272 227 402 13 -219 148 128 156 77 288 151 -110
7382 -110 -6 257 249 -240 -23 -2 36 50 -205 372 54 -206 -31 126 -150 -213 66 213 105 -336 -159 68
7404 68 62 -277 28 33 82 19 138 129 160 -244 -23 43 -404 -145 -71 219 66 137 72 119 269 37 55 -171 36
7429 36 -127 40 294 -155 2 406 -126 -204 -5 235 -109 -340 -151 -11 286 -117 -119 95 -235 -259 -183 187
7451 187 -117 -370 51 22 104 -108 -17 102 105 277 -99 106 -261 -299 84 289 92 -8 193 -190 -95 -5 -267
7474 -267 203 -270 -25 412 118 67 -279 47 -3 30 224 234 19 -168 50 330 -232 -186 -110 40 176 185 -37
7497 -37 63 153 -112 -4 301 -42 -111 -17 -17 7 -128 180 32 -74 -33 182 84 -47 -280 -200 30 -217 -91
7520 -91 49 -218 -8 -108 269 -290 -46 12 105 127 38 112 125 177 128 239 -194 315 -100 -77 -70 200 285 -30
7544 -30 141 39 178 266 234 323 258 -271 -155 -186 -87 187 10 40 -47 -111 203 121 -277 187 136 248 -39 -152
7568 -152 -61 -160 -253 -188 -35 -108 -226 -32 -209 -4 -60 312 17 49 -66 28 -100 -253 -244 37 -229 150 236 297
7592 297 225 -191 144 -19 -35 242 147 -69 -51 201 238 46 21 -360 79 -12 82 51 -135 20 -248 238 260
7615 260 -46 -187 -249 63 88 -297 -230 -184 -175 97 -62 44 -54 -165 -55 64 123 -151 -130 2 -22 -60 245 -121
7639 -121 -115 -367 -165 109 -109 90 -28 358 -236 107 31 211 -75 -331 339 249 163 88 -75 64 -86 42
7661 42 -98 50 -228 160 74 -40 119 -73 345 -262 190 209 254 -57 -43 -158 -132 91 -68 204 145 -129
7683 -129 -83 217 -264 -28 -270 -119 -88 202 222 143 107 230 -126 122 123 -142 224 116 173 -74 99 -300 -140
7706 -140 141 220 -105 -100 28 190 192 32 358 26 43 -243 68 195 -100 -295 61 298 -181 -80 284 -9
7728 -9 -420 137 -27 -82 -329 -27 -76 168 -117 88 328 -76 -185 48 19 78 -315 90 99 -164 16 31 -131
7751 -131 -244 10 -266 -158 -226 36 53 22 -181 -232 285 79 144 -254 -134 -65 -46 246 234 81 121 349 54
7774 54 104 -266 41 419 -20 25 -26 111 -20 143 40 -91 15 -196 -197 -309 47 -86 145 -50 -62 280
7796 280 133 -283 -500 -411 -83 -151 60 223 -273 -209 -340 56 -68 -75 -161 189 -132 -112 -131 -99 125 -341 123
7819 123 154 -22 -121 95 157 77 296 -145 -63 -112 -41 197 -193 -35 -234 -99 101 -180 -46 -38 -66 -102 5 67
7843 67 -82 -151 -246 -164 -277 30 102 172 -21 -208 143 -101 -4 117 111 -146 12 -56 352 -17 -69 -503 -69 -87
7867 -87 60 156 109 -268 65 140 -166 156 18 61 -120 28 282 -78 287 9 -191 95 400 -55 47 332
7889 332 175 -68 -53 183 15 -123 -287 113 -24 -180 -206 -171 -122 -66 -215 -52 -27 -31 64 77 -157 -208 132 156
7913 156 -330 112 49 -88 -474 77 71 -22 -229 184 -194 -137 204 261 27 5 -168 -74 2 -14 -216 177 215 -76
7937 -76 118 224 -89 -313 19 367 128 -295 -287 49 29 -72 467 215 171 -256 -339 95 -215 -110 184 -154
7959 -154 -82 25 93 343 -103 -363 84 111 87 -53 255 -25 134 238 -130 26 -207 80 -153 -3 -292
7980 -292 -97 -101 103 53 61 -17 -17 -95 139 20 202 294 414 325 -150 -133 -13 175 -427 -304 -17 86 -15 -20 -89
8005 -89 -98 -23 2 138 151 -189 138 -276 159 -212 -189 -84 88 -307 280 137 -176 -156 -117 -47 157 168 51 -98
8029 -98 16 173 -134 -81 101 141 -126 83 10 -19 -2 -204 242 314 128 370 113 21 216 1 136 179 -146
8052 -146 50 -11 112 -240 82 96 60 19 -154 -131 286 -310 62 118 -82 -301 -292 247 -59 126 -2 215 93
8075 93 -73 63 54 -238 -139 -297 1 -118 -62 263 197 94 27 120 -417 -7 -108 84 116 -170 -101 180 171 -211
8099 -211 108 92 195 -147 -362 96 -151 -158 221 117 -85 78 -144 236 -267 -47 346 9 -227 -92 96
8120 96 154 -224 -132 -85 143 -194 -218 55 155 66 -305 482 114 -109 -6 18 -71 -175 148 242 -63 -44 76
8143 76 162 -3 -144 187 -43 -221 268 18 210 -5 153 378 -77 98 26 294 255 81 -29 28 -46 71
8165 71 -151 71 71 14 12 301 2 -1 143 -30 -4 -142 167 221 42 23 93 -67 -157 -112 -18 133 155 -267 32
8190 32 -440
8191d40
$$ Imaginary data points
##PAGE= N=2
##DATA TABLE= (X++(I..I)), XYDATA
0 0 0 0 0 0 -5 0 -8 8 -8 8 -16 16 -24 24 -32 40 -48 56 -64 74 -88 102 -117 134 -155 176 -200 228 -256 290
30 290 -326 367 -411 458 -510 569 -631 702 -776 859 -953 1054 -1167 1293 -1432 1591 -1771
47 -1771 1976 -2213 2491 -2821 3224 -3727 4371 -5230 6440 -8268 11345 -17480 34359 -173877
61 -173877 -565876 -62661 289385 17625 -232371 47131 252541 44976 -141145 -15575
71 -15575 51279 -58828 -74207 48095 44450 -27495 27349 100299 -12518 -144172 -82589 43855
83 43855 31324 -18763 24808 59485 -16301 -61027 25307 93249 16157 -60297 -3495 55286
95 55286 -20033 -93015 -25197 50023 532 -34427 48234 82818 -19925 -60486 43966 71973
107 71973 -54109 -96011 27344 86980 5565 -34260 4725 -14832 -58104 -1418 56353 -10152
119 -10152 -60736 28649 85901 -14202 -83655 8849 87797 19017 -62462 -46045 -9570 -4683
131 -4683 13514 20094 -30291 -51144 26369 83827 14673 -67846 -29578 48702 31392 -38162
143 -38162 -36042 29217 49674 -1762 -48222 -33741 8430 24731 14939 7921 4010 -8025 -13853
156 -13853 1147 18593 16587 10039 12385 11274 -1254 -9988 -13120 -21409 -30214 -18655 12360 36758
170 36758 35962 15464 -694 -4008 -12363 -34065 -30993 18105 50469 10868 -38792 -17455 26267
183 26267 3941 -46625 -40816 1500 15429 14301 26819 22315 -4650 -4677 15752 -4386 -44371
196 -44371 -30580 16546 20164 -9038 -11146 3018 -1516 -1579 14771 10270 -8118 8818 40071
209 40071 18807 -26951 -20078 14749 807 -37889 -23880 23820 32070 5392 -2875 5189 -2498
222 -2498 -13709 -1174 17352 14911 3474 5327 8020 -5314 -22391 -22459 -18555 -21018 -8656 23175
236 23175 34246 8617 -7178 11123 16771 -15087 -32990 -7235 12293 -2131 -10350 1161
248 1161 -2978 -18706 -6867 16725 8606 -6261 9744 20480 -6144 -21904 3914 19028 -2334
261 -2334 -7383 17014 14260 -18907 -21179 1363 -8777 -29084 1878 53972 48282 2215 -11046
274 -11046 4415 -4626 -29635 -24909 479 8192 5166 13924 20458 3825 -16315 -15283 -5102
287 -5102 -5820 -4713 10638 18278 4808 -7968 -1134 4811 -7558 -17002 -8505 -1691 -9723 -11497
301 -11497 2311 10923 6563 6545 12770 7431 -6234 -11869 -12245 -13699 -4546 14540 18495 2472 -6496
316 -6496 777 1348 -11389 -14049 359 14272 18141 16877 10792 -2765 -13812 -12615 -3281 4821
330 4821 8589 8341 4895 -1869 -9511 -12926 -8154 296 8007 16543 20849 13954 -1636 -12382 -16654
345 -16654 -22035 -20558 -901 19005 14656 -1760 -2594 2804 -6182 -18904 -13229 4137 13121 13659
359 13659 12067 2733 -10507 -14767 -10101 -7006 -4812 1424 3286 -836 -746 6007 7946 3087 4032
374 4032 10204 12528 6408 -3933 -15758 -19711 -10043 2628 6790 8934 18006 18118 -417 -16401
388 -16401 -10478 4412 5252 -1496 3333 15995 17270 -192 -19182 -22001 -11664 -5222 -4865 1285
402 1285 13254 16015 7112 1121 1240 -3108 -10765 -10369 -3203 -732 -2863 -4137 -5152 -5401 1115 7511
418 7511 3402 -4551 -2366 4925 2907 -468 4945 8247 301 -6351 -3861 -2025 -5265 -5386 -1436
433 -1436 -899 2035 13937 18233 5332 -6265 -2596 2557 -1176 -1318 7719 8087 -3023 -7872 -3741
448 -3741 -4093 -8770 -5011 6962 14584 12864 5468 -3212 -6428 -4487 -6700 -10908 -6741 6439 11034
463 11034 3893 -2659 -4219 -8201 -14343 -12212 -1584 10422 16452 11182 -343 -5787 -3564 -3253
477 -3253 -6756 -5588 -1558 -2743 -3639 4556 10485 3137 -3834 813 3543 144 3185 9060 1456
492 1456 -8920 -560 11242 2555 -8484 2200 12390 -2168 -16539 -6537 7830 4179 196
505 196 8215 12302 2876 -3624 -924 -610 -4331 -7248 -8776 -9361 -3019 6632 8644 2751 -1021 -1562
521 -1562 -4694 -7035 -2113 6392 6876 -2629 -10357 -3826 9344 7176 -9989 -18181 -6968 4314
535 4314 2885 2933 9481 9486 1338 -2152 -404 -1993 -1187 5350 3920 -6181 -6388 2551 3356 -3242 -425
552 -425 6749 4727 1151 8761 11461 -584 -8583 -2907 -1351 -7852 -3357 10482 12611 -982 -10028
567 -10028 -8912 -6270 -3657 4270 10206 6077 -687 -2393 -561 841 -623 -6262 -12216 -9695 176
582 176 4780 1898 -1323 -631 -567 293 4414 6954 2466 -5027 -7919 -5621 -2881 -654 5826 14014
598 14014 9844 -8685 -17517 -4159 9164 2244 -6224 7043 22186 12226 -7451 -9246 -217
611 -217 -593 -6083 -3665 -26 3451 10967 12900 -2161 -16322 -7865 6853 5619 78 6929 8264
626 8264 -7674 -18497 -6566 7130 5324 -968 -628 -405 -3552 -4617 -3240 -3700 -3288 1367 4546
641 4546 5513 7582 4654 -7337 -17013 -12596 -1237 5224 9138 10647 4819 -4749 -5908 -1522 -996
656 -996 -2674 1807 9945 11586 4461 -4803 -8353 -5382 615 2276 1262 4498 9373 6548 -2062
671 -2062 -8054 -7493 -2663 4220 9202 6890 2698 2563 -407 -10708 -15933 -6750 5406 8978 6197
686 6197 2835 -2635 -4905 -1608 -2159 -7332 -3154 9205 6020 -10872 -9513 7625 6807 -11468 -10875
701 -10875 8072 10095 -4942 -4783 6965 2595 -10738 -6891 9910 13647 4859 -906 -4818 -10177
715 -10177 -8670 3872 12427 6660 -1044 323 4792 2737 -1786 -1528 -1119 -3908 -2422 7372 12296
730 12296 2768 -7088 -6364 -3688 -6126 185 14212 11810 -9125 -15289 1517 8788 -3996 -8567
744 -8567 3091 4833 -5154 -3030 5902 99 -12695 -8319 4285 4751 1169 4729 3828 -7323 -10161
759 -10161 223 4531 -1958 -3056 4623 6649 528 -2135 -192 -911 -3556 661 6752 5393 -1523
774 -1523 -1412 3638 2268 -4865 -2250 8841 6799 -7573 -7607 10164 12161 -7057 -12403 4716 10532
789 10532 -3468 -7082 5948 6233 -7412 -8052 4325 4126 -4958 -3565 3353 948 -3300 571 2000
804 2000 -2975 -4426 -2086 -3789 -5725 1960 8587 3588 -3565 -3112 -1132 -3276 -4240 -131 3805 3345
820 3345 1112 460 3072 3452 -2851 -9567 -4945 6287 7854 3268 4451 5721 -2828 -9164 -1458
835 -1458 6696 2674 -382 3847 2901 -3953 -1118 6050 -1039 -11727 -2897 12699 8942 -4290 -4609
850 -4609 660 -3817 -7069 741 6157 969 -3842 -1945 -1052 -3105 -1782 646 -1256 -2158 1647 4042
866 4042 803 -3772 -5839 -3570 1291 3402 882 -378 1524 -1422 -6053 -2284 6812 5095 -2864
881 -2864 -203 7521 3154 -5646 -2691 3657 473 -1754 5177 7556 -1761 -7295 -238 3409 -266
896 -266 1092 6716 5096 -1015 -1090 -1857 -5378 -5693 1930 5091 1714 588 2376 -792 -7010 -7806 -2664
913 -2664 2468 4947 3513 1190 705 -819 -7423 -10822 -3550 3257 2071 1036 5224 2701 -7117
928 -7117 -6819 2351 2520 -2973 2082 10243 3602 -5719 -1408 1324 -8133 -8903 7604 14706 2812
943 2812 -4379 1899 2604 -6679 -5110 6016 7707 1383 1696 5561 899 -7024 -6547 -1709 -614 59
959 59 4504 7966 3491 -3929 -5965 -2284 1321 -295 -1452 1553 2407 -2521 -4572 -1600 -2711 -6760
975 -6760 -1176 8016 4920 -4689 -3106 2608 -2093 -6987 2549 8997 -995 -7233 2966 5765 -7813
990 -7813 -11358 3361 8731 -1479 -1466 10098 8571 -5218 -6194 3502 3005 -3572 484 7103 1532
1005 1532 -5578 -1442 4300 -179 -4859 1303 7880 4225 -2555 -2331 1500 473 -2326 536 3824
1020 3824 -552 -6041 -3535 2021 -1168 -7163 -3689 4142 3864 812 3645 3666 -4598 -8048 -979 2851
1036 2851 -3055 -4440 1801 1665 -6102 -3944 6159 5026 -4162 -3083 4739 3933 -1651 1340 5431
1051 5431 -130 -5363 349 5560 165 -5455 -2671 1447 -321 43 4553 6253 3732 2404 3348
1066 3348 35 -5677 -4822 1828 2600 -2613 -4570 588 2741 -1303 -3198 2259 3710 -2192 -4613
1081 -4613 2779 6749 -118 -5846 -2417 185 -4334 -4812 1199 1234 -5612 -6459 552 4839 3086 3353
1097 3353 4599 530 -4485 -2098 2900 396 -5182 -4237 66 1470 383 1360 2744 1629 1507 3188
1113 3188 2099 -622 343 5047 4641 -1793 -4095 1065 2777 -2923 -5734 -1087 2046 -1249 -1696 5376
1129 5376 9269 3020 -3068 -2516 -1267 -3103 -2125 1363 49 -5826 -5262 9 1368 -1529 -223 3157
1145 3157 216 -3609 918 7193 3048 -7060 -6696 1590 3119 -2237 -2728 973 -762 -5230 -3307
1160 -3307 2901 4097 1746 4407 8327 3101 -3665 -2303 2104 -548 -5779 -2803 3330 2130 -1121
1175 -1121 1086 3894 30 -3005 1140 4705 2606 1534 4106 2261 -5370 -7908 -1018 3899 572
1190 572 -3769 -2916 -1882 -2778 -1810 2707 4655 2053 452 2323 2882 -1168 -4823 -5882 -6472 -5640 -106
1207 -106 5344 3100 -2264 -819 3588 436 -4840 212 9066 5914 -4064 -3258 2846 428 -6308
1222 -6308 -3982 2567 1791 -1813 302 1678 352 1621 6327 6210 471 257 4296 2560 -5137 -7567
1238 -7567 -4642 -3125 -2040 2739 6832 4338 -1629 -2365 826 661 -1186 -632 2105 1754 -2527 -3660
1254 -3660 -524 -521 -6173 -7644 -1058 3815 1237 -958 2916 4562 207 -934 2319 2730 -1273 -2943
1270 -2943 -2372 -3750 -4760 -2649 586 2239 5123 7475 3753 -1913 -1183 2509 1124 -1418 819
1285 819 2809 937 -796 1727 438 -4647 -6263 -1121 2888 3142 3280 4472 2758 -266 -1448 605
1301 605 1161 -1112 -4371 -6424 -3991 -472 335 -1775 -1421 1809 3836 2671 443 -967 -2885 -3380
1317 -3380 -1559 1154 2414 475 -1275 -1602 -1350 -2369 -3816 -2696 194 2065 3132 5351 5995 2044
1333 2044 -1648 -1204 642 -654 -2390 -975 -890 -2801 -1372 3859 5278 1650 681 2388 1923 248
1349 248 1205 1157 -1994 -3019 2321 3705 -1536 -3661 240 -580 -6219 -5078 2464 4418 900 1227
1365 1227 4809 2940 -1839 -2695 -1004 -2889 -6246 -5265 -2899 -1388 1261 3281 2369 -88 344 2271
1381 2271 1970 -94 -474 621 -867 -2774 -985 3501 3246 -2240 -5680 -1999 1742 2231 2087 4089
1397 4089 3786 795 2542 6921 4400 -4425 -7103 -2612 -1543 -3369 -1084 2787 1146 -1080 2930
1412 2930 7008 3492 -1324 -2266 -1588 -2734 -1322 1268 -935 -4432 -2925 612 -925 -2423 -941
1427 -941 -322 -2673 -663 5760 6600 306 -2893 -450 -179 -2381 -3009 -2000 -3328 -4608 -1178 3845
1443 3845 4874 3403 2472 2105 1816 2115 1581 -1058 -3143 -3360 -683 1930 2075 1283 1062 396 -2573
1460 -2573 -2443 1631 4021 1984 240 2107 3380 117 -1836 -112 -1637 -5813 -5555 -454 1009
1475 1009 -1421 572 3275 1075 -1469 2079 4441 -1162 -5403 -2996 -1518 -4462 -2948 3718 4649
1490 4649 -1800 -3925 668 1448 -1379 -699 1373 -277 -654 4518 7500 2218 -3381 -2522 -1401 -3218
1506 -3218 -3856 392 3004 688 -554 3556 6557 4275 -27 -796 122 -739 -2054 -1779 -1147 -1762 -1021
1523 -1021 2041 2782 -248 -1639 -1069 -1959 -2895 959 4104 1616 -2009 441 4738 1518 -5712 -7719
1539 -7719 -5441 -4273 -2096 2164 3573 978 405 3380 3987 1573 119 -1055 -3989 -5690 -2279
1554 -2279 2108 2003 -879 -903 426 1983 2696 2548 498 -747 -730 1356 3705 4788 3150 -891 -2619
1571 -2619 -2688 -3320 -4513 -2928 1262 2312 1973 3505 5260 4323 1545 -661 -1900 -3872 -5239 -4268
1587 -4268 -729 305 -85 -1210 -995 626 1491 1636 1163 -829 -2923 -2166 1163 3185 1403 -664
1603 -664 -953 -3115 -5294 -3365 1058 567 -2538 -630 5581 8164 4826 1682 -124 -2669 -3893 -1905
1619 -1905 -34 -943 -1254 1356 2053 924 1553 3325 1599 -1387 -921 1876 2083 380 -367 227 312
1636 312 -353 -782 -1859 -3334 -3279 -1263 1054 760 -118 895 2723 3134 1067 -700 -1708 -3688 -5547
1653 -5547 -3998 -219 945 -1166 -1117 1583 2452 1088 522 -93 -2186 -2167 1111 3035 1312 558 2239
1670 2239 768 -3220 -3018 545 645 -2648 -1559 2702 4777 3377 2914 3226 2015 253 -1108 -3343
1686 -3343 -3676 -1442 1218 800 -1111 -1310 972 2038 1444 428 -251 -545 -1607 -1090 1133 2904 176
1703 176 -3515 -3022 -1393 -1922 -3289 -1768 -427 -2740 -1745 3964 6792 3832 263 78 -923 -3622
1719 -3622 -2569 -615 -2077 -4135 -851 3406 2160 143 2512 3879 1211 -1036 1421 2543 169
1734 169 -1597 1002 2232 -584 -3282 -1791 600 760 -248 -678 962 1806 2115 3865 4164 1552
1750 1552 -1458 -1998 -2294 -4253 -3464 -506 -639 -4452 -3215 4811 7397 1326 -2510 323 1114 -2707
1766 -2707 -2829 781 578 -3703 -2681 1708 1447 -2306 -1420 701 -1020 -2329 1601 4613 2533 462
1782 462 2562 3716 -1298 -3832 -1400 179 -2628 -3411 736 3855 2189 709 4057 5463 1037
1797 1037 -3395 -2311 627 372 -1093 980 2443 -1370 -3074 822 2974 -1719 -5304 -2069 1666
1812 1666 652 1286 3921 2604 -2619 -2955 568 -42 -5008 -4662 109 -247 -2633 -89 4552 2490
1828 2490 -1468 -1288 1276 822 -1703 -1415 547 459 -107 540 1190 -724 -1572 247 1764 -292 -2554
1845 -2554 -148 3457 3644 1900 3054 3595 -261 -3721 -1655 1688 -1556 -5730 -2231 3561 3067 1064
1861 1064 3027 3691 -1617 -4326 -410 1909 -1522 -2924 1173 1702 -1976 -1813 1538 -246 -5489 -4082
1877 -4082 1478 2043 -634 1495 4450 2265 -1428 -460 523 -2574 -5259 -2092 1354 -295 -2570 440
1893 440 4220 3101 1217 2104 2415 -818 -3024 381 2944 -379 -2745 321 2985 263 -1331 1135
1909 1135 1822 -3017 -3833 2098 5816 2233 -279 1673 1675 -2496 -3588 -872 -1647 -4249 -2483 2103
1925 2103 2564 320 1386 2240 -629 -3658 -539 1835 -1145 -4125 -1271 2922 245 -3490 -2045
1940 -2045 1947 589 -1883 -590 2343 975 -1172 788 3248 1293 -1865 -1180 931 160 -358 901
1956 901 638 -1692 -1797 2050 3932 1622 353 1720 1558 -854 -218 1185 -334 -3266 -1521 2628
1972 2628 2139 -694 -739 1381 -189 -2791 -1412 2495 970 -2378 -456 3289 1918 -2585 -3368 -355
1988 -355 -402 -2625 -1262 1284 -186 -2220 507 3021 900 -1800 -453 967 -1029 -1391 1024 1135
2004 1135 -2398 -1977 2025 3159 -222 -391 1582 -388 -2663 -86 4054 2449 -1602 160 4084
2019 4084 2198 -2444 -2433 642 -1555 -3136 44 4274 3324 -360 158 2019 -231 -3033 -1262 949
2035 949 -906 -2141 504 1448 -1473 -2042 1065 1550 -2509 -2918 1245 1975 -1546 -1735 1394 990 -2022
2052 -2022 -1007 2258 761 -2817 -2289 890 -61 -834 961 2794 320 -1276 1912 4135 388 -2995
2068 -2995 -1887 333 -773 -580 2810 2889 -300 -1289 1634 2963 433 -1978 -1370 -376 -143 1554 3232
2085 3232 1330 -1748 -1634 -206 -496 -1207 -1553 -1333 -1573 367 3993 3269 -1184 -2942 -1988 -976 -1654
2102 -1654 -588 920 -1067 -3045 -184 3625 2822 -1103 -2564 -1597 -753 796 2227 619 -1732 -1173
2118 -1173 1361 2184 1156 1174 479 -2613 -3027 897 3657 1725 -779 883 2077 1123 309 885 -790
2135 -790 -3214 -1489 2050 2032 398 1674 2099 -1184 -2920 -676 1489 -1454 -2799 675 2843 140
2151 140 -1841 -163 845 -1331 -1985 -424 -550 -1656 -930 1353 1082 -952 -720 1032 53 -1484 -173
2168 -173 1776 -215 -2528 -430 1799 960 -754 680 2353 -1176 -2428 1104 3046 -222 -1447
2183 -1447 1436 1940 -743 -435 3443 2242 -2342 -2022 1360 84 -2386 1372 3769 177 -3153 608
2199 608 3436 -146 -2893 -321 240 -3440 -2462 3158 4351 -827 -3212 -749 -703 -2212 19 2241
2215 2241 -754 -4174 -1054 2892 1241 -1105 276 622 -2811 -4019 1542 4845 626 -3677 -1129
2230 -1129 2509 896 -530 1348 1583 -1608 -2906 778 2808 788 131 1518 391 -1878 -249
2245 -249 2939 1168 -2165 -706 1032 -798 -1667 2001 4183 -209 -3774 -721 1418 -638 -1539 1553
2261 1553 823 -3871 -3115 2298 3011 -1333 -2228 128 -1328 -2976 34 3646 1030 -3248 -1986 742
2277 742 301 -730 656 715 -2364 -2572 1956 2798 147 -1040 663 409 31 1276 2520 333 -2214
2294 -2214 -445 1543 -291 -1780 1043 3004 764 -916 1428 2218 -1243 -2894 1109 2838 434
2309 434 -1529 708 1276 -1451 -1570 727 -413 -3529 -1512 2338 2350 -229 -203 405 -2173 -2885 197
2326 197 2642 -928 -3584 -833 855 -476 -896 1562 897 -2354 -1430 2229 2012 -1217 -948 1747
2342 1747 47 -1776 586 2788 -573 -2624 -479 1827 612 -751 1654 3013 499 -758 913
2357 913 1395 51 -528 573 546 -1129 -781 784 679 -587 -2 747 -704 -1371 1272 2211 -70 -2822
2375 -2822 -867 1325 -999 -2278 -133 1340 -1651 -3412 -222 2495 420 -1381 124 1412 -510
2390 -510 -677 404 443 -1970 -1000 699 306 -1317 -75 938 -64 -694 1372 2216 523 -101 1619
2407 1619 1612 -261 -1405 148 500 -147 591 1501 63 -2000 -1026 1340 1550 470 197 1321 1028 -684
2425 -684 -511 5 -674 -2438 -2037 231 815 -196 -754 -570 -1033 -1127 485 1367 507 -1098 -639 404
2443 404 -524 -1138 -1132 -877 -1249 -350 350 729 -74 451 1532 639 -614 740 1189 86 -568 241 639
2462 639 -401 -966 -14 418 477 436 1098 596 353 1348 1990 1153 -726 -561 375 173 -912 -804 -169 -567
2482 -567 -1049 -740 822 1239 -208 -606 29 671 76 54 -482 -1469 -1726 -639 172 -995 -1756 -855 518
2501 518 -37 -624 398 1357 645 -188 248 1235 134 -918 -1268 -190 -172 -290 255 603 292 813 1203
2520 1203 1291 443 51 328 1349 1007 570 -175 -561 -927 -637 -23 299 -299 -74 812 1070 672 419 368
2540 368 -306 -871 -215 357 -576 -2059 -2024 -838 -423 -392 -46 544 -204 -403 518 1084 -423 -876 -473 -306
2560 -306 -731 -801 -471 -400 -766 -896 738 995 304 -179 808 1680 969 846 696 559 -293 -253 191 44 -970
2581 -970 -845 523 1617 986 506 1521 1114 -227 -597 826 1323 -480 -1797 -470 491 -280 -856
2598 -856 -218 -531 -1016 -268 826 996 -517 -176 225 -162 -1097 -389 -564 -1527 -1703 -597 252 -1164 -886
2617 -886 925 1731 822 -22 1104 635 -652 -644 827 1020 -884 -1428 291 1314 -323 -707 810 903
2635 903 -517 267 2636 2012 -360 -704 1329 1062 -1209 -794 549 -1132 -2759 -1229 1574 961 -813
2652 -813 789 2232 578 -1192 144 290 -1704 -2114 403 1062 -1847 -2418 -15 818 -1473 -1655 517
2669 517 960 -202 531 2144 972 -1641 -1415 573 -234 -1741 301 1120 -1255 -2895 621 3504
2685 3504 1282 -436 1539 2728 589 -946 1132 1152 -2508 -2750 338 2704 -39 -393 1018 417
2701 417 -1755 -743 2063 1739 -553 -1 1854 422 -2154 -1954 -84 -1254 -2794 -1727 623 357
2717 357 267 863 1246 -43 -1096 167 764 -473 -1286 -566 -1336 -2022 -1203 1152 559 -560 -374 581
2735 581 309 608 2021 1466 -148 -1115 645 1512 342 -880 -667 -1294 -1339 227 1929 1234 -165 1318
2753 1318 2659 1313 -296 567 946 -1479 -2505 -305 904 -1020 -1729 340 1025 5 -473 338
2769 338 329 -1155 21 1873 657 -1292 -443 -303 -1151 -1714 -247 -455 -2669 -2341 1306 2763 345
2786 345 -195 995 750 -576 593 1984 -824 -3611 -1518 1465 -87 -1419 963 2625 -289 -2197
2802 -2197 1911 3990 529 -2585 605 2996 747 -794 1064 884 -2802 -3244 332 1418 -975
2817 -975 -575 2694 1918 -581 493 2648 135 -3502 -1122 1461 -1389 -4016 -738 1803 -721 -2829
2833 -2829 582 2789 -640 -2133 1128 1937 -1627 -1485 2385 2006 -2085 -2430 1063 22 -3540 -1865
2849 -1865 2568 1118 -2014 727 5129 2679 -1454 340 2588 -979 -3372 -91 2488 -1115 -3458
2864 -3458 859 3811 702 -1268 1308 1547 -1861 -948 3911 3156 -2435 -2243 1785 944 -2936 -2210
2880 -2210 805 -1375 -4134 -609 4400 2350 -1449 -658 1952 153 -1783 686 779 -2798 -3959 -397
2896 -397 1070 -1277 -1072 1532 1331 -1105 -2 3349 1861 -2250 -1518 2154 1324 -1242 244 1641
2912 1641 -496 -2963 -1302 1042 6 -625 1754 3446 1768 442 1808 1624 -1674 -2225 -174 3
2928 3 -1611 -1368 1165 756 -1701 -716 1835 909 -646 405 1565 -85 -1769 -463 804 -365 -1874
2945 -1874 -804 -164 -1169 -1193 115 -303 -1505 45 2164 1840 537 946 1062 -1215 -2229 -503 642
2962 642 -1333 -2145 28 1532 1011 584 1367 1184 -359 -205 1671 1161 -426 -664 329 174 -363 347
2980 347 316 -971 -2082 -317 1148 606 292 1111 1402 312 837 1016 -721 -2941 -2284 -745 -554 -1548
2998 -1548 -719 889 -316 -700 1343 2269 -406 -2073 -521 932 -753 -1347 329 690 -1595 -1796
3014 -1796 931 819 -1860 -1791 1151 1438 248 1086 3005 2120 -133 -512 884 -1270 -2664 -894 822
3031 822 -251 -872 2154 3253 754 -711 913 1746 -690 -1580 522 1340 -438 -1024 47 -208 -1603
3048 -1603 -572 362 -501 -2326 -848 2249 1674 374 487 1394 -702 -2493 -1254 -7 -1592 -3304
3064 -3304 -1330 1174 829 504 1876 1650 -392 -866 923 986 -1001 -1500 281 503 -109 821 1264 -332
3082 -332 -2419 -819 1624 879 -587 867 2890 2082 -99 629 1027 -955 -2909 -1827 156 418
3098 418 -782 157 1414 1351 1371 1091 -131 -1204 -1165 -404 -535 -651 -538 -220 -581 -674 -79 185 -1010 -2037
3118 -2037 -1391 303 916 693 1061 1133 232 -681 -196 -914 -2024 -2270 -620 816 533 728 1607 1572 185
3137 185 163 822 761 -889 -932 219 928 -79 200 275 220 156 33 331 -76 -364 -59 778 1066 1202 476
3158 476 67 -318 -855 -884 -1351 -1921 -1380 -279 887 596 496 429 -168 -341 -293 -144 -432 -889 -1003 -656
3178 -656 227 405 -186 -788 -923 -300 221 293 121 -181 655 1104 1338 712 564 -140 -833 -1270 -619 -119
3198 -119 -79 -211 509 1847 1689 1287 535 199 156 -150 -416 -132 -594 -232 -660 335 103 -329 114 -318
3218 -318 -430 -178 232 406 100 -188 54 368 96 -809 -1866 -984 -830 -978 -735 253 886 358 255 1413
3238 1413 1548 15 -1526 -1143 -129 -413 -153 -634 134 235 357 1102 1036 830 -127 -591 434 980 886
3257 886 891 571 44 288 82 -452 -758 -988 -294 306 471 1224 1464 777 459 -59 -92 -536 -1295 -1861 -1189
3278 -1189 -364 -29 -161 -90 484 250 374 -35 -884 -1364 -152 -171 327 843 797 -9 -1250 -821 -191 -215
3298 -215 -952 -630 256 1396 953 1349 1251 591 -542 -533 13 47 -731 -756 -57 530 810 903 1162 165 -141
3319 -141 130 117 -299 -762 -197 899 808 681 173 -318 -774 -1255 -1070 -554 -270 -240 -127 657 1302 838 -228
3340 -228 -1103 -1392 -617 -478 -577 -433 -388 -621 -173 411 749 391 -772 -359 -48 355 708 474 128 76 326
3361 326 506 -258 -904 -1224 -553 -38 429 1286 1330 1314 884 690 337 146 -789 -1289 -685 -319 407 334 -100
3382 -100 -188 106 327 187 -151 -159 -184 -321 -228 63 409 -430 -731 -597 96 -724 -1250 -1036 -411 78 757 1495
3404 1495 1398 545 -228 -703 -425 -789 -968 -545 64 270 541 968 679 21 -114 792 734 206 125 424 554
3425 554 427 612 430 -460 -700 -328 -46 78 258 -172 -299 467 1195 1248 12 -901 -589 -393 -475 -644
3445 -644 -320 -271 -733 -366 865 1213 6 -779 -654 -428 -177 -255 -159 -534 -394 47 1005 178 -73 -975
3465 -975 -266 -521 -61 478 1002 539 -217 674 1543 877 -573 -784 -267 4 112 641 926 580 -281 83
3485 83 977 600 -407 -471 -172 -367 194 378 197 -266 -380 353 319 -413 -367 -352 -987 -998 384 842 256
3506 256 -179 366 -49 -685 -840 -494 -596 -1042 -404 461 470 -325 226 664 372 -900 -795 413 296 -40
3526 -40 312 738 291 -164 -89 872 83 -872 -1025 -420 339 998 1026 759 43 -387 248 276 -791 -584 -233
3547 -233 -353 -266 857 1316 440 -863 -589 436 -179 -299 54 -451 -1057 -676 941 1102 -569 -1203 -61
3566 -61 -122 -900 -828 355 230 -875 -283 1652 1268 -836 -1500 -394 -446 -1063 391 1105 234 -224 546
3585 546 1740 632 -856 -496 237 -137 -382 1664 1421 -148 -967 729 1323 131 -882 476 740
3602 740 -644 -584 1031 1006 -732 -548 692 459 -975 -793 146 -330 -1098 222 1121 784 -693 196
3620 196 701 -1578 -2319 -625 956 -89 -943 648 997 -479 -1310 520 1259 -1199 -2040 -214 960
3637 960 789 101 362 365 -871 -550 1311 1215 -202 -1178 165 382 212 787 1441 585 -1117 -420 1143
3656 1143 815 -785 -904 120 26 2 670 1571 413 -920 -997 -152 -16 -518 -401 -212 -101 -274 320
3675 320 238 -556 -1032 -532 -491 -31 -76 -38 154 -63 -24 317 -194 -548 -780 43 402 201 -393 361 439 186
3697 186 124 424 956 -183 -305 40 638 729 -380 -135 388 379 605 633 495 -161 -631 -219 456 -13 -281
3718 -281 499 531 -223 -674 287 -81 -978 -1303 -123 718 -418 -740 853 772 -468 -1464 -495 -317 -480
3737 -480 -1082 577 987 -839 -822 186 689 -871 -875 425 230 -141 527 1288 244 -1408 -840 553
3755 553 780 114 259 600 -221 -666 508 1695 283 -632 132 1354 433 -182 -13 42 -1171 -807 1072
3774 1072 1617 -217 -647 361 541 -838 -996 452 -287 -1103 -668 1025 732 -1094 -1049 -78 -22 -1063
3792 -1063 -333 687 160 -1004 189 1237 -337 -1081 -349 663 -448 -1174 254 1027 -428 -867 656
3809 656 1737 426 -679 487 783 162 -365 354 437 -193 -897 419 1069 258 -314 332 156 -147 -233
3828 -233 669 679 -7 198 692 56 -995 -860 4 -516 -1116 -249 460 -165 -268 259 598 -338 -1217 -567
3848 -567 148 138 -428 119 52 -999 -916 270 496 -335 -311 320 431 298 53 772 338 -601 -423 681
3868 681 866 -163 -858 155 527 -38 329 1068 997 -94 5 342 591 -368 -532 129 399 -396 141 435
3888 435 -56 -706 -312 776 409 -289 -29 408 507 -523 -142 146 -663 -764 -374 168 -729 -1063 -564 202
3908 202 262 161 687 380 -829 -671 -2 558 -434 -655 -202 182 -282 -237 480 643 -438 -225 911 1033
3928 1033 185 449 561 397 -20 -350 752 274 -460 -454 224 208 -334 47 651 710 217 602 515 -312 -747
3949 -747 -113 274 -388 -1287 -332 330 -180 -512 -401 6 -523 -499 641 871 237 -625 -579 -27 -345 -377 -58
3970 -58 22 -325 -526 361 496 164 -150 345 448 943 598 433 393 -380 -400 -80 36 67 -9 7 319 128
3992 128 659 493 293 -65 445 905 139 -380 -214 -272 -340 -457 29 -222 -399 -480 -66 546 245 -344 -211
4013 -211 212 13 -271 -12 -105 -867 -1109 -324 583 347 -696 -251 334 388 42 382 790 -133 108 501
4033 501 192 -231 -692 -284 -71 -332 -45 907 806 32 291 968 1117 169 313 393 487 -76 -139 -191 -897
4054 -897 -561 155 351 39 -110 406 194 -90 140 469 144 -679 -561 -238 -394 -702 -871 -462 -469 -5 478
4075 478 340 152 -105 250 521 223 12 -187 70 -637 -523 -80 -253 -477 -162 562 384 420 266 851
4095 851 688 414 410 485 221 -587 -715 261 -55 49 -51 -176 47 583 946 443 -184 -154 338 -21 -270
4116 -270 218 159 -925 -1119 -125 86 -797 -672 -49 -2 94 114 311 167 -613 -260 659 344 -1034 -702 -60
4137 -60 -535 -621 -78 831 -27 -431 461 1172 351 -470 452 255 -129 -90 580 348 -1046 -640 548 306
4157 306 117 206 949 192 -103 841 1512 316 -714 -282 233 -335 -1043 -53 -244 -729 -796 545 840 -195
4177 -195 -428 131 332 -225 -34 245 -258 -801 -614 85 -346 -1203 -779 609 107 -389 212 1395 229
4196 229 -537 -28 594 149 -474 -178 424 -492 -873 39 -50 -308 548 1131 832 -62 152 929 655 -11
4216 -11 -43 481 -175 -672 153 818 -312 -1221 -261 568 706 487 1248 591 -396 -365 715 1 -1186 -896
4236 -896 -266 -415 -625 -32 420 -326 -926 208 1090 551 -317 -133 -38 -691 -774 59 503 -184 -613 38
4256 38 192 -85 270 549 401 141 986 1060 410 -468 80 72 -749 -552 691 849 111 -323 617 929 123
4277 123 148 748 371 -379 -221 320 21 -866 1 317 -490 -984 75 695 -445 -998 100 809 18
4296 18 -254 662 380 -789 -1081 -32 -59 -802 -607 418 15 -576 138 1278 618 -617 -362 1192 520
4315 520 -495 48 1 -909 -827 523 715 327 -517 174 825 376 581 910 353 -429 608 1087 552 -819
4335 -819 -1039 -484 -737 -491 240 1008 -435 -452 468 757 121 -522 -605 -164 -497 -648 121 338 -677 -1112
4355 -1112 -316 380 -280 16 109 -308 46 430 932 320 -962 -370 150 -359 -568 -406 -212 -680 -10 831
4375 831 855 607 418 403 -24 -50 614 307 -622 -786 -20 777 229 -253 920 408 -587 -525 805 928 62
4396 62 -216 452 473 -469 -245 -20 -590 -1200 -827 -29 -155 59 816 510 -353 -464 332 415 142 -514 -128
4417 -128 -106 -917 -304 483 154 -607 -388 288 541 545 750 933 -74 -861 159 1109 57 -274 -291 -170
4437 -170 -790 -411 563 852 237 -406 670 1374 490 12 243 -327 -1084 -537 423 91 -702 -611 432 437
4457 437 -680 -530 76 -99 -647 126 796 336 -478 -606 219 -370 -974 -599 -160 -830 -326 626 952 114
4477 114 -241 242 35 -338 -354 260 19 -823 -12 913 230 -445 -507 455 464 161 468 690 75 -418 -68
4498 -68 532 599 -73 93 436 -323 -777 -957 131 -109 -173 477 1062 504 -308 -48 -46 -931 -1161 -707 -316
4519 -316 53 -243 459 -63 -555 -1063 256 473 -119 -227 467 453 -61 -266 -97 -57 -837 -500 -234 533
4539 533 358 154 274 134 101 769 1093 715 211 -144 -121 0 -643 -354 -74 118 -75 346 807 788 -9
4560 -9 -264 -109 345 -144 -53 305 203 -356 -172 -223 -802 -1310 -502 101 98 73 465 818 208 -155 307 38
4582 38 -1192 -937 -204 -81 -189 -84 247 403 -120 -14 495 401 -101 -362 463 508 -258 -274 412 29 -476
4603 -476 16 580 536 -167 -397 482 352 -14 230 775 720 -113 -211 199 -495 -1347 -851 182 375 41 373
4624 373 755 -180 -475 -155 97 -787 -457 278 677 201 -385 -141 -758 -1383 -721 205 304 -478 -124 509
4644 509 86 110 -92 218 76 -316 33 204 -95 -376 -432 156 454 435 619 658 180 -478 133 575 -347
4665 -347 -446 28 479 729 -104 -211 -198 -459 -614 -170 717 180 -81 869 722 56 -631 -33 -168 -1103 -1006
4686 -1006 -37 -109 -285 -472 392 257 -338 -246 -280 -314 -465 11 361 395 -494 -410 224 -302 -521 -46 240 -204
4708 -204 -237 382 836 574 -19 287 699 187 28 -51 -23 -669 -759 482 181 154 165 634 912 225 115 23
4730 23 -202 -342 -57 57 452 6 -532 -213 -69 -274 -381 -211 58 120 267 512 162 -496 -396 -137 63
4751 63 -492 -519 -102 -189 -325 42 490 495 104 85 561 159 -49 -157 126 -183 140 -140 535 312 -217 -190
4773 -190 401 350 102 133 42 139 442 882 607 -208 -254 227 -17 -202 -717 -97 602 -233 -149 724 810 -305
4795 -305 -839 -346 136 -320 -624 -25 107 134 -187 508 -22 -711 -625 151 429 -344 131 531 292 -313 50
4816 50 220 -52 -1173 -482 503 159 -286 218 791 -53 -196 444 1051 177 -525 366 670 -13 -218 457
4836 457 662 -123 48 699 341 -440 -570 234 349 -6 139 644 75 -572 -304 454 -187 -1057 -642 -319
4856 -319 -235 -417 333 579 -252 -212 34 229 -507 -104 -72 -46 -428 26 573 449 -362 -73 63 -329 -576
4877 -576 -253 719 449 68 213 414 60 -415 261 253 34 -688 -6 650 473 498 393 346 84 -135 388
4898 388 221 -364 -373 -97 -217 299 559 338 -243 -496 -480 -99 -643 -87 65 -8 -260 43 502 28 -809
4919 -809 -406 178 -183 -449 368 725 158 -263 -22 486 -220 -350 64 193 -119 74 613 328 -367 -9
4939 -9 672 316 -511 -75 973 -65 -281 218 647 72 -422 601 340 -81 -491 -141 -11 -461 322 530
4959 530 107 -195 -59 656 -339 -653 -273 293 -228 -760 338 478 -205 -615 -101 708 -414 -930 -95
4978 -95 579 -90 -539 418 610 -367 -653 690 75 -712 -230 851 194 -436 492 990 13 -952 255
4997 255 1154 229 -869 -62 577 -86 -419 626 753 -652 -396 556 476 -66 -571 172 -245 -667 214
5016 214 986 233 -753 -139 522 -191 -629 -146 122 -521 -548 187 950 -202 -876 -162 -116 -242 -553 448
5036 448 574 -618 -216 719 461 -489 -348 91 -198 -662 240 1134 67 -547 131 638 148 -304 281
5055 281 297 -235 -573 650 589 -351 41 632 671 -183 -8 544 -92 -924 120 359 -34 -419 393 807
5075 807 -370 -503 -251 243 -270 -955 252 223 -509 115 781 62 -736 -606 67 -88 -801 4 573 17
5095 17 -764 4 718 -72 -786 -200 400 -50 -230 845 771 -446 -669 448 626 -171 -255 468 -15 -122
5115 -122 328 1082 46 -646 -496 491 211 -270 106 186 -621 -952 148 902 219 -497 -382 -13 -138 -241
5135 -241 -45 -70 -418 -454 554 392 -544 -721 -289 -532 -729 -473 548 216 -311 284 839 28 -335 -249
5155 -249 115 -363 -106 780 230 -130 -387 403 161 95 149 175 -113 -1 186 856 191 -318 231 317 170
5176 170 -261 -110 184 104 -97 429 395 207 -401 273 419 -109 -151 -67 -459 -506 -52 -40 245 -507 -162 457
5198 457 -296 -568 93 14 -114 -172 280 384 -164 -426 89 113 -209 -292 -113 -210 -157 277 902 128 -289 -37
5220 -37 223 -97 -145 -3 277 -321 -245 481 393 16 -259 107 251 -39 165 255 -371 -504 56 343 145 -77
5242 -77 -199 199 -192 -425 -82 -132 -383 -540 -33 203 146 -199 39 -257 -216 -108 -87 -126 -414 -527 493 15
5264 15 -130 115 27 -356 60 370 490 -20 -307 382 295 461 -39 -88 87 71 -60 612 539 81 -78 187
5286 187 318 378 -153 131 11 -206 240 191 -317 -517 -198 393 87 -383 -25 425 -117 -569 133 250 -28
5307 -28 -480 -373 93 -86 -176 -375 -170 -399 -505 -114 413 -34 15 -29 452 -109 -255 10 66 -161 -156 335
5329 335 367 -88 51 249 350 145 -319 231 361 -62 249 49 38 192 -546 -10 129 57 52 312 253 -251
5351 -251 283 812 302 -381 110 123 -9 -615 -361 34 -87 -495 -158 278 0 -300 64 220 178 -604 -338
5372 -338 -228 -100 213 41 171 -30 -410 -161 -103 -236 -262 413 267 11 240 388 452 -221 -477 -102 28
5393 28 -207 -150 250 816 -327 -393 170 356 -35 -277 363 651 -264 -130 139 67 -113 -149 185 -130 -325
5414 -325 -233 146 13 -403 -320 433 262 -167 154 241 -4 -919 -371 510 6 -431 220 96 470 -121 258
5435 258 323 -125 -178 -222 653 249 -369 44 125 -253 -402 -68 452 -205 -263 284 714 87 -242 538 546 -39
5457 -39 0 182 449 -312 -417 129 -217 -273 -125 390 264 -191 252 524 12 -602 -325 574 30 -445 -189
5478 -189 262 -412 -620 129 204 -230 -833 101 789 146 -181 -119 263 -590 -597 15 149 -299 -398 335 449 -200
5500 -200 -42 450 76 -251 4 692 362 -400 -33 429 169 -306 -4 388 258 -553 -34 801 -166 -589
5520 -589 80 504 -75 -350 92 306 -506 -529 -82 238 -766 -761 396 429 -94 -438 -23 -137 -529 -554 115
5541 115 -162 -206 -222 92 -77 -278 -198 208 -172 25 -126 311 198 -294 -42 181 224 -97 -33 -7 115 95
5563 95 291 438 166 107 247 461 216 -97 -237 136 -267 -281 -83 -80 -240 -80 -116 89 109 -194 -77 -280
5585 -280 28 242 146 -93 -228 -330 -596 -42 -305 -239 -144 -194 -305 15 -242 229 384 -295 -74 445 224
5606 224 -49 -91 -206 -155 -541 -378 521 274 -236 272 750 299 80 236 685 103 -451 277 332 -292 -145
5627 -145 491 311 -173 -145 189 711 -278 100 329 367 -270 -302 177 -74 -569 -227 243 -361 -679 -203 765
5648 765 -82 -665 -453 664 115 -335 58 497 -116 -803 309 418 -212 -798 84 359 -230 -461 441
5667 441 667 -88 -259 461 534 -496 37 689 83 -820 -161 587 104 -136 339 705 104 -373 63 945
5687 945 185 -509 -107 308 -87 -211 93 26 -648 -922 240 451 217 21 193 57 -424 -203 633 58
5707 58 -782 -405 -105 -128 -521 -468 227 -136 -460 200 893 507 -497 -215 213 -115 -790 307 454 -260
5727 -260 -306 203 314 -385 -9 325 573 -145 241 660 439 -213 -41 435 197 -592 -200 76 -175 -254 -86
5748 -86 275 -46 -115 423 201 -160 -333 144 -127 -596 -376 -79 -3 -618 -180 403 -286 -353 -133 392 352 -13
5770 -13 -53 -139 164 -261 191 180 -175 -108 -179 72 -20 60 145 1 -50 623 662 705 107 -490 -202 -21 226 121
5794 121 350 -292 -616 -41 442 394 42 83 -18 28 220 89 50 -697 -493 44 146 -242 122 -161 -236 -580
5816 -580 123 194 14 -49 -80 238 -155 98 66 205 -831 -409 59 255 -81 -198 312 426 -258 194 413
5837 413 105 -283 -117 276 -93 -355 -297 185 -43 -208 208 264 -18 -255 575 461 -53 -47 38 344 -575 -67
5859 -67 -187 -330 -743 -271 528 50 -192 124 421 -76 -237 206 197 -56 -629 -27 287 -426 -556 -86 83
5880 83 -164 -117 62 264 -24 114 371 222 -179 -147 -96 -164 -294 -162 137 -244 -399 256 540 195 160 82
5902 82 123 277 -92 281 340 68 -145 -305 254 27 166 12 58 96 110 951 183 30 -122 128 135 -459 -229
5925 -229 -95 -191 -679 -25 2 244 -46 -249 -190 235 -138 240 79 -481 16 -187 18 -119 -150 125 127 17
5947 17 90 178 226 -240 -98 147 218 197 -14 73 125 339 -53 268 -15 129 362 362 67 55 417 285 -160 -193
5971 -193 258 -269 -194 174 220 -69 -4 -59 -74 -99 -90 11 156 -205 -137 164 19 60 -167 96 -220 -249 -324 158
5995 158 -126 -353 -129 470 238 45 142 78 -3 -137 0 300 37 104 282 211 313 -175 291 148 366 413
6017 413 500 106 61 -308 45 303 32 -334 -385 -363 -145 -51 -25 70 -122 154 129 34 -224 -221 -442 -442 -402 -330 -105
6042 -105 -66 -186 -50 -226 -97 -17 -521 -319 -409 231 193 211 115 -40 -83 102 237 157 26 21 13 518 70 478
6066 478 135 121 274 131 283 -14 -43 -195 -9 -80 452 48 138 -287 -127 262 -22 -266 67 -83 119
6087 119 194 79 -232 -292 -112 -282 -367 -215 -12 -404 123 -135 274 -76 75 -76 -343 97 -402 -294 -220
6108 -220 -212 -55 114 -204 558 95 -116 -75 235 380 185 -68 243 120 256 393 -62 38 -385 -22 -51
6129 -51 351 117 205 63 221 -51 273 100 -83 -185 264 -16 -476 62 1 180 65 32 29 39 -149 -91 225
6152 225 87 -28 34 95 39 -109 -266 -317 -271 -430 -283 -59 109 109 -31 330 159 -98 94 -119 -47 -140 77
6175 77 197 267 -49 72 154 131 -78 176 337 293 -375 307 321 113 -34 -49 100 -172 73 -44 173 -122
6197 -122 -45 287 262 49 24 208 146 -430 -122 -66 1 -546 -455 187 371 -14 -339 334 29 -314 -94 361
6219 361 -65 -136 295 64 181 -384 -140 105 -136 -244 300 275 272 -288 288 318 235 13 439 81 -178 -38
6241 -38 221 6 -263 122 289 374 194 -59 198 161 -521 8 124 196 73 -150 69 108 -288 -534 -101 -116
6263 -116 -79 -435 236 -93 -291 307 31 -267 -315 -119 98 -385 -383 60 -10 53 -91 206 128 147 -230 138 100
6286 100 -501 130 208 247 22 357 -12 134 -5 152 221 -16 -90 96 282 475 171 -13 61 -84 101 23
6308 23 171 -202 -400 8 -83 217 203 -244 36 57 193 -190 -216 259 -16 27 -208 77 62 -251 117 -42
6330 -42 -123 -249 -247 279 87 193 155 235 0 -63 283 104 -355 126 193 625 -145 -428 -167 -96 220 -24 472
6353 472 -10 -374 -14 101 443 -188 46 244 360 -270 51 335 -273 -361 88 435 198 -170 56 9 -363
6374 -363 -448 232 309 -244 -281 188 114 -101 -297 78 73 -540 -329 456 354 -231 -193 349 -9 -200 -29 532
6396 532 26 -618 -208 422 199 -192 272 258 -10 -184 208 810 -200 -766 -80 342 -82 -505 516 279
6416 279 -189 -142 233 282 -778 -274 485 120 -459 -339 506 80 -551 -254 363 -230 -583 -132 683 -122
6436 -122 -505 104 521 -103 -613 284 493 -485 -619 627 456 -510 -660 246 408 -316 -148 490 338 -178
6456 -178 47 538 225 -333 33 473 135 -165 242 580 -251 21 49 624 175 -94 183 254 -276 -199 304
6477 304 221 -500 -316 363 183 -186 -106 186 138 -138 -142 357 345 -307 -206 38 396 243 -1 -189 -254 -277 -60
6500 -60 267 315 -504 -280 125 227 2 275 21 -57 106 100 97 -15 -62 -254 365 70 49 178 277 54 -320
6523 -320 219 62 -198 63 143 58 119 -85 -116 101 -266 320 -140 248 107 365 188 -93 -54 -207 -209 -332
6545 -332 84 -81 -180 -7 229 -439 -241 127 -19 -536 -437 111 96 -305 -74 107 -205 -164 102 136 -116 -3
6567 -3 -101 105 260 -171 217 248 -99 -34 190 4 -212 -437 163 332 -195 164 218 384 -321 -461 117 54
6589 54 -237 -314 482 316 -244 230 237 -173 -167 -19 256 238 -174 169 145 -118 -709 -164 662 -73 -365 214 -65
6612 -65 117 -131 63 66 -73 164 192 157 -195 -23 319 -23 -278 -35 580 393 -64 45 174 93 -89 -34
6634 -34 487 348 -42 -105 419 14 -181 161 297 155 -300 20 232 -84 -281 -1 160 -351 166 59 4
6655 4 -70 -51 -12 290 161 12 377 -79 27 -291 -74 -13 -407 -33 335 152 128 100 150 14 -169 36 -14
6678 -14 80 -108 151 58 -46 -16 425 474 79 -29 -43 113 -176 -54 -154 239 87 275 96 247 -244 -163
6700 -163 -62 -130 -305 -7 -13 67 253 -39 -61 -303 -51 -261 60 30 -154 176 -59 -53 -322 -9 -97 -385 121
6723 121 38 244 343 -458 -188 203 131 -64 -203 -137 8 -9 -532 221 347 208 201 -61 71 41 -278 -117 -71
6746 -71 36 386 313 111 -328 -138 141 44 72 79 85 141 196 227 -329 -29 70 -2 256 -112 64 -195 -271 -99 24
6771 24 7 -163 -39 -127 -126 61 -198 -372 -173 -292 16 -167 17 21 -147 14 -166 172 102 -124 -41 39 -84
6794 -84 198 133 -47 28 134 -35 276 -261 -103 217 112 -26 329 137 46 -152 238 226 285 -305 -274 14
6816 14 103 250 42 144 -30 70 -146 -243 283 -332 7 149 -8 346 83 153 -182 -223 -26 -272 -49 207
6838 207 118 -28 259 -337 119 -132 -102 158 -238 -166 -98 36 47 -33 85 97 53 146 169 -41 233 208 247 93
6862 93 -103 22 -290 58 -285 -258 -61 57 13 -62 36 108 -19 277 15 237 -196 -271 -62 -108 -376 -54 156
6885 156 347 -180 -150 157 -268 -419 -347 141 -70 -163 -155 -226 -59 -128 -180 284 -260 -452 84 -170 -76 192 295
6908 295 278 -32 161 194 -126 -60 11 15 72 -188 11 82 87 -122 45 135 132 358 -88 209 171 88 -126 -74 -32 -25
6934 -25 194 -337 -36 -213 41 175 -34 1 59 -70 -222 -146 -147 -21 -580 -319 -183 -203 161 299 304 -249 -276
6957 -276 142 137 -74 263 64 185 96 -153 260 114 -261 -239 201 354 -27 283 202 251 -114 333 525 137
6979 137 -136 242 -33 -44 -93 -361 -114 147 -49 117 135 -111 -74 -76 277 -249 -176 1 228 -130 4 -206
7001 -206 -309 -345 -90 -86 -55 105 202 131 9 212 127 15 -350 40 -55 -64 -193 -97 -66 140 -61 106 137 252
7025 252 -70 202 167 3 386 -94 -13 -398 192 138 18 -192 108 -84 -23 211 440 79 -333 110 104 397
7047 397 -247 -206 -97 -182 -193 42 129 -154 -306 -114 71 -198 -112 314 -68 -411 -257 100 81 -9 -157 -264
7069 -264 -3 158 -27 -32 400 -60 247 268 368 -113 -100 -206 44 -320 -34 188 -170 122 -104 249 64
7090 64 112 179 77 -225 57 9 28 -53 -435 -210 18 -290 -232 53 85 -63 42 -32 -108 -2 -243 -100 -222
7113 -222 -563 -386 142 -145 -173 -92 -65 177 119 -211 287 -85 -8 45 230 103 -129 88 183 -32 -4 26 147
7136 147 -194 -193 -3 -214 -25 17 49 -156 -353 -84 102 174 85 208 -155 -26 111 -124 -257 -149 -272 -73
7158 -73 338 127 184 38 -143 -169 54 -6 1 -143 -209 -178 79 -185 76 -189 69 79 96 183 74 -51 -159 -155
7182 -155 462 13 -168 -94 3 -250 -124 -94 -26 179 40 302 154 86 -68 -69 -155 -31 30 24 86 -59 168 95
7206 95 157 107 -331 145 59 -251 -231 -7 -174 -33 -272 9 -79 -81 -128 319 -157 137 66 18 140 -191 0 -233
7230 -233 -286 -464 108 -16 236 -386 272 269 -177 -322 -46 95 -16 -362 231 187 140 130 -143 -43 55 -306
7252 -306 240 363 91 107 -32 60 262 -32 -8 -104 -318 19 73 -176 -350 82 129 68 265 378 200 333
7274 333 -107 -75 109 -1 -41 -358 -101 15 -258 -81 -45 -467 -173 67 312 125 -37 77 166 5 -221
7295 -221 271 518 -59 281 1 480 107 -242 332 203 -34 43 -191 313 109 -108 -31 -7 -29 -5 -100 -53
7317 -53 -152 -212 -10 73 -238 61 150 74 -79 -87 -57 -133 -169 -232 226 -95 -135 102 -59 22 -243 -102 115 -104 163
7342 163 42 102 -156 -72 96 -223 78 -112 65 404 -21 -9 -151 44 -101 68 -6 -237 -100 -250 50
7363 50 16 125 -163 -163 49 -320 -134 45 -102 350 -67 271 -76 -260 108 247 -34 -293 -7 77 316 -146
7385 -146 -173 18 -33 -139 -120 123 308 -86 288 -72 -12 -190 -241 81 -463 -159 -112 20 100 -159 4 252
7407 252 115 -113 240 266 167 43 49 -100 70 35 -46 149 -212 262 -14 -58 -244 -141 -226 -146 -27 6 647
7430 647 -135 -228 -360 61 268 -170 38 196 -83 -129 -4 268 62 -181 -387 274 -143 -84 -21 -127 -211 -146
7452 -146 -109 -56 160 -131 -98 277 178 -235 130 33 148 -50 68 42 -11 -172 -54 103 103 23 10 -45 -144 250
7476 250 73 565 207 276 -74 -75 -100 -28 112 48 -51 -53 223 -348 -105 -134 257 8 129 -115 50 -82 64
7499 64 -351 170 -18 39 183 -281 204 -80 134 -217 -209 -142 96 185 138 -33 -148 -153 -109 -182 190 -97 41 -44
7523 -44 145 512 19 27 372 -98 13 -7 93 65 9 -242 42 273 -69 -94 -6 92 -43 118 -190 -180 150
7546 150 -9 -183 20 -275 -124 -260 -168 -49 -31 54 -188 -114 -61 40 101 -239 132 -52 88 -310 -139 -98
7568 -98 49 -96 -193 75 8 -173 -115 75 57 238 34 -267 139 33 75 185 57 112 -64 216 -33 125
7590 125 108 -26 -61 -18 -107 64 34 -105 158 -58 308 236 172 -159 -310 7 3 -34 -204 233 188 138 18 -203
7614 -203 18 198 -136 39 15 -72 56 -15 77 -55 123 41 143 113 0 -39 -241 34 0 33 96 22 -83 249
7638 249 -210 -97 53 242 12 -85 -92 2 119 -185 139 342 -118 -102 167 250 113 197 -94 -76 71 40 152
7661 152 219 -56 -138 170 40 -208 230 113 -399 -129 1 55 -8 -43 187 -145 -77 -64 207 -195 -89 -170 77
7684 77 72 -203 178 277 -119 80 -6 13 -277 330 -25 -117 -333 198 299 118 -114 -77 46 172 250 -42 86
7707 86 176 -236 -177 200 -71 -21 -10 -66 -47 -179 -23 -29 -82 -125 -122 195 -110 -137 -59 46 -105 -115 -20 -164 29 -152
7733 -152 -326 -134 -21 -27 228 -219 -33 71 113 -41 -405 217 -256 -161 162 -37 248 -285 -264 208 -45 -58
7755 -58 31 181 -106 79 -152 284 3 -121 101 -144 1 -151 50 231 -226 -276 124 409 -15 -261 52
7776 52 102 -26 185 226 236 -84 -58 69 50 -30 105 49 18 -236 -290 82 -66 -5 10 2 66 -149 125 245 -6
7801 -6 -198 78 16 -35 129 86 289 -431 252 -6 113 62 -193 -128 189 -18 -183 101 -48 -105 -44 185 290
7824 290 125 77 -41 -249 -366 182 -21 112 173 -33 57 181 32 -202 -120 -10 -52 66 58 -8 -67 -125 -37 -164
7848 -164 304 37 -60 -201 -62 7 125 -558 -229 44 219 251 82 149 -202 -340 108 11 -46 517 128 -143
7870 -143 -96 292 238 13 -211 482 -255 -105 -110 136 283 -137 -205 -85 -191 -133 73 115 -86 98 144 17 -294
7893 -294 -282 248 289 -125 -207 -5 -108 113 -145 -98 21 -83 -100 379 -139 -260 -148 402 121 -309 251 1
7915 1 166 -338 83 335 -48 -146 -67 -51 110 -50 258 20 -100 62 230 -193 -44 -174 96 159 93 -52
7937 -52 -19 128 -101 -173 175 218 -357 -51 41 195 -358 95 -105 -339 30 -453 163 175 -370 -165 -235 -191 9
7960 9 96 244 110 -55 234 87 -162 125 150 134 -127 26 172 88 36 -8 -43 80 -56 45 312 139 -90
7983 -90 213 142 106 -138 42 168 -92 -67 -100 285 60 336 -21 29 -53 -77 -327 -8 -94 -163 35 -107 93
8006 93 22 -57 -206 2 -98 -9 -163 43 159 96 151 6 280 -32 -175 -203 -144 240 -111 -4 -180 -77 -181
8029 -181 116 225 -183 0 12 113 126 54 -129 301 -189 12 183 123 -46 -170 250 203 -216 1 162 58
8051 58 132 -85 -53 29 162 -216 -8 83 -282 12 -7 -87 -168 -218 -59 -477 200 -123 -82 -79 119 -124 -156 11
8075 11 -89 188 -261 104 295 -157 -175 -171 148 264 320 26 62 39 -310 156 128 219 203 274 184 -138 -115 72
8099 72 26 23 -98 -249 205 -65 -250 10 89 -414 -62 -116 396 179 -77 161 20 -182 -207 14 118 126 -261
8122 -261 -206 131 -126 246 80 -43 -46 38 268 -193 -34 -203 149 71 -336 158 266 311 21 -203 204 53
8144 53 -50 -332 40 139 -158 -167 146 -211 89 -85 82 -77 -172 118 78 33 -227 -283 261 -211 -63 299 252
8167 252 120 -244 30 62 -55 5 274 -61 -52 184 51 10 -250 -6 211 203 -70 94 -154 -134 -272 -171 115
8190 115 -5
8191e
##END NTUPLES=NMR FID
##END=
