##TITLE=1H_Costus-F-ACN-1
 CDcl3, 8 sc, 
 30.5.2019
##JCAMPDX= 6.0         $$ Bruker NMR JCAMP-DX V2.0
##DATA TYPE= NMR FID
##DATA CLASS= NTUPLES
##ORIGIN= UXNMR, Bruker Analytische Messtechnik GmbH
##OWNER= root
$$ XWIN-NMR		Version 3.5
$$ Thu May 30 13:26:59 2019 Russian Standard Time (UT+4h)  she@DPX200
##.OBSERVE FREQUENCY= 200.13155
##.OBSERVE NUCLEUS= ^1H
##.DELAY= (6, 6)
##.ACQUISITION MODE= SIMULTANEOUS
##.ACQUISITION SCHEME= undefined
##.AVERAGES= 8
##.DIGITISER RES= 18
##SPECTROMETER/DATA SYSTEM= spect
##.PULSE SEQUENCE= zg30
##.SOLVENT NAME= CDCl3
##.SHIFT REFERENCE= (INTERNAL, CDCl3, 0, 15.7039)
##AUDIT TRAIL= $$ (NUMBER, WHEN, WHO, WHERE, WHAT)
$$ ##TITLE= Audit trail, XWIN-NMR		Version 3.5
$$ ##JCAMPDX= 5.01
$$ ##ORIGIN= Bruker BioSpin GmbH
$$ ##OWNER= she
$$ F:/spectra/data/she/nmr/H-F/1/audita.txt
$$ ##AUDIT TRAIL=  $$ (NUMBER, WHEN, WHO, WHERE, WHAT)
(   1,<2019-05-30 13:25:57.71 +0400>,<she>,<DPX200>,
      <created by zg, POWCHK disabled, PULCHK disabled
       configuration hash MD5:
       00 E9 B6 7A A2 85 ED C7 34 08 36 98 17 FE 4E 26
       data hash MD5: 16K
       E5 2A AB 4B 2F CF 42 2B 73 F6 4C ED 68 51 20 DD>)
$$ ##END=
$$ 
$$ hash MD5
$$ C7 B4 3C 35 BE 55 50 0E 2C D8 1E 0E 5D A6 75 60
##$RELAX= 
##$RELAX= 
##$RELAX= 
##$RELAX= 
##$RELAX= 
##$RELAX= 
$$ Bruker specific parameters
$$ --------------------------
##$DU= <F:/spectra>
##$EXPNO= 1
##$NAME= <H-F>
##$PROCNO= 1
##$TYPE= <nmr>
##$USER= <she>
##$AMP= (0..31)
100 100 100 100 100 100 100 100 100 100 100 100 100 100 100 100 100 100 
100 100 100 100 100 100 100 100 100 100 100 100 100 100 
##$AQSEQ= 0
##$AQ_mod= 1
##$AUNM= <au_zg>
##$AUTOPOS= <>
##$BF1= 200.13
##$BF2= 200.13
##$BF3= 200.13
##$BF4= 200.13
##$BF5= 200.13
##$BF6= 200.13
##$BF7= 200.13
##$BF8= 200.13
##$BYTORDA= 1
##$CFDGTYP= 0
##$CFRGTYP= 5
##$CHEMSTR= <none>
##$CNST= (0..31)
1 1 145 1 1 1 1 1 1 1 1 1 1 1 1 1 1 1 1 1 1 1 1 1 1 1 1 1 1 1 1 1 
##$CPDPRG= <>
##$CPDPRG1= <>
##$CPDPRG2= <>
##$CPDPRG3= <>
##$CPDPRG4= <mlev>
##$CPDPRG5= <mlev>
##$CPDPRG6= <mlev>
##$CPDPRG7= <mlev>
##$CPDPRG8= <mlev>
##$CPDPRGB= <>
##$CPDPRGT= <>
##$D= (0..31)
0 1.2 0 0 0 0 0 0 0 0 0 0.03 0 0 0 0 0 0 0 0 0 0 0 0 0 0 0 0 0 0 0 0 
##$DATE= 1559208356
##$DBL= (0..7)
120 120 120 120 120 120 120 120 
##$DBP= (0..7)
150 150 150 150 150 150 150 150 
##$DBP07= 0
##$DBPNAM0= <>
##$DBPNAM1= <>
##$DBPNAM2= <>
##$DBPNAM3= <>
##$DBPNAM4= <>
##$DBPNAM5= <>
##$DBPNAM6= <>
##$DBPNAM7= <>
##$DBPOAL= (0..7)
0.5 0.5 0.5 0.5 0.5 0.5 0.5 0.5 
##$DBPOFFS= (0..7)
0 0 0 0 0 0 0 0 
##$DE= 6
##$DECBNUC= <off>
##$DECIM= 24
##$DECNUC= <off>
##$DECSTAT= 4
##$DIGMOD= 1
##$DIGTYP= 9
##$DL= (0..7)
0 120 120 120 120 120 120 120 
##$DP= (0..7)
150 150 150 150 150 150 150 150 
##$DP07= 0
##$DPNAME0= <>
##$DPNAME1= <>
##$DPNAME2= <>
##$DPNAME3= <>
##$DPNAME4= <>
##$DPNAME5= <>
##$DPNAME6= <>
##$DPNAME7= <>
##$DPOAL= (0..7)
0.5 0.5 0.5 0.5 0.5 0.5 0.5 0.5 
##$DPOFFS= (0..7)
0 0 0 0 0 0 0 0 
##$DQDMODE= 0
##$DR= 18
##$DS= 0
##$DSLIST= <SSSSSSSSSSSSSSS>
$$ [...]
##$SUBNAM2= <"">
##$SUBNAM3= <"">
##$SUBNAM4= <"">
##$SUBNAM5= <"">
##$SUBNAM6= <"">
##$SUBNAM7= <"">
##$SUBNAM8= <"">
##$SUBNAM9= <"">
##$SW= 24.9336996594482
##$SWIBOX= (0..15)
0 0 2 0 0 0 0 0 0 0 0 0 0 0 0 0 
##$SW_h= 4990.01996007984
##$TD= 16384
##$TD0= 1
##$TE= 0
##$TE2= 300
##$TE3= 300
##$TEG= 300
##$TL= (0..7)
0 120 120 120 120 120 120 120 
##$TP= (0..7)
150 150 150 150 150 150 150 150 
##$TP07= 0
##$TPNAME0= <>
##$TPNAME1= <>
##$TPNAME2= <>
##$TPNAME3= <>
##$TPNAME4= <>
##$TPNAME5= <>
##$TPNAME6= <>
##$TPNAME7= <>
##$TPOAL= (0..7)
0.5 0.5 0.5 0.5 0.5 0.5 0.5 0.5 
##$TPOFFS= (0..7)
0 0 0 0 0 0 0 0 
##$TUNHIN= 0
##$TUNHOUT= 0
##$TUNXOUT= 0
##$USERA1= <user>
##$USERA2= <user>
##$USERA3= <user>
##$USERA4= <user>
##$USERA5= <user>
##$V9= 5
##$VALIST= <valist>
##$VCLIST= <CCCCCCCCCCCCCCC>
##$VD= 0
##$VDLIST= <DDDDDDDDDDDDDDD>
##$VPLIST= <PPPPPPPPPPPPPPP>
##$VTLIST= <TTTTTTTTTTTTTTT>
##$WBST= 1024
##$WBSW= 4
##$XGAIN= (0..3)
0 0 0 0 
##$XL= 0
##$YL= 0
##$YMAX_a= 95556
##$YMIN_a= -176658
##$ZGOPTNS= <>
##$ZL1= 120
##$ZL2= 120
##$ZL3= 120
##$ZL4= 120
##$ABSF1= 10
##$ABSF2= 0
##$ABSG= 5
##$ABSL= 3
##$ALPHA= 0
##$AQORDER= 0
##$ASSFAC= 0
##$ASSFACI= 0
##$ASSFACX= 0
##$ASSWID= 0
##$AUNMP= <proc_1d>
##$AZFE= 0.1
##$AZFW= 0.1
##$BCFW= 1
##$BC_mod= 2
##$BYTORDP= 1
##$COROFFS= 0
##$CY= 11.3945322036743
##$DATMOD= 1
##$DC= 2
##$DFILT= <>
##$DTYPP= 0
##$F1P= 18.9103706918063
##$F2P= -1.10871071338519
##$FCOR= 0.5
##$FTSIZE= 0
##$FT_mod= 4
##$GAMMA= 1
##$GB= 0.15
##$INTBC= 1
##$INTSCL= 1
##$ISEN= 128
##$LB= 0.24
##$LEV0= 0
##$LPBIN= 0
##$MAXI= 10000
##$MC2= 0
##$MEAN= 0
##$ME_mod= 0
##$MI= 1.114404
##$NCOEF= 0
##$NC_proc= 0
##$NLEV= 6
##$NOISF1= 3.799351
##$NOISF2= 2.8
##$NSP= 1
##$NTH_PI= 0
##$NZP= 0
##$OFFSET= 15.70392
##$PC= 1
##$PHC0= -8498.182
##$PHC1= 13.60023
##$PH_mod= 1
##$PKNL= yes
##$PPARMOD= 0
##$PSCAL= 0
##$PSIGN= 0
##$REVERSE= no
##$SF= 200.130013532006
##$SI= 16384
##$SIGF1= 3
##$SIGF2= 2
##$SINO= 400
##$SIOLD= 16384
##$SREGLST= <1H.CDCl3>
##$SSB= 0
##$STSI= 0
##$STSR= 0
##$SW_p= 3612.71676300578
##$SYMM= 0
##$S_DEV= 0
##$TDeff= 0
##$TDoff= 0
##$TI= <>
##$TILT= no
##$TM1= 0
##$TM2= 0
##$TOPLEV= 0
##$USERP1= <user>
##$USERP2= <user>
##$USERP3= <user>
##$USERP4= <user>
##$USERP5= <user>
##$WDW= 1
##$XDIM= 8192
##$YMAX_p= 0
##$YMIN_p= 0
$$ End of Bruker specific parameters
$$ ---------------------------------
##NTUPLES= NMR FID
##VAR_NAME=  TIME,          FID/REAL,        FID/IMAG
##SYMBOL=    X,             R,               I
##VAR_TYPE=  INDEPENDENT,   DEPENDENT,       DEPENDENT
##VAR_FORM=  AFFN,          ASDF,            ASDF
##VAR_DIM=   8192,          8192,            8192
##UNITS=     SECONDS,       ARBITRARY UNITS, ARBITRARY UNITS
##FACTOR=    0.0002004,     1,               1
##FIRST=     0,             0,               0
##LAST=      1.6414764,     0,               0
##MIN=       0,             -176658,         0
##MAX=       1.6414764,     95556,           0
$$ Real data points
##PAGE= N=1
##DATA TABLE= (X++(R..R)), XYDATA
0 0 0 0 0 0 0 0 0 -6 8 -8 8 -8 16 -16 23 -24 32 -37 40 -48 57 -70 80 -93 105 -121 137 -158 179 -200 229
31 229 -255 287 -320 358 -399 445 -493 547 -607 672 -743 823 -913 1010 -1120 1245 -1386
48 -1386 1547 -1736 1957 -2221 2543 -2950 3475 -4189 5220 -6844 9804 -16947 72741 8276
62 8276 -145044 -15195 75511 8701 -79726 -7010 63849 28774 -36383 -15103 13615 -3240
74 -3240 -31462 -13154 9338 10551 348 8250 12110 -1936 -24604 -21761 3197 18613 2782
87 2782 -10957 -1252 9728 -3116 -16189 -9131 3753 4301 1724 283 -3577 -10094 -8615 -1747
101 -1747 3860 6731 3145 -5976 -3910 12350 18203 1384 -11151 -879 12009 11133 7850 4722
115 4722 -5441 -9459 4518 13925 675 -9576 3291 10125 -6568 -14723 4460 18142 3548
128 3548 -10844 -4383 4622 2231 -2101 -2909 -6700 -7079 3648 12178 3106 -12424 -13295 -1789 3700
143 3700 -2097 -8238 -4819 2862 4017 -2982 -7728 -6215 -4359 -4647 -687 7148 7705 -249 -6314 -3001
159 -3001 3147 5171 3780 1846 632 2128 6288 7505 2630 -3702 -5779 -2139 4101 8424 6957
174 6957 2760 -467 -2927 -2424 3143 8364 3142 -6169 -4251 7511 10046 -510 -7746 -4911 -1371
189 -1371 -2392 347 2693 -1210 -6522 -3278 3674 1136 -6148 -7774 -3554 -1090 -1966 -1329 -1146 -3260
205 -3260 -5158 -3440 755 3458 1596 -3011 -3213 1273 5862 4835 -1479 -4787 -2250 3011 6179
220 6179 4701 794 -2119 -2262 901 4821 5934 2521 -392 746 5080 6651 4233 208 -3694
235 -3694 -3939 531 5542 4684 -1512 -3918 328 3098 755 -1978 -2078 -2767 -3073 -969 1729 -38
251 -38 -5329 -6887 -3889 -4 959 -871 -4408 -5606 -2643 1516 1578 -897 -3134 -2838 -828 2605 3726
268 3726 334 -5907 -7233 -1307 4707 5473 2504 -175 -389 1539 4361 4311 1679 -1825 -1360 2769
284 2769 5967 6168 2234 -585 -1659 -222 2958 4112 1459 -1805 -1635 1905 4112 2211 -1201 -3123
300 -3123 -2961 -1510 165 -458 -2725 -4289 -3025 192 2181 371 -3142 -5690 -4635 -1108 2192 476
316 476 -3651 -5052 -2057 1275 1339 -1507 -4280 -4396 -1366 3166 5089 2721 -1425 -2933 -852 2625
332 2625 4926 3860 418 -969 1014 4124 4771 1544 -1655 -835 1866 4526 5555 3963 106 -2813
348 -2813 -1397 2716 3595 460 -2405 -1471 981 2216 962 -2088 -4438 -3759 -535 2442 1456 -2284
364 -2284 -4167 -3787 -1672 156 392 -2431 -5473 -4404 -542 1887 -432 -3902 -4742 -2180 2055 3583
380 3583 2064 -1404 -3360 -2499 563 2980 3246 1377 -1132 -1123 2053 4688 2943 -998 -2423 1202
396 1202 5121 6148 3507 885 -373 342 1198 2892 1816 -976 -1892 887 3058 3239 538 -2268
412 -2268 -2750 -357 1642 1917 -1411 -4950 -3986 -415 1187 -287 -2599 -4276 -4825 -2460 649 1515
428 1515 -1476 -4295 -3458 48 2530 1637 -1634 -4421 -4276 -606 3130 2479 233 -1910 -1005 819
444 819 2758 3253 1179 -1054 -603 2809 5123 3050 99 -1356 137 2581 4163 3123 848 -354
460 -354 533 1929 2263 1014 -882 -1235 217 2681 3154 389 -3589 -5078 -2594 1198 1589 -863 -3488
477 -3488 -3201 -1438 552 866 -1091 -4110 -5127 -2298 1551 1735 -1062 -3548 -3660 -1911 1332 2756
493 2756 -339 -3476 -2818 752 2947 2073 608 -89 -590 534 3063 3722 926 -2111 -903 2351
509 2351 3989 3049 1376 -13 672 2658 4031 2217 -860 -2030 -302 2034 2933 1952 -511 -2788
525 -2788 -2434 377 2824 806 -3718 -4561 -1399 1852 1841 -595 -3272 -4302 -3441 -598 875 -562
541 -562 -2912 -3684 -2283 200 1411 721 -2138 -3433 -1890 1608 2949 638 -1452 -1598 -400 1067
557 1067 2315 1961 -424 -722 1419 3543 3407 1063 -428 318 2498 3927 3140 1025 -1041 -1011 1457
574 1457 3226 2469 -350 -1721 -624 1472 2571 1473 -1170 -3192 -2696 438 1901 451 -2912 -4334
590 -4334 -3061 -408 1407 501 -2019 -4157 -3164 -1117 -120 66 -484 -2445 -2677 -671 2562 1014 -3007
607 -3007 -4160 -998 2164 2450 1533 36 -914 324 2093 2506 540 -634 481 1814 2783 3020 2050
624 2050 -427 -1669 897 4640 4078 679 -1850 -738 978 2498 2447 651 -2019 -2381 176 2392
640 2392 1336 -1528 -4112 -3661 -1089 1980 2286 -818 -3492 -4065 -2056 130 284 -1730 -3326 -2535
656 -2535 -304 968 350 -1751 -3589 -2649 359 2660 1339 -991 -1573 -444 841 1589 1304 63
672 63 -632 659 3078 2944 875 -177 -334 306 2310 3919 3380 150 -1556 335 3041 2851 1158
689 1158 -1320 -1470 170 2364 2484 -139 -2605 -2037 -706 825 1442 430 -2315 -4084 -2249 808
705 808 979 -1335 -3026 -2652 -1420 -498 -252 -1189 -2763 -2514 -499 1615 1006 -577 -2274 -1778 -301
722 -301 1271 1461 63 -994 -213 1455 2807 1540 -475 -1187 410 2551 3721 3012 512 -1604
738 -1604 -382 2632 4061 2129 -755 -1168 430 1743 2518 1884 -1349 -2356 -717 1982 2697 573
754 573 -1862 -3229 -2311 -260 1587 705 -2777 -3721 -1990 73 427 -916 -2478 -3071 -1555 659 1007
771 1007 -574 -2673 -2576 -574 617 994 217 -906 -1438 -1000 1855 2800 411 -1866 -1023 2292 3337
788 3337 1844 443 -156 311 1270 3107 2955 742 -965 250 1831 3118 2338 275 -1833 -1155 1299
805 1299 2843 1409 -871 -1722 -804 -56 801 833 -1405 -3103 -2504 -19 1364 -280 -2349 -3164 -2160
822 -2160 -529 167 -742 -1861 -2589 -1426 472 651 -360 -1800 -2232 -367 1150 1760 236 -1468 -1554
839 -1554 302 2374 2421 456 -988 -244 1713 2981 2306 722 -896 -858 1673 3946 2821 508 -910
856 -910 -657 805 2684 3030 798 -1886 -1444 628 1998 969 -958 -2443 -2259 -516 1642 1298 -1484
873 -1484 -3479 -2334 -682 230 255 -959 -2649 -2505 -535 721 -294 -2297 -2562 -1225 55 1318
889 1318 629 -1200 -2211 -839 1363 2271 1320 -847 -814 290 1792 1995 1060 -212 -565 595 2573
906 2573 3243 1626 -757 -1255 547 2903 3069 1445 -295 -1251 -80 1801 1792 -114 -1663 -1268 96
923 96 1196 1232 -18 -2248 -2807 -1070 737 436 -1336 -1912 -2183 -1397 -137 -134 -1913 -2578 -1895 100 825
942 825 -401 -1473 -2115 -1352 124 1913 1565 -811 -1797 -548 1097 2120 1025 -454 -558 594 2707
959 2707 3366 1905 -466 -1470 -162 2280 3305 1948 65 -1075 -239 1424 2509 817 -1036 -1475
975 -1475 321 1934 1614 300 -1502 -2138 -1094 274 1670 -141 -2368 -2536 -1416 -50 25 -635 -1784
992 -1784 -2631 -955 705 638 -1674 -3012 -2003 -380 890 937 -406 -1822 -1790 272 1983 1356 -125
1009 -125 -476 49 1157 2402 2016 338 -867 -482 1633 3124 2081 442 -789 -369 1260 2657
1025 2657 2017 710 -501 -96 1164 1939 694 -829 -1756 -952 524 958 588 -1370 -2443 -1684 243
1042 243 794 -257 -1956 -1906 -1157 104 177 -700 -2574 -2994 -1174 732 445 -1253 -2238 -1883 -354 1063
1060 1063 1695 362 -1190 -1069 639 1856 1321 98 -477 -674 781 2416 2501 815 -1071 -261 1200
1077 1200 2707 2296 1127 -274 -258 1365 2514 1735 2 -1207 -994 594 1437 1107 -536 -1552 -1201
1094 -1201 315 1511 299 -1507 -2683 -1559 -83 526 -542 -1792 -2693 -2125 -198 395 -484 -2553
1110 -2553 -2147 -865 565 946 135 -1051 -1766 -1062 601 1493 501 -1304 -1602 225 1814 2268 855
1127 855 -562 -143 923 2321 2352 801 -320 -650 847 2077 2310 1145 -289 -736 573 1678 1532
1144 1532 133 -1048 -710 469 1631 979 -779 -1994 -1762 -443 469 -63 -1259 -2270 -1885 -493
1160 -493 714 206 -1223 -2590 -1639 -329 222 -310 -1403 -2288 -1697 108 1280 676 -696 -2006 -877
1177 -877 766 2150 1326 -303 -787 68 1589 2330 1293 -151 -725 182 1821 2422 952 -154 -660
1194 -660 577 2088 2177 1738 196 -950 74 1200 1344 72 -1436 -979 311 854 844 -524 -1911
1211 -1911 -1700 -613 173 702 -422 -1809 -1905 -998 273 156 -1606 -2632 -1773 -73 753 415 -840
1228 -840 -2024 -1223 378 1439 743 -62 -1203 -1305 222 1853 1590 -87 -808 -21 1948 2297 1458
1245 1458 -152 -361 -152 1718 2411 1750 618 -476 -168 728 1807 984 -436 -1072 153 1432 1313
1262 1313 330 -768 -1369 -393 252 1179 -165 -1952 -1857 -1142 40 596 -1013 -2151 -1932 -827 449
1279 449 466 -695 -2001 -1891 -529 1130 959 -31 -1376 -1601 -534 694 981 84 -661 -410 741 2156
1297 2156 2019 713 -647 -302 1029 2077 1822 507 -332 565 1117 1530 945 360 -261 -366 669 1638
1315 1638 1217 -207 -1092 -162 699 1044 -41 -1471 -1984 -1129 183 770 -259 -1495 -1867 -836 324
1332 324 432 -477 -1670 -2367 -1298 536 862 -211 -1868 -2058 -909 862 1124 -4 -1072 -1250 -258
1349 -258 1393 1908 516 -467 -692 122 1808 2045 895 -428 -851 495 1891 1890 772 254 194 880
1367 880 1526 1249 97 -798 -406 424 1093 844 -346 -1245 -995 -450 870 491 -699 -1905 -959 370
1385 370 566 -275 -1410 -1886 -1617 -463 84 -751 -1671 -1755 -1042 512 1173 347 -1038 -1263 -852 581 1309
1404 1309 236 -701 -784 -36 733 1304 780 -101 -472 248 1677 1897 671 -256 50 815 1709 1629 607
1423 607 -573 -966 342 1241 1190 -142 -779 -456 597 1238 1191 -105 -1834 -1751 -217 890 1 -1222
1441 -1222 -1829 -1428 -546 483 528 -852 -2143 -1906 -208 637 417 -763 -1388 -1598 -270 1096 894 -634
1459 -634 -1715 -986 602 1122 1132 179 -617 34 982 1674 1307 289 -830 -87 1022 1621 1100 95
1477 95 -205 372 1106 1632 897 -296 -682 558 1174 1066 408 -393 -930 -658 408 818 -749 -1761 -1467
1496 -1467 -578 201 416 -493 -1501 -1649 -711 322 14 -1069 -1812 -1419 -173 493 561 -583 -1642 -1452
1514 -1452 -225 902 732 -420 -610 -544 727 1202 925 147 -595 -242 991 1508 1244 -369 -284 920
1532 920 1454 2342 1461 170 -434 240 1354 1312 511 -452 -910 -368 845 1520 418 -960 -1694 -788 630
1551 630 1307 -138 -1371 -1586 -1252 408 626 -800 -2133 -2396 -952 296 388 -209 -762 -1361 -644 760
1569 760 870 -35 -1068 -1178 -786 646 1000 135 -576 -373 408 1811 1458 361 -99 84 930 1470 1507
1588 1507 653 -277 -103 895 1583 1072 -318 -953 -462 1158 1395 1354 -194 -682 -61 906 963 63 -1236
1607 -1236 -1738 -1169 -248 337 28 -1097 -1650 -953 167 709 -149 -1387 -1554 -929 -28 421 0 -1145
1625 -1145 -1434 -918 210 809 -115 -916 -1212 10 1376 1235 658 -335 -180 729 1093 877 165 -86 -154
1644 -154 869 1765 1454 622 -656 -325 475 2010 1409 36 -907 -609 746 1607 770 -702 -1167 -1155
1662 -1155 79 527 401 -585 -1721 -1445 -80 604 216 -920 -1823 -1325 -378 567 -362 -1378 -1468 -1151
1680 -1151 173 413 242 -792 -701 -749 374 774 549 -181 -1212 -160 994 1379 405 -528 -639 178
1698 178 1121 1279 1090 -84 2 825 1636 1525 342 -667 -518 240 1165 1165 -76 -829 -749 -153 905 974
1718 974 -336 -1181 -1062 -429 429 547 -275 -1570 -1542 -969 -45 293 -1057 -1897 -1290 -476 519 541 -527
1737 -527 -954 -940 179 141 232 -945 -1173 -756 162 1117 1086 -341 -769 72 1244 1514 946 -329 -136 505
1757 505 1113 1664 586 -1 -332 114 1077 1445 1026 -395 -786 145 1465 1712 500 -680 -1358 -504
1775 -504 345 646 -261 -1159 -1455 -528 73 383 -173 -1191 -1896 -855 157 285 -774 -1252 -986 -735 215
1794 215 186 -635 -1078 -886 -408 182 390 31 -602 -508 1016 1618 1121 130 -898 -336 999 1146 924 29
1814 29 -277 197 1323 1931 1531 183 -482 -478 437 1398 1063 -324 -839 -415 731 898 186 -977 -1398
1833 -1398 -773 557 266 -426 -411 -724 -1106 -326 281 -351 -1393 -1700 -1110 -88 235 -109 -823 -1240 -318
1852 -318 782 448 -451 -972 -442 349 683 659 229 -485 -402 133 1263 898 175 -752 -398 910 1878 1463
1872 1463 372 -294 10 700 1414 1073 309 -845 -912 436 1338 1239 -145 -806 -569 284 749 37 -617
1891 -617 -1176 -965 108 110 -410 -661 -1634 -913 -129 109 -303 -1366 -1403 -663 171 698 40 -848 -1424 -306
1911 -306 545 629 -154 -866 -780 75 899 1318 557 -369 -390 521 1216 1597 519 -376 -508 550 1533 1517 518
1932 518 -438 -440 283 1014 913 331 -617 -511 39 754 758 -204 -1084 -880 -270 654 -10 -661 -1081 -867 99
1953 99 43 -253 -1047 -1574 -1133 -338 449 -280 -1085 -1662 -777 268 414 -297 -1143 -940 -589 731 1279 392
1973 392 -306 -538 293 1100 1350 1091 -428 -680 194 1310 1374 960 -201 -80 493 1486 1497 707 -302
1992 -302 -470 18 983 866 283 -497 -622 -349 404 543 -186 -638 -1071 -12 378 300 -513 -1128 -1155 -413
2012 -413 321 -100 -713 -1208 -923 -299 223 373 -576 -1364 -651 558 1121 650 -782 -1357 -422 878 1105
2031 1105 627 84 -253 -456 804 1403 1043 40 -341 78 1100 1542 1040 -150 -787 -129 874 1093
2049 1093 391 -388 12 -48 601 958 347 -555 -991 -622 245 372 -512 -907 -906 -394 -160 239 -536 -1606
2069 -1606 -1409 -345 360 204 -692 -1210 -929 -371 154 282 -490 -1058 -1084 334 1050 959 -406 -715 -412
2088 -412 510 1306 870 464 -562 -199 1153 1128 1019 186 -132 43 486 1424 980 -369 -564 146 992
2107 992 979 573 -151 -564 -176 417 733 -30 -882 -854 -645 394 164 -515 -762 -1307 -506 400 217 -741
2127 -741 -1665 -1150 -351 309 311 -230 -1327 -1479 -638 585 692 -320 -984 -715 89 844 1215 241 -579 -618
2147 -618 107 1463 994 385 -48 152 653 1045 1467 572 71 -572 228 1490 826 159 -542 28 127 501
2167 501 690 -332 -630 -619 419 600 -392 -794 -754 -902 432 387 -68 -1300 -1834 -802 -132 246 -484
2186 -484 -1139 -1124 -562 150 452 -123 -948 -1283 -321 566 798 45 -378 -962 -92 861 1131 440 -555 171
2206 171 647 1166 650 710 -9 -59 380 1354 1090 91 -188 -111 411 1125 759 169 -773 -300 529 895 265
2227 265 -863 -816 -365 -103 234 150 -404 -1225 -1170 -23 512 -148 -1297 -1494 -723 58 423 195 -909 -1343
2247 -1343 -833 110 550 380 -572 -929 -568 274 1218 718 -374 -1069 -221 1032 1165 489 21 13 78 835
2267 835 1596 796 268 -207 603 1064 913 358 -311 -82 185 903 935 261 -717 -605 38 583 306 -479
2287 -479 -764 -1008 10 464 171 -722 -1510 -1022 -298 286 488 -778 -1200 -1201 -113 581 -8 -613 -1070 -730
2307 -730 -81 528 485 -196 -598 -404 618 1081 785 -120 -377 196 700 1249 993 57 -205 160 950 1109
2327 1109 411 106 -160 589 872 1464 719 -323 -618 174 895 540 -445 -788 -821 -300 441 764 -19 -826
2347 -826 -1109 -481 355 455 -443 -1078 -1184 -552 222 83 -299 -1327 -1206 -318 459 251 -302 -918 -796 287
2367 287 717 883 -7 -403 -247 582 1038 768 254 -203 -169 837 944 881 -54 -45 277 955 1059 794 -23
2388 -23 -410 -96 734 728 517 -694 -437 99 668 910 -49 -847 -865 -81 250 356 157 -1005 -1572 -544
2408 -544 284 333 0 -1043 -1157 -576 401 263 -315 -923 -1256 -39 372 458 -143 -501 -640 177 815 506
2428 506 210 -193 -133 623 906 731 36 -206 -61 925 1437 674 -82 -341 145 693 678 806 3 -531 -259
2449 -259 585 1035 453 -451 -895 -451 442 618 -36 -917 -1249 -802 -11 18 -147 -776 -1345 -979 -204 279
2469 279 65 -1099 -1135 -565 299 364 -136 -781 -870 -260 346 712 156 -226 -500 299 578 852 493 -135 160
2490 160 464 773 1103 -259 -319 -91 364 991 708 148 -554 -180 471 900 892 164 -622 -842 258 599
2510 599 370 -374 -1022 -945 10 456 327 -675 -1235 -1074 -41 -24 -76 -665 -1066 -836 108 300 7 -501
2530 -501 -1012 -248 -30 505 138 -560 -644 -158 525 699 433 -126 -171 333 956 859 441 -73 -100 294 796
2551 796 973 489 15 -247 634 796 1262 298 -428 -661 171 517 763 -101 -535 -443 -69 549 106 -134
2571 -134 -919 -819 -446 291 354 -421 -1054 -941 -317 312 -118 -466 -814 -746 -222 600 253 -205 -798 -129 168
2592 168 310 287 -291 -676 -79 300 785 629 339 -140 200 620 956 616 -197 -364 -193 910 1120 602
2612 602 -266 -427 66 754 1128 150 -109 -478 175 431 670 144 -481 -863 -294 171 56 -363 -601 -688
2632 -688 -577 338 379 -39 -772 -966 -536 233 69 -368 -641 -1026 -177 413 -76 -311 -675 -516 415 319 405
2653 405 150 -527 42 312 897 929 -255 -356 -17 996 1197 881 129 -666 24 1160 947 617 -34
2672 -34 -381 -193 402 887 351 -265 -561 -244 195 543 -22 -618 -900 -333 -29 90 -313 -488 -743 -370
2692 -370 20 96 -540 -436 -893 -596 199 251 -343 -1104 -636 115 629 728 36 -602 -535 -4 1024 554 -86
2713 -86 -258 -48 374 1054 709 158 -498 225 648 1140 1153 252 -383 -257 568 997 306 36 -392 -383 256
2734 256 513 813 -234 -803 -444 88 478 125 -668 -944 -582 -94 68 -194 -638 -883 -555 -369 -103 -171
2754 -171 -936 -927 -192 518 352 -190 -624 -551 -394 588 532 -56 -371 -711 149 789 883 295 -125 -108 620 779
2776 779 971 444 -357 -267 242 692 662 184 -216 12 142 771 794 103 -429 -28 344 415 257 -116 -1009
2797 -1009 -640 -296 -104 -16 -563 -847 -561 228 97 -46 -768 -725 -555 92 364 438 -1089 -786 -388 541
2817 541 146 -136 -534 -375 -175 657 814 434 -133 -349 192 1128 957 18 -117 -528 41 909 933 683
2837 683 -354 -154 261 795 697 427 -281 -444 -351 694 497 -150 -373 -503 -303 44 114 -595 -431 -673
2857 -673 -271 216 52 -475 -1172 -606 -396 -39 -64 -677 -691 -844 -33 638 155 -341 -574 -357 320 365 328
2878 328 46 -387 -137 467 741 388 -135 -268 112 903 984 425 96 -247 65 821 1005 90 -248 -336 18
2899 18 561 528 266 -313 -202 -54 392 416 81 -550 -885 -82 356 166 -228 -441 -910 -334 413 -385 -264
2920 -264 -869 -769 -59 454 42 -319 -954 -293 279 622 177 -616 -583 -450 -74 1009 530 -421 -233 -82
2940 -82 405 578 739 -26 -245 -66 322 975 746 148 -126 -77 384 723 437 109 -232 -73 241 577 415
2961 415 -308 -481 -192 -224 22 -342 -780 -954 -303 209 137 -109 -852 -686 -294 47 273 -514 -928 -555 113
2982 113 250 237 -517 -682 -338 -148 438 522 45 -670 -218 276 704 944 140 -261 -351 352 435 788 33
3003 33 -283 -154 751 934 767 206 -466 -27 280 622 -97 105 -114 -215 220 -5 257 -616 -493 -354
3023 -354 225 308 -90 -375 -591 -432 221 147 103 -954 -993 -377 127 193 -680 -566 -617 -109 449 170 -81 -328
3045 -328 -738 -154 606 534 64 -14 -218 304 621 541 112 -10 -109 398 788 845 430 314 208 326 439 347
3067 347 230 43 -28 555 472 168 -169 -506 -384 118 318 133 -273 -880 -520 -166 44 -215 -259 -683 -672
3088 -672 320 113 -370 -814 -605 -256 377 256 -149 -467 -595 -29 218 673 197 -525 -203 96 353 388
3108 388 463 208 -22 72 638 461 461 101 -433 376 626 855 211 -209 187 188 397 652 209 -155 -437 96
3130 96 584 403 -89 -683 -663 221 152 12 -592 -878 -512 116 555 37 -436 -1259 -571 -217 274 -226 -581
3151 -581 -673 -515 -58 170 113 -235 -326 -452 299 766 309 -539 -141 70 498 566 378 -217 -542 -18 704
3172 704 549 184 413 -115 387 572 523 375 -317 -503 150 826 353 -191 -223 -293 -51 252 390 -118 -579
3193 -579 -594 236 171 59 -416 -736 -629 140 473 -16 -644 -675 -791 18 276 378 48 -496 -694 12 421
3214 421 372 -73 -431 -461 473 511 646 308 13 -121 176 691 459 133 -312 442 678 738 363 41 -114
3235 -114 144 564 663 227 -52 -75 52 613 701 -142 -444 -473 122 453 529 -312 -505 -937 -215 153 260 -171
3257 -171 -332 -888 -543 238 255 -202 -951 -511 -171 336 597 -228 -991 -420 152 68 34 54 -91 -70 271 490
3279 490 393 113 -381 -16 434 773 302 443 -67 212 501 438 253 -29 -388 50 138 644 507 -485 -447
3300 -447 -156 126 490 82 -291 -734 -195 -108 98 -159 -575 -592 -465 296 263 -98 -586 -753 -564 46 99
3321 99 -29 -583 -577 -101 7 558 -18 -391 -406 -95 455 365 84 110 -134 -51 660 576 62 -80 -105 522 942
3344 942 680 258 -115 -80 466 630 639 -106 -365 -175 354 616 249 34 -398 -274 83 244 95 -278 -597
3365 -597 -726 -76 215 126 -587 -756 -337 -378 127 -110 -449 -682 -450 -171 425 42 -213 -167 -255 122 433
3386 433 41 -457 -294 327 686 553 121 65 39 -48 494 679 213 -354 -300 327 644 499 198 -23 -461
3407 -461 184 541 404 -38 -251 -360 -96 441 264 -34 -561 -404 85 -56 71 -267 -505 -562 0 246
3427 246 230 -239 -694 -661 -198 104 315 -49 -464 -349 -101 240 132 -298 -468 -128 203 256 334 5 -78 281
3449 281 586 143 349 49 -180 35 629 870 368 73 -140 491 688 631 190 -142 -266 117 316 434
3469 434 13 -136 -215 -260 310 289 -205 -685 -703 -287 106 179 -203 -551 -434 -87 126 -258 -141 -595 -511 -263
3491 -263 153 157 -201 -687 -559 -17 125 5 -116 -265 -161 358 614 251 -200 -74 -82 469 417 233 -41 -83
3513 -83 -79 586 512 172 -121 -199 -173 195 659 281 57 -413 29 597 394 83 -339 -259 -198 5 272 -79 -407
3536 -407 -688 -233 85 497 -406 -688 -324 -285 125 19 -50 -405 -517 -117 498 219 -40 -379 -494 33 491
3557 491 452 -20 -172 -169 310 770 375 386 -111 -142 634 524 481 136 -423 5 492 522 363 84 -5 -60 298
3580 298 646 147 49 -49 -42 26 423 341 -75 -340 -295 256 221 -61 -699 -535 -193 -56 2 -127 -430 -581 -56
3603 -56 327 -93 -8 -322 -458 -220 106 200 237 -410 -311 45 516 593 60 -126 -58 298 749 592 283 -211
3625 -211 -98 279 637 386 199 -164 -166 219 505 588 55 -50 -407 553 506 128 53 -327 -270 -36 626 199
3647 199 -331 -558 -554 -81 -77 -135 -340 -437 -449 153 61 -11 -217 -363 -494 -136 15 -26 -303 -369 -82 478 482 72
3671 72 -547 -164 130 458 500 214 -242 -290 235 723 887 330 -80 -222 382 452 517 85 -357 -251 193 424
3693 424 203 126 -514 -364 29 338 336 -175 -633 -270 -86 161 -12 -14 -485 -497 -93 139 20 -353 -481 -268
3715 -268 52 -26 -266 -358 -598 -271 23 287 -88 -131 -261 -13 201 452 267 -84 -373 63 313 427 324
3736 324 -181 -154 66 402 361 298 -381 -61 36 358 444 163 -2 -69 232 337 515 71 -368 -389 65 166
3758 166 125 194 -635 -254 -213 -138 162 -320 -499 -630 86 50 10 -297 -508 -368 -17 50 -19 -336 -694 -419 35
3781 35 423 119 -313 173 -425 111 172 112 127 -177 142 347 415 147 -67 19 -219 645 663 544 308 -15
3803 -15 -96 325 479 -1 72 214 55 150 47 69 -18 -693 166 246 81 -174 -698 -311 -5 -23 -91 -182 -555
3826 -555 -520 -337 -43 394 56 -316 -460 -90 89 77 -158 -238 -162 -118 268 271 -242 -336 -163 60 368 486 331
3849 331 -50 -156 213 623 453 177 -97 180 405 416 240 284 -246 -59 -261 263 284 60 -233 -191 42
3870 42 342 -93 -257 -184 -328 115 144 128 -340 -193 -300 -63 -35 -205 -355 -462 -266 136 111 97 -243 -497
3892 -497 -100 101 390 -164 -115 -450 81 264 251 441 -266 -488 185 151 349 144 148 26 102 601 619 221
3914 221 11 -173 151 619 352 -68 -144 44 -155 370 217 -13 -322 -344 67 20 -158 -438 -346 -430 -35 177
3936 177 -96 -419 -417 -71 -173 -93 -189 -413 -353 -317 124 265 -27 -221 -501 -39 210 425 249 -597 -315 -65
3958 -65 306 488 347 138 -174 47 351 231 361 -220 -413 401 305 373 488 -156 81 288 179 554 -49
3979 -49 -322 -86 65 354 190 -39 -346 -467 -28 120 28 -121 -137 -22 -95 64 -107 -373 -706 -319 146
4000 146 174 113 -364 -307 -274 346 130 -180 -175 -469 143 146 414 281 -42 -418 -49 263 324 527 -233 -101 327
4023 327 339 226 208 64 -144 187 284 365 152 -346 -170 116 -11 595 -88 -482 -328 -206 22 134 137 -217
4045 -217 -520 -333 225 -8 -99 -557 -383 -346 103 114 -297 -454 -520 -42 386 203 -144 -504 -97 -287 268
4066 268 198 -246 -409 -148 391 163 176 -60 -348 -1 167 371 386 242 20 -69 490 210 43 -49 -536 28
4088 28 233 49 -21 -199 -388 -174 306 113 -33 -178 -205 -397 169 -13 195 -152 -349 -180 71 38 -252
4109 -252 -205 -739 -535 -264 41 139 -432 -356 -128 289 -48 -99 -76 -293 -188 327 626 -215 47 -189 187 387
4131 387 251 83 -324 -8 -39 436 125 -133 114 164 -38 293 218 16 -278 -139 399 57 -40 -119 -434 -264
4153 -264 182 164 92 -3 -546 -142 148 -52 -24 -236 -308 -42 21 -311 -33 -429 -436 -450 0 111 -159 -225 -256 -185
4177 -185 33 545 130 -343 -126 229 562 -60 234 154 -137 28 468 502 92 -66 -197 159 481 540 264
4198 264 -234 -190 -35 354 302 -78 -43 -347 158 157 95 -163 -209 -610 -44 282 -199 -217 -324 -331 173 268 94 22
4222 22 -447 -426 -360 -14 -127 -325 -400 -113 213 -319 121 -228 -506 181 433 130 206 -75 -85 326 315 236 193
4245 193 -101 137 33 517 287 -7 222 -71 -54 247 386 210 -85 89 1 258 123 57 -5 -239 -171 18
4267 18 302 -236 -152 -249 -11 191 151 -216 -433 -355 38 578 159 -171 -635 -237 -163 68 -161 -396 -320 -172
4289 -172 -27 -92 -61 37 -216 4 256 316 45 303 -165 82 -15 310 338 -10 121 -42 443 249 146 185
4311 185 -441 -29 359 -6 61 -43 -100 91 431 248 45 -139 -233 -160 145 324 36 -138 -411 -102 113
4332 113 56 235 -614 -321 -111 170 153 -62 -272 -259 -10 248 286 -176 -151 46 75 151 -15 23 -83 -361 156
4355 156 264 186 14 -27 85 326 331 74 -2 -70 299 474 378 89 -115 -396 59 -63 406 258 -50 -59 96
4378 96 384 186 95 -256 -172 30 -278 -89 110 -195 -369 -94 52 80 220 -463 -411 -130 66 208 -88 -369
4400 -369 -302 -207 333 528 -216 -366 -97 -182 164 243 39 -108 31 113 482 332 -311 -109 -95 30 374 204
4422 204 -245 -344 -44 105 547 489 -187 -269 -92 6 282 -81 -206 -530 -362 306 243 33 -111 -300 -249 -69
4444 -69 177 -7 -247 -240 -251 -149 131 -95 -477 -283 -269 133 -34 -132 -91 -136 4 203 27 -97 -291 -174 217
4467 217 385 271 233 -23 -41 152 267 195 40 -68 -158 334 63 487 -119 94 79 457 148 317 -114 -254
4489 -254 -456 -38 417 236 -27 14 -265 96 425 265 -231 -189 -266 -15 133 127 -39 -198 -171 -340 13 -51
4511 -51 -235 -81 -215 -55 82 -34 9 -15 -324 -99 236 192 10 -467 72 393 67 -129 -29 -191 97
4532 97 -265 460 52 15 -192 107 182 340 132 194 -211 -326 114 137 23 144 -64 197 215 252 -67 -321
4554 -321 -296 -313 -431 -120 186 -458 -26 -41 -196 -24 -388 -293 -452 86 -8 196 -254 -301 -288 161 91 -166 -42
4577 -42 -215 267 111 332 59 -153 -450 139 517 210 193 186 -32 -23 234 159 161 -77 -151 198 539 458 61 46
4601 46 -114 -346 329 107 429 -264 -275 74 13 -134 -62 2 -429 -177 176 83 -174 -327 -174 -159 -95 -40 -541
4624 -541 -308 -91 115 125 39 -114 -293 -174 -139 174 193 69 -234 -110 126 195 444 -48 160 58 97 153
4646 153 -44 12 24 304 344 124 179 93 -312 -163 253 22 521 -22 36 76 165 -217 118 -127 8 -74 262
4669 262 58 -215 -109 -439 141 240 -94 -197 -317 -302 -68 184 -32 63 -112 -141 100 448 22 175 -54
4690 -54 -68 27 272 559 211 -310 2 31 227 228 -105 -344 -312 252 295 265 96 -352 -64 -120 47 78 14 -210
4714 -210 -70 151 109 -20 -207 81 35 -4 224 -23 43 -178 -258 78 -9 106 -330 -278 -143 -288 2 -96 -196
4737 -196 -405 -121 174 -32 -62 -487 -133 27 89 -15 311 -253 -155 422 -20 397 136 -180 -114 -127 248 662
4759 662 -65 119 -117 208 -14 285 40 -42 -149 62 328 202 13 -143 24 -33 265 120 -61 -102 -334
4780 -334 119 87 -67 -147 -374 -246 13 182 -53 -118 -46 -402 44 85 438 -327 -323 -158 -173 224 1 -318 -526
4803 -526 -275 258 409 -179 28 -110 -158 97 73 76 -118 -196 60 531 368 28 -195 -327 -202 86 426 114
4825 114 196 112 -14 44 304 369 10 52 46 -62 53 -258 -461 -126 188 12 -205 -350 -47 -474 -2 198
4847 198 -293 -56 -212 -189 -31 391 -25 174 -44 -380 7 139 -123 -190 -113 -141 241 252 -42 41 -161 179
4869 179 255 448 320 -124 -82 -36 229 549 292 85 -234 18 -15 294 -304 -59 -133 -55 151 105 176 269 -417
4892 -417 119 128 -110 81 -100 -253 -285 196 230 -453 -160 -137 -70 -154 -260 241 -133 -9 -321 30 124 82 -525
4915 -525 -94 219 -14 5 164 -418 -197 205 -266 404 310 -112 -87 422 92 251 225 -226 239 59 333
4936 333 323 -22 106 -140 337 140 247 -242 -267 153 160 151 -27 -328 -81 -357 -201 -76 -74 -135 -112 -233 4
4959 4 192 -8 -60 -114 -73 1 188 55 -62 -464 128 9 -41 -170 -135 126 16 118 175 -62 -299 -76 450
4982 450 267 143 -38 187 135 212 395 48 -16 -176 146 330 432 -176 -195 74 -363 49 118 161 -226 -479
5004 -479 99 -96 215 228 -118 -393 -215 286 192 -318 -349 -358 -317 80 189 -168 74 77 -39 402 66 317 -146
5027 -146 -281 -63 291 187 256 -65 73 68 278 356 -32 -47 10 -84 197 220 161 -82 -138 137 72 252 120 -19
5051 -19 183 65 106 307 -152 -93 -6 81 92 -10 -389 -145 -116 14 136 261 284 -212 -185 188 -23 -79 -200
5074 -200 -533 -88 92 -34 366 -320 -175 22 241 179 6 -45 -111 -42 52 -34 151 68 -349 -22 144 174 -337
5097 -337 161 43 -73 102 293 -5 10 -235 87 257 -126 66 -333 -4 -36 145 310 -62 3 13 176
5118 176 208 159 -304 -73 -273 -293 49 110 -121 -502 -114 -31 -116 -173 -228 -223 -70 -273 118 234 289 -343 -164 111
5142 111 55 -17 -216 -310 -62 65 70 52 -139 66 -157 183 506 268 169 219 95 -1 -90 -228 22 -137 -86 -335
5166 -335 53 -94 -16 -110 92 144 319 410 -274 -75 83 38 6 84 172 -262 -412 -82 145 150 -296 -97 -159 -87
5190 -87 376 -4 -142 82 1 -22 356 5 -109 -292 -102 237 -237 9 86 42 -136 127 137 6 -57 -40 -149
5213 -149 250 201 -222 37 72 43 163 22 116 -234 0 210 119 -155 41 -267 -146 -43 -41 228 -53 163
5235 163 -34 -171 166 45 -64 -135 20 89 -201 19 -297 -142 -235 -293 -109 -47 -240 -204 -169 88 64 -88 -8
5258 -8 -97 16 134 21 37 251 83 -99 129 -70 -157 -202 147 187 172 268 105 -145 79 94 -50 52 113 52
5282 52 -58 67 109 111 -219 -421 -31 37 59 60 -64 -246 -24 -189 157 -108 -273 -310 -104 -123 51 -87 48
5305 48 386 53 -196 -35 282 2 -380 173 24 154 -150 50 43 153 -17 326 80 68 -312 126 148 213
5327 213 186 -33 -46 -220 353 24 -21 -73 1 97 72 235 319 -147 -317 68 -53 155 -139 -341 260 2 34
5350 34 -16 110 -260 -96 38 45 191 72 -372 246 167 142 -144 -2 -241 -4 -189 -63 316 18 -249 286
5372 286 97 74 -152 -129 -20 -109 381 232 269 143 -165 91 135 101 235 37 -49 84 378 218 80 37 -142
5395 -142 276 -76 47 -23 -29 -297 -30 -22 -53 -132 -105 -295 -176 294 -46 38 -57 71 -276 -23 242 -187 -396
5418 -396 -171 47 335 -72 -62 -273 -147 -115 -82 42 341 -341 30 41 153 243 -57 -168 31 180 -32 265
5440 265 -186 55 -26 -49 81 48 231 -51 60 166 222 -4 11 -258 -83 -300 -62 228 -202 -143 8 29
5462 29 230 198 -156 -371 -392 180 -258 -200 -131 -309 -35 -20 -164 41 -385 -203 -56 167 101 -28 -143 -101 -127
5485 -127 404 283 -115 37 -76 -100 -243 356 112 351 -101 341 113 231 6 -133 39 -126 124 172 138
5506 138 -273 88 70 34 50 -142 101 15 57 -135 26 -155 11 79 37 113 -69 -207 -306 20 93 -241 25
5529 25 135 -188 -10 71 67 -145 -67 -119 225 119 52 -173 -169 -415 140 -34 342 -81 186 55 68 38 121 291
5553 291 -138 -68 -110 41 344 -77 293 258 -142 33 -77 466 16 -65 13 256 218 84 -84 -108 -106 257 -170
5576 -170 -166 -70 -224 -24 497 -320 106 -179 2 80 19 -175 6 -211 -179 220 -158 13 -241 47 4 206
5598 206 48 -221 45 -104 -252 33 -11 -185 -176 -484 -27 213 275 -34 21 -199 8 198 22 -37 98 -154
5620 -154 -137 3 130 -184 -368 -188 150 -191 409 -61 -97 54 20 179 120 103 -290 104 194 114 -186 -168 173
5643 173 206 9 534 -26 157 -170 -93 -280 244 47 -71 68 -264 129 135 111 -79 -22 -186 -68 243 26
5665 26 248 130 -70 184 289 336 -138 -78 -102 112 -87 -47 -5 -74 -5 -77 -78 -153 -50 66 56 95 -204 92 -92
5690 -92 -64 -51 -49 33 -166 33 40 19 19 141 217 -87 -72 238 125 23 29 2 -231 -52 195 -148 -64 -80 83 1
5716 1 157 41 147 -131 -10 -213 169 371 81 80 -155 10 109 374 345 -316 96 73 125 -50 66 67 -64
5739 -64 158 -169 5 -131 -280 -234 -10 -202 -23 -165 -25 -101 90 280 -46 -142 -160 -102 270 67 -66 -174
5761 -174 -137 -62 -65 -153 176 -132 -46 247 65 115 -122 -29 52 -62 -95 101 -287 -303 -47 376 -217 -111 -148 128
5785 128 -155 -259 101 132 -345 25 172 -227 -268 -45 -140 -169 141 -143 -116 11 -67 -137 -140 -93 -10 -16 -118 -292
5809 -292 -122 3 24 -34 -49 85 132 -187 334 113 -16 -202 -260 78 -22 167 82 221 50 -180 128 -11
5831 -11 171 -351 277 165 218 -83 113 -93 269 14 -8 190 44 -86 49 191 35 -52 -247 0 -63 293
5853 293 4 -9 -29 33 210 217 -11 -115 -342 -178 57 259 283 -139 -281 -273 124 -93 -97 -148 -147 -323 103 111 65
5878 65 -180 126 -45 -87 84 -11 12 -23 -205 149 -81 115 129 145 365 8 253 -56 -179 -309 169 -41
5900 -41 203 153 180 390 -255 172 -87 114 -362 -276 -95 -105 -110 -77 174 -2 235 -302 -147 58 169 -17 240
5923 240 83 -52 -194 -165 92 147 424 107 -176 76 12 72 334 45 226 -344 -355 -261 115 92 -128 121
5945 121 261 205 215 -90 19 3 -69 153 345 -201 127 -26 -13 -112 50 216 104 172 -26 49 -6 43 94 -108
5969 -108 -204 112 122 -12 -143 98 -43 34 204 339 -72 -99 -38 22 41 44 -84 -95 10 -37 159 -272 -126 59
5993 59 43 57 -152 338 -99 128 -239 -51 217 318 70 -149 344 -16 111 140 -259 72 8 303 -287 -47
6015 -47 -299 -78 -124 -83 154 163 567 277 211 230 -280 -142 -316 89 117 -258 -23 143 84 107 90 16 43 118 211
6040 211 -153 -294 -9 20 59 -118 -126 -176 -11 -287 -24 -90 126 205 -87 272 -83 137 -85 -311 356 31
6062 31 120 -49 208 -60 88 62 22 -242 46 160 43 16 -71 191 231 111 -39 225 -34 -63 -20 137 -1
6085 -1 101 47 -256 41 339 270 151 120 -187 203 -63 -354 33 -130 -77 245 373 22 -21 -79 147 -80 -42
6108 -42 -65 187 294 -205 -226 -172 27 79 -64 189 84 398 -47 -83 25 139 1 -70 151 248 26 84 -58
6131 -58 -20 -80 120 220 -113 147 71 -6 92 -190 -42 -41 -182 25 -129 -144 181 -4 -99 -55 -212 -170 331 41
6155 41 32 29 70 92 26 -265 255 -35 -207 147 115 20 8 -204 -296 60 428 240 93 206 -72 61 -86 184
6179 184 -8 38 77 114 37 -86 40 117 208 -268 36 180 96 160 -126 6 87 431 88 210 44 -292 -74
6202 -74 -51 238 -118 -95 -175 -86 -49 218 37 -117 -160 -89 92 173 138 -394 100 -17 -155 197 274 -98 217 44
6226 44 -75 105 -27 13 -110 331 134 177 -126 1 193 215 -3 82 -125 245 167 121 -163 -116 -8 283 -25
6249 -25 582 89 -121 -73 -54 514 81 3 -19 -74 202 -176 -96 -111 -166 -248 -290 -37 94 -365 53 43 -135 19
6273 19 -206 -186 -160 -192 -184 224 -43 48 97 83 -14 -148 -32 -197 -128 139 39 76 279 -94 38 -45 79 398
6297 398 -21 80 66 178 4 7 111 10 106 203 -168 27 268 33 -52 260 328 240 -83 51 90 -97 40
6320 40 168 -65 14 71 15 148 250 -407 83 191 -313 -137 175 -129 246 -41 127 181 -204 -92 -118 -20
6342 -20 98 -272 483 84 -2 335 -201 281 64 -128 -169 101 197 15 -33 -93 -91 -136 -175 -24 151 -31 -121 -130
6366 -130 -4 -30 129 -79 234 -36 -111 221 2 102 -314 -2 -180 -142 70 97 13 97 87 83 -136 385 -1
6389 -1 55 11 -136 233 -218 -82 105 134 -52 -275 -164 72 59 -2 44 -80 -42 -152 -117 -88 138 -18 -72 43
6413 43 -66 -65 -173 139 -78 59 30 78 1 -455 -138 141 -122 -252 -112 -142 -299 -148 176 -15 -215 391
6435 391 92 -222 144 -2 58 -105 -90 -89 193 102 61 -67 199 -101 13 135 200 224 81 160 -73 22 -163
6458 -163 163 -55 -41 23 -81 6 67 -55 -2 -127 128 142 -103 -219 85 386 144 -38 -89 -54 -3 26 -260
6481 -260 190 -263 -81 48 79 72 66 32 -78 -48 168 -98 101 -177 108 -181 -169 -211 -369 174 123 136 -28 81
6505 81 -73 340 2 -470 -289 182 -361 368 354 118 -45 -227 48 110 -139 16 30 -3 226 130 -83 178
6527 178 161 -108 -125 119 -219 -44 55 82 -74 -148 -71 -149 -127 138 66 -5 141 84 125 -152 212 -281 85 10
6551 10 -76 -87 -79 -110 -31 -272 118 -43 44 -28 142 230 168 34 -105 -98 -219 46 87 -11 74 70 -9 78 154 178 180 187 182
6580 182 -74 -103 64 -94 50 -90 135 85 -3 -69 -120 -58 -62 199 169 -349 -104 -46 -7 222 130 79 192 196 -94
6605 -94 199 -42 -58 104 -13 36 93 138 9 -76 -130 -145 -8 -121 -484 -234 -132 -196 107 -137 -1 -42 -36 -28 -272
6630 -272 24 -3 -108 -95 -132 130 -180 115 -23 24 21 -221 383 61 -155 79 66 285 -15 -82 213 -246 108
6653 108 135 73 -118 -304 135 118 -90 -108 -138 -88 45 6 6 -134 -34 -249 -41 -19 -144 115 133 147 14 -432
6677 -432 54 29 -42 -128 62 -94 -228 102 -42 -68 49 118 -205 58 134 41 69 29 -54 28 140 -64 160 214
6701 214 -181 -164 -92 69 -51 254 -174 261 119 178 115 157 -32 50 -103 -84 -99 266 -318 -56 127 -152 -83
6724 -83 -203 -50 20 312 -44 3 169 -10 101 -7 -95 -108 -27 166 -33 -12 28 66 -27 68 208 156 93 -292
6748 -292 -150 -163 85 55 69 181 -116 95 64 4 -43 -29 -121 -64 18 90 -114 -190 60 -43 -187 -28 -52 -237
6772 -237 -282 29 -73 209 285 -240 123 -84 -52 -226 160 190 61 -101 -102 -50 217 -15 56 -210 76 -123 83
6795 83 159 -191 -74 88 64 -124 122 -51 200 -76 139 -64 -217 -190 148 -94 370 -104 124 229 -110
6816 -110 15 40 142 -147 -100 -57 129 -168 -174 -70 278 43 73 162 295 43 160 44 -292 -84 -261 -73
6838 -73 99 223 125 94 -8 -50 -123 -20 -84 -15 7 36 230 -109 -188 89 3 26 164 154 -11 -10 186 140 193 175
6864 175 151 -34 107 158 90 -77 -134 58 -81 174 -175 -171 56 226 -140 -467 79 64 -134 3 27 -254 76
6887 76 51 -159 151 -169 304 -20 14 -88 28 -106 -261 -56 130 32 263 86 -57 270 14 90 -8 -31
6909 -31 48 -91 -4 18 111 0 29 190 -217 163 166 195 115 3 146 -25 -19 -100 -7 26 -55 -4 89 164 -14 83 192
6936 192 -166 66 225 -79 -19 8 -66 -149 192 72 -153 -12 239 90 -156 -14 343 57 -6 82 96 131 -1
6959 -1 -298 -5 -51 -38 -113 72 89 1 5 -92 80 12 106 183 -272 55 -12 -188 113 302 -3 78 -11 282 -126
6984 -126 249 45 135 229 -125 34 40 10 -253 -23 43 -335 -32 47 72 -196 -174 127 -375 -183 181 -175 -37
7007 -37 -369 -132 167 -201 -24 -239 -19 39 -272 -126 -137 28 76 -44 -22 37 -91 275 248 -54 123 -54
7029 -54 -131 82 197 -115 189 54 -91 -296 -240 19 44 242 175 95 -336 154 7 82 60 3 75 184 -80
7052 -80 -124 -109 -63 183 -149 -218 -28 314 -93 -410 -280 212 -319 -254 -87 -121 -36 170 10 -43 -107 33 -220
7075 -220 189 72 -62 -335 87 -111 -210 441 -196 245 -117 157 -31 60 -87 -79 218 -184 162 -74 -40 95
7097 95 20 -47 -207 347 -101 281 254 75 -28 34 155 51 -21 363 -44 103 -70 -8 16 96 11 61 39 -57
7121 -57 -187 132 -248 36 -91 86 -98 107 -44 -73 -262 -47 -214 -57 -22 314 -71 -117 -17 -72 -15 -142
7143 -142 -25 -159 166 223 189 -73 266 285 149 -264 -17 93 -170 -30 0 46 -36 57 11 -434 -221 -100 107
7166 107 -141 160 -18 -79 -20 152 114 48 -83 -77 233 -137 -216 57 -154 -155 364 129 -36 103 -56 -131 -206 -120
7190 -120 -88 -82 118 96 -102 157 108 -2 186 -120 100 -321 32 -260 -197 3 70 80 207 -14 -153 29 133
7213 133 -189 -8 98 129 68 34 -122 -114 -104 -308 96 67 178 -418 136 194 0 -235 -172 -133 239 242 369 -104
7237 -104 173 245 204 69 -164 -123 -88 227 105 11 -100 2 19 83 -170 -128 -62 125 -316 278 213 -62 16 -185
7261 -185 8 7 -101 -29 4 -35 43 211 -91 162 38 120 44 266 41 150 -64 -142 124 36 29 91 -133 102
7285 102 180 -58 -251 -219 182 -145 -176 -192 -122 -94 11 -126 -67 -1 -95 -39 -65 99 -144 -130 -144 -3 120 -153
7309 -153 130 -82 -315 -82 -122 -98 -16 71 81 18 179 58 -11 316 75 185 -45 261 121 -202 -100 202
7331 202 20 -133 -75 -130 54 148 -55 268 -235 260 -256 -22 282 -90 249 281 36 240 31 69 155 -58
7353 -58 306 92 -305 16 32 107 348 136 -123 220 -132 -176 130 225 -53 -187 221 -100 -60 259 -116 -263
7375 -263 188 97 0 -9 30 89 23 0 93 73 161 59 290 -47 -214 145 196 -127 311 82 -179 61 141 229 46
7400 46 380 -74 -4 -64 -93 -160 73 -75 -133 86 113 -116 -25 10 -84 63 245 167 41 112 -162 -7 380 -5
7424 -5 -120 -158 -32 -388 -8 -107 177 268 -83 64 316 391 -347 -45 170 -7 -383 4 55 -204 -227 -159 120
7447 120 -57 8 48 -173 -106 135 -131 5 -170 -40 203 93 -118 -17 76 -228 -170 59 40 16 287 49
7469 49 -25 -55 45 -139 -214 -124 180 126 174 -45 -138 -87 236 23 107 -14 44 -165 -91 14 59 50 7 -160 -68 231
7495 231 274 103 159 260 -171 -19 -57 223 111 -114 -313 -24 192 -204 147 102 -121 45 -8 -140 -19 157
7517 157 140 251 -53 -12 74 22 -28 -182 108 7 -250 -198 263 17 -248 -58 -125 12 242 -47 -201 -140 246
7540 246 -51 -82 -166 -96 -234 -137 97 264 12 -119 288 42 188 188 158 162 -17 41 253 35 -13 -44 183 162
7564 162 -297 377 412 73 288 -9 161 42 226 99 -318 80 161 99 186 -21 -149 -121 66 108 -133 38
7586 38 117 -147 126 -12 353 126 16 -325 -98 219 53 186 272 168 -303 265 -100 281 12 -59 25 201
7608 201 -115 -64 -170 94 208 -114 -12 -105 149 -19 85 -266 -281 175 -9 48 4 -4 -37 -212 56 -111 17
7631 17 41 -142 -103 56 -367 -16 11 -59 62 -126 -7 248 -174 140 -29 52 -114 6 -133 15 -78 -301
7653 -301 -45 -5 -184 -8 359 -109 -91 115 -29 -397 7 171 173 -107 -168 -111 91 202 -136 -125 108 -13
7675 -13 -2 186 78 -244 268 -16 -66 69 37 222 -142 9 -369 36 -124 -229 -27 -287 -235 233 -204 -22
7697 -22 53 42 90 87 -40 51 -16 229 177 163 49 -7 -42 -323 54 60 33 -139 -79 -162 -79 186 -163 103 -299 -30
7723 -30 -139 -61 -76 -152 74 23 6 288 182 52 -69 -126 -130 -44 112 76 46 32 3 -75 62 349 -302 -147 67
7748 67 73 -24 99 157 41 -189 -17 275 -5 -58 28 -49 124 130 -174 -183 80 65 -107 -336 -190 34 -190 -12
7772 -12 -20 -14 -105 -85 209 202 12 -301 -367 -184 57 -125 -74 101 -30 171 148 50 22 -123 -224 79 5 65 132 -119
7798 -119 -148 147 16 288 -220 -68 -150 -16 191 204 98 23 -297 -114 12 190 -318 -227 -85 268 -193 -4
7820 -4 78 -122 -96 -115 202 -76 193 138 -28 -128 111 83 -31 149 -1 11 65 5 -397 -158 -36 5 -108 -207
7844 -207 39 15 -95 3 14 231 225 99 94 -211 88 335 -122 -101 -171 13 166 -44 110 -241 22 130 -92
7867 -92 -143 58 101 -69 -3 -15 39 172 -159 -267 -29 -34 372 -100 -64 257 141 -139 -68 33 159 -167 -4
7890 -4 149 401 80 91 -34 -161 38 174 200 -158 -172 -8 203 143 -153 -70 -2 47 -24 228 -499 -52 175
7913 175 121 29 161 40 100 -221 -177 -142 29 175 60 -83 40 -315 249 137 -64 25 -207 142 77 -24
7935 -24 9 -392 -14 -19 -12 -178 54 -15 -47 61 43 263 -209 -128 115 183 -42 23 317 79 -250 96 -29 -24 -175
7960 -175 150 -268 197 50 135 -280 -22 62 164 211 -167 24 -111 301 -114 -290 528 227 -103 50 -403
7981 -403 116 -237 -60 322 45 337 374 -316 -8 -180 -56 -59 -190 -110 127 -270 90 -43 266 120 -445
8002 -445 -209 36 -2 77 -198 150 42 -101 -40 -136 28 25 -105 95 -125 73 86 26 111 173 155 112 -42 282
8026 282 65 -58 -8 81 79 -3 -305 -67 33 -188 -79 130 -137 -81 -364 -62 -209 38 166 -36 175 -403
8048 -403 -69 249 7 301 -66 -223 298 -270 276 22 -78 -118 -135 144 235 197 106 -386 -19 -64 177 125
8070 125 -3 285 288 139 -43 98 -180 -120 1 -38 348 162 3 -174 56 -51 -301 43 -194 -128 -105 -59
8092 -59 146 -76 -172 33 -78 187 -68 -320 -164 -44 132 -22 -190 428 73 12 189 98 -33 15 -206 -34
8114 -34 -135 41 82 -65 -163 116 44 65 232 -81 300 109 151 173 -5 74 -126 -73 325 -198 204 84 111
8137 111 -229 43 -37 1 30 103 168 165 -119 -121 -41 -258 -130 -91 307 -162 -67 -24 2 4 -32 207 -142 -126 -7 132
8163 132 455 -56 -59 73 145 1 -48 41 -310 -306 -56 44 83 -132 -74 -183 218 191 -102 18 123 110 140 -117
8187 -117 -104 -8 -10 -83
8191h3
$$ Imaginary data points
##PAGE= N=2
##DATA TABLE= (X++(I..I)), XYDATA
0 0 0 0 0 0 0 0 0 0 0 0 -8 8 -8 8 -8 15 -16 16 -23 24 -29 32 -40 43 -49 57 -65 74 -83 95 -106 119 -134 149
34 149 -167 185 -206 228 -254 281 -310 343 -380 421 -466 517 -576 643 -721 811 -917 1048 -1210
53 -1210 1420 -1696 2087 -2675 3663 -5628 11015 -55010 -176658 -18344 95556 12407 -79598
66 -79598 -4614 70622 17999 -55593 -28090 15880 1094 -25596 -2890 23046 16526 -1271
78 -1271 333 2598 -9605 -22959 -11671 14682 23207 2018 -13336 -2357 9332 -2356 -13206
91 -13206 -2413 11536 8844 633 -947 -2736 -4925 66 8467 11533 9567 3891 -2583 -451 12607
106 12607 13579 -4253 -14538 -802 13170 7340 -2328 -5115 -9449 -9685 3266 10079 -3803 -13991
120 -13991 -1273 7251 -6685 -13372 5334 16186 -1811 -17241 -7129 5098 1018 -5571 -4493
133 -4493 -3820 -2606 5139 9513 -1661 -14976 -10976 3832 8233 277 -5382 -366 6597 5456 -1952
148 -1952 -5446 -927 3662 4061 6303 9914 7257 -1824 -5493 832 7506 7136 3460 680 -13 1436
164 1436 3639 2423 -2973 -6991 -5024 1065 6571 7285 1861 -3910 -5942 -4821 -2241 1916 4015
179 4015 -1665 -9202 -5510 5362 5152 -6527 -12509 -5535 215 -642 -798 1034 -2281 -6073 -2005
194 -2005 3955 1272 -6157 -5290 1182 3823 1250 755 1216 -48 -409 2290 5809 6879 3350 -935
210 -935 -448 4027 6806 3182 -3027 -3901 1265 6179 6882 2768 -1717 -3213 -1146 2522 4935 3251
226 3251 -669 -2740 -878 2563 2262 -1795 -5698 -6525 -4188 369 3813 660 -5552 -6377 -998 1859
242 1859 -1451 -4645 -3600 -2550 -2130 -688 1112 -1095 -5009 -4383 179 3877 3354 254 -2102 -1649
258 -1649 2261 4867 3789 121 -1573 361 2992 4493 3937 -188 -3947 -2166 4414 8844 6401
273 6401 975 -1231 -72 2332 3734 2364 -1019 -3090 -1016 3199 4266 1447 -2683 -4963 -3612
288 -3612 -904 1537 1378 -1644 -4581 -3032 126 1247 -1752 -5417 -5530 -3374 -797 76 -1035 -2977
304 -2977 -3112 -608 2193 2093 -818 -3917 -4140 -1118 3049 4551 1232 -2387 -2029 1714 4193 2702
320 2702 -360 -1745 -77 3794 6804 6081 1824 -2020 -1854 1817 4873 5011 1383 -1252 -1979 692
336 692 3824 2137 -1432 -3089 -1102 2004 3220 1511 -1280 -4476 -5209 -2425 1355 1456 -2786 -4610
352 -4610 -2828 66 183 -2095 -4190 -5015 -2573 1418 3061 261 -3509 -4016 -1822 662 1555 282
368 282 -2014 -3375 -627 3529 4104 1390 -1572 -708 2934 5370 4800 1466 -1562 -1903 627 4120
384 4120 5191 2885 597 -1041 167 2529 3673 1079 -2637 -2278 1937 4884 2965 -856 -3452
399 -3452 -3184 -1487 -397 162 -1239 -3164 -2895 -131 1750 245 -3225 -4535 -3265 -681 907 -437
415 -437 -3338 -4896 -2554 1204 2068 -426 -2720 -2952 -1504 897 3322 3055 -546 -2335 -39 3948
431 3948 4469 2072 -1409 -2460 -235 3900 6059 3720 -7 -1323 897 2933 3808 2703 642 -1583
447 -1583 -315 3227 3511 834 -2930 -2873 -179 2038 2015 -187 -2183 -2615 -1419 -81 -18 -1826 -2928
464 -2928 -2803 -807 798 89 -2862 -5625 -4695 -805 2094 1410 -1721 -3543 -1913 829 1705 1141 -1490
481 -1490 -3131 -2244 1385 4407 3114 -413 -2161 -415 2284 4671 4117 569 -1502 46 3967 4850
497 4850 2972 260 309 453 1283 2986 2318 -330 -2242 -664 2875 3140 506 -1532 -1959 -1174 781
514 781 930 -1501 -3789 -3320 -858 935 679 -1589 -3686 -4043 -2427 601 1786 -1233 -4359 -3882 38
531 38 3030 1244 -2201 -4158 -3652 -619 1869 2850 754 -1246 -1264 930 3225 2719 1228 -513 -1292
548 -1292 1279 4295 4004 1424 -791 -236 2109 2846 2904 1677 -22 -329 1872 3290 1915 -959 -1664
565 -1664 82 1807 1874 167 -2294 -3346 -1688 641 1681 -300 -2921 -3732 -1490 453 721 -1489
581 -1489 -3551 -3885 -2512 768 1232 -1230 -3781 -3548 -955 1673 1965 417 -2257 -2984 -809 1754
597 1754 2328 1361 98 -526 -265 1859 3794 1700 -2096 -1941 2475 4813 3601 1066 -76 -197 1348
614 1348 2678 1952 -268 -1111 631 2175 1720 554 -736 -2397 -2332 774 3087 1098 -2871 -4073
630 -4073 -2125 214 814 -391 -2449 -3607 -2817 -223 1006 -831 -3440 -4235 -2341 672 2594 1054
646 1054 -2289 -3658 -2779 241 1706 1213 -676 -1634 -480 2064 2378 950 -843 -1565 652 3221
662 3221 4310 2182 -507 -639 1222 2320 2198 1697 518 -124 1511 3032 1999 -326 -1549 -476
678 -476 729 2061 2489 221 -2538 -3516 -395 1729 784 -1753 -3324 -2489 -54 1147 7 -2617
694 -2617 -4199 -2828 -272 824 74 -1148 -3099 -3473 -695 1991 1253 -1391 -2697 -1087 1138 1688
710 1688 957 -434 -757 -23 2136 3020 1639 -544 -1151 448 2261 2964 2716 707 187 768 2330
727 2330 2537 591 -1293 -501 992 2901 2161 154 -1777 -2816 -596 2205 2050 -940 -3289 -2298
743 -2298 -260 1028 368 -1651 -3266 -3542 -842 1197 776 -2177 -3804 -3194 -1559 829 1558 -305
759 -305 -2973 -3007 -68 1809 635 -932 -1440 -817 1024 2490 2180 70 -1669 -581 1670 3080 2380
776 2380 763 -113 164 1565 3085 3058 433 -1349 -24 3281 2968 617 -983 -914 -54 1236 1999
793 1999 815 -1674 -2345 -900 1248 1265 -424 -2624 -2726 -1909 818 1192 -1152 -3558 -2862 -1072 -195
810 -195 -7 -577 -2180 -2962 -1321 1168 1521 -512 -2101 -1684 -158 1603 1398 234 -845 -780 1024
827 1024 2109 1868 132 -540 9 1705 2987 2491 625 -749 107 1716 3184 1893 -162 -1393
843 -1393 454 2095 2334 906 -879 -1695 -236 1440 2285 517 -2188 -2748 -1621 323 1387 494
859 494 -1806 -3736 -2530 97 883 -974 -2555 -2931 -1663 73 982 233 -2282 -3012 -1181 780 1675
876 1675 656 -831 -1627 -441 1155 1990 468 -711 -751 1473 2608 2235 955 -373 -571 1032 2950
893 2950 3147 1083 -926 -537 1697 2504 1868 1 -1050 -295 1067 2335 1618 -523 -2277 -1852 571
910 571 1730 950 -1262 -2750 -2729 -972 829 43 -2046 -2891 -1826 51 384 -250 -1999 -2973 -2248 42
928 42 1618 267 -1654 -1856 -961 369 1049 505 -553 -1015 441 2134 1983 415 -727 21 1083
945 1083 2272 2715 1446 -342 -777 784 2867 2546 1107 -124 -266 1238 2876 1905 -134 -1895
961 -1895 -1616 521 2388 1840 -651 -2458 -2116 -588 950 944 -1021 -2571 -1794 -524 920 -15 -1780
978 -1780 -2612 -2273 -745 607 687 -1678 -2966 -2247 164 1249 295 -471 -1051 -973 459 1775 1016 -772
996 -772 -1576 284 2262 2590 1579 237 -819 123 1923 3036 1860 -216 -353 1144 2566 2040 966
1013 966 -561 -1035 113 1480 1943 348 -1499 -1918 -608 1193 1493 -132 -1478 -2073 -950 307
1029 307 348 -1369 -2828 -2466 -822 335 202 -1360 -2383 -2528 -814 688 749 -837 -2102 -1367 7
1046 7 908 584 -751 -1880 -1264 1215 2485 1574 -158 -899 394 2082 2909 2157 351 -940 244
1063 244 1964 2688 1437 -131 -531 87 1482 2158 1581 -578 -1540 -453 1560 1841 866 -1079 -1540
1080 -1540 -1205 399 919 -460 -2195 -2454 -1558 332 538 -585 -1650 -2250 -995 119 807 -674 -2279
1097 -2279 -2043 -805 456 732 -660 -1549 -1243 139 1413 1564 76 -1275 -418 1488 1965 1479 753
1114 753 -333 -405 747 2197 2235 624 -883 -210 1468 2718 2172 443 -861 -599 810 1817 964
1131 964 -537 -1703 -731 613 1117 725 -903 -1811 -1510 152 886 254 -1404 -2284 -1543 -172 526 -616
1149 -616 -2343 -2602 -1574 253 782 -191 -1511 -2010 -860 674 1346 24 -1019 -1438 -308 1354 1174
1166 1174 62 -678 -643 358 2210 2433 1267 -499 -724 809 2366 2539 1161 -159 -567 827 2259
1183 2259 1883 -134 -1215 -874 501 1531 1290 36 -980 -1210 133 1247 851 -703 -2088 -1824
1199 -1824 -670 340 -420 -1622 -2288 -1480 34 588 -408 -1498 -2167 -1094 126 541 435 -812 -1736
1216 -1736 -1213 87 1432 487 -1260 -1758 195 1622 1870 1285 -356 -749 754 2329 2252 998 -98
1233 -98 -591 575 1572 2142 970 3 -535 522 1941 1761 558 -676 -881 108 1332 1202 -116 -1738
1251 -1738 -1759 -832 175 411 -901 -1959 -1588 -109 804 180 -1228 -2031 -2127 -998 97 -110 -1004 -2174
1269 -2174 -1685 -202 669 512 -549 -1398 -1244 645 1557 958 -543 -817 -248 1570 2438 1710 -197 -723
1287 -723 71 1354 2472 1476 689 -176 601 1881 2287 1135 -297 -1093 -279 893 1386 478 -1194 -1319
1305 -1319 -385 530 298 -425 -1000 -1015 -944 250 361 -378 -1747 -1787 -489 6 -145 -1327 -2268 -2004 -737
1324 -737 548 708 -929 -1364 -950 371 1184 911 -868 -1611 -1141 371 2014 1444 21 -999 -357
1341 -357 892 2090 1630 521 -480 -178 1551 2622 1578 101 -812 -414 892 1816 827 174 -1008
1358 -1008 -540 792 1991 957 -794 -1196 -604 207 497 -526 -1428 -1841 -1331 7 161 -531 -1422 -1687
1376 -1687 -975 -206 565 -572 -1880 -1890 -698 627 374 -457 -1585 -1499 -128 790 1001 468 -997 -228
1394 -228 841 2168 2013 359 -627 -739 909 1468 1555 305 -172 63 826 1581 1538 395 -395 -351 548
1413 548 1726 1428 -85 -945 -463 590 747 -231 -1127 -1566 -1363 106 944 -29 -1290 -1492 -803 371
1431 371 463 -387 -1617 -2371 -1655 224 744 -136 -1681 -1667 -422 788 1245 371 -922 -1357 -249 1171
1449 1171 1709 528 -487 -841 -200 1406 1747 1012 -298 -700 136 2100 2411 1228 255 -85 438 1266
1467 1266 1346 287 -797 -818 179 1152 986 130 -935 -972 -435 708 224 -820 -1631 -1277 105 438 -321
1486 -321 -1178 -1812 -1320 -612 1 -58 -1101 -1746 -1003 596 816 171 -771 -1460 -532 59 1302 386 -637
1505 -637 -1273 -167 1240 1418 1146 76 -271 13 1259 1776 1088 122 19 557 1613 1550 770 -372
1523 -372 -282 47 1093 1476 113 -635 -712 258 1146 990 -328 -1462 -1327 -344 512 7 -1087 -1637 -1111
1542 -1111 84 625 230 -883 -2065 -1752 12 720 284 -660 -1704 -1392 -8 918 433 -792 -1766
1559 -1766 -1047 556 1285 1362 -56 -309 -189 853 1737 1082 206 -620 -368 975 1786 1159 611 -13 294
1578 294 1218 1589 822 -506 -269 330 1034 1117 279 -421 -1167 -600 341 571 -207 -1221 -1198 -387 591 539
1598 539 -371 -1058 -1795 -657 137 272 -879 -2059 -1777 -625 543 600 -139 -1176 -1152 -97 730 703 -233
1617 -233 -1250 -786 382 1374 870 340 -600 -553 478 1548 1398 269 26 427 1318 2105 1284 203
1635 203 -660 -112 1027 1508 525 -196 -519 121 845 1005 628 -734 -1458 -753 550 811 68 -1254 -1714
1654 -1714 -1265 570 429 -459 -1808 -2057 -1242 -50 488 -79 -980 -1488 -956 447 590 -104 -1374 -1616
1672 -1616 -446 665 1170 562 -361 -499 722 1107 1387 608 -150 -146 428 1290 1301 838 -154 -248 571 1599
1692 1599 1268 -92 -509 -405 682 1134 955 83 -329 -488 656 872 48 -1135 -1832 -1260 -83 696
1710 696 177 -961 -1581 -1093 -2 494 -257 -1210 -1753 -1117 -52 525 185 -790 -1381 -1290 -77 812 239
1729 239 -712 -1130 -83 986 1599 1051 -175 -183 551 1050 1189 488 -207 -207 338 1407 1695 918 -66 -47
1749 -47 598 1433 1137 307 -919 -300 719 832 717 -352 -910 -866 -20 447 414 -658 -1146 -1321 -50
1768 -50 869 434 -886 -1814 -1723 -673 263 -131 -862 -1527 -984 98 483 526 -468 -1096 -960 181 1205
1787 1205 431 -371 -915 -202 1082 934 691 -239 -206 135 1075 1453 1184 152 -124 465 1033 1461 696
1806 696 -528 -522 -50 1126 1449 336 -607 -326 497 925 676 -286 -651 -1363 -749 666 784 -359 -1459
1825 -1459 -1588 -835 161 -15 -671 -1797 -1486 -251 662 296 -195 -1095 -1097 -149 189 459 -290 -910 -1005 447
1845 447 1079 727 -71 -413 -210 715 1129 1029 117 -444 472 1502 1098 955 81 -650 -90 980 1405
1864 1405 719 -268 -361 188 1182 1181 355 -968 -1279 -336 429 674 -147 -958 -1159 -670 331 549 -356 -1678
1884 -1678 -1803 -846 29 378 -254 -1407 -1206 -717 461 -29 -509 -796 -1376 -366 759 735 388 -782
1902 -782 -75 326 1167 925 11 -589 -544 787 1290 1117 88 -203 465 1053 1552 1280 -33 -494 -278
1921 -278 644 1287 682 -301 -1066 -385 564 859 302 -965 -1349 -621 63 633 321 -744 -1213 -1125 -220 250
1941 250 -315 -1250 -1784 -1118 -275 187 -122 -887 -1119 -381 431 433 -424 -611 -701 6 640 852 229 -729 -443
1962 -443 299 1261 1093 141 -285 -38 851 1629 1365 739 -369 19 637 1420 889 18 -885 -567 201 1017
1982 1017 974 -303 -915 -638 357 914 496 -627 -1392 -730 -140 173 172 -781 -1174 -1371 -329 35 -122 -595
2002 -595 -1040 -750 46 353 72 -1011 -1101 -572 332 532 290 -420 -734 385 959 821 443 -247 -195 286
2022 286 1366 1572 555 -323 -195 747 1610 940 392 -214 -229 354 1210 1228 377 -888 -687 -110 892
2041 892 810 104 -1137 -1016 -246 155 399 -704 -1211 -634 -56 147 74 -636 -1239 -1202 -522 288 -41 -636
2061 -636 -1294 -587 215 384 85 -504 -1113 -307 674 1172 509 -297 -333 -26 589 745 578 -28 -683 276
2081 276 1278 1556 841 -209 -416 392 1186 1445 678 -126 -727 106 1087 957 111 -627 -447 -395 226 744
2101 744 100 -854 -1047 -125 377 -78 -527 -885 -994 -598 75 -157 -719 -1297 -703 -251 395 -79 -636 -888
2121 -888 -809 -30 746 624 -476 -1218 -72 780 980 474 -297 -751 -305 718 1377 928 -444 -529 14
2140 14 1064 1361 1029 464 -602 -147 815 1457 478 -350 -429 152 341 694 319 -290 -804 -680 54 299
2160 299 159 -1090 -1101 -468 62 191 -537 -1189 -1210 -730 51 -13 -428 -806 -771 -319 -82 18 -315 -1053 -786
2181 -786 54 828 726 -60 -277 -318 290 855 872 306 -653 -186 689 1275 997 682 -318 -142 596 1482
2201 1482 1094 165 -334 -130 635 798 739 223 -531 -426 134 275 508 -833 -1006 -613 120 411 -153 -670
2221 -670 -1004 -670 248 342 -413 -1470 -1205 -397 272 84 -543 -645 -1123 -495 702 1005 -173 -1312 -557
2240 -557 202 1040 1104 321 -418 -557 314 1143 1282 452 -576 -382 372 1308 1458 698 -346 -543 593
2259 593 1392 1038 95 -331 -120 284 821 701 199 -770 -607 170 453 132 -453 -856 -610 -79 286 306
2279 306 -670 -1450 -620 249 247 -562 -1021 -1113 -600 49 175 176 -925 -1020 -525 538 704 467 -193 -917 -253
2300 -253 723 997 181 -469 -494 125 1452 1208 766 109 -437 38 1035 926 672 -309 -565 334 973 690
2320 690 70 -452 -323 179 783 371 -184 -818 -488 -45 274 -61 -416 -1311 -1011 -15 288 -11 -820 -1558
2340 -1558 -916 218 279 -184 -594 -1355 -824 193 751 156 -643 -723 -569 142 1270 653 -94 -839 -278
2359 -278 703 1153 204 234 -251 549 1185 1357 580 -169 -537 -70 764 1147 615 -372 -271 222 428 963
2379 963 216 -780 -509 293 316 84 -271 -615 -708 -505 -222 170 -440 -1460 -1177 -249 509 165 -756 -1270
2399 -1270 -912 -336 656 314 -611 -1098 -677 -110 588 537 17 -749 -423 478 822 953 -145 -342 201 529
2419 529 1005 1136 290 -423 -170 703 1061 873 335 -150 339 1120 1105 215 -289 -386 -164 677 704 -143 -881
2440 -881 -638 26 291 549 -141 -545 -842 -596 496 366 -359 -989 -1009 -436 182 372 -597 -1145 -841 -464
2460 -464 409 327 -141 -708 -564 11 294 828 85 -508 -392 426 737 730 106 -3 216 567 1104 971 406
2481 406 -144 88 666 1021 762 33 -140 245 392 783 420 -332 -483 -268 239 644 231 -390 -991 -558
2501 -558 246 641 -131 -781 -1327 -637 86 68 -250 -1205 -1132 -331 -100 471 -228 -599 -1113 -389 320 615 54
2522 54 -613 -808 108 681 654 390 -347 -427 335 942 859 418 -78 -201 514 989 479 201 -296 -79 506
2543 506 868 634 42 -411 -251 164 1024 459 -346 -772 -536 206 443 206 -488 -1264 -849 118 526 57
2563 57 -396 -1203 -931 -25 417 97 -717 -1344 -487 -74 247 123 -304 -1177 -204 -19 1044 349 -228 -337
2583 -337 -194 476 905 163 -134 -78 427 902 1130 683 -7 -152 437 801 729 340 -50 -265 159 1044 715
2604 715 204 -599 -433 270 418 285 -31 -715 -890 -46 495 123 -295 -1200 -653 -392 628 139 -660 -1290
2624 -1290 -1161 -280 270 301 -700 -974 -533 210 452 220 -478 -764 3 421 735 404 -358 -397 133 444
2644 444 793 308 -131 -287 133 881 705 631 95 51 428 948 934 502 -375 -544 172 512 469 106 -649
2665 -649 -175 206 453 516 -120 -922 -1011 -175 96 32 -548 -927 -1226 -121 -17 59 -516 -1062 -739 -172 376
2686 376 54 -435 -503 -510 -212 254 383 -93 -544 -313 310 749 494 217 -310 34 662 869 481 -124 21
2707 21 254 894 911 569 -219 -196 42 952 1070 309 -169 -296 -197 727 606 -25 -919 -777 -366 162 429
2728 429 -207 -883 -869 -161 356 386 -49 -839 -999 -566 124 188 -165 -591 -1015 -263 308 323 -167 -433 -209
2749 -209 102 528 453 123 116 -90 280 841 488 -68 -227 33 615 907 604 223 -120 267 698 1063 896
2770 896 -266 -678 -78 302 722 205 -171 -670 -259 533 360 142 -263 -674 -555 4 25 -69 -431 -853
2790 -853 -657 100 121 -308 -1013 -800 -266 136 35 -114 -667 -431 -107 462 394 -242 -541 -318 61 708 712
2811 712 151 -223 38 667 1309 765 262 -12 105 799 1014 664 256 -198 -197 646 773 652 -172 -616 -560
2832 -560 304 864 640 -516 -693 -468 149 598 330 -368 -681 -885 -65 497 -110 -696 -1014 -608 -81 289
2852 289 -112 -392 -794 -645 294 429 62 -555 -740 -248 266 621 223 43 -362 247 1154 1114 280 -140
2872 -140 -60 507 606 858 421 -162 -255 512 877 737 106 -299 -34 173 741 799 134 -248 -260 -77 661 206
2894 206 -565 -726 -665 30 392 73 -186 -470 -607 226 48 -315 -774 -764 -541 -267 161 -67 -697 -701 -389
2915 -389 137 511 -216 -257 -169 46 363 754 535 -34 -211 126 705 1001 37 -329 -232 336 896 1183 661
2936 661 -65 -39 129 699 782 157 -404 -532 -259 641 404 -101 -544 -531 -34 176 691 -55 -653 -53 -410
2957 -410 -9 101 -247 -942 -759 -360 27 -39 -424 -904 -613 235 483 263 -397 -756 -293 362 257 195 -419
2978 -419 -424 54 340 971 348 -362 -51 -61 635 962 541 428 -139 164 901 792 326 -76 -350 -126 539
2999 539 686 362 -44 -476 9 469 480 -223 -241 -664 -369 377 273 -113 -722 -654 -462 40 -23 -426 -681
3020 -681 -589 -239 85 176 -76 -656 -378 171 252 -140 -318 -671 -449 110 813 626 -40 -268 143 339 662
3041 662 504 -27 -320 -244 460 905 628 270 -137 -186 456 558 596 -6 -322 -317 302 612 147 -289 -775 -54
3063 -54 104 28 27 -264 -699 -754 455 294 -241 -405 -551 -528 108 328 -634 -924 -590 -407 211 468 -235 -442
3085 -442 -135 -86 484 559 -343 -191 -239 37 928 638 26 -485 -288 580 916 647 163 -188 315 354 820
3106 820 662 317 -308 174 522 218 438 117 -178 -182 380 431 466 -485 -539 -161 -208 346 146 -438 -810 -304
3128 -304 155 114 -273 -776 -803 -487 21 318 -377 -357 -646 -220 310 391 -76 -771 -597 -100 384 424 137 -356
3150 -356 -97 258 706 667 252 -45 100 567 756 776 389 -42 -105 181 735 875 51 -403 -360 465 531 -18
3172 -18 12 -90 -230 26 295 -100 -349 -639 -417 150 430 -286 -587 -663 -666 -220 270 -175 -193 -678 -497 -4
3194 -4 483 -87 -501 -585 -15 150 457 -130 -148 -704 -114 548 929 540 21 -226 164 607 801 260 -259
3215 -259 272 93 716 634 664 135 -333 297 428 570 439 -186 -223 215 377 19 -518 -801 -103 -183 408
3236 408 88 -141 -298 -471 -225 153 27 -643 -611 -881 -99 94 -24 -280 -486 -455 251 596 -43 -204 -351
3257 -351 -196 92 446 570 -25 -186 -206 224 865 146 -12 -601 115 806 402 283 -89 -153 177 555 566
3278 566 272 -237 -375 13 565 270 159 -233 -274 25 474 424 -106 -471 -635 -377 -1 149 -272 -536 -591
3299 -591 -351 -9 -70 -516 -944 -620 -337 468 -65 -108 -524 -379 -344 371 290 -107 -521 -342 290 570 689
3320 689 156 -173 -100 715 944 713 -19 1 180 440 194 459 83 -91 260 416 609 199 -275 -72 257
3341 257 361 695 156 -2 -636 -197 41 244 -244 -488 -364 -419 288 474 -144 -744 -728 -508 211 491 -246
3362 -246 -989 -512 -223 213 395 -298 -526 -490 -171 73 425 -200 -180 101 522 485 830 -9 -127 -11 234
3383 234 495 413 91 -19 334 313 461 656 181 -511 156 52 761 384 -355 -336 -46 375 375 -20 -264 -491
3405 -491 -201 129 425 272 -563 -813 -421 -112 82 -341 -582 -799 -627 -20 259 35 -620 -412 -533 60
3425 60 394 2 -263 -514 171 385 621 172 -197 -200 -8 431 508 424 -198 -285 341 806 668 230 -77 -142
3447 -142 385 626 641 60 -119 -53 111 182 448 -291 -529 -203 59 438 102 -377 -695 -95 -448 197 -127
3468 -127 -812 -745 -311 -113 197 392 -171 -473 -591 136 393 -26 -623 -218 -268 -70 145 177 -161 -628 -3
3489 -3 246 626 260 87 -306 143 679 501 178 87 -319 266 580 557 269 -29 318 302 516 524 -187 -175 26
3512 26 -188 604 483 -288 -339 -429 -105 240 61 -44 -409 -495 -257 212 215 -331 -539 -408 -104 279 68 -73
3534 -73 -621 -883 187 588 39 -255 -335 -17 -54 301 152 88 87 -104 3 319 322 -227 -28 151 313 403 397
3557 397 -35 -148 140 541 820 132 144 -155 198 162 250 28 -260 -364 -30 263 315 -187 -580 -234 -255 254
3579 254 323 72 -514 -774 -319 29 57 -372 -641 -503 -256 362 -23 -484 -483 -613 74 235 204 52 -328 -210
3601 -210 263 508 332 -170 -64 85 226 523 344 47 78 -80 461 569 490 -163 -184 -262 660 284 -92
3622 -92 -195 -303 -59 440 815 231 -368 -512 68 310 221 168 -254 -679 -242 88 357 -455 -529 -533 -490 14
3644 14 -106 26 -343 -428 -167 -60 190 -208 -217 -442 -321 142 548 -101 -146 -105 77 463 456 268 -332 -156 393
3667 393 361 236 187 -244 115 441 596 275 -15 84 -180 216 349 230 -417 -353 -97 -60 704 -79 -51 -286
3689 -286 -458 123 382 69 -280 -575 -596 -192 -9 5 -617 -487 -84 -314 151 261 -369 -65 -346 164 125
3710 125 171 -266 -291 21 597 541 330 -331 -127 286 388 586 140 -58 239 293 702 514 388 -153 -196 295
3732 295 833 365 80 5 -96 242 644 163 -149 -278 -355 -17 217 330 -93 -386 -332 -99 147 -30 -200
3753 -200 -502 -645 -406 195 48 -671 -453 -382 41 233 47 -6 -505 -231 134 271 -54 -444 -292 242 284
3774 284 265 277 -215 -199 161 421 464 184 -234 162 -60 419 524 412 -197 -257 398 329 162 331 -166 -416
3796 -416 -47 294 316 -31 -439 -312 -173 -63 102 -31 -401 -425 -267 -88 80 -302 -685 -395 -26 -48 29
3817 29 -105 -764 -373 -194 -25 -227 -230 -90 -20 411 459 1 -41 -83 209 355 694 162 -71 -126 153 556 630
3840 630 483 -220 -28 53 467 544 44 -80 -268 44 312 151 101 -257 -314 99 54 -14 -209 -153 -500 -41
3862 -41 -3 113 -213 -697 -689 -778 181 197 198 -302 -65 157 136 114 -116 -424 -59 212 338 42 -44 -207 -260 -51
3886 -51 324 163 183 -179 120 382 542 397 227 59 -110 117 283 362 -55 -306 -69 -290 374 322 35
3907 35 -408 -105 175 380 -91 -119 -104 -304 346 166 23 54 -258 -257 -49 -25 -9 -294 -477 -244 79 -37 -292
3930 -292 -317 -404 -324 178 219 -227 -148 -278 -5 337 3 -140 -198 -146 421 504 409 472 -199 -66 1 327 344 103
3954 103 -92 -97 22 332 356 -115 33 -130 205 333 341 -72 -238 -93 -99 -36 80 -130 -511 -193 380 -109 -326
3977 -326 -451 -355 -294 -147 -33 -301 -128 -499 -225 204 220 183 -273 -467 104 598 408 101 -374 16 -120
3998 -120 296 483 201 12 -245 -28 427 387 464 -308 -204 116 608 537 185 111 -177 -70 321 156 210 89
4020 89 -163 -108 250 211 -57 -74 -185 -176 301 204 -12 -513 -231 -343 -44 47 -264 -309 -520 81 -27 118 -499
4043 -499 -435 -182 99 356 -103 -426 -523 -311 105 256 -113 51 -247 -178 -80 546 421 150 -226 8 587
4064 587 434 364 -67 33 -41 358 787 54 246 -19 88 265 337 99 -332 -646 -95 186 62 -154 -619
4085 -619 -529 -14 216 284 -79 -428 -385 -276 128 -256 -504 -467 -354 -455 219 164 -366 -322 -203 -57 178 11
4107 11 6 -241 -381 187 412 328 -276 -302 50 434 585 276 299 -179 162 278 619 135 236 -185 167 131
4129 131 172 -222 -175 -97 -180 559 487 151 63 -359 89 226 -97 -136 -471 -126 -120 -181 6 -162 -478 -399 -213 170
4153 170 -27 -228 -165 -301 71 394 46 -172 -498 -415 99 445 488 244 62 -357 207 223 123 101 45 56
4175 56 304 381 288 38 55 -147 148 566 334 -60 156 45 203 249 69 -179 -426 -37 150 502 87 -80
4197 -80 -241 -86 -164 46 -28 -399 -460 -99 242 100 -129 -579 -266 -152 103 454 -346 -576 -197 -324 167
4218 167 140 115 -333 -232 -316 302 161 230 -56 -22 179 473 296 22 -284 -32 30 321 569 125 -14 104
4240 104 187 370 276 -147 -78 -407 103 11 312 -160 -164 92 -195 329 23 -210 -338 -59 -117 127 -6 -301
4262 -301 -252 -208 -175 -59 -63 -223 -463 -371 -315 264 -127 -178 -358 -11 129 179 84 -293 -157 23 246 117 173 314
4286 314 -154 94 424 300 -297 -19 -124 269 580 31 -46 -95 -497 195 275 132 -326 -229 -219 126 55 114
4308 114 46 -140 -195 302 153 57 -123 -270 -232 -97 153 237 -132 -569 -219 23 -239 48 -461 -293 -160 -205
4330 -205 -29 255 -387 -299 -151 168 178 -39 -316 11 -94 292 555 188 102 -171 68 283 487 155 66
4351 66 -123 13 544 -92 118 136 -190 213 122 -9 -69 49 27 22 115 -126 -103 -447 -223 -43 388 -39 -195
4374 -195 -229 -260 -192 105 -50 -172 -638 -207 123 -225 374 -102 -490 -158 -109 82 100 -131 -42 -107 -158 157 94
4397 94 80 36 -240 42 205 284 -168 -23 41 527 512 513 -149 151 14 346 503 195 -209 23 103 216 491
4420 491 152 -621 -463 -34 245 363 -34 -168 -334 -127 -50 373 -5 -288 -593 37 -2 59 72 -240 -125
4441 -125 -121 97 30 152 -183 13 -421 321 15 230 47 -221 58 132 171 229 7 131 376 315 92 40 87
4464 87 -63 131 291 265 13 -80 74 89 378 -53 -90 -72 63 -155 417 -77 -179 -81 -33 24 54 -106 -12 -63
4488 -63 -388 6 80 4 -416 -223 -338 136 -50 -133 -422 -531 19 94 100 74 50 -154 318 178 297 -62 -13
4511 -13 -61 349 286 89 -108 198 -176 -74 537 521 245 -46 -140 -33 113 441 -65 -78 92 148 237 122 -182
4534 -182 -447 -225 -160 195 27 153 -176 -371 -208 159 126 145 -140 -450 82 75 509 -217 -418 -263 40 65
4556 65 236 -21 -265 -167 314 68 -98 -36 -239 18 238 387 28 -225 -162 183 355 146 186 66 -57 -189
4578 -189 209 268 106 66 120 313 282 3 -47 -372 -119 -26 286 188 138 37 -36 -54 311 10 -91 -491 -355
4601 -355 -365 359 314 -313 -475 72 -461 527 43 -14 -456 13 67 148 270 -50 -299 -315 47 -8 219 -59
4623 -59 -9 137 421 70 113 -26 126 -50 284 119 1 -75 -76 156 158 118 154 100 -117 -73 343 252 -23 -78 -228
4648 -228 -38 -3 265 283 -386 -631 -175 -80 48 -228 97 -496 -66 18 143 -129 -220 -221 -155 187 324 -39 -242
4671 -242 -70 -217 212 395 -415 -173 -191 109 523 64 -160 -65 -199 248 705 238 32 -224 -121 297 68
4692 68 284 -174 -151 -247 455 316 -63 125 -232 153 104 153 191 -304 -234 -99 16 -103 200 -267 -208 -255 -104
4715 -104 -106 -91 -151 -448 0 73 -9 -39 -364 -172 15 26 222 -99 -247 -91 -216 304 275 -3 -263 -221 -37
4738 -37 472 204 -129 -324 215 51 473 399 78 -34 111 443 135 296 129 59 -394 68 362 249 3
4759 3 -29 184 325 337 -329 -454 -313 -316 -133 -48 153 -234 -258 -151 7 -246 182 -634 -206 -162 254 49 -340
4782 -340 -300 -430 -144 -158 -32 -117 -28 -233 239 -18 291 419 -363 34 76 357 404 -87 121 -256 145 406
4804 406 245 -184 -211 149 -133 481 258 -190 178 40 76 183 111 221 -309 -232 -135 138 21 -446 -277 -41
4826 -41 -147 165 2 -360 -489 -254 53 -47 -73 -265 -381 -253 204 139 96 -84 -69 -1 -279 541 479 -474
4848 -474 141 -137 103 312 38 74 21 61 393 307 33 -191 -213 1 231 208 42 -152 -178 51 223 187 191
4871 191 -106 88 136 367 -189 17 -21 -377 83 153 83 -65 -70 -241 -247 116 87 -82 -389 -354 206 -55 -51 148
4895 148 28 -223 -119 289 -17 114 -261 -350 196 335 -32 74 -69 -146 233 145 158 -4 -317 463 511 320
4917 320 281 67 7 -63 191 125 385 -24 147 133 -74 295 -165 145 110 -52 50 235 -90 -92 -68 73 -88
4940 -88 242 149 -368 -190 -54 36 75 -182 -521 -262 -160 147 -247 -52 -381 73 110 268 165 -1 -3 -125
4962 -125 -37 74 243 -20 -361 52 178 198 158 -38 -24 -59 255 221 195 -9 -233 -58 186 173 269 19 -186
4985 -186 -108 146 188 252 -2 -223 -155 43 170 -5 -421 -253 -382 221 -194 -25 -397 -392 -117 -57 -75 -34 -254
5008 -254 -119 7 -122 131 2 -378 -235 61 355 265 26 225 -87 238 -121 426 24 68 -162 144 150
5029 150 -24 154 -203 -16 -61 208 287 267 44 92 118 333 193 -304 -207 -207 56 274 -45 153 -30 -122 60
5052 60 56 -8 -379 -198 -191 36 -115 9 -50 -225 -75 -64 279 34 -131 30 165 40 501 -257 -24 -118 223
5075 223 47 301 4 -167 253 -155 -105 299 -9 77 -164 -76 226 314 -19 -64 100 210 325 -69 199 -21
5097 -21 -135 25 368 -11 133 21 6 239 162 -190 -267 -153 -120 6 30 129 -236 -321 -352 -105 -91 -291 -9
5120 -9 -248 -63 -114 6 -69 -197 -321 -211 121 344 -118 -249 -34 -86 263 2 78 -22 -136 235 370 96
5142 96 232 -196 -232 143 8 187 53 -125 -29 17 76 419 84 -58 2 173 -61 451 -136 -198 -52 -205
5164 -205 -94 -293 -349 -344 -127 -111 51 186 257 -225 -8 30 345 -130 -316 -1 -518 -178 -186 -102 22 -213 19
5187 19 -151 79 -172 -54 267 -190 301 293 214 -199 -69 67 370 289 179 -65 59 79 133 440 317 25
5209 25 22 136 256 275 -273 -355 -240 -65 48 112 -28 -60 -175 -39 4 17 -93 -96 -274 -190 228 -76 -67 -190 -200
5234 -200 -15 12 -71 -404 147 2 -196 -31 476 -104 -23 -79 -200 231 -57 -86 0 110 171 136 201 43 1
5257 1 188 -19 140 -2 -83 28 -144 109 322 114 -114 -231 51 148 234 58 19 36 -44 -63 57 -165 -129
5280 -129 -55 -285 41 116 -209 -298 -187 -152 -85 117 -75 -308 -154 -438 19 145 -147 -251 -55 -144 119 87
5302 87 -126 40 -95 135 3 92 27 -83 80 83 229 9 336 -104 -82 124 243 238 -169 -170 -61 -119 412 87
5326 87 -193 86 -23 51 289 -4 -34 -252 -29 92 -38 -220 -212 -98 -311 -126 66 -54 -125 -227 -331 -189
5348 -189 -19 -70 -84 -25 96 -23 -95 -13 53 -147 71 -145 -239 259 46 -140 23 190 49 132 59 41 352
5371 352 194 62 147 247 129 288 66 72 107 -265 16 -141 144 -16 45 -162 -321 -128 155 124 -183 -146
5393 -146 -135 -191 84 -112 -239 187 60 -23 -202 108 -152 219 -270 -239 -13 -128 -19 4 53 -5 134 112 -376
5416 -376 39 -31 219 -220 -36 -148 -77 -151 139 165 32 150 175 127 108 110 -107 -53 -76 -138 169 -28 -77 -54 -309
5441 -309 -5 -176 -81 -185 -350 -224 -98 21 114 -143 -322 -94 130 -169 -105 -32 -115 -232 149 -52 67 -79
5463 -79 46 41 -145 69 121 209 -66 -17 273 361 200 -259 -227 -26 -288 326 1 -119 -89 -112 413 150 69 -216
5487 -216 -251 134 27 19 33 -333 37 441 -44 -24 -32 3 -126 -207 210 116 173 -194 119 125 426 -9 119 -173
5511 -173 -100 114 71 -152 87 -265 -212 -385 116 138 156 -24 -121 275 233 1 -52 -145 122 13 110 222 90
5534 90 -139 -120 -90 86 207 58 -177 155 38 260 223 39 96 38 35 -74 76 6 72 -120 -126 -187 342 188
5558 188 144 -70 136 322 -26 -211 -336 -349 -296 0 -32 -28 16 -221 -81 173 61 126 -283 34 -85 213 -382
5581 -382 -153 -233 -83 -164 -153 -21 156 -32 239 238 113 -38 -240 262 344 383 285 92 -50 -21 -227 192 63
5604 63 -33 202 -230 -245 238 -184 -340 48 -27 -240 357 4 -80 -204 -65 -24 202 -35 -222 -29 -4 -344
5626 -344 165 -58 5 -166 -14 13 -8 130 -140 -6 55 -32 71 61 -329 -49 -94 323 144 60 -27 91 93 114
5650 114 128 45 63 -94 -1 -86 429 119 71 18 324 214 342 56 -133 -174 -29 363 280 127 -68 -41 -183
5673 -183 194 3 -145 -113 145 -93 243 -29 -167 -138 -47 -290 -210 -52 -75 -127 -113 141 199 -233 119 -152 303
5696 303 -126 184 528 119 -211 159 125 192 275 -118 -157 -95 169 162 -27 197 60 50 230 -7 -9 -22 78 281
5720 281 -29 -175 170 -244 -406 170 256 -168 -174 189 -388 156 48 65 154 -84 262 -264 -100 137 -106 -40
5742 -40 -250 0 312 -182 -60 -163 -64 -172 209 220 -191 -242 1 -95 171 141 -311 32 -177 214 -51 85
5764 85 -93 -40 65 -113 -12 -61 -204 7 191 -26 5 285 118 -122 136 257 126 244 86 -183 -243 -26
5786 -26 -28 -25 -252 -58 -298 -258 -123 -275 -102 -66 34 -168 131 -48 -236 -276 -2 270 -5 -233 -93 162 173
5809 173 262 84 -155 -92 -35 396 109 28 -12 104 153 52 -79 -106 112 -201 247 -172 279 134 30 -60 102
5832 102 115 125 -87 -98 57 -117 -27 73 150 -221 -510 96 -437 -15 -15 21 -208 95 -165 47 15 -35 -362
5855 -362 -127 164 3 -120 -143 321 -160 121 89 -49 -53 -265 -109 -224 -158 109 35 -148 98 162 164 119 97 3
5879 3 62 -10 1 -221 132 -58 56 486 18 47 165 232 -83 177 4 -224 -38 -187 -141 139 -230 55 -299
5902 -299 148 -98 -103 45 -119 359 -58 -263 -202 23 3 37 -52 -4 1 -147 -191 -10 -30 28 -6 -92 37 -241 -28
5927 -28 202 321 329 -28 -319 -102 307 182 -88 18 192 205 174 -301 -27 -174 225 177 94 21 39 -206 73
5950 73 76 76 -153 96 -127 -242 -111 58 164 -96 15 -59 226 79 -42 152 -37 -62 -134 72 -156 -131 106
5973 106 -133 9 5 -4 -226 -298 76 -31 90 -141 -70 41 -7 42 186 -188 -270 -46 -31 -103 102 84 140 142 55
5998 55 107 128 92 209 234 -307 -38 103 162 -77 231 -228 278 313 61 -183 -262 -423 -32 -108 181 -221 -138
6021 -138 38 -11 -69 -235 -143 -257 105 84 -75 41 92 -277 -149 358 3 -288 -152 -119 47 375 -21 48
6043 48 156 156 349 15 182 146 -14 -142 296 261 -146 -44 35 -215 -18 106 127 21 232 -122 -33 347 -7
6066 -7 140 -73 96 27 56 60 -11 126 -54 -14 -139 -306 -31 -44 -7 -69 -123 -159 -149 -3 -26 -118 -113 150 100 -44
6092 -44 124 46 -1 66 -106 -161 -115 174 -176 104 373 -14 -137 86 -130 -50 -108 -122 197 221 48 -27 -489 -246
6116 -246 263 -77 -50 66 -66 13 99 -85 -193 59 33 -158 33 -69 -211 -127 -185 -264 77 221 61 -236
6138 -236 -133 -252 90 6 204 8 -332 91 69 28 -32 -45 -359 -275 -29 -49 157 1 -245 29 191 49
6160 49 -324 -17 -108 -154 52 196 -92 36 73 448 268 25 -33 -81 -76 -200 117 -16 -74 76 343 43 3
6183 3 147 162 -41 -142 142 -32 24 178 -397 -262 -92 18 31 53 -176 -71 21 146 232 -65 248 292 -367
6206 -367 182 -73 284 -274 -240 213 117 -112 -215 -29 57 186 -10 -78 -21 87 -101 60 66 -103 275 241 -155
6229 -155 99 -187 -32 209 -63 -128 123 -126 -301 67 -118 201 268 253 -270 -197 -2 -114 197 -132 67
6250 67 -38 -155 -69 171 -27 306 -116 -274 183 -21 -65 38 -25 47 19 -29 88 -140 16 151 -191 -77
6272 -77 235 -71 -36 -155 -102 155 -170 30 28 63 132 -13 61 152 16 203 8 467 3 154 -130 49 92
6295 92 20 -40 -264 -168 64 -182 3 -112 136 -174 -90 -206 -40 213 196 -83 -72 127 -183 -183 -185 386 34 37
6319 37 -29 75 365 -224 183 181 178 106 -74 101 -42 178 164 163 -338 -59 77 27 209 -287 -124 -265 77 132
6343 132 142 6 -54 158 122 165 190 21 -38 28 12 220 159 -103 108 -81 -16 51 76 -313 -199 -93 -126 -35 -147
6368 -147 -108 58 -272 -157 -325 38 -215 -31 116 -59 -47 -217 225 77 -30 -27 -98 -37 37 -254 327 252 175
6391 175 -227 -43 169 -103 4 225 -51 86 -169 125 -32 36 -81 -355 -291 -124 41 209 -252 228 -38
6412 -38 30 165 60 -96 300 -54 208 147 125 -173 110 -114 -141 -53 -6 12 128 -3 -226 66 35 63 -109
6435 -109 139 161 -7 156 -114 155 -284 153 44 -74 26 -85 -48 141 -152 21 -32 -17 -340 -56 -125 256
6457 256 -108 -9 113 -174 -133 -216 204 -9 95 -345 -70 -72 93 -192 14 -311 17 33 358 -248 -130 -199
6479 -199 155 44 -105 3 57 127 -312 337 -300 -352 -83 77 -7 -17 -166 -82 -59 -86 -242 -112 -188 -28 223
6502 223 -45 108 -120 44 86 -180 13 8 -97 -148 -37 311 218 -191 -27 -227 65 -217 -151 182 -237 313
6524 313 -58 93 -414 -199 -117 19 -303 38 -214 -235 18 101 -183 -201 296 -303 -188 -14 -176 -13 40 -138
6546 -138 -68 -132 -113 214 73 159 -164 -94 -165 208 -23 108 259 -228 -301 408 195 26 -168 -102 -138 -98 93
6569 93 -69 111 184 31 85 -96 -342 4 -102 33 -13 9 61 201 195 -277 44 125 -109 66 -123 66 6
6592 6 -263 -54 -238 6 -121 -163 307 -164 -122 81 58 114 -247 41 142 -139 68 -124 -215 -114 -52 147 88
6615 88 137 -4 -151 -87 49 3 -120 398 -103 -229 67 41 111 78 -5 -97 29 129 -83 -7 20 -43 103 62
6639 62 99 -68 -118 33 -227 -233 189 -23 36 -12 249 17 117 94 -252 -160 118 -91 0 -100 -48 -47 -56 -258 -2
6664 -2 83 267 -168 278 155 -165 266 -173 -29 -175 -64 89 56 16 2 -140 -173 -203 -7 20 109 173 -184 -118
6688 -118 173 2 -38 -74 69 -397 -107 -31 186 143 80 83 210 -351 67 182 151 -81 307 158 -95 70 -3
6711 -3 140 -66 -44 35 12 42 258 93 -75 32 -80 -18 123 -124 124 -49 -103 92 -34 10 142 250 110
6734 110 8 -141 -301 390 193 100 89 -15 -254 -169 147 139 -68 -138 3 248 -347 166 -334 -53 37 -70
6756 -70 -69 -143 79 39 243 11 -58 150 23 -165 -8 -28 -16 11 47 -167 -146 20 207 -50 161 -38 -145 -5
6780 -5 54 -66 -48 -94 188 -28 -315 124 -114 270 148 -81 -5 -43 102 -210 8 21 82 -74 -194 175 -133
6803 -133 -18 124 -57 248 -238 103 101 -113 -147 22 167 182 244 -38 -145 -112 126 23 -28 -61 196 -174 185
6826 185 -45 167 227 -232 69 60 -253 26 -186 -146 -329 -61 -65 -162 77 87 -40 -127 279 212 -42 94 210
6849 210 8 217 47 -39 206 -230 -19 165 163 83 -167 119 228 64 -56 -21 206 -96 -69 -244 -46 78
6871 78 14 -62 -281 140 -8 -121 -123 247 -235 -16 -145 -187 176 -171 -30 -285 -83 -315 -70 39 -107 57
6893 57 132 102 -278 20 -119 107 -294 132 -82 -126 -59 -91 112 130 -102 -95 -139 -26 -88 -7 119 190 92 -61 115
6918 115 149 165 269 -98 -48 -92 356 -105 -100 165 -92 255 -77 -165 -172 -133 -167 -236 123 184 -45 162 46 -57
6942 -57 113 120 97 -109 126 166 -50 66 -10 -113 -241 -12 71 239 75 -55 -127 -150 119 -10 41 -228 -303 -143
6966 -143 64 -122 -41 299 -181 -122 -39 97 -329 154 -11 -77 -71 -171 -388 2 -35 -45 56 -65 -196 406 -33
6989 -33 13 -98 -24 62 91 47 -32 50 127 66 159 -40 -56 88 -202 244 62 -216 168 -45 124 -199 135 -370
7013 -370 -72 -2 116 38 65 119 230 135 -318 -199 225 50 129 71 95 15 -24 33 35 -39 117 62 154 126 47 -47
7039 -47 114 67 5 -281 172 73 -71 -246 -104 105 1 55 93 147 52 4 -237 75 71 -62 -76 -149 110 77 -126
7064 -126 -97 -138 -182 -18 164 -45 238 -70 -191 -87 35 104 -77 -55 117 124 90 129 180 -241 50 -226 16
7087 16 276 -52 -14 -285 -107 56 95 -217 -87 -9 -207 52 242 -31 162 -88 -93 -143 41 186 85 -184
7109 -184 187 82 -180 -70 174 -82 -102 -47 129 -283 -40 -101 82 91 2 29 -16 -6 2 -297 -35 -115 -310 -91
7133 -91 -272 74 -6 -397 195 39 -147 -271 144 0 -31 40 30 -308 -332 22 6 190 40 -81 301 29
7155 29 168 320 308 -20 196 -197 -97 173 -51 219 192 56 120 -151 -30 204 -40 165 -97 -34 63 58 89
7178 89 27 42 13 -1 -9 -281 120 -10 10 -183 -67 -99 -398 -37 22 68 293 -118 120 279 -72 -216 -36 78
7202 78 345 37 1 235 82 104 253 148 83 -219 -47 -129 9 47 55 272 -27 128 5 174 -141 -141 -159 -14
7226 -14 100 -88 -62 -181 37 93 165 25 -52 -87 -261 -46 162 -102 -33 17 227 -143 54 61 47 -85 -256 -440
7250 -440 -206 10 92 217 -238 -150 44 -146 77 -493 -194 66 -60 26 84 -230 109 -20 63 -40 -55 110
7272 110 65 -140 -262 19 -155 -212 193 -53 -204 202 97 -53 -3 74 145 -156 65 -89 -117 -50 7 -260 -214
7295 -214 0 -15 102 29 38 -99 -47 -143 -184 -41 94 -138 -25 61 -36 -167 -21 24 144 50 -20 -217 -15 -91
7319 -91 -95 211 132 75 106 88 126 -50 89 -190 222 16 178 -65 -161 322 -506 122 -153 -57 -63 -136 -39 -86 126
7344 126 -89 -172 -56 145 -191 -262 -45 42 -265 152 -295 -204 7 42 12 272 194 111 168 -20 89 51 4 -9
7368 -9 214 111 139 36 76 -120 74 24 57 35 -177 331 62 -97 86 101 163 -19 -10 138 34 80 -218 -120
7392 -120 -22 197 198 -128 -78 -38 -146 253 -7 -231 -69 314 136 -68 -46 -9 38 106 -154 -88 -168 -59 67 5
7416 5 -25 114 -144 -216 211 137 -363 70 285 -273 -37 135 -75 42 49 -204 -56 -89 115 95 91 -135 68 -209
7440 -209 -195 9 107 176 -82 -153 -230 -163 78 -237 334 -188 81 140 16 -28 -187 -86 -2 -170 -174 55 123 -126
7464 -126 -39 -104 -9 -387 -67 104 60 138 -129 169 -18 405 -284 345 -272 137 -73 81 32 -131 -51 -148 220
7487 220 -74 19 14 -135 229 321 -12 -153 218 34 91 -60 80 -65 58 29 349 -135 77 151 14 -64 -113
7510 -113 107 -60 220 131 20 -233 291 -151 141 48 58 -325 -10 80 211 -244 143 -130 124 242 -35
7531 -35 -117 -15 -65 -11 97 123 40 -464 205 111 -62 89 21 15 119 176 234 -82 -18 -98 191 233 -37 -130 59
7556 59 72 -36 -35 24 197 -43 102 -102 -344 -250 -330 28 -113 -46 237 131 -134 -40 222 222 -85 -6 -85 -20 -129
7581 -129 499 -131 176 146 241 161 202 -103 51 81 154 108 5 146 -208 208 -64 -40 68 213 206 73 94 147
7605 147 11 37 72 -116 52 -142 -79 42 240 -17 -89 322 142 100 218 -245 230 422 -264 -275 59 -151
7627 -151 240 -44 28 -112 296 -29 -74 102 -143 -40 385 288 1 -189 161 412 127 93 -46 -120 38 114
7649 114 9 -77 -47 133 -232 -248 91 223 70 98 -37 165 224 220 320 -80 42 120 249 -76 351 316 132
7672 132 -202 -87 112 -144 104 -48 34 115 -197 -66 -185 30 11 -59 39 117 143 -56 26 169 -24 8 -34
7695 -34 234 132 -223 -322 -61 110 30 -113 336 160 113 11 -123 89 -190 -50 24 221 -136 -33 -105 167
7717 167 -494 -136 51 -172 -9 337 145 -3 -10 205 36 410 -131 32 -15 102 24 112 172 -35 69 -206
7739 -206 -117 -146 28 268 217 -2 290 -387 256 -243 -183 -155 194 -177 125 -55 9 -90 -24 -14 -86 -53 -80 -222
7763 -222 -32 241 139 297 -188 -37 -64 341 72 253 148 6 -44 340 90 59 2 172 -391 27 -239
7784 -239 107 28 65 86 -127 -14 -249 -58 -116 54 -49 -286 252 257 235 -40 -100 1 23 -59 71 -5 74 -31
7808 -31 -60 56 -68 41 256 338 156 -189 488 274 -10 -51 41 177 -93 -49 -96 -68 237 57 -65 419 4
7831 4 -125 61 -258 21 -23 -150 129 -248 79 67 -19 225 108 -192 -52 -9 305 -93 -258 -282 144 59 90
7854 90 -63 25 -59 -94 285 -311 28 41 -51 -43 192 0 -34 95 -14 129 175 165 229 228 121 30 339 -206 -2
7879 -2 -47 -233 -206 31 -69 129 118 123 166 -18 -180 -77 214 268 110 238 265 -131 195 69 -208 108 156 -317
7903 -317 -36 96 -217 65 -98 -74 -90 37 -200 128 236 -42 68 140 -165 -126 108 149 172 60 141 -89
7925 -89 118 2 48 -70 16 16 208 -88 206 12 -165 74 5 -162 45 -16 -110 48 -56 56 -113 55 146
7948 146 166 -199 39 61 226 203 -114 115 193 -156 25 -200 -100 18 -206 -80 81 109 43 68 -101 -306
7970 -306 -164 71 -209 187 51 -111 12 -51 -70 152 -366 -183 -332 -30 -86 97 -3 -60 -60 54 -181 198
7992 198 -168 406 107 -84 291 187 2 43 -37 126 -45 58 234 56 316 -143 162 -351 177 96 107
8013 107 131 -232 -213 -122 -144 60 -37 38 62 95 -134 -31 -71 -129 150 -132 13 -89 190 -124 -47 204 -168 41
8037 41 -130 173 212 94 -179 186 151 -52 -6 -258 220 14 284 -71 179 72 -168 2 16 -20 -168 39
8059 39 3 -329 146 -147 -72 -223 107 -16 223 11 -27 -270 32 210 37 70 -355 -62 85 148 -174 87
8081 87 61 -147 225 149 -94 -266 -121 27 -47 52 139 -98 -150 -172 -103 -138 -181 -102 -324 -26 -247 26 -354 129
8105 129 -187 31 169 -27 -9 52 51 -53 -86 -185 313 -100 -66 120 24 -48 -97 60 -377 -29 88 -69 -279
8128 -279 235 5 76 50 65 58 74 37 -67 90 97 -358 218 -262 181 125 315 -334 -229 -122 -15 152 -143
8151 -143 -17 127 -6 125 -144 194 -187 -61 70 14 -11 207 -183 -198 -233 122 220 -23 96 -96 91 -8
8173 -8 -56 217 -24 -192 20 -51 110 -24 159 52 61 127 220 -283 -79 222 -48 99
8191I9
##END NTUPLES=NMR FID
##END=
