##TITLE=1H_Costus-2Kg-Acet-D
 CDCl3, 8 sc, 
 26.2.2020
##JCAMPDX= 6.0         $$ Bruker NMR JCAMP-DX V2.0
##DATA TYPE= NMR FID
##DATA CLASS= NTUPLES
##ORIGIN= UXNMR, Bruker Analytische Messtechnik GmbH
##OWNER= root
$$ XWIN-NMR		Version 3.5
$$ Wed Feb 26 14:21:54 2020 Russian Standard Time (UT+4h)  she@DPX200
##.OBSERVE FREQUENCY= 200.1315
##.OBSERVE NUCLEUS= ^1H
##.DELAY= (6, 6)
##.ACQUISITION MODE= SIMULTANEOUS
##.ACQUISITION SCHEME= undefined
##.AVERAGES= 8
##.DIGITISER RES= 18
##SPECTROMETER/DATA SYSTEM= spect
##.PULSE SEQUENCE= zg30
##.SOLVENT NAME= CDCl3
##.SHIFT REFERENCE= (INTERNAL, CDCl3, 0, 15.7039)
##AUDIT TRAIL= $$ (NUMBER, WHEN, WHO, WHERE, WHAT)
$$ ##TITLE= Audit trail, XWIN-NMR		Version 3.5
$$ ##JCAMPDX= 5.01
$$ ##ORIGIN= Bruker BioSpin GmbH
$$ ##OWNER= she
$$ F:/spectra/data/she/nmr/H-F/1/audita.txt
$$ ##AUDIT TRAIL=  $$ (NUMBER, WHEN, WHO, WHERE, WHAT)
(   1,<2020-02-26 14:20:43.43 +0400>,<she>,<DPX200>,
      <created by zg, POWCHK disabled, PULCHK disabled
       configuration hash MD5:
       00 E9 B6 7A A2 85 ED C7 34 08 36 98 17 FE 4E 26
       data hash MD5: 16K
       8D A3 8D 6F 99 06 6A 5A B0 7C EC 7B 9F 2D 23 EE>)
$$ ##END=
$$ 
$$ hash MD5
$$ F2 9D 0F E5 D4 5C 0F F6 6B F1 0D CC 2D CD B5 C9
##$RELAX= 
##$RELAX= 
##$RELAX= 
##$RELAX= 
##$RELAX= 
##$RELAX= 
$$ Bruker specific parameters
$$ --------------------------
##$DU= <F:/spectra>
##$EXPNO= 1
##$NAME= <H-F>
##$PROCNO= 1
##$TYPE= <nmr>
##$USER= <she>
##$AMP= (0..31)
100 100 100 100 100 100 100 100 100 100 100 100 100 100 100 100 100 100 
100 100 100 100 100 100 100 100 100 100 100 100 100 100 
##$AQSEQ= 0
##$AQ_mod= 1
##$AUNM= <au_zg>
##$AUTOPOS= <>
##$BF1= 200.13
##$BF2= 200.13
##$BF3= 200.13
##$BF4= 200.13
##$BF5= 200.13
##$BF6= 200.13
##$BF7= 200.13
##$BF8= 200.13
##$BYTORDA= 1
##$CFDGTYP= 0
##$CFRGTYP= 5
##$CHEMSTR= <none>
##$CNST= (0..31)
1 1 145 1 1 1 1 1 1 1 1 1 1 1 1 1 1 1 1 1 1 1 1 1 1 1 1 1 1 1 1 1 
##$CPDPRG= <>
##$CPDPRG1= <>
##$CPDPRG2= <>
##$CPDPRG3= <>
##$CPDPRG4= <mlev>
##$CPDPRG5= <mlev>
##$CPDPRG6= <mlev>
##$CPDPRG7= <mlev>
##$CPDPRG8= <mlev>
##$CPDPRGB= <>
##$CPDPRGT= <>
##$D= (0..31)
0 1.2 0 0 0 0 0 0 0 0.06 0 0.03 0 0 0 0 0.0002 0 0 0 0 0 0 0 0 0 0 0 0 
0 0 0 
##$DATE= 1582712442
##$DBL= (0..7)
120 120 120 120 120 120 120 120 
##$DBP= (0..7)
150 150 150 150 150 150 150 150 
##$DBP07= 0
##$DBPNAM0= <>
##$DBPNAM1= <>
##$DBPNAM2= <>
##$DBPNAM3= <>
##$DBPNAM4= <>
##$DBPNAM5= <>
##$DBPNAM6= <>
##$DBPNAM7= <>
##$DBPOAL= (0..7)
0.5 0.5 0.5 0.5 0.5 0.5 0.5 0.5 
##$DBPOFFS= (0..7)
0 0 0 0 0 0 0 0 
##$DE= 6
##$DECBNUC= <off>
##$DECIM= 24
##$DECNUC= <off>
##$DECSTAT= 4
##$DIGMOD= 1
##$DIGTYP= 9
##$DL= (0..7)
0 120 120 120 120 120 120 120 
##$DP= (0..7)
150 150 150 150 150 150 150 150 
##$DP07= 0
##$DPNAME0= <>
##$DPNAME1= <>
##$DPNAME2= <>
##$DPNAME3= <>
##$DPNAME4= <>
##$DPNAME5= <>
##$DPNAME6= <>
##$DPNAME7= <>
##$DPOAL= (0..7)
0.5 0.5 0.5 0.5 0.5 0.5 0.5 0.5 
##$DPOFFS= (0..7)
0 0 0 0 0 0 0 0 
##$DQDMODE= 0
##$DR= 18
##$DS= 0
##$DSLIST= <SSSSSSSSSSSSSSS>
$$ [...]
##$SUBNAM2= <"">
##$SUBNAM3= <"">
##$SUBNAM4= <"">
##$SUBNAM5= <"">
##$SUBNAM6= <"">
##$SUBNAM7= <"">
##$SUBNAM8= <"">
##$SUBNAM9= <"">
##$SW= 24.9337058887773
##$SWIBOX= (0..15)
0 0 2 0 0 0 0 0 0 0 0 0 0 0 0 0 
##$SW_h= 4990.01996007984
##$TD= 16384
##$TD0= 1
##$TE= 0
##$TE2= 300
##$TE3= 300
##$TEG= 300
##$TL= (0..7)
0 120 120 120 120 120 120 120 
##$TP= (0..7)
150 150 150 150 150 150 150 150 
##$TP07= 0
##$TPNAME0= <>
##$TPNAME1= <>
##$TPNAME2= <>
##$TPNAME3= <>
##$TPNAME4= <>
##$TPNAME5= <>
##$TPNAME6= <>
##$TPNAME7= <>
##$TPOAL= (0..7)
0.5 0.5 0.5 0.5 0.5 0.5 0.5 0.5 
##$TPOFFS= (0..7)
0 0 0 0 0 0 0 0 
##$TUNHIN= 0
##$TUNHOUT= 0
##$TUNXOUT= 0
##$USERA1= <user>
##$USERA2= <user>
##$USERA3= <user>
##$USERA4= <user>
##$USERA5= <user>
##$V9= 5
##$VALIST= <valist>
##$VCLIST= <CCCCCCCCCCCCCCC>
##$VD= 0
##$VDLIST= <DDDDDDDDDDDDDDD>
##$VPLIST= <PPPPPPPPPPPPPPP>
##$VTLIST= <TTTTTTTTTTTTTTT>
##$WBST= 1024
##$WBSW= 4
##$XGAIN= (0..3)
0 0 0 0 
##$XL= 0
##$YL= 0
##$YMAX_a= 102766
##$YMIN_a= -59755
##$ZGOPTNS= <>
##$ZL1= 120
##$ZL2= 120
##$ZL3= 120
##$ZL4= 120
##$ABSF1= 10
##$ABSF2= 0
##$ABSG= 5
##$ABSL= 3
##$ALPHA= 0
##$AQORDER= 0
##$ASSFAC= 0
##$ASSFACI= 0
##$ASSFACX= 0
##$ASSWID= 0
##$AUNMP= <proc_1d>
##$AZFE= 0.1
##$AZFW= 0.1
##$BCFW= 1
##$BC_mod= 2
##$BYTORDP= 1
##$COROFFS= 0
##$CY= 11.3945322036743
##$DATMOD= 1
##$DC= 2
##$DFILT= <>
##$DTYPP= 0
##$F1P= 16.9975609425685
##$F2P= -3.02152046262296
##$FCOR= 0.5
##$FTSIZE= 0
##$FT_mod= 4
##$GAMMA= 1
##$GB= 0.15
##$INTBC= 1
##$INTSCL= 1
##$ISEN= 128
##$LB= 0.24
##$LEV0= 0
##$LPBIN= 0
##$MAXI= 10000
##$MC2= 0
##$MEAN= 0
##$ME_mod= 0
##$MI= 1.114404
##$NCOEF= 0
##$NC_proc= 0
##$NLEV= 6
##$NOISF1= 3.799351
##$NOISF2= 2.8
##$NSP= 1
##$NTH_PI= 0
##$NZP= 0
##$OFFSET= 15.70392
##$PC= 1
##$PHC0= -9797.369
##$PHC1= 27.80082
##$PH_mod= 1
##$PKNL= yes
##$PPARMOD= 0
##$PSCAL= 0
##$PSIGN= 0
##$REVERSE= no
##$SF= 200.130013532006
##$SI= 16384
##$SIGF1= 3
##$SIGF2= 2
##$SINO= 400
##$SIOLD= 16384
##$SREGLST= <1H.CDCl3>
##$SSB= 0
##$STSI= 0
##$STSR= 0
##$SW_p= 3612.71676300578
##$SYMM= 0
##$S_DEV= 0
##$TDeff= 0
##$TDoff= 0
##$TI= <>
##$TILT= no
##$TM1= 0
##$TM2= 0
##$TOPLEV= 0
##$USERP1= <user>
##$USERP2= <user>
##$USERP3= <user>
##$USERP4= <user>
##$USERP5= <user>
##$WDW= 1
##$XDIM= 8192
##$YMAX_p= 0
##$YMIN_p= 0
$$ End of Bruker specific parameters
$$ ---------------------------------
##NTUPLES= NMR FID
##VAR_NAME=  TIME,          FID/REAL,        FID/IMAG
##SYMBOL=    X,             R,               I
##VAR_TYPE=  INDEPENDENT,   DEPENDENT,       DEPENDENT
##VAR_FORM=  AFFN,          ASDF,            ASDF
##VAR_DIM=   8192,          8192,            8192
##UNITS=     SECONDS,       ARBITRARY UNITS, ARBITRARY UNITS
##FACTOR=    0.0002004,     1,               1
##FIRST=     0,             0,               0
##LAST=      1.6414764,     0,               0
##MIN=       0,             -59755,          0
##MAX=       1.6414764,     102766,          0
$$ Real data points
##PAGE= N=1
##DATA TABLE= (X++(R..R)), XYDATA
$$ [...]
1910G2M99j81k5k37M77j16Jl01M46o2l36j52N38p2m02j64L76O0N0j62K98n82N6
$$ 72 571 390 365 128 605 489 490 189 635 573 237 85 623 551 149 -15 361 421 471 309 607 25 81
1933H1K73k28L58m72P3L95m22l89N88j04j42m21J67M77m05k49L02J84l14J09o1
$$ 81 354 126 484 12 85 480 58 -331 257 153 11 -410 -243 234 -171 -420 -118 66 -248 -139 -200
1954b00l5j42o2J69j3j65j76J98J85k69k5K68Qj93pM1L3j39J91k62L54Jk07J18
$$ -200 -235 -377 -439 -270 -283 -448 -624 -426 -241 -510 -535 -267 -259 -452 -459 -418 -385 -524 -333 -595 -241 -240 -447 -329
1978c29j7Lk08j8L31p8l80J89O9o9L10l20K20mk54L44L02k06Rj89k4L25R3l70
$$ -329 -346 -343 -551 -569 -238 -316 -696 -507 -438 -507 -197 -517 -297 -301 -555 -211 91 -115 -106 -295 -319 6 99 -271
2002b71L03l14K27j6J98l77M19n43M98L02n98K58R8l6L1j31j63O90k59k93L42
$$ -271 32 -282 -55 -71 127 -250 169 -374 124 426 -172 86 184 148 179 48 -115 575 316 23 365
2023C65J99k53j30K95l49L9L40o4J71k21m1K1j10J81O8M2M0l80K57M8j97P0l3
$$ 365 564 311 181 476 127 166 506 442 613 392 351 372 262 443 511 553 593 213 470 518 321 391 358
2046C58m7J56j68J64l5J31r0k0m8Q9m17J53o9n7J55k17K05J92m21k09K47K23l66
$$ 358 311 467 299 463 428 559 469 449 401 490 73 226 157 100 255 38 243 435 14 -195 52 275 -91
2069i1J50o2P4l38N10l28J21k01O2J42m00J34q0K92l4O5k80K35k75k3K8K02j39
$$ -91 59 -3 71 -267 243 -85 36 -165 -103 39 -361 -227 -307 -15 -49 16 -264 -29 -304 -327 -299 -97 -236
2092b36k51j64K76J1qJ63l24J68j86J16O8Q4j65Q9l92O14k30P8l81L79L51m55
$$ -236 -487 -651 -375 -364 -372 -209 -533 -365 -551 -435 -367 -283 -448 -359 -751 -137 -367 -289 -670 -291 60 -395
2114c95J56o7N5l02L21k71M50K7m26J41K03j39K86m6J54n59O6L66j57p4M12K58
$$ -395 -239 -306 -251 -553 -232 -503 -53 -26 -452 -311 -108 -247 39 -7 147 -412 -346 20 -137 -211 201 459
2136D59m87l11M88j02j03Q0L24K37m46q8J81J56n34K29J13N9L8M7Q1k04j43K38
$$ 459 -28 -339 149 47 -56 24 348 585 139 51 232 388 -146 83 196 255 293 340 421 217 74 312
2158C12L43o69J47M1N04n71K40J47j60P8k77K46NJ34j30R4j57k43M23j00m87M10
$$ 312 655 -14 133 174 678 107 347 494 334 412 135 381 386 520 390 484 327 84 507 407 -80 330
2180C30Mn8J6J3ml19M16j12J43m21J01L68r4m06MN77k06p36J72M24j81j80J92
$$ 330 334 276 292 305 301 -18 398 286 429 8 109 477 383 -23 -19 558 352 -384 -212 212 31 -149 43
2203D3l03J40k15K03O1j89M97l69j95O2J71j57J28l39M1j33j11L11K06k95l0K54
$$ 43 -260 -120 -335 -132 -71 -260 237 -132 -327 -265 -94 -251 -123 -462 -421 -554 -665 -354 -148 -443 -473 -219
2225b19k07J79J06q8k40L29K9k36O6j21J01l8k72K40L14r1K2j70J32j88k11J52
$$ -219 -426 -247 -141 -229 -469 -140 -111 -347 -281 -402 -301 -339 -611 -371 -57 -148 -126 -296 -164 -352 -563 -411
2247d11Q4q1L53k90J32j23L10l16J09L07l48K04p7J98k67K21j0j31K18K02j26
$$ -411 -327 -408 -55 -345 -213 -336 -26 -342 -233 74 -274 -70 -147 51 -216 5 -5 -136 82 284 158
2268A58m5PJ13j19j02K96l14l8M58l21M7K57R7r3j72K49j20L7p6J60j69j16J07
$$ 158 113 120 233 114 12 308 -6 -44 414 93 140 397 494 401 229 478 358 395 319 479 310 194 301
2291C01J09K39m96J13j9K27j09J07r3K66m22K07K22k85l3n2J93j15j19K37j42
$$ 301 410 649 153 266 247 474 365 472 379 645 223 430 652 367 334 282 475 360 241 478 336
2312C36k02J25J8J57j04k80J59p9L1j91nJ56j07M8l7k28N2K16j44n0j58M24l12
$$ 336 134 259 277 434 330 50 209 130 161 -30 -35 121 14 62 25 -203 -151 65 -79 -129 -287 137 -175
2335a75J2R1l1k58J06J59qm5J60l19n6m4J73Q3J96o31J42l1L8O2J65J19j92j67
$$ -175 -163 -72 -103 -361 -255 -96 -104 -149 11 -308 -364 -408 -235 -152 44 -587 -445 -476 -438 -376 -211 -92 -284 -451
2359d51J94j58K06j04L9r8m1j02J03L11m50L09J58j61R2K35p47M62J10l11J87
$$ -451 -257 -415 -209 -313 -274 -372 -413 -515 -412 -101 -551 -242 -84 -245 -153 82 -665 -203 -93 -404 -217
2380b17m1K71k85P4j47m3L60J02j41J9K51r8j56J1Q6k29L08K1k25J80J31j78Q5
$$ -217 -258 13 -272 -198 -345 -388 -28 74 -67 -48 203 105 -51 -40 46 -183 125 146 -79 101 232 54 139
2403A39l5L43k59o7j64L71k79q3N24j7j87P8O4j32o2k06K13J75J8N2l40M44l91
$$ 139 104 447 188 121 -43 328 49 -34 490 473 286 364 428 296 234 28 241 416 434 486 146 590 199
2426A99Q7o8qJ80m22q3O19p0k77r5K59M4m64M75j41Q4j31j16J58pj65J56k0K21
$$ 199 286 218 210 390 -32 -115 504 434 157 62 321 365 -99 376 235 319 188 72 230 223 58 214 194 415
2450D15m15L5N5o6j47k00M43k08k89M03k2J96m89J44O1k52J32q8L61n46K06J37
$$ 415 0 35 90 24 -123 -323 120 -88 -377 26 4 200 -289 -145 -84 -336 -204 -292 69 -477 -271 -134
2472a34J59l76k1J98O6o0j20J07j88J91O1j86J9m3k8L18l73n0J92k01P5O5p9K85
$$ -134 25 -351 -372 -174 -108 -168 -288 -181 -369 -178 -117 -303 -284 -327 -355 -37 -410 -460 -268 -469 -394 -329 -408 -123
2496a23j34m7lj89J57J82l3m53N01R0k37j24K45K29l04L4R2K90mk15R4nq8j03
$$ -123 -257 -304 -307 -496 -339 -157 -190 -643 -142 -52 -289 -413 -168 61 -243 -209 -117 173 169 -46 48 43 -45 -148
2520a48J63K26l74k6L99kl05K45mJ13K7k13R2J35j51K0j15J34j67J35k7M8L9J10
$$ -148 15 241 -133 -159 240 238 -67 178 174 287 314 101 193 328 177 197 82 216 49 184 157 205 244 354
2544C54Q0k84J43r8M1K39j46j11j61K81J11l49K3J51J30j4J63k90J32j22o4k6
$$ 354 434 150 293 195 236 475 329 218 57 338 449 100 123 274 404 390 553 263 395 273 209 183
2566A83J68j35j95L48r1M6j51K69m83K29L5j82J31K3k17k4p9L38k80k64O94k89
$$ 183 351 216 21 369 278 324 173 442 -41 188 223 41 172 195 -22 -46 -125 213 -67 -331 363 74
2588G4k11L52j89l7n48J17N00l89N01j27k95J69k54J46q3Q9j77O2P4j10L74k25
$$ 74 -137 215 26 -11 -559 -442 58 -331 170 43 -252 -83 -337 -191 -274 -185 -362 -300 -226 -336 38 -187
2610a87j91O4K54N9Nj80n1M2J36j32j87J67r0Nj2J7Q3J7J90k03j29M18k01j25
$$ -187 -378 -314 -60 -1 4 -176 -227 -185 -49 -181 -368 -201 -291 -286 -298 -281 -198 -181 9 -194 -323 95 -106 -231
2634b31n2J14j80J41n8L41J04l62L1R3l34M16l7j26J47k31n0L13J03k68K27M2
$$ -231 -283 -169 -349 -208 -266 75 179 -183 -152 -59 -393 23 -14 -140 7 -224 -274 39 142 -126 101 143
2656A43M8k68L6Q7N7k23M52o65L17K17J11l20K01j74K54R9k40J48k11P6q3M09
$$ 143 191 -77 -41 46 103 -120 332 -333 -16 201 312 -8 193 19 273 372 132 280 69 145 62 471
2678D71m67K23J6p6k14NJ70K42Qj81N6J81k80L9R2L8N5j52L5j23J55j49J24r4
$$ 471 4 227 243 167 -47 -42 128 370 378 197 253 434 154 193 285 323 378 226 261 138 293 144 268 174
2702A74R7n00N69m2j27M8j76o0K70l7k65K16j92pJL52k63n38N04J50j89k15J42
$$ 174 271 -229 340 298 171 219 43 -17 253 216 -49 167 -25 -32 -31 321 58 -480 24 174 -15 -230 -88
2725h8O7n4K4K4o0k3j8p9M0J22r5l32K40N7N6r0K55j55j83J62l26J84J42j52J27
$$ -88 -21 -75 -51 -27 -87 -110 -128 -207 -167 -45 -140 -472 -232 -175 -119 -209 46 -109 -292 -130 -456 -272 -130 -282 -155
2750a55Q9m16K17M3k49N13k59J48J20k5m60L96M1k98L4l1RK00m7K52k82N5l85
$$ -155 -66 -482 -265 -222 -471 42 -217 -69 51 26 -434 -38 3 -295 -261 -292 -283 -83 -130 122 -160 -105 -490
2773d90L59J18O0j78J12L1L6L04k46J67l55L51R0m60J55K68k10n8O3j46L07r4
$$ -490 -131 -13 47 -131 -19 12 48 352 106 273 -82 269 359 -101 54 322 112 54 117 -29 278 184
2795A84j1n7r8P2M27l7k96n4J17k03J84J12j50j64K43o3q4J55J08l39J37j34L53
$$ 184 173 116 18 90 517 480 184 130 247 44 228 340 190 26 269 206 122 277 385 46 183 49 402
2818D02j24K23j31l52j99M75k82J31K4j8K1K99k69M0j18r9NJ06j34l9L35%k96
$$ 402 278 501 370 18 -181 294 12 143 167 149 170 469 200 240 122 23 28 134 0 -39 296 296 0
2841@J82K3j92k08K26J47l09q8J39l44K98j04j10J34n4L3m2J98J9n5l52K36p2
$$ 0 182 205 13 -195 31 178 -131 -219 -80 -424 -126 -230 -340 -206 -260 -227 -269 -71 -52 -107 -459 -223 -295
2864b95K11m3K62m20J45j61P6k69K24p6J22q6L9m8rL37k99K4n2j15K04j7k62K52
$$ -295 -84 -127 135 -285 -140 -301 -225 -494 -270 -346 -224 -310 -271 -319 -328 9 -290 -266 -318 -433 -229 -246 -508 -256
2888b56k93K78J7L7p8K6J33N2o4l8%K6P7M6J06m10L41N0J62p7L6k40Q8j76P0P0
$$ -256 -549 -271 -254 -217 -295 -269 -136 -84 -148 -186 -186 -160 -83 -37 69 -341 0 50 212 135 171 -69 19 -157 -87 -17
2914a7J45J89l44K22j90j3K47j33J05J24j90P3Q2k0k89N17k26j62n0M3K20j95
$$ -17 128 317 -27 195 5 -8 239 106 211 335 145 218 300 280 -9 508 282 120 70 113 333 138
2936A38J40K9k07P8j90k0JM65J62n76L46J15j53j9J38l12K80j80k51K9L0K34k35
$$ 138 278 307 100 178 -12 -32 -31 434 596 20 366 481 328 309 447 135 415 235 -16 13 43 277 42
2959D2O0n0k65K41O7j91J16j21J54J33l21J76J05k96K8J91j44r4k86L23J29p4
$$ 42 102 52 -213 28 95 -96 20 -101 53 186 -135 41 146 -150 -122 69 -75 -169 -455 -132 -3 -77
2981g7Q4k01k7j9j78M24j43k36K93pK06j62j28n1k07K64K6O8k45l6n2q9K13j06
$$ -77 7 -194 -221 -240 -418 6 -137 -373 -80 -87 119 -43 -171 -222 -429 -165 -139 -71 -316 -352 -404 -493 -280 -386
3005c86J31j47Q2J63j23L77l40J14RqK18m9j90j89J94J96k02%q2o3K79j33j90
$$ -386 -255 -402 -320 -157 -280 97 -243 -129 -120 -128 90 41 -149 -338 -144 52 -150 -150 -232 -295 -16 -149 -339
3028c39K99r1O2m5K69j37K23l67M35q2M0l38J29L6m2o2L15j62j39J26J6r1J49
$$ -339 -40 -131 -69 -114 155 18 241 -126 309 227 267 -71 58 94 52 -10 305 143 4 130 146 55 204
3051B04J45N8j53k79N5L43k43J89L6l47l8J86j21L73k23N5L4k52L94r9m3k87L45
$$ 204 349 407 254 -25 30 373 130 319 355 8 -30 156 35 408 185 240 274 22 416 317 274 -13 332
3074C32k58K4J09L4N2k30Q1M0p3J98l27J59k6Q7J56l45K72m57N05m37K28j67n4
$$ 332 74 98 207 241 293 63 144 184 111 309 -18 141 115 202 358 13 285 -172 333 -104 124 -43 -97
3097i7L50j89J54k08n9M8P2j99M7J65j06R4k13O9k28J46N5l1J43l19M22p2n7P6
$$ -97 253 64 218 10 -49 -1 71 -128 -81 84 -22 72 -141 -72 -300 -154 -99 -130 13 -306 116 44 -13 63
3121F3l98J11J99k07J05j03q1K24k50k49M29r0l6j4Q2r8K38r1j34mM6O2K40k53
$$ 63 -335 -224 -25 -232 -127 -230 -311 -87 -337 -586 -157 -247 -283 -297 -215 -313 -75 -166 -300 -304 -258 -196 44 -209
3145b09j34L00m4J42j57J27J38m25N5J92P4k63Q1K4N0k64L49K8m27L06J79n4l1
$$ -209 -343 -43 -87 55 -102 25 163 -262 -207 -15 59 -204 -123 -99 -49 -313 36 64 -363 -57 122 68 37
3168C7QL73k41l50J80K20j74k9j44M69k66k40K29P7j06L2J70j94K00j12jJ19j46
$$ 37 45 418 177 -173 7 227 53 24 -120 349 83 -157 72 149 43 75 245 51 251 139 138 257 111
3191A11m1k35O1P49j90q5R3r5l83L80l34J26k71K48k70L10k50K67J57l13L1N6
$$ 111 70 -165 -104 645 455 370 463 368 -15 365 31 157 -114 134 -136 174 -76 191 348 35 66 122
3213A22j6L6j5k33M02k71j02K25R1l24J53J79k40Km4k9J33P9n8k09J09j15J88
$$ 122 106 142 127 -106 296 25 -77 148 239 -85 68 247 7 9 -35 -64 69 148 90 -119 -10 -125 63
3236F3%l94K54J70n18L01q8J95R2j50j70P8K52l08k9J66j51K99l01K4l3J82m69
$$ 63 63 -331 -77 93 -425 -124 -212 -17 75 -75 -245 -167 85 -223 -252 -86 -237 62 -239 -215 -248 -66 -535
3259e35K58K47q3k28K09j05M3k09K28qQ5n8M5L5J71l35q4K90J42k3m36K01K41
$$ -535 -277 -30 -113 -341 -132 -237 -194 -403 -175 -183 -98 -156 -111 -76 95 -240 -324 -34 108 85 -351 -150 91
3282I1m49K28o5P2L89k19l3p8K42k93R4J35k54L40j48r0j38N12l68P4K17k10k02
$$ 91 -358 -130 -195 -123 266 47 14 -64 178 -115 -21 114 -140 200 52 -38 -176 336 -32 42 259 49 -153
3305a53P7L82K02l28j10L01k56J12j21O4K36k01k3j60J72J8q6K79j47K7N2l15
$$ -153 -76 306 508 180 70 371 115 227 106 170 406 205 182 22 194 212 126 405 258 285 337 22
3327B2K50M1Oj42L9J24k43k73O5K26l40L47j03O1Q8N0m4k2K19j48j75P3j76J84
$$ 22 272 313 319 177 216 340 97 -176 -111 115 -225 122 19 80 168 218 174 152 371 223 48 121 -55 129
3351A29o2qj38L85l31R6K42m01J04j28J73J83J02m15J51j87j8J31K24k29k19J24
$$ 129 67 59 -79 306 -25 71 313 -88 16 -112 61 244 346 -69 82 -105 -123 8 232 3 -216 -92
3373i2k8oQ8r7m9o5j9r2K74J52K9o02O37l74j03L50L7j10RNk03J95k65J4L45k11
$$ -92 -120 -126 -38 -135 -184 -249 -268 -360 -86 66 95 -507 130 -244 -347 3 40 -70 -61 -56 -259 -64 -329 -315 30 -181
3399a81Ln7L73l70M2J90J16l08j24K30K7K20l53j78K65K41l62J91k27j57o7M05
$$ -181 -178 -235 138 -232 -190 0 116 -192 -316 -86 -59 161 -192 -370 -105 136 -226 -35 -262 -419 -486 -81
3421h1l4R4k1M31l41j59L8jK29k66Q3L64l09j92J63J38k07K20J08l55L27L4k32
$$ -81 -115 -21 -42 389 48 -111 -73 -74 155 -111 -28 336 27 -165 -2 136 -71 149 257 -98 229 263 31
3444C1LJ26K03k23q4ro6L79l66K82k65k7K77J43j04k30K21K52j2j09m19K17k45
$$ 31 34 160 363 140 56 47 -19 360 -6 276 11 -16 261 404 300 70 291 543 531 422 3 220 -25
3467b5K80j3j60O8k68K21j3j4J47N5j27j80J46k7J9k51N07n07J03K36k89j65J35
$$ -25 255 242 82 150 -118 103 90 76 223 278 151 -29 117 90 109 -142 365 -142 -39 197 -92 -257 -122
3490a22O5N1q7N8K09l63K35P5m37J70L4m5J01l02L57R3k12m7J67l4m0j34j25L75
$$ -122 -57 -6 -93 -35 174 -189 46 121 -316 -146 -112 -157 -56 -358 -1 92 -120 -167 0 -34 -74 -208 -333 42
3514D2J27j75j17R6p5j1o3j59K09J29o1J02k73J72k6J0q3K23j34r3J63k8k9r2
$$ 42 169 -6 -123 -27 -102 -113 -176 -335 -126 3 -58 44 -229 -57 -83 -73 -156 67 -67 -160 3 -25 -54 -146
3538a46M75o61j3M48j93oK64j53p6pj3J36l07M20k16j4J57P1k73L25j51j84k42
$$ -146 329 -332 -345 103 -90 -96 168 15 -61 -68 -81 55 -252 168 -48 -62 95 166 -107 218 67 -117 -359
3561c59N50q6J71j20J35pl28M71k30o0L86k09Pm05L92j22J72l17jj18L57k45J33
$$ -359 191 105 276 156 291 284 -44 427 197 137 523 314 321 -84 308 186 358 41 40 -78 279 34 167
3584A67J56r2j65n8L87n07J48j58K35j72L1K28J31r5k40j71J40J0r5J65j64M25
$$ 167 323 231 66 8 395 -112 36 -122 113 -59 -28 200 331 236 -4 -175 -35 -25 -120 45 -119 306
3606C06j12k39O5K54l19K6J92j70j59J93k6K1p1m3Q4J67l93L01l65K25j4L0j67
$$ 306 194 -45 20 274 -45 -19 173 3 -156 37 11 32 -39 -82 2 169 -224 77 -288 -63 -77 -47 -214
3629b14l8J5J56j62J63o8J30q7k14j8O2R7k4Q9P2r6p8K35k74Q8N0Kl6R4L9p3l3
$$ -214 -252 -237 -81 -243 -80 -148 -18 -105 -319 -337 -275 -178 -202 -113 -41 -137 -215 20 -254 -166 -116 -114 -150 -56 -17 -90 -123
3656a23pJ42j70J72l94K47P3J27j07K9k2k6k71J96J20k8J3j39N3M32l05R0M7r2
$$ -123 -130 12 -158 14 -380 -133 -60 67 -40 -11 -33 -59 -330 -134 -14 -42 -29 -168 -115 317 12 102 149 57
3680E7K01k79r7j4L21j26J1k25N03m90K85j17p6J12R3j27J12L0R9k28Oj78R9P5
$$ 57 258 -21 -118 -132 189 63 74 -151 352 -138 147 30 -46 66 159 32 144 174 273 45 51 -127 -28 47
3704D7%k7L96j85l22L17O9k55q6P0J59L4j45p5M2j37L12j12J30RNJ56l96m3l4
$$ 47 47 20 416 231 -91 226 295 40 -46 24 183 217 72 -3 39 -98 214 102 232 241 246 402 6 -37 -71
3729g1L28k43r5o3J79J53jJ25k73mk6J50j61K2pn1RK1j8L0l74L38J00n07P1K72
$$ -71 257 14 -81 -144 35 188 187 312 39 35 9 159 -2 20 13 -38 -29 -8 -26 4 -370 -32 68 -439 -368 -96
3755i6r7J52p0Q3P6k30L3R0k80j72LM38k60K23r5k83K13M1M8j33K59j21o9J35
$$ -96 -193 -41 -111 -28 48 -182 -149 -59 -339 -511 -508 -70 -330 -107 -202 -485 -272 -231 -183 -316 -57 -178 -247 -112
3779a12m5j0J08J12j76l80K62J61k8k11J88p1J97k16K58p6j0k3P8r8P6p5l6K94
$$ -112 -157 -167 -59 53 -123 -503 -241 -80 -108 -319 -131 -202 -5 -221 37 -39 -49 -72 6 -92 -16 -91 -127 167
3803A67k92O1j1j76J83J47j52q3j10K31r6L20j1o4L8m0J03l17J31K59j55q5J95
$$ 167 -125 -64 -75 -251 -68 79 -73 -156 -266 -35 -131 189 178 114 152 112 215 -102 29 288 133 48 243
3826B43m0l41L89k39m3R8k8K67k54L6M4o6j80K37l40N23m04O9J51Q3k46L28J03
$$ 243 203 -138 251 12 -31 67 39 306 52 88 132 66 -114 123 -217 306 -98 -29 122 205 -41 287 390
3849C90l42j52J49O6N1J18j22k26J4Q2M6K28k97J44J03l96J87k25J79J54j02k04
$$ 390 48 -104 45 111 162 280 158 -68 -54 28 74 302 5 149 252 -144 43 -182 -3 151 49 -155
3871a55M10j80n2L50o51R7J10rR4k98R2J66N6m4L2j69M5J51j73n1j36K96Q5k97
$$ -155 255 75 23 373 -278 -181 -71 -80 14 -284 -192 -26 30 -14 18 -151 -106 45 -128 -179 -315 -19 66 -231
3895b31r1K85k71L30q5o1j59j96L34Lj15l96O64q1J12m80L70n4N2M0J36k01Q6
$$ -231 -322 -37 -308 22 -63 -124 -283 -479 -145 -142 -257 -653 11 -70 42 -438 -68 -122 -70 -30 106 -95 -9
3918io5J40j60P2m8j85O4j00K57l3P7J26r7m0J98r9j99K90Q0p5N0k01m1K49j12
$$ -9 -74 66 -94 -22 -70 -255 -191 -291 -34 -67 10 136 39 -1 197 98 -101 189 269 194 244 43 2 251 139
3943A39j92Q4L5p2J11j62j33J16L01j29k2k10P2J90O8j31l11K86J24J34o9p9j74
$$ 139 -53 31 66 -6 105 -57 -190 -74 227 98 76 -134 -62 128 196 65 -246 40 164 298 229 150 -24
3966b4M12j75N9j67m18M67L69k38P3m54K29J20j88J80m4j00J16q4r5J04N5j70
$$ -24 388 213 272 105 -313 154 523 285 358 -96 133 253 65 245 201 101 217 133 38 142 197 27
3988B7J42l13K27n6J1L2K67m37J06j43J09J46q4q8k9k54O6M50j75R1L3Ml00r8
$$ 27 169 -144 83 27 38 70 337 -100 6 -137 -28 118 34 -54 -83 -337 -271 179 4 95 128 132 -168 -266
4012b66L48j91Q5j15n4j86K97N9j34J39L0M5j88k75J26K83j29j96K04L7J14k03
$$ -266 82 -109 -24 -139 -193 -379 -82 -23 -157 -18 12 57 -131 -406 -280 3 -126 -322 -118 -81 33 -170
4034a70P3p5m1K48j60K06k67O2j93o2M76o27L20k3R0K13J34m68K2J47L78k12j42
$$ -170 -97 -172 -213 35 -125 81 -186 -124 -317 -379 97 -530 -210 -233 -143 70 204 -264 -242 -95 283 71 -71
4057g1j48K75R3o7j21J15n6n2L9k53M16K25l79j58K59j07J43Q9j73J66k66Q6r2
$$ -71 -219 56 149 82 -39 76 20 -32 7 -246 170 395 16 -142 117 10 153 242 69 235 -31 55 -37
4080c7J8j09K64l01J51L04l31r9O8K67j71j42K38n5R4m43J38L69j05J87k98L68
$$ -37 -19 -128 136 -165 -14 290 -41 -140 -72 195 24 -118 120 65 159 -284 -146 223 118 305 7 375
4102C75m39J65L7j17L93l20k41K92L1p1J02j50q9Oq0J70o7JL4o2K94k72%L06k76
$$ 375 -64 101 138 21 414 94 -147 145 176 105 207 57 -32 -26 -106 64 -3 -2 32 -30 264 -8 -8 298 22
4127B2j44J07j78L0RJ3J35k24J90j20R9Q6J64k8l71n0K32Q7o0k72L6J8rK17n1
$$ 22 -122 -15 -193 -163 -154 -141 -6 -230 -40 -160 -61 25 189 161 -210 -260 -28 59 -1 -273 -237 -219 -228 -11 -62
4152f2k08J4M4o7P9J33L9j75P4m5L05k78m7L14o4k87Q9M1n3R8K03m50l9J48K1
$$ -62 -270 -256 -212 -279 -200 -67 -28 -203 -129 -174 131 -147 -194 120 56 -231 -142 -101 -154 -56 147 -303 -342 -194 -173
4177a73k21L84J23j52K22j72j2k62K45J09k08K61n4l31M9O2N06j85j12K0M2k6
$$ -173 -394 -10 113 -39 183 11 -1 -263 -18 91 -117 144 90 -241 -192 -130 376 191 79 99 141 115
4199A15JL4j10j47J71J59k77L45p8l37L69n53L97K51k34J51J28m24j7N9J27L04
$$ 115 116 150 40 -107 64 223 -54 291 213 -124 245 -308 89 340 106 257 385 -39 -56 3 130 434
4221D34m27M67l03l17J26J09J9L64n29L04j62J2j68L16M1k19R4j01p6J88k00p
$$ 434 7 474 171 -146 -20 89 108 472 -57 247 85 97 -71 245 286 67 161 60 -16 172 -28 -35
4243c5J09J71l58L49j85r4J58o0k4J55l84R5p2j22K29K17j59k18R1J41nj78R2
$$ -35 74 245 -113 236 51 -43 115 55 31 186 -198 -103 -175 -297 -68 149 -10 -228 -137 4 -1 -179 -87
4266h7Q6K52l01p4K19r9j14n9Np4L9K89n2l56K05nr4J75J2J00j06j39K00j5L9
$$ -87 -1 251 -50 -124 95 -4 -118 -177 -172 -246 -207 82 30 -326 -121 -126 -220 -45 -33 67 -39 -178 22 7 46
4291D6k85K13l09J62R2J13j84q6J33J32k1j00J39n9j09J01Q0Q8l28L31q7j15o3
$$ 46 -239 -26 -335 -173 -81 32 -152 -238 -105 27 6 -94 45 -14 -123 -22 58 146 -182 149 62 -53 -116
4314a16N7j75j1N16k41O5lj68l1R0j17J38j29K4P9j68J10J44K15m6k40J44R2o0
$$ -116 -59 -234 -245 271 30 95 92 -76 -107 -17 -134 4 -125 -101 -22 -190 -80 64 279 233 -7 137 229 169
4338A69j7n8m3J72j73N1N2p4K2M4p0J58r5K82o42K44J04o3O6M2q8r2K60k09J43
$$ 169 152 94 51 223 50 101 153 79 101 145 75 233 138 420 -222 22 126 63 129 171 83 -9 251 42 185
4363A85j21l0j48K58j38q4j70L79Pl40L29o6j97J66j00J43K09l83K89k77j3j10
$$ 185 64 34 -114 144 6 -78 -248 131 138 -202 127 61 -136 30 -70 73 282 -101 188 -89 -102 -212
4385b12N64Pk47M1j21j98K49p7k99M21k70M8J99q5k73M80j34j11j69J02j66K01
$$ -212 352 359 112 153 32 -166 83 6 -293 128 -142 -94 105 20 -253 227 93 -18 -187 -85 -251 -50
4407e0Nj88M83l87k22R3K21j85J33k8j55L64k16m4J29K37m02R7j78L78j30p5j05
$$ -50 -45 -233 250 -137 -359 -266 -45 -230 -97 -125 -280 84 -132 -176 -47 190 -212 -115 -293 85 -45 -120 -225
4430b25L63k15K13l89k59M11K07k70n5J3J1O5K37k0k50M27l74J7m0J44R7j26K85
$$ -225 138 -77 136 -253 -512 -101 106 -164 -219 -206 -195 -130 107 87 -163 264 -110 -93 -133 11 108 -18 267
4453B67J49j55k51K76l69J98O7j05j8K7p0P1r6J07k65L27n2KJ00m0l70J30L83
$$ 267 416 261 10 286 -83 115 182 77 59 86 16 87 -9 98 -167 160 108 110 210 170 -200 -70 313
4476C13l85J15J96j55K00p7P3l01j36J19N6j7p6L70k50J12l07j00L07N5j81J02
$$ 313 -72 43 239 84 284 207 280 -21 -157 -38 18 1 -75 295 45 157 -150 -250 57 112 -69 33
4498C3J29l03M07k52J43m05K45J6k7M5j57J09J75R0j7ok9l05J04j5K26J7k19J10
$$ 33 162 -141 266 14 157 -248 -3 13 -14 31 -126 -17 158 248 231 225 196 -109 -5 -20 206 223 4 114
4522A14j94q3K2J13p9j28o9M96m6j81p4m7Q7j23M20k11Q9m05M05k78l3k14J75
$$ 114 -80 -163 -141 -28 -107 -235 -304 192 146 -35 -109 -156 -69 -192 228 17 106 -299 106 -172 -205 -419 -244
4545b44Q8O9Q7l30J25J74n8o6j62J26J28m4P1l76K00L3J06J93k11J05l53L45L21
$$ -244 -156 -87 0 -330 -205 -31 -89 -155 -317 -191 -63 -107 -36 -412 -212 -179 -73 120 -91 14 -339 6 327
4568C27m24j85Q2J94O7Q8J03j11j69k29L53P0j34j38L6p3K4P8j9j31K41J81k21
$$ 327 -97 -282 -200 -6 61 149 252 141 -28 -257 96 166 32 -106 -70 -143 -119 -41 -60 -191 50 231 10
4591A0K1M0J58l4Q2m4J22l42j05J26j81L48n4Q1j92N9n1N2K2m9Qk4j29P3j29j62
$$ 10 31 71 229 195 277 233 355 13 -92 34 -147 201 147 228 36 95 44 96 118 69 77 53 -76 -3 -132 -294
4617b94L53j42K37k49j46j4M33j26K6L0l74K65K6J05qJ72l39p1K61j25k9k22K44
$$ -294 59 -83 154 -95 -241 -255 178 52 78 108 -266 -1 25 130 122 294 -45 -116 145 20 -9 -231 13
4640A3o2J78k96K00j12O2J25j73R5k04K44j64J2j59M11q9Q0j65p8K74j51j53j12
$$ 13 -49 129 -167 33 -79 -17 108 -65 30 -174 70 -94 -82 -241 170 81 161 -4 -82 192 41 -112 -224
4663b24O2J19j41k12L51L5K52n52o5J06K70jl18q3K74O0n4k1J08M2j38JJ18N8
$$ -224 -162 -43 -184 -396 -45 -10 242 -310 -375 -269 1 0 -318 -401 -127 -67 -121 -142 -34 8 -130 -129 -11 47
4687D7L9j14J28n5K1j26K80n39M86j86Q1j66J45r1q4K45j96J68o2j2k03J37K82
$$ 47 86 -28 100 45 66 -60 220 -319 167 -19 62 -104 41 -50 -134 111 -85 83 21 9 -194 -57 225
4710B25k27K92j30L6j90j46K31L1k95R4J72j08J83k19Pl17M83J63k74j45J55Q5
$$ 225 -2 290 160 196 6 -140 91 122 -173 -79 93 -15 168 -51 -44 -361 122 285 11 -134 21 106
4732A06l0n9K5J2j03m8J86o8J94N0j62%k33J11J62J57k87K03l30l8M60q1l40J28
$$ 106 76 17 42 54 -49 -97 89 21 215 265 103 103 -130 -19 143 300 13 216 -114 -152 308 227 -113 15
4756A5j4L9L6j39l3j9J54r9r8K89k63j21J43J90j79j43J99J66m17L25m2j25j44
$$ 15 1 40 76 -63 -96 -115 39 -60 -158 131 -132 -253 -110 80 -99 -242 -43 123 -294 31 -11 -136 -280
4779b80M75m71J33K06j83J03k26P7j32K93l2Qr8K83k54k11J76Oj22J85k04K00
$$ -280 195 -276 -143 63 -120 -17 -243 -166 -298 -5 -37 -29 -127 156 -98 -309 -133 -127 -249 -64 -268 -68
4801f8N4o2n1p0M12k19Q%M7j0j86N0N3k76K79J43l23K42J99l05o5j57M88n9j97
$$ -68 -14 -76 -127 -197 215 -4 4 4 51 41 -145 -95 -42 -318 -39 104 -219 23 222 -83 -148 -305 183 124 -73
4826g3PN9O7j00K15j09j10R7r3p5K0R4J91j50m0m7R2j3J00j27M0K19m06M60k03
$$ -73 -66 -7 60 -40 175 66 -44 53 -40 -115 -95 -1 190 40 0 -47 45 32 132 5 45 264 -142 318 115
4851A15N1j50j07N8K03j11j27J97k15L37j36m1K65k98r1J15o0L99m74K7P3k3n1
$$ 115 166 16 -91 -33 170 59 -68 129 -86 251 115 74 339 41 -50 65 5 404 -70 -43 30 7 -44
4874d4K56k94K23n9O5j42RQ8J8K36l00r3L4P0n3Q1J1j97n7p6J94J50r6j15K19
$$ -44 212 -82 141 82 147 5 14 102 120 356 56 -37 -3 67 14 95 106 -91 -148 -224 -30 120 24 -91 128
4899A28k33o2OO7J06j70K74m92L50j34J49k81J26J0l5J81M2j96qK15n28L18L89
$$ 128 -105 -167 -161 -94 12 -158 116 -376 -26 -160 -11 -292 -166 -156 -191 -10 32 -164 -172 43 -485 -167 222
4922B22k59j1k19N3L40l03K68k22r4L34p0j38J09k33K13j8J28m8o6P3k74N16k96
$$ 222 -37 -48 -267 -214 126 -177 91 -131 -225 109 39 -99 10 -223 -10 -28 100 52 -14 59 -215 301 5
4945El0n4l9L6K9N3j46L16j43J25k32J79l14L03o3j66rM56k58m4L6R4l93J51K55
$$ 5 -25 -79 -118 -82 -53 0 -146 170 27 152 -80 99 -215 88 25 -141 -150 306 48 4 40 134 -259 -108 147
4970A47n4R8k19p6J15l2K0n1j53K31r7J90j49J71r0J09j3l0k02L71r7j24N5K19
$$ 147 93 191 -28 -104 11 -21 -1 -52 -205 26 -71 119 -30 141 51 160 147 117 -85 286 189 65 120 339
4994C39m65K61J12l86K30K14k31j45p1k0R5J89p9j87J38m5r5o2N63k87k11J10
$$ 339 -126 135 247 -139 91 305 74 -71 -142 -162 -67 122 43 -144 -6 -51 -146 -208 355 68 -143 -33
5016c3j15M56j71j63J26p3r0j80M93m23K18q8j09l2l1J01R9j8k02j84M61q2j26
$$ -33 -148 308 137 -26 100 27 -63 -243 250 -173 45 -43 -152 -184 -215 -114 -15 -33 -235 -419 42 -40 -166
5039a66J12J5K74j50p0k46J72R0Pj0m9O3r6J86j02M4k08j9%J45j96K6J87j40J4
$$ -166 -54 -39 235 85 15 -231 -59 31 38 28 -21 42 -54 132 30 74 -134 -153 -153 -8 -204 -178 9 -131 -117
5064a17N7k17L5L21j21J05q0J68k10l1m65N08M4O2m3j10J55j6k55L48j49k0k1
$$ -117 -60 -277 -242 79 -42 63 -17 151 -59 -90 -555 -47 -3 59 16 -94 61 45 -210 138 -11 -31 -52
5087e2m0j39K36J04k32L1K65l30J74l0k97O8K03j58j27M84N1k51K92j09k8M2k47
$$ -52 -92 -231 5 109 -123 -92 173 -157 17 -13 -310 -242 -39 -197 -324 160 211 -40 252 143 115 157 -90
5110i0N4P1m3n8J00n9J02k33M50k79L8m8K07o6k48L15k26K18pj93JK3J8l9P6j08
$$ -90 -36 35 -8 -66 34 -25 77 -156 294 15 53 5 212 146 -102 213 -13 205 198 5 6 29 47 8 84 -24
5136b4P6j1K57k16k28J39L5O0k3k5J91M4l78J34k06K8L52k78N0k04J11P6J73p5
$$ -24 52 41 298 82 -146 -7 28 88 65 40 231 275 -103 31 -175 -147 205 -73 -23 -227 -116 -40 133 58
5160E8j09K3l9k30M34j15m4j73L13k8k71K33k70J61o9J67J16l89k3Q9m2K62N0
$$ 58 -51 -28 -67 -297 137 22 -22 -195 118 90 -181 52 -218 -57 -126 41 157 -232 -255 -166 -208 54 104
5183A04j56M5m64L40j40M1J35L0l58O06m10N01l38j90L0P8oJ09j50J04k26K02
$$ 104 -52 -7 -471 -131 -271 -230 -95 -65 -423 183 -227 274 -64 -254 -224 -146 -152 -43 -193 -89 -315 -113
5205a13j3JJ40N1K41j38l15K08lQ4k46N8J40l3l5j11J13j24J59k1J60j77K35j38
$$ -113 -126 -125 15 66 307 169 -146 62 59 143 -103 -45 95 62 27 -84 29 -95 64 43 203 26 261 123
5229A23q0j23K64J8k52L37j26k66L13l47Q5ML61j89J21o5j63J37j45J67j17lk8
$$ 123 43 -80 184 202 -50 287 161 -105 208 -139 -54 -50 311 122 243 178 15 152 7 174 57 54 26
5252B6K01n1M6j54K29O0k50Op2l4M80n77K45l58M60j89j64K18k33m1P5J49l03
$$ 26 227 176 222 68 297 357 107 113 41 7 487 -90 155 -203 257 68 -96 122 -111 -152 -77 72 -231
5275b31N8K65j2j61%J63J2k8J71m28J79j19p5K42k5j40J23M1q8J1j4J17L4r7L9
$$ -231 -173 92 80 -81 -81 82 94 66 237 -191 -12 -131 -206 36 11 -129 -6 35 -53 -42 -56 61 95 -2 37
5300C7q6M2L6l11r6K11K30k84j37L97J20l98K09J65j32k00K0j1qJ80L3K56k42
$$ 37 -49 -7 29 -282 -378 -167 63 -221 -358 39 159 -239 -30 135 3 -197 -177 -188 -196 -16 17 273 31
5323C1p1j79K46j16K71l80J70J27j01r4K34o29O30N7l12J99M3k32J49n8K15j21
$$ 31 -40 -219 27 -89 182 -198 -28 99 -2 -96 138 -491 139 196 -116 83 126 -106 43 -15 200 79
5345G9l06M55j76J00m30M12n2j56K51l89J11p1J17J87k26J85P5l90N72k70j92
$$ 79 -227 228 52 152 -278 134 82 -74 177 -212 -101 -172 -55 132 -94 91 166 -224 348 78 -114
5366a14J72R6J82k91R8J56m18P4L06j06l5n8J23q1k21J02K63k12j07J53J42k30
$$ -114 58 154 336 45 143 299 -119 -45 261 155 120 62 185 104 -117 -15 248 36 -71 82 224 -6
5388fK00k92J92K1j30O4K26j24%r6K72l77M8J0k10L97n10O52l51K13k7l08j64
$$ -6 194 -98 94 115 -15 49 275 151 151 55 327 -50 -2 8 -202 195 -315 337 -14 199 172 -136 -300
5411c00J69K02k09J24J96q1j6j64J64j05r0o1J3J25j02K21l77M73k21j03L07k32
$$ -300 -131 71 -138 -14 182 101 85 -79 85 -20 -110 -171 -158 -33 -135 86 -291 182 -39 -142 165 -67
5433f7k08K0J6K76k28M11m12J33l9j1J33l52K94J72j82L6K9l14K26N2K6n06N85
$$ -67 -275 -255 -239 37 -191 220 -192 -59 -98 -109 24 -328 -34 138 -44 -8 21 -293 -67 -15 11 -495 90
5456I0j35K02j57k68L90j97k3j72K75j23L03J17m30L12j28j12nLo3N5q2J99j8
$$ 90 -45 157 0 -268 122 -75 -98 -270 5 -118 185 302 -128 184 56 -56 -61 -58 -121 -66 -148 51 33
5479C3P%K67k67qj6P7j19k27M01j70j34J15L3M1n4K47j61k36L26k44j64M27j7
$$ 33 40 40 307 40 32 16 93 -26 -253 148 -22 -156 -41 -8 33 -21 226 65 -171 155 -89 -253 174 157
5503A57k13L1J15j49K62k51M6K13J58o91M50j43P3l05M35M1k68L66l21J26k48
$$ 157 -56 -25 90 -59 203 -48 -2 211 369 -322 128 -15 58 -247 188 229 -39 327 6 132 -116
5524a16P5K39n5j05j9J20rQ8l5l14K92j48j72L07j79l03K61QJ75J53l25k86r9
$$ -116 -41 198 143 38 19 139 130 218 183 -131 161 13 -159 148 -31 -334 -73 -65 110 263 -62 -348 -447
5547d47L37K84k13l31K82J29j3L29j02k62k1J95l57L05j98n2L4k8J57l30L04j2
$$ -447 -110 174 -39 -370 -88 41 28 357 255 -7 -28 167 -190 115 -83 -135 -101 -129 28 -302 2 -10
5569a0j03K9Q8R4m28J74J15J1m79N71q3K34r7l65L06m32M51l40K62J08k08j06
$$ -10 -113 -84 4 98 -330 -156 -41 -30 -509 62 -21 213 116 -249 57 -375 76 -264 -2 106 -102 -208
5591b08P3Q7O0K10k76Q0q3Q5R2p6k21o4K26j53J29K52k24R2j44j8l8J97J7j91
$$ -208 -135 -48 12 222 -54 26 -57 28 120 44 -177 -241 -15 -168 -39 213 -11 81 -63 -81 -119 78 95 -96
5615i6L5J21L7J9Q4r4K14n7r5j64P2O1J24j23J1q8j10J08J89l43M3o2n8RJ5J92
$$ -96 -61 60 97 116 200 106 320 263 168 4 76 137 261 138 149 61 -49 59 248 -95 -52 -114 -172 -163 -148 44
5641D4L76l20k45K8L49m28M8K39n3J01k44K42j61J16o9M7K59k43Q4l05M17k83
$$ 44 420 100 -145 -117 232 -196 -148 91 38 139 -105 137 -24 92 23 70 329 86 170 -135 282 -1
5663ak42J71p5j7P8N6J46l19K8o0j0L28j81K54j52r7K97j55O4k45j56M1L69K57
$$ -1 -243 -72 -147 -164 -86 -30 116 -203 -175 -235 -245 83 -98 156 4 -93 204 49 113 -132 -288 -247 122 379
5687C79m96Q6J42j73l37M78P7k58K25m77rm2K16J90j2p5J79l13M5L49j34j33J0
$$ 379 -117 -31 111 -62 -399 79 156 -102 123 -354 -363 -405 -189 1 -11 -86 93 -220 -175 174 40 -93 -83
5710h3kJ63j06k99J93j48K75k85L16j14j73J87k33L05J0j41M04m98L27pk31o9
$$ -83 -85 78 -28 -327 -134 -282 -7 -292 24 -90 -263 -76 -309 -4 6 -135 269 -229 98 91 -140 -209
5732b09q4K72K41j97j4k95K64k03J09Q7N4j21K4j13J05L44m47L05q1J68l06J45
$$ -209 -293 -21 220 23 9 -286 -22 -225 -116 -29 25 -96 -72 -185 -80 264 -183 122 41 209 -97 48
5754D8p6M9l41K22o2J66J14R6k64K06k43R0J16Jm1M3j21P3K13J24k64k63R7K48
$$ 48 -28 21 -320 -98 -160 6 120 216 -48 158 -85 5 121 122 81 124 3 76 289 413 149 -114 -17 231
5778B31j17j11L0j04J45m4L11l46J44j60j66J08L66k04J81j88q6J70J3j99k04
$$ 231 114 3 33 -71 74 30 341 -5 139 -21 -187 -79 287 83 264 76 -10 160 173 -26 -230
5799b30J43M5L2j21P8k01M28j77l4l25N39j89R4J21o6r2Q1k86p6RM08m2p6n0Q9
$$ -230 -87 -42 -10 -131 -53 -254 174 -3 -37 -362 177 -12 82 203 137 45 126 -160 -236 -227 181 139 63 13 102
5824A02l6m47N48l03j03L8l8m9M43l89J73k87K09J78j36k53M76k03p0j22L00r3
$$ 102 66 -381 167 -136 -239 -201 -239 -288 155 -234 -61 -348 -139 39 -97 -350 126 -77 -147 -269 31 -62
5846f2q2QO6J71k14L65k99K87j13j57K0J61j18K82m60L01r2O6J40k17k69L65j93
$$ -62 -144 -136 -70 101 -113 252 -47 240 127 -30 -10 151 33 315 -145 156 64 130 270 53 -216 149 -44
5869d4J52j64M1l5J19J80j92l17J40M08k25J5L77m46k58K80Q2q4J2O1k36L07p7
$$ -44 108 -56 -15 -50 69 249 57 -260 -120 288 63 78 455 9 -249 31 113 29 41 102 -134 173 96
5892I6J78k08l11M87l62J12j47L13j13K36l34j62M80l80N30k00j75N3%j02L71
$$ 96 274 66 -245 242 -120 -8 -155 158 45 281 -53 -215 265 -115 415 215 40 93 93 -9 362
5913C62m41J37Lj32j24K31J5k13K14j70P2J8K76m5n41L76jm2j98J64J72M5j42
$$ 362 -79 58 61 -71 -195 36 51 -162 52 -118 -46 -28 248 203 -338 38 37 -5 -203 -39 133 178 36
5936C6r6N8%q4j27L23j10j63q4J14j4K88l36j1L7L65j90P7j21M3r9K01J23k79
$$ 36 -60 -2 -2 -86 -213 110 0 -163 -247 -133 -147 141 -195 -206 -169 196 6 83 -38 5 -94 107 230 -49
5960d9J4j34o1P4R3J19k6j36jr8J24j63L99k03j57P3l0J99K1j99Q3n8m5O9K53
$$ -49 -35 -169 -230 -156 -63 56 30 -106 -107 -205 -81 -244 155 -48 -205 -132 -162 37 58 -141 -58 -116 -161 -92 161
5985A61l73O7J79O1lj82j08L87K87o91J35L70m94M32j57j09poO3r4K04r6o8J56
$$ 161 -212 -145 34 95 92 -90 -198 189 476 -215 -80 290 -204 228 71 -38 -45 -51 12 -82 122 26 -42 114
6009A14n8j14J86k51J97n6K28K50k97j96M9j31P6J33k30L65j48k63K59j55qJ56
$$ 114 56 -58 128 -123 74 18 246 496 199 3 52 -79 -3 130 -100 265 117 -146 113 -42 -50 106
6031A06n3J9R5r6J52r2l31J57k08J24P5K21l8J1l55pL59k86M04l59N10k79L7j09
$$ 106 53 72 167 71 223 131 -200 -43 -251 -127 -52 169 131 142 -213 -220 139 -147 257 -102 408 129 166 57
6055E7j18r2L91J6m09J04q9J50O3O6k05L16l64J65j73j24N7j3L36j2r4j29o6K18
$$ 57 -61 -153 238 254 -155 -51 -140 10 73 139 -66 250 -114 51 -122 -246 -189 -202 134 122 28 -101 -167 51
6079E1j83j27q4N5K43m9q0J64l83L32N4j55K53j40p6L04m23J38o8J98j04O2J66
$$ 51 -132 -259 -343 -288 -45 -94 -174 -10 -393 -61 -7 -162 91 -49 -125 179 -244 -106 -174 24 -80 -18 148
6102A48o6N2l30K26Q4J5l77L06N7K29m39k5K39j3q0j09J19n0k68J76QJ10J78r
$$ 148 82 134 -196 30 114 129 -248 58 115 344 -95 -120 119 106 26 -83 36 -14 -282 -106 -98 12 190 181
6126A81o3q9j9k32K49J09j53J27j25J1k6k31N68j4j48r5l9J07q0l9k9j44J68j27
$$ 181 118 29 10 -222 27 136 -17 110 -15 -4 -30 -261 307 293 145 50 11 118 38 -1 -30 -174 -6 -133
6150a33L37j43k40J25J50J7R7j73k69J1K96j93rK05L1Jk0N3K1o2j41L3J33OJ46
$$ -133 204 61 -179 -54 96 113 210 37 -232 -221 75 -118 -127 78 109 110 90 143 164 102 -39 -6 127 133 279
6175B79m39K65N9J47m56O9Q1m2L8k25K35ok82l1K16J40k4m26N33j87Q6m9j36Q9
$$ 279 -160 105 164 311 -145 -76 5 -37 1 -224 11 5 -277 -308 -92 48 24 -402 131 -56 30 -19 -155 -66
6199f6j71L42m1r9LK88o8j89j08J37p6K23k17k57K80j84K9K21J68p1k21J49j22
$$ -66 -237 105 64 -35 -32 256 188 -1 -109 28 -48 175 -42 -299 -19 -203 -174 47 215 144 -77 72 -50
6222e0L8P8j8j40R5j59J92Qj61Q9P5l00K78R4l41K06k58N29k19j3J12k63J88Q3
$$ -50 -12 66 48 -92 3 -156 36 44 -117 -28 47 -253 25 119 -222 -16 -274 255 36 23 135 -128 60 143
6246A43k32R7J9K66k46j90J90K6l02Q8k7QK1M38m18j35L0O16m12M6L17m94L57
$$ 143 -89 8 27 293 47 -143 47 73 -229 -141 -168 -160 -139 299 -119 -254 -224 392 -20 26 343 -151 206
6269B06O2m09J19p5J92o7k9O9J74j66K71m20K93k20j47J56m6j5j51K44J6J19j18
$$ 206 268 -141 -22 -97 95 28 -1 68 242 76 347 -73 220 0 -147 9 -37 -52 -203 41 57 176 58
6292E8p1J62J04r4q4k10M28l29J27Mo8m3k48K46j92L18%k21L5j78K25J67k06l
$$ 58 -13 149 253 159 75 -135 293 -36 91 95 27 -16 -264 -18 -210 108 108 -113 -78 -256 -31 136 -70 -73
6316g3J94j27N5k0j1j62J63j66J23j13M05m47O6LM4K06o5R5j54j34J86j03Q1k54
$$ -73 121 -6 49 29 18 -144 19 -147 -24 -137 268 -179 -113 -110 -66 140 75 170 16 -118 68 -35 46 -208
6340b08L00Q7k99K92j68qRJ13j83N2M7J07k10J18L8j20P8k06J81K8q6r1J99N3
$$ -208 92 179 -120 172 4 -4 5 118 -65 -13 34 141 -69 49 87 -33 45 -161 20 48 -38 -129 70 123
6364A23Jk08n3J0N5o4J70k8j6j12L12j00l15J77j22j06K34Q1p2k30M04Kk11J30
$$ 123 124 -84 -137 -127 -72 -136 34 6 -10 -122 190 90 -225 -48 -170 -276 -42 39 -33 -263 141 143 -68 62
6388F2J81o1R8l78J6q7J77K36m36L41J9m8J91k64J26j79j70K56k7m6j60J53K58
$$ 62 243 182 280 -98 -82 -169 8 244 -192 149 168 120 311 47 173 -6 -176 80 53 7 -153 0 258
6411B58k51Nj22K50j20J37k48L14j98J24p5j02N3q8R6L1r0L81n0l13M3k23K22
$$ 258 7 12 -110 140 20 157 -91 223 25 149 74 -28 25 -63 33 64 -26 355 305 -8 35 -188 34
6434C4j07R7M3J08j14p2q4N1MJ7k47n5L03j15l1L6K63l96J8K30j86N5K59O9o7
$$ 34 -73 24 67 175 61 -11 -95 -44 -40 -23 -270 -325 -22 -137 -168 -132 131 -265 -247 -17 -203 -148 111 180 113
6459A13k04K84p8k37J28K6j9j90l5K73l92L94o6jPp5K49r8k80j78L59j81J55J82
$$ 113 -91 193 115 -122 6 32 13 -177 -212 61 -331 63 -3 -4 3 -72 177 79 -201 -379 -20 -201 -46 136
6483A36m11O34m84j3J19K06k95n7J14m8O0l5M0q9L3J38l46N35p3p4k19K04k18
$$ 136 -275 359 -125 -138 -19 187 -108 -165 -51 -99 -39 -74 -34 -123 -90 48 -298 237 164 90 -129 75 -143
6506a43J20J10K12k21l14K42j52J68qk3j88M30k82j72L48j29k13J65J09K01k72
$$ -143 -23 87 299 78 -236 6 -146 22 14 -9 -197 233 -49 -221 127 -2 -215 -50 59 260 -12
6527a2K10j08o5Qk6Q0l40L29J84m16K67k02J50jQ9m64Q32n66J81k48n6K17k3L3
$$ -12 198 90 25 33 7 87 -253 76 260 -156 111 -91 59 58 147 -317 515 -51 130 -118 -174 43 20 53
6551E3J49l42Mj24L39m29K8N06m09L8J75l17K43j27L99k13j14K31P3J64k52N6
$$ 53 202 -140 -136 -260 79 -350 -322 184 -225 -187 -12 -329 -86 -213 186 -27 -141 90 163 327 75 131
6573A31k13l4J90P2m3j53K09q6j53J40j85K83j68J24k65J22J12j30Q5R5j54j8
$$ 131 -82 -116 74 146 103 -50 159 73 -80 60 -125 158 -10 114 -151 -29 83 -47 38 133 -21 -39
6595c9N6J26J45j96L9l7n5k8J93n56M77K0k34jJ36k45J03M2K88K3j52m8pN2j88
$$ -39 17 143 288 92 131 94 39 11 204 -352 125 145 -89 -90 46 -199 -96 -54 234 257 105 57 50 102 -86
6620h6L22l68o0J05J36l4K4K9q7r4L11p3L4l19K01K69n27L63j86pk42j52M07L11
$$ -86 236 -132 -192 -87 49 15 39 68 -19 -113 198 125 159 -160 41 310 -217 146 -40 -47 -289 -441 -34 277
6644B77l48j37K75l6JJ87j75k9L76n30J72m6r1J92o9j14J00M0r1K00l15Q8j1j85
$$ 277 -71 -208 67 31 32 219 44 15 391 -139 33 -13 -104 88 19 -95 5 45 -46 154 -161 -73 -84 -269
6668b69K33J76k70M01j10Q3l71J66K0J7k05L5M1J4k56K87K72k58J95j52L60m26
$$ -269 -36 140 -130 271 161 244 -127 39 59 76 -129 -94 -53 -39 -295 -8 264 6 201 49 409 -17
6690a7m9Q8o4J49j40K45j22L09m50J04q3Qj67K39K75p90N50Q9k47J05j99N6K00
$$ -17 -66 22 -42 107 -33 212 90 399 -51 53 -30 -22 -189 50 325 -465 85 174 -73 32 -167 -111 89
6713H9o5K71n09K53l4k71P4J44Q5j49l4K0J50j02O6j59m3O97l11k08k61J96O5
$$ 89 24 295 -214 39 5 -266 -192 -48 37 -112 -146 -126 24 -78 -12 -171 -214 483 172 -36 -297 -101 -36
6736c6Q8j80q2Q2n8J91k90L04j87l1K05k40L80j46K14k56l1J31P6k18p5m5J61
$$ -36 52 -128 -210 -128 -186 5 -285 19 -168 -199 6 -234 146 0 214 -42 -73 58 134 -84 -159 -204 -43
6759d3J08l43L76k51N8q5J58N9N9N7l91M10m90M72l3m84L09j9J86j6L3J38l18
$$ -43 65 -278 98 -153 -95 -180 -22 37 96 153 -238 172 -318 154 121 -363 -54 -73 113 97 130 268 -50
6782e0R2n9o3J61j84L41nm27M17j16j41K14k05K28j06j11K97j17j01o3j67K25
$$ -50 42 -17 -80 81 -103 238 233 -194 223 107 -34 180 -25 203 97 -14 283 166 65 2 -165 60
6804F0k78K2K44j70K32l1k9K45k91J1J3J4q8J88l84M95L8n33K77K4k10PN4M0N7
$$ 60 -218 -196 48 -122 110 79 50 295 4 15 28 42 -46 142 -242 253 291 -242 35 59 -151 -144 -90 -50 7
6829Gj92k8L37O8m02J29J03J06k21k98L59j92L53o0N7m8r2J18k7k7m18L11j69
$$ 7 -185 -213 124 192 -210 -81 22 128 -93 -391 -32 -224 129 69 126 78 -14 104 77 50 -368 -57 -226
6852b26k8M76l38Q0J15N5N9l32J13o1J22m1k15k5J74j32K48L9k87K84j45n4M2
$$ -226 -254 222 -116 -36 79 134 193 -139 -26 -87 35 -6 -221 -246 -72 -204 44 83 -204 80 -65 -119 -77
6875g7M00j68k8o1P8j87J81m5j06j30P9O3K9j9O4j72J17n3j27K64J4l26N23l95
$$ -77 323 155 127 66 144 -43 138 93 -13 -143 -64 -1 28 9 73 -99 18 -35 -162 102 116 -210 313 -82
6899h2J89r8P1n2j68K4K52l09J73N5j11L14m7m70L37j40J73k39O5K00Qj8P1j39
$$ -82 107 9 80 28 -140 -116 136 -173 0 55 -56 258 211 -259 78 -62 111 -128 -63 137 145 127 198 59
6923E9k6j19J34j45J34k63J98L5M5m5J06j10J03j44pM7j0J48n25M51k76K22J3
$$ 59 33 -86 48 -97 37 -226 -28 7 52 7 113 3 106 -38 -45 2 -8 140 -385 66 -210 12 25
6946B5j2M33m54r8M3q1K22k39N47j76j15l6j18P6j88K69j8k77JL08N1j91k2Oj94
$$ 25 13 446 -8 -106 -63 -144 78 -161 386 210 95 59 -59 17 -171 98 80 -197 -196 112 163 -28 -50 -44 -238
6971b38L43l38J71J72Pk02N8K32j88K0J32k92Kr6K60j45J80r0k7K22j64j62m4
$$ -238 105 -233 -62 110 117 -85 -27 205 17 37 169 -123 -121 -217 43 -102 78 -12 -39 183 19 -143 -187
6994a87J74m46N86j49M8j92M95k56k21N12o58J61J61K69n10J97j06q0J5P3J13
$$ -187 -13 -459 127 -22 26 -166 329 73 -148 364 -294 -133 28 297 -213 -16 -122 -202 -187 -114 -1
7015an0L5j82K14j81R6L7L6k2k5J6K2j25KK39lj17J06j05l39L87j82K87k01Q1
$$ -1 -51 -16 -198 16 -165 -69 -32 4 -18 -43 -27 -5 -130 -128 111 108 -9 97 -8 -347 40 -142 145 -56 25
7040B5J28k36%m3J76m7J71k72L4Q6J15j56Lk2o5J98J68r7k15L11n21J23j50R3
$$ 25 153 -83 -83 -126 50 3 174 -98 -64 22 137 -19 -16 -38 -103 95 263 166 -49 262 -259 -136 -286 -193
7064a93J9Q4k3L9n7Q4j96J48K76k3j15P4j7k4O8k41R0k11K96Pj95K26k81L2j53
$$ -193 -174 -90 -113 -74 -131 -47 -243 -95 181 158 43 117 100 76 144 -97 -7 -218 78 85 -110 116 -165 -133 -286
7089b86L93l17L27l46q2K62J38k85M45j64k29J12O5k56L25M9k36L0J16K2p8K16
$$ -286 107 -210 117 -229 -311 -49 89 -196 249 85 -144 -32 33 -223 102 151 -85 -55 61 83 5 221
7111B21m21M29j78Lk68K04J50j76N8n3J65k23o4J76j62k2J49J2Q7N0M1j00j51
$$ 221 -200 229 51 54 -214 -10 140 -36 22 -31 134 -89 -153 23 -139 -161 -12 0 87 137 178 78 -73
7134g3J2O1K0o1m44N06P9j40rJ33q8o7p1L50n67M18M7m34J80N1K72k22l03L24
$$ -73 -61 0 20 -41 -485 21 100 -40 -49 84 -4 -71 -142 208 -359 59 106 -328 -148 -97 175 -47 -350 -26
7158b6r1m7K10R0l09RL00j44k3L44j91J06j63m69M36N4O9k55M6K05J34n5o27R0
$$ -26 -117 -164 46 136 -173 -164 136 -8 -31 313 122 228 65 -404 32 86 155 -100 -54 151 285 230 -397 -307
7182c07M45Pl13MK45j28P8Q7n8M9k49L73%q0k29k23o2M49n0k5N1j40M51n50J09
$$ -307 138 145 -168 -164 81 -47 31 118 60 109 -140 233 233 153 -76 -299 -361 88 38 13 64 -76 375 -175 -66
7207f6Q1q6M59q54K96K88N3k87Q0K6p4k7M27j39J9J14l63j78J25J39k11L00Q6
$$ -66 15 -71 388 -466 -170 118 171 -116 -36 -10 -84 -111 316 177 196 310 -53 -231 -106 33 -178 122 208
7230B08l65J75j42j03M34l36J9j19L45M8j75J18q5L5l56L72j2l57L25K0K09m57
$$ 208 -157 18 -124 -227 207 -129 -110 -229 116 164 -11 107 22 57 -299 73 61 -296 29 49 258 -199
7252a99qL10j79j16J08K10j45n6M23n36Q7J39N7j42j37P4K60Ll65M78m70K12k93
$$ -199 -207 103 -76 -192 -84 126 -19 -75 348 -188 -101 38 95 -47 -184 -110 150 153 -212 266 -204 8 -285
7275b85nK68j14o1K70r8J02J5k01J57N8n5j65K38m74J47L33J2o7k77K8K08j22
$$ -285 -290 -22 -136 -197 73 -25 77 92 -109 48 106 51 -114 124 -350 -203 130 142 75 -202 -174 34 -88
7298h8L44l3l73K76O8n6P6l05R7k02J41M7l7J38j09n0P5L7M7l29o2J0M14k64J07
$$ -88 256 223 -150 126 194 138 214 -91 6 -196 -55 -8 -45 93 -16 -66 9 46 93 -236 -298 -288 126 -138 -31
7323c1P3k71J82N3N1Q6k31K61k69KJ04k62K98l05J95J73Q7k05K98k45J04L5l36
$$ -31 42 -229 -47 6 57 143 -88 173 -96 -94 10 -252 46 -259 -64 109 196 -9 289 44 148 183 -153
7346a53J49j48L41j17j08K16j52O2M7l68K72n7K30l65J38j1j3k9J84j16k10K38
$$ -153 -4 -152 189 72 -36 180 28 90 137 -231 41 -16 214 -151 -13 -24 -37 -66 118 2 -208 30
7368C0j69J46l2N9k92K19N0r0k7J25j70J4J18j20m9k29L54K16l1l18R4J87o0k20
$$ 30 -139 7 -25 34 -258 -39 11 -79 -106 19 -151 -137 -19 -139 -188 -417 -63 153 122 -196 -102 85 25 -195
7392a95o9K4L95L2k00m3K6k77J68J21l7L33k56j06L78k75R7j12kJ75j14RK3k54
$$ -195 -264 -240 155 187 -13 -56 -30 -307 -139 -18 -55 278 22 -84 294 19 116 4 2 177 63 72 95 -159
7416a59M69n49q9L78j96L62l93M1J40m5J15J03k21N4j20nJ15J38J61k72j04J37
$$ -159 310 -239 -328 50 -146 216 -177 -136 4 -41 74 177 -44 10 -110 -115 0 138 299 27 -77 60
7438F0J22k01j68R6J99r2K7Q8m6J2r8J63l7m9j0J1j84P9j02L54l56K16r8O0K03
$$ 60 182 -19 -187 -91 108 16 43 131 85 97 -1 162 125 76 66 77 -107 -28 -130 224 -132 84 -14 46 249
7463B49m84L49K29k82j44J9K02j21J99k24J25l20K64K60l55L10l59P5J07p9P5
$$ 249 -235 114 343 61 -83 -64 138 17 216 -8 117 -203 61 321 -34 276 -83 -8 99 20 95
7484I5l83K55O9J8m70L68Q8r1k08M20k02P4j00J50k14K3Q3O9J76j27n2K2j93L50
$$ 95 -288 -33 36 54 -416 -48 40 -51 -259 161 -41 33 -67 83 -131 -108 -25 44 220 93 41 63 -130 220
7508B20m39K5K64N9k37J35k0r1K17j93K05k14M1P7k88J00M11j74j45J94J50l26
$$ 220 -219 -194 70 129 -108 27 7 -84 133 -60 145 -69 -28 49 -239 -139 272 98 -47 147 297 -29
7530b9J44j95n2O3L3K91m99K75q4J12p7j50L85k10j36N2L22k33k39K67J3N6j42
$$ -29 115 -80 -132 -69 -36 255 -244 31 -53 59 -18 -168 217 7 -129 -77 245 12 -227 40 53 109 -33
7553c3J07j78O3q0J58J20m05K06K2R2K9k69L05Ok11K02k8k26j76J17j6P2P1l71
$$ -33 74 -104 -41 -121 37 157 -248 -42 -20 72 101 -168 137 143 -68 134 106 -120 -296 -179 -195 -123 -52 -423
7577d23L98K20k08J47j77q6L76J1k39j13q6L65k71J20K1m0J62j0k77L37j57o2
$$ -423 -25 195 -13 134 -43 -129 247 258 19 -94 -180 185 -86 34 55 15 177 167 -110 227 70 8
7599HO9n7kk24N1J23qJ89M4k56j09L05j12K02k02O9m9M9k4m17M75j32oj0PJ1l18
$$ 8 77 20 18 -206 -155 -32 -40 149 193 -63 -172 133 21 223 21 90 41 90 66 -351 124 -8 -14 -24 -17 -6 -324
7626c24l4L49J46j61O4j85j1J37J70j91k6q8PK1K66j49K04m36L60l61L67k69J16
$$ -324 -358 -9 137 -24 40 -145 -156 -19 151 -40 -66 -154 -147 -126 140 -9 195 -241 119 -242 125 -144 -28
7649b8pj49J65K70j14l29q0K94K1j9j03J86J80l49J27J06Jj64R1j11j01J85J12
$$ -28 -35 -184 -19 251 137 -192 -272 22 43 24 -79 107 287 -62 65 171 172 8 99 -12 -113 72 184
7672A84k87L16j03l8k07M9J32K59k66k66K44K28l92L56l14M18l94J71N8j30J24
$$ 184 -103 213 110 72 -135 -86 46 305 39 -227 17 245 -147 209 -105 313 -81 90 148 18 142
7693A42m4m6r8J11k07M10l70L5Q9Pj32k5R2J97k25J13p4K9P7L4j71L4J77p5P4
$$ 142 98 52 -46 65 -142 268 -102 -67 22 29 -103 -128 -36 161 -64 49 -25 4 81 115 -56 -22 155 80 154
7718A54l4r2l03K24K93j5l03JK21k14n5P0J62J3L3j33n8k47j57N83k50OJ10K98
$$ 154 120 28 -275 -51 242 227 -76 -75 146 -68 -123 -53 109 122 155 22 -36 -283 -440 143 -107 -101 9 307
7742C07k69r7q8L40l37K2P5J02j71j78L02j41J27k2O9J01j44j99M34k94J18k65
$$ 307 38 -59 -147 193 -144 -122 -47 55 -116 -294 8 -133 -6 -28 41 142 -2 -201 233 -61 57 -208
7764b08K75k88J83J92m53J38J04K75m43J64K0L9P3j43N7p9K34l8j24K19o17K48
$$ -208 67 -221 -38 154 -299 -161 -57 218 -225 -61 -41 -2 71 -72 -15 -94 140 102 -22 197 -420 -172
7786a72K36j14J2M8mJ4p3K68j53j10L48j38j51P3k20L62r9l07K08j23K28l32L43
$$ -172 64 -50 -38 10 6 20 -53 215 62 -48 300 162 11 84 -136 226 127 -180 28 -95 133 -199 144
7809A44O1l39j64K42K06l41J31k3K83l03l5O0K32j35K67k54m8M8j23J29p7K78
$$ 144 205 -134 -298 -56 150 -191 -60 -83 200 -103 -138 -78 154 19 286 32 -16 32 -91 38 -39 239
7831B39j44r6J17j74p2K26l66J50K37K70r7m37Qr5K31J45L7k26j00L2L11k31l6
$$ 239 95 -1 116 -58 -130 96 -270 -120 117 387 290 -147 -139 -234 -3 142 179 -47 -147 -115 196 -35 -71
7854g1K60p5J31k21L6o4l2K31k03K78l16P4m0j56K17P1j03J7J4l45L37J78m19
$$ -71 189 114 245 24 60 -4 -36 195 -8 270 -46 28 -12 -168 49 120 17 34 48 -297 40 218 -201
7877b01K48J20j75K43k61j99J91KJ12o6K4k58L73k92Oj44P9K19k80N18m2j84Q6
$$ -201 47 167 -8 235 -26 -225 -34 -32 80 14 38 -220 153 -139 -133 -277 -198 21 -259 259 217 33 119
7900A19j58l0L32n7n43M31K00m10Nl8k9j2K08J01k90RJ10Q6M2l08L80j42L1L1
$$ 119 -39 -69 263 206 -337 94 294 -116 -111 -149 -178 -190 18 119 -171 -162 -52 34 76 -232 148 6 37 68
7924F8M0J76k25k22J88q5J84pk53L27j80J33R9k34r4N9J2j70P8L05k67J11J13
$$ 68 108 284 59 -163 25 -60 124 117 -136 191 11 144 243 9 -85 -26 -14 -184 -106 199 -68 43 156
7947A56n2j48k0J81j58m5J14R0pl99K50N8J08j82J70k42k8J33J02Lm24L41%M3
$$ 156 104 -44 -64 117 -41 -86 28 118 111 -288 -38 20 128 -54 116 -126 -154 -21 81 84 -340 1 1 44
7971D4j17K05Q7o1k86K98j05J25k43k91J82n6M33l32K2J38j3k34J7PL11j55R0
$$ 44 -73 132 219 158 -128 170 65 190 -53 -344 -162 -218 215 -117 -95 43 30 -204 -187 -180 131 -24 66
7994F6J46j67K19l82n4J6L19j02P6P8o5N7k12j7J28o7j65L23m52K54L01m11K47
$$ 66 212 45 264 -118 -172 -156 163 61 137 215 150 207 -5 -22 106 39 -126 197 -255 -1 300 -111 136
8017A36n0k75J54r0K58K2j99j50J16K16Om6q4r2K01m62K28K8P2K05k27K01l47
$$ 136 86 -189 -35 -125 133 155 -44 -194 -78 138 144 98 14 -78 123 -339 -111 -83 -11 194 -33 168 -179
8040a79J57j4L24m04Q1j26J94J93k5l31K17l51J35K9M21l14J05K4k18J93k22m2
$$ -179 -22 -36 288 -116 -35 -161 33 226 201 -130 87 -264 -129 -100 321 7 112 136 -82 111 -111 -153
8062a53k39K92K38K2L0k39O5j2j58J27k98N53l00J36m9p4K35j92J27r3l13K12
$$ -153 -392 -100 138 160 190 -49 16 4 -154 -27 -325 228 -72 64 15 -59 176 -16 111 18 -295 -83
8084h3j09k09M27j37j15M1K26J3j40K52q3L11j99p1k88K27J10l52L19m47K29K94
$$ -83 -192 -401 26 -111 -226 -185 41 54 -86 166 83 394 195 124 -164 63 173 -179 140 -307 -78 216
8106B16p2l42J67L26j64n1j63j0M7q3J7L8l00L47J56J27N1l90J54k92J56N8J06
$$ 216 144 -198 -31 295 131 80 -83 -93 -46 -129 -112 -74 -374 -27 129 256 307 -83 71 -221 -65 -7 99
8129I9l85K84no2J87j98R2j95M5N1R0J28j78J19l88M18l83K23KK27k51J99k23
$$ 99 -286 -2 -7 -69 118 -80 12 -183 -138 -87 3 131 -47 72 -316 102 -281 -58 -56 171 -80 119 -104
8152a04J33j79K43N9k6p7k00J22n9J16M4Ol0k5p8K07j44j20J07Q7r5j54M16j07
$$ -104 29 -150 93 152 126 49 -151 -29 -88 28 72 78 48 23 -55 152 8 -112 -5 82 -13 -167 249 142
8176A42j24Nj28K16m6J7q3k83M45k84J50j84J36j5n0
$$ 142 18 23 -105 111 65 82 -1 -284 161 -123 27 -157 -21 -36 -86
8191h6
$$ Imaginary data points
##PAGE= N=2
##DATA TABLE= (X++(I..I)), XYDATA
0@%%%%%%%%Nj3J6j6J6j7K5l2L9m7N4o2P2q7J01j16J33j52J74j97K23k52K83l20
$$ 0 0 0 0 0 0 0 0 0 5 -8 8 -8 8 -9 16 -16 23 -24 30 -32 40 -47 54 -62 71 -81 93 -104 119 -133 150 -170
32a70L59m02M51n01N58o21O89p64Q45r35J036j148J272j410J564j741J945k180
$$ -170 189 -213 238 -263 295 -326 363 -401 444 -491 545 -603 669 -741 823 -918 1027 -1153
50a153K457k788L189l690M341n222O485q458J1999k0301P3780M2127j61696q25
$$ -1153 1304 -1484 1705 -1985 2356 -2866 3619 -4839 7160 -13141 60639 102766 -58930 -59755
64e9755J08331J3151j06675k399Q4993J0597p3447J193N4326k847m7406R765L3798
$$ -59755 48576 61727 -44948 -47347 37646 48243 -25204 -24011 30315 27468 -19938 -10173 23625
77B3625j1330k8863J4232J9938j1435j3664J3133O297j1289m947Q169l38k669
$$ 23625 12295 -16568 -2336 17602 6167 -7497 5636 11933 644 -4303 3866 3528 859
90H59L391P08o303J853N667n733o824R046O510j2094m815J4185K518j6911j360
$$ 859 4250 4958 -1345 508 6175 442 -6382 2664 9174 -2920 -7735 6450 8968 -7943 -9303
105i303J8384r83j8915L779J8281o473k0223Q405J9491j0171j8206J1918J6586
$$ -9303 9081 8098 -10817 -7038 11243 4770 -15453 -7048 12443 2272 -15934 -4016 12570
118A2570j4819j6673J7208J6477j8190j6295J8188J5406j8487j5683J7334J5677
$$ 12570 -2249 -18922 -1714 14763 -3427 -19722 -1534 13872 -4615 -20298 -2964 12713
130A2713j5075j4311J4018J2679j4725j2877J3400J3965j0538j2899Q157J2191
$$ 12713 -2362 -16673 -2655 10024 -4701 -17578 -4178 9787 -751 -13650 -5493 6698
142F698o677j0703N702R049n082p823M244P298m024n845M669N993m656n593M370
$$ 6698 21 -10682 -4980 4069 -1013 -8836 -4592 2706 -1318 -7163 -2494 3499 -1157 -6750 -2380
157b380M776m511l771N394M243m654m271M283L930l166k642L130J834l367j856
$$ -2380 2396 -2115 -5886 -492 3751 -903 -5174 -891 3039 -127 -2769 361 2195 -1172 -3028
172c028L899K899k919k827J815L808r67m156p9M982J294m675j600N151K168n812
$$ -3028 871 3770 851 -1976 -161 3647 2680 -1476 -1555 3427 4721 46 -1554 3597 5765 -47
188d7l228O980L919o901m334P498M152p886m137Q893L858r156l111R394K627j0104
$$ -47 -3275 3705 7624 723 -3611 3887 8039 153 -3984 4909 8767 -389 -3500 5894 8521 -1583
204a583k788J0427K104r632l44Q986o11j0454J766R494k362r223L443R082l949
$$ -1583 -4371 6056 8160 -1472 -1816 7170 6559 -3895 -2129 7365 5003 -4220 -777 8305 4356
219D356q881L549Q031m269p536M119O790m087o220M082M800l516m328K384L586
$$ 4356 -4525 -976 7055 2786 -4750 -631 6159 2072 -4148 -66 4734 1218 -3110 -726 2860
234B860l348k540K941K322k326k750J190K729j295k695P89L082m88l631l92L143
$$ 2860 -488 -3028 -87 2235 -91 -2841 -1651 1078 -217 -2912 -2123 959 471 -3160 -3552 -409
250d09Q31l533q62L540R64m266j024M154L61l849l64M433R9m601J00M792j122
$$ -409 422 -3111 -3973 -433 531 -3735 -4759 -605 -244 -4093 -4457 -24 75 -4526 -4426 366 -756
267g56m378J340N387k267m983J800M763k343m324K479M963j869m139R96L870j240
$$ -756 -5134 -3794 1593 -674 -5657 -3857 906 -1437 -5761 -3282 1681 -188 -4327 -3331 539 -701
283g01l522J380L204p4l028L41K676O19k309j331J917K152j982k041K014L439
$$ -701 -4223 -2843 361 287 -2741 -2400 276 895 -1414 -2745 -828 1324 -658 -2699 -685 2754
299B754j927l446K418L169k665k991L057L771l092l150L419L097l599k723M164
$$ 2754 827 -2619 -201 2968 303 -2688 369 4140 1048 -2102 1317 4414 815 -1908 2256
314B256L052m777k121M378K231m919j603N295J481m602j467M543R08m810m70M907
$$ 2256 5308 531 -1590 2788 5019 100 -1503 3792 5273 671 -796 3747 4655 -155 -625 4282
330D282M20m178m14M297J42m102p85L717R93l439j197L356J711l683k052L355
$$ 4282 4702 524 110 4407 4549 447 -338 3379 4372 933 -264 3092 4803 1120 -932 2423
346B423K098l138l031L394K580k948l558L500L439l569m045L719L186l202m121
$$ 2423 4521 1383 -1648 1746 4326 1378 -2180 1320 4759 1190 -2855 864 4050 848 -3273
361c273M203K912m231l276M224K456m537k031M490J741m784j595M541P01m669
$$ -3273 930 3842 -389 -3665 559 3015 -1522 -3553 937 2678 -2106 -3701 840 1541 -3128
376c128m83M395k01m045K10L860p02l259O26K796j142k407M24K304j54j737K43
$$ -3128 -3611 784 583 -3462 -3252 608 -94 -3353 -2727 69 -1073 -3480 -3056 -752 -906 -2643 -2400
393b400P06Pn53o39K41J736k53j583l51K178P06k741n38L022K49l001j24L859
$$ -2400 -1694 -1687 -2240 -2879 -2638 -902 -1155 -2738 -3089 -911 -205 -2946 -3484 -462 -213 -3214 -3338 521
411E21J78m222Q6M543k98n069J397N231j144n065J343N281j705m852J616N122
$$ 521 699 -3523 -3437 1106 808 -4261 -2864 2367 1223 -3842 -2499 2782 1077 -3775 -2159 2963
427B963j857m188K304M082j857l948K175L563j836l336K196L184k223k803K401
$$ 2963 1106 -3082 -778 3304 1447 -2501 -326 3237 1401 -1935 261 3445 1222 -1581 820
442H20K571j721k400J593K782j563k428R36K586o71k229P66K264j8k796J32K471
$$ 820 3391 1670 -730 863 3645 2082 -346 590 3176 2505 276 1042 3306 3288 492 624 3095
459C095J68l276L58L132J27l396q20M130K97l525p94L817M71l882o50L385Q74
$$ 3095 3263 -13 345 3477 3604 208 -612 3518 3815 290 -504 3313 3784 -98 -748 2637 3511
476C511l592q55L541N08l491p37L389M08l176l86K653L38k568o63K728N21l145
$$ 3511 -81 -936 2605 3113 -378 -1115 2274 2682 -494 -880 1773 2111 -457 -1120 1608 2129 -1016
493a016j234L137N19k650j154L135J316l623j571L397J075k914j687L109J515
$$ -1016 -2250 887 1406 -1244 -2398 737 2053 -1570 -3141 256 1331 -1583 -3270 -161 1354
508A354l255j938L487J593l892j135L579J243m146j300M291J285m485r33M327
$$ 1354 -1901 -3839 -352 1241 -2651 -3786 -207 1036 -3110 -4410 -119 1166 -3319 -4252 75
523G5P06m273n82M297N14m141l66L845J25l461P7L634l72l492P23K664n21k277
$$ 75 781 -3492 -4074 223 737 -3404 -3770 75 200 -3261 -3184 450 78 -3414 -2691 -27 -548 -2825
541b825R05J994o28k178J452J538r49r62J051R05o02o89M66O75p8kj68L68K97
$$ -2825 -1920 74 -554 -2732 -1280 258 -691 -1653 -602 303 -299 -988 -522 153 75 73 -95 273 570
560E70m6q63o5J142O79j587J61J907k35k106M33K378p3k592O72K829r57k896R47
$$ 570 524 -339 -404 738 1417 -170 -9 1898 1663 -443 -10 2368 2295 -297 375 3204 2247 -649 298
579B98L356j007l169J023L253j411l058J338L199j386k698J578K099j439k100
$$ 298 3654 2647 -522 501 3754 2343 -715 623 3822 2436 -262 1316 3415 1976 -124
594a24J467J810j656j455J262J374j322j071J196Q44j227q63O24Q12m40q27M75
$$ -124 1343 3153 1497 42 1304 2678 1356 285 1481 2325 1098 235 859 1671 1231 404 879
611H79L87o16l91J25M36m05l31M27K88k52q52k69Q03l00o58KJ330j90j963NJ902
$$ 879 1266 650 259 384 820 415 84 511 799 547 -305 -574 229 -71 -729 -727 603 413 -1550 -1545 357
632C57m01k343L74K239J18k677M5K585j83l004O28K620n15k977O49L038o18l290
$$ 357 -44 -2387 -2013 226 344 -2333 -2288 297 114 -2890 -2262 358 -157 -3134 -2485 553 -65 -3355
650c355R70K704p20l175J096K759j325k178J183K121q89j951P38K089n95j988
$$ -3355 -2385 319 -401 -3576 -2480 279 -1046 -3224 -2041 80 -809 -2760 -2022 67 -528 -2516
666b516P28K157j024j961J113K059j085j561R44J810j012j557O71K254p88k092
$$ -2516 -1788 369 -655 -2616 -1503 556 -529 -2090 -1146 664 -348 -1905 -1234 1020 232 -1860
682a860J391J554o45j744N70K310o18j976M66K238o67j582L75K015l90j684N75
$$ -1860 -469 1085 440 -1304 -734 1576 958 -1018 -552 1686 1019 -563 -188 1827 1437 -247 328
699C28J205l27j025K14R65L37j112k56J005K34m70k74K73P78m35p27O13Q56q72
$$ 328 1533 1206 181 395 1360 1697 585 329 1334 1568 1098 824 1097 1875 1440 713 1326 2182 1310
718A310r93Q73J528j089j530Q30J637j160j529J248J537j243j994J631J670j924
$$ 1310 317 1190 2718 1629 99 929 2566 1406 -123 1125 2662 1419 -575 1056 2726 802
734H02j471K233J184k502j381K734Q65k740o64K352Q21l199k81K516L38k370n15
$$ 802 -669 1564 2748 246 -1135 1599 2464 -276 -940 1412 2233 -966 -1247 1269 1607 -763 -1278
751a278K705k19k774L11J995l83j702L54J506p26j468M73J248m63r38L93J09L7
$$ -1278 1427 1208 -1566 -1255 740 357 -1345 -991 515 -211 -1679 -1206 42 -421 -1359 -966 -857 -820
769h20l59k26q8K82M48k44n77J5O82o18l82J094M8j004k12J659m9j754O3J714
$$ -820 -1179 -1405 -1493 -1211 -763 -1007 -1584 -1569 -887 -1505 -1887 -793 -745 -1749 -1961 -302 -351 -2105 -2042 -328
789c28K4j974M04K045o08k126J021K055j174k018J490J906j447j765J787J754
$$ -328 -304 -2278 -1874 171 -437 -2563 -1542 513 -661 -2679 -1189 717 -730 -2495 -708 1046
805A046j530j803J877J545j331j917K146J586j639j822J720J747j724r45J627
$$ 1046 -484 -2287 -410 1135 -196 -2113 33 1619 -20 -1842 -122 1625 -99 -1044 583
820E83R49j431o18J078P35q77n32R34O09p62n45O46P06o05p83P24P75m27o90O39
$$ 583 1532 101 -517 561 1296 419 -113 821 1430 668 123 769 1475 870 87 811 1586 1159 469 1108
840A108O30m21q76Q37P61r06o63P13P71q16p02R21L94q61o35J154M46j040l91
$$ 1108 1738 1317 441 1278 2039 1133 470 1183 1954 1138 436 1357 1751 890 255 1409 1855 815 424
859D24P54K79j009q4N82K68k35j44k17J03k33l8l13J27N38o30l27n9P55l33j070
$$ 424 1178 1457 448 364 946 1214 979 835 618 721 488 450 137 264 802 172 -155 -214 541 208 -862
880h62M40J349p25j415N83J240n14j401Q83J396j525j430J264J512j543j381J767
$$ -862 -422 927 202 -1213 -630 610 96 -1305 -422 974 -551 -1981 -717 795 -748 -2129 -362
897c62R34k192j005K172Q41k404n74K805n9k420j06K348J93k389J56K190k58k077
$$ -362 572 -1620 -2625 -453 388 -2016 -2590 215 156 -2264 -2370 -22 171 -2218 -2062 128 -130 -2207
915b207L6K012j20j725O45J678p00j696Q26J723p64j520Q07J342p35j092P17P30
$$ -2207 -2171 -159 -279 -2004 -1359 319 -381 -2077 -1251 472 -292 -1812 -1005 337 -398 -1490 -773 -43
933d3l19q60P29O33m04p41M07R64j97k90NK29m4k74Q4N32j00j41k26N90p8j09
$$ -43 -362 -1222 -493 140 -264 -1005 -598 366 169 -121 -116 113 69 -205 -121 411 311 170 -56 534 456 347
955C47j12L14j0K13j35N9L94p29K38K72L10n48k05O19J96j16p29O84N13p04o62
$$ 347 235 549 539 752 617 676 1070 341 579 851 1161 613 408 1027 1223 1107 378 1062 1575 871 209
976B09R05R30r30r53Q90J160j171j146R64O78p05o57R52Q20j335j030J459P65
$$ 209 1114 2044 1114 161 1051 2211 1040 -106 858 1536 831 174 1126 1946 611 -419 1040 1805
994A805j411q19J237P46j452p05J443O25j709j65J287p8j306M4J075j97j151K90
$$ 1805 394 -425 812 1558 106 -599 844 1469 -240 -405 882 804 -502 -458 617 420 -731 -441
1012d41R24o54p01Q01J70n26l84N21R3o56l9M53K61p63J86LN3j65K81k34n22J78
$$ -441 483 -171 -872 -71 99 -427 -811 -290 -197 -853 -892 -439 -178 -941 -755 -752 -699 -864 -583 -817 -1339 -1161
1034a161P21o41k18O68K79n81n14Q31M30j293j10J546Lj585N7J584R8j696J39
$$ -1161 -440 -1081 -1299 -631 -352 -933 -1447 -616 -186 -1479 -1589 -43 -40 -1625 -1568 16 114 -1582 -1443
1053a443J542j93j614N16J390k66j239K39J207k01j373J027P90n40p91O64O08
$$ -1443 99 -94 -1708 -1192 198 -68 -1307 -1068 139 -62 -1435 -408 382 -158 -949 -285 323
1070C23o71k95O47N16n34j36M64M98p71k85N18P18k38q58K35O57j09n38j38R54
$$ 323 -348 -643 4 520 -14 -150 314 812 41 -244 274 992 754 -104 131 788 679 141 3 957
1090I57K87j170J20Q77L84j395j1J478K12j423k50J384J25j153q3J302l81j173
$$ 957 1244 74 194 1071 1455 60 49 1527 1739 316 66 1450 1575 422 339 1641 1260 87
1108H7L5J633p16j073P09Q74q67l75K67Q59m50q79N65O01q52m58K80P73n26m09
$$ 87 122 1755 1039 -34 675 1549 682 307 574 1433 983 104 669 1270 418 -40 240 1013 487 78
1128G8M38J95r7n76K52o9J15n34o6L15kk56j13L67J17l74n07R07p1m62j54L19
$$ 78 516 711 614 38 290 221 336 -198 -264 51 49 -207 -320 47 164 -210 -717 190 119 -343 -497 -178
1150a78n4m61j05Q34k92o78m07R35Q6o90k22N56J76q30J28N87%o19k09N25L09
$$ -178 -232 -693 -798 36 -256 -934 -1341 -406 -320 -1010 -1232 -676 -500 -1330 -1202 -615 -615 -1234 -1443 -918 -609
1171f09n19j58M10R7J31k57Q6J37j2k46j52N15N6o55K40N66q2m98K95N53m11m19
$$ -609 -1128 -1286 -876 -779 -648 -905 -819 -682 -694 -940 -1092 -577 -521 -1176 -936 -370 -452 -950 -655 -102 -513 -932
1193i32N04Q48n27p59O66O97o06q58Q79Q75j082k89M25J064j169k60O91Q93p33
$$ -932 -428 420 -107 -866 -200 497 -109 -967 -88 787 -295 -584 -159 905 -264 -524 167 1060 327
1212C27m58Q78K27r05j49R79n9n83N4N11N3m68o0J125m64m84N34ln84K46l6rK39
$$ 327 -131 747 974 69 -80 899 840 257 311 822 875 407 347 1472 1008 524 1058 1055 471 717 681 672 911
1235I11n5rj8p2J6k34L46L01j74j79m89K86L39l96LK05k8m22KK50k07j32l35N49
$$ 911 856 847 829 757 773 539 885 1186 1012 833 344 630 969 573 576 781 753 331 333 583 376 244 -91 458
1259D58L62r86J21O86j97o94j13J053n36q42M84Q18j010r9jP07m31o24K00N90
$$ 458 820 -166 -45 641 444 -250 -363 690 154 -688 -204 614 -396 -495 -496 211 -220 -844 -644 -54
1279e4l66o13Q02l1l99j92J90L75j53n63J86N47o85r1J39K23j93j60L35rOm09
$$ -54 -420 -1033 -231 -262 -661 -853 -663 -288 -441 -1004 -818 -271 -956 -1047 -908 -685 -878 -1038 -703 -712 -706 -1115
1301a115M31M4j71l65N79L95l91n54L16L93J90m13Q9J23j34L03k36N01k47k66
$$ -1115 -684 -640 -811 -1176 -597 -202 -593 -1147 -831 -438 -248 -661 -572 -449 -583 -280 -516 -15 -262 -528
1321e28M18j85K19j29m6K86K71m88kK56J31l55J29R6K97j15o13Q86O8k25l13K73
$$ -528 -110 -295 -76 -205 -251 35 306 -182 -184 72 203 -152 -23 73 370 255 -358 528 596 371 58 331
1343C31L46m77J47q6P15l59m95N24J80k01p47J004p2m59M0M47M00n95n42J052
$$ 331 677 200 347 261 976 617 122 646 826 625 -122 882 810 351 391 838 1238 643 101 1153
1363A153m3p30k5M15J27o75Q4Q37J8p96o5N33J36p29n5O93j92o56O9M61L60q79
$$ 1153 1110 380 355 770 897 222 306 1143 1161 365 300 833 969 240 185 878 686 30 99 560 920 41
1385D1j64O81k9p25J33N33o9n68J57K69L0o44K15K16k39l40P5M69rl53k23L77
$$ 41 -123 558 529 -196 -63 470 401 -167 -10 259 289 -355 -140 76 -163 -503 -428 41 32 -321 -544 -167
1407a67k78j91J0L48k90l08L94P6j03k31k69O57j53m2k07J85l76K08j32J95L06
$$ -167 -445 -636 -626 -278 -568 -876 -482 -406 -509 -740 -1009 -352 -505 -547 -754 -569 -945 -737 -869 -674 -368
1428c68l62J3K58P4j48k26K58lQ5m96K61L08k63j09OP45m57k26L32N0J87n90L91
$$ -368 -730 -717 -459 -385 -533 -759 -501 -504 -419 -915 -654 -346 -609 -718 -712 33 -424 -650 -318 -268 -81 -671 -280
1451b80M00n28O3J27N20m38l71M30M28k79m70N77J01j04r8K34K85l85k14N14o2
$$ -280 120 -408 -345 -218 302 -136 -507 -77 351 72 -398 179 280 176 78 312 597 212 -2 512 450
1472D50k31r1M73l4k8k09K81p2J45k29Q0K36l0R8j91J28J17k12j15K15m7j15j63
$$ 450 219 128 601 567 539 330 611 539 684 455 535 771 741 839 648 776 893 681 566 781 734 619 456
1495D56M69ql22k22M08K2l33l61M96L07m02j37K46P9l52k5L94%p34r9O73j04l82
$$ 456 925 917 595 373 781 803 470 109 605 912 510 373 619 698 346 321 715 715 -19 -118 555 451 69
1518F9L56n5O2q07J37O52p16R8p4L53M7l72k05N03k5o24J59J38j3k79L74j99m0
$$ 69 425 370 432 -375 -238 414 -302 -204 -278 75 122 -250 -455 48 23 -601 -442 -304 -317 -596 -222 -421 -461
1541d61j72L45k05J3k71J44Nk63Q0L47J5l6l75L16K71l73j01K15L6L00l59p2K80
$$ -461 -633 -288 -493 -480 -751 -607 -602 -865 -785 -438 -423 -459 -834 -518 -247 -620 -721 -506 -470 -170 -529 -601 -321
1564c21q6k84L49K0p4j88l78P37K71n81J17J98M0k5p1J86M1n85L39K51K12o29
$$ -321 -407 -691 -342 -322 -396 -584 -962 -225 46 -535 -418 -220 -180 -205 -276 -90 -49 -634 -295 -44 168 -461
1586d61L42K46r3q7K5J42J53j78K59J42J6l56J22L46K0o03K30L50J18k78mQq1
$$ -461 -119 127 34 -53 -28 114 267 89 348 490 506 150 272 618 638 35 265 615 733 455 451 459 378
1609C78j28J6K13K36k30k19K33J46j74j2J25j35Kk2N7Q8n0j26R1M61l06k00k16
$$ 378 250 266 479 715 485 266 499 645 471 459 584 449 451 429 486 574 524 398 489 950 644 444 228
1632B28K26Q1p70O83R6J6j35j47q8J02Mq7k6K06n64l8M49k66n05N73M71m76j76
$$ 228 454 535 -235 448 544 560 425 278 190 292 296 209 183 389 -175 -213 236 -30 -535 38 509 33 -143
1655a43k46N37j38o37L51J89k95l22O54%n80j10N80K61p46o4O60j01n80l33O87
$$ -143 -389 148 10 -627 -276 -87 -382 -704 -50 -50 -630 -740 -160 101 -645 -709 -49 -150 -730 -1063 -376
1676c76L01l87k16M29O4n67m5K44k05o0Q5L73nm53J41Q5o4K47J35J36k43J57j2
$$ -376 -75 -462 -678 -249 -185 -752 -797 -553 -758 -818 -733 -360 -365 -818 -677 -592 -656 -409 -274 -138 -381 -224 -236
1699b36k49L45j01k51r3M23j23J93k68J82j5k31L94j80M32j77r4P6q4j72L06j80
$$ -236 -485 -140 -241 -492 -585 -162 -285 -92 -360 -178 -193 -424 -30 -210 222 45 -49 27 -57 -229 77 -103
1721a03L17p9J02j82L71m18L50J3N8n50L69L63L3m21J91L04m77M52l38K81j29
$$ -103 214 135 237 55 426 8 358 371 429 -121 248 611 644 223 414 718 241 693 355 636 507
1742E07k9P2K61k20k08j50N90q5j77j90J30K38k35j9j49J26j65o3M32j14k46P5
$$ 507 478 550 811 591 383 233 823 738 561 371 501 739 504 485 336 462 297 234 666 552 306 381
1764C81M17l09l81p0L76m0m30L05J58j53p4N9K18l87k89K63L63n8o20O9L28j68
$$ 381 798 489 108 38 414 374 -56 249 407 254 180 239 457 70 -219 44 407 349 -271 -202 126 -42
1786d2n9J81J05k11j21k10J79k99O3k77Q37o3l51q0J30j99Q4l87N85m18n5J45
$$ -42 -101 80 185 -26 -147 -357 -178 -477 -414 -691 146 83 -268 -348 -218 -417 -333 -720 -135 -553 -608 -463
1808d63Q1jj15n5nK90k35p6O6K34j94k75K27j6k16K38J31J29k26k56P21j37m24
$$ -463 -382 -383 -498 -553 -558 -268 -503 -579 -513 -279 -473 -748 -521 -537 -753 -515 -384 -255 -481 -737 -16 -153 -577
1831e77J60K29J88q70N63K03J15l12J25K10K4o4k36K91K69m50R7L60l9j35m5K38
$$ -577 -417 -188 0 -870 -307 -104 11 -301 -176 34 58 -6 -242 49 318 -132 -35 325 286 151 106 344
1853C44J55m05P4M08l15Q2Q8j11k43P7L12mJ90j53k31R9J00j31KJ66J61r5l40
$$ 344 499 94 168 576 261 343 431 320 77 154 466 462 652 499 268 367 467 336 338 504 665 570 230
1876B30L43j45R5K06j82q6r3L63j10k87O3K37j78P3L6l4j74j94J51m00M06J23
$$ 230 573 428 523 729 547 461 368 731 621 334 397 634 456 529 565 531 357 163 314 -86 320 443
1898D43j06j32j33J61l3j22KP8K33k77Q1O0j93j78j14J71K29l60k56N80o04M71
$$ 443 337 205 72 233 200 78 80 158 391 114 195 255 62 -116 -230 -59 170 -190 -446 134 -470 1
1920An51L45k63k17N19o9J96n38J39M14l60k01j39M33j00j26k33L42k34RJ43K37
$$ 1 -550 -205 -468 -685 -166 -235 -39 -577 -438 -24 -384 -585 -724 -291 -391 -517 -750 -408 -642 -633 -490 -253
1942b53k34k90J88J45j39p7K11j39J00J20k1K1K84k23j27J50j49k7o8N94q3k70
$$ -253 -487 -777 -589 -444 -583 -660 -449 -588 -488 -368 -389 -368 -84 -307 -434 -284 -433 -460 -528 66 -17 -287
1964b87j61J02j8K10mJ64K66m75Q7J64j15j73M7L08J47k53j65N77q2l91QJ05L09
$$ -287 -448 -346 -364 -154 -158 6 272 -203 -116 48 -67 -240 -193 115 262 9 -156 421 339 -52 -44 61 370
1987C70k11J1M51l66p0m47L92K56J08j54J69r3j52J44J39k04%K24J4r0j83K83
$$ 370 159 170 621 255 185 -262 130 386 494 340 509 416 264 408 547 343 343 567 581 491 308 591
2009E91l56J56J26k20L22j34N0j11L5pj18k14J72K36l55p6K67p9k02N7o3R3m19
$$ 591 235 391 517 297 619 485 535 424 459 452 334 120 292 528 173 97 364 285 83 140 77 170 -249
2032b49J66L63j07K1o8k16L32m73J93k31K24j51q1J47Q8m55K40RJ43K0k53J55
$$ -249 -83 280 173 194 126 -90 242 -231 -38 -269 -45 -196 -277 -130 -42 -497 -257 -248 -105 -85 -338 -183
2054a83j17j65J51j93k3M19l20Q5o1P4j53k56N41K6n50K16K71j3n9K5Nj78q1O4
$$ -183 -300 -465 -314 -507 -530 -111 -431 -346 -407 -333 -486 -742 -201 -175 -725 -509 -238 -251 -310 -285 -280 -458 -539 -475
2078d75K07Q7k03J56J74k49nj83K98k88j36L52K27L5n16L76j21J33j58J27K01
$$ -475 -268 -181 -384 -228 -54 -303 -308 -491 -193 -481 -617 -265 -38 -3 -519 -143 -264 -131 -289 -162 39
2099C9l42K59l8M1nj17J67j6m8J50o3J24K10m01P3N40m57J38j49J52J82l25O5
$$ 39 -303 -44 -82 -41 -46 -163 4 -12 -60 90 27 151 361 -40 33 573 116 254 105 257 439 114 179
2122A79L5M00m24o5K90Q0m27M1O87m19j86R5N23o07K42k02k4J4j41L98m8J5k60
$$ 179 214 614 190 125 415 495 68 109 796 377 191 286 809 202 444 242 218 232 91 489 441 456 196
2145A96L57j31j82N5Mj73j77K60L93k26k71J84Q7J88n28Q0n4J38n8J8m0J8r6n2
$$ 196 553 422 240 295 299 126 -51 209 602 376 105 289 376 564 36 116 62 200 142 160 120 138 42 -10
2169a0j65k87M49o2K8r4j98N3j7K14l2k06l3L23L1l18j22L32l50k98K95L40o2
$$ -10 -175 -462 -13 -75 -47 -141 -339 -286 -303 -89 -121 -327 -360 -37 -6 -324 -446 -114 -464 -762 -467 -127 -189
2192a89j54J30k55J6M6k07L52q3J9P2N0J95k66j51J26j88l1k5L42r9k78Q0N01
$$ -189 -343 -213 -468 -452 -406 -613 -261 -344 -325 -253 -203 -8 -274 -425 -299 -487 -518 -543 -201 -300 -578 -498 3
2215Cm99K3K79J22m3M4n13N11O3m74Q4K90P9k44q0K38K74l80q6L73k41J17J75
$$ 3 -496 -473 -194 -72 -115 -71 -584 -73 -10 -484 -400 -110 -31 -275 -355 -117 157 -223 -309 64 -177 -60 115
2238A15L94l04m92K96K99P8j13K4l05J98k20K52K16K71m63j2K93k33J28l14J10
$$ 115 509 205 -287 9 308 386 273 297 -8 190 -30 222 438 709 246 234 527 294 422 108 218
2259B18J71j21K53k24j36j3M6K52N5k93J68J8p4K0k26Q4J56J04j37M3N7k09M8
$$ 218 389 268 521 297 161 148 194 446 501 208 376 394 320 340 114 198 354 458 321 364 421 212 260
2282B60j60M02l92j06L81j22O9r6r9L38n17Q8j05j22J96j53J86Q2k34J62j17J51
$$ 260 100 502 110 4 385 263 332 236 137 475 -42 46 -59 -181 15 -138 48 130 -104 58 -59 92
2304I2m44J54L82j21m23J38J09l8j37J61k44J35%o8R3l09L44j63N4q5j9l7r1J87
$$ 92 -352 -198 184 63 -360 -222 -113 -151 -288 -127 -371 -236 -236 -304 -211 -520 -176 -339 -285 -370 -389 -426 -517 -330
2328c30P7Rk44K19j40k71M11j03J30Q1j53j4P2qj14p7K12j09K4K41l35Q9j32L15
$$ -330 -253 -244 -488 -269 -409 -680 -269 -372 -242 -161 -314 -328 -256 -264 -378 -455 -243 -352 -328 -87 -422 -333 -465 -150
2352a50J09j98R8M0K62o0r2l10K19r8K33j67K55j21K05j44P9l29j5L81j89K23
$$ -150 -41 -239 -141 -101 161 101 9 -301 -82 -180 53 -114 141 20 225 81 160 -169 -184 197 8 231
2374B31j75N85j71l02K1K59n2m05K34j16L59j79p2mP3k8m6N2N2r4o0K08K2l01
$$ 231 56 641 470 168 189 448 396 -9 225 109 468 289 217 213 286 258 212 264 316 222 162 370 392 91
2398I1L03Q2k54O2p1k61O5Q7J46J93k56rL36k52k31NJ53J11j5m1m6J7K20j40j32
$$ 91 394 476 222 284 213 -48 17 104 250 443 187 178 514 262 31 36 189 300 285 244 198 215 435 295 163
2423A63k16M05l41j34J13j1p4m0M31j53k01q1N2m14J06M2j15L87r2J49j41K21
$$ 163 -53 352 11 -123 -10 -21 -95 -135 296 143 -58 -139 -87 -501 -395 -353 -468 -81 -173 -24 -165 56
2445E6k20j67K11J07l83N5J63l84K74l24K03j25J21O6k00R2j34P05n05J49j32
$$ 56 -164 -331 -120 -13 -396 -341 -178 -562 -288 -612 -409 -534 -413 -347 -547 -455 -589 116 -389 -240 -372
2466c72n7L07k46o0M93q5m42K72l37M38k42K3K58J11m58K18L6J21k31K28L04k94
$$ -372 -429 -122 -368 -428 65 -20 -462 -190 -527 -89 -331 -308 -50 61 -397 -179 -143 -22 -253 -25 279 -15
2488a5J81k85l7K59j2l21K11K17L6k28K39N4j02k39O9J25J93nj81O7Q1q4k41N67
$$ -15 166 -119 -156 103 91 -230 -19 198 234 6 245 299 197 -42 27 152 345 340 159 226 307 223 -18 549
2512E49J2j77k16K69j69R2k64L57m1m3l14O11r9n79K71K56n16K36p1l7J84m9J48
$$ 549 561 384 168 437 268 360 96 453 412 369 55 666 567 -12 259 515 -1 235 164 127 311 262 410
2535D10o7k0j27J09J34k51Rn5rJ7k05J45Q2k26Rl7J59k0k41K03k04J73j91r5J70
$$ 410 343 323 196 305 439 188 197 142 133 150 -55 90 172 -54 -45 -82 77 57 -184 19 -185 -12 -203 -298 -128
2560a28K42k82M3R9J16l57k3L5J90k52K88k42L31p2l89K93k5k10N1L6L7N3j69
$$ -128 114 -168 -125 -26 90 -267 -290 -255 -65 -317 -29 -271 60 -12 -401 -108 -133 -343 -292 -256 -219 -166 -335
2583c35O9O2J16m14M18l23Pj11J22K56l00j4M07Mm05L5K92p0L20n11K24J08l2
$$ -335 -266 -204 -88 -502 -84 -407 -400 -511 -389 -133 -433 -447 -40 -36 -441 -406 -114 -184 136 -375 -151 -43 -75
2606g5p9j96L80k11O2r6M99m03l44L89P9q5k48R2M60k10j38J90j10K73l47L01
$$ -75 -154 -350 30 -181 -119 -215 284 -119 -463 -74 5 -80 -328 -236 224 14 -124 66 -44 229 -118 183
2628A83j67K25k53K62lN9r9J97l4k60K16j72L6j77O8J78J39j27J67j91K1j72L32
$$ 183 16 241 -12 250 247 306 207 404 370 110 326 154 190 13 81 259 398 271 438 247 268 96 428
2651D28j26q4L0l74L50K4j10J84j75J04M2n43M10R2O9j74J02j40J83k52j27K87
$$ 428 302 218 248 -126 224 248 138 322 147 251 293 -250 160 252 321 147 249 109 292 40 -87 200
2673B00k05M2K95k24M1l76L93k07J39l26K55j92L8J41J07k23J52j90j93o7K20
$$ 200 -5 37 332 108 149 -227 166 -41 98 -228 27 -165 -127 14 121 -102 50 -140 -333 -400 -180
2694a80J19r1j45K33J38k84P0j56q7K47j7M7k66k9L62l9l52p3K42j96L0K18j24
$$ -180 -61 -152 -297 -64 74 -210 -140 -296 -383 -136 -153 -106 -372 -401 -39 -78 -430 -503 -261 -457 -427 -209 -333
2717c33jp6ML52j33k96L60n21N83J7l16K09j85L13j88J00K71j23k68K91m95N24
$$ -333 -334 -410 -406 -54 -187 -483 -123 -644 -61 -44 -360 -151 -336 -23 -211 -111 160 37 -231 60 -435 89
2739H9q7P0p0l6J29k34O6k10M15j38L2k03K89k8O1n8P5l97O00k9j37J38l46m1
$$ 89 2 72 2 -34 95 -139 -73 -283 132 -6 26 -177 112 84 145 87 162 -235 365 336 199 337 -9 -50
2763e0K95j71J79J9k16J79RK41k27Qo6k9n4M60k54k75L06j71Q3k05J63k06K59
$$ -50 245 74 253 272 56 235 244 485 258 266 200 171 117 577 323 48 354 183 266 61 224 18 277
2786B77j76J56j35l5j20L16j42m4J57j08l3J05n2j92Q0j04L92j62n5j57J94l47
$$ 277 101 257 122 87 -33 283 141 97 254 146 113 218 166 -26 54 -50 342 180 125 -32 162 -185
2808a85P2L06k01k1k05M1K69k36L5Q2j15jj35K65N5k08J99m6r8j63P4J51k71j4
$$ -185 -113 193 -8 -29 -234 -193 76 -160 -125 -43 -158 -159 -294 -29 26 -182 17 -29 -127 -290 -216 -65 -336 -350
2832c50M00l80L41j51k5m01K60K4J72Q5k28R4L80l56k50l3RK67j70K35l2J02k80
$$ -350 50 -330 11 -140 -165 -566 -306 -282 -110 -25 -253 -159 221 -135 -385 -418 -409 -142 -312 -77 -109 -7 -287
2855b87J90k67J64PO1J79k07Q4K04j47P8j78P3K19r7j95J02R5j11J95j42j39L20
$$ -287 -97 -364 -200 -193 -132 47 -160 -76 128 -19 59 -119 -46 173 76 -119 -17 78 -33 162 20 -119 201
2878B01j4j14l94K72L01k9J29l07J76L7j25L7J01Q4j04j2o4l36L65k88K50L0N0
$$ 201 187 73 -321 -49 252 223 352 45 221 258 133 170 271 355 251 239 175 -161 204 -84 166 196 246
2901B46L2j58J72m9j27P9N3j27J72j44J53K79n09J86l6j56R6M7k44J41K37l18
$$ 246 278 120 292 243 116 195 248 121 293 149 302 581 72 258 222 66 162 209 -35 106 343 25
2923B5K82j81J16N5k62O0O3k41p5J64L30m27J39okk77L02k28J95k4n7P6k15j01
$$ 25 307 126 242 297 35 95 158 -83 -158 6 336 -91 48 42 40 -237 65 -163 32 8 -49 27 -188 -289
2947b89L83m99M96j98L4n3k71L03k79J39N5Q1N3q5l55L34J14l02p9K81M9j86J14
$$ -289 94 -405 91 -107 -73 -126 -397 -94 -373 -234 -179 -98 -45 -130 -485 -151 -37 -339 -418 -137 -88 -274 -160
2970a60j65LR1Q3J28l50Q6J68J11k5k53k2K44j72r2J17Q8n7J79j02k49k2M4J96
$$ -160 -325 -322 -231 -148 -20 -370 -284 -116 -5 -30 -283 -305 -61 -233 -325 -208 -120 -177 2 -100 -349 -371 -327 -131
2994a31K5l5q8J64p7nK01K9j36k33K90p1N5M4M7O8r8L3J45l18K12k09L9J08R0
$$ -131 -106 -141 -229 -65 -142 -147 54 83 -53 -286 4 -67 -12 32 79 147 49 82 227 -91 121 -88 -49 59 149
3019A49R8J91l75J65k58J95k1K0j39pL17n0l83K61j8J79j81J85p9l5r1J97j62
$$ 149 247 438 63 228 -30 165 144 164 25 18 335 285 -98 163 145 324 143 328 249 214 123 320 158
3042A58K4O2j24n2L24P5m44K27J26k06j53J16k29J29L3J32k38J20p8K88j81l7
$$ 158 182 244 120 68 392 467 23 250 376 170 17 133 -96 33 66 198 -40 80 2 290 109 72
3064G2o1J81k72K99k97J24m73N10k32r5K75j12k11J60J86j99n4l4O1R8p4j32R4
$$ 72 11 192 -80 219 -78 46 -427 83 -149 -244 31 -81 -292 -132 54 -145 -199 -233 -172 -74 -148 -280 -186
3087a86N7L2k29J02NK2K40m18P7J67K70j10k96q4J99j01k14L86j3j8J37j55J44
$$ -186 -129 -97 -326 -224 -219 -197 43 -375 -298 -131 139 29 -267 -351 -152 -253 -467 -81 -94 -112 25 -130 14
3110A4r3l30j50L22j98K92J00j14K50k38M9m2k8K12n6Q0J00j00m4l14L90k68M2
$$ 14 -79 -409 -559 -237 -435 -143 -43 -157 93 -145 -96 -138 -166 46 -10 70 170 70 26 -288 102 -166 -124
3133a24O4K35j42J12o4K58M7l48K33k04pK1P5j27J84N6m4j0j16j12R3j7K10j04
$$ -124 -60 175 33 145 81 339 386 38 271 67 60 81 156 29 213 269 225 215 99 -13 80 63 273 169
3157A69j03J32M8l10P8Q2O6k14Q8P0M1q2L16k82O5R9Q5J16k89J09j80O8r6J9N6
$$ 169 66 198 246 -64 14 96 162 -52 36 106 147 65 381 99 164 263 348 464 175 284 104 172 76 95 151
3182A51q8l9P4J24L2l4k38R1J7J5J91m37K01j46J13M9k19K36r6j90M40j52l1J5
$$ 151 63 24 98 222 254 220 -18 73 90 105 296 -141 60 -86 27 76 -143 93 -3 -193 247 95 64 79
3206G9k12L45o1j76M1l11J12J19M0J09k16R4q7J12l01N8J18J47j22m06K35K58
$$ 79 -133 212 151 -25 16 -295 -183 -64 -24 85 -131 -37 -124 -12 -313 -255 -137 10 -112 -518 -283 -25
3228b5l07L82l07J74o3k38J99M6k32L31k60J29j0K1L92k73l11M44k19N1kK95j88
$$ -25 -332 50 -257 -83 -146 -384 -185 -139 -371 -40 -300 -171 -181 -160 232 -41 -352 92 -127 -76 -78 217 29
3251B9m1k99J37k89K03L46j97K56Qj89J9J10Km4l65L98J18k53r0O02l04N2j10
$$ 29 -12 -311 -174 -463 -260 86 -111 145 153 -36 -17 93 95 51 -314 84 202 -51 -141 461 157 209 99
3274I9K95l86L76k09j6K12R3k05j65k3P3K94j29l48L59O2n32K00O7r6J45J61R0
$$ 99 394 8 384 175 159 371 464 259 94 71 144 438 309 -39 320 382 -150 50 117 21 166 327 417
3297D17j58QJ94m54j79N7J53J20J34lj54l2Q2j01q2r0K11pr1L11o03N82j81O2
$$ 417 259 267 461 7 -172 -115 38 158 292 289 135 103 185 84 2 -88 123 116 25 336 -267 315 134 196
3321A96l28Q4j18M51k88m2O8N5l4k96M2J69R0M7m02J72l9L4m0Q8N3J02j73k88
$$ 196 -132 -48 -166 285 -3 -45 23 78 44 -252 -210 -41 49 96 -306 -134 -173 -139 -179 -91 -38 64 -109 -397
3345c97K59l89K96j1J13j01n8J37R1j94P0L05n03L40k53J72j21M03k52oL4k11
$$ -397 -138 -527 -231 -242 -129 -230 -288 -151 -60 -254 -184 121 -382 -42 -295 -123 -244 159 -93 -99 -65 -276
3367b76M6R9j66J89N3k96N11k68M2J5J5j66J83ln3p5j01n7J52m9L75j45l7k7K26
$$ -276 -230 -131 -297 -108 -55 -351 160 -108 -66 -51 -36 -202 -19 -22 -75 -150 -251 -308 -156 -205 170 25 -12 -39 187
3392A87j16j39oK07k28O9L84j66l1J38J69m36K2J29R7k25J59k2J17K8l13J7K23
$$ 187 71 -68 -74 133 -95 -26 358 192 161 299 468 32 54 183 280 55 214 192 309 337 24 41 264
3415B64j55J12j54M7J49Ll8j61j33L08n0j66K53m71K27K66k72p8K09r5K27q7l4
$$ 264 109 221 67 114 263 266 228 67 -66 242 192 26 279 -192 35 301 29 -49 160 65 292 205 171
3438A71k32K36Q8k10l6K04J5k41P3J14o1j16k12L37j53Q8k17Q2J1j12J60j02J81
$$ 171 -61 175 263 53 17 221 236 -5 68 182 121 5 -207 130 -23 65 -152 -70 -59 -171 -11 -113 68
3461F8m6l3j91J57m6k61Q3L35j42j66j66N18k62j26N08j16k53j6J88K0k42j02
$$ 68 22 -11 -202 -45 -91 -352 -269 66 -76 -242 -408 110 -152 -278 230 114 -139 -155 33 53 -189 -291
3483b91J08K23k03N3OM3J12k40L9l41L53j38q3M77k23K54k30j7k38J67k1K45l9
$$ -291 -183 40 -163 -110 -104 -61 51 -189 -150 -491 -138 -276 -359 118 -105 149 -81 -98 -336 -169 -190 55 16
3506A6j42k9J91l6o9J60l90L64q2o0j91L06J35j90M15p31L69k5K85l14rK64j47
$$ 16 -126 -155 36 0 -69 91 -299 65 -17 -77 -268 38 173 -17 398 -333 36 11 296 -18 -27 237 90
3529I0j26M9p1j04K67Q1J11j38o9K1p4K55j13L4J22l51l8J42J39oJ5L6m55N08
$$ 90 -36 13 -58 -162 105 186 297 159 90 111 37 292 179 213 335 -16 -54 88 227 221 236 272 -183 325
3553C25l10jL33k7j62o6p9N1q2K34k00K08m55K44K3j9J1L2N4k76L30P1j15j9k8
$$ 325 15 14 347 320 158 92 13 64 -18 216 16 224 -231 13 36 17 28 60 114 -162 168 239 124 105 77
3578G7J67m40L13M9j86p2J09J28o5k14K91o2j30l67p0L64O6L4o7j51J57K12m67
$$ 77 244 -196 117 166 -20 -92 17 145 80 -134 157 95 -35 -402 -472 -108 -42 -8 -75 -226 -69 143 -324
3601c24j4L9J66m33N86o2j22o8M35m47L2L4L2NoR5J4p2m3J6oN3k9k40O86m02k53
$$ -324 -338 -299 -133 -566 20 -42 -164 -232 203 -244 -212 -178 -146 -141 -147 -52 -38 -110 -153 -137 -143 -90 -119 -359 327 -75 -328
3628c28M52j74j98J13K7j57k66M84n8j87J22L57k11j06K88k40L3Q3M3j27K03k99
$$ -328 124 -50 -248 -135 -108 -265 -531 -47 -105 -292 -170 187 -24 -130 158 -82 -49 34 77 -50 153 -146
3650a46j60L52K78r4K6j92j65L09n8r2Q5k8l84P28m10L31j98m3K96J2m58j00J41
$$ -146 -306 46 324 230 256 64 -101 208 150 58 143 115 -269 459 49 380 182 139 435 447 -11 -111 30
3673C0L07l15j06L07j56K13j91o0j63K38J72l49J71K32m59kO9K70J78q3j51m3
$$ 30 337 22 -84 223 67 280 89 29 -134 104 276 -73 98 330 -129 -131 -62 208 386 303 152 109
3695A09m7k54K06J2l6Q4J42k43L29k97L6K00Nk53m0o6L24k35r0K71m97J20L36
$$ 109 62 -192 14 26 -10 74 216 -27 302 5 41 241 246 -7 -47 -113 211 -24 -114 157 -340 -220 116
3718A16j36j1K3J76k01o8Q1j52K3j8lq7Q3J45j9l27K47Q2m46N20r6n6J84m35J58
$$ 116 -20 -31 -8 168 -33 -101 -20 -172 -149 -167 -170 -257 -174 -29 -48 -375 -128 -46 -492 28 -68 -124 60 -375 -217
3743b17k80L34J37j37O8J70l85J05m2J91R7j39K16k83N5k39J96m0J85j66L2Q9
$$ -217 -497 -163 -26 -163 -95 75 -310 -205 -247 -56 41 -98 118 -165 -110 -349 -153 -193 -8 -174 -142 -53
3765e3J72m34M47k24K3q0J4R1L2n5K7K12j13j27j52L16jJ70l77L21k85j74K56
$$ -53 119 -315 132 -92 -69 -149 -135 -44 -12 -67 -40 172 59 -68 -220 96 95 265 -112 209 -76 -250 6
3788Fr2J66j26J88K35j47Q9n0L67m34k1r5M32l92Q2k04k6J79K96k94j05K16q1
$$ 6 -86 80 -46 142 377 230 319 269 636 202 181 86 518 126 208 4 -22 157 453 159 54 270 189
3811A89J76m26K41j2j09J9j89K37ql10J51L14j98J5Q0NK56Nk19q7q1J13j21p1
$$ 189 365 -61 180 168 59 78 -111 126 118 -192 -41 273 75 90 170 175 431 436 217 130 49 162 41 -30
3835c0l18J48J14J23k31K62J63l57R9r7%J0K0Q2l8k68K92m2Q7lj29K95m40J54
$$ -30 -348 -200 -86 37 -194 68 231 -126 -27 -124 -124 -114 -94 -12 -50 -318 -26 -68 19 16 -113 182 -258 -104
3859a04j6L2k91K30K32k42J03l56L27j36J5K35q6o6K07l28K22m6j60J58JJ2p4
$$ -104 -120 -88 -379 -149 83 -159 -56 -412 -85 -221 -206 29 -57 -123 84 -244 -22 -68 -228 -70 -69 -57 -131
3882a31j18M45l94R7OK18N9k74L7j82K30l5j15R1R1o0k04J3M68k28r8M5K93l57
$$ -131 -249 196 -198 -101 -95 123 182 -92 -55 -237 -7 -42 -157 -66 25 -35 -239 -226 242 14 -84 -39 254 -103
3906a03j7j25J1J25K49O7O3m9j20K87k82Pm0N4J55l7r9J34j12q2K57l42J46N2
$$ -103 -120 -245 -234 -109 140 207 270 221 101 388 106 113 73 127 282 245 146 280 168 86 343 1 147 199
3930A99K79m89K17j50j91J13J21K60l29L80L2m96P5J64m5J86k01O6k17j08L31
$$ 199 478 -11 206 56 -135 -22 99 359 30 410 442 -54 21 185 140 326 125 191 -26 -134 197
3951A97m80L52n0J6n6J06j44M36l80l96L60J09J38k02k52J97j70K05j6J58n7r6
$$ 197 -283 69 19 35 -21 85 -59 377 -3 -399 -39 70 208 6 -246 -49 -219 -14 -30 128 71 -25
3973b5j30j34M29J15l52K6J77k27J47j43K09o9j13l37M55l57L4O61m96L0l0k1
$$ -25 -155 -289 140 255 -97 -71 106 -121 26 -117 92 23 -90 -427 28 -329 -295 366 -130 -100 -130 -151
3995a51L1j97K98M4km5j74l8N5j17L71k33l0j25K09j96J23K4J51J73k97j11l2
$$ -151 -120 -317 -19 25 23 -22 -196 -234 -179 -296 75 -158 -188 -313 -104 -300 -177 -153 -2 171 -126 -237 -269
4018b69J77p4K49j03M0j40K68l96J55M56k73k31Q2J10k72K1J33L46l38K69j71
$$ -269 -92 -166 83 -20 20 -120 148 -248 -93 363 90 -141 -59 51 -221 -200 -67 279 -59 210 39
4039C9k41M34m87M78j45J94l58M7J5J72M8j01mM6j64J20N3l8J74j95K39k66O9
$$ 39 -202 232 -255 223 78 272 -86 -39 -24 148 196 95 91 137 -27 93 146 108 282 87 326 60 129
4062A29j18J78k14J89P4k09J02J09J09j15J90m66N9k30rM34m29O83l37P6j04q3
$$ 129 11 189 -25 164 238 29 131 240 349 234 424 -42 17 -213 -222 212 -217 466 129 205 101 18
4084A8j18J88Q0j25K3o2j03K12P3o2J59n74K22J04k1L1j86k9j6J6K71%k1j07j88
$$ 18 -100 88 168 43 66 4 -99 113 186 124 283 -291 -69 35 14 45 -141 -170 -186 -170 101 101 80 -27 -215
4109b15r3K97J23n15J71J45L68m95L99l48L56n59L54j79M37k54j11k54K15J71
$$ -215 -308 -11 112 -403 -232 -87 281 -214 185 -163 193 -366 -12 -191 246 -8 -119 -373 -158 13
4129A3p1J63k16J40J24k28j66J80l9qq9J30L45l40R5j03qR8l19J31j42L50j33
$$ 13 -58 105 -111 29 153 -75 -241 -61 -100 -108 -197 -67 278 -62 33 -70 -78 20 -299 -168 -310 40 -93
4152i3m6N5j1l4o5J57P1R7j30K62l41L47k02J35k84K5m0m74Q56j14j67K37k92
$$ -93 -139 -84 -95 -129 -194 -37 34 131 1 263 -78 269 67 202 -82 -57 -97 -571 285 171 4 241 -51
4175e1qn6O61m30J08J6l29J07P8K3J34p7l9J83l63j0K9j45J80K17j77j7L51k40
$$ -51 -59 -115 546 116 224 240 -89 18 96 119 253 176 137 320 -43 -53 -24 -169 11 228 51 34 385 145
4199A45j4j13L50p05K09J71l7L16q8j77j11K06k87R7J28l12L49l97L71l3k65R2
$$ 145 131 18 368 -337 -128 43 6 322 234 57 -54 152 -135 -38 90 -222 127 -270 101 68 -197 -105
4221a05K91j97J22R8j13J5l00L6J50K12l42o2m0j10L15r3n7J30K0j3l60L25Q3
$$ -105 186 -11 111 209 96 111 -189 -153 -3 209 -133 -195 -235 -345 -30 -123 -180 -50 -30 -43 -403 -78 5
4244EM3m07K20j46K99o8k75O10m23L6n2m3J78L2j65P8J15j92l0R1J28k06j31L85
$$ 5 48 -359 -139 -285 14 -54 -329 281 -142 -106 -158 -201 -23 9 -156 -78 37 -155 -185 -94 34 -172 -303 82
4268H2l17L39l20Nm0M06k15m4Q2q2k4QJ34qMj09J26K2j57J07k0L42j93n2N3k16
$$ 82 -235 104 -216 -211 -251 155 -60 -104 -22 -104 -128 -120 14 6 10 -99 27 49 -108 -1 -21 321 128 76 129 -87
4294h7K99Mn9m37J51j66M26k07N6J12J27j89J90j14J14k46J39J62l39K41p3j10
$$ -87 212 216 157 -280 -129 -295 131 -76 -20 92 219 30 220 106 220 -26 113 275 -64 177 104 -6
4316fr1L9L87k72k7J89ppk68M27m99J60L4r0J06j08j9OM3N5R7k39J48K10k80K1
$$ -6 -97 -58 329 57 30 219 212 205 -63 364 -135 25 59 -31 75 -33 -52 -46 -3 52 149 -90 58 268 -12 9
4342Ij9L4K95o10N96q5j36l83K50Q6kl24P07o53j6K4O27n05M2LK70k96J77J30
$$ 9 -10 24 319 -291 305 220 84 -299 -49 37 35 -289 418 -235 -251 -227 400 -105 -63 -60 210 -86 91 221
4366B21l21L24k88k2J20m6r0J52j8j12j91N90n16K1J46n5O4l52M96m36J62K1L9
$$ 221 -100 224 -64 -86 34 -12 -102 50 32 -80 -271 319 -197 -176 -30 -85 -21 -373 123 -313 -151 -130 -91
4389i1m8r0K7J38j28J39j07J24j00J26j67O6p3J95R9j00m5n9J13k03j31n5N96
$$ -91 -139 -229 -202 -64 -192 -53 -160 -36 -136 -10 -177 -111 -184 11 110 10 -35 -94 19 -184 -315 -370 226
4412B26l53L33j98j30L16l71L0R4K74j02J31r2j83l9p7K24q7RJ67k28PL85k82
$$ 226 -127 206 8 -122 194 -177 -147 -53 221 119 250 158 -25 -64 -141 83 -4 5 172 -56 -49 336 54
4435E4R6o8n5Jm8k6K18J18l32q6K90r8J60k16J21l9q6k03M52J91n85L17m38O12
$$ 54 150 82 27 28 -20 -46 172 290 -42 -128 162 64 224 8 129 90 4 -199 253 444 -141 176 -262 350
4459C50k09j61Q6N1K33k67M8k98J88J11r2J40j87K66j88L8k47K55J82k20o0k04
$$ 350 141 -20 66 117 350 83 131 -167 21 132 40 180 -7 259 71 109 -138 117 299 79 19 -185
4481a85K61k02p2K07m9L6j37N4m2J19l08N89q3r6m88L13M3J00k38K04Q2o7M3O7
$$ -185 76 -126 -198 9 -40 -4 -141 -87 -129 -10 -318 271 188 92 -396 -83 -40 60 -178 26 108 41 84 151
4505A51p5j4l43j23K81j02J65l5K83k47j58L79m9l20j1J35j38J18J91K9k39R6
$$ 151 76 62 -281 -404 -123 -225 -60 -95 188 -59 -217 162 113 -207 -218 -83 -221 -103 88 117 -122 -26
4527b6o3n9L09m21kK19j50J6j41K91p1jL50k52Q6M6l56J23J53j5k4L9k56L82j67
$$ -26 -89 -148 161 -260 -262 -43 -193 -177 -318 -27 -98 -99 251 -1 85 131 -225 -102 51 36 12 51 -205 177 10
4552A0J81j17O3j72N16m60K50k40q2L57k74K09l41L44J25k28K3J68l33J29P9j98
$$ 10 191 74 137 -35 481 21 271 31 -51 306 32 241 -100 244 369 141 164 332 -1 128 207 9
4574IJ67L2l03P7O7j38j21J78J72J72k16O5k33M85j99k02l8K90m11K62k6kQ8k24
$$ 9 176 208 -95 -18 49 -89 -210 -32 140 312 96 161 -72 413 214 12 -26 264 -147 115 89 87 175 -49
4598d9LK04N7k81J57P4l57J46j9k96M77o1p1LK56nk44m6O9k39L17j4k00Q2j35
$$ -49 -46 158 215 -66 91 165 -192 -46 -65 -361 116 55 -16 -13 243 238 -6 -52 17 -222 95 81 -119 -37 -172
4623a72Q5L00m40L5K96l93J91j4j0L4j01J42o1J77k57J82p2l60M04n6J9J67j53
$$ -172 -87 213 -227 -192 104 -289 -98 -112 -122 -88 -189 -47 -108 69 -188 -6 -78 -438 -34 -90 -71 96 -57
4646e7M8r3J16k44M7K75l45M0K33J27l7l43J06M5j3L30j59k00l3K57Q6j12r4k15
$$ -57 -9 -102 14 -230 -183 92 -253 -213 20 147 110 -233 -127 -82 -95 235 76 -124 -157 100 186 74 -20 -235
4670b35M1J45p0nK34p6l9R1m8pJ2j18J83n2r5j21M43k66K42k21J14p1R1O6k86
$$ -235 -194 -49 -119 -124 110 34 -5 86 38 31 43 -75 108 56 -39 -160 283 17 259 38 152 81 172 238 -48
4695d8Q7P5J66k51P0j82l6K80q2O8L0M7j28J07j73NJ6J11J19l27j01K53k12J06
$$ -48 39 114 280 29 99 -83 -119 161 79 147 177 224 96 203 30 35 51 162 281 -46 -147 106 -106 0
4719@J85k68J19K51m62Q1J92j30Nl2K06J13l57J48L0pO9n5j90j59J90K45j47j86
$$ 0 185 -83 36 287 -175 -94 98 -32 -27 -59 147 260 -97 51 81 74 143 88 -102 -261 -71 174 27 -159
4743a59M32k31j57j04J63r8M4p4j4J47J2n3J6p9L93n22L81l60L57p4J58j41L6
$$ -159 273 42 -115 -219 -56 -154 -110 -184 -198 -51 -39 -92 -76 -155 238 -284 97 -263 94 20 178 37 73
4766G3n6J4l8k26J97j27K9K88n2l34L08Pk36o2K26k73J95K09j89j60J63J72N8
$$ 73 17 31 -7 -233 -36 -163 -134 154 102 -232 76 83 -153 -215 11 -262 -67 142 -47 -207 -44 128 186
4789A86j54L58k97n9k5P9j73L8j91K38P8j15Q6oL21n17K80k36L81k05l0j53K93
$$ 186 32 390 93 34 9 88 -85 -47 -238 0 78 -37 49 43 364 -153 127 -109 272 67 37 -116 177
4812A77j36J39L0q5J13j62j1QJ14l32K55r0J11m5J86n6k91M03j31j10k2k32J30
$$ 177 41 180 210 125 238 76 65 73 187 -145 110 20 131 86 272 216 -75 328 197 87 65 -167 -37
4835c7N19m21m8L31m05J72j21L2P6K83m35J60L9J0j90M55l60j22R8J15n7j99R3
$$ -37 482 61 13 344 -61 111 -10 22 98 381 -54 106 145 155 -35 420 60 -62 36 151 94 -105 -12
4858a2J80k3J69l23L6j72J1ML9J51J30o5m26K80Q6k58K90P3j68k19J09qj71J03
$$ -12 168 145 314 -9 27 -145 -134 -130 -91 60 190 125 -301 -21 65 -193 97 170 2 -217 -108 -116 -287 -184
4882a84L87r1n53K90J84J22l62j43M59P0k20J07k98j25L50m2o3j39J59J4O7J50
$$ -184 203 112 -441 -151 33 155 -207 -350 109 179 -41 66 -232 -357 -7 -49 -112 -251 -92 -78 -11 139
4904A39l03K80p4l7k60K91l11L25J32k50K17k57K75j64j03j34L58l3j6j29J26
$$ 139 -164 116 42 5 -255 36 -275 50 182 -68 149 -108 167 3 -100 -234 124 91 75 -54 72
4925G2pr0P1j24Q7p6k07J09M6Q8K16l23j09J85M3R2k00R6K15j36Mj58K70j54k33
$$ 72 65 -25 46 -78 9 -67 -274 -165 -119 -31 185 -138 -247 -62 -19 73 -127 -31 184 48 52 -106 164 10 -223
4950b23N04j02k24KJ13J10l65N01m03K39L5j96p2J11QJ53l18J85j09N0K29j08
$$ -223 281 179 -45 -43 70 180 -185 316 -87 152 187 -9 -81 30 38 191 -127 58 -51 -1 228 120
4972A20j46k24K9M03l69M88n21J39J70J49k62n5K54m28M84l31R4l2q6K71K0k73
$$ 120 -26 -250 -221 182 -187 301 -220 -81 89 238 -24 -79 175 -253 231 -100 -6 -38 -124 147 167 -106
4994a06n8J89N4j96M1K63k75j50K54m32J72R9r9L09n6l13j97L82O3J90j38k17
$$ -106 -164 25 79 -117 -76 187 -88 -238 16 -416 -244 -145 -244 65 9 -304 -501 -119 -56 134 -4 -221
5016b21J51J27J99j95l3j30k9K41k70j17j22J15O1k2m4k9M4J32j69q0P93n55K45
$$ -221 -70 57 256 61 28 -102 -131 110 -160 -277 -399 -284 -223 -245 -289 -318 -274 -142 -311 -391 402 -153 92
5039I2k22K13k98j45K90K3j74J64p2J00J54j26j16J53Q3k92K44L2r0j85J06O3
$$ 92 -130 83 -215 -360 -70 -47 -221 -57 -129 -29 125 -1 -117 36 119 -173 71 103 13 -172 -66 -3
5061cL63n54J7M02k44K92l09Q9q6K46j25j92J23oql7q1J46J49Q5l83K64p0j8O0
$$ -3 360 -194 -177 225 -19 273 -36 53 -33 213 88 -104 19 13 5 -32 -113 33 182 267 -116 148 78 60 120
5086A20K8p9O4r1K55j86l3k64K27J78k76J03Q1k23o2J53J52J0k54L75k91K42k74
$$ 120 148 69 133 42 297 111 78 -186 41 219 -57 46 127 -96 -158 -5 147 157 -97 278 -13 229 -45
5109d5J24k7k3K49k47P3nL7j3k84K38k11O0K13j35OJ39l10M12m19M91n60L76k99
$$ -45 79 52 29 278 31 104 99 136 123 -161 77 -134 -74 139 4 10 149 -161 251 -168 323 -237 139 -160
5133a60j96M29K62l83j54J23J21j95J04j5k78M82n00J1J79M18j28P3m66J63K65
$$ -160 -356 73 335 -48 -202 -79 42 -153 -49 -64 -342 140 -360 -349 -170 248 120 193 -273 -110 155
5154A55j95r0M0J8J64N5k69K30l60J37J66k01j05J81o1PJ33k13l3K50p9j20J98
$$ 155 -40 -130 -90 -72 92 147 -122 108 -252 -115 51 -150 -255 -74 -135 -128 5 -208 -241 9 -70 -190 8
5177Hj1j50m08M80j25J09l4J0Q8j68J25k5R2J23ok35L50j85R1k00R7L9q6m3r1
$$ 8 -3 -153 -561 -81 -206 -97 -131 -121 -33 -201 -76 -101 -9 114 108 -127 223 38 129 -71 26 65 -21 -64 -155
5202a55K22N5NP0m82N55k01j76J5J30R4R5j86k5j3R4J55k08J50m05K8K66J08p7
$$ -155 67 122 127 197 -285 270 69 -107 -92 38 132 227 41 16 3 97 252 44 194 -211 -183 83 191 114
5226A14j41K34k48J50j51J28j25o9K53k2k71m3J63q8K72k95L23m46K08m9J20k47
$$ 114 -27 207 -41 109 -42 86 -39 -108 145 123 -148 -191 -28 -116 156 -139 184 -262 -54 -103 17 -230
5248b30K52K30l84J93j72K58J8k38J9K32j17O4j11Q6j4j7j83Q5mj27K6J87k95
$$ -230 22 252 -132 61 -111 147 165 -73 -54 178 61 125 14 100 86 69 -114 -29 -33 -160 -134 53 -242
5271b42J07P0O9j81J83k23P5m1J82k1l76M40q9k7M6N6j60J16K56j2k21K10l43
$$ -242 -135 -65 4 -177 6 -217 -142 -183 -1 -22 -398 42 -47 -74 -28 28 -132 -16 240 228 7 217 -126
5294a26K06j11j63K24J7MJ12l00j70L54o7l07J73J34l09L96P7j60J79j83k97K26
$$ -126 80 -31 -194 30 47 51 163 -137 -307 47 -20 -327 -154 -20 -329 67 144 -16 163 -20 -317 -91
5316i1K77j86J50k49P6J38q6K33l81K65j86L0m8K80m86M52k96jN13m92M5L57n36
$$ -91 186 0 150 -99 -23 115 29 262 -119 146 -40 -10 -58 222 -264 188 -108 -109 404 -88 -43 314 -222
5339b22J84J93o6j25k85N28l17K68l63K25j4J05j32K14j06L4O2K7o6O7m20K27
$$ -222 -38 155 89 -36 -321 207 -110 158 -205 20 6 111 -21 193 87 121 183 210 144 211 -209 18
5361A8j74j15K29K72k23J65l56L23k12J19LN6k4M7k14j42J49J07J21j29J50J3
$$ 18 -156 -271 -42 230 7 172 -184 139 -73 46 49 105 81 128 -86 -228 -79 28 149 20 170 183
5383A83k48J48j96J12r8Q8n4k00L27m2j84j22J8L35J36n78K52K8j11Q8O2J51r3
$$ 183 -65 83 -113 -1 -99 -11 -65 -265 62 20 -164 -286 -268 67 203 -375 -123 -95 -206 -118 -56 95 2
5406Bk70K53%Q4qJ3k80OJ69L57l72n1J41j55p4Q9J09Q4k55J81kn0l09K94k73M43
$$ 2 -268 -15 -15 69 61 74 -206 -200 -31 326 -46 -97 44 -111 -185 -96 13 97 -158 23 21 -29 -338 -44 -317 126
5432A26j52M5M3J07j72J50l10K20m5P6j03L2K94l68K38j37K0j8N7j28O7Q4k0Q
$$ 126 -26 19 62 169 -3 147 -163 57 12 88 -15 17 311 -57 181 44 64 46 103 -25 42 126 106 114
5456A14k45J81K1J21j70P2j76K14ll3J25l2p3MR5k05J15r4J8P5k35J38R8j34N81
$$ 114 -131 50 71 192 22 94 -82 132 129 96 221 189 116 120 215 10 125 31 49 124 -111 27 125 -9 572
5481E72o82K81J3j2%m30L31m1r7J89j55rK88o3j88o6P4j12J6j60J97K74J9k13
$$ 572 -110 171 184 172 172 -258 73 32 -65 124 -31 -40 248 185 -3 -69 5 -107 -91 -251 -54 220 239 26
5505B6j50Q1p2K16p2j81K49p3K60l64M41n51K21k29L3P5j91K69J01j33j17N1r8
$$ 26 -124 -43 -115 101 29 -152 97 24 284 -80 361 -190 31 -198 -165 -90 -281 -12 89 -44 -161 -110 -208
5528b08m4L01J77m14K07N4r9j66L50m35K39p9J13J8p5j31j4J99o9m5r4J57M7L35
$$ -208 -252 49 226 -188 19 73 -26 -192 158 -277 -38 -117 -4 14 -61 -192 -206 -7 -76 -121 -215 -58 -11 324
5552C24l13o0J19rj76L21m71L7K80l2j02J82j5k18L32r8k93J45K09j56J35l9k56
$$ 324 11 -49 70 61 -115 206 -265 -228 52 20 -82 100 85 -133 199 101 -192 -47 162 6 141 102 -154
5575a54K84l2p3k24M03j8l33J50k67J51R2K06k55O8Jq0l1JL02j21N00o95L9J22
$$ -154 130 98 25 -199 204 186 -147 3 -264 -113 -21 185 -70 -2 -1 -81 -112 -111 191 70 570 -125 -86 36
5599C6J49L2l68j32L45J41J9K74n73J61m52L28L58k43J00n8l6l11N31j99J94j63
$$ 36 185 217 -151 -283 62 203 222 496 -77 84 -368 -40 318 75 175 117 81 -230 301 102 296 133
5621A33L2K5K6n7k7J06m11L47Ql24J30J51j81k21N03j72j57k2M87o25J79j03j47
$$ 133 165 190 216 159 132 238 -173 174 182 -142 -12 139 -42 -263 240 68 -89 -111 376 -249 -70 -173 -320
5644c20M98k93J51L1K43k54O1j50k97K82j48J89j22n6K03j41J74r4P7l37J39K31
$$ -320 178 -115 36 67 310 56 117 -33 -330 -48 -196 -7 -129 -185 18 -123 51 -43 34 -303 -164 67
5666F7K10m62L12k05j78J53J1m4J12r6N6j23K98j24M5p5j94J69M1K38k39m67N97
$$ 67 277 -185 127 -78 -256 -103 -92 -136 -24 -120 -64 -187 111 -13 32 -43 -237 -68 -27 211 -28 -495 102
5689A02n2k52L06k28l34J52M10k93K38k35J28o9J00L1o8N8l9r9K02r0P9m2J71
$$ 102 50 -202 104 -124 -458 -306 104 -189 49 -186 -58 -127 -27 4 -64 -6 -45 -144 58 -32 47 5 176
5712A76m9N0j12p8J57n9k04M5O1K32k50L36m51K9J03J39m11K36Q8J30P8P1l05
$$ 176 127 177 65 -13 144 85 -119 -74 -13 219 -31 305 -146 -117 -14 125 -286 -50 38 168 246 317 12
5735A2J56l33M9K48o4j9K9k09K17J19k42j1N7J91j79K75m07j1J57l8J98m08Q9
$$ 12 168 -165 -116 132 68 49 78 -131 86 205 -37 -48 9 200 21 296 -111 -122 35 -3 195 -213 -124
5758a24M28l37j46j5J13PnP0n1r1L34m3l06n3K75k77r5M85p9j44P1L7J0l95J16
$$ -124 304 -33 -179 -194 -81 -74 -79 -9 -60 -151 183 140 -166 -219 56 -221 -316 169 90 -54 17 54 64 -331 -215
5783b15p4J25M0J19N4j62K76k50j99K66j46K27l14Q7K53k87Q0L5k21M52k32k13
$$ -215 -289 -164 -124 -5 49 -113 163 -87 -286 -20 -166 61 -253 -166 87 -200 -120 -85 -306 146 -86 -299
5805b99j49L98k95L02O1k29j01L21l41O28l31K55k53K28j38j86k41L54K06k45
$$ -299 -448 -50 -345 -43 18 -211 -312 9 -332 296 -35 220 -33 195 57 -129 -370 -16 190 -55
5825e5J21m9R2j72K76k90N5K18O7m1k88m9Q8M1N2N0L32m08J30k36Q1J29k5j24
$$ -55 66 17 109 -63 213 -77 -22 196 263 222 -66 -115 -27 14 66 116 448 40 170 -66 15 144 119 -5
5849eJ23q0j94J77r7J63J70o6J15k72j39j32N29n69K58L92o00M35J46k16J51k27
$$ -5 118 38 -156 21 -76 87 257 191 306 34 -105 -237 292 -277 -19 373 -227 208 354 138 289 62
5871F2l3q0J14Nj99L42l49O9J3K42j09%J23o8K9k24O0OL5q1k66J92K38L1l89K68
$$ 62 29 -51 63 68 -131 211 -138 -69 -56 186 77 77 200 132 161 -63 -3 3 38 -43 -309 -117 121 152 -237 31
5897C1Rj18K14j50Nl46J54l0N3L15j37J36k39K35n0j39R2K02m76O0K2J45j42M4
$$ 31 40 -78 136 -14 -9 -355 -201 -231 -178 137 0 136 -103 132 82 -57 35 237 -239 -179 -157 -12 -154 -110
5921a10J54J4J80l22O3j84K95j73P4q3nl9K07M5j38J99J56m27Q5k07l6J07J1K01
$$ -110 44 58 238 -84 -21 -205 90 -83 -9 -92 -97 -136 71 116 -22 177 333 -94 -9 -216 -252 -145 -134 67
5945F7r5j62L1m1R4K2q9K75j86JJ06l4q0L05l18K16j68j35m3K55k4Q9j01K91K1
$$ 67 -28 -190 -159 -200 -106 -84 -173 102 -84 -83 23 -11 -91 214 -104 112 -56 -191 -234 21 -3 86 -15 276 297
5970B97q2l48J75p1K8K1K76k17l68J86L09m6j63J77j31K0j32N45m08L17m36J04
$$ 297 215 -133 42 -29 -1 20 296 79 -289 -103 206 160 -3 174 43 63 -69 476 68 385 -51 53
5992E3P0r1j10k77K25J58J16q9j24N98n02J4P6j9j34O5K07l60L4L79m50J28j4
$$ 53 123 32 -78 -355 -130 28 144 55 -69 529 27 41 117 98 -36 29 236 -124 -90 289 -161 -33 -47
6015d7K39r6j8k71j56L44j91J51q9K13l09J83j5K02j13J59j95%J90k44j74M11
$$ -47 192 96 78 -193 -349 -5 -196 -45 -134 79 -230 -47 -62 140 27 186 -9 -9 181 -63 -237 174
6037A74k45j84R1M4k8j7p2K89l64Q9K24k66J93J41q3M5n1J55m9j4l46J95r2K22
$$ 174 -71 -255 -164 -120 -148 -165 -237 52 -312 -223 1 -265 -72 69 -14 31 -20 135 86 72 -274 -79 -171 51
6061E1j03l6k09l8J02J63m1j04J14rK0j71L43l23K93o8M9pJ5j23m8K2L5J78Jo7
$$ 51 -52 -88 -297 -335 -233 -70 -111 -215 -101 -110 -90 -261 82 -241 52 -16 33 26 41 -82 -130 -108 -73 105 106 39
$$ [...]
8191B79
##END NTUPLES=NMR FID
##END=
