##TITLE=1H_Costus-2Kg-Acet-C
 CDCl3, 8 sc, 
 26.2.2020
##JCAMPDX= 6.0         $$ Bruker NMR JCAMP-DX V2.0
##DATA TYPE= NMR FID
##DATA CLASS= NTUPLES
##ORIGIN= UXNMR, Bruker Analytische Messtechnik GmbH
##OWNER= root
$$ XWIN-NMR		Version 3.5
$$ Wed Feb 26 14:26:01 2020 Russian Standard Time (UT+4h)  she@DPX200
##.OBSERVE FREQUENCY= 200.1315
##.OBSERVE NUCLEUS= ^1H
##.DELAY= (6, 6)
##.ACQUISITION MODE= SIMULTANEOUS
##.ACQUISITION SCHEME= undefined
##.AVERAGES= 8
##.DIGITISER RES= 18
##SPECTROMETER/DATA SYSTEM= spect
##.PULSE SEQUENCE= zg30
##.SOLVENT NAME= CDCl3
##.SHIFT REFERENCE= (INTERNAL, CDCl3, 0, 15.7039)
##AUDIT TRAIL= $$ (NUMBER, WHEN, WHO, WHERE, WHAT)
$$ ##TITLE= Audit trail, XWIN-NMR		Version 3.5
$$ ##JCAMPDX= 5.01
$$ ##ORIGIN= Bruker BioSpin GmbH
$$ ##OWNER= she
$$ F:/spectra/data/she/nmr/H-F/1/audita.txt
$$ ##AUDIT TRAIL=  $$ (NUMBER, WHEN, WHO, WHERE, WHAT)
(   1,<2020-02-26 14:24:14.07 +0400>,<she>,<DPX200>,
      <created by zg, POWCHK disabled, PULCHK disabled
       configuration hash MD5:
       00 E9 B6 7A A2 85 ED C7 34 08 36 98 17 FE 4E 26
       data hash MD5: 16K
       79 AA 6A 42 BA 69 89 EB CA 54 5D 86 13 53 78 64>)
$$ ##END=
$$ 
$$ hash MD5
$$ F1 B4 71 85 5B 39 0A 11 68 98 B2 37 6F F4 2A C8
##$RELAX= 
##$RELAX= 
##$RELAX= 
##$RELAX= 
##$RELAX= 
##$RELAX= 
$$ Bruker specific parameters
$$ --------------------------
##$DU= <F:/spectra>
##$EXPNO= 1
##$NAME= <H-F>
##$PROCNO= 1
##$TYPE= <nmr>
##$USER= <she>
##$AMP= (0..31)
100 100 100 100 100 100 100 100 100 100 100 100 100 100 100 100 100 100 
100 100 100 100 100 100 100 100 100 100 100 100 100 100 
##$AQSEQ= 0
##$AQ_mod= 1
##$AUNM= <au_zg>
##$AUTOPOS= <>
##$BF1= 200.13
##$BF2= 200.13
##$BF3= 200.13
##$BF4= 200.13
##$BF5= 200.13
##$BF6= 200.13
##$BF7= 200.13
##$BF8= 200.13
##$BYTORDA= 1
##$CFDGTYP= 0
##$CFRGTYP= 5
##$CHEMSTR= <none>
##$CNST= (0..31)
1 1 145 1 1 1 1 1 1 1 1 1 1 1 1 1 1 1 1 1 1 1 1 1 1 1 1 1 1 1 1 1 
##$CPDPRG= <>
##$CPDPRG1= <>
##$CPDPRG2= <>
##$CPDPRG3= <>
##$CPDPRG4= <mlev>
##$CPDPRG5= <mlev>
##$CPDPRG6= <mlev>
##$CPDPRG7= <mlev>
##$CPDPRG8= <mlev>
##$CPDPRGB= <>
##$CPDPRGT= <>
##$D= (0..31)
0 1.2 0 0 0 0 0 0 0 0.06 0 0.03 0 0 0 0 0.0002 0 0 0 0 0 0 0 0 0 0 0 0 
0 0 0 
##$DATE= 1582712653
##$DBL= (0..7)
120 120 120 120 120 120 120 120 
##$DBP= (0..7)
150 150 150 150 150 150 150 150 
##$DBP07= 0
##$DBPNAM0= <>
##$DBPNAM1= <>
##$DBPNAM2= <>
##$DBPNAM3= <>
##$DBPNAM4= <>
##$DBPNAM5= <>
##$DBPNAM6= <>
##$DBPNAM7= <>
##$DBPOAL= (0..7)
0.5 0.5 0.5 0.5 0.5 0.5 0.5 0.5 
##$DBPOFFS= (0..7)
0 0 0 0 0 0 0 0 
##$DE= 6
##$DECBNUC= <off>
##$DECIM= 24
##$DECNUC= <off>
##$DECSTAT= 4
##$DIGMOD= 1
##$DIGTYP= 9
##$DL= (0..7)
0 120 120 120 120 120 120 120 
##$DP= (0..7)
150 150 150 150 150 150 150 150 
##$DP07= 0
##$DPNAME0= <>
##$DPNAME1= <>
##$DPNAME2= <>
##$DPNAME3= <>
##$DPNAME4= <>
##$DPNAME5= <>
##$DPNAME6= <>
##$DPNAME7= <>
##$DPOAL= (0..7)
0.5 0.5 0.5 0.5 0.5 0.5 0.5 0.5 
##$DPOFFS= (0..7)
0 0 0 0 0 0 0 0 
##$DQDMODE= 0
##$DR= 18
##$DS= 0
##$DSLIST= <SSSSSSSSSSSSSSS>
$$ [...]
##$SUBNAM2= <"">
##$SUBNAM3= <"">
##$SUBNAM4= <"">
##$SUBNAM5= <"">
##$SUBNAM6= <"">
##$SUBNAM7= <"">
##$SUBNAM8= <"">
##$SUBNAM9= <"">
##$SW= 24.9337058887773
##$SWIBOX= (0..15)
0 0 2 0 0 0 0 0 0 0 0 0 0 0 0 0 
##$SW_h= 4990.01996007984
##$TD= 16384
##$TD0= 1
##$TE= 0
##$TE2= 300
##$TE3= 300
##$TEG= 300
##$TL= (0..7)
0 120 120 120 120 120 120 120 
##$TP= (0..7)
150 150 150 150 150 150 150 150 
##$TP07= 0
##$TPNAME0= <>
##$TPNAME1= <>
##$TPNAME2= <>
##$TPNAME3= <>
##$TPNAME4= <>
##$TPNAME5= <>
##$TPNAME6= <>
##$TPNAME7= <>
##$TPOAL= (0..7)
0.5 0.5 0.5 0.5 0.5 0.5 0.5 0.5 
##$TPOFFS= (0..7)
0 0 0 0 0 0 0 0 
##$TUNHIN= 0
##$TUNHOUT= 0
##$TUNXOUT= 0
##$USERA1= <user>
##$USERA2= <user>
##$USERA3= <user>
##$USERA4= <user>
##$USERA5= <user>
##$V9= 5
##$VALIST= <valist>
##$VCLIST= <CCCCCCCCCCCCCCC>
##$VD= 0
##$VDLIST= <DDDDDDDDDDDDDDD>
##$VPLIST= <PPPPPPPPPPPPPPP>
##$VTLIST= <TTTTTTTTTTTTTTT>
##$WBST= 1024
##$WBSW= 4
##$XGAIN= (0..3)
0 0 0 0 
##$XL= 0
##$YL= 0
##$YMAX_a= 147238
##$YMIN_a= -89617
##$ZGOPTNS= <>
##$ZL1= 120
##$ZL2= 120
##$ZL3= 120
##$ZL4= 120
##$ABSF1= 10
##$ABSF2= 0
##$ABSG= 5
##$ABSL= 3
##$ALPHA= 0
##$AQORDER= 0
##$ASSFAC= 0
##$ASSFACI= 0
##$ASSFACX= 0
##$ASSWID= 0
##$AUNMP= <proc_1d>
##$AZFE= 0.1
##$AZFW= 0.1
##$BCFW= 1
##$BC_mod= 2
##$BYTORDP= 1
##$COROFFS= 0
##$CY= 11.3945322036743
##$DATMOD= 1
##$DC= 2
##$DFILT= <>
##$DTYPP= 0
##$F1P= 16.9975609425685
##$F2P= -3.02152046262296
##$FCOR= 0.5
##$FTSIZE= 0
##$FT_mod= 4
##$GAMMA= 1
##$GB= 0.15
##$INTBC= 1
##$INTSCL= 1
##$ISEN= 128
##$LB= 0.24
##$LEV0= 0
##$LPBIN= 0
##$MAXI= 10000
##$MC2= 0
##$MEAN= 0
##$ME_mod= 0
##$MI= 1.114404
##$NCOEF= 0
##$NC_proc= 0
##$NLEV= 6
##$NOISF1= 3.799351
##$NOISF2= 2.8
##$NSP= 1
##$NTH_PI= 0
##$NZP= 0
##$OFFSET= 15.70392
##$PC= 1
##$PHC0= -9803.677
##$PHC1= 33.40082
##$PH_mod= 1
##$PKNL= yes
##$PPARMOD= 0
##$PSCAL= 0
##$PSIGN= 0
##$REVERSE= no
##$SF= 200.130013532006
##$SI= 16384
##$SIGF1= 3
##$SIGF2= 2
##$SINO= 400
##$SIOLD= 16384
##$SREGLST= <1H.CDCl3>
##$SSB= 0
##$STSI= 0
##$STSR= 0
##$SW_p= 3612.71676300578
##$SYMM= 0
##$S_DEV= 0
##$TDeff= 0
##$TDoff= 0
##$TI= <>
##$TILT= no
##$TM1= 0
##$TM2= 0
##$TOPLEV= 0
##$USERP1= <user>
##$USERP2= <user>
##$USERP3= <user>
##$USERP4= <user>
##$USERP5= <user>
##$WDW= 1
##$XDIM= 8192
##$YMAX_p= 0
##$YMIN_p= 0
$$ End of Bruker specific parameters
$$ ---------------------------------
##NTUPLES= NMR FID
##VAR_NAME=  TIME,          FID/REAL,        FID/IMAG
##SYMBOL=    X,             R,               I
##VAR_TYPE=  INDEPENDENT,   DEPENDENT,       DEPENDENT
##VAR_FORM=  AFFN,          ASDF,            ASDF
##VAR_DIM=   8192,          8192,            8192
##UNITS=     SECONDS,       ARBITRARY UNITS, ARBITRARY UNITS
##FACTOR=    0.0002004,     1,               1
##FIRST=     0,             0,               0
##LAST=      1.6414764,     0,               0
##MIN=       0,             -89617,          0
##MAX=       1.6414764,     147238,          0
$$ Real data points
##PAGE= N=1
##DATA TABLE= (X++(R..R)), XYDATA
0@%%%%%%%%%Qj6J6j6J6k2L0l2M0m8N6o9P9r0J04j22J41j61J85k10K37k69L04l40
33a79L80m26M76n29N87o52P25q04Q91r87J093j211J341j488J653j842K059k311
51a224K609k965L404l961M690n694P174r603J4492m3271J23002L6479j91327j5862
65h2057J38693K4502j34157j8830J01214K2016q1374l454O3078r16n3285R773
77a4797L9607j2038l5029J3674K4783q600j5140J0715Q710q621q658L164L249
90A019N725L086o784p348Q732N777j2420n748J6637M766j7943k252K1040m72k3503
105i688K959K4792n784k4612Q439K5092j2336k4587J4619K3597j8077k3233K2198
118C379K2917k5094k4383K5666K4355k5776k4142K6464K4951k5667k6030K1746
$$ y = [0, 0, 0, 0, 0, 0, 0, 0, 0, 0, 8, -8, 8, -8, 8, -14, 16, -16, 24, -24, 32, -37, 42, -48, 56, -66, 75, -86, 99, -111, 126, -143, 161, -179, 201, -225, 251, -278, 309, -343, 382, -422, 469, -518, 575, -636, 705, -783, 870, -972, 1087, -1224, 1385, -1580, 1824, -2137, 2553, -3141, 4033, -5570, 8922, -34349, 88653, 125132, -66195, -82057, 56636, 81138, -53019, -71849, 29365, 51381, -29993, -33447, 29631, 28715, -24570, -14797, 24810, 12772, -22257, -8583, 16200, 7600, -7540, 3175, 11885, 3264, -5394, -2230, 1019, 6744, 9830, 3046, -4302, 4430, 10207, -2213, -7961, 8676, 13442, -4501, -6753, 14287, 13815, -9688, -6729, 18063, 12279, -12333, -3894, 21198, 8862, -15725, -1106, 22491, 4414, -18819, 3379, 26296, 1202, -23181, 2485, 26840, 1064, -23078, 3386, 28337, 2670, -23360, -1614]
130a614K3751j9656k2116J9395K0869j8442k1816J5192K0965j1942j9438Q989
142e863J6334p967j3434P462J0684p373q382P281O091r351n182J1758M258j2409
156f093m821J2357M408j2488l903J2540M369j2928n333J0815N125q624k929Q790
170A285Q77j0067j795J0781L526q636m907P470M492o549n518N419O891k268o755
185e754J099O868m56p784r33Q772K680p898l416Q995L836r204l781R084L773r466
201c585l215J0937M061j1159m367J0217L980r419j856J1115P64j0999n02J0780
215F752j632j1635L115J4006k397j3288L280J2370m630j4528M690J4999l673j2814
229e385M548J3801m806j4682K893J2954l816j0910M598J2360m452j2118L184J0135
$$ y = [-1614, 22137, 2481, -19635, -240, 20629, 2187, -19629, -4437, 16528, 4586, -14852, -5863, 10471, 2504, -10930, -3468, 7216, -157, -8539, -1258, 4833, -4518, -9700, 2058, 6316, -6093, -10914, 1443, 5851, -6637, -10540, 2000, 6369, -6559, -11892, -1077, 4048, -4576, -7505, 1285, 2162, -7905, -9700, 1081, 4607, -4029, -8936, -1466, 3026, -3523, -9041, -3622, 3269, 1001, -5754, -4655, 2213, 1757, -6027, -6960, 1812, 4492, -3406, -6822, 2173, 6009, -3195, -6976, 2108, 5881, -3585, -6800, 4137, 8198, -2961, -7328, 2889, 6869, -2550, -4406, 6709, 7473, -3526, -4028, 6752, 5120, -6515, -3400, 10606, 8209, -5079, -1799, 10571, 5941, -8587, -3897, 11102, 7429, -5385, -837, 12964, 8158, -6524, -3631, 9323, 5507, -5403, -805, 11555, 7103, -5015, -1831, 8304]
243H304k881r707L402Q885k985p898K392O565k912n466K637M999k763m487K948
258A033K910l396l131K917K757l061j911L240J626l800k875K783K675k010k162
273b405J976K966k205m943j44M828J270m679j070N450K125o384m470O141M874
288C330o822n287Q186O361q276p437P912O938q850p051R228P608q852o830R090
303g52N835r048n792R095N261q643l964Q409L002p799k485P939J536o744j040
318e190P080J52o333J69N717L37n064L97M924J11m585k52M184J68l941j73M999
335B700J202m744j441M663K126n535k660O429L960o351m541O777M516o547m905
350d351O938N586o988n155O431M943n479m344N177L243m739k847M485J697l464
$$ y = [8304, 5423, -4284, -882, 8003, 5018, -2880, -488, 6077, 3165, -2301, 336, 5335, 2572, -1915, 1033, 3943, 547, -2584, 333, 3090, 29, -1882, 1358, 2984, -816, -3691, -908, 1767, -243, -2405, -429, 2537, 332, -4611, -4755, 73, 1343, -3336, -4406, 1044, 3169, -3215, -7685, -1544, 3330, -3492, -8779, -593, 5768, -2508, -9945, -2033, 4905, -3945, -10996, -1768, 5840, -3012, -9842, -752, 5083, -3965, -9757, -662, 4599, -4044, -8008, 401, 3403, -4396, -6881, 1058, 2594, -4150, -5190, 1890, 2042, -4291, -4122, 1595, 1932, -3132, -2735, 2189, 2300, -2285, -2537, 1647, 1815, -2126, -2299, 2700, 3902, -842, -2283, 2380, 4506, -1029, -3689, 2740, 6700, 349, -4192, 2585, 7101, 554, -4351, 2587, 8173, 1185, -3970, 2461, 7404, 1925, -2419, 2758, 6001, 1262, -1585, 2900, 4597, 1133]
365A133l10K340n91k205O82J904r51j618J878M84j186k67J207j16j822L21O54
382A537l77L74K51r96j5J188r05l310Q63M275p79m530J414N383l244o629K944
399b556P412l775q049N137Q325n481q817N495P818o258p969P177Q107o647p791
414g872O593N988p184n773O379N836n473m367M960L064n367k826M178K496k777
429b145j664L437J163l059j003J294R55r04q63J059J856p74j898P3K102n50k763
446c684J291L776k69m203O81M404j574n176J817O447r71o612J642O648j708p125
462d616J518P431o98o613O59O162j87n424K70M571L4l669k15L501O70k803p05
479a14J855N76j650k91K268R14j988j505J856J457k442j589L541K348l389l510
$$ y = [1133, 823, 3163, 2572, 367, 1049, 2953, 2002, 384, 2262, 2746, 1560, 1293, 2500, 2384, 562, 883, 1537, 1160, 1534, 1785, 789, 774, 1962, 1057, -2253, -1390, 2885, 2106, -2424, -1010, 4373, 1129, -5500, -2556, 4856, 1081, -6968, -1831, 6494, 1013, -7804, -2309, 5509, -749, -8718, -1541, 6566, -81, -7872, -1279, 4709, -2475, -8248, -1869, 3967, -1506, -5873, -913, 2151, -3216, -6042, -1864, 632, -2145, -3809, -372, 791, -2268, -3271, -1977, -1022, -1926, -2789, -1730, 126, -648, -2546, -2473, -371, -921, -3684, -2393, 1383, 1114, -3089, -2408, 1996, 422, -4754, -2937, 3510, 2539, -4073, -2431, 4217, 2509, -4616, -3098, 4333, 3635, -2978, -2319, 3843, 3656, -1768, -1498, 3073, 3107, -562, -777, 2724, 3394, 591, -114, 1741, 2317, 667, 376, 2644, 3558, 1570, 65, 1921, 3378, 936, -653, 2888, 5236, 1847, -1663]
495a663L677K659m021k801N529K810o335k092N959J854p137j280P254R53q010
510b644m71Q365K83r511L16R116l68r282P15Q930j209q270R71P176j064p088J084
527b951O416j392n482P95M715j069l836M49K586Jj913l51J403L01o99p00j78O59
545a246L12j050k14N35Q18j138l06J329J61j977O57J721r88j994J551K353j610
562a086l250K261L633k745l802L063M601k983m796K626N135l132m805L223N562
577C505k766n590K577N517k483n461K663N724k681m791K775N020k791n067K905
592i44M653k887l454K845L697l051l039L301K105l404j788M264J292l439j021
607h70L493M45l811K87L892l82l940J071L907j215l984J619L325j499k685J561
$$ y = [-1663, 2014, 4673, 652, -2149, 3380, 6190, -145, -2237, 3722, 5576, -1561, -2841, 4413, 5366, -2644, -3115, 5250, 5533, -3978, -3662, 5454, 5086, -4196, -3481, 5449, 4240, -4030, -3059, 4117, 3053, -4035, -2951, 3465, 2073, -3409, -2614, 2101, 1032, -2804, -2355, 231, 232, -1681, -2032, -629, -328, -1027, -1727, -1905, -1246, -934, -1984, -2198, -1663, -845, -1983, -2289, -960, -799, -2776, -2119, -398, -1386, -3380, -1829, 524, -1086, -4336, -2075, 1558, -1187, -4989, -1926, 2675, -308, -5104, -2478, 2657, -475, -5280, -2057, 3505, 739, -4851, -2274, 3243, 760, -4701, -2038, 3686, 1005, -3786, -1011, 4009, 1218, -3849, -944, 3709, 822, -2632, 213, 3910, 859, -2180, 1121, 3226, -178, -1966, 2298, 3590, 151, -870, 2623, 3068, -743, -456, 3436, 3054, -886, 185, 4092, 2877, -1107, 512, 3837, 2338, -347, 1214]
623A214K919j754k837P57K566j89j923j35J043J198j104j906K18J767L55k582
639c93l35K982J163l598j634L459J510l962j706M356J604m373j370M026O70m065
655a666j290M498P44m116l66L699m14l774N02L778q86l866J282L266j468l364
671c441J291L544j964l537K086L832k210l710J779L630j706m309K043M211j365
686A74m586J831M301j882m413J745M551j372m322J531L801j362l998J878L520
701A397j872k631J718K668j822j909J552J114j161n20J362L20j039K70N97M6r86
718h96Q57N26n11K6J137l93j178P80R67j149o25J735M1j467J7K747r74k650J078
737F8L776k316k995K606L604l552l727M292L829m723l894M863M068n401l207N463
$$ y = [1214, 4133, 2379, -458, 299, 2865, 2676, 753, 618, 1661, 2859, 1755, -151, 67, 1834, 2189, -393, -728, 2254, 3417, -181, -1815, 1644, 3154, -808, -2514, 1842, 3446, -927, -2297, 1729, 2399, -1666, -2956, 1542, 2286, -1830, -2196, 1503, 1089, -2685, -2183, 1595, 709, -3157, -1875, 1391, -77, -3441, -2150, 1394, -570, -4107, -2021, 1811, -399, -4109, -2330, 1300, -406, -4715, -2672, 1539, 174, -4412, -2581, 1720, -162, -4575, -2830, 1721, 349, -3973, -2442, 1359, -3, -4001, -2123, 1397, -475, -3106, -1388, 1280, -542, -2451, -899, 215, -946, -1466, -104, 216, -823, -553, 44, 90, -896, -39, 487, -24, 2, 1139, 746, -432, 348, 1315, 166, -459, 1276, 1317, -150, -133, 2614, 1640, -1010, 68, 3844, 1528, -1467, 1139, 4743, 1191, -2536, 1756, 5585, 862, -3032, 1831, 5899, 498, -2709, 2754]
753B754K848n909k331N780J538n102j308M746R53m874l29M182k67l779O77L338
769B917j266k331J083J852j572j844J844J078j750q17K097kj447o59R55J79p11
786c94K35l4k95L13L18j373j2J337j83j724L51K042r47k278R27K651j313k760
804c139J600K499j718k369J850K213k009k679J717K577j540j993J771J511j666
819a375j339J142J414j144o27J083M17l91q45M83K42J91l29M00Q5p1m21Q0P94
838b11J08r62L50J153n40j141P60J816j064k355J599K817j750k905K329K928k689
855B43k532K404L123k523k765K571L204l140k490K766K586k722k006K435J693
870B847k192r17J832O12j679n92J876J73j085J70O34o39n34Q57M8q07O79O19n13
$$ y = [2754, 5602, -307, -2638, 3142, 4680, -422, -1730, 3016, 3969, -905, -1234, 2948, 2681, -1098, -421, 2917, 1651, -680, 403, 2255, 683, -1161, 683, 1761, 11, -806, 1291, 1289, -158, -817, 138, 317, -394, -159, -193, -488, -175, 143, -1230, -1242, 95, -88, -1812, -1461, 581, -366, -2644, -1717, 934, -379, -3139, -1539, 960, -758, -3127, -1277, 936, -1073, -3752, -2035, 542, -998, -2991, -1220, 291, -1375, -2714, -1572, -158, -1302, -1929, -846, -429, -820, -1665, -1182, -940, -749, -1078, -678, -593, -664, -1085, -1005, -211, -103, -1065, -715, 438, -102, -1243, -483, 1333, 269, -2086, -487, 2330, 580, -2325, 4, 2932, 243, -2289, 115, 3238, 715, -2050, 521, 3725, 585, -1905, 861, 3447, 725, -1281, 1154, 2847, 655, -262, 1570, 2182, 503, -89, 1787, 1960, 875, 1045, 1679, 1040, 506, 1363, 1411, 604, 1283, 1902, 1389]
889A389r48P54K98q18k65J270n37j139M99Q83m87j198J100J479k346r41K195O19
907A807k119j013K503N13l209l49L190K67l668M9L786l01l525m0L643l97l394
924b257lL415l29l077j55K774L60k576l2K154m96j496l9J402m96q32K93P12j09
943g87q25N09J02l07j48Q59M36j087j9M85O15j201q5J021o9o10k15Q50N4j77n25
964a124JJ123K27j369k97J265P84r82r16Q51J076q41j362J517J577j305j714J566
982G7J900j333k084J450K265j629k102K007K045j889j810J774K132k120j527J942
998A098J393j868j076J715P48j548o65J947J26j217j54J232q5j540P78Q43p34
1015I93p65Q38Q71p34q51P64L70l23r65L67O73l41m93j0N50J12k95q77J27J031
$$ y = [1389, 441, 1195, 1493, 675, 410, 1680, 1143, 4, 503, 1386, 899, -299, 801, 2280, -66, -1007, 1188, 1807, -312, -1325, 1178, 1691, -1518, -1867, 1323, 1590, -2078, -2029, 1757, 1456, -2069, -2109, 1534, 1137, -2257, -2260, 1155, 826, -2251, -2406, 368, 728, -1848, -1880, 274, -222, -1718, -1757, -355, -851, -1683, -1390, -678, -787, -1612, -1103, -1001, -1308, -1456, -597, -161, -1248, -1267, -782, -167, -1368, -1453, -432, -501, -1111, -1326, -476, -422, -599, -1124, -1123, 0, 227, -1142, -1439, -174, 610, -372, -1288, -437, 639, -202, -1564, -47, 1530, 225, -1489, 77, 1977, 644, -1440, 10, 2275, 646, -1456, 551, 2596, 707, -1103, 671, 2803, 683, -844, 1098, 2491, 623, -453, 1262, 2010, 462, -203, 1744, 1870, 653, 499, 1731, 1646, 106, 884, 1727, 993, 228, 1066, 1937, 1203, 352, 1116, 1486, 1163, 198, 565, 1238, 897, 404, 394, 944, 1056, 761, -116, 11, 1042]
1035A042j30j433P9J612m98j979L39K271n10k074j30K359m82k054L17K298j042
1052a5j489L48J862j372j186J169J084j164j441J758L84j129l95R59J72r54k1
1069a430Q79j06m68k03P35l48k95R4M59k34m46L31M2N47k43m61k15J023k1o78
1089a038p1J163rj437J8J605oj827K75J775R8j996M97J723m00j383N51J305l75
1108D68j405O17J383m09j114P13R62q66m92O10P36n35m83O41l83L33l60L28K37
1127I81j83j98k0O1P01p45p6N25L69q84j96J091K56j208m74J603K17j735l33K196
1147A948L23k405k50J849K53j823k46K157m73j778P8J985n96j728N80J350o42
1164E82j156P69O18n14q16O09N07j167j20J291l60p12J44L97l65l47K59J16k48
$$ y = [1042, 912, -521, -442, 1170, 672, -1307, -968, 1303, 793, -1281, -1411, 948, 466, -1588, -1271, 1027, -15, -1504, -1156, 706, -666, -1852, -683, 401, -763, -2204, -446, -62, -1191, -1586, -627, -455, -1409, -1430, -551, -657, -1125, -1328, -593, -941, -1236, -1142, -683, -917, -1363, -1032, -990, -443, -686, -1147, -1362, -339, -360, -1038, -1109, 54, 45, -1392, -1374, 231, 225, -1602, -1327, 448, 546, -1450, -953, 770, 370, -1013, -462, 843, 468, -937, -320, 1063, 654, -460, 253, 1215, 349, -143, 467, 1203, 668, 185, 826, 443, 776, 416, 744, 981, 798, 600, 580, 641, 1342, 597, 521, 1046, 1415, 531, 335, 1426, 1682, 474, 0, 1603, 1820, 85, -248, 1948, 2271, -134, -384, 1465, 1718, -105, -351, 1806, 1333, -445, -367, 1618, 1022, -706, -126, 1224, 582, -574, 195, 813, 299, -517, 92, 599, -568, -688, 603, 243, -469, -325, 72, -293, -640, -381, -265, -513]
1183e13j54L71l11k9J26J56o01P6N13j49q37L07J139p68r59O75Q85o87j110J234
1203f36J133j555j155J669R28j645j028J878R30j771q30J811Q77j760n05J089
1219e70M37r82j41J260j28l71j43N29j30l45K32N33L0l80K13K25k74o3J39K8K5
1240A24q8J50R9J95j32k75M83K63n57l83O30M99n21m38O35Q13l80j171Q93R19
1260A758j043q82R10P27p41p17P00P95p12o39L01J040n16p73K21O92j17p85J85
1279D04Q74l87n92l8O89R4r05K6M99K34q27J21L18j15m68JR55n49p40J10R26o01
1301B9n54L14R41j256l95P15O71p13o51O86M68n53r26Q42P14j118l65P42M17q37
1321h29m89Q72L29n76p31O63L61j2o88J78M31J41l72k97M03L99q13p0O94kj32
$$ y = [-513, -667, -296, -607, -636, -510, -354, -955, -879, -366, -515, -1352, -1045, 94, -674, -1633, -958, -73, -760, -1870, -636, 497, -1058, -2213, -544, 384, -1261, -2289, -411, 519, -1252, -2082, -271, 606, -1154, -1659, -570, -133, -1115, -1256, 4, -124, -495, -638, -109, -239, -584, -352, 181, 211, -169, 44, 269, -5, -68, 71, 99, 124, 36, 186, 285, 480, 348, 73, 556, 819, 262, -121, 509, 1008, 487, 49, 684, 1497, 1117, -54, 839, 1758, 715, -167, 743, 1470, 729, 12, 712, 1507, 795, 156, 457, 1497, 981, 208, 429, 1121, 1004, 219, 404, 1278, 891, 299, 261, 950, 1044, 139, 165, 664, 898, 71, 192, 510, 395, -73, -72, 883, 334, -406, -296, 630, 29, -525, -211, 730, -526, -921, -206, 465, -248, -899, -213, 255, -298, -1224, -382, 332, -786, -1151, -409, 8, -829, -1318, -446, -117, -693, -1424, -761, -400, -412, -1100, -922, -491, -350, -722, -1019, -616, -217, -1030, -1100, -406, -408, -540]
1342e40m32O37o7k27k68N26L08m07l91R79k22n36K22O04l91m04J76O57J5p40J52
1363c49N29O4m49K52L56K24r42L96L38J53q46N0Q65k08m03j89Q09N45r59k94J050
1384I92O0n32k03M98K93n87n28P45M55p37j8P48J36r50LQ02k02q34J80P72l44
1405G49l69K32K65l2p25M02L35l75j94L60M2p85K48L49K4n59j60K32L67k03l13
1426a10j00L80q0n2m83j83Q03j07l37p7N11r5q47L72R07o63j126P88O92o32q51
1447a290N93Q14k98j143O97Q13q18l62N01M97j179J91O48p7n08k02J192m27j140
1466a498O02P93j86o73J04O80m32l37M20L19k33k58K89K28l56J36n3L3j15L03
1486b34j75QO09k27j69p8L07J87n85K30O76J14j088K94Q43J1p22J50Q48l18n20
$$ y = [-540, -972, -335, -402, -629, -897, -371, -63, -470, -861, 118, -104, -640, -418, 186, -205, -609, -433, 224, 239, -501, -349, 180, 244, -205, 47, 403, 627, -315, 81, 419, 572, -274, -224, 641, 433, 30, -159, 650, 1195, 236, -58, 992, 1052, 520, 317, 815, 1108, 521, -7, 738, 1193, 456, 438, 1186, 1322, 372, 375, 1177, 975, 141, 321, 1093, 749, 380, 612, 877, 845, 120, 522, 857, 482, 288, 648, 690, -95, 153, 502, 526, -33, -193, 39, 406, 203, -110, -210, 170, 90, 38, -445, -628, 175, 68, -269, -346, 165, 70, -777, -405, 502, -161, -1287, -499, 193, -439, -1290, -697, 117, -181, -1324, -627, 186, -632, -994, -493, 4, -1175, -984, -336, -413, -921, -1123, 69, -358, -1498, -896, -103, -289, -962, -858, -178, -610, -947, -527, -208, -441, -699, -410, -182, -538, -402, -455, -422, -537, -234, -409, -401, 208, -19, -188, -266, 41, 228, -357, -127, 549, 663, -425, -131, 712, 723, 1, 151, 999, 681, 161]
1507A61m14J207m79m21M30L57j91n63M24L92l16k02K05j56o1j02J33M99o25K51
1527E29J50n8j81l22P46j0k15l85J89O67n06l46K30J83l4p17L03K64J00m81K11
1548C17L27k94p39L22P39m39q38N20K97j45l44J17M85l03j92J54j62q6q4N7L02
1569A1l35j11N6J34R4M6k85k27M86j65j56j76K42j76j21J03K34m96k15O56N7j89
1591e33k08K25M79q10j35Q65J55r12j61Q04K46p26r5Q86q6p79J40O92J4r12K81
1612e70N07q0n42K00P15m5n61K29L63k46l56M59M22o75K34m4J30n5l9M51K68n63
1634B02J50M39l87m11M51J10j45l58N38k80l11M72ko9J46L15j72k97L27J61m16
1655D63j06m5P69m54m10O0R21o92l69J93P58l32q76L72M30l9n03n8O66k81m20
$$ y = [161, -253, 954, 475, 54, 484, 841, 650, 87, 511, 903, 587, 385, 590, 434, 373, 271, 404, 903, 278, 529, 679, 621, 440, 118, 864, 854, 639, 254, 443, 1110, 604, 258, 488, 671, 637, -80, 223, 487, 587, 106, 317, 644, 350, -389, -67, 672, 233, -605, -85, 212, 67, -277, -160, 325, 22, -170, -16, -178, -264, -348, -291, 11, -324, -435, -379, -245, -151, -105, -390, -617, -131, -296, -452, -628, -386, -562, -683, -580, -346, -842, -1057, -401, -344, -533, -741, -516, -37, -847, -982, -117, 38, -874, -1035, -231, 15, -711, -806, 80, -6, -785, -645, 47, 61, -851, -570, -63, -143, -685, -485, 230, 185, -376, -147, 216, -30, -386, 73, 495, -180, 54, 10, 140, 85, 46, 497, 765, 202, 352, 791, 404, -7, 444, 554, 409, 51, 589, 309, -2, 470, 468, 399, 545, 860, 688, 391, 718, 879, 463, 357, 312, 1081, 627, 217, 277, 1198, 506, 137, 330, 1088, 756, -120, 252, 682, 643, 140, 82, 748, 467, 47]
1676D7k38Q04p29l5L05L33j25k88j9J02q5j59K89K85m00n27M98J40o13j5M86J40
1698A96n17l40R53m32l80k73M42Q0l03L6N54k49o04K07M62k38m26M06Oj48j01
1719f69j02L53J23p6l6n71N19K1k26J14M3j14M7n9K22M84n52m54P91J23l00k92
1741f11O68j31k61L8L50L1j73l75L91L43l50L1L12M6o81N49L50m95p7K55L65j71
1763D04l91l8M97j09m32L08M13j78l59L74K79m33l58N69K68j30m83J01N59j66
1783F95m21J77P00k92q16L86J00qm82K13K98j25j85J54L31o04K10K22K6n62k71
1804b54Q14j35m34O7L76k72k43P1L78k63N9o4N4j95p7M8M07m01j18N4k46R1K39
1827d4N5m09N6M32k6r14N14N71l92o66N00K72k87k71J95M91o36n45P05K66k03
$$ y = [47, -191, 613, -116, -151, 154, 487, 362, 74, 55, 157, 72, -87, 202, 487, 87, -440, 58, 198, -415, -430, 56, 196, -321, -661, 292, -140, -520, -793, -351, -271, -574, -538, 16, -233, -837, -630, -168, -406, -832, -426, -420, -568, -669, -771, -418, -295, -371, -407, -978, -459, -438, -664, -550, -507, -621, -574, -633, -411, 73, -479, -933, -142, -19, -319, -611, 57, -74, -335, -297, 53, 84, -89, -464, -73, 270, -80, -49, 263, 309, -372, 177, 527, 32, -45, 210, 575, 404, 13, -25, 472, 363, -69, 239, 652, 474, 115, 489, 768, 335, -23, 546, 814, 684, 201, 302, 861, 695, 274, 451, 1151, 859, 43, 429, 529, 521, 39, 252, 550, 425, 240, 394, 725, 121, 331, 553, 579, 17, -254, 560, 425, -9, 58, 434, 162, -81, -10, 368, 105, 164, 100, 154, -41, -118, -70, 337, -64, -182, -128, -374, -283, -44, 11, -398, -342, 90, 64, -850, -336, 235, -157, -823, -323, -51, -338, -609, -414, 77, -559, -1104, -399, -133, -336]
1848c36o02R73r0r52J36M87K76m72j72N62k16k54J35O60l36q13M31P02n28m7l4
1869d90N81j72n45N35K73l93o3L47n2n06JM37l7j50J11M74j59j66r4L50J39r0
1891C31j14l16K17K15j34l9m8N38k0l02q1M51n37L41%N4l71J84J6J33n0R4r2L42
1915H12k54j76J49m9r9k13L64O3n37q2M60J4R1n64L64Q5n3m79L06L63k78l45O0
1938BO13k91k84n3K86j46l22J75K27n12q9K47K00m22j17N02N0k90k16N63J4m01
1960b64l91L90J95l01l19O20k99j43J13J40o7k3K40l20K35k9j58K48l73L21k91
1981d76J24j24m6O7J01l0J30k51r2R5K71q5J62%j61K55l16K08L40m55j44N38k49
2004a38j4l86O66q1k49M80l12M4m9m2M26j00k75R0L07J75n56K44K0j08p7J32K74
$$ y = [-336, -938, 35, -55, -1007, -871, -384, -108, -580, -752, -190, -406, -660, -525, 135, -201, -1014, -583, 119, -409, -456, -490, 91, -81, -626, -91, 182, -211, -274, 73, 21, -485, -484, -47, -84, -234, -123, 351, 192, 26, -68, 282, 421, 331, 217, -99, 118, 333, 199, 160, 112, 650, 630, 328, 247, 698, 161, 502, 502, 556, 185, 369, 385, 518, 468, 562, 470, 812, 558, 382, 531, 482, 383, 170, 534, 597, 60, -22, 438, 452, 543, -21, 343, 428, 375, -104, 202, 565, 287, -58, 2, 615, 324, 40, -13, 273, 127, -195, -20, 207, -305, -394, -147, 53, -369, -486, 16, 66, -224, -440, 123, 137, -264, -655, -265, -70, -371, -690, -70, -369, -512, -399, -259, -326, -349, -109, -429, -194, -223, -381, -133, -506, -185, -476, -352, -476, -522, -455, -354, -384, -254, -505, -597, -502, -231, -316, -154, -154, -315, -60, -376, -168, 172, -283, -427, 111, -138, -152, -538, 128, 47, -202, 278, -34, 10, -39, -81, 345, 245, -30, 60, 367, 542, -14, 230, 250, 142, 65, 197, 471]
2027D71l1k49N4K10j67k3j96L71q2j67l2K84j70j2J27J0K53l70P6K10m44P0L5
2050B28K80Q6m98K36O66m24l06j84L4O9J28l84L82J7l39j3N17k40k85J52Q8p2
2072A38j37J51k8K34j66k28K6Q1N0m08j1P3J53m08K7K06K3o3j34N29m19j54K83
2095a82l0P3k91K71k55j24R2J08M5j76r2M02N6m50p8K48J37q1Jo0N1Ol06JK37
2120c97J30M8k56K72L4k10J84J16j3k34K75kj52j49J11M82k93j98L51K46j74k22
2142e1j51O13m47j26K61K28n33L21K92q4n92M58o0M48k99j43M29l39j31L42k06
2163B30K28l26K56qJ2p0P5j60P7l8O9j40l9PK75J86l37K11j04j14qM62p32K2J40
2188A74O7l26M6K32J48o07K46JL4l98L41M99n97L6J28J47j41l27J32R7k0l29L54
$$ y = [471, 440, 191, 245, 455, 288, 265, 69, 440, 358, 191, 159, 443, 273, 261, 388, 398, 651, 281, 357, 567, 123, 193, 228, 508, 594, 96, 332, 998, 574, 268, 84, 118, 187, 315, -69, 313, 330, -9, -22, 495, 255, -30, 122, 210, 138, 1, 152, 124, 358, 192, -36, -10, 71, 121, -287, -298, -225, -72, -480, -453, -247, -224, -287, -421, 108, -311, -465, -182, -212, -139, -430, -159, -414, -538, -446, -338, -293, -469, -561, -159, -103, -553, -631, -383, -246, -327, -326, -386, -335, -329, -635, -634, -397, -267, -219, -475, -203, -169, -379, -195, -79, -92, -326, -51, -53, -205, -354, -243, 239, -54, -252, 99, 345, 171, -51, -202, 411, -36, -162, 99, 327, -206, 115, 407, 323, -269, 189, 129, 577, 278, 135, 564, 225, 94, 436, 230, 458, 132, 388, 380, 392, 322, 397, 237, 314, 276, 345, 205, 166, 173, 448, 634, 297, 508, 404, 290, 282, 744, 12, 34, 174, 241, -85, -39, 193, 341, -266, -20, -19, 15, -383, -42, 457, -140, -104, 24, 171, 30, -297, -165, -68, -88, -417, -63]
2211f3J11J7m12K92J01m0j73r0K76l16J69rm15Q7q4L83j37r8J73Q2j12j24N7j12
2235d37J59r7Lk75K74r6J52o3K23M5k9n82N23J53l82P5K00r6R8k48K57J08M5j21
2259a11k1K20k24l4K15n2j17J4L26l29o4J31l1K96o7mK39m37M30m84K97J14P8
2282C85l65j3M30l02J30p6L39n36RJ32N20m51N7J05O8l51j5L4M03l21k6J70k8
2305B98q0M4J09J09n19J98N49o11m8j29Q76l69m03J49M18m98j43J81j99M48m96
2326a16L40k02KL20j57r9l32J43L06j40j19j96L81m85J9R9K48k61J27J74l42K55
2348c5j05j24j75J21L38n05M18m72M40j98L3l6R1r3Q7j25J67j64j37jJ79J29k37
2371d04J49p3L47l54L42k69j87O6j38N16j70p0j9J87j66p5lR7K00K0l33M72j64
$$ y = [-63, 48, 65, -347, -55, 46, 6, -167, -257, 19, -297, -128, -137, -552, -465, -549, -166, -303, -401, -228, -146, -258, -382, -325, -437, -278, -375, -372, -647, -373, -469, -317, -380, -157, -112, -141, -723, -200, -47, -429, -354, -154, -250, -152, -400, -143, -35, 10, -111, -132, 88, -136, -170, 45, -7, -124, -110, 216, -113, -177, -46, -77, 219, 152, 148, 387, -50, 380, -104, 193, 307, 385, 20, 7, 437, 135, 265, 189, 528, -8, 1, 133, 653, 202, 259, 364, 432, 81, 66, 100, 503, 182, 156, 326, 298, 218, 262, 371, 480, -39, 159, 708, 97, 49, -80, 796, 427, 24, 173, 591, 93, -50, 131, -68, 380, -116, 224, 22, 24, 344, 187, 88, -244, -101, 205, 65, -54, -250, 131, -354, -335, -236, 12, -249, -122, 52, -290, -35, -140, -264, -439, -318, 20, -485, -67, -539, -99, -297, -264, -300, -209, -302, -215, -340, -173, -337, -474, -475, -296, -167, -404, -255, -328, 19, -335, 7, -262, -449, -383, -521, -5, -175, -245, -264, -77, -243, -318, -321, -224, -24, -4, -337, 135, -29]
2394b9k22m2K64m4k81M25K66k12mM29q7k15q3j10m9K2J38K15m54NM3K00j83J09
2418A01J0L16j46k41K87Kk76K01j34J47j42K83L0k13K19J83j92l03Q7M72l66M1
2440C66m7J26j63j02J55J59j51l06j27N43j69r4K31l11m5j22m1R0N0M9j75L52
2462B68j32j61k15M64n63K91r6j12L72l77M37m28Rk16N13l37nK39k13R5l35K12
2484b90m1J23j12J28O7L5j42L1k64j0K37r1K03k91K26J39j58r2l34M53M7N8q1
2507a59l7O7k28M60l95j7K5K98k2j76J52J80m88J4K85j64M3R5J18k37N4N3K22
2530A43J28k90j79K19L51n98J25M34n6l42J29J90k44j8K26j8N0j20J15N6m27K29
2552A03K23n3R4m60K66Q4j24j23J98L93n65J08O9J15j56K06j72P1j72R4M0l5M3
$$ y = [-29, -251, -293, -29, -73, -354, 71, 337, 125, 121, 550, 463, 248, 165, 55, 6, 28, 166, 381, -73, -68, -25, 175, -8, 101, 111, 427, 281, 40, 327, 329, 53, 254, 120, 267, 125, 408, 438, 225, 444, 627, 435, 132, 219, 691, 325, 366, 319, 445, 282, 180, 335, 494, 343, 37, -90, 453, 284, 190, 421, 110, 65, -57, -98, -8, 42, 91, -84, 268, 136, -25, -240, 224, -339, -48, -144, -256, 116, -261, 176, -252, -243, -459, 54, -283, -288, -49, -262, -167, -502, -290, -331, -208, -320, -192, -125, -90, -232, -201, -465, -475, -238, -329, -126, -417, -191, -52, -210, -302, -636, -183, -136, -78, -159, -196, -129, -357, 103, -292, -309, -284, 14, -8, -184, -32, 148, -340, -326, -41, -205, -162, -67, 51, -186, -132, -79, 143, 271, -19, -198, 21, 372, -226, -101, 333, 277, -65, 64, 254, 10, -8, 218, 200, 250, 130, 245, 301, -126, 103, 326, 273, 367, -93, 173, 257, 133, 10, 208, 601, 36, 144, 213, 328, 172, 378, 206, 277, 105, 199, 239, 204, 247]
2575B47J74q4j10Qo4j6N5o1M0J44l46L29l31M8J49j12j52J42n4j1N3j36K39k12
2599f1N1n9L13j70j5k03J24j23J0K44l47K2J6j0J93j30J98o39O10n8k12N0p2l9
2623c07M9N2m7J42n2k51J03J45j56K13j69J61j39K49j77k2p4J16J97l55M0q3L16
2646d9j37K3J83q4o2o5K13J04p1j16K6J25l6JJ04q6r9J7J60p7N3J85j13n5k57
2671a13K70l7Jj53K33K76k12N5oJ54k61K26j71km6K23l26q3P2L91j83P3R4k11
2695B64r6j45L4K64j47n6J87j22j26J35lN9Q9j68O9k58J33JL7nj31O1k03J77j34
2720h4r4J36j24K52l86J55N6k59L79j61K63m27J46M52k21l05J26k24L11l12P4
2741b47J29m5r8N4K82m41J25Q3q4p8J04K81l41Q7l05n4M97k78R4Q4j8k95J63J92
$$ y = [247, 421, 337, 227, 235, 171, 155, 210, 149, 189, 333, -13, 316, -15, 33, 182, 70, -82, 60, 6, -5, 48, -88, 151, -61, -10, -69, 244, 74, 59, -144, -20, -143, -133, 111, -236, -214, -198, -208, -15, -145, 53, -586, 24, -34, -246, -196, -268, -307, -258, -206, -253, -111, -163, -414, -311, -166, -322, -109, -278, -117, -256, -7, -184, -206, -280, -164, 33, -322, -282, -365, -49, -186, -163, 20, -64, -126, -191, 22, 126, 55, -61, -35, 90, 54, 55, 159, 73, -26, -9, 151, 74, 127, 312, 199, 144, -113, 157, 120, 121, -32, 201, 477, 265, 320, 314, 468, 207, 433, 262, 260, 214, 437, 111, 28, 100, 491, 308, 381, 475, 264, 168, 23, 57, 321, 174, 118, 305, 183, 57, 192, 189, 248, 337, 169, 238, -20, 113, 114, 151, 146, 15, 76, -127, 50, -84, -178, -42, -166, 86, -300, -145, -89, -348, 31, -130, 133, -294, -148, 304, 83, -222, -96, -320, -9, -321, -247, -118, -163, -261, -207, 75, -366, -241, -158, -242, -320, -216, 65, -276, -189, -494, -548, -51, -329, -235, -151, -169, -464, -301, -109]
2765a09R2l82Q2J08j79L29J63j12p9Q0j31J06J0l12M53K5l16J23j89m1K14J15
2787E0j09L72k28J6r6j57K19j08K89k23J42j97L89q1j60M3P9k10p7M05k88r5L81
2810C56k21kJ92j50l9o3M36m03N1J24N3k45o5J32N1l69M59N9m02J85J73m4l29
2833f1L54Q8m8k76M07m76n4l2J01O4nj28j4P1J28l49K25K34k00k02n0J31M1q1
2857a32R7J08k02k29M01j48k09K81j18J20L14o86K62J10o9k4j93j69O29k03l15
2878c75O8L7p2Q1j12L36p5m4J26j26N1k98K72L2j64K62k56J18M6R4O8l22nK19
2902c9l9o1K23l58L09j7j46J68j40J16j51j52M62J16m38M86l73K05kk27n9pL44
2925B20Lk74RM13r1o4j05J41j92jK96l20k5J65k1J35j21K24L1l06j46K80L2J61
$$ y = [-109, -17, -399, -317, -209, -388, -59, 104, -8, -87, -7, -138, -32, -22, -334, 119, 144, -172, -49, -238, -279, -65, 50, -59, 313, 85, 101, 5, -152, 67, -41, 248, 25, 167, -30, 359, 278, 118, 161, 240, 30, -47, 358, 70, -25, 356, 135, 133, 325, 175, 136, 73, 509, 106, 157, 281, 334, 89, 24, 156, 207, -162, 297, 356, -46, 139, 312, 268, -61, 293, 381, 333, 57, 464, -12, -66, -98, 3, 67, 62, -66, -80, -9, 119, -230, -5, 229, 29, -173, -223, -92, -51, -132, -35, 73, -129, -358, 43, -105, -314, -33, -151, -31, 283, -403, -141, -31, -100, -124, -317, -486, 143, -60, -375, -307, -270, -342, -261, -373, -37, -112, -156, -30, -156, -105, -403, -131, -99, -263, -1, -257, -139, -93, 1, 69, -253, -258, -39, -78, -139, 84, -274, 35, 18, -128, 40, -100, 16, -135, -287, 175, 291, -147, 339, -34, 171, 169, -58, -117, -124, 220, 223, -51, -42, 371, 280, 216, 111, 252, 60, 59, 355, 35, 10, 175, 154, 289, 168, 392, 423, 117, -29, 251, 283, 444]
2949D44q8pOj83OK39p7l67K9j7LN27n73J44n8K86j36J06k56p1j43K10O9j76K70
2974A87k52j7k48K06j95K21j20J60J81q1L48j005M76J27k56K03L0p1O9j76M51
2995B38m04k58L69j9p2l0j3J72j82m8P1q1m0j4R0M1J07k2J32l23r8K26m0J64j13
3020a47L6r2J47j26o6K84k60K87l47J33K1k1L3L94n60M42P1Qm61Q0J27Q8j41r2
3044a62J08m6M10j54k1r2j68o0L58j06q1j32M56l34J43lL4%M3j90K38J99m02J53
3068A91%J80j59j07K27l14K94o8k1R1j10N3j18j41K58l78M42m91M44l19J01k77
3090b22K10K34k28Q2L0K97l51J74j53p9J24j9nj38K83m06R8J64k89K85l67K44
3112c2l21K63J72K41p72J04J65M59l09m2l16M80o21L75N0j8q2nL74l30Q9N4j67
$$ y = [444, 356, 349, 355, 172, 178, 417, 340, -27, 2, -15, -12, 515, -58, 86, 28, 314, 178, 284, 28, -43, -186, 24, 93, -83, 187, -65, -82, -330, -124, -319, -98, -218, -58, 123, 42, 390, -615, -139, -12, -268, -65, -35, -106, -37, -213, 238, -166, -424, -55, -74, -146, -176, -189, -17, -199, -247, -176, -257, -297, -311, -221, -180, -73, -95, 37, -286, -384, -158, -198, -34, -147, -111, -203, -56, -182, -248, 36, -224, 63, -284, -151, -130, -151, -118, 276, -284, 158, 229, 237, -224, -144, -17, 71, -70, -162, -54, -100, 310, 156, 135, 43, -125, -185, 173, 67, -14, -146, 310, -24, 119, 116, 150, 150, 193, 3, 241, 440, 38, 191, 191, 371, 212, 105, 332, 18, 312, 244, 223, 314, 204, 257, 139, -2, 256, -122, 320, -171, 273, -46, 55, -222, -12, 222, -6, 76, 106, 403, 52, 226, 73, -6, 118, 99, 94, -44, 239, -167, -69, 95, -194, 91, -276, -32, -353, -90, 82, 323, -449, -345, -180, 279, -30, -72, -388, 92, -529, -154, -104, -122, -204, -209, 165, -165, -76, -22, -189]
3135a89n2L8J80o7J39k91n9j03K55N8J41m8L2m0k14N5p4J87j83l9M15l03l39R4
3159d07M22q4l8n1k57K35K47j4j36j87M07Q2K5m76J68q5m0L04M4k74L35j85p8
3182d3K5J77J30J9K9q5P4j47J69n0j20n1k61L60N0j1l91J93L14j64k23J33J8J63
3206C08l14M52j06l38J97p3k79M05q2p5K76m40N24l96K13n7k12j96K40L84m81
3227e0No3L6K36o8P9K2k19j38J64K42k02k70N7N9L08m65L27J00l87K8M80n57K48
3251b8J93O8m16k65J24L64k10m3j2Q8k35K50J62l92R0l1R7k99P6K4R3J71J41j4
3275dJ42j52j99J53j19Q9L4R2j56oM04l87M7K4k88K07j10PoL85j56n4P7r6M30
3300C58r1k14q2N7n6J08j4l84M58k53K36k03j53N28k25J94Jl35L34j53J57m4j
$$ y = [-189, -241, -203, -23, -90, 49, -242, -301, -404, -149, -91, 50, 2, 34, -6, -220, -165, -239, -52, -235, -274, 141, -162, -501, -407, 15, -69, -107, -158, -415, -180, 67, 53, -83, -270, 137, 219, 244, -232, -64, -149, -189, 115, 159, -115, 220, 35, -43, -18, 159, 289, 308, 337, 252, 326, 179, 348, 298, 178, 127, -134, 226, 276, 265, -126, 67, 381, 217, -6, 127, 145, 308, -6, 446, 340, 2, 199, 126, -153, 252, 170, 95, 371, -69, 455, 59, 272, 215, 3, -193, 47, 431, -50, -45, -108, -72, 164, 96, 175, 197, -22, -160, 4, 246, 44, -226, -169, -110, 198, -267, 60, 160, -227, -199, 281, -276, -28, 165, 233, -183, -448, -324, 40, -170, -213, -225, -137, -372, -122, 40, -352, -262, -293, -196, -495, -419, -395, -302, -131, 10, -4, 138, -14, -213, -60, -179, -90, -56, 36, -120, -126, 278, -109, -62, -38, -326, -119, -229, -222, -228, 157, 1, -53, 24, -72, 358, 267, 53, -29, 28, -28, 80, 66, -318, 140, -113, 123, -80, -233, 295, 70, 264, 265, -70, 264, 111, 268, 224, 223]
3323B23J6J21ok82K05j07k96K31RR2N1j64k94J45L69k06k10M39l56k3K41l58K20
3346F0j12J67j41L48l0l06L33j76K10l71J08j32J02L2j50Q9r1K2J05Q7Ll68r6
3369c07K88Qj19K69j07q4J71r8Q2m50K91o7K07P5j22j79L2J74l98J50M6L64n42
3392c16K12J93k90k9J71k3j30r5M00j92K8j90K69q6j65M9K29n39K75K17k3m2Q
3415f9J73J82l64l8L79k06q2Kk3K62n72L05J19n3k3K12k11K26J04j40k77L8j6
3438g2j4K45l28K57J17J9R4l63K67N5k43K36l35L08j38k63L36j15j05K41Rl35
3460a27L98j35o5K29j82L46n37M69n66K66j40r3K71J34r0j49nN6R6k60J42J5K02
3483B75l37o4L63j41j40m1O0N7N6k02R2J00k76L12J16j82l8l5M4r4j11K07QjN8
$$ y = [223, 239, 360, 354, 72, 277, 170, -126, 105, 114, 206, 257, 93, -201, -56, 313, 107, -103, 336, -20, -43, 198, -160, 60, -52, 115, -26, 322, 292, -14, 319, 143, 353, -18, 90, -42, 60, 92, -58, 31, -60, -38, 67, 154, 157, -211, -307, -19, -11, -130, 139, 32, -52, 119, 21, 103, -347, -56, -123, 84, 159, 37, -142, -110, 64, -334, -184, -138, 226, -316, -104, 89, -201, -230, -59, -82, -212, -307, 93, -99, -71, -261, 8, -78, -243, -194, 35, -504, -229, -12, -35, -77, -69, 104, 286, -78, -116, 263, 57, -25, -23, -46, 216, -356, -51, 68, 15, -8, 204, -7, 219, 323, 183, -94, -56, -72, -86, 159, -169, 88, 205, 224, 318, -45, 222, 277, 34, 270, -65, 243, 105, -158, 178, 63, -42, 199, 208, -127, 271, 136, 71, 300, 118, 464, -73, 396, -170, 96, -44, -137, 134, 268, 178, 29, 24, 80, 176, -84, 58, 73, 275, -62, -126, 237, 96, -44, -85, -25, 32, 88, -114, -22, 78, -198, 114, 230, 48, 10, -25, 19, -75, -186, 21, 29, 28, 86]
3508H6j29l88M36l41M31j87J37%j48rj77K45j40K03j66P5j66n9J50K28M0l36j3
3531b28j1m1J52J01j32J5j49L47p3O0J81l79L78o01M06K48j45j86Q0j9j60j98
3553c54K79q2K68q5j06L07k89N8K19j15Lj61o6J81J67K45l04l2J9L4j68q0L50
3576B88l41P0K09j77P3j78K47j54J44p9P6R1l53oJ58j36J67R2n36M04J44p9j31
3599gM9j2j56L43R2j93l06K19lj2L91n20Q1M7Q4K59j49q4N3j31j66m7J03j34K8
3624a71J2L02k26n0M21m72L40m11N7M06j12j78K20l16L18J8k70N3q8O9m0j2L45
3647B15j85J02l12J86J24L5j04k81J85p8L23l70J19K5j3k07J26kq7J35k14L84
3669A06m55K04qK37j28j23j37J03K5L44q5O9j46k14N17l53q7J08P3M5l1j15K05
$$ y = [86, -43, -431, 5, -336, 95, -92, 45, 45, -103, -112, -289, -44, -184, 19, -147, -72, -238, -297, -147, 81, 121, -215, -228, -239, -280, -128, -27, -159, -144, -293, 54, -19, 41, 222, -157, 221, -380, 26, 274, 129, -57, 23, 4, -156, -354, -75, -157, 111, 26, -80, 227, -62, -4, 215, 100, 103, -58, -124, 57, 224, 469, 165, 133, 152, 186, 18, -62, 288, -53, 17, 226, 49, 122, -56, 191, 37, 181, 102, 178, 269, -84, -90, 68, -68, 99, 191, -345, 59, 203, 124, -7, 42, 30, -126, 217, 309, 116, -190, 29, 26, 14, 405, -115, -34, 13, 97, 356, 207, 123, 176, 45, -121, -168, -65, -199, -171, -159, 143, -83, -133, 288, -184, 156, -255, -198, 208, 96, -82, 138, -178, 140, 158, -112, -59, -147, -78, -118, -130, 215, 30, 132, -180, 6, 130, 165, 61, -220, -35, -113, 210, -160, -41, -16, -29, -236, -110, -112, -199, -64, -278, 106, -349, -145, -153, 84, -44, -167, -304, -201, -176, 168, 83, 152, 6, -208, 309, -44, -131, -23, 50, 95, 64, -51, 154]
3692A54j13L5k2j9L09k49J56k69J34n6O7j38K47r8k09K16R5J02K0j23l31K98k33
3715b7K85K3j96r3O9j47L77k70O6j99K00j7Q5r2K04j80J5P2j91L99l08k62K45
3738E8J84k61qj75K20j02J85J15j67j61L35m41L51j95j13N9K8P4J62r3J0l22k50
3761e07M12O1r2J07p6j40N39l21J88k25m9L88o2k85k46j53L02j28M55j8k02j49
3783b01j11M96k86J97k67R0n6k8k97J79J32P0j38J27J18n4qp7j67K17L9J9k22
3806b28J82J3L14l08K22l33j40K45Q3r8j27K85j30K28m09J52J11n9n4rO1K44q0
3829A65J13k75J65Q1l74L0M5J86j10P7j86J34J19J0j75k05L66l1j8q3J4J49k29
3852c2k14K86J40q4Q1j73J65k10J21J02k07J44J27k89J2P5j53J54J39l60N31j12
$$ y = [154, 41, 76, 54, 35, 344, 95, 251, -18, 116, 60, 127, -11, 236, 138, -71, 145, 240, 342, 362, 239, -92, 206, -27, 258, 281, 85, -8, 61, -86, 291, 21, 87, -112, 88, 71, 156, 64, 268, 88, 103, 175, -16, 383, 75, -187, 58, 242, -19, -27, -202, 18, -84, 101, 216, 49, -112, 223, -218, 133, -62, -175, -116, -88, -14, 148, 55, 65, -257, -507, -95, -34, -126, -19, -95, -235, 304, -17, 171, -54, -103, 285, 223, -62, -308, -461, -159, -287, 168, 150, -52, -201, -312, 184, -102, 95, -172, -82, -138, -166, -463, -284, -152, -82, -220, -93, 25, -29, -37, -114, -281, -64, -25, -6, -228, -46, -33, 281, -27, 195, -138, -278, -33, 50, -48, -175, 110, -20, 208, -201, -49, 62, 3, -51, -60, 1, 245, 165, 278, 3, 168, 249, -125, -95, -50, 136, 26, 103, -83, 51, 170, 180, 5, -200, 166, 135, 117, 34, 48, 197, -32, -246, 40, 180, 96, 177, 4, 169, -41, 80, 182, -25, 119, 246, -43, -31, 44, -109, 45, 184, -176, 355, 243]
3874B43k26j97M47n47l3M31j11j31J86J91k81rj59L64m39J91R5q0j84K67L1%k89
3897b40J54j19K41N1k41j19L4N2K19j36J57n06J9N15m44K77K72l16L09k87k35
3918c43J62K53j92J73j13j69Q0J68k96L6J00j9K33k08Q0l23M79k72J54rJ17r7
3940fR6L2n9k8k15J26L38k19J73j73o8j2k27M23j61N7j3j04J73M3L4n7k20J13
3964D6j32K26o4P1J32m41M34k36Q9J66m30L46R9l02K03J2l36r9M68j68r6L55m59
3987a16J97j59J78M5r5r6k4k4r8K51j25L16k54O9P8OJ91n76M41m51R6j7K73j2
4011I4j17k32K6J89k3J64j90K86m70M06j30M3k07L19l61M42j01j76K7K2mJ34p0
4034G1P9k63M9k1pnP6j2M5j08l26L19k9RJ42l14J73J1k96M12l37L21j14J70k98
$$ y = [243, 17, -180, 267, -280, -313, 118, 7, -124, 62, 253, -28, -37, -196, 168, -271, -80, 15, -65, -249, 18, 49, 49, -240, -86, -205, 36, 87, -154, -273, -239, -187, 32, -104, 53, -453, -434, 81, -363, -86, 186, -130, 179, -108, -343, -181, 72, -120, 53, -60, -229, -149, 19, -277, -241, -141, -160, 73, -135, -55, -378, 101, -171, -17, -26, 91, -6, 90, 122, 63, 35, -180, -54, 284, 65, 238, 65, -3, -15, -242, 181, 20, 77, 64, -40, 133, 176, 210, 153, -67, 46, -86, 140, 76, 147, 279, -162, 272, 36, 125, 291, -139, 207, 306, 4, 207, 219, -117, -216, 252, 84, -12, 343, -116, 81, -78, 100, 145, 50, -46, -70, -94, -192, 59, -66, 250, -4, 65, 143, 149, 340, -236, 205, -246, -150, -167, 106, 94, -23, -255, -229, -40, -63, 101, -89, 197, -273, 133, 3, 46, -161, 158, -203, 239, 138, -38, -11, 11, 7, 141, 71, 150, -113, -64, -85, -92, -97, -21, -33, 12, -96, -422, -103, -132, -123, 19, -295, -122, -111, -407, 5, -332, -11, -125, 45, -253]
4059b53J45N4j31J48J21R9o2j56P9r1J06m6K68j40k82K31No6J67k84j20J53L18
4082B63l67L72n5j68K4J8o4J02O7M6k47j14K26m7k25L03MO5Kr5O6p6M9K2J3l34
4108a50K26J03J24l49J4M8J1J20m9L5l5K10m23L55l91M26n01p7L68J04k70J19
4130A8p2p8K33m1Q5j33j3J05J12o8Qk11J81l34L17j5k07L61m16K05n8l7L0J10
4154H2l14J24q3K53L4n8l3k4l17K56K7k87L54j6k58L88j63l18N6N13k97lJ01k78
4178b61L20J31l30O6n8J39O6j19J25j12p7J08O8k33K13r7P1l1P6j98N1J10l40
4201c12K12Q3n5L52m74J52P9k78J73P8K35l39K9J72k09J53j2P4j38O5K51l37J93
4224A47j47L94k93m3K70l15J48nj08J3J2k18K70j62J1J63J56j18k59J10J56j33
$$ y = [-253, -108, -54, -185, -37, 84, 183, 121, -35, 44, -47, 59, 13, 281, 141, -141, 90, 95, 29, 196, -88, -208, -55, 263, -104, 268, 213, 45, 69, 87, 23, 125, 192, 238, -9, -123, 103, 56, -169, 134, 138, 203, 205, 110, 176, 100, 149, 171, 184, -150, 76, 179, 303, -46, -32, 16, 27, 147, 98, 133, 98, 308, -115, 240, -151, 275, -226, -303, 65, 169, -101, 18, -54, -132, 101, 60, 145, 12, -1, 104, 216, 148, 156, -55, 126, -208, 109, 94, -113, 248, -168, 37, -21, -58, -28, 82, -232, -108, -191, 62, 96, 38, 5, -19, -336, -80, -53, -340, 14, -2, -260, 128, -35, -353, -297, 216, -81, -84, 17, -261, 59, 190, -140, -74, -132, 7, 73, -46, 79, -33, -110, -2, 66, -167, 46, -51, 20, -11, 65, -133, -82, 28, -312, -100, -17, -72, 280, -194, -42, 37, -241, -68, 10, 245, -94, -65, 107, -102, 51, 39, 113, -25, 40, 291, -46, 147, 0, 394, 101, 58, 328, 13, 161, 156, 48, 61, 73, -145, 125, -37, -26, 137, 293, 175, -84, 26, 182, 49]
4246D9r0J29j41J92o1j47O7j15N1R0J5l40M66k60K10r6m5K13k40J3J08j16P1j45
4270a22k6J88l1j29L21j32k34oK13k3J06k19K57k15J59k17K14j45l0J19j71r8
4292b21K88j0J6K25p61L10K6j50j0k2K78J36q3j44j25K41j61K39j0k25j14K55
4314b2k63M03l10M14k64j0Q4j04P6k99K08J15K0o2M2K4k57J74K9J4J04j12K18
4337B22l09P2K28j94k23L34k21k65M71n6K0J17j99K13n1J04j27nj63j66qM89k31
4360E2K97l40Q7k97L97J64m27L31j22J00k35P3j90K62qK4q8j46Q7j87l0j35M18
4383H7J03l82L22j94k73K89L9k1J02O6j56r9L18k32j6J1J82j40p6J38R8j51k37
4406b22L03j64j08P6O4n0j02L00k44K09k9J7r2m4J79L7l75J3M93k63o9j88L55
$$ y = [49, -41, 88, -53, 139, 78, -69, -2, -117, -66, 24, 39, -301, 165, -95, 115, 19, -26, 187, -53, -40, 68, -48, 23, -122, -148, 40, 9, -120, 201, 69, -165, -171, 42, 19, 125, -94, 163, -52, 107, -110, 104, -41, -71, 48, -123, -221, 67, 57, 73, 298, -463, -153, -127, -277, -287, -309, -31, 105, 22, -122, -247, -6, -167, 72, 62, -163, -277, -22, -285, 118, -192, 222, -42, -52, 32, -72, 4, -295, -87, 28, 48, -14, 28, 52, -205, -31, -2, 12, 116, 4, 222, -87, -15, 213, 19, -204, 130, -91, -356, 115, 59, 79, 196, -3, 210, 159, 263, 136, 131, -32, -198, -206, 283, 52, 349, 9, 96, -201, 196, 360, -67, 264, 142, 242, 7, 80, -110, 152, 144, 168, 80, -66, 21, -166, -196, -331, 87, 190, -192, 130, -64, -337, -48, -9, -30, 72, 138, -18, -117, 201, -31, -47, -36, 146, 6, -70, 68, 166, 15, -222, 81, -83, -191, -115, -51, -101, -203, 97, -147, 62, 33, 50, -42, -86, 93, 130, -245, -232, 261, -2, -71, -259, 96]
4429I6k12j13L72l41r8K34kK66l67K11o0J97n54N22j82mO2L29l46J61q9j71J05
4452A6j03j74K82J76k29K9l3LR9l3J66k12N6K16m32M00Kq6r2k36K12K1K4J34j40
4477F6o6K60r9l0j86J68o7l3J07l4k04J31J62k71J74j86k08R8L11R0rj55K08k20
4501Gj53K46K08l45J27l6j61J12O5J4O2k88R3J84j63j18J95j47P6k96K57J17j78
4524a22j77L57o6q4J32LJ00j58k3q6J64j71R8Q8J79k50j05j57J85M7L1k37J42
4547a10o3J38K8k28M60l0o4k33j6M8J95j95J09k28L2P2J19j73o2J29J77j50pJ63
4571A11k47J83k20m1J39P2j17J22k06L51j98K53l83K93n7q0J58k33L78j79p9l0
4593a0K36k18p3J56p3rJ09j34j02J17J38o77O73o9q1q2O14n42K94l03n0K48J28
$$ y = [96, -116, -229, 143, -198, -296, -62, -64, 202, -165, 46, -14, 183, -371, 151, -31, -35, 27, 356, 10, 171, 82, -89, 16, -87, -261, 21, 197, -32, -3, -36, -33, 66, 33, 199, -13, 43, 259, -173, 227, 229, 143, 51, -185, 27, 48, 72, 206, 66, 0, 260, 161, 131, -55, 113, 46, 13, 120, 86, -118, 13, 175, -96, 78, -108, -316, -218, 93, 183, 174, 19, 227, 7, -146, 100, 308, -37, 90, 54, -107, 5, 70, 84, 146, -142, -49, 135, -28, -146, 49, -98, -22, -318, -61, 56, -122, -299, 58, -8, -92, 40, 43, 143, -15, -38, -124, 40, -131, -33, 55, 234, -16, -121, -278, -93, -46, -15, -252, -110, -173, -35, -7, -235, 225, 195, 131, -102, -118, -70, 125, -70, 39, -189, -157, -85, 34, -139, -201, -72, 105, -45, -52, 111, -136, 47, -173, -214, -75, -3, -120, 2, -204, 147, -51, 202, -181, 112, 55, -25, 133, -100, 278, 99, 20, -10, 226, 8, -65, 91, 18, 9, 118, -16, -118, -1, 137, -540, 133, 64, -17, -99, 515, -27, 267, -36, -86, 162, 290]
4616B90j37n1J31j37j63J39o6j2J19J02k91L10j31J26on3k09k0O2q4K22k62J18
4639cK79r9j18m0J7k28J33m7J51K2%j73L16j39r9R6k23J20N7M0J34k34j2k22K19
4664e3J36j53O5N3k64K57J15j04K75n63L83j23j00J90J67j91m08K87m8k53M6J9
4686b67J82j51M69k06K7J12J0j60k05o0Q6J49K21j58j83K34j97l42L08k59J63
4707b27R9L12j52l3j40L36k37J13PJ02j60m6J95r4L03q6q7O1m48L70k89L62k93
4730c2J25p3j94l4J05J59K57l91K01o7k14L29k58K20o3J42j19K5k38J84o2j41
4752a39K39P5kj00j30J38M6LQ9j05K9j63K32l34J71j22L6L14l01j59K90J49l46
4775i0Ql6J74m4J8l21M40k88K40k14J48Q5m52K30j57J33J77j51o4J86p8J26j85
$$ y = [290, 153, 102, 233, 96, -67, 72, 6, -6, 113, 215, -76, 234, 103, 229, 223, 170, -39, -59, 3, -81, 141, -121, -3, 276, 177, 59, 19, 36, -192, -59, -106, 45, 67, 67, -106, 210, 71, -28, 68, -155, -35, 22, 62, 196, -38, -50, -272, -53, 83, -70, -5, 48, -216, 41, 156, 52, 327, -236, 147, 24, -76, 114, 281, 90, -318, -31, -79, -332, -286, -267, -85, -236, 233, 27, 54, 166, 176, 16, -189, -249, -163, -14, 207, 49, -134, 100, -97, -439, -131, -390, -227, -128, 184, 32, -1, -141, 195, -42, 71, 78, 180, 20, -26, 169, 75, 378, 292, 205, 266, -182, 188, -101, 261, -32, 93, 20, -174, -208, -103, 56, 313, -78, 123, 56, -158, 171, -87, 133, 70, 212, 93, 118, -120, 64, 2, -139, 100, 175, 173, 73, -57, 81, 127, 130, 219, 114, 143, -20, 212, -122, 49, -73, -37, 277, -24, -183, 107, 256, -90, -82, -118, 56, 12, 30, -291, 149, -139, 101, -113, 35, 120, -332, -102, -259, -126, 51, -100, -164, 22, -56, 70, -115]
4798a15P6N9j42R8J35j53K72k27N5k44M4K16k89L94m00J77J03j15M0j11k28J72
4820a83J23o4J80J72m16K46J7j60L24n74K38K07l73L07k30K69j58J8M2P7l28J92
4842g4N7o6K29l32L37l92J88m7N0K6m1N1n2L70k12q6L9k1j43j7N2O3K3k10J76
4867c2K33P5j78j76j53q2L73J04k8k55J3K50k2J12l11Q9k43M10j49j93K19k98
4889b42K0J72K50l05K67j61J03l67L10j07N6j76M3L67j66j00j8j6j7K07k74Q1
4911g3J44k3mj48K0l6K3J19k78K74o1J14k88L56l54J15RR8q8N9r4L9%K30l51L42
4937A44j33J3j07m2J35K0l8j25K91k51k05L57p3J04j06L2P9j77J25j42J10j57
4959a46P9J38r3j11J67m9L28k14l6l78K96j73M68j59k54M68n27M07j71j09rJ63
$$ y = [-115, -39, 20, -122, -24, 111, -42, 230, 3, 58, -186, -142, 74, -215, 179, -221, -44, 59, -56, -16, -127, -355, -183, -60, -124, 56, 228, -188, 58, 75, -85, 239, -335, -97, 110, -263, 44, -186, 83, -75, -57, -15, 62, -266, -74, -17, -83, 146, -186, 151, -241, -53, -100, -50, -24, -65, -14, -66, 304, 92, 6, 45, 24, -119, -136, -84, -21, 2, -208, -32, 201, 276, 98, -78, -231, -313, 60, 164, 136, -119, -106, 144, 122, 234, -77, 12, -231, 179, 30, -163, 56, -242, -222, -50, 200, -105, 162, 1, 104, -263, 47, -60, -4, -180, -137, 230, 64, -36, -54, -70, -87, 120, -154, -73, 71, 48, 44, -104, -84, -120, -97, 22, -256, 18, -43, 71, -217, 139, -215, -100, -91, 7, -81, -22, -116, -77, -77, 153, -198, 144, 11, 24, -83, -125, 10, 30, -8, -133, 158, -93, -298, 59, -14, 90, -16, 16, 95, -82, 43, -99, 11, -146, -67, 71, -22, -133, 34, -15, 313, 99, 63, -315, -19, -192, 276, 117, -137, 331, -196, 211, 40, -69, -78, 85]
4981H5j95J61K8K63j14k76n8J8J40o3Q1rl8j34L15j45k31J52n7J38k69K28M9l75
5005c06L05K66m29J60J47j45L0J36P2Rj14l10J18L90l33L7K03p0J29p5l08p1K32
5028G3j96K6K09o9J13j84Q5j57j85K70J45l13J69J78p7r6pj42K84J20l61J47M9
5051H1Q6J76l55J94k75N5J56k46K36p4l23j48L96n4K99l38K76m4l9P5l56J19J49
5074D6j28J20M5k79Q6J11L00m67N8J1J19K3l2R0pj90K9lj32J99kj60K06n1r3J
5100a00J6K14j29J66l54Q6J05j28J20j22M84n92L45j05J19k1M7j94J86l98J12
5121a43J27j29m5M03l32J14p3K14k64L21l6k34J11k87J89K63j6l23M05l31n1J30
5143A3o1K50k53k4K53kl49K99r1j39J99R5k76J29O9j64m6L23n5k59J91k37MR4
$$ y = [85, -110, 51, 79, 342, 228, -48, -106, -88, 52, -11, 70, 61, 23, -111, 204, 59, -172, -20, -77, 61, -208, 20, 69, -306, -1, 265, -164, -4, 143, -2, 28, 164, 236, 245, 131, -179, -61, 329, -4, 33, 236, 166, 295, 220, -88, -159, 73, -123, -97, 112, 43, 156, -28, 57, -100, -285, -15, 130, -183, -14, 164, 87, -9, -16, -158, 126, 246, -115, 32, 81, 167, 343, -12, 182, -93, -38, 118, -128, 108, 34, -289, -437, -41, -95, 204, -134, 142, 98, 59, 134, -222, -103, 46, -82, 38, 83, -196, -110, 1, 301, -166, -108, -97, 22, 45, 13, 103, 96, -94, -65, -68, -200, -1, -3, -163, 43, -8, -101, -100, -84, 130, 1, 167, -187, -101, 4, -124, -4, -126, 358, -234, 111, 6, 125, 104, 151, -43, 143, -255, -143, -16, -145, -190, 213, -119, -5, -78, 136, -128, 193, 157, -77, 34, -253, -64, 199, 183, -140, 265, -66, -117, 13, -48, 202, -51, -75, 178, 176, -173, 126, 35, -104, 95, 190, -86, 43, 112, -52, -98, 225, 170, -89, 102, -135, -131, -37]
5167c7J32m3j62j92L58N1k88R3M3J82j04m4n5m7J00N4p1j00K28j35J67N9l68K93
5191A14m1l24N93n19J14nJ31J57l26J68k25m4L50r8M1J46k80n6N8o9p0K02k3j24
5215a30L11l08L25k57N7Mn0K33m24L03p1J67l08j2K43mmj21q8K30j30q4K21o7
5239C6J06j54L6j95O1K38l16M69k19J6J14R9k24k74J66j42N15l00j4J38k25L0
5261c9L14L7m79L76l45k37M71J04l2k13Q9Nj58M31j58j52L05j99n1n7m2O3o7j26
5285a60J18J93l51K16j87J76J51j87J06J44k92O5J55j91K43m72lL80j70J51m85
5306d00K78l9LJ26qj05J17J26o6k63K17J17j9j03j15o1Lj8l0K53j15Q9l4j46K49
5331E6j18N3m9K22J67k72o3J84k50J91k86R9n7L27j53k64J95p9J4K26k77J34Q8
$$ y = [-37, 95, 52, -110, -302, 56, 107, -181, -88, -45, 137, 33, -11, -66, -113, -13, 41, -30, -130, 98, -37, 130, 189, -179, 114, 73, -251, 342, -177, -63, -68, 63, 220, -106, 62, -163, -207, 143, 45, 86, 232, -48, -104, -46, -115, -185, 17, -6, -130, 181, -127, 198, -59, -2, 2, -48, 185, -239, 64, -7, 160, -148, -160, 83, 79, 75, -46, -134, 96, -34, -118, 103, 36, 142, -12, 24, -171, -110, 128, -188, 281, 62, 78, 192, 291, 67, -207, -41, -183, 332, 32, 18, 156, -69, -39, 275, 312, -167, 209, -136, -373, 98, 202, 170, -43, 46, 51, -107, 324, 166, 14, 319, 120, 69, 12, -30, 33, -34, -160, -42, 151, -200, 16, -171, 5, 156, -31, 75, 219, -73, -8, 147, -44, 199, -273, -276, 104, -66, 85, -400, -122, -161, -158, -32, -40, -145, -28, 98, 32, -231, -14, 103, 84, -19, -134, -195, -192, -210, -240, 13, -102, -13, -47, -193, 56, -62, -9, -58, 164, 331, 59, -4, 180, -70, 121, -165, -66, -123, 204, 51, -213, -18, -97, -83, 143, -134, 0, 88]
5354H8L16k60l98J50l18N74o2j44j27J7k01M59j13j10j04J67K23k27J21k34M6
5375a37K15j74m9L28k49j37J12j52J52P6k11N3M3J42j88J93k02r2K75K17l35J96
5397G6o2J44N0m41M25O0j82p3j00J21l77N97k52q5K20m9m68N54k76J27j33K63
5419A39j57R7K6k45J42K41k80J41j52L6l3l16M55j51J01j53n5K36l24K39k66L33
5441E4r8p6P1K06k25O2r8J05j4j36K95j13O1J02rk22J88m02K18M2m5j7j58J89
5465b0J97Q0m05j17M32j59kL05m75J1J44K13l10N5J67l54O2L9j2K86l46M27l4
5488A84j23k43L22l7k37p9J96Q1K1k44K06J03j52j26J80J00k33J2L0o0J51L1J
5511H4m0k87N9K92M9P4k08kL18j15k51l01L30j19k22L87J08n7k14K06R4j71J94
$$ y = [88, 404, 144, -254, -104, -422, 152, 90, -54, -181, -164, -365, 94, -19, -129, -233, -66, 157, -70, 51, -183, -137, 78, -96, -145, 183, -66, -203, -91, -243, -91, -15, -226, -173, -130, 12, -176, 17, -185, -277, -2, 215, -120, 76, 14, 158, 208, -233, 192, 252, 70, -3, -103, 18, -359, 238, -14, -99, 121, 72, -396, 158, -118, 9, -124, 139, -18, 79, 105, -140, 2, 243, -37, 104, -48, -12, -45, -361, 94, -57, 44, -109, -164, 72, -252, -13, -279, 54, -44, -120, -49, 157, -68, -6, -104, 1, -13, -149, 146, 33, 94, 196, 187, -35, 153, -249, -31, 11, -34, -51, -209, -20, 177, 257, -148, -265, 167, 8, 6, 311, -164, -153, -9, 204, -106, -51, 116, -238, -176, -137, -149, 137, -209, 218, 184, 61, -182, 140, 103, -134, -213, -17, 64, 85, -159, 47, 150, -2, -128, 52, 152, -81, -69, -39, -99, 52, 83, 84, 44, -243, -184, 108, 157, 231, 23, 21, 339, 224, -27, -328, 2, -117, -339, 48, 156, 99, -115, 91, 185, 14, 208]
5534B08M7l55J55l0j95L44K8j70j19L56k67Q4J40O1j19j47K18m8l67P0n5L46j60
5557B5q3K74k34R4O3k12N0k51L27Qj47J51p2j08K13q3j22q9Q5L94l15L7qL3j36
5582a06K6J08n6K53k11K36l38R9O6n1j19j81K88r7J5K33j56Q7j9k2J78j30k46
5605a43L46j73l26K86k2k10L05M76n16k78J85L17m07J75j19J40K2j24J06qn4N9
5627C7N9M6M9k94J88j13j11L19K0m46M31j48l71K36J11mP7k26N37n63J91N1RO4
5651A49k87L18L2j28M1l7l5k20J85L3K6J22j75K38j13j65J08p4p5J8M7N2j07J57
5675A10j33p3j20J77J79j81J40j04l64L20K34k67k0K64m7l70L46j88J30p2J08
5696F9j38J50l9j26n4N2M26l69P7k11J79j8j81K39J34l67L9Q1j04J31k49j09L18
$$ y = [208, 255, -100, 55, 25, -170, 174, 202, 32, -87, 269, 2, 86, 226, 287, 168, 21, 239, 191, -176, -106, -161, 185, 25, -58, 216, -18, 76, 139, -73, -23, -274, 53, 61, -86, 65, -7, -115, 98, 15, -107, -196, -111, 283, -32, 5, -3, 30, -106, -80, 28, -28, 225, 14, 250, -88, 11, 77, 26, -93, -274, 14, -83, -68, 165, 9, 96, 77, 55, 233, 103, -143, 203, 30, -296, -10, -32, -242, 63, 539, 23, -255, -70, 247, -160, 15, -104, 36, 58, -66, 40, 32, -22, 37, 96, 142, 191, -103, 85, -28, -139, 180, 200, -246, 185, 37, -334, -98, 13, 9, 86, -140, 397, -166, 25, 76, 85, 149, -138, 180, 212, 84, 125, 88, 53, -167, 18, 51, 77, 199, 24, 262, 149, -16, 92, 18, -57, -39, 8, 60, -47, 110, -23, -96, -216, -39, 140, -41, 99, -5, -369, -49, 185, -82, -102, 162, 115, -255, 91, -97, 33, -39, 69, -69, 81, 42, -84, -138, -86, 340, -29, 48, -163, 16, -2, -183, 56, 190, -177, -138, -57, -161, -30, -279, -388, -70]
5719g0L81m87r7J97J28R0j36K38o85M68J35l50J0O4j51L99j15k54J30P7P2k19
5741a75QK67l6j15m1K78k42P7QJ62j65NJ04l07M8K22o2K3j88R7N9j48J56J20j00
5766E5j45k04N47k6j11p6L5j65L65k37L7K6m49M66J81n06N7O7K37j42J22l38Q5
5789a19K73j00m9K50l42J42K86k03K6l86L51j57j62K90j32o4L2J74j80r1L28k30
5811f3M7%j39J0N1K25k02O3L2n0j84K15k41J32K80m87K41J01j8O4K37l06j42k7
5835a61M54j5l33p2K95m83J51P1J63k20n2K45J39m03j6K17J08Ql28J28p7K27j87
5858a41m2J17J16K57k84L09l44N2l49K13l3kmJ12J6j60L60n43N01q7O3K0j45j71
5882a69K00k35M35l47K5N4j42K54k47L35J43k60p0NK8K21k35J19j4k64J09Nl0
$$ y = [-70, 311, -176, -273, -76, 52, 142, 6, 244, -441, 27, 162, -188, -178, -114, -265, 134, 19, -235, -105, -28, 44, -175, -167, 100, 64, -51, -92, 186, -56, 21, 29, 191, 26, 31, 135, -172, -124, 98, 36, 59, -129, -32, 27, -121, 35, 155, 55, -90, -294, 253, 227, 116, 40, 75, -90, 275, 38, 75, 101, -348, 118, 299, -207, -150, -83, 154, 12, 134, -204, -119, 154, 54, 5, 255, -87, 55, 341, 138, 164, -222, 129, -28, -190, 100, -32, -96, -64, 110, -70, -161, 167, -63, -16, -16, -155, -145, -94, 131, -71, -8, 24, -26, -210, 5, -236, -104, 176, -311, -70, 31, 13, 77, 314, 8, -134, -161, 293, 278, -55, -127, 168, -315, -164, -93, 70, -150, -202, 43, 182, -221, -237, -20, 88, 96, -232, -104, -181, 46, -141, -183, -66, 50, 307, 23, 332, -12, 40, -309, -96, -129, -131, -135, -23, -7, -167, 193, -350, 151, 64, 127, 147, 2, -169, 31, -204, 231, -116, -91, -37, -179, 75, -172, 163, 306, 46, -24, -19, 9, 230, -5, 114, 100, -164, -55, -50, -80]
5905h0K8n2J30J19m8J3L70k96j38r5j05j14L92j8n6L12l13OJ81p4r7Q4j42j22
5929a15J8O7J33l5J57l0l28J30j51J25k9j5J63o9K38k52K61m45M82l83Q8j39m
5952a33N1J70ko1p1N4j0j96M4K38k4K34o27K24K05L4K4k56K40j88J37k19J95j45
5976h2O4o1J83J41l6k61k15J01N2j5J64P8Q9j4j21j25j07J92J3k94J20L2q4k42
6000d28N97k49RM1J95j67J51m05K53J89j58k7kO4j58P5K31J8m67L93n8Q4j2k11
6024d2l7m3L39l25j2J55J27J50q8l19K93k2rP8j07m2m5J1J7J01q5k31J81P5o9
6049E1K1j38J32J85k53Q4l61K69J2J30K73l93r1M7K94Mj27j92K72j96K3J37J17
6072C00l53K25j76j24qK23q7R3j38M1j14K42j18J20K02l39j82m1K80k91J53K59
$$ y = [-80, -52, -104, 26, 145, 97, 110, 480, 184, 46, -49, -154, -268, 124, 106, 50, 362, 49, 55, 236, 162, 65, 149, 7, -115, -97, -30, 103, 68, 225, 195, -133, -3, -154, -29, -58, -73, 90, 21, 259, 7, 268, -177, 305, -78, 10, -129, -133, -82, 88, 86, 25, -46, 8, -2, -198, -154, 84, 60, 294, -333, -109, 96, 130, 154, -102, 138, -50, 87, -132, 63, -82, -18, -79, 104, 245, 209, -52, -267, -166, -114, -129, 35, 113, 202, 188, 67, -58, -165, 27, 40, -254, -134, -102, -186, -428, 169, -80, -71, -30, 165, -2, 149, -256, -3, 186, 28, 1, -1, 63, -95, -20, 211, 229, -238, 155, 97, 181, 169, -42, -79, -122, 217, -108, -120, 35, 162, 312, 224, -95, 198, 176, 167, 245, 138, 96, 51, 62, 79, 180, 95, -136, 45, 120, 51, 72, -66, 66, 251, -2, 82, -279, -10, 2, 132, 405, 12, -79, -32, 262, 266, 139, -53, 219, 23, 46, 183, 300, -53, 172, -4, -128, -136, 87, 0, 93, -45, -4, -118, 124, 6, 126, 328, -11, -193, -234, 46, -245, -92, 167]
6094A67l37J20r4qK82j44M6J6r2nN9Q0k89L25q3k46M55n37K0K90q3N9K1m7J74
6119A49l5l52J91J53j76K60k09R0j15J65l0R4l44J04J62k21J3J08J54j82NR2n9
6142A7KoK8Q6p0J1j94R7r3K4l2M87k69j10J96L2k92j4L47l5%m73L30k56K01o2
6168d8K45mM7l49K23p4kNk58L40J3O0k58K87m78J99Q9j94L35k45k1J1K41J6q6
6193I4j0l23K46p6l1K36k61r6P9J63O9K12kl19ro8P1J62k46r4J16K6J8j32J56
6218a9R0j36Pn8M0J91j44jj29q4M24j09J55m40L78l76p2K69J20n2J42k89k07K87
6242a3J15q6l90K77j0O9J1j04j17J11K57k49J44r7N0p7N9j53J05J27j57j7J83
6265C8k3n1J24j72k60K65LK01l20J33J66k11K52m84M45m7k87J83J24J14k73J4
$$ y = [167, -170, -50, -144, -152, 130, -14, 32, 48, -44, -49, 10, 90, -199, 126, 43, -203, 252, -285, -265, 25, -58, 1, 22, -25, 149, 114, -238, -47, 106, -70, 190, -19, 71, -44, 121, 91, 185, -159, -55, 107, -114, -101, 7, 161, -21, -16, 76, 17, 19, 13, 41, 127, 57, 68, -126, -29, -122, -98, -130, 357, 88, -22, 174, 206, -86, -100, 247, 212, 212, -261, 69, -187, 14, -48, 197, 193, 240, -109, 114, 40, 38, 43, -215, 125, 138, 198, -60, 227, -251, -52, 37, -157, 178, -67, -88, -77, 164, 180, 94, 84, -239, 7, -69, -100, 136, -125, -221, -142, 21, 90, 302, 300, -19, -28, -96, -25, 137, -109, -203, -87, -61, -43, -175, -19, 71, -65, -58, -116, -76, 115, -29, -30, -159, -243, 181, 72, 227, -213, 165, -211, -283, -14, 106, 54, 196, -93, -300, -13, 102, 16, -374, -97, -107, -38, -27, -131, -248, -137, 120, -129, 15, -82, -32, -109, -50, -203, -98, 29, -128, -145, 38, 15, -36, 88, -84, -344, -79, -76, 125, -195, -62, 104, -107, 145, -339, 106, 59, -228, -45, 79, 193, -80, -66]
6287f6J94K10m64M06l20J44q3J5k4L30l25l3PK4j6j15K02k33K86q5J69k06M3P
6311F7l2k84L85l9J21Q6m45L86ln34J81K21j81M8q9J46o9O5R0Mj43LJ96m30K44
6336fp2J88nq9l1q3N9J02l4o9J76j26J1j91R0M25l02k1m6L8K6N5j18l18L92L0
6362H1j92J55q2P1j07n6j06J66L0J25j14j75Q7Q5K54j48l18L41k14L32m14K61
6384F2l7j90L12k67J97j88J04O8p2J00OJ31k88k13J84j64M39k16K43j18K0K25
6406C38l23l23M79k76J94q8j18J17K13j4k42r8K13k62K58j66N2K88k75L81l97
6427d9Q9O9o8j84K38j32P3Q8q5j37J24J7p8M2K92k47j23J4J63k78K30J40k18m8
6451f8K33m1j72N8O8j81L64j42j36j05qL28J97n29L22r6l34N11n90L65R7n8k06
$$ y = [-66, 128, 338, -126, 280, -40, 104, 21, 36, 12, 342, 17, -16, -9, 15, -1, -116, 86, -147, 139, 54, 223, 17, 60, 67, 35, -249, 136, 97, 218, 304, -141, 245, 242, -292, -111, 110, -71, -23, -112, 34, -35, 30, 120, 124, -19, -16, 180, -250, -6, -78, 110, 105, 16, -15, -98, -39, 63, 29, -40, 136, 10, 21, -170, -80, 345, 43, 22, -24, 14, 40, 95, -23, -341, 51, 81, -111, 44, -38, 33, -74, -130, -236, -70, -40, 85, -29, -204, -117, -32, 222, 74, -244, 97, -117, 215, -199, 62, 25, -165, 147, -120, 77, -111, -7, 61, -11, 89, 95, 226, -62, -275, -91, -255, 184, -32, 211, 93, 113, 338, 15, -308, 171, -105, 89, 1, -117, 0, 213, 199, -43, -141, 72, -190, 68, -98, -46, 242, -33, 348, -49, 40, 109, 41, -143, 95, -37, 36, 124, 39, -98, 26, 43, -35, 7, 299, 52, -71, -57, 106, -172, 58, 198, -20, -68, 165, 124, -48, 10, 78, -103, 261, 119, -17, -122, -130, 198, 395, -134, 188, 92, -242, 269, -321, 44, 141, 83, -123]
6474a23l00K61K43k92J29PJ50Rk33Q9k8N4O8l3j74p9Q5K7K41k05L9m9J09J99k93
6499i9J86K43l62j63qj25K41k2J23m7q8K55j41K76k59L0p6kr9J17K12k92J80J07
6523A87k02N5O0m3j25k48L84j62JJ27R8k3m2J00j03j17L25j35o6o0k52K20j58
6546a79J89q9K17n9P6mk86K23k9j29L8J70j79k28K30j24L57j45r0m0J77k13J47
6569C0J72j75mJl4K85k88p8K04j47K9j11K03k8j07J21k67J79j59P9K52j26k30
6592a99J44j65J81J99j01M1j68r0J19K08k16k85L18P2j23R0k42K03k40k7L25k38
6614a94J00J32R2k88J76k3j66L02K0j13m5J62l25L21o9k49j37L85m41M20l36L92
6636A16o3J53l00r3J8j4J68J00J00j82M8JK14j97j29nK57k37P3J49J62m34J8M5
$$ y = [-123, -423, -162, 81, -211, -82, -75, 75, 84, -149, -60, -88, -34, 34, 1, -173, -252, -167, -140, 101, -104, -65, -114, -5, 194, -99, 87, 330, -32, -195, -203, -328, -87, -109, 14, -33, -121, 134, -7, 269, 10, 40, -36, -38, -137, -20, 192, -100, 80, 187, -15, 40, 100, 57, -68, -316, 68, -94, -93, 34, 132, 109, 67, 167, 64, -53, 272, 137, 71, 11, -241, -21, -179, 10, -79, 138, 79, 155, 151, -135, 88, 59, -70, -32, 138, -41, -269, -39, -163, 194, 49, -41, -81, 96, -117, 30, 202, 27, 23, 24, -10, 275, -13, -91, 113, -34, -5, -116, 87, 59, -48, 73, -194, -15, -174, -95, 157, 31, -199, -55, -220, -39, 160, 59, 100, -68, -158, -39, 169, -47, -332, -14, 58, -65, 25, -217, -14, -254, -281, 44, -194, -94, 38, 130, -158, 18, -5, -171, 131, 151, 38, -7, 155, -170, 151, 82, -167, -304, 81, -360, 60, -276, 116, 53, 206, -94, -187, -169, -183, -15, 85, 185, 3, 51, 52, 266, 69, -60, -65, 192, -45, 28, 177, 339, -95, -77, -32]
6660c2K10k44K3J35p0L1j92M15k33k04M70k35q0K38j25j77J6J12q7J07o1K07l18
6683i4J63k0k17J3N6j6K32k52L37N2j98j78j04L61j73J42pJ07k83J63j22J07J13
6706A82j00q3P2Mk07K32k20q5L65l26J96j66J54k6O1r9K64k64M4O5k61K20j2r6
6730h6j10L66j44L7J4j56J94J24m66N3K23Jk78J94L07j88k06P9J90k18k6p4K08
6753C8k90L37m33Q6K80q3L19j77N1j23K3j9J36m14K33j43J02J58j48m1J75j53
6775h6o9nj43J24Q3P5oj65J85R8j97l17K30M27J2k66J85j30j36J95k10R9n0P9
6799A2q3K53N0k68J2J25k04J37J48lj15m3J35k1Nr4k49M90o26N48L30n82m1J56
6823G2n5m1J21J49o8L5j54K3K66j61l84K9L04j01J75k13J68m21n5K69p4M21k49
$$ y = [-32, 178, -66, -43, 92, 22, 53, -139, 276, 43, -161, 309, 74, -6, 232, 107, -70, -54, 58, -29, 78, 17, 224, -94, 69, 49, -168, -155, -99, -115, 117, -135, 202, 254, 56, -122, -226, 135, -38, 104, 97, 204, -79, 84, -38, 69, 182, 82, -1, 71, 75, -132, 100, -120, -205, 160, -166, 30, -136, 18, -8, 53, -46, 218, -46, -2, 63, -198, 22, 10, -86, -196, 170, 26, 63, 77, -79, 115, 239, -227, -174, 49, 50, -228, -34, 273, 85, -121, -42, 148, -70, -96, -170, 38, -252, 85, -348, -262, 18, -65, 254, 77, 128, 5, 28, 9, 145, -269, -36, -179, -77, 81, -67, -108, 67, -86, -155, -160, -303, -179, -96, -21, -27, -192, -7, 91, -106, -423, -193, 234, 246, -20, 165, 35, -101, 94, -116, -17, -67, 12, -71, 182, 232, -36, -24, 101, -103, 34, 182, 179, 64, 21, 156, 135, 140, 46, -203, 287, -339, 209, 539, -43, -84, 72, 17, -24, 97, 246, 178, 213, 59, 82, 348, 187, -197, -168, 136, 35, 210, -3, 165, -256, -311, -42, -116, 305, 56]
6846E6j78K17Qj35q0P4J55k38j9L18l70O9j46L56m3k59J47K22j90J94m07L10j22
6869f1%j66nL73k12o0J10j28P1rn2J94k53J57M4o3J82q0q2M5j03j67J05M85m72
6894a47L67j27K23m02p1K49j1K78n07K48m1k2%p4P0k69K17R2j39r4P8J13L9J3
6918H3j7P0l30J49J91j85J6J66j57m4K8L49j15k10J44q2j78J78J59k93q9L22q3
6941G2m2pj51R8j36K1J81K3k21J30j41J15Q8L2j65K24l3j52L74j48j17K5J60j78
6965E2j14j57K93l72K86Mk08K39L70o10R8J57N1P1j89j7k30M18k13J07M1Rj55
6988f9K74l14jj19M08k08P7ol0k05Q9K47n4o4j07j1%j11L11M4J11j47k73K91k42
7013a09r0L6L64R8l26o6q4J75M9K68j22l00j43K7M58k27r6j41r7N22k70P3J96
$$ y = [56, -122, 95, 103, -32, -112, -38, 117, -121, -140, 178, -192, -123, -269, 87, 44, -215, -68, 154, -36, 158, -249, 61, -61, -61, -227, -232, 141, -71, -131, -21, -149, -78, -87, -139, 55, -198, -41, 3, -60, 122, 42, -40, 5, -98, -265, -160, 325, -147, 220, 93, 316, -86, -157, 92, 81, 359, -148, 100, 59, 37, 37, -37, 33, -236, -19, 73, -66, -160, -82, 31, 70, 83, 66, 136, -194, -45, 146, -39, -23, 143, -14, -58, -30, 319, 204, -6, 138, 56, -122, 56, 215, -78, -167, 155, 72, 30, 23, -128, -30, -166, -145, 36, 59, -162, -32, -173, -58, 30, 62, -103, 121, 88, -64, 310, 162, 45, 70, 230, 52, -62, -219, 74, -298, -12, -8, -216, 23, 393, -217, -119, 38, 89, 160, -29, -46, -276, 142, -71, 36, 77, 86, -69, 205, -109, -110, -229, 179, -29, 48, 42, 12, -193, -104, 143, 89, 25, -82, -93, -93, -204, 107, 151, 262, 115, -158, 133, -109, -199, -163, 201, 299, -27, -93, -177, -2, 47, 315, 193, -107, -250, -223, 235, 8, -88, -229, -326, 196, -74, -1, 195]
7036A95m33L07j02J15L07n11k5K3j03J48Q1j45m6L04p3j88L64j29j55k23K16K0
7058e3j1J07n5J27o5M1j07Q6j53L6o1M29l85M80k20J43n22P1K85j03j21J7K38
7081B04m94J94M3M3N1m5J43j85l28J88lN4J13j05j4m9J99L4j72J85K0k03nN7J04
7106B9j26K69j59OJ57J03k47m9N1J5k73K93l45J06K36j93J23j70j29L41P2j04
7128FJ16Pm08O4L63j76j05K91k76kr4J15J03M48m88m2M9Q3l40M06j76j10N5K04
7152I3j58k34J72L27m25L18J37p3p2l69L19j58J58k8P9J52n01L58j77L09k51r1
7174a15J88r7l6k15K86j00J19m8L19j79o5j6j01K15r1O2J42m15J67j84M04k44
7196dKK5o2k60M27k27K3K9J38k67J46K05k04J02m1j7J46J19k63J58l50K7K82k7
$$ y = [195, -238, 69, -33, 82, 389, -122, -147, -124, -227, -79, 2, -143, -189, 115, 42, -146, 218, 89, -66, -289, -73, -53, -64, 43, -12, 115, 50, 91, -16, 70, -83, -47, -108, 321, -64, 416, 196, 339, -183, -112, 173, 70, -51, -34, 204, -290, -96, -53, -10, 41, -4, 139, -46, -374, -186, -189, -135, -22, -127, -141, -190, 9, 43, -129, 56, 76, -127, -132, -75, 29, -97, 172, 13, 19, 176, 279, 32, -17, 34, 49, -224, 69, -276, -170, 66, -127, -4, -174, -303, 38, 110, 6, 122, 129, -279, -215, 148, -28, -133, 158, -118, -120, -214, -99, 4, 452, -36, -78, -29, 54, -286, 120, -56, -166, -111, 93, -65, -299, -127, 200, -225, 93, 230, 157, 85, -284, 35, -123, 35, 7, 86, 238, -263, 95, -82, 227, -24, -115, 73, -24, -60, -275, 11, -89, 30, -18, 301, 122, 57, 41, -60, 155, 64, 126, 268, -147, 20, -164, 240, -4, -2, 23, -39, -299, 128, -99, -76, -47, 91, -176, -30, 175, -29, 73, 32, 15, 161, 280, 17, 175, -175, -148, 134, 107]
7220A07j55R4L04k50K2r2J42r2j40N1Pj31K26j09no1M7o3K43k37L4M4pL00l24
7245d5k9J41j08J02r5l8N5J88M1j98k2J66q7j10J1l0k3P4RP3k00K13L3J1l08J17
7271e9Q9M4j29L10m13R2jJ7j1O0j80K34j88K51n39N67K51l34j60K15K60n95N25
7294C06n77M03k04l2J74k52K77n24O76l39K69m26K05L15j07m22L88K73l91q0k32
7315c00M38q3J55k0o0j58l0o4K39Q0n8J52k7k11j6l29M35l61K52J05P0m17K9L72
7339A93k55q7M04j10l19K2L05k48L31k36l5o9K28k09o7J72J1j42J7m1J45M6k05
7362a49L27l67J45j28K69P6k43J29k13J50j02j91K20j06L16j57N8J5K79k63N3
7383A18j82K0J17k10M7o6k7k9K65r4l6O8L36l38K0n2J11j36J93k17J05m7l50M92
$$ y = [107, -48, 46, 350, 100, 122, 30, 172, 80, -60, -9, -2, -133, 93, -16, -21, -82, -35, -98, 145, -92, -58, -14, -21, 279, -45, -74, 67, -41, 61, -34, -72, -17, 171, 212, 14, -8, 158, 71, -39, -28, -58, -81, -7, 2, 75, -125, 88, 121, 132, -176, -59, 30, 74, -55, 255, -158, -66, -67, -50, -61, -1, -181, 53, -135, 116, -423, 144, 395, 61, -99, 116, 376, -219, 306, -271, 132, -72, -104, 70, -182, 95, -429, 247, -92, 177, -249, -44, 271, 164, -258, 130, 403, 12, -68, -300, 138, 55, 210, 190, 130, -28, -58, -122, 117, 197, 139, 291, 264, 53, 37, -292, 143, -218, 34, 139, 209, -208, -179, 193, -62, -149, 255, 145, -174, -152, 153, -95, 236, 0, -35, -104, 124, -85, -152, 20, 31, -111, -94, -135, 10, 56, -149, 178, -189, -44, -172, 97, 173, -70, 59, -154, -4, -106, -297, -77, -183, 133, -24, 34, 49, 328, 65, 118, -64, -44, 73, -137, -90, -156, -183, -212, 53, -41, -77, -9, 327, -11, 9, -43, 68, -68, 125, -92, 13, -34, -384, 108]
7407A08k97MJ57o7j27K82j10J12O7j63N4r8J91k56J00K31j51j26M6p1J97%j05
7430b2L56l17M8j28M2p7K07j11M2j06m8L42m4n65K76J9J10K41m8k40p2J50KJ56
7454B13N3k89J0J82j97r7K81j23J09L0j29K81j70k06k31O1K00K42j11k19J96n6
7476C0J13k29R8j70M43l16j11M7J14l7O7j9RN0k03J87l4k0j7j63K55J7k20j89
7500b98J44J62N9K6k97K21k26R3oL48k51O2%k30K25j6M4l8r3j10M0l0o6J49M3
7525d5R6P0J9j2j56L2j91K57j55P4j78J72J68k45m4q3K21mn6K68j47oK63m55J38
7550Aj52RQ1K71q5J03j05P0q4q3k00K06l99L13Q1k4J3o8r2O3R4L00l27k61K24
7575e1K52j33k72J74m3K4j4o9K64j87l8K96n4k62J62j56o0J03J20m0R2o1m9K70
$$ y = [108, -189, -185, -28, -95, -222, 60, -50, 62, 129, -34, 20, -78, 113, -143, -43, 188, 37, -89, -43, -114, 83, 83, -22, 334, 17, 65, -63, -21, -98, 109, -2, 40, -66, -114, 228, 184, -381, -105, -86, 24, 265, 217, -23, -95, 55, 57, 213, 266, -23, -13, 169, -28, -125, 156, 33, 142, 172, 43, 324, 154, -52, -283, -222, -22, 220, 109, -110, 86, 30, 143, -86, 12, -158, 285, -31, -142, -95, 19, -18, 49, 30, 39, 89, -114, 73, 39, 19, 2, -161, 94, 111, -109, -298, -154, 8, 67, 93, -204, 17, -209, -116, -122, 226, -25, 37, 37, -193, 32, 16, 60, 22, -71, -181, -141, -171, -237, -88, -45, 51, 121, 140, 128, -28, 4, -187, 70, -85, -11, -189, -17, 151, -94, -138, -221, 0, -4, -60, 208, 61, 55, 318, -137, 1, -151, -142, -61, 210, 125, 228, 123, 193, 109, 26, -174, 32, -367, -54, 27, 3, 16, -52, -144, -81, 13, 313, -14, -275, -51, 201, 68, -204, -30, -73, -49, -63, -132, 132, -55, -93, 203, 149, -113, 49, -107, -167, -64, 56, 16, 108, 47, -2, 268]
7599B68k95r9k1J52q1k13K67L90k22l38K15j92M18k89J16o3L7l20K14J9K88l97
7621a46q6L43q0j29J58o7k99J13L54m3k55J83R2n90O10l36J54J17j46J78m77K17
7643a35L82m15J36Ql0j83L51m9M7j69j90N99l07J56m06K52j19K58l81R1J13J71
7665A80r1N9j15M5j35K31j44q4K19j83j3m7K21j69P6j47Pn3p2o6J28N19o23j0
7689b67R9K8J69O8q0N9k22R2J47L4Q9kj34j4q5j93L37k38j01M21m04r4K66J99
7713A74o8k1q1L34m77q8N3J87J70k52J10R4n2K18k84M3o3J01K0j36J08J05j80
7736A5O4k10K38l76n7K97K5O6j22J10K44j89j02K3n6M0K47l79k22L63j74Q6J08
7759C9j36K56L3l53K78k29n9J95k82L39R2m06N01k69m4K5J00k03j56K05J80k58
$$ y = [268, -27, -126, -147, 5, -76, -289, -22, 368, 146, -192, 23, -169, 249, -40, 76, 13, 50, -270, -56, -37, 251, -146, -232, 111, 31, -98, 60, -7, -306, -193, 161, 118, -137, 46, 138, -452, 158, -178, -24, 93, -53, 125, -352, -135, 247, -168, -32, -24, -54, -237, 114, 65, 112, -57, -247, 352, 45, 201, -205, 47, -72, 186, -195, -104, 9, 180, 89, 148, 33, 78, -57, 174, 30, -54, 165, -18, -31, -78, 143, -26, 50, -97, -90, -143, -215, -281, -153, 366, -257, -267, -168, -140, 29, 97, 17, 76, -146, -54, 93, 127, 216, 214, 80, 66, -19, -212, 125, -113, -214, 207, -197, -291, -25, 174, 106, 85, 4, 338, -139, -227, -174, 13, 183, -69, 41, 135, 83, 301, 17, 60, -3, 98, 118, -18, 90, 195, 15, 79, -131, 107, -269, -326, -29, -4, 62, -60, 50, 294, 105, 3, 26, -30, 10, 257, -122, -344, 19, -155, -69, 39, -97, 159, 192, -161, 117, -112, -171, 24, -258, 81, 173, -233, 268, -1, -45, -20, 80, -123, -279, -74, 106, -152]
7781a52K16k12J62j1k76k8M69j04k50K86M8r5j08N4j62J40L9R5l31K08j2o3Q4
7804cM8J7j47K39n5k3j13J04j26j05J47J99k03KJ01l3r2P1L3j31K07m2M9l21J51
7829b6J21o1l1o6O3J17l76L2K35K2mJ78p6k77R7O3K24k66J45N0k0p2J57p0j11
7854D8k6m4rj31qK45k8R8k84K09K70k68j16N6J1k24P1J48m1J10q4k26J10K27l2
7879H2k94N93m39K37Jk12n7KL28l79P3J71j94O7J5L5l26M25q4K81m85qR7N3j12
7904a30L28k04k38K76j06l1J39r2O5l81Q7L98k20K34m68K35K35k26J2M9l8K57
7926A81k53L73l61J40k07J23R2N0l29O0q0K25n8J7J09j2J99r9l0k26L56l22n5
7949a07j00J31K36k29K73j99j18K10n24M30l02K35K20Q1m20L47K35m0k18mj42
$$ y = [-152, 64, -148, 14, 3, -273, -301, 168, 64, -186, 100, 148, 53, -55, -1, -163, -23, 16, 111, -220, -12, -24, -87, -3, 45, 62, -85, 154, 99, 76, -37, 67, -59, -164, -17, 182, -21, -19, 82, 49, -43, 28, 61, -70, 137, 95, 144, -177, -26, 95, 34, 3, -63, 0, 117, -259, -227, 8, 30, 26, 204, 128, -149, -52, 11, 235, -31, 114, 164, 144, 72, 229, 159, 48, 22, -22, -31, -162, -170, 75, 47, 145, -139, 70, 340, 72, -44, 12, 23, -201, -130, 18, -23, 87, 3, -223, -113, 114, 82, -212, 381, -58, 179, 180, -32, -89, -87, 241, -138, -65, 106, -88, -21, -6, 29, -297, 128, 44, 325, -160, -168, -71, -18, -130, 198, -6, -244, 32, -74, -105, 34, -58, 7, -374, -287, 111, -109, 125, -343, -108, 127, -99, -87, -38, -76, 181, -72, 301, -60, 80, -127, -4, 88, 138, -191, -131, -211, 14, -44, -27, 82, 70, 269, 170, 140, -86, 270, -52, -107, -207, -76, 160, -69, 204, 5, -113, 97, -427, 3, -299, -64, 156, 237, -183, 164, 399, 359, 141, 137, -5]
7970eJ94l83L60j58K13k72R0Nr8J48N7M2k90j59K73K89k48k17K95k08J10K83j90
7993A31j51n9K04r6p8j3k8K2K14j69j53OJ37J12j20j01J93j71K37q3R3m6k11n1
8017a81K44m38J83n1K55k55J96K94j26k01P7J22j85R1l45K59N31m52m6k5J12J39
8039A98n22M77j47j64J14j69M71k51k06K41m99O08k29QOr6K40r8r1L0K78Mm21
8062b18l2j9R3J34R2k08K4j0j6K65k4m3K27l07j48J97K3j62L25j44M8K1k00J88
8086A06k92J42j48J04O3J35r6k2K79j88j63M1P2L8J59J16r2k82m6J49P9q5J9k8
8110F0j03J59p0j61J23k29N36l73P0k01q9K38r2M22k50j03l82N91j19j07j03J89
8132Fj31Q5O8K01N7k45l0J90k29PK21m23P2k0K49j53l6K07j57K03l86L57o2k63
$$ y = [-5, 189, -194, 166, 8, 221, -51, 39, 44, -54, 94, 151, 193, -97, -256, 17, 306, 58, -159, 136, -72, 38, 321, 131, -20, -79, 125, 29, -49, -62, -90, -68, 146, -23, -176, -170, -33, 79, -41, -142, 51, -120, 117, 34, 127, 81, -130, -181, 63, -375, -192, -243, 12, -243, -47, 247, 121, -80, -3, 119, -66, 25, -320, -61, 470, 18, -28, -53, 59, 198, -324, 153, 6, -158, -44, -213, 258, 7, -199, 42, -457, 151, -78, -70, -64, -160, 80, -18, -109, -79, 199, 203, -218, -250, -269, -176, -42, 50, -158, -134, -144, -160, 105, 81, 38, 265, -42, -190, 7, 30, -132, 193, 49, 97, 118, -82, 106, -186, -44, -192, -88, -25, 110, 14, -8, 271, 83, -80, -39, 33, 71, 230, 346, 254, -28, -74, 75, 154, 69, 88, 60, -43, 116, 46, -115, 8, -221, 315, -58, 12, -189, -278, -40, -132, 290, 40, -63, -445, 146, 27, -80, -183, 6, -125, -40, 28, 229, 286, 41, 11, 201, -28, -21, 200, -223, -151, -171, 78, -75, -111, 96, -61, 142, -244, 113, 51, -212]
8156b12K10R1J56l61K56k97K72l33K76m04L34J54pM9k98j38K25J21k34j89Q0J53
8178i6j95P5K49J66k5m33L00M6j67K50k56q7M03
$$ y = [-212, -2, 89, 245, -116, 140, -157, 115, -218, 58, -346, -12, 142, 135, 184, -114, -252, -27, 94, -140, -329, -249, -96, -291, -216, 33, 199, 174, -259, 41, 87, -80, 170, -86, -173, 230]
8191B30
$$ Imaginary data points
##PAGE= N=2
##DATA TABLE= (X++(I..I)), XYDATA
0@%%%%%%%qJ6j6J6j6K4l2L2m0N2o0P2q8J04j20J36j56J80k08K39k71L04l43L87
31B04m35M89n46O10o79P54q40R34j034J145j267J401j552J720j907K118k359K634
49A390k952L326l773M318n003N888p082Q799j1489J6329k7703J00993O4197k25123
63g7885j1732J47815K8849j44646j4722J13968K6785r4119q845O7717L006o0638
75b4447O951M3648r562l8433J4874K9075r309k1168J0223J0168j0099r525O928
88f76N904K300n72o377o599P727O440j0559n504J4706N550j7434l986J9499M16
103A0835k2292J389K3928m462k4900O571K5055j0630k5372J3425K4207j6667k3271
116b2184J9911K2951k4074k3529K5666K3959k5582k3929K5905K4122k6789k5800
$$ y = [0, 0, 0, 0, 0, 0, 0, 0, -8, 8, -8, 8, -8, 16, -16, 16, -24, 28, -32, 40, -48, 56, -64, 72, -84, 96, -112, 127, -144, 160, -183, 204, -231, 258, -288, 322, -357, 397, -443, 491, -543, 602, -665, 736, -816, 904, -1003, 1115, -1244, 1390, -1562, 1764, -2009, 2309, -2694, 3194, -3888, 4911, -6578, 9751, -17952, 83041, 147238, -77885, -89617, 58198, 87047, -57599, -72321, 41647, 68432, -25687, -34532, 33185, 36191, -24447, -17496, 26152, 16590, -21843, -6969, 22106, 12797, -8371, 1852, 12020, 1921, -7604, -676, 5228, 7528, 6956, 579, -6020, 1707, 8147, -2412, -7916, 6790, 12340, -5094, -9080, 10419, 10835, -11457, -10068, 13860, 9398, -15502, -8931, 16124, 5494, -19878, -6453, 17754, 1087, -22184, -2273, 20678, -3396, -26925, -1259, 22700, -2882, -26811, -906, 23216, -3573, -29373]
128b9373K3693K5272k0286k2986K0018K0906j8969k1761J7051K1713j3560k0421
140a8703J0107J8207p922j4666P694J2037p277r751P221P488q639m832J0542M536
154F042j1570m532J2551M834j2439m599J3084M038j2788n094J2421N988r824l829
168e717Q246J865r155j214J1014K925j0094m243Q307M753o760m760O179O606l483
183D469p043J393O680l34p091k01Q584J631q229l044Q350L770r253l720R003M083
199I048r571l216J0181L739j1156m874J1095N095j0118k732R563J059j1564l93
213c844J0160o5j1040K659J3052k757j4099J800J2699m050j3480M603J5225l610
227G253j4292M070J2905n101j4718L695J3773k977j1552M247J1229m905j2183
$$ y = [-29373, -5680, 19592, -694, -23680, -3662, 17244, -1725, -23486, -6435, 15278, 1718, -18703, -8596, 9611, 1689, -12977, -5283, 6754, -523, -10274, -3053, 4435, -4204, -9036, 1506, 6042, -5528, -10060, 2491, 7325, -5114, -9713, 3371, 7409, -5379, -10473, 1948, 7936, -1888, -5717, 2529, 4394, -4761, -5975, 5039, 7964, -2130, -6373, 1934, 6687, -73, -4833, 1346, 7952, 4469, -2574, -1181, 5499, 5165, -1926, -2127, 6457, 8088, -141, -3185, 5165, 8935, -318, -4038, 4965, 9048, -523, -3739, 6442, 10181, -975, -5849, 5246, 10341, 223, -2509, 7054, 8113, -3451, -3844, 6316, 6251, -4789, -2130, 10922, 8165, -5934, -4134, 8565, 4515, -8965, -4362, 10863, 7253, -7039, -2969, 9936, 4835, -9883, -6188, 7585, 4608, -6944, -2697, 8532, 3627, -8556]
240h556L142J0850k557j0291L336R104l040q514K514O756k573n815K463N376k960
255g65n066K590L650k929l131L371K776k750k272L173J351l625j968L247K813
270D65k096k360J737K689k676l320P93N074J158m275j397N019J932o389l720O473
286h93N017o080m701P453N837q312p092Q065P374q341o632R190P705q751p229
301g390Q481O428r081n189R307N376q559m421Q427L550q169k397P823K044p512
316a282q92O763M29o132l5O207j42n207L63M820p38m136k18M200K76m097J03M811
334E093L79m835j894M505J735m855k326N879L412o476m118N912M637o546m976
349d474O708N146o938n442O269N157n700m643N073L459n099l388M852K142l565
$$ y = [-8556, -5414, 5436, 2879, -7412, -4076, 5028, 1988, -6526, -4012, 2744, 171, -5644, -3181, 2195, -765, -5831, -3241, 409, -2520, -5651, -2280, 496, -2254, -4526, -1353, -2, -3627, -5595, -2348, 465, -1631, -3991, -2254, 435, -2241, -5561, -4768, 306, 1464, -2811, -4208, 811, 2743, -3646, -7366, -893, 4124, -1956, -6657, 796, 6633, -1679, -8771, -706, 6668, -1673, -8305, 885, 8590, -161, -7390, 1091, 7519, -1562, -6751, 2556, 7932, -627, -5048, 3379, 6929, -1240, -3637, 4186, 6230, -1282, -2174, 4589, 5018, -1114, -1149, 5058, 4916, -291, 72, 4892, 4154, 18, -200, 4000, 4276, 179, 282, 5093, 5472, 637, -1257, 3248, 4983, 128, -2198, 3681, 7093, 617, -3501, 2411, 7048, 502, -4474, 2234, 7380, 442, -5000, 1269, 6426, 726, -3917, 1156, 4615, -484, -3872, 980, 3122, -443]
364d43j360K485k71k227N57K009q45j570J111O67j503n40J279k04j249J3R72P0
382a049m17J94n43o04Q43k45k313J012M074p58m395R40M728k525n984L096P108
399C162l045p504M428Q256n879q437N672Q362n749q159P137Q014p213p352O231
414b076P019o931n597O993O129n675n332N122L426m949k559N025K673l406j720
429a858K858J302k739j405K039J790j363m84J245J139q22k069O68J854l21k340
445e06J378L221m29m155J43M291j243m586K028N853j335o662J214O740j537p417
461c002K039P102q48p457P11O285l91o023P15M896k42m084j94L496M97l178r79
478f57K504L41j818j28J356N16k123j338J929J368k164j630K902K058l606l093
$$ y = [-443, -1803, 682, 411, -1816, -1259, 750, -95, -1665, -554, 113, -1390, -1930, -651, -855, -2104, -2091, -1119, -1049, -1466, -1272, -1815, -2419, -1576, -1821, -4134, -3122, 952, 194, -4201, -3261, 1467, -1058, -7042, -3946, 3162, 117, -7387, -2959, 5297, -582, -9019, -3347, 5015, -734, -8893, -1756, 6258, -955, -8307, -2076, 4943, -1988, -7585, -592, 5537, -138, -5470, -348, 3078, -1871, -4430, 595, 3268, -138, -1858, 1000, 2302, -437, -1842, 197, 1987, 624, 140, 1385, 2524, 1702, -367, 301, 2155, 1834, -506, 872, 4093, 3664, -491, -348, 3943, 2700, -1886, 142, 5995, 4660, -2002, -788, 5952, 4415, -3002, -963, 6139, 5291, -2166, -1455, 4830, 4439, -1584, -869, 4027, 3785, -299, -493, 3003, 3500, 322, -657, 1847, 2188, 370, 242, 1598, 2114, -9, -1347, 582, 1950, -214, -1844, 1058, 3116, -490, -3583]
494c583L377K814l997k530M743K653n654k516N621K246o717j998P524J183p671
509d505q55Q101L5r058J66R225o81q813L51R472p32q905O13Q180j167p416J227
526d762O765j224o052J182N211o91m388O34L199j27k220k37K121l0n49n73K19
543a522P34K80o03p51J302J092j096p18J099L87j376M28J624m40j868J290K628
560B490j654k945K054L295k388l341K834M436l061m631L020M690k884m806L134
575B43N527l088n272K442N546k645n129K732N563k837n281K685M854k635n145
590b440K690N035k677m404L006L914l416l544K888L203l382k309L923J767m171
605H3j708L851M04l905M17L908l00m026N96L517j192l583J371L249j395l436J676
$$ y = [-3583, -206, 2608, -1389, -3919, 824, 3477, -2177, -4693, 928, 3174, -3543, -5541, 1983, 3166, -4505, -5360, 2741, 2776, -6282, -6116, 3109, 2428, -6385, -6034, 3438, 2706, -6199, -5586, 2594, 1427, -5989, -4762, 2003, 779, -5273, -4091, 1120, 429, -3959, -3325, -126, -253, -2473, -2710, -589, -619, -1168, -1741, -1522, -788, -508, -1111, -1862, -560, 532, -564, -1282, -183, 204, -1172, -744, 880, 440, -1428, -138, 2490, 836, -2109, -55, 3240, 852, -2489, 345, 4781, 1720, -2911, 109, 4799, 1915, -2891, 243, 5770, 2682, -2590, -148, 5398, 2753, -2376, 356, 5919, 3082, -2199, 486, 5340, 2705, -2440, 250, 5285, 2608, -1796, 1210, 5124, 1708, -1836, 1052, 4255, 873, -1436, 2487, 4254, 83, -1625, 2226, 2630, -1275, -858, 3050, 2750, -1276, -680, 2837, 1645, -1938, -567, 2682, 1287, -2149, -473]
622d73K793j853k929R40K463J18k334r9J296L28j055j148j81J891Q57k480o62
639b528K679Q76l446j377L258J690l784j233L807J515m269j439L966J062m107
654c330q82M485R73m041o90L950r2l690M11L795q24l249Q45L498j428l585J611
671b243L681j120l699J775L709j932l714J804M055j680m173K336M013j352m554
686c094J736M222j590m061K038M020j356m147J537L965j508l722J594L739j701
701A672k628J466K636j887j915J506J773j165j040J091O18j253m07J343j87q07
717H16M56O41o31j96J282n97j238M42J188j105j133J511Q46j502m60K239m86k688
735f15P17L251k097k903K138L047k727l753L727L646m535l854M769L632m828l735
$$ y = [-473, 2320, 467, -2462, -1522, 941, 1059, -1275, -1374, -78, 250, -805, -1953, -2134, -243, 614, -1866, -2528, 151, 1027, -2419, -3796, -538, 1152, -2632, -3865, -58, 1457, -2812, -4251, -285, 777, -3330, -4212, 273, 1246, -2795, -3485, 465, 373, -3317, -2906, 889, 65, -3184, -2339, 1159, -269, -3854, -2243, 1438, 318, -3381, -1606, 2103, 171, -3543, -1739, 2316, 636, -3537, -1201, 2812, 1460, -3094, -1358, 2864, 1274, -2787, -749, 3271, 1915, -2232, -695, 3270, 1762, -1960, -366, 3373, 1672, -956, 510, 3146, 1259, -656, 850, 2623, 1458, 418, 1509, 2127, 874, 467, 1810, 1623, 816, 1272, 1913, 1282, 1086, 2368, 1771, 533, 975, 2163, 1058, -75, 1436, 2282, 780, 320, 2559, 2073, -615, 102, 3353, 1256, -1647, 491, 3538, 811, -2942, 785, 4431, -104, -3958, 811, 4443, -385, -4120]
751d120N179L078n634k765N502K145n647j799N117J557n523k01M519m84l742L96
767b422L637j117k745J006J838j514j641J887J515k124q32K029M4j439m19J503
783g94o2p19L17m3o9J95ko34M24J011j7j474L75J615n91j850P36K161p68k099
803b288J346K307j504k675K053K235k095j830J891K637j628k139J682J672j431
818B33j490J564J117r70q73J188L64m80n24O17K89P0o9j1N7J93q11L83M90j43
838A194n05K36R97o12j222Q85J469j090j972J809K241j928k496J686K898k280
854A310k768K382L029k563l206K846K565k831k631K872K460k900k042K269J613
869B405k195j328K176N16j998k77J988k78j458K02P29l03p75P10J98p07J60L99
$$ y = [-4120, 1059, 4137, -1497, -4262, 1240, 3385, -2262, -4061, 1056, 2613, -2910, -3111, 1408, 924, -2818, -2422, 1215, 98, -2647, -1641, 197, -1317, -2958, -1071, 444, -1680, -2512, -483, -439, -1878, -2297, -794, -856, -1575, -1258, -1301, -1370, -1175, -1177, -1811, -1387, -376, -393, -1867, -1492, 123, -468, -2318, -1582, 579, -189, -2288, -942, 1365, -139, -2814, -761, 1474, -621, -2451, -560, 2077, 449, -1690, -8, 1664, 233, -1257, 307, 1424, 454, -419, 769, 1133, 653, 129, 746, 1035, 1105, 1036, 1025, 1082, 1275, 464, 847, 1337, 1194, 689, 925, 1922, 1310, 88, 973, 2442, 1352, -620, 1189, 3430, 1502, -994, 692, 3590, 1310, -1458, 924, 3953, 1390, -1816, 1030, 3595, 764, -1867, 1005, 3465, 565, -1477, 792, 2405, 210, -1118, 1058, 1574, -424, -701, 1287, 1009, -449, -247, 482, 179, -596, 114, 312, -395, -235, 164]
887A64m92r27O69N46j041m6J128M5j630M93J100j040n10P50J137j893p79J986
905c40Q99k532o34K640M70k782o30L442K29l649l9L219J41l319J38L879k78l489
923b635j24L496j89l018L6L222o7k769M4K577p8j935N53J148p27r10O65J067n23
942a67n03L93N83n14j90N21P84j106k70J318jo14l62R31M65r37KO43M7j01o12
963C10K17J031m90p17j03J094O81j365p38J254Q03j210j241J460J576j397j370
980b05J294J656j424k213J577K073j556j800J352J903k014j500J672J881k002
995F94j573J623J557j543j409J360R29j680p31J534M39j722j42R81J12j316L99
1012d88J145o22j322Q89P51o80r67P82O02p13o60N70L24m39m13K37N83o3l71n75
$$ y = [164, -328, -1255, -586, -40, -1081, -1127, 1, 46, -1584, -1091, 9, -1031, -1541, -791, 346, -1547, -2326, -340, 559, -1973, -2607, 33, 503, -2279, -2909, 533, 762, -2887, -2926, 293, 434, -2885, -2747, 1132, 854, -2635, -2759, 737, 548, -2470, -2434, 788, 721, -2048, -2004, 573, 495, -1440, -887, 261, -466, -1376, -711, 356, -167, -670, -277, 306, -208, -398, 123, 907, -199, -469, 849, 848, 234, -128, 803, 1268, 331, 333, 976, 1023, 922, 310, 527, 1558, 1068, 351, 248, 1342, 2023, 658, -80, 1174, 1977, 767, -474, 986, 2562, 1165, -205, 1089, 2745, 1321, -892, 685, 2758, 1202, -598, 754, 2657, 643, -857, 815, 2696, 694, -879, 744, 2301, 758, -651, 709, 1638, -42, -773, 761, 1200, -522, -664, 317, 429, -887, -488, 657, 35, -1287, -398, 353, -327, -1294, -512, 90, -623, -1283, -713, -389, -828, -1241, -1004, -421, -484, -855, -1430]
1032a430M12Q15j19j546O4J762l01j836M04J964j92k297O18J921n19j953P94J716
1050B77m66j807R07J076j013r55Q24J656j144q96J112M19q47k64J156L26j130
1067g69k55J032k1o62J18J052j29p41J54P98n14m4o5L96O77n05k14J04P33K33
1087A378j278j67J214K19j406J69J325L74k034K45J741k46j617o0K097m58j452
1104D4J30J859p42j237M03J368m68j418Q61P41n09q29N74P16j131RO16P0q7n15
1124D55J10J73m06o1N18l88J98n87n6K97O79j011n84R25N82j670k13J354O20j599
1144f64m63J856L54k316k28J849K33j680o24K096K4k213O3K161m92j445N3J342
1162i4m41q37M91P71p24p06Q19K08p63O2P55j4o29r9P21j99p09Q99M98r62k84
$$ y = [-1430, -1018, -203, -322, -1868, -1804, -42, -343, -2179, -1775, 189, -3, -2300, -1682, 239, -280, -2233, -1439, 277, -189, -1996, -1089, -13, -1026, -1981, -1157, 499, -645, -1541, -429, -10, -857, -1121, 35, 361, -769, -1024, 8, -13, -675, -557, 495, 366, -375, -221, 577, 63, 19, -46, 350, 1027, 522, 308, 412, 1145, 1378, 100, -67, 1147, 1366, -40, 129, 1454, 1828, -206, 39, 1780, 1534, -83, -143, 1954, 1496, 44, 174, 2033, 1291, 54, 457, 1825, 1357, -61, 800, 1541, 1032, 203, 777, 1493, 362, 371, 987, 1057, 970, 455, 565, 738, 332, 271, 789, 401, 599, 12, -44, 253, 932, -79, -663, 262, 844, -826, -1039, 315, 935, -664, -1127, 729, 1083, -1233, -1461, 388, 621, -1059, -1683, 413, 437, -1776, -1713, 448, -44, -1489, -1436, -94, -535, -1372, -881, -110, -834, -1540, -721, -513, -1276, -1214, -459, -473, -1102, -1201, -480, -679, -1388, -489, 9, -953, -1237]
1183a237O27j11j04J94L61n10k20P42J36o16M91O07m37r75Q03R83p93r05J120
1202A56J265j504j185J534J104j733q47K020Q14j931n23J745Q58j904n77J687
1218I79L91j037o39J324J27r18J9P27l7n73L45K49np37N51L60m26mJ24M60p55
1239E25K46j49O4K57j92k87J24L46k85l38K90Q44j021m50L61M54j56p78K72R04
1259A031p51p65Q15P68r24p45N17P92m39r80M85P48m16q00J2Q89j41n71Q9L87
1279Aj19o54l5N84J15q35M0M40o9n71J33O67j06o39J82L47k6q55L38O27m4r21
1301a400O30N42l69n49K87P51o62o51Q57P40r11o68J011Q54j438k86J183J93m88
1320c74o87R60M09n04m98K95O23j50n75o0O96N1k28k75O31L22p17j14M24M04l95
$$ y = [-1237, -610, -721, -825, -631, -270, -780, -1000, -258, -122, -738, -247, 360, -77, -1052, -249, 734, -59, -964, 156, 1421, -83, -1268, 266, 1370, -363, -1210, 810, 1624, -307, -830, 915, 1773, -131, -708, 979, 1370, 333, -306, 1018, 1145, 227, 246, 973, 936, 363, 708, 957, 952, 215, 766, 1126, 700, 696, 820, 1280, 525, 771, 622, 686, 943, 751, 464, 588, 934, 649, 311, 601, 1445, 424, -26, 335, 789, 633, -145, 127, 1031, 280, -485, 330, 1098, 174, -571, -54, 738, 299, -681, -196, 552, 136, -664, -652, 237, 96, -475, -386, 1, -118, -772, -807, -223, -108, -943, -903, -463, -532, -1103, -970, -303, -409, -1048, -866, -519, -545, -1400, -1062, -435, -479, -1400, -770, -228, -597, -1146, -859, -108, -770, -1421, -564, 176, -735, -1403, -392, 462, -976, -1262, -79, 114, -374, -1061, -101, 308, -196, -694, -399, 224, 74, -501, -561, 135, 186, -42, -317, 314, 636, -81, -195, 229, 633, 238]
1341B38J0J98K00l15l22J041J31j009K9P63J48q87j41O26M23q35M76J36l2m61
1361D17j1N60j96m48J41P23j20o83K30K48M4n91K99K38L04n47l75O07O1l01p54
1382a54O37L69n23m39O73M80r49m48O32M47q13m60J167K4j071K1P81N6r17j8N19
1403A4j22o78K14P70l29l91l11J045p49k99L07N07n60m2L01J58o15MK31q5L4k70
1425h66M03J4k11nJ4j30J45J20o74J53R21J4j155O14O55l77p21J91R58l58j053
1446a348N18J167l61r66O75R44j088k19P21K67r74p7R88K10p88l1Q95k12n61k30
1466d70R91j42n11J20N35j23n25N27K42k26l42L58L24j4k07k8J06j1L5L5l81K14
1488E07K59m79q7P37k5o74L1J098k49p96M9Q85k77q02j83Q83j47q43M31R74l37
$$ y = [238, 248, 446, 646, 331, 9, 1050, 1181, 172, 201, 964, 1112, 225, 84, 710, 1133, 298, 774, 910, 878, 417, 406, 966, 770, 322, 463, 1186, 1066, 383, 613, 861, 905, 314, 613, 851, 1155, 608, 233, 840, 901, 600, -154, 483, 852, 329, -110, 563, 1043, 94, -354, 278, 725, -88, -548, 619, 643, -428, -407, 374, 430, -487, -505, 14, -108, -786, -572, 198, -131, -522, -833, 212, -537, -836, -529, -22, -582, -624, -323, -165, -780, -776, -545, -630, -596, -866, -463, -449, -660, -665, -651, -781, -636, -516, -1190, -1037, -116, -102, -1257, -643, 12, -365, -1086, -895, 63, -295, -1348, -830, 337, -24, -990, -315, 629, -459, -678, 43, 310, -664, -741, 247, 457, -331, -362, 533, 321, -240, -470, 521, 379, -132, -12, 523, 400, -125, 402, 644, 418, 76, 434, 758, 744, 537, 509, 615, 604, 639, 674, 293, 507, 766, 287, 200, 937, 912, 238, 269, 1367, 1118, 322, 371, 1256, 979, 177, -6, 877, 730, -113, 318, 1292, 955]
1509I55r70K70M83l14l97L13J94r7n24L78J0p9l78M60l2k47k47L01Q6q7n86L92
1531a16J77P0q64j56O86j03n71N15L79n82k56J48M46k09l99L0Q85l89n33J34P00
1552hl29n82O5M24k65J28Q6P5k65m15N04J91pk31J02N1O5JK14k98J42k1k62p4
1576g09M73o2J3R7O9o8k26K39J30j54j13K40L97o36j84M83L24j04o09J088N9j054
1598c07LR76K05r49L6J064k95p27m2R76O6j041J96O70j32q50K87P51j59p79P02
1619F51K78k96n09O51K22j73p03P65j41k09o0J21K14k58j1J49j47qk31M33l63
1640C75k7R0L4l55j04L77o5m75O63l89Q0j93L33N0p99L97L62j62o21M21J01N4
1662A47n79QO15k04m95Q7N21k81n27J91N64m37m20L11L55j51l85L46P9l27m20
$$ y = [955, -15, 255, 738, 424, 27, 340, 534, 437, -87, 291, 301, 222, -156, 304, 272, 25, -222, 79, 165, 78, -508, -116, 61, 131, -733, -889, -203, -306, -877, -362, 17, -565, -821, -673, -227, -436, -835, -805, 80, -309, -842, -708, -8, -337, -919, -854, -430, -695, -567, -481, -406, -671, -1086, -582, -391, -398, -629, -527, -476, -411, -410, -196, -494, -352, -373, -635, -709, -236, -298, -285, -188, -119, -187, -413, -174, -44, -198, -311, -71, 326, -310, -494, -11, 313, 209, -400, 688, 747, -307, -304, 672, 877, -72, -36, 1028, 733, 6, -36, 940, 1006, -35, 161, 831, 699, -151, 136, 887, 728, -51, 651, 929, 633, 124, 775, 997, 824, 121, 886, 745, 536, 476, 597, 811, 553, 542, 691, 544, 536, 305, 738, 375, 348, 438, 472, 117, 13, 390, 325, -150, 513, 124, 204, 11, 344, 394, -405, -8, 354, 192, -429, -8, 93, 147, -432, -424, 191, -13, -508, -421, 100, -181, -708, -517, 47, -390, -810, -499, -144, -295, -680, -334, -255, -582, -1002]
1683a002N57R3M8n14M16J02j38j26J69K95n73k38O88J39m30mJ54J00m93K40P02
1704A85n84q8N3K68j03k16N04J15j12m69j09O60o5j45K39K4mJ53n35L24Q2L44
1726E21l78k39M16j12L63o22L76N04l33m07M05J17k96k80M24J72k03N7J04J68
1746G57o18j21O33j32n37K01P66j98o33J95K31K31m52q8O60k75k76j4K14m8m59
1767C7K08K92j28n82L29M39J8p36K21L73L9n39k0M44m54j89K89J42j4m25k20N75
1789I9mm95M55j48n7l49L26k5K1l10J28k4j73q1M84L31j047k7P08j34n45M00P26
1812B59r86j53O05Qj64k33J90m0m13L58J04L2l10L86j3j06L8L48o4m12O8O37l60
1835b21m79L9O15o1o19M13P43o93k95N38L62m07o08P56M49p30l65Q29K95o84l48
$$ y = [-1002, -445, -352, -304, -818, -402, -300, -438, -564, -395, -100, -673, -911, -223, -84, -514, -518, -364, -264, -757, -517, 185, -399, -487, -434, -166, -269, -485, 19, 134, 22, -447, -556, 104, 39, -106, 133, 157, 153, 306, -229, 95, 177, 521, 143, -96, 320, 208, 571, -51, 325, 829, 496, 89, 494, 611, 315, 35, 459, 631, 428, 485, 589, 757, 139, 18, 651, 519, -18, 183, 949, 751, 118, 313, 544, 775, 323, 235, 895, 620, 344, 330, 544, 496, 37, 245, 537, 409, -173, 156, 595, 613, -123, 98, 471, 510, -29, -49, 395, -59, -248, 41, 183, 169, -256, -476, 99, 95, -400, 55, -93, -150, -499, -173, -198, -177, -487, -359, -383, -556, -637, -153, 178, -869, -896, -188, -322, -867, -467, 259, -727, -880, -275, -267, -431, -664, -474, -514, -927, -569, -465, -433, -743, -357, -370, -476, -438, -90, -154, -566, -498, 139, -221, -700, -661, -46, -107, -726, -313, 430, -263, -558, -20, 342, -65, -673, 83, 532, -198, -563, 266, 561, -123, -471]
1856d71P82r6l95k4P63j10o62L97L26j48k06M73k7k25k43K85J96j05n58K62L33
1877E47m83J23N50k09n14K61J78p1k03K57n3m1M28k43l99J01P2L00k84l12N78
1898E83k21l44K79k6J03k85K66p5j59j75J61J14k20k10J53J16k00m42N59K29l15
1919a09K30k59L93n76J80k16J11j48%J86l2o2k94M04P4m20k18L79J45j52l80M36
1941c28M7j07k42L3J45j68j14L42LN6n43O11Rk55o77P23K46k66pK01K14l08n4
1964d39j35M18k98K14K9O4k20K24N4p7j80J17L36m31J05J27m9J62m3P4J18%J0
1987A80Q7m5m4K32n4k25J51K18k51j70R8O35m19k99M45K7n41K54M28k30l16J33
2009B94L58K2n22L25Q9R1l22O3K66p6o38L59J9k7j35J26O4k24Q2J96m3j68O2q4
$$ y = [-471, 311, 215, -180, -204, 559, 449, -213, 184, 510, 362, 156, 629, 602, 377, 134, 419, 615, 510, -48, 214, 547, 64, 187, 737, 528, 14, 275, 453, 382, 179, 436, 383, 342, 770, 527, 128, 229, 301, 601, 317, 5, 583, 362, 18, 297, 271, 374, 89, 355, 280, 121, -54, 107, 221, 1, -209, -56, 60, -140, -582, -23, 206, -109, 121, -138, 255, -321, -141, -357, -246, -394, -394, -208, -240, -302, -596, -192, -118, -538, -756, -377, -232, -384, -764, -328, -281, -388, -630, -597, -452, -620, -734, -392, -389, -333, -876, -265, -256, -511, -1188, -465, -219, -485, -492, -291, -77, -385, -439, -574, -156, -454, -240, -211, -147, -367, -143, -89, -166, -346, -229, 107, -324, -219, -92, -141, 21, -22, 52, 170, 170, 180, 267, 222, 178, 410, 356, 131, 282, 500, 249, 79, 177, 812, 393, 94, 539, 566, 25, 279, 707, 477, 161, 294, 652, 674, 152, 477, 566, 657, 335, 398, 664, 588, -50, 309, 328, 301, 166, 292, 356, 132, 214, 410, 367, 199, 261, 177]
2033A77K4J61j13j75K01M2l72O5M8L32o11L74j52K0k51K77k55K36j29l02O90k70
2055A7n38J58L23k72m34K78L06j96l5j8L31k29p7%J95o3k80L55k00L5j06R6k1
2078c75R1l08L36k55J71m8P4m8J66r1j37J92J28k21k10L05J79l71kK73l0l86N
2101e62L84M29m12q9M47k42l2J51r3J52L82o73L13Q4k09m2N7K98M3o51J86M98
2123D19j76j44o8K68J68l09K01NJ2k78K11J87o9l34K13L85l66M7j32R7K5N4o5
2146C51K88j3j98p4j89J21m06N20j54J03l21M90m24k23K90J98j83l41M15K64k30
2167B84j20l15N33m86m4K60j6q3J6J1l2k08P7R7j90K39j18N1k47M4J88m22Q2J58
2191b41j51J72m12P23L7m44l90L62J50m78L16L59j65l94K04J40r3l23j4N22k63
$$ y = [177, 201, 362, 249, 74, 275, 317, -55, 10, 58, 390, -221, 153, 1, 21, -230, 47, -208, 28, -101, -403, 287, 17, -521, -363, -40, -312, -746, -468, -162, -358, -393, -411, -80, -309, -386, -386, -191, -254, -534, -179, -379, -344, -450, -354, -375, -284, -592, -256, -511, -340, -388, -314, -362, -196, -287, -424, -232, -104, -325, -535, -230, -51, -422, -424, -151, -181, -567, -562, -178, 251, -161, -250, 197, -45, -77, 74, -19, 133, 515, -158, 155, 239, 30, -12, 45, 343, 386, -265, -79, 419, 243, 99, 31, 299, 467, 158, 359, 364, 376, 98, 309, 496, 427, 93, 306, 691, 325, 372, 240, 337, 362, 416, 351, 639, 626, 428, 354, 165, 286, -120, 400, 246, 349, 28, 518, 94, -129, 161, 359, 176, -165, 250, 514, 284, 164, -151, 382, -104, -148, 112, 96, 13, 29, 40, 8, -200, -123, -26, -216, 23, -95, -44, -291, -247, -59, -481, -399, -241, -392, -220, -632, 91, 128, -316, -706, -344, -194, -672, -356, 3, -162, -556, -352, -212, -305, -628, -642, -120, -383]
2212c83l7p4N89m37k1J74J97l96R8N8J19o7N1j24K84l01L55l73M32j96j06J31
2234b7O9l7k77K79k8o5J72q4J79j68n8L01n9O9m7NQ5k68K86Q7J40k63j88M1J6
2259A60J86J05l2J43k80K13n6k9Q2m3k09K11nl83M0L24j96O9J71l4m0N9m34L19
2283C41j69Q9j07R0K23m58M8K77J18k81k35J76K26j41n25K95L04q6l34M27l77
2304i9j27J16M7p2r8O9K12Q6o76O34j0l2l30J07k6J92l87K16J39j95k31K46N2
2327a67l18j08K53K59l08K14j77J75k68k12N04k67K3N10k26l87K15j43K65k74
2347d37L15K4j95J2j1J50M2k39K00KN6j88K49J01r7l10M40nk64J45k1J69o8j38
2371f8M50o1n02J30M13j17l6j8M39n46m7K14J15J26m83K57NK7k14J92K73l09k99
$$ y = [-383, -420, -494, 95, -342, -363, -189, 8, -388, -290, -232, -113, -180, -129, -253, 31, -270, 85, -288, 144, -52, -158, -27, 42, 5, -272, 7, -21, -86, 86, 2, 181, 13, -45, 256, 197, 266, 219, 224, 309, 41, 327, 414, 554, 291, 103, 144, 160, 346, 451, 419, 562, 282, 495, 439, 410, 492, 449, 240, 451, 446, 63, 103, 427, 231, 300, 471, 437, 397, 456, 22, 341, 172, 261, 154, 244, 467, 9, 57, 334, 452, 171, -64, 112, 338, 197, -328, -33, 271, 185, -149, 278, -99, -226, -110, -63, -135, -233, -164, 48, 134, -542, 92, 82, 50, -280, -173, -199, -7, -394, -178, -39, -234, -465, -219, -167, -485, -593, -340, -81, -389, -175, -352, -177, -445, -657, -153, -420, -397, 113, -113, -500, -285, -428, -163, -437, -122, -98, -293, -281, -292, -142, -100, -339, -139, -137, -81, -269, -20, 81, -16, -326, 114, 109, -155, -10, -31, 138, 70, -68, 382, 321, -181, -51, 362, 245, 209, 191, 630, 84, 37, 251, 366, 492, 9, 266, 271, 298, 84, 276, 549, 240, -59]
2394e9M28L15j74l74J05R7j2n27N43k37N7j25N06j09m62L61J47l46O9k41N20k58
2416B24k94J81M4J8k06n2J21k72J70K79p2m70J72L84l03q7K29q8P6l5j73R8k54
2439c10J44L35k10pQ2j50l2j94Q4Q2J98j34J38l68o8n8N1J23j66M09K41n55k06
2462e71K95M47n40m7k9K68n8k50J90K37k83q1M11r3m04j1J85L0j02l7L80n3L5
2485h1K2j46K21m7p2P1J59k27j66L81k2j94J05K70J32l15L1m6P6J35o7J74J11
2508E05m34j5K29o4k61oM52k21k5jl2K20J00m18L87j36k87O63l86J20k47J71k24
2531I0R5K23J34k97o6lm2o2P8j24L01m87M51K33m51o0L9L05j19q0o0J49l82l04
2555d39O89p4j59k16P00n04J32m68N43l24j19L62k21R2J06l64N3J9j8J67l80%
$$ y = [-59, 369, 684, 510, 136, 241, 338, 326, -201, 342, 105, 162, 37, 543, 434, -28, 333, 480, 134, 203, -38, 482, 224, -70, 111, 155, 173, -33, -85, 36, -236, -66, 213, 141, -329, -157, 227, -76, -163, 66, -22, 54, 19, -154, -56, -310, -166, 169, -41, -48, 34, -116, -148, -342, -258, -176, 22, -112, 26, -342, -410, -468, -417, -294, -460, -51, 190, -365, -571, -276, 171, -369, -416, -445, -177, -235, -485, -295, -58, -341, -422, -11, -104, -508, -519, -334, -304, -406, -443, -63, -116, -81, -59, -205, 16, -31, -103, -32, 127, -100, -266, 115, 93, -101, 4, 274, 406, 91, 122, 76, 152, 287, 220, 394, 505, 71, 56, 285, 221, -40, -46, 406, 185, 160, 159, 127, 347, 447, 29, 416, 280, -7, 656, 270, 390, 143, 314, 90, 185, 408, 542, 245, 179, 176, 134, 72, 150, 26, 327, -160, 291, 524, 73, 13, 52, 357, 238, 158, 98, 247, -135, -439, 250, 176, 17, -199, 501, -3, 129, -339, 204, -120, -239, 123, -98, -6, 100, -264, -211, -192, -210, -43, -423, -423]
2577d23L16K79n98J66J56Q6k73J16p5J2k71K35j92J89L39m84M01l23K92j76q1
2598c09K3p5M4K59j08j30q3L7J94J76j90oK07j81L81j39l39oK69j88L7J67K5l9
2622B6J69k23k6o8K4N2m4jL09j36J5k8l52L83L42n01Q2J66J89J06l08m60N19N7
2646B92l61L01R3M3Nj15P2m3q3j71L49m14J02L74j07l23n3K44J56k57l1K18Q0
2669C71l61K71M1N5j94K6k04K3J61j7qp6n7L44k17J9j24j82K17j26k81O93l89
2692a5q1K81l79n0K38j79l6L15j25j28K21o39M81J05k08R6k10k00N58l09J47m1
2714a58l3k73r0M06l87K51pJ1j30J50K22k99R1j8J60r5J43l38K58j84r6L21QL02
2738B15l52j81M18K08m51pQ5J18q0r3L3p8K46n1J24j34J2N7p6O6j97J0J6K86J
$$ y = [-423, -107, 172, -426, -260, -104, -18, -291, -175, -250, -238, -509, -274, -466, -277, 62, -422, -21, -344, -52, -228, -309, -286, -361, -317, -58, -166, -296, -379, -342, -148, 28, -162, -168, 39, -142, 239, 100, -239, -245, 24, -164, -127, 40, 65, 26, 195, -28, -54, -122, -98, -46, -90, -91, 218, 82, 97, 69, -283, 100, 442, -59, 23, 189, 378, 484, 176, -284, 235, 292, -69, 232, 325, 368, 373, 258, 330, 287, 204, 33, 382, -32, 70, 444, 337, 14, -39, 205, 361, 104, 73, 291, 371, 10, 281, 322, 377, 183, 209, 5, 28, 189, 172, 164, 88, 31, 375, 158, 177, 53, -129, 88, -38, -319, 374, -15, -96, 185, -194, -244, -6, -185, -221, 94, -31, -159, 62, -577, -96, 9, -199, -103, -313, -513, 45, -264, -117, -158, -191, -464, -554, -148, -535, -284, -291, -280, -410, -260, -38, -337, -246, -264, -104, -199, -56, -394, -136, -320, -416, -95, -87, 215, -137, -318, 100, 308, -143, -150, -65, 53, -27, -120, -87, -165, 81, 30, 154, 20, 32, 89, 13, 79, -118, -108, -92, 194, 195]
2763A95R3r2j9Q3j66K9L5J23k01J01M26n51%J60J82j66k06L66q8j01J41ok64K62
2787C36l80J21K06m16M20m5J34M0l76N1NM59m10J68rm09J32K2J00L8K65l20j25
2810Gj31J32J56k02J78M1l57J29J13j00L1k6o3L1n3P1M2j18K4K10j08M2k48L0
2834a69L2K58l47j07J07R0q4J78l14R6n4K51lk36m5M85j64o2j5l00L50k30J97
2857h6qm0m7j25L9l0J25LO0j63J90k6L05n14K32j82J41J39J1n6K94m84J74q4m8
2882a80k3J29L33p1P3j31ml64M46j48K35j47J8J9j36O4R2p1j9J75M6m4l78K59
2906A73L1o2J24l75L65P8k65J26q4P9q2J46o3nk25R2o5K70l89L28J33Pj36j76
2930B5N71m46j30K9J34j0pJ2j2k58J19j87o4K34k23N18q0k62n2Q3J08q2l29J77
$$ y = [195, 288, 196, 177, 260, 94, 123, 158, 281, 80, 181, 607, 56, 56, 216, 398, 232, 26, 392, 304, 203, 344, 338, 74, 336, -44, 77, 283, -133, 287, 242, 376, 416, 40, 91, 96, 555, 145, 313, 304, -105, 27, 49, 149, 187, 452, 132, 7, -124, 8, 164, -38, 140, 181, -176, -47, 66, -34, -3, -29, -92, -61, -114, -43, -1, -119, -95, 115, 7, 49, -199, -169, -137, 121, -226, -333, -226, -136, -220, -42, -356, -260, -314, -63, -66, -302, -347, 138, -26, -88, -103, -403, -53, -283, -86, -94, -134, -181, -306, -267, -297, -172, -169, -109, -272, -82, -108, 197, -317, -85, -267, -126, 13, 24, -32, 262, -222, -48, -132, -180, -203, -74, 259, 188, 261, 130, 126, -238, 208, 60, 295, 148, 166, 185, 49, 113, 205, 134, 115, 290, 336, 292, -86, 173, 204, 142, 266, -109, 256, 334, 69, 195, 111, 190, 108, 254, 191, 186, -39, 53, -12, 258, -131, 197, 330, 337, 201, 25, 596, 150, 20, 49, 183, 173, 166, 178, 166, -92, 27, -160, -224, 10, -213, 305, 225, -37, -89, -6, 102, 20, -309, -132]
2954a32Q4P5k03J73j3k18L71n04L7R3j72K35o6J44J0m00J35Q6M7O8p2M1J9k59
2978d21K86j53K01j19J60j44n5M9J48P3l48R1M10m53P1K92m07L70k42L22o7m13
3000c49J89O40o61J91m01M45l04K16L55l07j42M4N4J71o0k71K31j13J11l34M39
3021A44j09J33k04K19k22J12O4j02J59N5j82L9R7J14j18q5m6J99l44M32k82J82
3043B55K42n70M96m1j38M1j09J41r5l8j78N7J31q9K51n9K22l91J11N9k73J99L6
3066B60m65J72j97J52K06j81k7J50k63K47j97K70K05k62k20j05L02K7k89j42N21
3087A64j70k59J49J5Lk03L51J12m86J89P4q7L1k50K15P6j60m9L47m71K7J41Q4
3110a57J17j76K15l94K10N9j81J83o8J20j29J55n5J92k58J40M7l20O8P3n8P6J50
$$ y = [-132, -48, 27, -176, -3, -16, -234, 137, -367, -330, -237, -409, -174, -240, -96, -86, -486, -351, -265, -218, -150, -222, -181, -162, -421, -135, -288, -87, -206, -46, -190, -245, -196, -48, 25, -323, -232, 178, -275, -204, 88, -319, 51, -191, 131, 64, -349, -160, 480, -181, 10, -391, 54, -250, -34, 321, 14, -128, -84, -30, 141, 81, -190, 41, -72, 39, -295, 144, 35, 168, -36, 183, -39, 73, 137, 35, 194, 249, 67, 106, 203, 317, 199, 114, 68, 267, -77, 355, 73, 255, 497, -73, 423, 382, 244, 285, 176, 317, 222, 184, 6, 63, 194, 105, 356, 297, 519, 128, 239, 298, 25, 224, 260, -205, -33, -230, -78, 128, -53, -80, 70, -193, 54, -143, 127, 332, 70, -150, -255, 47, 74, -215, -357, 164, -6, -265, -116, -101, -98, -301, 50, 162, -324, -135, -61, -148, -117, -367, -152, -76, -236, -285, 62, -409, -382, -241, -157, -40, -216, -1, -395, -185, -126, -307, -124, -192, -72, -201, -46, -101, 91, -167, -27, 20, -300, -232, -159, -217, -141, 9]
3133Ij97K64j64o3l1J83K24l72lJ04q5R3m75O13l17K51j3q9m1K72k28K32k54M6
3157d1J31K2j34J14k52K75j20R9N5L68m85j33K15K81j67k83J22K7J04p4K8J00
3179B52j52O6Q2j35n3j95M54K0k57LL6R5pJj86k20J90O1k39oj38K38J55j27L3
3204b9k0J25k0l06R9j66L62m33M61j09k1j46J37J49K60m61k67N26l87L3j27o7
3226d07N05j23o2j2l1j90J63j9J33o0j98J74k8L80l04j70R0J31k34K6J05K33l03
3249b01P0J44k20J29k6L4L17l92J94k78M1J47j04L14j7J21j42r9k27K38q6L91
3271C48l65J67o4j47K35p3ok31K15j5J22k2r0K08m04J87L19l69P9l17J79J40r4
3294BJ30O7k97j33M77R8m01L35R2q1N0j98j5K79o4j39L04k36k61l5K71j87P7j20
$$ y = [9, -188, 76, -88, -151, -182, 1, 225, -147, -150, -46, -131, -38, -513, 100, -217, 34, 21, -68, -109, 163, -65, 167, -87, -41, 90, 112, -22, 92, -160, 115, -5, 94, 149, 517, 32, -101, 114, 395, 228, -55, 67, 94, 198, 124, 152, 252, 100, 166, 248, 113, 60, -135, 319, 339, 82, 85, 121, 216, 209, 210, 24, -196, -6, 55, -184, -190, -328, -90, 65, -62, -29, -49, 76, 56, -250, -151, -317, 45, -388, 73, -36, -57, -203, -66, 83, 343, -118, -385, 141, -246, -213, -340, -407, 98, -25, -87, -99, -130, -320, -157, -176, -43, -103, -301, -127, -155, 225, -79, -249, -159, -28, -262, -236, -131, 102, -201, -131, 13, -207, -78, -104, -70, 247, -145, 49, -229, -188, -41, -145, 169, 152, 273, 131, 32, -195, 43, -43, 348, -17, 150, 86, -61, 174, 101, 95, -136, 79, 64, 186, 164, 74, 282, -122, 65, 384, 15, 94, -223, -44, 96, 2, 132, 199, -98, -231, 246, 344, -57, 278, 370, 289, 339, 141, 126, 405, 341, 202, 506, 270, 9, -26, 245, 58, 135, 15]
3318A5n6k2j01M44k85L99k05l25L05J16l81ln8K90m0J50j2n3j22k55O6Q2J90k26
3342h7K20k02k14J21M42l90J95j09r5oJ9q7p5N8J77l27M39k02j26j68M89l45J85
3365h8k48J57J25Rj35O2o6L27k17j23K95k79K3k79K51O3J77j26J61k8r4k04L88
3388A51j89P6J31j60N1P6j75Q0K0l31K07J35l7J62k02J15j53R5m0L18l85j4M4
3411b5n3L75j08j7q1N1k14K56j16J84m48P0L78K6j84k9K73k5M3k12l01N27k56
3434A14J63j85O6j67n8J86j83K34l75K82M78n76N3m7J78k66J78KN3Ok3k07J25
3457C1j25J16Q4k35L35k48k03K25j24K43k9l42K95k73J64K2K2k3J39j98J93j20
3479e1m0Lj66jJ53l0j28K54q9R1k1j26m1o4J12j62K91j20l5j3J72m32K82Rlm7
$$ y = [15, -41, -63, -164, 280, -5, 394, 189, -136, 169, 285, -96, -99, -157, 133, 93, 243, 231, 178, 56, -199, -133, -51, 139, -87, 133, -69, -283, -162, 280, -110, 85, -24, -119, -125, -106, -193, -268, -210, -33, -360, 79, -123, -249, -417, 72, -273, -88, -336, -179, -54, -45, -180, -118, -184, 143, -74, -197, 98, -181, -158, -437, -186, -123, 54, -72, 89, 61, -33, -237, 151, -38, 38, 169, 9, 60, 136, -39, 41, 61, -270, -63, 72, 35, 197, -5, 110, -43, 52, 12, 330, -55, -69, -25, -78, 297, 189, 172, 91, 142, -72, 184, 68, 252, -196, -126, 252, 278, 94, 65, 338, 313, 356, 144, -157, 370, 114, 277, 92, 158, -9, -67, 119, -64, 170, -205, 77, 555, -21, 32, -15, 163, -103, 75, 77, 130, 136, 113, -94, 31, -94, 22, 106, -129, 206, -42, -245, -20, -144, 99, 70, -272, 23, -250, -86, -64, -42, -65, 74, -124, 69, -51, -91, -88, -254, -255, -102, -132, -260, -6, -95, -4, -25, -151, -192, -256, -144, -306, -15, -135, -170, -183, -11, -443, -161, -152, -155, -202]
3505b02J25R6k99J98k86J29L7K36j67j70j32M65Qn37N45Q8j88j0JL5O6l31M62
3528A69K1j94J01j51J31ON4k29L43k07k06N38j49k62j30L12M6j31q0N9J38o7N9
3551A71q9J77Lr3j51k0j34M53j60k38L45O8m05J95q2n4L8J66N5k92L24p7K83k51
3575B32m46K49k74K34k0j09K05N3j71n1K50M6l09Q4J71n4K13k02k78J14l45L57
3597e1M1j12j29M45n04M16k10lqj47J52j34J97P3l29L87j71n3Oo5K22n01N44j18
$$ y = [-202, -77, 19, -280, -82, -368, -239, -202, 34, -133, -303, -435, 30, 38, -499, 46, 134, -54, -64, -63, -28, 38, -293, 169, 190, -4, 97, -54, 77, 83, 137, -92, 251, 44, -162, 376, 227, -35, -165, 147, 193, 62, -18, 41, 179, 112, 171, 82, 259, 262, 169, 18, -2, -136, 317, 157, -81, 264, 332, -73, 122, 40, -14, 24, 190, 245, -47, 277, 200, 483, 232, -214, 35, -239, -5, -25, -134, 71, 124, -47, -98, 152, 198, -111, -27, 144, 90, 303, 101, -177, -63, -408, -51, -10, -122, -251, 194, -310, 106, -104, -107, -115, -262, -110, -244, -47, 26, -303, 84, -87, -140, -134, -199, 23, -478, 66, -52]
$$ [...]
8191F3
##END NTUPLES=NMR FID
##END=
