##TITLE=1H_Costus-2Kg-Acet-B
 CDCl3, 8 sc, 
 26.2.2020
##JCAMPDX= 6.0         $$ Bruker NMR JCAMP-DX V2.0
##DATA TYPE= NMR FID
##DATA CLASS= NTUPLES
##ORIGIN= UXNMR, Bruker Analytische Messtechnik GmbH
##OWNER= root
$$ XWIN-NMR		Version 3.5
$$ Wed Feb 26 14:33:03 2020 Russian Standard Time (UT+4h)  she@DPX200
##.OBSERVE FREQUENCY= 200.1315
##.OBSERVE NUCLEUS= ^1H
##.DELAY= (6, 6)
##.ACQUISITION MODE= SIMULTANEOUS
##.ACQUISITION SCHEME= undefined
##.AVERAGES= 8
##.DIGITISER RES= 18
##SPECTROMETER/DATA SYSTEM= spect
##.PULSE SEQUENCE= zg30
##.SOLVENT NAME= CDCl3
##.SHIFT REFERENCE= (INTERNAL, CDCl3, 0, 15.7039)
##AUDIT TRAIL= $$ (NUMBER, WHEN, WHO, WHERE, WHAT)
$$ ##TITLE= Audit trail, XWIN-NMR		Version 3.5
$$ ##JCAMPDX= 5.01
$$ ##ORIGIN= Bruker BioSpin GmbH
$$ ##OWNER= she
$$ F:/spectra/data/she/nmr/H-F/1/audita.txt
$$ ##AUDIT TRAIL=  $$ (NUMBER, WHEN, WHO, WHERE, WHAT)
(   1,<2020-02-26 14:32:05.51 +0400>,<she>,<DPX200>,
      <created by zg, POWCHK disabled, PULCHK disabled
       configuration hash MD5:
       00 E9 B6 7A A2 85 ED C7 34 08 36 98 17 FE 4E 26
       data hash MD5: 16K
       D8 B9 BC 0B E3 09 A8 33 D7 2A AF 02 DA 96 45 6F>)
$$ ##END=
$$ 
$$ hash MD5
$$ 1B 2A 83 69 64 B1 FE 05 47 4F 24 38 8E 1A A8 A4
##$RELAX= 
##$RELAX= 
##$RELAX= 
##$RELAX= 
##$RELAX= 
##$RELAX= 
$$ Bruker specific parameters
$$ --------------------------
##$DU= <F:/spectra>
##$EXPNO= 1
##$NAME= <H-F>
##$PROCNO= 1
##$TYPE= <nmr>
##$USER= <she>
##$AMP= (0..31)
100 100 100 100 100 100 100 100 100 100 100 100 100 100 100 100 100 100 
100 100 100 100 100 100 100 100 100 100 100 100 100 100 
##$AQSEQ= 0
##$AQ_mod= 1
##$AUNM= <au_zg>
##$AUTOPOS= <>
##$BF1= 200.13
##$BF2= 200.13
##$BF3= 200.13
##$BF4= 200.13
##$BF5= 200.13
##$BF6= 200.13
##$BF7= 200.13
##$BF8= 200.13
##$BYTORDA= 1
##$CFDGTYP= 0
##$CFRGTYP= 5
##$CHEMSTR= <none>
##$CNST= (0..31)
1 1 145 1 1 1 1 1 1 1 1 1 1 1 1 1 1 1 1 1 1 1 1 1 1 1 1 1 1 1 1 1 
##$CPDPRG= <>
##$CPDPRG1= <>
##$CPDPRG2= <>
##$CPDPRG3= <>
##$CPDPRG4= <mlev>
##$CPDPRG5= <mlev>
##$CPDPRG6= <mlev>
##$CPDPRG7= <mlev>
##$CPDPRG8= <mlev>
##$CPDPRGB= <>
##$CPDPRGT= <>
##$D= (0..31)
0 1.2 0 0 0 0 0 0 0 0.06 0 0.03 0 0 0 0 0.0002 0 0 0 0 0 0 0 0 0 0 0 0 
0 0 0 
##$DATE= 1582713124
##$DBL= (0..7)
120 120 120 120 120 120 120 120 
##$DBP= (0..7)
150 150 150 150 150 150 150 150 
##$DBP07= 0
##$DBPNAM0= <>
##$DBPNAM1= <>
##$DBPNAM2= <>
##$DBPNAM3= <>
##$DBPNAM4= <>
##$DBPNAM5= <>
##$DBPNAM6= <>
##$DBPNAM7= <>
##$DBPOAL= (0..7)
0.5 0.5 0.5 0.5 0.5 0.5 0.5 0.5 
##$DBPOFFS= (0..7)
0 0 0 0 0 0 0 0 
##$DE= 6
##$DECBNUC= <off>
##$DECIM= 24
##$DECNUC= <off>
##$DECSTAT= 4
##$DIGMOD= 1
##$DIGTYP= 9
##$DL= (0..7)
0 120 120 120 120 120 120 120 
##$DP= (0..7)
150 150 150 150 150 150 150 150 
##$DP07= 0
##$DPNAME0= <>
##$DPNAME1= <>
##$DPNAME2= <>
##$DPNAME3= <>
##$DPNAME4= <>
##$DPNAME5= <>
##$DPNAME6= <>
##$DPNAME7= <>
##$DPOAL= (0..7)
0.5 0.5 0.5 0.5 0.5 0.5 0.5 0.5 
##$DPOFFS= (0..7)
0 0 0 0 0 0 0 0 
##$DQDMODE= 0
##$DR= 18
##$DS= 0
##$DSLIST= <SSSSSSSSSSSSSSS>
$$ [...]
##$SUBNAM2= <"">
##$SUBNAM3= <"">
##$SUBNAM4= <"">
##$SUBNAM5= <"">
##$SUBNAM6= <"">
##$SUBNAM7= <"">
##$SUBNAM8= <"">
##$SUBNAM9= <"">
##$SW= 24.9337058887773
##$SWIBOX= (0..15)
0 0 2 0 0 0 0 0 0 0 0 0 0 0 0 0 
##$SW_h= 4990.01996007984
##$TD= 16384
##$TD0= 1
##$TE= 0
##$TE2= 300
##$TE3= 300
##$TEG= 300
##$TL= (0..7)
0 120 120 120 120 120 120 120 
##$TP= (0..7)
150 150 150 150 150 150 150 150 
##$TP07= 0
##$TPNAME0= <>
##$TPNAME1= <>
##$TPNAME2= <>
##$TPNAME3= <>
##$TPNAME4= <>
##$TPNAME5= <>
##$TPNAME6= <>
##$TPNAME7= <>
##$TPOAL= (0..7)
0.5 0.5 0.5 0.5 0.5 0.5 0.5 0.5 
##$TPOFFS= (0..7)
0 0 0 0 0 0 0 0 
##$TUNHIN= 0
##$TUNHOUT= 0
##$TUNXOUT= 0
##$USERA1= <user>
##$USERA2= <user>
##$USERA3= <user>
##$USERA4= <user>
##$USERA5= <user>
##$V9= 5
##$VALIST= <valist>
##$VCLIST= <CCCCCCCCCCCCCCC>
##$VD= 0
##$VDLIST= <DDDDDDDDDDDDDDD>
##$VPLIST= <PPPPPPPPPPPPPPP>
##$VTLIST= <TTTTTTTTTTTTTTT>
##$WBST= 1024
##$WBSW= 4
##$XGAIN= (0..3)
0 0 0 0 
##$XL= 0
##$YL= 0
##$YMAX_a= 339767
##$YMIN_a= -223347
##$ZGOPTNS= <>
##$ZL1= 120
##$ZL2= 120
##$ZL3= 120
##$ZL4= 120
##$ABSF1= 10
##$ABSF2= 0
##$ABSG= 5
##$ABSL= 3
##$ALPHA= 0
##$AQORDER= 0
##$ASSFAC= 0
##$ASSFACI= 0
##$ASSFACX= 0
##$ASSWID= 0
##$AUNMP= <proc_1d>
##$AZFE= 0.1
##$AZFW= 0.1
##$BCFW= 1
##$BC_mod= 2
##$BYTORDP= 1
##$COROFFS= 0
##$CY= 11.3945322036743
##$DATMOD= 1
##$DC= 2
##$DFILT= <>
##$DTYPP= 0
##$F1P= 16.9975609425685
##$F2P= -3.02152046262296
##$FCOR= 0.5
##$FTSIZE= 0
##$FT_mod= 4
##$GAMMA= 1
##$GB= 0.15
##$INTBC= 1
##$INTSCL= 1
##$ISEN= 128
##$LB= 0.24
##$LEV0= 0
##$LPBIN= 0
##$MAXI= 10000
##$MC2= 0
##$MEAN= 0
##$ME_mod= 0
##$MI= 1.114404
##$NCOEF= 0
##$NC_proc= 0
##$NLEV= 6
##$NOISF1= 3.799351
##$NOISF2= 2.8
##$NSP= 1
##$NTH_PI= 0
##$NZP= 0
##$OFFSET= 15.70392
##$PC= 1
##$PHC0= -9799.542
##$PHC1= 31.00082
##$PH_mod= 1
##$PKNL= yes
##$PPARMOD= 0
##$PSCAL= 0
##$PSIGN= 0
##$REVERSE= no
##$SF= 200.130013532006
##$SI= 16384
##$SIGF1= 3
##$SIGF2= 2
##$SINO= 400
##$SIOLD= 16384
##$SREGLST= <1H.CDCl3>
##$SSB= 0
##$STSI= 0
##$STSR= 0
##$SW_p= 3612.71676300578
##$SYMM= 0
##$S_DEV= 0
##$TDeff= 0
##$TDoff= 0
##$TI= <>
##$TILT= no
##$TM1= 0
##$TM2= 0
##$TOPLEV= 0
##$USERP1= <user>
##$USERP2= <user>
##$USERP3= <user>
##$USERP4= <user>
##$USERP5= <user>
##$WDW= 1
##$XDIM= 8192
##$YMAX_p= 0
##$YMIN_p= 0
$$ End of Bruker specific parameters
$$ ---------------------------------
##NTUPLES= NMR FID
##VAR_NAME=  TIME,          FID/REAL,        FID/IMAG
##SYMBOL=    X,             R,               I
##VAR_TYPE=  INDEPENDENT,   DEPENDENT,       DEPENDENT
##VAR_FORM=  AFFN,          ASDF,            ASDF
##VAR_DIM=   8192,          8192,            8192
##UNITS=     SECONDS,       ARBITRARY UNITS, ARBITRARY UNITS
##FACTOR=    0.0002004,     1,               1
##FIRST=     0,             0,               0
##LAST=      1.6414764,     0,               0
##MIN=       0,             -223347,         0
##MAX=       1.6414764,     339767,          0
$$ Real data points
##PAGE= N=1
##DATA TABLE= (X++(R..R)), XYDATA
$$ [...]
2488h59K049j92k223p12K167J008o57k677L35K565Q20k184k039J477K484m99k378
2505a515l14K135Q20o56j720l1J824J026j175k148M93K374M27j895j682J676K188
2522A827r72k353p3K219J270j208j764J5K213P17j760j757J016K423k18k268j087
2539a760J989J651p01k214r6J979J334j433j987O74K193N97k021j847J258K766
2555B382p35k482o31K246J657j818k217J042K210L41j735j342P42J832Q1k066
2571d93r30J506K020j325k396K39K480J088k182j704R13K313Ok338r07J370J751
2588A411n70k463K4J981R52q49k292N52K373M18j796j613Q19K452R0k535q29J652
2606b23J625j073k380P3K240J205k090j211J166J720r9j897r47J178J705l58k018
$$ y = [-859, 1190, 998, -1225, -1937, 230, 1238, 581, -2096, -1761, 804, 1624, -560, -2599, -1122, 1362, 863, -1515, -1829, 306, 1126, 470, -1250, -1281, 543, 1569, 394, -1754, -1261, 1113, 1540, -355, -2037, -361, 1827, 855, -1498, -1571, 648, 1918, 710, -1054, -1039, 1174, 1891, 131, -1626, -610, 1813, 1595, -673, -1760, 229, 1880, 1179, -1035, -1131, 848, 2182, 749, -1238, -564, 1629, 2226, 205, -1642, -384, 2382, 1647, -835, -1466, 780, 2437, 619, -1598, -556, 1654, 1995, 260, -1082, -340, 1492, 1573, -493, -1423, 83, 2103, 778, -1618, -1379, 1101, 2189, 7, -1697, -784, 1529, 1535, -803, -1710, -340, 1411, 841, -1622, -1598, 383, 1335, 486, -1806, -1254, 1119, 1537, -259, -1872, -1053, 1399, 1489, -1046, -1875, -223, 1402, 329, -2051, -1978, 262, 1467, -623, -1834, -668, 1052, 953, -944, -1891, -713, 992, 634, -1384]
2623a384q27J988J340o68k351M43J916Q75j963j622J150K549j39k690m94K058
2639A81J564j048k310K55J934Q14j533j715J188K030j56j928o70J169K118r20
2655I73j869m48K004J074j252k070P04K008P89k476r89J522J944n60j865o45J554
2672C98J273q00j707J29J645R69j256j727L81K351j00k244q30J665K213o41k439
2689g20m45K075J162j569k066Q55J913O45j973j110R65J741l56j887n14J762J402
2706A880q35k028j53K049R30j555k009N23K703qk559r94J916J582r44j941J79
2723a264J796Q23j314j412O00J578N87k087j256J239J682N0k411k78J504J655
2739A492j280k062K40K240P77j821j374J260J660m59k058j51J069J563r98j604
$$ y = [-1384, -2211, -223, 1117, 449, -1902, -1459, 457, 1332, -631, -2253, -1103, 1446, 1307, -1383, -1877, 181, 1745, 697, -1613, -1358, 576, 1390, -143, -1858, -670, 1360, 1204, -724, -1394, -225, 1893, 973, -896, -1344, 660, 1734, 482, -1588, -884, 1124, 1913, -563, -1552, -30, 1914, 1354, -511, -1156, 398, 1671, 871, -836, -707, 938, 1907, 651, -1076, -695, 1656, 1556, -688, -1518, 147, 2360, 1719, -720, -1165, 910, 2072, 503, -1563, -708, 1205, 1850, -123, -1233, -268, 1473, 1117, -770, -1284, 478, 1880, 1045, -983, -1136, 913, 1843, 288, -1721, -1198, 1505, 1497, -1062, -2056, -140, 1442, 498, -1443, -1264, 532, 1355, 41, -1371, -771, 807, 1394, -693, -1949, -710, 972, 1022, -1389, -1667, -163, 1492, 212, -1850, -1610, 630, 1407, -414, -1788, -528, 1132, 673, -1385, -1536, -467, 1096, 98, -1506]
2755a506j89J709J155r35j565L17J813L35j329j704J171K137n50k213p16K053
2771a7J633j251k265O79K370P6j478j400J311J383M4j507o85J223J354m24j875
2788h29q06K355J042j720j547N16K774J95k000j159J337J505l49j733n70J632
2804F43Q90r46j771L76J960N39j458j312O53K177j11j924q79J555J520p78j982
2821h48q2J781J220j609j697O31J689L36k232n71J453J368m05j352l01J234P76
2838A391q08j531j47J628R50j642j658J114K013K15k516p53J945J066q27j738
2854a298K09J817K63j105j163Q98J546m65j488q32P61J657n20j522j61J777J025
2871A399j083j902K81J868O87j804j519J119J959n2k163k50J199J986j644j171
$$ y = [-1506, -1695, 14, 1169, 234, -1331, -1014, 799, 1134, -195, -1899, -728, 1409, 859, -1354, -2070, -17, 1616, 365, -1900, -1221, 1149, 1225, -253, -1653, -342, 1041, 1085, -422, -1107, 116, 1470, 1046, -829, -1635, 720, 1762, 42, -1505, -989, 1785, 1980, -20, -1179, 158, 1663, 1314, -419, -989, 643, 1533, 587, -1184, -808, 1152, 1691, 233, -1079, -426, 1751, 1640, -284, -1163, 392, 1912, 1134, -848, -930, 851, 2071, 462, -1235, -604, 1085, 1421, -811, -1382, 71, 1439, 1034, -318, -619, 615, 1391, 583, -948, -1095, 533, 1483, -159, -1817, -703, 1310, 1525, -991, -1744, 201, 1267, 440, -1298, -1089, 728, 991, -114, -1277, -379, 1167, 702, -786, -1618, -857, 800, 280, -1242, -1403, 374, 1399, 316, -1586, -1305, 563, 1250, -554, -2073, -954, 1005, 953, -1210, -1460, -261, 1725, 81, -1090]
2887a090m19J684O33j045j226N51J513M33j440j203J118J703j41k407m40J712
2903f4J574j109j844N26K260mj755q38J251R61k06j821n23J577J491n22j785L7
2921g94J425R22j313j555N78J798K00j601q70J380J631p44j811j1J395P82j058
2938C54j694Q83J608L35j161j076O73J599j06j710p96J075J362q96j520K83J565
2955G78O75r80j290N50J595j8j881r64J517J288p49j091l35J673O44j164j342
2972a094K01J467L94j159j213J084J385j11j943k91J601R97r72j751J94J274Q04
2989H67j298j126O34J871R1k001l92Q72J449q25j505k7J655O93p45j474M76J549
3007G64L62j453j436R52J435m6j776l8J552J120r80j699L05J198O81j259j161
$$ y = [-1090, -1509, 175, 808, -237, -1463, -912, 601, 1034, -406, -1609, -491, 1212, 1071, -1336, -1776, -64, 1510, 401, -1443, -917, 1343, 1339, -416, -1254, -3, 958, 752, -1069, -1592, -15, 1476, 954, -831, -794, 631, 1553, 240, -1315, -737, 1061, 1261, -340, -1210, 170, 1801, 1057, -754, -765, 630, 1412, 354, -1340, -457, 1151, 1486, 325, -751, -78, 1521, 1415, -295, -1091, -16, 1346, 450, -1070, -787, 778, 1453, 473, -817, -267, 1328, 1310, -571, -1535, -18, 1270, 521, -570, -905, 768, 1412, 248, -1094, -893, 574, 968, -191, -1404, -320, 1065, 954, -989, -1280, 321, 1318, 346, -1405, -1211, 63, 867, -431, -1557, -923, 948, 1039, -962, -1354, -482, 967, 142, -1363, -1390, 265, 958, 213, -1261, -785, 764, 1126, -327, -1763, -811, 624, 578, -1198, -1236, 316, 1436, 456, -1243, -938, 260, 941, -318, -1479]
3024a479Q23J314J20j146j326J525J238l4j842l53J542O60q46j391L20J753M16
3041A294j441q19Q24J324n12j196p12J646N89m45j373J38J819N49j348j458N08
3058f13J717k43j625o17J491J514l61j769k13J489J036j294j338J54J269M99j355
3075b59p91R79J624l20j584n88J383J045j046j522K93J489N60j099j195Q74J589
3092A432O6k045o12J177J047o09j440m7J621P55j293r25J86J447J06j267r42P03
3110f40J358k5j486m05J510Q00p42j403j31J561N32j453p71P20J374J23j474o25
3128a177J012J460j139j506l59J526J136j193j282P27J766j82j144r09Q08J395
3144I39p64j480r6J460J165j080j211K10J438K16j158j183J095J154J9j187p98
$$ y = [-1479, -656, 658, 778, -368, -1694, -169, 1069, 1035, -807, -1160, 382, 1042, 196, -1195, -875, 878, 1294, -147, -966, -142, 1182, 670, -526, -1238, 408, 997, 552, -821, -683, 1136, 1685, 337, -1121, -613, 1104, 861, -764, -1381, 110, 1624, 1263, -506, -719, 770, 1806, 512, -826, -672, 597, 1096, -259, -1050, -71, 1553, 1233, -351, -939, 444, 1489, 443, -1079, -786, 703, 1263, 164, -1031, -157, 1432, 1498, -547, -1159, 18, 1065, 456, -984, -1031, 590, 1345, 52, -873, -687, 760, 866, -401, -1343, -640, 718, 693, -793, -1198, 312, 1112, 370, -1033, -1164, 397, 929, -524, -1295, -575, 799, 922, -552, -1177, -165, 1295, 156, -1350, -1709, -183, 953, -240, -1522, -795, 971, 789, -355, -1264, -456, 939, 175, -1305, -1401, 59, 1224, 144, -1067, -857, 581, 797, -361, -1544, -449, 705, 724, -463, -1261]
3161a261J554R34q06j394L5J460N27r46j404M16J744J07j429p70J204J343L5k047
3179f98k37J268R76r64j298M20J245O96j578p35R56J194k89j344n58J298J026
3196A378n37r14l89J399N11j177j088N27J272N23k002m61R43J112k82j330K8J012
3214E25N92p38j006P4J120N59j132r74R05J343j84j613m18J049P77m75j344K04
3232g36J016R52j062r58J51J603p5j533o62O72J321k30j692J95J288N49n32j333
3250a066K55J253M82j189j240Q18J587o07r32n67J344R33q86j514Q6J608J91r37
3268c81j007N52J521j06j426l48J085J037o15j453M8J185N84n70r63K17J295M02
3286A057j614r78J341J326m44j435n00J273P77m03j118J49J490L22j217j052P16
$$ y = [-1261, 293, 1227, 421, -973, -938, 522, 1049, 103, -1301, -885, 859, 966, -463, -1233, -29, 1314, 1349, -698, -935, 333, 1309, 345, -953, -533, 712, 1408, -170, -905, 51, 1245, 956, -388, -946, 352, 1378, 841, -73, -462, 937, 1448, 271, -817, -290, 982, 1505, -497, -958, -15, 1097, 815, -515, -487, 525, 1117, 379, -627, -553, 567, 1126, -6, -980, -75, 1268, 1084, -529, -947, 102, 879, 404, -940, -736, 280, 1232, 170, -788, -637, 966, 891, -642, -1304, -632, 689, 459, -1233, -1038, 250, 799, 267, -1066, -811, 442, 924, -265, -1505, -687, 900, 293, -639, -1206, 138, 1071, 185, -1329, -1243, 365, 556, -381, -1388, -836, 685, 579, -847, -1195, -110, 927, 312, -1141, -1093, 92, 676, 106, -857, -640, 655, 1057, -557, -1535, -194, 1132, 688, -747, -1247, 26, 803, 400, -718, -569, 921, 1243, 26, -1026, -310]
3303c10J115K7j191l28Q62J052l81j276j35R00J145r86j483L75J577J77j387o09
3321h56P49J229r9j470l56Q93R76p45j222J58J649J46m61j112J11J449O6j398
3339b93n87R54J001m04j340l13J825L49r51j135O43J146k31j016p15J020R83k63
3357F73p61p45J045Q99o95j443K14J432L95j361p55O52J350N3j503m60P52J171
3375I13r22j047l7J326L60l89j457O89J040K68j222q96Q11J094j98j482M0J206
3393I7J018q42j005m03J593L15j168r26P77J100j45r32m20Q33J229q31r70l24
3411a004J432N84r57j277O44P97M85r44p18R40P21J56j664l68J302Q39o74j068
3429g74L28R92L08r47q43O78J163m87r05n28J186R31rj596p2J170P09p51j549
$$ y = [-310, 805, 832, -359, -687, 175, 1227, 846, -430, -565, 335, 1480, 494, -989, -614, 963, 1140, -247, -856, -107, 1122, 1023, -447, -803, 90, 1066, 321, -901, -743, 906, 1052, 591, -521, -410, 1039, 1105, -293, -880, 74, 1075, 671, -669, -982, 843, 1192, 241, -894, -251, 895, 664, -352, -1067, -47, 936, 673, -88, -833, 212, 1111, 416, -1027, -813, 619, 1014, -347, -1102, -450, 900, 953, -550, -1010, -258, 913, -9, -1056, -1093, 233, 593, 204, -1253, -564, 476, 744, -478, -1374, -563, 531, 333, -1149, -1109, 97, 1115, 273, -732, -1135, 458, 773, -395, -1321, -544, 556, 411, -521, -941, -108, 1121, 290, -680, -1004, 428, 1012, 55, -1222, -578, 219, 704, -240, -958, -18, 703, 859, -805, -1173, 129, 968, 294, -774, -446, 546, 854, -93, -936, -258, 905, 418, -487, -1015, 171, 1102, 1093, -503, -575, 595, 1304, 553, -996]
3448i96N72J218J49j300m04P58J372o95r06o29J302N60p39r35L23J057J62p96
3466G3q34M24J487Mj250p54J132O93m20j323P1J388L00j148p45P18R12J84j020
3485a08p36R16P26k73j089j71R97M77o81r35J96Q70O40r07j398P71J355j79r86
3504e15k74O97J103q46j258K20J125M08j084o97M53J132Q0j055n46N62J076p0
3522E11j620L01P16P36m92r30K24J157K94j166q96P02J180l01j054o36J060J070
3540H56p23q47L5P31P12o33j141N03J250k58l16j141Q33J020l51j285Q6Q30M80
3559F41m01r97K03J257L94j123p68O18J059J19j460l51R62P93q70n59J17J082
3577G16M24j124n67N29J028j39r69o60R04O27L1j235k12J168N02p58j045K86J137
$$ y = [-996, -424, 794, 943, -357, -761, -3, 1369, 674, -232, -861, 441, 1001, 262, -673, -350, 707, 869, 73, -761, -337, 1150, 1154, -96, -850, 282, 975, 555, -768, -697, 691, 991, -157, -902, -184, 728, 912, -108, -844, 72, 798, 525, -564, -735, 262, 739, 58, -877, -681, 189, 829, -78, -1476, -705, 650, 471, -515, -789, -92, 1011, 165, -1093, -873, 252, 660, -424, -1121, -668, 464, 544, -511, -1057, -495, 581, 511, -1109, -808, -92, 644, 152, -778, -554, 603, 897, -269, -1165, -463, 717, 416, -638, -1274, -214, 856, 133, -714, -679, 52, 764, 131, -1010, -507, 743, 485, 169, -972, -139, 881, 530, -755, -669, 161, 641, 240, -757, -554, 703, 1097, -26, -794, -176, 883, 1002, -458, -809, 153, 946, 76, -483, -366, 716, 1140, 16, -551, -22, 1006, 867, -102, -762, 142, 769, 800, -435, -647, 521, 1023, 265, -780, -494, 643]
3596F43J54q92l82L84Q01Kp57n89R36Q40p81j296L70J282M97j192j255P80J189
3615G34r3j100k61P24P84n21q94k37J026Q87o98j366J65J397J10q64q22P31R05
3634F07l57r07l38P38J169k61j605J24J106O10j170q52L96Q90L90q82o13R89P71
3653H05p72o38M8O50N69q21q18K52J217L83q56r39M57J324o13r74o4Q43P47l35
3673D65j014J38R14J89p98n08L33P15J90r80o07P13J008n01q45K0Q00O04r14m85
3693e63K85M68M06o67m80P09O12N4j399j2P64P44m83r89L17Q37J94q54l50L45
3713f2R30l36m89o62M54J113m02j203P6J352K57r03p58L71J051k58p23k08K74
3732a26J012m77o85j03N33N44l05j120K73J070K00p49o93L96Q12m4o18p70P10
$$ y = [643, 797, -95, -477, -93, 708, 710, -47, -636, 300, 1140, 359, -937, -567, 715, 1212, 20, -1235, -455, 734, 641, -459, -720, 4, 788, 267, -627, -864, 162, 1049, 351, -1015, -850, 547, 657, -207, -1029, -298, 607, 250, -657, -995, -257, 912, 651, -954, -830, 276, 886, -284, -1136, -740, 150, 540, -342, -955, 34, 805, 33, -605, -557, 93, 662, -159, -977, -725, 492, 875, 19, -920, -463, 861, 248, -726, -790, 53, 800, 465, -549, -411, 503, 692, -106, -614, -281, 434, 624, -356, -963, -250, 758, 257, -588, -568, 232, 836, -78, -563, -278, 190, 596, -71, -551, 158, 770, 824, -575, -587, 177, 921, 438, -551, -234, 603, 797, -57, -407, -62, 868, 532, 43, -619, -165, 948, 546, -657, -581, 771, 1028, 125, -633, -262, 789, 531, -192, -400, -126, 886, 409, -276, -379, 154, 698, 393, -727, -454, 616, 816, 67, -626, -230, 582, 538, -80, -850, -140]
3751a40Q75m13o92m56R49O35n40q40J82R58M2q29o63N78Q54k39j196j1P38P64
3771E56l59j298L63R59J98q44m34N40O31K57r12m52J018L23l49r60j43J054N44
3790F92p19n19J2R70J75j049m89P28Q21j26j069k14J214J96p05m60J46N49K07
3809C60l67o66M47O49K57p75o68O73P31j87j160K1J325Q7o46r66M55Q87J39p00
3829a04o65R04O65j80j153J56N85L77l12p20J24R55K42n84p48O1J177mj195k72
3849f91O88R94o87p37n1Q78L58n61o38J13J270j79j042l29O61J067q27o49j38
3868e00Q51O57q85q02O8J039K92r77o56M72J264m37p62r9O17O33m50j304N16Q99
3888D36Q4n90o81M38Q99k52p24p72J256N52m04r72j26Q13O85o23o56J79O80N38
$$ y = [-140, 735, 322, -370, -826, 123, 758, 218, -622, -440, 518, 560, -269, -932, -354, 500, 261, -935, -946, -208, 556, 197, -1101, -738, 221, 419, -425, -859, -319, 312, 569, -343, -795, 223, 546, 197, -763, -906, 148, 692, -27, -546, -534, 436, 611, -438, -927, -199, 622, 496, -573, -787, 427, 623, -82, -542, -396, 153, 360, -7, -673, -226, 423, 680, -95, -763, -90, 641, 454, -706, -685, 640, 727, 81, -885, -430, 457, 596, -104, -769, 135, 800, 620, -533, -377, 208, 585, 273, -447, -323, 632, 874, 290, -458, -397, 780, 776, -419, -691, -3, 991, 304, -433, -484, 394, 752, 191, -447, -334, 936, 757, -285, -614, 47, 1114, 287, -362, -500, 351, 1008, 123, -679, -611, 428, 720, -257, -913, -441, 823, 386, -376, -475, 142, 775, 325, -979, -463, 436, 520, -70, -751, -313, 586, 334, -390, -1162, 94, 646, 242, -730, -856, -43, 642, 19, -637, -458, 222, 760]
3908G60j055m93M72N88r7p11m51R95O86m49p80KP43L90q08n69J21J119P5j045
3928e07m29P99Q69l90p94l88R16N95m77j137K50J426j03j000l30P26P75j71r87
3947c57j85M40Q12l12q52J05N65M73n27p89M32P93J28j165j6Q56L67k44q29k2
3967c27Q07K83n72n49p1Q20L78p69p00P53M51N1q46j13O21M86m06o89O2Q31M27
3988I28o94r07L95J164m37p57j33L12R85q38p20K15O84K99n05m37L29M25L23j085
4008d54l22P20N76J13j266l63J062K98k29q97L00O31M01o71p40M95Q32J16q22
4027b20m72N16P14m39o61j4M15N75k04q01l80J198O0n90n93L53R07K7r42l26R10
4048C3K28l39p81P75N23J39n52q21O63M46j51m42k96L40N48j62p81J5P04M98p27
$$ y = [760, -295, -788, -316, 272, 175, -536, -987, 8, 694, 245, -535, -533, 210, 600, -208, -777, -656, 463, 538, -507, -936, -137, 732, 342, -452, -840, 76, 671, 194, -943, -693, 733, 630, -370, -700, 26, 801, 630, -357, -542, -102, 710, 398, -454, -349, 216, 689, 162, -627, -195, 598, 726, -439, -455, 401, 768, 524, -305, -327, 480, 763, 191, -358, -429, 391, 769, 0, -700, 53, 504, 555, -291, -404, 217, 703, 297, -392, -330, 501, 928, 234, -673, -278, 886, 449, -308, -441, -129, 856, 18, -702, -487, 197, 496, -9, -446, -117, 308, 631, -454, -776, -56, 520, 633, -633, -996, 66, 364, 135, -762, -462, 169, 570, -101, -841, -346, 486, 602, -220, -692, -176, 538, 99, -562, -576, -161, 414, 210, -591, -971, 227, 287, -303, -896, -543, 364, 391, -551, -877, 33, 261, -78, -859, -84, 439, 578, 26, -795, -132, 314, 163, -279, -575, -235, 313, 151, -630, -615, 89, 587, -140]
4069a40n22J94J052J82q17m68M10O29j83q84K69O52K76j49j041K04J070q5o28
4088B1o86N19R51l21n44j34L57M94j88r76N5Q82R2k76q62L65P49K89q99n90P17
4109A5N23q3o90m7K92M29j75o19k7O24M17p16n63L43R59k9j038k40Q34N10k82
4130D37j027L16N12N41q69k91j4N15N27j008j59N10L99J43j271J07O30M53m60
4149ip44K73O62m4l49m83L78M30K45p26m64O32K50K24q92k28P92P41q54m26R0
4170e02Q15r3n69l74M72N85r0q85J40M32N64n56o51J67Q24J10n20p31P78M36K39
4191E91q12j88M43K42O0o74m4M37N82o11o75L75O72n0n34n37P81R66p24n99l7
4212c36L91Q03o20p66M83M45J81n52n40O30O36k73n36l95M08O79n2r16q4P96K62
$$ y = [-140, -662, -468, 584, 766, -51, -519, -109, 520, 337, -547, -278, 374, 650, 501, -540, -336, 734, 649, 21, -665, -146, 805, 484, -60, -194, 163, 657, 469, -507, -452, 430, 522, 246, -616, -251, 498, 787, -112, -702, 15, 538, 455, -235, -282, 10, 439, 264, -355, -382, 242, 659, -57, -620, -277, 682, 653, -385, -625, 209, 719, 437, -590, -274, 238, 779, -90, -381, -395, 120, 647, -361, -520, -10, 389, 532, -739, -632, -2, 451, -9, -753, -480, 182, 138, -211, -694, -316, 114, 359, -367, -831, -199, 51, 275, -617, -845, -53, 688, -166, -592, -502, 313, 220, -349, -723, -251, 334, 244, -641, -501, -69, 495, -61, -712, -545, 279, 389, -131, -862, -84, 352, 591, -221, -409, 34, 276, 336, -338, -382, 55, 637, 26, -649, -274, 398, 348, -186, -723, 58, 1024, 300, -299, -336, 55, 858, 238, -528, -45, 400, 581, 29, -511, 119, 755, 482, -54, -449, -41, 638, 586, -330, -414, 382, 644]
4233F44m42n18K66P50j25o87k57P83M06l08q53n8N43K52k67m61R3O56M28j085
4253b40k67K22R49r1r49q1L13P72m39p10p1R30M58q37n69K51Q49k03p15j8L80
4274f6K90j36n43j91O32L17j80n26l32J215j92o33k13L21M51q5n28j75O71L34
4294D31l34o04k6P06L07q06p05N65O23O2o16j22L65N74l7q97K7K66N83l89l24
4315c51rO49M2l51m42N20O02m58o16j96N25O69l82n95J1N03L15m81l34L34M50
4336D05J15n78m72N88O24k04q04k9O99M99n88o50k4J282l52p14N7K5N22J48n25
4357B4o23P68N07l37q29J17P74L60r68k32K23P17P2m87k39J29P16n36n16r7O79
4378B22O44q03l82L05L50R5k16n68K08O90j89m00l77N08N63j79r95L13P37j82
$$ y = [644, 202, -316, -50, 700, 575, -112, -369, 414, 820, 512, -341, -399, 144, 396, 129, -332, -239, 417, 845, -240, -507, -285, 664, 573, -376, -457, -144, 628, 189, -521, -592, 338, 796, -41, -610, -359, 490, 287, -428, -446, -66, 224, 88, -455, -646, -14, 303, 123, -403, -735, 480, 288, -345, -558, -237, 214, 129, -399, -574, 97, 431, 97, -507, -533, 173, 480, -326, -1031, -466, 157, 219, -397, -519, -154, 420, 383, -514, -487, -221, 362, -27, -351, -360, 289, 331, -20, -462, 58, 660, 202, -414, -610, -85, 584, 202, -393, -382, 121, 436, -45, -379, -45, 405, 520, -58, -530, 58, 682, 478, -326, -355, 344, 843, 255, -395, -419, 863, 511, -203, -146, -121, 401, 549, 24, -599, 169, 676, 339, -490, -373, 401, 761, -207, -439, -216, 501, 573, 86, -153, -24, 692, 156, -360, -457, 222, 866, 63, -319, -14, 336, 431, 215, -353, -145, 545, 356, -44, -421, 87, 650, 471, -524, -211, 526, 344]
4398C44m22n63N52N29l1n11j14K10M36l54l46m06P17N69j072l18K41Q27L02j012
4418d22k33N04K67J17l73n10R37K06n31p40J55R28J00o50l54L92M70J49p34m12
4438g34Q78K37l63k59j00N67J96M2q35JN94nl46o28N37P04j67q68K48N44L75n72
4460D6l98J32P20M8m59n98K20P50P5p56l98M46Q71k08r30J18P99M20p80m53L1
4481c04P41k22l08l62M46M68q3m12m14N94N48l14q44N43L74L1o66n1J99M10L0
4502D04l95l87K29J101n19n76m18Q14K22q16O9O3M41J05m94j95J63R25o03k32
4522i9l91K72P47l82p64J48J061N1j018Q0L20M60k65n81m78Q75L24k50o09OM61
4543c2M10o85l04N3P85K13q03N6K07M59k05m33k89O81J97l17n38R4O46O09r96
$$ y = [344, -78, -641, -89, 440, 409, -102, -216, -6, 430, 76, -270, -676, 41, 610, -462, -780, -539, 288, 590, -422, -655, -151, 116, 233, -140, -650, 287, 493, -38, -778, -623, 305, 405, -245, -599, -207, 263, 412, -322, -734, 144, 381, 18, -241, -341, 226, 422, 464, -371, -370, 224, 219, -127, -755, -218, 486, 319, -549, -301, 243, 618, 46, -352, -220, 500, 548, 89, -509, -289, 461, 536, -220, -618, -172, 699, 491, -439, -321, 478, 898, 118, -335, -304, 437, 215, -93, -455, -9, 459, 376, -36, -450, 144, 692, 378, -466, 77, 451, 482, -184, -235, -36, 374, 404, 9, -378, -149, 952, 433, -143, -561, 253, 475, -341, -272, -209, 232, 337, -157, -352, -189, 736, 133, -99, -490, -218, 529, 147, -617, -469, 592, 643, -375, -295, 25, 485, 220, -361, -839, 36, 360, 110, -499, -493, -32, 378, -307, -611, -558, 227, 440, -363, -307, -100, 359, 154, -279, -568, 113, 310, -7, -545, -451, 195, 804, -192]
4564a92k96J74P43j85o07n5K69N98m18m68k65O68L17k27l16k27M88L65l39q07
4584g80Q21M41l33o98K15M86L54n03n43L04O37L65n73l95K48M59q5m59l00O12
4604B73J82l28n26K31R3M89j99n25P7P36j12m31j91L43M38j15k32k02L04K20l62
4625A63n24K24K21L30l78l23K56J26L52p44J9L37L13P2m90j71O32K62o79k73L04
4646B9Q6L88o87m28O18M21j54p67k25N67K79L58o82j92P51j82m11k63J73O61o8
4667B72r13L20K93P13o12m54o2O65L79n07n30J35O92l26k05k91L59N02l31o43
4687e44O2O26J28l43n08M54K28J93m41n08M74L79j27l83k54L96M54l19m23K25
4707b31L62M16l74p08L77L83L30p36k11L71L53l68l26l1M72K12J54p39K85L58
$$ y = [-192, -488, -314, 429, 244, -363, -418, -149, 449, 31, -437, -702, -34, 283, 56, -260, -487, 1, 366, 27, -780, 41, 482, 149, -549, -334, 152, 506, 3, -540, -236, 401, 766, 193, -202, 46, 505, 420, -39, -339, 273, 455, 127, -399, -168, -75, 414, 215, -310, -233, 503, 391, -40, -231, 112, 550, 435, 203, 1, 305, 525, 163, -361, -137, 84, 414, 36, -287, -31, 95, 447, -297, -278, 59, 372, 444, -46, -217, 415, 677, -2, -275, 29, 115, 503, -184, -612, 6, 427, 273, -494, -719, -152, 127, 485, -197, -389, 362, 180, -231, -494, -321, 340, 272, -641, -321, -28, 685, 73, -381, -443, 222, 601, 94, -436, -301, 391, 65, -140, -431, -72, 430, 99, -544, -482, 144, 272, -71, -579, -125, 103, 296, -145, -653, -179, 200, 73, -310, -564, -168, 286, -33, -456, -231, 131, 547, 173, -535, -158, 225, 555, -181, -392, -21, 332, -36, -362, -393, 79, 291, 445, -294, -9, 349]
4727C49M1o05j21K58N81M1p32O6O3O44l17p52K41M29P07o73o20L86L56K01n04
4748C9o19O89P41l01q50j67O44P5k48l80N0L64Q37j156j11N59J32ko86K49N87
4769D46j29k86n77J98O42Rk10n13M26K36K6k63o96R35N50o10p36M39L70M4N1j036
4791f84L61K66M67n20m60L75N75m8o83k42P14L56m25l35j8O35k65k27l35L36L38
4812A81J16q11J13L52N09k33n71J0K70M38o01k05L68K71k3j27o39M00L68j50m49
4833d13k54P34N01m86o28J99P22m6o44l43Q45M0J0n52l2M87J12j22j83l07N56
4854A96K71o51k80L55N09P0n66l79P31M73l70n78q4L13N18o0p09O7M65L84n08
4875A67o69O68L7K78n77j20L35J18m8l88o2L61L39j96p40L83K86L30n03o47P62
$$ y = [349, 390, -215, -336, -78, 503, 544, -188, -122, -59, 585, 268, -484, -243, 186, 893, 220, -400, -14, 342, 543, 39, -580, 109, 850, 549, -301, -468, 176, 251, 3, -377, -327, 37, 874, -282, -393, 166, 298, 296, -390, -141, 446, 317, 31, -546, -348, 294, 303, 93, -420, 6, 242, 268, 5, -691, 244, 794, 184, -552, -113, 257, 301, 352, -684, -323, -57, 410, -110, -570, -195, 380, 332, -351, -593, 121, 477, 52, -283, -301, 334, 69, -158, -493, -157, 181, 297, -514, -401, -49, 460, 227, -344, -334, -64, 374, -227, -432, -64, 207, 184, 57, -582, -182, 186, 36, -413, -667, 67, 568, 82, -546, -347, 375, 329, -315, -658, 187, 227, 237, -315, -347, 140, 252, 130, -53, -360, 196, 467, -184, -464, -109, 400, 470, -96, -475, 256, 729, 359, -219, -303, 10, 528, 468, -241, -174, 291, 675, 167, -502, 166, 203, 481, -96, -216, 119, 237, 189, -199, -261, 100, 439, 243, -497, -114, 172, 502, -1, -648, 114]
4896A14K79l73j06o9J73O17n33l46R0P2L45l33l34M00M12O0p64k74Q26n7k2n44
4918c67n2N89P9j30o05O21J58j23l31k21L38M71j46o50O8M41K80m76m31J94N29
4939B36J88o63q8N5N44p0n65P1K42M75n30k04j37P63k7l81k74n3Q11N2p74Q4J67
4962g8N13l43o92L48M34J90l44l71M0P36J48m77l41J41O57n40j57KL36L01p7p21
4984b95L0O78J26m37m05L43K11J5k97l83K75P52l97o26o9Q26r6L7n85K82N55r3
5006D47l30o44O35M80l77m82k35N30M63j28p53P8N79K57n29l54M67J90J50l99
5026D5n22O50L09m39l79LL86K39k65k82KP17r6o43l20O54J88J19n45k48R6N74
5048B43J31p01J72M84l8n51j31N98j70L55p22j44L79M51k76l84l7O14R9l18l46
$$ y = [114, 393, 20, -86, -155, 18, 635, 102, -244, -154, -82, 263, -70, -404, -4, 408, 468, -296, -570, 256, 199, 177, -367, -419, 170, 249, 119, -486, 135, 293, 170, -161, -382, -44, 427, 281, -369, -301, 140, 420, -56, -487, -293, 236, 424, -239, -327, -272, 272, 202, -363, -292, -50, 425, -105, -309, -446, 317, 290, -91, -365, -418, 393, 445, -329, -245, -78, 435, 92, -600, -252, 182, 372, 28, -343, -303, 433, 581, 104, -237, -96, 561, 21, -136, -134, 202, 503, 426, -295, -265, 413, 539, 102, -303, 40, 251, 266, -31, -414, -139, 613, 216, -410, -479, 347, 251, 288, -297, -15, 540, 447, 117, -527, 108, 588, 211, -271, -506, 24, 487, 359, -394, -316, 263, 520, -9, -363, 104, 294, 444, 45, -477, 173, 482, 43, -336, -333, 53, 292, 27, -255, -253, 464, 368, -275, -595, 59, 247, 366, -179, -427, -331, 243, 374, -327, -155, 329, 291, -260, -391, 207, 37, 392, -330, -474, -95, 356, 80, -304, -341, 273, 372, 54, -292]
5069b92R9L59J28o29j81N73M33n23m84KK97L53j49m27j46N92L16k05n71J54N16
5090B15l56J07m79N55N75n60m28K6N82M11o24n09K33M52J40l55m52L95N47l22
5110A53m61J35K63K05l05n64N89L60Kl79o5J0L12J3m20j72M66L01j71m37k37O03
5132B01N07q96l51N86K62Q6l43j95O6M36j72l23j59O31J50l00m85J47O56n2o22
5153a70m35L72O88N1n42k32K34L58k8l08k30M5N92o46l12L44K32M36o18k39L05
5174a03L95K5j129L68N12K26jr23L52M51L43o79q3P0N48l45n24K6N13M31o34Q
5196a53j84L81M62o57k61R8M97L16m74n20N53M35j72q32j77O92M36p74p3J03M81
5217A77J52l45k13O8M98j52n01k54Q97K51r83M4n5Q95K35q60j79J29M32k50j26
$$ y = [-292, -193, 166, 294, -335, -516, 57, 490, -33, -517, -515, -218, 135, -14, -441, -587, 5, 321, 116, -455, -301, 215, -141, -34, -513, 42, 617, 57, -371, -345, 237, 648, 24, -485, -252, 200, 340, -15, -467, -72, 475, 153, -308, -173, 90, 295, -10, -574, 15, 375, 377, -2, -67, -57, 255, 268, -152, -324, 142, 443, 272, -165, -402, 201, 708, -188, -539, 47, 309, 395, 52, -143, -77, 359, 187, -136, -295, 336, 486, 186, -299, -152, 504, 452, -170, -605, -233, 455, 506, -36, -268, -34, 324, 296, -12, -242, -197, 395, -251, -563, -219, 13, 449, -169, -408, -103, 292, 317, -812, -444, 68, 294, 293, -630, -278, 173, 516, -163, -246, -176, 372, 27, -497, -471, 42, 473, -161, -153, -337, 44, 506, -151, -412, -314, 183, 499, 25, -495, 58, 493, 321, -511, -688, 4, 440, -334, -407, -304, 177, 329, -16, -229, -161, 337, 185, -316, -570, 327, 578, -405, -361, -416, 479, 714, -146, -325, -196, 236, -14, -140]
5238a40J02n9M32O5l26k10M14L1k44n04K08L94L79n11k01j22N91J04o26q7L28
5259A8M42k25o26L39M54m3l79k37K39L65r4l14O8p1N37k85l80j69O69R9m93m33
5281e19N53M95j28m65j86L78m4J44o10K0O07J44n6m07l27N30L27n10j66P2K84
5302A36p4o29R5N75j01J53m76P2M90J18k69m05l30R48nn82k75L07O30j45o24j35
5324e26M47M40m05n40L24L49J78l68n01N32N22p6q98k3O61K38J52r48k93O58M98
5345D21n95l9k24N68L85n44p67R78K47l62n09J35M60N8k51k08P8M28l82K86p63
5366f00M87L27K48o49oP18L1o63k63K92N28k29k19l44k0Q39kp16l29N97M55k18
5388B64m98k13N29M82n21j99R2M16J17k71m51m8P11l59j23l7Q0M00k24k92j5N77
$$ y = [-140, -38, -97, 335, 400, 74, -136, 278, 309, 65, -439, -231, 163, 542, 31, -170, -292, 299, 403, -223, -310, 18, 460, 235, -391, -52, 402, 359, -20, -257, -18, 347, 253, -61, 7, -64, 473, 188, -192, -361, 308, 407, -86, -519, 34, 529, 401, -64, -250, 128, 84, 228, -382, -362, 245, 389, 333, -74, -401, 129, 456, -54, -220, -148, 136, 62, -567, -472, 103, 2, 155, -321, -249, 241, 359, 90, -315, -645, 303, 298, -284, -559, -252, 378, 233, -391, -526, -79, 361, -44, -584, -260, 89, 267, -101, -602, -70, 452, 376, -522, -545, 116, 354, 506, -442, -735, -77, 421, -174, -213, -437, 131, 516, -28, -795, 183, 430, 68, -441, -306, 154, 212, -39, -247, -169, 259, -123, 163, -600, -113, 214, 462, -187, -193, 525, 556, -107, -370, -78, 450, 221, 2, -342, -362, 477, 475, -241, -570, 27, 482, 264, -234, -447, 82, 564, 43, -156, -64, 352, 469, 198, -253, -301, 410, 51, -72, -109, -29, 371, 147, -145, -160, 417]
5410D17O7n40m15L25M95n3k49k31J97N79j89n30L1M92k9l83j39l00K44M38l97
5431a70m90N44M77m7j81m89J21O41l05k35j74M36J92m45j37K19M40j76l20l07
5451d06L70L84J31o72j07L02k1K06n07O3L38J65l22n59P54J81l13k93j85N18K29
5472B56k12k90k02M38N6k01l01R2N32M2l54k25K00L72J19n55K3kL51m5n26J36
5494b96K71J83n12O0N41p9J12o14o0L39L49j33m26PN96J78o22J76J5L15j74m46
5516b20j28N49L35j92n77k0N80J85k60l83KM22L41m65m91L20M87j33n00j52N53
5537B53K55k81p1j70L73o1j61n36K39K42L16k12p14N82K72K4r69L83K80J1R4n8
5559I1k12M10J14p13l40L68P07j78m76j36N69K96n01k13j12L12K57l67j83M23
$$ y = [417, 484, -56, -471, -146, 349, 296, 47, -184, 13, 592, 403, -127, -96, 396, 367, -16, -155, -455, -211, 227, -170, -660, -116, 361, 314, 133, -356, -235, 406, 101, -134, -308, 128, 320, -125, -262, -43, 397, 221, -99, -406, -36, 348, 479, -193, -300, 2, -19, 187, -320, -257, 81, 246, -76, -635, 119, 300, -13, -306, -491, 27, 256, 44, -246, -448, -10, 46, -155, -456, -364, 168, 210, -144, -369, -169, 203, 322, -233, -210, -212, 139, 94, -432, -296, -25, 158, -354, -294, 247, 168, 280, -334, -394, -55, 294, 161, -265, -258, 338, 516, -106, 70, 85, 400, 226, -220, -348, 201, 536, 344, -233, -253, 327, 512, 252, -131, -129, 293, 634, 169, -322, -2, 485, 352, -148, -300, 253, 508, 227, 156, -14, 359, 298, 137, -399, -160, 82, 398, 186, -528, 54, 326, 350, -619, -236, 44, 55, 149, 91, -121, 289, 403, -310, -650, -282, 425, 247, -229, -365, 204, 500, -1, -214, -326, -14, 243, -124, -307, 116]
5579A16J86k31k70k76L88J71K17l63l94M38M64l78m87N9M44j5l83m5M82K12j88
5600A47o53k0O40M07n11j85q0M82L83q34j37J36L82J44o11j67O20j03J31l36k32
5621c97M17K83k14n03L44M90N5l28o53M35L25K36q27K6L66J07O3k30l2K29K50
5642D42n48l99P33K08P9p90L1K68J24J53m16LL87k6k39k48k1L70J89k88k35O5
5664a58N10k19l48j51N13M25k68n08o1N82P0m11k72M6L86J59n35j09N34L36m69
5685E2l76K82K63j51j51j44j45M33L63m08n17P79j27o5o35j02N42N13o55j46L81
5706a4M13m3m57k3k36M40P7q3p36N07N28j93m50qM53K40l48n16K49M50N9m37k74
5729d02J82P29l44k07m61N48J83l34k32K14L39k6l89j40K67M27k27k47q1L6O32
$$ y = [116, 302, 71, -199, -475, -87, 84, 301, -62, -456, -18, 446, 68, -419, -360, 84, 69, -314, -359, 123, 335, 147, -506, -526, 114, 521, 10, -175, -255, 227, 610, -224, -361, -225, 157, 301, -310, -477, 143, 40, 171, -165, -397, 20, 303, 89, -414, -70, 420, 475, 147, -506, -71, 254, 490, -337, -311, 55, 162, 225, -5, -37, 192, 442, -106, -505, 228, 436, 515, -275, -244, 24, 148, 301, -115, -112, 275, 249, 10, -238, -259, 111, 300, 12, -223, -158, 352, 133, -215, -366, 147, 572, 304, -204, -265, 317, 387, -24, -296, -250, 136, 295, -240, -349, 185, 521, 52, -324, -42, 221, 70, -81, -225, -370, 63, 426, 18, -499, 280, 153, 88, -547, -649, -107, 406, -249, -395, -14, 399, 356, -101, -124, -360, 80, 157, 74, -662, -155, 373, 180, -270, -278, 175, 415, 67, -449, -200, 250, 309, -128, -402, -220, 509, 165, -42, -503, 45, 228, -106, -338, -124, 215, 189, -200, -340, -73, 354, 127, -120, -201, -165, 467]
5750D67j32m89r4M84r8j14j37J17L97Q1o91j3M0L01M20o02k83N14J88j01o51L19
5772g7O37n5m65l9J1K68N8n04j4J82N66o24j52J35M56K7n05l73N22K82J70n04
5794Bj51J46M04k94l54K04J48K41l96k33J70L26K17l27n65L34M93j75l39j38M46
5815A59RJ04r84N80K68K96o39j31M45j11L20o70l1O27J35n17k31K09N8K70j98
5836c2l38J13M71M4m93r5M61%K74n52j51K15L31j02m78P0M28j37m88L4O9M21N9
5859A24k59j37K87J43j43m05l9N18K9k4m96K64J86Q7l83J22j44N10J8l89l53L37
5881a47L34o5k87O7O05r3o35j75K61K70j7j42m21M76O8l2m17J0N23J95k08n27
5903c57K36K77L35q08N6K53J84K24p23K93j71N45k19n07J58L98K87l84n51M40
$$ y = [467, 335, -154, -248, 236, 138, 24, -113, 4, 401, 482, -209, -222, -182, 119, 539, -63, -346, 168, 356, 255, -396, -77, 560, 505, 40, 1, 12, 280, 338, -166, -180, 2, 568, -56, -208, -73, 383, 410, -95, -468, 54, 336, 506, 2, -149, -3, 401, 107, -247, -43, 105, 346, -50, -283, -113, 213, 430, 103, -462, -128, 365, 190, -149, -287, 159, 168, 272, -712, -132, 136, 432, -207, -338, 107, -4, 316, -354, -385, 242, 377, -140, -371, -162, -104, 166, -32, -370, -257, 214, 258, -235, -330, 131, 131, 405, -147, -298, -83, 248, 146, -332, -262, 166, 29, -459, -425, -356, 65, 124, -135, -272, 15, 158, 15, -390, -429, 89, 118, 94, -402, -138, 48, 135, -248, -126, -270, 240, 258, -131, -484, -147, 187, 122, -165, -98, 507, 414, -221, -396, -135, 135, 118, -24, -445, 31, 99, 67, -350, -340, 183, 378, 170, -357, -121, 156, 491, -317, -261, -8, 176, 400, -323, -30, -201, 344, 125, -382, -224, 174, 461, 77, -474, -34]
5923c4K72j86j98j70K58J59l4k87J28N9L91r3m71K09L0K95n00j41L15pK86m96
5945b15q5O7L91j18k62M9J02K90k19p0l03N54R3o34j19J99L26R9j51n2R2K3J16
5968A73l84k16P56k41l26k47M98J82l17J83l03K88J37k47l10J92K83n0ll99k0
5989c71L99M7m40j2N23L37k68l70r4L89Ll41N5m4M20K89n49j58J53M50nm11j10
6012a08l1N85k74m42J23K19K02k91n28O62K19r9m96J20O0N89l49l40J16K59L91
6033E87m46n65J37N37j19j01l87J75O51k92j16m13M55K30p2n50K15K88J27k57
6053H4o52O39J37J30n05n0J72K81j0n07J95J56L43k66m47K29K70j62k97K44j56
6074a72M38k14k13J8L48l5j32k83L1N31q7m57l22L94K74j7l14J83J1j7Q3k19l
$$ y = [-34, 238, 52, -146, -316, -58, 101, 67, -220, -92, -33, 358, 265, -206, 3, 33, 328, -172, -313, 2, -5, 281, -215, -300, -233, 158, 40, -222, -173, -71, 219, 0, -70, -373, 181, 274, -360, -479, -280, 46, 145, -6, -58, 34, 57, 173, -211, -427, 329, 88, -238, -485, 13, 195, -122, 61, -242, 46, 183, -64, -374, -182, 101, 51, 48, -351, -371, 28, 75, -365, -377, 146, 483, 215, -155, -249, 140, 143, -198, -143, -187, 233, 522, -27, -185, -32, 418, 413, 2, -108, -139, 446, 172, -270, -147, 72, 274, -17, -545, 117, 336, 237, -259, -139, -79, 510, 161, -179, -63, 196, 587, 141, -424, -287, 250, 131, 30, -357, -182, 469, 177, 61, -352, 103, 333, 261, -289, -74, 214, 341, 84, -568, 71, 208, 338, -167, -217, -45, 236, 226, -281, -86, 70, 413, 147, -300, -71, 199, 37, -260, -16, -172, 266, 52, -161, -143, 205, 170, 38, -245, -214, 317, 230, -227, -549, -155, 119, 102, -212, -29, -18, -35, 48, -171, -174]
6097a74P5L67k40l80J61M00K23k42n65M50K77k70l66M6M28K06m47k19j05N86m7
6118A64L7n85K62M93j83k92l21M43J58j15m32J15P2O85o51k67K08J38N84l84m79
6139c50J21O44l26l59p7N42L79m57l43J95K51J62l33k67J68N53k92l25j46L83
6159A23L23j93m74q2N84J11o22l1L08J82n7j44l7J21J79On11J08K62K10j92m91
6181c17L49k0K08l18O3k15J96J32m4k04L70J34O3p11J35K67q3k96J8R9N17j71
6203A72l35j25K30L03r9k78R5O6L89j99o77J11O94j71k74k94RN62Q8l46j90L72
6225A03L6j49j39j21L43L28m3o19j06O20P1j42m22L03P7j32q5k89O49j25J2o63
6247d93L39K83Q7Nn30L67K46j04n56Q6L01Q0m9j34l2K39L07k88m13k62N12K68
$$ y = [-174, -99, 268, 28, -352, -191, 209, 432, 190, -375, 75, 352, 82, -284, -238, 190, 396, -51, -270, -375, 211, 164, 201, -384, -122, 371, 188, -104, -425, 18, 176, 61, -371, -256, -184, 501, -150, -417, -209, -71, 513, 129, -350, -229, 415, 89, -270, -347, 195, 574, 117, -226, -31, 220, 382, 49, -218, -50, 503, 211, -114, -260, 123, 446, 253, -221, -303, 281, 392, -230, -261, 47, 229, 172, 28, -9, 112, 291, 297, -214, -106, 156, 366, 174, -317, 32, 12, 220, -98, -35, -250, -54, 78, 34, -170, 200, 334, 397, -314, -179, 88, 5, -291, -273, -174, 343, 172, -163, -288, -58, 245, 146, -132, -37, 29, 418, 219, -458, -347, 347, 176, -98, -392, -383, 179, 267, -79, -269, 103, 139, -10, -149, -270, 73, 401, 358, -261, -367, 253, 324, 182, -240, 63, 140, 8, -77, -366, 283, 158, 170, -493, -154, 129, 216, 221, -309, 58, 304, 200, -356, -270, 31, 111, 62, -72, -104, 135, 442, 154, -259, -521, -9, 259]
6269B59o46J78J59K31K15n60j51K25K97n51J22J99M47j53m62j45M97l6K24l34
6289A5j77J33L84k20j10Q9J21L9k0n65L26k67K32j00j35M28P6k34l26K80L50K19
6311E38o78pJ59K29p3j75m57L15O28m01j89p1L87J09k01k89j64K96K75r5n43M03
6333dK33J14l46k88M65p0l5m9j84K18O4m11kL73P2J0r9k26M16j60J44k69m8R5
6357A3j33L01m64J26M17j8n44J14q8q3N59m94p7K85M86J3o87j52N99L93p22m14
6379e70M25K69J63m42l21M55J95r6j43m13P08K05m4n51M1p0N39j74k28jO65k64
6401C48m90l00K64K74k37j08P4K34J86J90p25M64K76p9l98M8K9N30j95l10j01
6422b6L39M41n56o7j74K68K05m49l98L37J06J52l09M3J94L32l25m73J46J12N74
$$ y = [259, -387, -209, -50, 181, 396, -164, -315, -90, 207, -344, -222, -23, 424, 271, -191, -336, 161, 125, 349, 15, -162, -29, 355, 135, 25, 114, 235, 274, 254, -311, 15, -252, -20, -120, -255, 173, 249, 15, -311, -31, 319, 538, -140, -147, 12, 241, 168, -7, -464, -149, 479, 78, -111, -182, 205, 314, 113, -176, -340, -44, 231, 136, -407, -4, 229, 343, -3, -291, 174, 104, 69, 20, -164, 54, 118, -293, -295, 78, 150, 160, 61, -165, 251, 91, 235, -34, -82, 13, -120, 181, -283, -157, 260, 242, -302, -188, -276, -359, 200, -294, -371, -86, 400, 413, -274, -426, 173, 566, -156, -570, -145, 124, 287, -155, -476, -21, 174, 78, -65, -478, 230, 435, 391, -160, -119, -189, 350, 176, -52, -53, 612, 348, -142, -442, -178, 96, -141, -249, -175, 59, 245, 435, -290, 174, 450, 371, -27, 21, 50, 580, 385, 75, -26, 313, 754, 198, 131, -43, 225, 430, -19, -417, -80, 26, 178, -131, -88, 106, 438, 113, -360, -214, -102, 472]
6443D72l53l45K12K99L5m75k9Q5M28M1n22J59L54j99O6m90J68L41K18m55k54K60
6465A6Q7L8l04j42L18M59j94o21n9O21j19r6k02o7P21m59Km16M00J65j97k91k58
6488e98K52O95o56J59K6J91J96n61j35O5O58k88l86J11K05j1J68n22K41M40k7
6509B23m76j28OO64J84r69M35LK48j30j43o0P9O54o06l37K27M86j91l51j65N30
6531A83K34k52k31J16J38J76j50k74P6M0K57l55k02M07J20L8m60m9M06K14k64
6552A68j64j24L79l3k11q9j12N03K5l45k39K46K30O8m47j68K85O61k97n00k9M20
6574B27R2r1m71J51L84l5k98j32R4L76j14p44N96mK15k21m84L40K68j46k1l79
6596c97N29J72p8l84o3K28M75m03n55P2K63M25l03k75O6M72Q2m80kJ01L59k80
$$ y = [472, 119, -226, -14, 285, 320, -155, -184, -99, 329, 370, -152, 7, 361, 162, 228, -262, -94, 247, 465, 10, -244, 16, 103, 141, -163, -305, 13, 472, 278, -343, -402, 219, 100, 4, -198, -265, 456, -3, -1, -417, -17, 148, -49, -340, -598, -346, 349, -307, -148, -122, 69, 265, -296, -431, -366, 292, 4, -382, -271, -66, -77, 91, -431, -190, 250, 223, -253, -381, -375, 289, 473, -496, -61, -58, 190, 60, -83, -143, -64, 590, -16, -353, -126, 360, 169, -182, -347, 183, 417, 165, -66, 50, 188, 364, 214, -60, 16, 56, 313, -42, -244, 163, 283, 321, -139, -188, 218, 432, 168, 4, -120, 259, 226, 15, -74, -186, 317, 342, -3, -242, 4, 234, 302, -145, -313, -28, 633, 336, -164, -193, 227, 319, 228, -243, -92, 292, 257, -41, -173, -79, 297, 183, -561, 35, 31, 246, 25, -459, -119, 149, 3, -18, -397, 132, 304, 226, -158, -221, 7, 482, 79, -476, -404, -141, 284, -19, -294, -228, 244, 326, -154, -156, -55, 304, 24]
6618B4l40J14K84lk6n05J13M46P5k06n31M67L38k34l57o4M53L88l05m47M8L62
6640I4M6j67j43q9L10J02k54l51M07K91j27k70k09M36L97n01j10k67N12O2l30
6661a61j51M08L07l7k77l48K7L24L26n38K3N87k53j90l14L29J23L14n97M3n1M74
6683C68l24q0k19N07R4K1n63J60J88M6k64j26M23J33l5l89R6J52j5k40k05J60
6705a12K29M29n84m98O60L6J75m31j10L10R3q9k80Q7J48J81j60n92L09J20K90
6726B11l01m10L65K79L7k25j73J43M02l65l91L43K32K79m55k84J88J69J23l92
6746b25n6K76K27l77N1p7L22m7J39o53K63Q64l98j70n92N04K46m34jm07Q46J04
6768D05p61R9j21N08K09n31J04J3J52j42%m4J06N33n96n49K20N77K84m41j93N2
$$ y = [24, -316, -202, 82, 79, 53, -452, -339, 107, 182, -24, -555, -88, 250, 16, -341, -405, 48, 436, 131, -316, -268, 94, 140, -27, -170, -259, 51, 153, -101, -452, -45, 246, 119, -151, -360, 76, 473, -28, -138, -405, 107, 169, -161, -312, 96, 403, 366, 89, -259, -232, 92, 418, -120, -97, 490, 237, 47, -267, 62, 185, 499, -98, -55, -106, 368, 44, -36, -255, 252, 346, 367, -196, -36, 152, 198, -66, -192, 231, 364, 329, -60, 36, 188, 173, -67, -272, -112, 117, 546, -38, -536, 124, 160, 335, -96, -206, 104, 197, 108, -172, -85, 63, 244, 84, -508, -199, -79, 211, -90, -500, -135, 144, 181, -44, -217, -74, 328, -37, -428, -85, 147, 426, -29, -313, -125, 44, 167, -225, -281, -5, 222, -155, -104, -181, 141, 94, 233, -420, -157, 707, 309, 139, -453, 51, 297, -137, -138, -545, 301, 405, -356, -257, -378, 130, 339, -192, -88, -75, 77, -65, -65, -109, -3, 530, -66, -615, -395, 182, 466, 25, -168, -116]
6790a16L87j42M4k98J13K42m0k56l00M31J51k40j46p1O70j13l48j78K79J17Q7
6811B73m82K16J12K95j43m86R5N34K56r69J68J70n1O19p07l37M17K67j54j80J78
6832I1J00k82L39o62M07j61P09n41m44Q8N76j16k08r6J51K47j57k63o4M88O0o1
6854B01n90L74K56N8p89N3N60P4k45J36m33M23J11k83k76R5L60K29l99P7k17M42
6876B17j2m84r3L03O25n16k90K4N07k86j43k06K2N16O4m27k33N54J39m33j63J59
6898a56J75K51k32l42J22M64j83J43q31M36N13l8k58o2J09K52j82o32L07K76J77
6919C09j30j42n6P5J44k88L0J50J73J98q02J51O97j37l52l25J3L89J91p2m82K32
6941c4M89l38l00k2Q6N25m70q9k26M26M41n61K2j86L22j1j51j16M61L5j74j28
$$ y = [-116, 271, 129, 173, -125, -12, 230, 190, -66, -366, 65, 216, -24, -170, -241, 429, 316, -32, -210, 69, 186, 273, -209, 7, 119, 414, 271, -215, -120, 414, 670, -299, -131, 39, -12, 607, -100, -437, -20, 247, 93, -87, 91, 191, -91, 248, -414, -7, -168, 541, 0, -444, -356, 220, 104, -104, -200, -49, 198, 41, -222, -286, 202, 262, 201, -389, -15, 241, 299, -490, -437, 123, 197, -48, 88, -345, 78, 189, -94, -370, -275, 85, 314, -85, -8, -225, 217, 205, -279, -372, -69, 556, 40, -250, -226, 281, -5, -148, -354, -332, 184, 248, -179, -412, 142, 281, -152, -315, -156, 19, 270, 38, -304, -182, 282, 99, 242, -589, -153, 360, 322, 64, 2, 111, 363, 181, -451, -144, 132, 309, 179, 37, -19, 56, 200, -88, -58, 92, 265, 463, -339, -188, 509, 372, 20, -305, -292, 97, 288, 216, -266, -34, 455, 117, -183, -205, -119, 406, -64, -153, -379, 47, 488, -73, -51, -237, 85, 74, -77, -193, 268, 303, 129, 1]
6963Al29O22J70l70m13K67K20O9n63K32J77N3j27j08Q9J47O6j52k18k03N35K21
6985C86l82J06k60K70k10j70n6M41K82l30J22n35J72N53k61o18K18O99l02k64
7005a39k59M61O8O4j07k23M69J01m53k72l9M66p2j87o8L05J16n1l89l68N01M16
7027C40n42j65L79J79J08l58m9J6L43k27j79O9n5R7J56m51Q3N44Lj25l64R7K44
7050A43j11J88l72l2P13q6n09l87L68M79m18L3r7L61L5p8n99L37L70k16o7j36
7072h1n3K26M05m24j39L32p7J7m02J40K83K86m02n63L57M60j90n29J92K81O7J75
7094C61n88j47L28N45m47l53O5N37J94l99p54O65R4j88k95R7N49n4l17q9j5J28
7116h3O4j0m07M62L44k23j02m67N08M6j50p7l68M55R8l84O3O3M14j18l8m83K95
$$ y = [1, -328, 294, 464, 94, -319, -52, 168, 237, -326, -94, 83, 136, 9, -99, -10, 137, 203, 51, -167, -370, 165, 386, 4, 110, -150, 120, -90, -260, -316, 125, 407, 77, 199, -336, -164, 389, 128, -490, -272, 427, 125, -139, -398, 63, 131, 195, 88, -135, 334, 435, -18, -290, -329, 137, 65, -122, -190, 115, 231, 180, -209, -577, -76, 340, -202, -367, 12, 191, 299, -59, -108, -92, 251, 24, -155, -86, -141, -44, 112, -339, -256, 288, 291, 166, -198, -101, 143, 32, 220, -152, -184, 529, 443, -66, -453, -85, 394, -24, 9, -88, 273, 308, 230, -369, -32, 338, 122, 55, -81, -134, 92, 497, 73, -66, 266, 189, 206, -196, -56, 227, 513, 111, -452, -95, 365, 175, -354, -162, 119, 186, 361, -227, -374, -46, 499, 52, -301, -236, 301, 495, 96, -658, 7, 101, -87, -382, -285, 264, 210, -107, -196, -211, -83, -19, -29, -436, 26, 370, 147, 45, -422, 86, 132, -18, -95, -463, -8, 90, -294, -231, -168, 246, 128, 90, -393, -98]
7139i8J95J67l45k10J83L59j19n51L55K75Lk70l00P7K46M04m96l95N60N3o5l27
7161b99J07L00K64m47j63O1M07j97k37j91L47K26l22j66J45J83K72k49j77j2K96
7182A48k4l70o7L36J27R1m92O0L38L5N9n04lM98K73l67j25k49P14k79j63J7k6
7205B7K55m44J88j88J63L97m30k53L9M59k46j2k2m6L90k71Kj13J10J98k69j86
7227b52J49M05R9l92k67kL34K35j00m19q7N44k36l49J54M55r8n1l14J21q9L47
7249A87n07P0L0M52j99l45J48J89M6k34K1j39M32J53m48j66K15L23J89m55l10
7270c48K04M58j58n0l63L45J54q1l77L7J83L02n00J62j7L86N6o24l6J59L34j43
7292H3l65K29K03oj13l90M86L40l49n31N1L42J22j02l77J00J85K33p2o8O4q1J86
$$ y = [-98, 97, 264, -81, -291, -108, 251, 132, -419, -64, 211, 214, -56, -356, -279, -33, 371, -125, -520, 40, 93, 28, -299, -192, 108, 372, -75, -238, -177, 230, 33, -204, -395, -48, 178, -144, -310, -165, 18, 290, 41, -136, -148, 148, 124, -246, -313, 23, 150, 241, -251, -191, 147, 182, 241, -263, -266, 232, 505, 138, 13, -236, 478, 199, 36, 53, 27, 282, -162, 26, -162, 1, 398, -32, -285, -246, 213, -33, -45, -67, -113, 277, 6, 8, -105, 5, 203, -66, -252, -103, 302, 401, 9, -258, -260, 74, 309, 209, -210, -297, 247, 11, -338, -184, 271, 173, 122, -192, -71, -160, 187, -320, -250, -220, 232, 33, -312, -164, 25, 71, -163, -142, -281, 151, 304, -144, -310, -95, 228, 417, -38, -348, -144, 314, 156, 106, -257, 88, 242, 161, -216, -179, 4, 306, -194, -32, -49, 337, 393, -231, -267, -108, 226, 83, -282, -53, 150, 144, 31, -359, 127, 467, 118, -413, -362, -20, 102, 0, -377, -277, -92, 141, 69, 1, 65, -16, 170]
7315A70j23m51L14M26pm61j79M90M59o99J31n9N27l49n7m60q1O94J14m90K1J92
7337A22K67j08m10P3L39Q1k02k48k46N85J2l83j32K88L15P6r71L50K50J16l59
7358a85K7J92J90j1l47k16M61J83k9k46k68j05N02n5j42l83P10Q0m72k24J96N08
7380C66l37j4l21K26Q0L48o56oL32K81k05j67j03L93j37k44l76K56N72k51l49
7401c12K0J66N7L70p59J51O05k37k52N8J19L38j34o19K51L3K56J38j00m75M15
7422H9Rk89l6K94K9J68k12l89J95M95k33k59k14N52P3m76J5j44L03K44j79j86
7444a51O6K62N4l68J53J30J01j04k85j92P06j30j75k84J28J30L52o76K22J27K78
7465C44r9n17J16J69J94j00k01k94N18K18k96k65J83k3L82k98n76P09K67n74J27
$$ y = [170, 47, -404, -90, 336, 329, -132, -311, 179, 638, -61, 70, 11, 538, 189, 132, -328, -409, 285, 399, -91, -70, 122, 389, 281, -129, -56, 283, 364, 162, -86, -332, 253, 265, -118, -250, 38, 353, 429, -542, -192, 58, 174, -185, -158, 34, 224, 213, -134, -350, 111, 294, 265, 19, -249, -354, 148, 93, -49, -432, 278, 358, -114, -338, -142, 366, 29, 15, -306, -80, 0, 348, -308, -314, 18, 299, 94, -73, -176, 217, 80, -164, -540, -284, 288, 37, -312, -292, -126, -69, 301, -458, -307, 298, 61, -191, -133, -14, 324, 190, -429, -178, -145, 111, 249, 149, -326, 89, 98, -191, -227, 67, 96, 264, 52, -337, -142, 353, 120, -139, -353, 199, 272, -204, -189, -333, -30, 214, 35, -151, -85, 177, 231, -137, 16, 146, 247, 143, -142, -334, 372, 242, 67, -217, -89, 41, 393, -283, -61, 66, 344, 245, -272, -156, 13, 207, 107, -94, -388, 130, 348, 52, -213, -30, -53, 329, 31, -545, 164, 431, -143, -16]
7486a6k66N91J13j49m47J9J41j36L36l91R1R9L89o43q0P13j83m52j06K98K87j9
7508A89R5l99k14J35N1o7j94M08L61l59j11l85N77Q2o8l30N8qN96n58k88J22N08
7531B01j23k52k27P1P89m08l84R5M78J49m67k48K54L30j00m23o0K49M12k61m99
7552d24J54J19K01K11m47K24L4K34l45j64L51j04K80m80J94K3L81k05m16K50p3
7573bK74l02r6l3M08k41j27k50N39K44l22k72n1j35N36k70k43M13j00K72m49R2
7595a15J44N8Q7j57j27M7L92j17n81N1O02J42n25j06N85l77J62q4m75M84M31k38
7617B83n30J80J87L00l55l67M37j15J19k36r9j24K82M09n03l35O86K1k18k70L2
7638b16O10n16Q6j52j02N71j61k93L46k14J85J7l35K46M0j33M5l82M38o1j14r2
$$ y = [-16, -282, 309, 422, 273, -174, -155, -14, -150, 186, -205, -114, -15, 374, -269, -349, 364, 181, -271, -377, -79, 208, 189, 284, -115, -329, -194, -143, -210, -404, 4, 365, 6, -105, -490, 87, 169, 101, -229, -171, -179, 417, -141, -429, -307, 201, 78, -174, -401, -330, 459, 51, -333, -238, 240, 389, -78, -326, -72, 258, 158, -265, -325, -76, 336, 75, -424, -270, -151, 50, 261, -186, 38, 72, 306, -39, -203, 148, 44, 324, -156, 38, 61, 442, 237, -179, 71, -2, 272, -30, -126, -159, 249, 8, -119, -369, 170, 414, 92, -180, -231, -366, 170, -100, -343, 70, -30, 242, -207, -115, 29, 87, 174, 17, -110, -63, 329, 212, -369, -318, 284, 426, -99, -205, 380, 3, 165, 81, -394, 90, 521, 283, -247, -67, 120, 420, 65, -302, 135, 20, 139, -97, -196, -320, -38, 371, -132, -467, 219, 240, 22, -248, -216, 394, -122, -36, -188, -290, 281, 120, -173, 173, -41, 144, 161, -174, 72, 112, -21, 24, -358, 80, 19, -95, -187]
7660a87j19K64N39k04o97J37M48o0k41m1l44O00K72k38l39K49j29J42Jn12M64
7681EL37j05l55j61M11K07m17r6K51J38J66o51J2L74Pj53l05L82o4L32n02J49
7703c8o0L61N5n30r1L59J42%j14n28O08P9l86p1J59K23n6j46M0J02K10j73k44
7726i9L5Q2K56O5m49j72L14L57k40k25j5K89RO2n38J15O88o00M6k50N62om6m94
7750b54P6L34J20m96J86J73n4k52R7Q8k00L83j25k36j00L76j30J6m66J56L56N79
7772F27n29n17O04l86L08m65n7M60J1j8m17J64M27l3l68p0J19N40m74r5n9L00
7794G2m9P5k44j17K71K10j35k5k61M07M1n21J08j26M52l23J4k1J42L09l09k73
7816c03OL26K49j32l56M03j61J56N2m48k03P90k61k34k5L82j13Jk88jL02k8k03
$$ y = [-187, -306, -42, 497, 293, -404, -267, 181, 121, -120, -161, -505, 95, 367, 129, -210, 39, -90, 52, 53, -459, 5, 342, 237, -118, -279, 132, 339, -78, -174, 77, 215, 381, -270, -258, 116, 123, -30, -335, 47, -17, 315, -187, -38, -98, 263, 318, -212, -303, 56, 198, 198, 84, -444, 164, 243, -143, -214, -55, 168, 112, -34, 6, 108, 318, 145, -99, -64, 18, 274, 339, -110, -282, 32, 389, 149, -76, -91, 198, 207, 269, -269, -154, 534, -66, -20, -270, 292, 286, 240, -254, -178, 156, 276, -220, -34, 139, 85, -167, -70, 18, -182, 201, 76, -160, -260, 116, -14, 2, -464, -308, 48, 627, 98, -419, 185, -201, 107, -358, -415, 45, 56, 38, -379, -215, 212, 179, -189, -259, -140, 400, -74, -169, -228, 72, 23, 98, -146, -263, 8, 218, 83, 58, -203, 204, 245, -276, -168, -294, 158, -165, -151, -172, -30, 279, -30, -303, -297, 29, 278, 146, -210, 193, 32, 188, 240, -208, -411, 379, 118, -116, -141, 241, 128, 129, -159, -160, 142, 114, -89]
7839h9q2L83J42k94j16J15L14l33%o5q9L50j45M2k39J79M04j2m71l88J53M66j69
7862E6q9j15K39K1k20oJ07L77k83N5l64o2N67l82Q8j81J55L90m9l10j79M46L99
7885F60p74j29o9N09kl26L2J12R2K59m43l83M92j5m7p4n7J00M07j15o99O02l05
7908a73N6m98J26N79Pl43K04j51K06K25k16l4j88N30l49j08k08J88K90l7j93n9
7930a46K89K55n33k86K95M63j17j00n57K09M52k3k33l09O16r5N9o17J72M81K37
7951E12m98l65L18K50O4n42R0K11K51j71j51k70K01M50r7n10J76J87K72n08j73
7972c03O62K9k54k55L7K95J38m58l23L43K6K99k97k37J98M14l16j83k3J66M98
7993D56l19l67l4L09K22om90K29k0K47m35O6J2K57K05n31K5P8K47o2j36k7O6l4
$$ y = [-89, -171, 212, 354, 60, -56, 59, 373, 40, 40, -25, -114, 236, 91, 133, -106, 73, 477, 465, -6, -394, -241, 225, 56, -33, -148, 91, 112, -108, -114, -7, 370, 87, 142, -222, -284, 283, -99, -11, -192, -37, 353, 304, -6, -185, 261, 660, -114, -243, -312, 197, 195, -131, -99, 13, 105, 364, -79, -462, 30, 15, -32, -106, -163, -63, 344, 229, -470, 132, -173, -117, -615, -489, 90, 97, -246, -42, -193, 13, 238, 22, -12, -200, 330, -19, -127, -335, -147, 143, 106, -87, -146, 143, 398, -135, -421, -126, 337, 220, 120, -437, -228, 224, 201, -32, -341, 275, 180, 239, -378, -206, 275, 512, 14, -351, -33, 217, 281, -261, -171, 40, 291, 120, -31, -301, -100, 350, 253, -257, -81, 106, 378, -130, -303, 359, 388, 134, -121, -84, 211, 349, -109, -432, -89, -63, 236, -61, -298, -100, 314, -2, -185, -208, -42, 456, 137, -230, -264, 45, 267, 261, -229, 0, -20, 227, -208, -142, -130, 127, 332, -199, -174, -96, 151, 89, -47, -74, -8, -42]
8017d2L1m39P8K95J86l7l43L11K87l4o90J58M92j94l76J72k74N49O5l88k84M69
8039hK12m1k30l73O74j76P8j17k90N78j31k01m58J23O17l37J37j56j83M40j06
8060E2j08P2J64Q4j18n46J79L36R5l08j28J23M91k30k46l73L14L07k14p2O9K04
8082A47L96o37k89M20K17L6m65l6J72K12j48p2j58M12J37k73m96L10J06L6k31
8103b04m7M12m6J66m05j77M17P7r2l55R5M68p2j12j83j68J58K18l32lJ87K94j54
8126A42l63n9M50J49j44j74n0J40J8l08l2m5L43ok66J46j77N84k15l69J35K13
8148A12j76p7q3R8L14j4n97Q1N13j0P1l95J30q5K82k83j10J5L54J71m41k73O54
8171B51j58p9m53J75M35k0kl66J17K35j11j45k34L7P80o9m98j06K65Q5
$$ y = [-42, -11, -450, -372, -77, 109, 72, -271, 40, 327, 293, -397, -239, 253, 59, -317, -145, -419, 130, 195, -193, -477, -8, 204, 163, -67, -440, 234, 58, 136, 19, -271, 307, 176, -25, -483, -360, 257, -80, 57, -99, -282, 158, 52, -56, 16, 180, 264, 146, -400, -221, 115, 210, -98, -226, -103, 388, 158, -88, -461, -147, 160, -54, -126, -57, 147, 543, -94, -383, 37, 254, 290, -175, -211, -39, 173, 25, -47, -205, 207, 344, 71, -425, -115, -9, 27, -204, -251, 161, 115, 281, -124, -301, 116, 193, 101, -254, -159, 309, 237, 125, -58, -226, -68, 150, -182, -185, 2, 296, 142, -221, -280, 170, 319, 175, 1, -49, 91, 109, -199, -231, -276, 67, 61, -205, -59, -236, 348, 133, -236, -101, 112, -64, -141, -224, -126, 188, 174, -423, -342, 171, 161, 232, -163, -33, -118, 164, -119, -229, -214, 140, 311, -130, -403, 251, 93, 14, -439, -264, 171, 151, 149, -217, -100, 135, 24, -121, -355, -318, 462, 393, -105, -211, 54, 139]
8191A39
$$ Imaginary data points
##PAGE= N=2
##DATA TABLE= (X++(I..I)), XYDATA
0@%%%%QqQj6J6k4L2m0M8n6P2q8J04j27J52j77K09k42K82l28L76m31M91n56O31
29C36p15Q06r07J017j137J269j416J577j751J943k155K388k643K925l238L587
45A886l978M419m921N495o156O936p873R014j0440J2289j4793J8391k4038L4223
59B0454n8266K13622J63957m79215q3899K93891J35548k71671j26688J79063J54003
70A40799j06732r9373L7686O8010r539j3266k2951l0904N967O2915J2047m8855
82d196j5875M7836J0236m5150k4723K7668K2002m999j6533j0547K885J9587J011
95I202k6865l155M2002K0992l1324k0610J9748J011k8286P9K2844j2015j8978
108b5355K7982K5474l3955k0805M9690K1602p0842m1580O9401N4097n5724m9121
$$ y = [0, 0, 0, 0, 0, 8, 0, 8, -8, 8, -16, 16, -24, 24, -32, 40, -48, 56, -71, 81, -96, 113, -129, 153, -175, 201, -230, 261, -295, 336, -379, 427, -480, 537, -600, 669, -747, 830, -921, 1022, -1133, 1255, -1388, 1537, -1701, 1886, -2092, 2327, -2594, 2901, -3255, 3681, -4192, 4822, -5618, 6671, -8122, 10269, -13769, 20454, -37812, 175810, 339767, -139448, -223347, 70544, 206092, -65579, -192267, -13204, 140799, 34067, -65306, -27620, 40390, 30851, 17585, -5366, -36270, -30303, 32612, 44659, -4196, -20071, 27765, 38001, -7149, -31872, -4204, 17798, 12799, -3734, -14281, -11396, 8191, 9202, -17663, -20818, 21184, 42176, 10852, -9758, 9990, 11001, -17285, -17206, 5638, -6377, -25355, 2627, 28101, -5854, -26659, 23031, 44633, -26209, -67789, 1612, 55709, -15, -49136]
120d9136N3357M9135m6261m9298K8647L3422k3435k3491J4070P629p276J7158
132D521K0805k3246k8827K4958L3959k5612m2863J5348M2443o636m0034n173L2669
145B312J7127j8267j9281Q831K2525q82k5765r519K5436J8365j9535j9924J5666
158b911K0109j4152j9141Q792J1842r720o270J0935K703q923P808J6664j0136
171G600k0189J1882K3177j2529k8250M487K0766l889j3255Q546J1241q029k981
184a423J1876k100j8619N798K3972n299l1110K890L7481O612l6796j8371K6124
197A035K1515j7780k4792P343K4847Q466j7006j4629R899K1640N63k4395j5192
210a8486J6736K2178n352k4532p864J8258J6375r988k3048m88K7426J4786k3829
$$ y = [-49136, 4221, 53356, 7095, -42203, -13556, 19866, -3569, -27060, -12990, -5361, -12637, 4521, 25326, 2080, -26747, -1789, 32170, 6558, -36305, -20957, 21486, 14850, -25184, -30357, 2312, 19439, 1172, -18109, -9278, 13247, 12365, -13400, -22919, 2517, 20882, 1347, -18577, -2911, 17198, 3046, -16095, -7303, 4539, -5181, -11451, -516, 2187, -6736, 1072, 17736, 7600, -12589, -707, 22470, 9941, -18309, -13822, 6944, 3055, -10200, -1654, 9587, 1558, -1423, 10453, 8353, -10266, -4468, 19504, 14205, -16905, -14015, 23466, 30078, -6718, -25089, 1035, 22550, 4770, -20022, -12679, 12168, 20634, 3628, -11001, -1102, 20538, 21101, -3294, -18486, -1750, 20428, 15076, -9456, -17320, 938, 17313, 7325, -15723, -16211, 11215, 26001, 2172]
223B172k2767J8651L0530j1245l6475l197L0714J0344k0416j2276J1832J0013
235G880m851p546l966L3Q361J0709m900j4933L327J9943P94k3932j1633J8594
249b120J4728j3147j7177O234J6893J069j3448p217R475J2552P86j1331q122P997
263b828J2807l247j8768q309J5962J6665q944k1504L421K5383O117k6244j7181
276b6670K0465K4990r857k4743L276K5263N059k0512j3914P958J2360j203j1330
289h858n793R001J6132L049j6692r564J5386J4900j2457k0261N345K0700J221
302A2109j7265o775J2255R512n131j1379k272J0388J0727m836j3768o94J4160
315G031O596j1300p979P598R012k986q324m755L8N902N908o411j1076Q224K1827
$$ y = [2172, -20595, -1944, 28586, 17341, -19134, -22331, 8383, 18727, -1689, -13965, -2133, 7880, 3029, -4517, -8483, -8450, -89, 10620, 5720, -9213, -5886, 14057, 14851, -9081, -20714, -2120, 12608, -539, -17716, -11482, 5411, 6480, -6968, -14185, -4710, 7842, 8628, -2703, -10825, -2828, 9979, 6732, -12036, -20345, -4383, 12282, 3338, -18166, -14745, 10638, 16755, -9489, -26670, -6205, 18785, 8928, -15815, -12539, 12724, 17783, -2729, -16643, -8685, 3675, 2472, -8858, -14651, -5650, 10482, 13531, -3161, -12725, 2661, 17561, 5104, -15157, -9812, 10888, 12109, -5156, -11931, 324, 9836, 4705, -6674, -8946, 1442, 12169, 7333, -6435, -7129, 7031, 13627, 2327, -5652, 1946, 10958, 7972, -352, -5107, -5069, 833, 6741, 330, -10746, -2522, 19305]
330A9305q8k3722n189K1359O455k1718j1877J5450J1423p899p327M290K167P21
344C350L800l333j3059J980J9042J823k1927n265K4954J0626k1755j4772J4604
357F8J3319j1424j5209K901J1301M520m141p589R09J3211Q211j3461j6239P721
371e902J6343n561j6901J668J4451J670r157m185K189M606O020j068j4034m980
385a4841J7815J1803j7512j4851J7240J7172j5002j8247R567J3414p458r095L602
398f393J094l649R298J0088j1685j2354J7608J6483k1118k3665J6855K3751j3465
411B848k3633R817K2345k637j5423m94P370J343n24k691q437J413J8884Q286k0138
426a671j3379J7462J4139j6919j8125J0645J7913k241j3209l308P860R554L200
$$ y = [19305, 19217, -4505, -9694, 11665, 18120, -3598, -15475, -25, 11398, 3499, -3828, 462, 2629, 3350, 7150, 3817, -9242, -7262, 11780, 13603, -8324, -13589, 11365, 21991, 236, -14536, 68, 13387, 1963, -13246, -10345, 956, 5476, 1335, -6254, -5345, 7866, 16077, 2616, -13623, -5902, 10441, 4880, -12021, -10353, 4098, 5768, -3389, -7574, -5385, -779, 5241, 4173, -9861, -14841, 2974, 14777, -2735, -17586, -346, 16826, 1824, -16423, -6856, 6558, -900, -9995, -6393, -5299, -8948, 350, 10438, -1247, -13601, 4007, 20490, -628, -24293, -7438, 16313, 2848, -20785, -10968, 11377, 8740, -6683, -7177, 193, 1536, 1012, -1679, -10116, -8703, 10181, 18467, -1671, -15050, 2412, 16551, -368, -18493, -7848, 10065, 7824, -5385, -8693, -833, 8721, 11921]
439A1921j0783j2426Q577J9778m418k3163q43K2498K805k1063o357J6317Q257
452A1100o074k957o47m563L409J0557p013j7340Q336K6618l944k8524r68K7401
466A5391K433k7179q402K0310R032j2011n184Q160M131L22O77o692r669N542J4666
481A1527m681j6990K047J8059R15j6213n817J1231P742l481q631l290O051J1494
495I963j344j6997m790J8554J0305j8198j4152J4974J5162j1480j6238M952J1430
508B141l07l326k16k174J955J1173l67j9826o679K1351J1046k3186j4546K3244
522B83J9194j9140k0934J3286J9004o998j4123J803P715K91Q2J174o583k429J0999
537C624O001j4224j1396J2752J5181q346j7127K721J5294M862q883q184M556J1218
$$ y = [11921, 1138, -11288, -2711, 17067, 12649, -10514, -11357, 11141, 13946, -7117, -13474, 2843, 11100, 5026, 2069, 1422, -3141, 268, 10825, 3812, -13528, -5192, 21426, 17482, -11042, -12010, 15391, 17824, -9355, -17757, 2553, 11585, -426, -5610, 2550, 6681, 7003, 7680, 988, -8681, -3139, 11527, 6846, -10144, -8097, 9962, 10877, -5336, -11153, 78, 7820, 4339, -4292, -7582, -1531, 9963, 8619, -8378, -13168, 5386, 15691, -2507, -16659, -1685, 13477, 1997, -14241, -9289, 2141, 1834, -1492, -1708, -3882, -1927, 9246, 8879, -10947, -17626, 3725, 14771, -8415, -22961, 283, 19477, 337, -20597, -7311, 11693, 4695, -9428, -7625, 90, 381, 463, 1637, -4946, -7375, 3624, 9625, -4599, -15995, -3243, 11938, 3592, -13535, -10814, 4480, 9342, 459, -7725, -3169, 8049]
551H049J429j2901j0260R383J5245l905j6532k69J5153M704j0442o075N629N773
565D981P97m103p156j77J1855P649j3115j4423J1948J8863r544k1551N654K2497
579A4175p70k0884m023J5415P646p321m959J450K491K464O66q405p125Q805J3997
594A3622o393j7568L081J8991K961j7676p865J2267J0486q320j1072K577J1598
607F689M614p387j0296m41R632M950o312p827L731Q812l54q937m671O357R348
622G908p90j1259m554R487R641p411j3733J459J3493K371j2398m826J1321R830
636A0539o977j1068o82P967M479l875o938m45Q217N924n387j1324J130J1966L714
651G240j2433q767J0080J3901m060j5200j407J4565O035j2489j0776P516J2808
$$ y = [8049, 9478, -3423, -13683, -4300, 10945, 7040, -9492, -9761, 5392, 10096, -346, -6421, -792, 4981, 5778, 1675, -5481, -5658, 6197, 13846, 731, -13692, -1744, 17119, 7575, -13976, -8322, 14175, 13405, -7479, -11502, 3913, 11559, 4238, -721, 729, 3220, 5684, 6350, -2055, -9180, -375, 13622, 7229, -10339, -7258, 11733, 14694, -2982, -10847, 1420, 11906, 3586, -7486, -4909, 6689, 11303, 3916, -6380, -6821, 2811, 7761, 1449, -6378, -2647, 6165, 5811, -3126, -7797, -1440, 7908, 7118, -4141, -8695, 792, 10433, 3022, -10711, -9252, 4241, 6612, -5786, -10612, 709, 10539, 3562, -7506, -8188, -221, 4258, 383, -6555, -7000, 1217, 7141, 1754, -9570, -8440, 3526, 7240, -5193, -13960, -3880, 10021, 5961, -9239, -10646, 3919, 9954, -2535, -13311, -5795, 7013]
664G013k354j0457k470P412M575l226m940j542M521P248m68j0391m864J0554R236
679I847q867j3204O328J5698j722j4848j890J2580M699r472o827M717O531J691
693E261k360m566j683N745N866n769j0468K836J2656J362j2269n335J1227R660
707A2163o781j2201N06J1838N471q422r607M122J1559K11j1610m668R735P569
721I885n536r178O78P825L922l552p620j640Q921P261p443j2803M686J6001j527
736I880j8085k777J6724O937j3823q907R184Q827m096o158o22J752L115L191l841
751A301q959K443J2618L14j4614m343J4502P962j1967j0387O870J0450k208q156
765d174k901M728O747Q40q501o165O351R598l792j2308J021J2335L273r409n967
$$ y = [7013, 4659, -5798, -8268, -856, 3719, 493, -4447, -5989, -1468, 5780, 5312, -5079, -9943, 611, 9847, 980, -12224, -5896, 9802, 8080, -6768, -8658, 3922, 8621, -851, -7678, -2961, 3570, 5261, 2901, -1665, -3348, 2397, 8263, 2494, -7974, -5138, 7518, 8880, -3389, -8724, 2503, 12163, 5382, -6819, -6313, 5525, 10996, 2574, -7033, -2911, 8648, 8859, -2751, -7419, 2316, 9885, 4349, -4829, -4151, 3674, 7596, 4044, -3576, -5216, 3705, 10966, 3523, -9280, -4594, 11407, 9880, -8205, -10982, 5742, 12679, -1144, -10051, -867, 7960, 3864, -2294, -2916, -1164, 1951, 5142, 1301, -7658, -5215, 7403, 7717, -6897, -11240, 3262, 11224, -743, -11130, -4260, 6190, 3982, -4174, -7075, -2347, 4400, 5240, -3261, -9426, -3075, 6523, 2731, -9577, -8556, 3779, 7052, -2357, -8324]
780h324M648O777k87n297n464K711R830K498j1595p404J1459J0733j0099j3401
794a3215P168J4373k547j2345o14Q784K366l857l377j592K049P522K018j0829
808d096o351J1764J0042j1001j3690Q649J5439l865j3677N79J0819K207p052m672
822d905J087N429N051k107q725j162J0213L824j0479o347R369P712n611p364K395
837a620N359J267k270l847k926M556P686k943j1926J830J4201J067j5001l961
851h528J2680N961r591n655N726M393j886k073k288k765N729Q154n248j3529K867
866f053J5992M92j6892k931J4652M926j2231o532Q675O639k903n434k488j71O054
881A795N249n719r535M406J1578k562j3286j42J2766L276j0415n900N784O855
$$ y = [-8324, -3676, 3101, 2814, -2483, -7947, -5236, 4594, 7092, -4503, -11907, -448, 10285, 186, -13215, -6047, 8326, 5779, -6566, -7180, 1604, 3970, 113, -3264, -4856, -2807, 4715, 6733, -4096, -10447, 1317, 11359, 358, -13332, -4683, 10756, 6891, -6786, -6207, 4612, 6819, -233, -4905, -3818, 1611, 6662, 4555, -4170, -5332, 4881, 8705, -1774, -8121, 1248, 8960, 3349, -4015, -1620, 3739, 5006, 2736, -1111, -4037, 519, 8205, 5262, -6664, -4834, 9367, 10434, -4567, -8528, 4152, 10113, 522, -5133, 593, 4986, 3100, 1027, -1261, -4026, 1703, 9857, 4609, -8920, -6053, 9939, 10431, -6461, -9392, 5260, 10186, -2045, -8577, 98, 6737, 3834, -1600, -4088, -4259, 1795, 7044, 1325, -8210, -3804, 7774, 5212, -8074, -8216, 4550, 7826, -2589, -8489, -2705, 4150]
895D150p29o118l837K756Q466L73j0766m505J0596Q710q972j0264N334R886k938
910B142q166K29N825K840k066l886m217K630R643K080j1265o572J0328Q514q847
925g88r516P315J0716m404j0725N28P347M312j730m882m726L136P752N86r078
940d157k394R947M954j0250p837P980R818l450q869k75N666L609j869n285k066
955d478N984O498n035r644K213J1694R12j0777l783Q901N486o634o032K920O405
970D630J978l691o307j464O948O882n938q628L455J0493j520j1527j413J1119
984E017M663q822p259L853O882R85l549l910J84M862J981n341m761N038P153j797
1000E179r431j990P994M484n138n917K088O882Q42o791m516M694P540j720q683
$$ y = [4150, 3421, -2697, -6534, -3778, 4688, 5061, -5705, -10210, 386, 9096, 124, -10140, -4806, 5080, 2142, -6024, -5795, 30, 2870, 804, -3082, -7299, -4669, 4974, 7054, -4211, -10783, -455, 8059, -788, -10304, -2989, 7727, 3323, -7402, -6874, 473, 4785, 3055, -1827, -6553, -3417, 4335, 4921, -4157, -6551, 3396, 8350, -1900, -9737, -1757, 8061, 4611, -4258, -4533, 1133, 4742, 2873, -2412, -4478, 1506, 8004, 2969, -6675, -4462, 7232, 8144, -2633, -6416, 2485, 7971, 1337, -4695, -1775, 4630, 6608, 2917, -3390, -4854, 2094, 8976, 3038, -5590, -2135, 8358, 6838, -4689, -6102, 5017, 9680, 858, -6401, -2548, 4334, 5319, 1770, -2140, -1956, 2906, 4887, -454, -5215, -177, 6976, 5179, -4252, -6242, 1752, 6236, 1098, -4819, -2731, 4151, 4993, -1798, -6314, -1620, 5920, 4200, -4483]
1015d483k964P718N582m598o457K167N497P62n849l757K930P099J497p060o510
1030h426M863Q878j363r475k131Q935M358p262o482M680P780p73p192k923M712
1045a821N072r72n574k673M785M862k139o993o76P591L829n774n940L686P136
1060D399q42p953k330P039N544l726p282M3P324L372n204n182K132N709M44n263
1076a776k590M037N408p27o669k869N571O333l139q203l28Q222L515o282n478
1091d975L771P206q84o763k615N461M667k384o049j222O187M503m076o760J376
1106b557P012J836n976m724L964N921p13o320k371N531N562l810p609O04P963
1121D313K391p406n070N059O731k329o248p81M657K965k125m689j728M314N338
$$ y = [-4483, -7447, 271, 5853, 1255, -5202, -3035, 2462, 3224, -2625, -6382, -3452, 3647, 5144, -1916, -8426, -3563, 5315, 3952, -5523, -7654, 1281, 5639, -1623, -8105, -3425, 4355, 3582, -3610, -6533, -1821, 3251, 2279, -3295, -5968, -1183, 3679, 1540, -5453, -6129, 1462, 5291, -483, -6423, -2737, 4399, 3557, -4396, -6726, 313, 5857, 2131, -5151, -5108, 2216, 5588, 384, -4798, -2666, 3043, 3487, -1776, -4366, -329, 5079, 4352, -2317, -5186, 385, 6718, 3579, -4624, -4952, 3270, 6785, 503, -4975, -1204, 6002, 5118, -1645, -4260, 1201, 5868, 3484, -2565, -3787, 2400, 6903, 2827, -3933, -2557, 4455, 6291, 315, -4409, -445, 5476, 4763, -1557, -3928, 1603, 7165, 3355, -4254, -3650, 4313, 6704, -702, -5772, -713, 6018, 3689, -2559, -3340, 1317, 4282, 2157, -2532, -4260, 54, 5392]
1136E392l125p652L18R205K782q862n624O700P148m310p559J023O027K093l659
1151a03l588L23M021K865l449n730J614O771J364p141l685N878N411l104o515
1166e068l60N605L557l923n429Q03O887K200o849m815N688P307l093q337L92O887
1182A452K125m582l463O30M424L109k676n734k78P858L314q716o457P894R279
1197H179n284j0310K586R920M68p569k853M313L548n24k905k578J372N353J680
1212E396o706m297O799O311n258q003L199P896n2o985k299M239M096q46m106k324
1228b940L243N070j397o929r20P483L623o690n309M593O044j559n499k339L019
1243e07M437Q3m902l319M888O873l658r094R82R834J129r144m135P047N295l574
$$ y = [5392, 2267, -5385, -5067, 4138, 6920, -1942, -7566, -866, 6282, 1972, -5587, -4564, 1463, 3556, -103, -3691, -3368, 653, 3518, 69, -5661, -4047, 2724, 4088, -3053, -6738, -860, 4551, 1447, -5068, -5428, 177, 3734, -189, -5618, -4815, 2072, 4272, -2577, -7392, -1704, 5603, 2510, -5827, -5435, 1452, 3577, -1005, -4468, -3838, 586, 3695, 1019, -4715, -4993, 2865, 6179, -2537, -8994, -1100, 8179, 2895, -7415, -4829, 5091, 5559, -2010, -4863, -550, 2998, 2474, -431, -3009, -1637, 3716, 5396, -1310, -5607, 1192, 7503, 2245, -5758, -2559, 5337, 5285, -1700, -3999, 240, 4336, 3490, -616, -2940, 303, 5373, 3976, -2953, -3873, 3610, 7233, 543, -4766, -173, 5871, 4312, -1187, -3526, -507, 3930, 4013, -889, -4208, 680, 7553, 3895, -5199, -4217, 5617, 6746, -2398, -6533, 514, 5809, 2235]
1259B235m635o4K970J952j73m016k376M351N342l627p510J385Q922J91q527k420
1275f000O290M262m287m501L48M086K319j921m254m00N420L293n415n977M480
1290b257O882j837q473k18O487L089l650m512N86M237K300k590n126J129O964
1305C011J507p649m171O876O425m576p413K095O051L47m352j793J433L016J590
1320B397j971m118P01O708J505p370m425O452O096m773p087K306P225P67n973
1335a560k055K474M032L46l639k598K743N038j074n963j526O466L644m907o115
1350d694K518N851K57m305k957L152M592l69n194k232M882N217l494o686M11O529
1366C478J565n779l125L461M763j455l979j751K826M294j222m905j905N541M074
$$ y = [2235, -2400, -2464, 506, 2458, 2285, -1731, -4107, 244, 5586, 1959, -5551, -4166, 4756, 4947, -3580, -6000, 290, 4552, 265, -4236, -3888, 198, 2517, 596, -3658, -4058, 1362, 4655, -760, -6737, -2257, 4625, 2788, -5685, -5903, 584, 3673, 23, -4489, -3903, 334, 2634, 44, -5082, -3953, 3011, 4518, -3131, -7302, -426, 5999, 1423, -5990, -3895, 2156, 2503, -1849, -3642, -2209, 807, 2397, 426, -3692, -2991, 3717, 5222, -2148, -6573, -121, 5975, 1202, -5885, -3579, 3646, 4413, -1560, -3615, -1141, 2891, 3237, -402, -3000, -257, 4781, 3707, -2256, -3782, 2684, 6328, 1421, -4694, -2176, 3675, 3932, -373, -3330, -178, 4414, 4045, -1149, -3381, 1501, 6718, 3224, -3462, -3051, 3478, 5043, -736, -3861, -400, 4363, 2908, -1071, -2822, 4, 4298, 3076, -1829, -3734, 1807, 5881]
1381E881l850o627K125P353k99o590k900M814L869k219l949m73L522K823j646
1396A834m855o60N899K848m966n922K500O748m3o604k007N310L588k892m568J83
1412c607M168K912k854m910L02N604J816n162l518L521N025j336o387q60N145
1427a41L122k526m651R12M396J785l245m024K314M788k73n707k219M502M597k328
1443A302n171j5M990K221l507l832K085M952K84m756l280L470N004r53n538j188
1459c932M228L608l076m800J171N401K165m567l817K405N399j29m932k561L975
1474E38L465k466m982K29N490K681m144m049J497N228R41l918k783K378M443j613
1490B935n039q28M890L428l703n308R91N405J758m078l349K473M848r93n028j510
$$ y = [5881, 2031, -4596, -2471, 4882, 4583, -2007, -4907, -93, 3776, 1557, -2392, -2865, 657, 3480, 1834, -3021, -3681, 2218, 5066, 100, -5822, -3322, 3426, 3383, -3221, -5228, 82, 3670, 778, -3790, -3607, 561, 3473, 619, -4291, -3989, 1615, 3431, -1731, -5249, -1728, 3297, 1961, -4426, -5286, -141, 2981, 455, -4196, -3284, 1112, 2897, -348, -4372, -2058, 2730, 2457, -3250, -5469, -967, 3630, 1302, -3869, -3884, 1106, 3327, -180, -4012, -1927, 3025, 3309, -1447, -4727, -1257, 3747, 2794, -2744, -3932, 296, 3904, 828, -3972, -2801, 2600, 4765, 198, -3619, -1214, 4185, 4056, -876, -3437, 538, 4003, 1537, -3445, -3216, 2274, 4955, 811, -3238, -1741, 3487, 4428, 510, -2273, 105, 4548, 2935, -2104, -2932, 1958, 5386, 1683, -3625, -2634, 2771, 4529, 451, -2898, -425, 4423, 3430, -1598, -3108]
1506c108N027L812l417n472J51M832J820l611l437J455M385J230m511l276L447
1521f73N571j145o291j621N267L251m071n085K106N159J30m129k551K585L891
1536B394O6l952k259L161L698j772m675j01N375J371m458m009K581L997K32l896
1552b247j740K367L954r00m094j293M809L804m340n329J533O372j64n190k045
1567d503L230L038j236k818n57K529L312j350m447j142M932L333l937m898K236
1582b278N571n47n578j202M162K409j905k805j28L020K625j427l741k93M764K403
1598E050m845m566L085N568j547n628l68M882K370k885l673J162M353J678l648
1613I88l841J731M901L14m805k436L957L348k713m073R62L348J205j600l023L21
$$ y = [-3108, 1919, 5731, 2314, -3158, -3007, 1825, 3645, 34, -3403, -1948, 2437, 3667, -844, -4120, -673, 4898, 3753, -2538, -4159, 1108, 4359, 288, -4797, -2691, 2468, 2598, -1531, -4082, -1497, 2394, 2460, -1492, -3751, -590, 3108, 1336, -3339, -3440, 1935, 3306, -1152, -5161, -2580, 1417, 1649, -2247, -3987, -1620, 2334, 1434, -2660, -3953, 856, 4660, 320, -5009, -3476, 2896, 2732, -2458, -4503, -1273, 1765, 529, -2289, -2846, -317, 2995, 1645, -2802, -3944, 988, 4321, 384, -4514, -2278, 3293, 2746, -2832, -4034, 128, 2537, 632, -2173, -2301, 719, 3344, 1917, -1824, -2117, 2647, 5050, 205, -4361, -1276, 4292, 2745, -2883, -3251, 1631, 4001, 1116, -2557, -1395, 2958, 4636, 988, -2853, -1122, 3779, 4093, -712, -3148, 809, 4157, 1444, -2629, -1667, 1681, 2886, 1286, -1737, -1416]
1629a416L633K881l622m604J705O017o93o339j844N798K720m587l549K284M026
1644B410p5k346j393O97K968J166k935m165K082N581j009p036l96N933K348n159
1660a329l686L073M856q12l789j284K542K880n6l759k778L173M056k281n606O70
1676d130N348J488m182l225K681M146J41l456k176K251L903p29n163j222M626
1691C01L365m441m492K549N137o96m431n66K809K333n42k183j421K071L352j158
1707A987m693j573N489K793m922m683L671N718j295n137m92M624K099k397k876
1722a687J24K856K463k759l809O59M686J086m663l228L844M472j584m458k13L879
1738A668K493k269l632L35L853J664l442m205K005N092m92n092j050M279K841
$$ y = [-1416, 2217, 5098, 1476, -3128, -1423, 4594, 3901, -2438, -4282, 1516, 4236, -351, -3900, -1616, 2410, 2335, -11, -1404, -707, 2261, 3427, 492, -3673, -1591, 3990, 2981, -4055, -4451, 1482, 3830, -1329, -5015, -1942, 2914, 2102, -1687, -2971, -429, 2451, 2395, -1364, -4142, -969, 3087, 806, -4800, -4130, 1218, 2706, -1476, -4701, -2020, 2126, 2267, -1189, -3365, -1114, 2789, 2060, -3103, -4325, 301, 3666, -775, -5267, -2718, 2419, 1723, -2708, -3274, -465, 1868, 1326, -857, -2278, -207, 3145, 1987, -2706, -4279, 1210, 4003, -919, -5602, -1931, 3787, 2492, -2645, -3137, 1487, 3586, 1189, -1687, -1563, 1293, 3756, 997, -2812, -2153, 2533, 3619, -1044, -4272, -428, 4044, 2460, -1998, -2211, 1668, 4161, 1892, -1740, -1405, 2448, 4112, 670, -3535, -1530, 3562, 3070, -2022, -3072, 1207, 4048]
1753D048k691l129Q70K960J140j787k979L17L582J535l989l494K569N128j479
1768B601n969K42N644J992m846l198L221L696q85k984j569J840K363k58l700j654
1784c464K741L984j798n113q3N570K253m074l476K173L844o17l956j168L133K387
1800B336j668l735n74L829K163k871k799J122L655M47l315j624K471K744p75l648
1816b242j503K969L351k323m257P21M384J099m043k269L291L975r98m214q54L038
1832A25K457j958k899q5K761J608k208l035P45M790R47m224k696K733M511n84
1848B988m578q66L724K370l142l415R57M084M86k821k480J440L704K04k881j543
1864a769K200L039j394l397n92L219K573k704l594R03L396J079l080k208K499
$$ y = [4048, 1357, -1772, -902, 2058, 3198, 1411, -1568, -1251, 2331, 3866, -123, -3617, -1048, 4080, 2601, -3368, -3126, 2518, 4510, -336, -3534, -313, 3383, 2498, -486, -2055, -215, 2148, 1890, -1810, -3464, -723, 3261, 1463, -3650, -3733, 1837, 4090, 16, -3460, -1287, 2557, 1940, -2016, -3184, -51, 2336, 668, -3067, -3641, 188, 2351, -520, -3319, -2197, 1458, 1905, -1410, -3034, -563, 2181, 1406, -2242, -3745, -776, 2575, 252, -4005, -3284, 1100, 2199, -1844, -4113, -822, 3153, 2155, -2059, -2913, 125, 2582, 624, -2275, -2360, 401, 2009, -199, -3234, -2489, 2301, 3248, -976, -3672, -939, 3572, 2988, -1590, -2456, 1268, 3638, 496, -2919, -1962, 2122, 2608, -213, -2693, -1253, 2451, 2655, -226, -1769, 431, 3470, 2076, -1321, -1913, 1306, 3879, 1175, -2419, -1516, 1880, 2959, -121, -2329, 170]
1879A70K919q30l217q44K626K878j715l302m67L032J607k484k754J309L353j98
1895B083l313j588K932L579j195l585r99L157K466k867l332P31L814L39l506j860
1911c144K411K893q22k933n70K412J905j350k555m37K886K312k647l502P68L926
1927A553L63m039j757K887L098j773l300P61L474J348k660j924K58K545R20k941
1943a187k389J827L242k35l765q77L341K617k611k770N58L477Q40k541k178J189
1959a462L684k24l833j926K832L167j338l994L11L973J353k791j918J412K838
1974B084O29k808k500J489L164j20l722j316L978K749k831l970K208M319k51l580
1990d78j768K705K359p52k783n55J585K570r51l948n49L897K436l311l246J872
$$ y = [170, 3089, 2259, -958, -1802, 824, 3702, 1987, -1315, -1782, 1250, 2857, 373, -2381, -1072, 2281, 2083, -1230, -2818, 114, 3693, 2498, -1087, -2086, 1071, 3537, 670, -2662, -1931, 1883, 2222, -1284, -3144, -733, 2160, 1338, -1595, -2165, 247, 2152, 802, -1753, -2190, 696, 3008, 361, -3141, -2373, 1553, 1916, -2123, -3880, -993, 2105, 332, -2968, -2207, 1267, 2615, -45, -1969, -1711, 834, 1754, -1187, -3576, -1749, 1493, 1258, -2507, -3384, -43, 2574, -37, -2807, -2249, 1228, 2068, -473, -2651, -1462, 2222, 1998, -1835, -3761, -929, 2238, 900, -3094, -2783, 1190, 2543, -248, -2166, -754, 2084, 2713, -95, -2595, -1106, 2058, 1938, -1784, -3100, 878, 3627, 796, -3174, -966, 3353, 3102, -478, -2246, 459, 2818, 2066, -717, -1272, 313, 2883, 1932, -2016, -2565, 1332, 3768, 457, -2789, -917]
2006i17L975l49l349m22K421J664j189k976p73K624K238k013k893Q0L994J142
2022C257l374k065K367K707j744k308n22K377J757j248k083r26K111K357k054
2037F09l665P15M485N40m102k136L731L051k080l134J19K825N62j642k099oK481
2054B54J518k681k153J390L888j97m197j086L311K417k337k508O39K756L42j486
2070a30k849J366K355Q60l239j816K388K744n78l430j10L137J322j848k176M21
2086a583J942J029k079k364P24L790Q96l910j930L474L255k192l619Q67L422N2
2102A774k482j027J155K038J15j693j967N49L432L23l427j935L476L284k159l819
2118b363J030M011L79l415j801K079K743j247k581q70K268K273r72k613j75L218
$$ y = [-917, 3058, 2709, -640, -1062, 1359, 3023, 1834, -1142, -1915, 709, 2947, 934, -1959, -1879, 2115, 3257, -117, -2182, 185, 2892, 1148, -1160, -1682, 695, 2452, 1204, -879, -1805, 306, 2663, 609, -3056, -2341, 2144, 2684, -1418, -3554, 177, 3228, 1148, -1986, -1867, 958, 1520, -122, -2221, -2227, 254, 1772, -909, -3062, -1672, 2216, 2019, -2178, -3264, 47, 2464, 127, -2381, -1742, 1014, 1356, -130, -2979, -1613, 742, 1602, -1637, -3453, -1065, 1679, 1101, -2329, -2439, 698, 2020, 172, -2004, -1583, 359, 1388, -691, -3055, -2331, 1459, 2355, -1555, -3485, -11, 3244, 1052, -2567, -1700, 1722, 1774, -708, -1735, -580, 1458, 1573, -120, -2087, -1538, 1894, 2217, -1210, -3145, 331, 3615, 1456, -2363, -1333, 2678, 3057, -358, -2159, -80, 2663, 1416, -1165, -2035, 233, 2506, 1534, -1079, -1254, 1964]
2134A964J404k609k871J565K937o0k894j168K162K201r33k966o23K900K151k386
2150G74l236J158L402Q51l321j482K502K130j429k586n15J894J801r18k671q25
2166b471K936K365k131l156Q69L778L38m031j692L430K339k057l269Q67K931R84
2182B030k432k089O20K341J114k864j430J764L119p69l096q38K791K051k235k735
2198b658J99L327J212l094j999J907L407o27l440j056K643K207j812k911M28L292
2214A025L82j685k148J303K275O99k784j602J463L050m10l375r45L456K273k478
2230D99k963P48L605R0l032j509K046K639o27k658m55K245J808j142k701l11K561
2247H43J654j954k307P59L123O78l319j561K484K501j371l028j98L017J404j936
$$ y = [1964, 3368, 759, -2112, -547, 2390, 2330, -564, -1732, 430, 2631, 1698, -1268, -1891, 1009, 3160, 774, -2462, -1304, 2098, 2949, -372, -1854, 648, 2778, 1349, -1237, -1752, 142, 1943, 1025, -1646, -2471, 465, 2830, 699, -2457, -1588, 2190, 2528, -1503, -3195, 235, 2574, 517, -2752, -1885, 1046, 2030, -402, -2491, -1871, 470, 1584, -1280, -2710, -946, 2173, 1404, -1692, -2530, 261, 2312, 77, -2658, -2459, 868, 2080, -1014, -3013, -1106, 2301, 1674, -1766, -2822, -179, 2028, 216, -2695, -2267, 1025, 1407, -278, -2426, -1123, 1152, 1851, -933, -2535, -1072, 1978, 1568, -1807, -2752, 704, 2977, 499, -2464, -1716, 1889, 1979, -1053, -2562, -516, 2123, 1496, -1162, -1617, 628, 2436, 1294, -1407, -1718, 843, 2497, 543, -1764, -1005, 2118, 2796, -523, -2084, 400, 2901, 1530, -1498, -1696, 1321, 2725, 789]
2263G89k124Q24K445M72k370j761J144K408J56k474j328J996K828j464l039K8
2279a470L302R07k787j963J210K740k11k850p12K077J678r03k267l73K269J276
2295A923j846j910L92K349Q22j903j613Q14K588l94k628j109K724J823j658k689
2311b315J79L463O86k292k099J583J920o60j679p07J297J632l94k175p48K037
2327b72K130j135l203J79L243O12k893j473J910K890j127k525m97K050J274j217
2343e4j746j9K003J428j846k054J082K694N01l009j310J963K194j218j847k88
2359a526J751J526j510k232M18L221R91k932k001J840K676r82k715j14K948P07
2375B066j548j731L78J590J103p51k566M28K376J342k735j762K118K540j238l254
$$ y = [789, -1335, -511, 1934, 2406, 36, -1725, -581, 1827, 1983, -491, -1819, 177, 3005, 1541, -1498, -1470, 1832, 2739, -48, -2011, -801, 1939, 1728, -1122, -1834, 243, 1921, 1018, -1249, -1622, 647, 1923, 77, -1833, -1441, 908, 1730, -173, -1786, -972, 1616, 1222, -1406, -2515, 209, 2032, 374, -2315, -2136, 1327, 2013, -279, -2378, -795, 1125, 465, -1214, -1921, -624, 1008, 614, -1561, -2309, -272, 1858, 723, -2480, -2301, 942, 1554, -1339, -2812, -902, 1988, 861, -1664, -2161, -111, 1163, -54, -1800, -1819, 184, 1612, -234, -2288, -1206, 1488, 1989, -1020, -2330, -367, 1827, 609, -1238, -1526, 225, 1751, 241, -1991, -1573, 1648, 2639, -293, -2294, -454, 2222, 1240, -1475, -1589, 1359, 2066, 518, -1213, -835, 755, 1858, 1107, -1459, -1031, 1345, 2687, -48, -1810, 308, 2848, 1610, -1644]
2391a644K7L122P26k063j536Q85K068K34j601j345J139K034j1k662j347K117K510
2408B653j396k786K46K873L54k190j434J236K022J22k617j175K063K063p98k840
2424a604q4K652J086k538j477J190K210N0k182j088R19K061M4k093j417K018J935
2441A682j332k822M66K947J057k650k375K704K250j324j990m71J395J493m24j996
2457a390l71J732J676j388k638N13K959L31k540j474K149K094q06k274k80J741
2473C4J695j411k018L20K147Q86k222j826J015L079k61k324j016K063J836j083
2489I14k062k08J854J460j539j875L44K704P42k698j794K121K372r28k883K15
2505a261K370R48j521j531J85K094O22j549j876P57K513j87j947j276J953J956
$$ y = [-1644, -1617, 1505, 2231, 168, -1368, -483, 1585, 1819, 218, -1127, 12, 2046, 2035, -627, -1974, 143, 2653, 1257, -1529, -1283, 1590, 1944, -246, -1680, -444, 1578, 1700, -917, -2092, -29, 2034, 1236, -1604, -1688, 964, 2050, -488, -1965, -775, 1435, 1485, -697, -1785, -866, 1195, 1239, -854, -2271, -253, 1682, 350, -2472, -2006, 941, 1998, -652, -3027, -323, 1927, 603, -1387, -1858, -463, 1030, 606, -1390, -1761, -29, 1647, 259, -2379, -1866, 1093, 1424, -1116, -2590, -441, 1653, 847, -1427, -1707, 34, 1729, 318, -1700, -1380, 767, 1653, -569, -2395, -1380, 1699, 1438, -886, -1902, 161, 1997, 914, -1148, -1356, 498, 1958, 419, -1456, -1112, 1592, 2334, -364, -2158, -37, 2335, 1407, -1476, -1261, 1109, 2057, 536, -995, -810, 1284, 1906, 357, -1519, -762, 1751, 1564, -383, -1659, 294, 2250]
2521B250r82k657J44K589O84j926j117Q02J503K92j757j124J054K257n70k459
2537a017l81K173J662j354k556M19K412J01j453j535Q25K389j27k115j245J390
2553d12K588j047k815q9K852O29k032j481J077K288l52k113p80J091J677k48k077
2570a244p07K001J708j563j809K07K494L43k156j514J445K153m69k366n45J788
2586b34J364j198j757K61K180P17j740j575J064J911K1j706j505J644J989p78
2602F58k268J0J704J619j562k401O02K598M30j889r99J323J557n68j944l08J432
2619fJ277q50j771L35J783P30j078j959N51K258L10j958j292J760K101p91k504
2636a104j60K194J196j561k084Q01J968O37k305j071J627J695m55j944l58J507
$$ y = [2250, 1268, -1389, -1245, 1344, 2028, 102, -1015, -213, 1290, 1582, -175, -1299, -245, 2012, 1442, -1017, -1398, 775, 2437, 1083, -1473, -1054, 1358, 1459, 6, -1529, -704, 1685, 1558, -557, -1802, -412, 2176, 1129, -1686, -1775, 1077, 1706, -326, -1807, -730, 1558, 1206, -907, -1687, -596, 1081, 833, -1244, -1951, 50, 1758, 195, -1614, -1407, 1087, 1430, -726, -2240, -795, 1358, 889, -1477, -2022, -234, 1130, -68, -1825, -1564, 616, 1333, -407, -1982, -918, 993, 1014, -692, -2197, -553, 1436, 658, -1610, -1600, 104, 1723, 161, -2240, -1638, 960, 1390, -499, -1498, -175, 1382, 814, -1130, -1438, -6, 1271, 421, -1350, -1015, 768, 1498, 420, -1539, -988, 1270, 1580, -378, -1670, 90, 2191, 1400, -1104, -1264, 930, 2126, 565, -1519, -718, 1250, 1887, -418, -1489, 138, 1833, 1378, -566, -924, 583]
2652E83J715j162k226l00K409P33j364j830J306J885l06j945q56J703J738j091
2668I92k044k57J994J025j269j855O62J871L82k053j065Q23K227m41j974p76K124
2685C66J633j000k226j60K089O61j649j908R92K344O0k362r61J919J606j001j826
2702a423J80J470Q40j014j576N38J646O43j972j396R85K053k37k195q87K144J642
2719A441j119j802M14J997M39j803j304J167J172j19j048j154J183J905m93k131
2735a255l39K050R57j319j827N44K365K92k198n90J315J547o91k159K36J390J148
2752A466r90j723N13J782N42j182j599O63J972j16j791o50J262J419n95j769o59
2769a455K392J111j545j984J160K240n68j968o77J593J347p66j374n51J328J538
$$ y = [583, 2298, 1136, -1090, -1390, 1019, 1752, 388, -1442, -136, 1749, 1443, -502, -1358, 345, 2083, 992, -1052, -1309, 685, 1710, 441, -1414, -752, 1119, 1501, -552, -1617, -794, 1433, 992, -982, -1758, 366, 1999, 999, -1227, -1387, 702, 1363, -286, -2194, -1202, 1142, 1202, -1160, -2121, -202, 1404, 403, -1423, -1243, 227, 1067, 53, -1523, -985, 661, 1304, -668, -2064, -1079, 974, 737, -1458, -2345, -201, 1441, 322, -1480, -1066, 931, 1370, -433, -1737, -570, 602, 483, -565, -1719, -536, 1369, 876, -1255, -1594, 456, 1413, 94, -1733, -1189, 1176, 1468, -730, -1320, -5, 1542, 851, -1308, -1072, 318, 1466, 476, -1247, -734, 1048, 1590, 408, -1191, -528, 1444, 1328, -463, -1113, 149, 1568, 973, -796, -1455, 937, 2048, 503, -1481, -321, 1919, 1351, -617, -1294, 299, 1646, 880, -494, -1045, 283, 1821]
2785A821j043j741j76K095Q75j904j536J445K484o31k246p18J662J553j369j837
2801a266K60J815L73j192j575R25K122O4j752j358J267J729o03j904l60J831J023
2818A399r74j821J94J919N77j867j392J040J995m10j869l57J933J015j200j459
2834a277K14R98R45j422j080O17J385N52k002o46J215J848l00k699k85K236N46
2851H45j090j623Q51J880k3j196j382J195J112K67j804n11J253J491n56j840J09
2868a022J995P03j645k035Q24K359k49j723p97J172J789m42k038JK024N22j017
2885D21j637O66J882J24j556j117J287J161k28j358o06J028J519q41k068L06J925
2902I08J277j880j450J255J119M34k204o18J313J553j098j295k27J439J166p22
$$ y = [1821, 778, -963, -1139, 956, 1831, -73, -1609, -164, 2320, 1689, -557, -1275, 387, 1940, 571, -1266, -1006, 809, 1182, -10, -1585, -660, 1462, 1526, -226, -1584, -317, 1412, 809, -1095, -1455, 376, 1399, 425, -1396, -1202, 717, 1294, -573, -1965, -925, 1070, 660, -1209, -1566, 367, 1382, 182, -1277, -1063, -65, 880, -542, -1622, -1005, 380, 932, -1070, -1716, -501, 1347, 1047, -1652, -1937, 299, 845, -245, -1868, -1017, 863, 840, -356, -1738, -543, 569, 836, -968, -1479, -226, 1265, 709, -1131, -1022, 973, 1676, 31, -2004, -1180, 1179, 930, -793, -1590, -418, 1371, 929, -1109, -1108, 916, 1438, 421, -1216, -550, 1332, 1456, -100, -1217, 70, 1231, 1003, -355, -961, 67, 1586, 745, -1323, -1017, 908, 2185, 305, -1145, 110, 1229, 1663, -541, -1159, 154, 1707, 609, -686, -913, 526, 1692, 970]
2918I70j431k90J633P05j717j140J236J685k56k058n69J772J013q03j702M1J608
2935F97O66j307j286R11J098K75j554q89J400J230m43j919k55J454P17p24j628
2952a557O16J694L61j329j368R03J676l81j920M6J469O92n40j449p0J541N43j322
2970c95j053L70J828K23j494j282J348J462k87j729n42J644J001j188j545O03
2986a036J706J72j174j328J430J514l06k105k99J594J003q63j500K06J587P08
3002A309j317j156M35J733k14j323r67J444J757q65j359m69J624J054j244j560
3018a118L68J455L29j540l51O68J436j80j266o22J041J544r01j726r0J830O93
3035A570j495r09L60J717j58j173r31R94J325l82j930J31J559P30r61j183L82
$$ y = [970, -461, -751, 882, 1587, -130, -1270, -34, 1651, 1395, -663, -1232, 540, 1553, 750, -952, -911, 697, 1363, 56, -1230, -319, 779, 1054, -500, -1389, 11, 1241, 798, -1121, -1376, 78, 795, 71, -1557, -941, 753, 1114, -215, -1583, -680, 996, 615, -1305, -1259, 210, 902, 362, -1087, -1157, 384, 927, -395, -1448, -1078, 750, 973, -521, -1803, -455, 1007, 720, -1009, -1551, 93, 1094, -94, -1639, -1036, 670, 842, -332, -1660, -230, 1284, 978, -1127, -1426, 168, 1171, 308, -1192, -986, 601, 1309, -8, -1164, -729, 1004, 790, -533, -1500, -56, 1701, 836, -523, -992, 632, 1686, 442, -1118, -750, 705, 1034, -506, -857, -189, 1247, 1067, -199, -821, 220, 1764, 863, -863, -953, 877, 1570, 75, -834, -474, 1243, 1085, -88, -1019, -25, 1300, 918, -1012, -881, 678, 1408, 447, -736, -354]
3052c54J325N28j433j382J343J101n95j255l05J647Q84r95j499j03K011K51j501
3069c32j182J313R14N6j632n59J404J073p61j282j58J082J166j149j517R64J116
3086E16M34j254q75R42J230m38j959j05J451J074q94j712N30J883L73j440j292
3103a536R54J317k84j432n38J258J334k50k051l2J625O50j373j038L93J881n2
3120H26j260j010J414R96o7j634m55J646O83j151j235K06J541P08j388q69P78
3137b71J625j52j613p13J471R87p85j583M44J127J027j556p62L65J532p2j162
3154i1j082J196J345o76j192kJ301O87j166j276K39J618L96j223j372J419R51
3171A072J41j272p47J046J299p37j451k37J559N82j141j103L35J704L63j678p95
$$ y = [-354, 971, 1499, 66, -1316, 27, 1128, 533, -722, -1027, 620, 1504, 509, -990, -1093, 918, 1169, -332, -1514, -201, 713, 769, -863, -1422, -18, 1055, 294, -988, -1146, -64, 1102, -47, -1564, -600, 516, 950, -304, -1179, -237, 993, 555, -1404, -1509, -58, 1016, 122, -1590, -1060, 823, 1196, -244, -1536, -582, 735, 451, -981, -1519, -261, 1073, 823, -1228, -1260, 365, 1015, -358, -1396, -1003, 878, 826, -434, -1444, -30, 966, 899, -735, -1190, 456, 1139, -12, -1247, -1041, 500, 1208, -180, -1049, -271, 1354, 1202, -411, -1124, 347, 1334, 549, -1034, -590, 537, 1564, 8, -754, -389, 1143, 1071, -91, -1173, 23, 1368, 692, -500, -502, 799, 1486, 320, -956, -717, 901, 1297, 74, -1298, 121, 1072, 1213, -59, -806, 240, 1539, 802, -649, -886, 673, 1255, 114, -989, -654, 1050, 1413, -265, -1060]
3188a060Q76J310m18j604j88J620Q18r85j022J38J252K76j149j014O16J561j88
3205H39j744j61J227J071j104r41J21J137P37j368j253P20J552K4j606n62J063
3222b48J529r76j302l53J417R32j197j062N44J639P9j231j112J019J248k57j613
3239i44l32J319Q16q01j228N4J478N83j150j134P51J211J38j472p44J743N58k33
3257F13j215o81J877O95r54j782P88J496N1j433o37J214J155j71j419n34J311
3274C74R34j035j140l1J438O02p02j441Q55J305n50j403j48J363P58n69j399J36
3292f53J369Q54j422q23M61J080K3j044m40L64J512n38j033k04Q97Q09p91j206
3310g85k4J498K22j310o30N80J733l62j229m55J032P76p13r95q6J115L73q92o83
$$ y = [-1060, -184, 1126, 708, -896, -1084, 536, 1354, 369, -653, -515, 737, 1013, -136, -1150, -534, 1027, 839, -905, -1066, 161, 1232, 128, -813, -692, 445, 1182, -186, -1439, -719, 833, 857, -749, -1311, -248, 1281, 305, -997, -1350, 67, 999, -198, -1260, -716, 923, 1002, -229, -1341, -322, 926, 669, -944, -1276, 43, 859, 58, -1170, -1116, 362, 945, -205, -1339, -588, 623, 761, -711, -1455, 288, 846, 613, -602, -1283, 594, 1289, 335, -1447, -659, 837, 888, -545, -1182, 32, 1187, 1016, -403, -937, 374, 1308, 273, -867, -898, 540, 1142, 440, -1001, -146, 1159, 609, -794, -942, 421, 1179, 610, -789, -653, 716, 1570, 148, -675, -214, 866, 889, -155, -595, -231, 1281, 743, -290, -494, 403, 1212, 421, -785, -809, 689, 911, -399, -1029, -449, 1284, 922, -307, -762, 270, 1046, 333, -662, -748, 367, 740, -152, -835]
3329h35L42J122N22j246j127O20J241m9j568k7J064N80m77j092K37J354M29j393
3347c03r62P46R05l0j296j37J048Q83k48j664nJ079N14q71p89L7J647J07r79r34
3367a252J100J084m70j506l36J552N95q17j040N83R21L89q93p45L18J379J45j497
3385d90o51J064O46J17j197j43J219P36j328p72J56J421J09j287o07R43R96l52
3403E80r75l14J244O97r93j052L12R39M17r63o43P08J253k10j322m77J247P27
3421A175p94j294p9J615O55r28r28L84J343j20j335o46J083J269r99r96l88J481
3439D98O79p95r93M5J012M22q84r78P83J295N1j552m31J122O48n31j011k81J180
3458B79N05r33m56K14J031J23j007q96O95J250l42j050m21J041O26n53j170K83
$$ y = [-835, -493, 629, 1151, -95, -1222, -602, 639, 590, -978, -1005, 59, 639, 162, -930, -693, 661, 1090, -303, -1265, -519, 386, 356, -940, -1077, -29, 854, 606, -1058, -1063, 16, 530, -341, -1130, -1093, 554, 661, -318, -1252, -152, 932, 462, -1044, -1380, 172, 767, -50, -1090, -507, 414, 803, -90, -835, -517, 862, 1007, -490, -1141, -77, 569, 686, -511, -654, 565, 1301, -27, -799, -643, 778, 887, -400, -1007, -64, 932, 580, -395, -709, 535, 1232, 239, -813, -501, 438, 855, -108, -751, -43, 1210, 1000, -322, -799, 448, 1175, 381, -913, -992, 623, 1278, 350, -578, -194, 1149, 1029, -306, -952, 131, 1400, 401, -595, -983, 498, 1177, 382, -611, -566, 446, 868, -16, -994, -211, 1084, 1135, -417, -848, 274, 922, 391, -620, -901, 279, 784, -149, -605, -391, 640, 763, -244, -1140, -445, 805, 463, -587, -1008, 33, 659, 106, -1064, -781]
3476g81J323N2r21p72M92J058J57j069p35R18R99p50n21j60J128M22r62j001K65
3495h58J170N48j250n75O16J360m85j701J22J108O59q24o91J56J332J97j215o74
3513a005R51Q12m1j177j11R77M86m58j327L22R43O00q10q88M75R28j04p44p91
3532i62Q95Q68k19j220p8J005O39n56r54J80J235j17q15m21J01J424k71j086l63
3551g15O42J209o47r75n8J260K97p43p64N55J037l95q49n39P97P06k21j216j03
3570g22J140M37o87j020N06R35O9m93j070O54J166m28p20o91R54J020p99j068
3588h17L08J039M39j246o94P22P55j03n68m94N85Q38n12j035k44R96M90m64o27
3607f32j72J303M8j108m24N88J202k97j275j98N82J183r29n56k13J077N93n53
$$ y = [-781, 542, 594, -327, -1099, -607, 451, 608, -461, -1196, -278, 721, -29, -550, -710, 418, 840, -122, -1123, -858, 312, 860, -390, -965, -349, 1011, 526, -1175, -1053, 55, 714, -110, -801, -645, 687, 884, -331, -1005, -54, 758, 717, -460, -571, 406, 892, 434, -893, -571, 372, 972, 162, -726, -251, 677, 573, -171, -962, -67, 801, 582, -638, -716, 289, 928, 372, -582, -402, 833, 716, -99, -520, -419, 1005, 734, -352, -715, -73, 1136, 489, -486, -544, 716, 1013, 270, -494, 61, 1098, 703, -146, -685, 112, 818, 597, -619, -722, 418, 855, 168, -852, -346, 589, 658, 165, -905, -251, 915, 487, -233, -924, 30, 1050, 251, -817, -509, 530, 969, -277, -971, -249, 506, 403, -165, -659, -74, 764, 252, -783, -1027, -31, 459, -5, -632, -804, 499, 547, -561, -985, -397, 805, 508, -767, -965, -383, 800, -129, -685, -898, 179, 772, 219]
3625B19j126J50J501k31j038l71O37R05l72q54j92J044N17q08j083K52J342J02
3643E94j109l47P24Q86k7j402k20J306M34p93p78L55Q54L21q59m10J79J004k11
3662E01p16p40R49R90k45j481K93Q47M45r69l15M80Q43l79o24q06O96R35n4j014
3682c64l46R43P04l58j087K40R98N0n50j047N97R06K66j025l31P34M53k35j259
3701g11J07J093N19j075o75N02J010l40n64o89Q38O68j82j240k36P55Q71k63j409
3720a021M31R85K90j199m91N96J117n02o35j91P02N87K9j367K58M53O67o38r86
3739i15M68R85J38j179m11N89Q36j45j236K61P84K67n65r15M02R43K30o84n71
3758g18L67Q12J32j009l35O04P52l09j113K36P60L83l54j147P3J320L25j053p42
$$ y = [219, -907, -757, 744, 513, -525, -896, -259, 646, 274, -580, -772, 272, 789, -19, -1102, -850, 492, 594, -515, -862, -138, 748, 721, -681, -901, 405, 839, 46, -732, -377, 477, 798, -61, -471, -292, 712, 501, -215, -955, -6, 984, 739, -742, -449, 398, 843, -126, -441, 39, 882, 503, -121, -927, -231, 704, 650, -364, -710, 233, 937, 579, -508, -268, 730, 780, 230, -817, -220, 686, 952, -73, -404, 330, 783, 548, -711, -604, 489, 1008, -67, -742, -240, 770, 430, -134, -823, 15, 683, 501, -739, -975, -220, 651, 388, -1021, -590, 395, 685, -514, -1005, -409, 708, 206, -429, -620, 82, 669, 698, -669, -411, 42, 709, 71, -915, -447, 538, 676, -503, -914, -325, 511, 366, -870, -609, 175, 442, -123, -1038, -636, 307, 537, -147, -718, -351, 461, 593, -416, -751, -147, 605, 296, -817, -581, 179, 562, 208, -939, -866, 454, 779, -274, -1016]
3777a016J093N66j82j150L7J033K71n10o18K13N91L99p17l30K9R59j15r65k20
3796f32Q28R34q41p54J55R41M28j051q49M81J144k78n58m03L89J027m74p62j23
3815c98J031K16l04j366R34L61K81o67o08L96O29J88r26m25Q93Q22r17o64k1R41
3835C96K14o23o57M18R57O6j030l81R07J82pq79l59J070P10r05p48R7J383k44
3855E67o05j173Q33P91l1j123N0P20O21n45o35K16N17M41p34n93K83M81L71q71
3875d19l36N90Q59m02r71j28R95N18o37r95L18J169j01p20n47M95O70m7o65m01
3895g55Q33Q73q15o16R7L81R30q52p24N87N03J15q02m04P68N01k41q53l25J053
3915B54N51p81m00L02O33km73p68Q35O44l19n13m90Q18L44l27q89R5P87N53r22
$$ y = [-1016, 77, 643, 461, -689, -652, 381, 652, 142, -476, -263, 328, 727, 10, -320, -291, 668, 553, -412, -632, 196, 1130, 289, -465, -310, 631, 1059, 8, -841, -360, 784, 506, -52, -455, -66, 961, 487, -275, -398, 633, 849, 545, -821, 113, 474, 755, 88, -520, -124, 505, 693, -233, -658, 235, 1057, 140, -524, -545, 396, 610, -13, -670, -252, 705, 771, -259, -640, 267, 449, 442, -437, -796, 274, 984, 79, -669, -572, 811, 567, -38, -1211, -378, 413, 382, -741, -691, 29, 650, 105, -530, -314, 203, 644, -90, -683, -400, 81, 452, -419, -755, -165, 694, 292, -679, -807, 188, 706, 69, -926, -608, 561, 460, -260, -807, -312, 358, 311, -354, -755, 78, 951, 136, -480, -383, -2, 928, 76, -648, -61, 442, 557, -245, -649, 119, 620, 379, -474, -799, 254, 805, 24, -376, -74, 559, 557, 84, -684, 151, 795, 476, -37, -527, 291, 635, 308, -581, -486, 301, 854, -68]
3936f8l47O0R31K92p67p01O92Q24n79o74k39J063J26j74p85K18M25N15q03m58
3956d49O80K99K05j084l10R46N02o33p05L49N31K04p48o26N50N88J53r20l39P79
3976b8M74l48n42k2P44K29n37p57J70P64L64n41o97N23O67k97r66j58Q68N43n16
3997f3q16N9R83J51m91n71O34N97l69m53m00L55P53k55r17Q8R52N29j043m33L02
4018d08R43l06m60m9L31N63l53n30n84R62Q45p91q45J95P46l8m38m31M55R43k27
4039E23q68m31O90Q80n52m70l94O99K75j67j035N63R51j63r62k6O09O06l28o95
4059b95OL14N53k15o23N8M42O52o40o22K06M80K35q09j92O13N23k59r86K38O97
4080C76K88n13n62L41O05m2o24n88P02P25k81j137J66O70N27m22o24O2L39N71
$$ y = [-68, -415, -355, 576, 868, 101, -600, 92, 916, 337, -337, -576, 487, 613, 439, -346, -128, 297, 812, 9, -449, 231, 530, 735, -349, -659, 287, 789, 156, -549, -200, 331, 535, -213, -839, -289, 299, 452, -468, -807, -28, 446, 98, -444, -466, 278, 507, -30, -787, -617, 147, 511, -30, -727, -204, 463, 166, -800, -958, -90, 453, -63, -879, -820, 163, 314, -177, -748, -114, 483, 114, -339, -739, -384, 369, 114, -803, -715, 237, 766, -277, -710, -408, 535, 229, -231, -280, 51, 614, 261, -269, -853, 109, 954, 163, -682, -487, 259, 221, -217, -648, -193, 750, 523, -345, -776, -86, 794, 242, -228, -622, 77, 352, 185, -850, -287, 664, 501, -461, -487, 122, 728, 400, -295, -289, 25, 578, 363, -260, -202, 240, 892, 252, -370, -164, 316, 551, -258, -450, 163, 686, 427, -559, -321, 376, 664, 151, -411, -70, 535, 493, -131, -719, -17, 708, 427, -710, -544, 126, 653, 231, -393, -331, 8, 579]
4100E79o95q37P21M73J46q00o24J126M32m55p19J95N77J50R9j108O49M52M2p25
4120c22m85O82O39m8q57n72R91P99r87n72J43J025o2o35k56LJ057k40p70j80L95
4141b52P62m29o53j44R58o6k33o47M70O72J34o39p33P78N63m94n56k45Q38M99
4161E83o84p35L69R35J22n61p49P71N07j75o63j13O33K67o9r04k5O70L93k20p75
4182d23K46P45L53j207j57O72K63j01p32p3M90O41j38q27j52O88M39n50q76N39
4202a60O24Q6p30k56M49O70o28r27N71Q01m0l25p04L47P84J30p41j33n9Q10M5
4223F14p07p89J063L23k46q85P4Q16M54n50j010M65J160n16o77q5O68K20m23l87
4243d18J04K62L49j45p67K76O16K14o77l97M65L73P0q69o2P82K64n36l41J59M89
$$ y = [579, -116, -953, -232, 241, 387, -413, -1037, 89, 521, 66, -653, -458, 119, 269, 368, -740, -91, 361, 403, -322, -807, -125, 514, 466, -391, -963, 28, 827, -160, -732, -589, 436, 374, -261, -517, -514, 543, 303, -467, -647, -252, 510, 81, -572, -716, 242, 176, -57, -704, -234, 438, 572, -67, -800, -22, 541, 47, -509, -754, 84, 583, -101, -836, -467, 468, 590, 29, -720, 51, 558, 383, -280, -393, 240, 507, 438, -466, -491, 179, 572, 352, -423, -177, 568, 921, -286, -443, 229, 492, 391, -341, -414, 76, 717, 579, -248, -400, 288, 727, 177, -699, -160, 464, 550, -180, -436, 13, 683, 55, -872, -301, 500, 460, 135, -569, -222, 562, 692, -49, -182, -241, 569, 614, -93, -882, 181, 504, 258, -627, -553, 263, 717, 167, -843, -378, 782, 266, -411, -496, 172, 392, -31, -418, -314, -52, 297, 152, -615, -339, 277, 491, -186, -583, -118, 255, 325, -544, -606, 176, 440, -96, -437, -278, 211]
4264B11J84o29m66K77Q60r8p36nM88L78o14m75L10L16M39o03j76k43R36J70r23
4285c99l1M27K51j01n02qO48L40k64o92O4P00l40k24m02M11O38j93p35j04O42
4306A26M37l80l61j55Q64R8n54o71M46P94k26n02n39N42Q59m64n79j39J063J1
4326F70k58o20J79N76j16m88j52jN61J02n55l78O00M30k58p12M91L90L25r63l05
4347d82O54J54J13o62k38N76N22k16o35m42N35O80m77m01J44M16J38n25l05K42
4367b09N38n8p47k27N76O11k32p09P4O93J20n47n47K35O52N1p46M4M51K96j87
4388A32k95n79P65N47n93n99J96O68K40r56k46O04O13l64r44K47Q94k56o6n45
4408e37J21M94N04q69j99L79K64M26n88o10O78N98l10q47J4O14M24o62n04Q14
$$ y = [211, 395, -234, -700, -423, 437, 339, -397, -402, 86, 464, -150, -625, -315, 1, 440, -163, -339, -582, 354, 524, -399, -430, -3, 248, 147, -355, -363, 285, 625, 361, -331, -267, 433, 93, -131, -533, -122, 516, 323, -412, -516, 126, 563, 183, -178, -333, 531, 629, 75, -596, -150, 644, 418, -84, -623, -81, 778, 314, -265, -404, 659, 670, 412, -208, -29, 547, 431, -57, -209, -210, 351, 453, -102, -480, 120, 550, 292, -420, 71, 461, 786, -177, -482, 172, 326, 439, -223, -461, 115, 637, 421, -214, -656, -121, 559, 82, -319, -175, 241, 379, -146, -451, -209, 329, 271, -476, -703, -127, 484, 252, -457, -383, 310, 430, -117, -664, -429, 223, 274, -472, -428, 23, 319, 132, -163, -742, 23, 570, -23, -622, -426, 242, 482, -474, -720, -116, 497, 133, -811, -564, 330, 74, 8, -537, -416, 78, 582, -287, -486, -107, 157, 583, -5, -615, 63, 661, 351, -496, -482, 132, 556, -106, -610, 204]
4428B04M15k69n62k14L00P08j97m12j46L61L99l72o63K19O83o8o29j86K61O17
4448D49K70p20n88O71Q20p09n33K52J68O09m49p10M23L76Kn21l49M58O66r1p10
4469b16n4N93J92l72l53j45J061n4n96n76M62O00l91o83j70R30K86j19q13J7N90
4490A89K22n03l96J92M34M4n11j62K22M08J95q00j68P53M88l94q83K38Q03P6n44
4511i7o95P78L48l72m30j00N42M06k95k31m33Q56L52o42o43M03O87j08n52n70
4531g96O59O90p30l12m0O08L39n96Pj02P10k25r1o13j1Q69q1m37l18N07L68l59
4553D6l18j77L86M82l72o89Q25J97K31n33n78P30M14k59p84J22M15K50k14k20
4573d6k68O81J38l49n60L97O46j51o51l49N28M23l6o99M6M90L01o03l74O15Q2
$$ y = [204, 619, 350, -212, -426, -126, 582, 385, -27, -173, 188, 587, 215, -448, -229, 454, 386, -243, -429, -168, 449, 719, -1, -589, 82, 902, 193, -340, -88, 80, 689, 240, -470, -47, 329, 331, -190, -539, -81, 585, 494, -216, -270, 323, 515, 143, -210, -355, 706, 652, 56, -520, -58, 542, 151, -532, -702, 228, 514, 395, -418, -401, 189, 411, -92, -488, -296, 138, 182, -329, -491, -269, 139, 334, -466, -634, 119, 607, 213, -670, -432, 371, 447, -97, -792, -14, 334, -38, -468, -568, -26, 380, 85, -146, -579, 277, 629, -13, -656, -253, 434, 326, -226, -796, -137, 553, -177, -489, -529, 79, 418, -178, -171, -273, 437, 212, 121, -492, -503, 366, 285, -152, -470, 37, 405, 46, -272, -449, -63, 419, 47, -642, 183, 380, 611, 78, -500, 230, 644, 385, -399, -277, 138, 388, 174, -46, -314, 367, 505, 156, -404, -7, 639, 488, -163, -512, 16, 439, 403, -296, -250, 240, 541, -62, -436, 179, 261]
4594B61K94o81l53N03N40L6p24l89O77K02l70j38j35Q26O9n96j72K12L12Ro80
4615b97l21J064J1j81p06J10P46J55q59j72j01Q58jo35k91O31O74l92o92n4P09
4636B56L28q16k67K98N49J47j075O2L22P43m76m64l49Q45M59l11p32n4M59O57
4656E81n61k89j06N16Q4o10j69M95N18k18p36J02P01K58n05p82M65L78L16p02
4676b64k54N85L15J04r37l6M71K97k01m44J80N62R5q08J67m4R10l81m80k96M07
4697e2M74l66n80J39K86Q73p20m42K03N78J50n39m66K66N68j11l25m60Q98L82
4717G56n93m56N6M93L96m64p15M2P54L04q62k6L02O95m17n70r1L71N13m13o62
4738e87L90O33J23m72n33K98N35J16j102OO02L60m98j82r8M62J0L7n90J01O48
$$ y = [261, 555, -126, -479, 24, 564, 600, -124, -513, 164, 366, -4, -142, -277, 549, 618, 22, -150, 62, 374, 383, -297, -618, 446, 457, 276, -430, -320, 426, 581, -278, -450, -551, 307, 306, -329, -620, 11, 685, 293, -399, -453, 256, 584, -232, -499, -201, 348, 495, -580, -518, -196, 547, 71, -393, -742, 103, 562, 251, -481, -535, -76, 581, 20, -269, -375, 141, 225, -385, -554, -59, 459, 241, -495, -393, 308, 566, 61, -721, -256, 122, 438, -264, -518, 67, 382, 486, -451, -487, -16, 281, 80, -364, -184, 378, 473, -335, -168, -212, 698, 317, -163, -459, -52, 422, 56, -524, -385, -99, 774, 54, -388, -185, 393, 543, 4, -462, -196, 372, 261, -64, -524, 374, 756, 163, -293, -237, 256, 652, 188, -527, -485, 269, 573, -289, -315, -13, 682, 265, -305, -396, -25, 488, 75, -587, -197, 436, 559, 87, -446, -148, 387, 503, -599, -593, 9, 369, -129, -311, -409, 53, 63, 100, -490, -389, 259]
4759B59J2n52qK90L30m29m09J64M09K97n82m43M51O95k03k97m72J44P27J8q54
4780d53K6L32L92m22k96K60K31J26m63r6R1M49q2l96o8N84L39l76q31L73L14M43
4802D77m22m86J97M08J04m20k49J41M51k22j82q3L16M90l46m81J65N97J51j051
4822d45P2L7O04J89q34K8M14K59L4n34k36P13L37m77p26L05P52k5k13o11M45J42
4844B30O2n28k55R30M09m01n85o7N00K59m96m54J73O38on02l82O56K29k39n75
4865d04J30M74J24n99l66L05O50Rm65L4J13K81L6m81j81M25M74l84p88L82L00
$$ y = [259, 271, -281, -289, 1, 331, -98, -507, -343, 66, 363, -219, -662, -211, 484, 281, -16, -488, -344, 383, 401, -453, -427, -95, 297, -125, -421, -161, 70, 196, -267, -363, -272, 177, 95, -301, -369, 215, 554, 178, -653, -280, 34, 477, 55, -431, -234, 174, 278, -142, -391, -250, 201, -21, -203, -286, 30, 520, 174, -307, -142, 455, 606, -445, -373, -336, 268, 457, -377, -349, 65, 324, 358, -176, -412, 301, 638, 161, -565, -260, 492, 467, 254, -357, 88, 230, 292, -236, -491, 439, 848, 447, -138, -205, 295, 554, 58, -396, -223, 415, 409, -93, -475, 181, 410, 171, -404, -274, 200, 324, -275, -641, -336, 314, 323, -142, -108, 5, 286, 322, -159, -340, 85, 559, 175, -613, -231, 69]
$$ [...]
8191A68
##END NTUPLES=NMR FID
##END=
