##TITLE=1H_Costus-2Kg-Acet-A
 CDCl3, 8 sc, 
 26.2.2020
##JCAMPDX= 6.0         $$ Bruker NMR JCAMP-DX V2.0
##DATA TYPE= NMR FID
##DATA CLASS= NTUPLES
##ORIGIN= UXNMR, Bruker Analytische Messtechnik GmbH
##OWNER= root
$$ XWIN-NMR		Version 3.5
$$ Wed Feb 26 14:08:35 2020 Russian Standard Time (UT+4h)  she@DPX200
##.OBSERVE FREQUENCY= 200.1315
##.OBSERVE NUCLEUS= ^1H
##.DELAY= (6, 6)
##.ACQUISITION MODE= SIMULTANEOUS
##.ACQUISITION SCHEME= undefined
##.AVERAGES= 8
##.DIGITISER RES= 18
##SPECTROMETER/DATA SYSTEM= spect
##.PULSE SEQUENCE= zg30
##.SOLVENT NAME= CDCl3
##.SHIFT REFERENCE= (INTERNAL, CDCl3, 0, 15.7039)
##AUDIT TRAIL= $$ (NUMBER, WHEN, WHO, WHERE, WHAT)
$$ ##TITLE= Audit trail, XWIN-NMR		Version 3.5
$$ ##JCAMPDX= 5.01
$$ ##ORIGIN= Bruker BioSpin GmbH
$$ ##OWNER= she
$$ F:/spectra/data/she/nmr/H-F/1/audita.txt
$$ ##AUDIT TRAIL=  $$ (NUMBER, WHEN, WHO, WHERE, WHAT)
(   1,<2020-02-26 14:07:34.21 +0400>,<she>,<DPX200>,
      <created by zg, POWCHK disabled, PULCHK disabled
       configuration hash MD5:
       00 E9 B6 7A A2 85 ED C7 34 08 36 98 17 FE 4E 26
       data hash MD5: 16K
       9C B8 EB 62 67 93 4A FC E6 E4 7C CB BE F8 74 CF>)
$$ ##END=
$$ 
$$ hash MD5
$$ 65 07 37 4E DA 37 6E 5F 64 88 EB E2 F6 51 92 FE
##$RELAX= 
##$RELAX= 
##$RELAX= 
##$RELAX= 
##$RELAX= 
##$RELAX= 
$$ Bruker specific parameters
$$ --------------------------
##$DU= <F:/spectra>
##$EXPNO= 1
##$NAME= <H-F>
##$PROCNO= 1
##$TYPE= <nmr>
##$USER= <she>
##$AMP= (0..31)
100 100 100 100 100 100 100 100 100 100 100 100 100 100 100 100 100 100 
100 100 100 100 100 100 100 100 100 100 100 100 100 100 
##$AQSEQ= 0
##$AQ_mod= 1
##$AUNM= <au_zg>
##$AUTOPOS= <>
##$BF1= 200.13
##$BF2= 200.13
##$BF3= 200.13
##$BF4= 200.13
##$BF5= 200.13
##$BF6= 200.13
##$BF7= 200.13
##$BF8= 200.13
##$BYTORDA= 1
##$CFDGTYP= 0
##$CFRGTYP= 5
##$CHEMSTR= <none>
##$CNST= (0..31)
1 1 145 1 1 1 1 1 1 1 1 1 1 1 1 1 1 1 1 1 1 1 1 1 1 1 1 1 1 1 1 1 
##$CPDPRG= <>
##$CPDPRG1= <>
##$CPDPRG2= <>
##$CPDPRG3= <>
##$CPDPRG4= <mlev>
##$CPDPRG5= <mlev>
##$CPDPRG6= <mlev>
##$CPDPRG7= <mlev>
##$CPDPRG8= <mlev>
##$CPDPRGB= <>
##$CPDPRGT= <>
##$D= (0..31)
0 1.2 0 0 0 0 0 0 0 0.06 0 0.03 0 0 0 0 0.0002 0 0 0 0 0 0 0 0 0 0 0 0 
0 0 0 
##$DATE= 1582711653
##$DBL= (0..7)
120 120 120 120 120 120 120 120 
##$DBP= (0..7)
150 150 150 150 150 150 150 150 
##$DBP07= 0
##$DBPNAM0= <>
##$DBPNAM1= <>
##$DBPNAM2= <>
##$DBPNAM3= <>
##$DBPNAM4= <>
##$DBPNAM5= <>
##$DBPNAM6= <>
##$DBPNAM7= <>
##$DBPOAL= (0..7)
0.5 0.5 0.5 0.5 0.5 0.5 0.5 0.5 
##$DBPOFFS= (0..7)
0 0 0 0 0 0 0 0 
##$DE= 6
##$DECBNUC= <off>
##$DECIM= 24
##$DECNUC= <off>
##$DECSTAT= 4
##$DIGMOD= 1
##$DIGTYP= 9
##$DL= (0..7)
0 120 120 120 120 120 120 120 
##$DP= (0..7)
150 150 150 150 150 150 150 150 
##$DP07= 0
##$DPNAME0= <>
##$DPNAME1= <>
##$DPNAME2= <>
##$DPNAME3= <>
##$DPNAME4= <>
##$DPNAME5= <>
##$DPNAME6= <>
##$DPNAME7= <>
##$DPOAL= (0..7)
0.5 0.5 0.5 0.5 0.5 0.5 0.5 0.5 
##$DPOFFS= (0..7)
0 0 0 0 0 0 0 0 
##$DQDMODE= 0
##$DR= 18
##$DS= 0
##$DSLIST= <SSSSSSSSSSSSSSS>
$$ [...]
##$SUBNAM2= <"">
##$SUBNAM3= <"">
##$SUBNAM4= <"">
##$SUBNAM5= <"">
##$SUBNAM6= <"">
##$SUBNAM7= <"">
##$SUBNAM8= <"">
##$SUBNAM9= <"">
##$SW= 24.9337058887773
##$SWIBOX= (0..15)
0 0 2 0 0 0 0 0 0 0 0 0 0 0 0 0 
##$SW_h= 4990.01996007984
##$TD= 16384
##$TD0= 1
##$TE= 0
##$TE2= 300
##$TE3= 300
##$TEG= 300
##$TL= (0..7)
0 120 120 120 120 120 120 120 
##$TP= (0..7)
150 150 150 150 150 150 150 150 
##$TP07= 0
##$TPNAME0= <>
##$TPNAME1= <>
##$TPNAME2= <>
##$TPNAME3= <>
##$TPNAME4= <>
##$TPNAME5= <>
##$TPNAME6= <>
##$TPNAME7= <>
##$TPOAL= (0..7)
0.5 0.5 0.5 0.5 0.5 0.5 0.5 0.5 
##$TPOFFS= (0..7)
0 0 0 0 0 0 0 0 
##$TUNHIN= 0
##$TUNHOUT= 0
##$TUNXOUT= 0
##$USERA1= <user>
##$USERA2= <user>
##$USERA3= <user>
##$USERA4= <user>
##$USERA5= <user>
##$V9= 5
##$VALIST= <valist>
##$VCLIST= <CCCCCCCCCCCCCCC>
##$VD= 0
##$VDLIST= <DDDDDDDDDDDDDDD>
##$VPLIST= <PPPPPPPPPPPPPPP>
##$VTLIST= <TTTTTTTTTTTTTTT>
##$WBST= 1024
##$WBSW= 4
##$XGAIN= (0..3)
0 0 0 0 
##$XL= 0
##$YL= 0
##$YMAX_a= 372289
##$YMIN_a= -234705
##$ZGOPTNS= <>
##$ZL1= 120
##$ZL2= 120
##$ZL3= 120
##$ZL4= 120
##$ABSF1= 10
##$ABSF2= 0
##$ABSG= 5
##$ABSL= 3
##$ALPHA= 0
##$AQORDER= 0
##$ASSFAC= 0
##$ASSFACI= 0
##$ASSFACX= 0
##$ASSWID= 0
##$AUNMP= <proc_1d>
##$AZFE= 0.1
##$AZFW= 0.1
##$BCFW= 1
##$BC_mod= 2
##$BYTORDP= 1
##$COROFFS= 0
##$CY= 11.3945322036743
##$DATMOD= 1
##$DC= 2
##$DFILT= <>
##$DTYPP= 0
##$F1P= 16.9975609425685
##$F2P= -3.02152046262296
##$FCOR= 0.5
##$FTSIZE= 0
##$FT_mod= 4
##$GAMMA= 1
##$GB= 0.15
##$INTBC= 1
##$INTSCL= 1
##$ISEN= 128
##$LB= 0.24
##$LEV0= 0
##$LPBIN= 0
##$MAXI= 10000
##$MC2= 0
##$MEAN= 0
##$ME_mod= 0
##$MI= 1.114404
##$NCOEF= 0
##$NC_proc= 0
##$NLEV= 6
##$NOISF1= 3.799351
##$NOISF2= 2.8
##$NSP= 1
##$NTH_PI= 0
##$NZP= 0
##$OFFSET= 15.70392
##$PC= 1
##$PHC0= -9783.198
##$PHC1= 7.40082
##$PH_mod= 1
##$PKNL= yes
##$PPARMOD= 0
##$PSCAL= 0
##$PSIGN= 0
##$REVERSE= no
##$SF= 200.130013532006
##$SI= 16384
##$SIGF1= 3
##$SIGF2= 2
##$SINO= 400
##$SIOLD= 16384
##$SREGLST= <1H.CDCl3>
##$SSB= 0
##$STSI= 0
##$STSR= 0
##$SW_p= 3612.71676300578
##$SYMM= 0
##$S_DEV= 0
##$TDeff= 0
##$TDoff= 0
##$TI= <>
##$TILT= no
##$TM1= 0
##$TM2= 0
##$TOPLEV= 0
##$USERP1= <user>
##$USERP2= <user>
##$USERP3= <user>
##$USERP4= <user>
##$USERP5= <user>
##$WDW= 1
##$XDIM= 8192
##$YMAX_p= 0
##$YMIN_p= 0
$$ End of Bruker specific parameters
$$ ---------------------------------
##NTUPLES= NMR FID
##VAR_NAME=  TIME,          FID/REAL,        FID/IMAG
##SYMBOL=    X,             R,               I
##VAR_TYPE=  INDEPENDENT,   DEPENDENT,       DEPENDENT
##VAR_FORM=  AFFN,          ASDF,            ASDF
##VAR_DIM=   8192,          8192,            8192
##UNITS=     SECONDS,       ARBITRARY UNITS, ARBITRARY UNITS
##FACTOR=    0.0002004,     1,               1
##FIRST=     0,             0,               0
##LAST=      1.6414764,     0,               0
##MIN=       0,             -234705,         0
##MAX=       1.6414764,     372289,          0
$$ Real data points
##PAGE= N=1
##DATA TABLE= (X++(R..R)), XYDATA
$$ [...]
1872d45P46l00n14M26L33P0k96o2M78l71k21K85k04M19l07K23L78l46K0l40K29
$$ -445 301 1 -513 -87 246 316 20 -42 436 65 -156 129 -75 344 37 260 638 292 312 -28 201
1893B01K95k76r4K50K92k74j36J97L76o04k67O93j76j75l53O00L84p09j83N19
$$ 201 496 220 126 376 668 394 258 455 831 227 -40 653 477 302 -51 549 933 224 41 560
1913E60J52l66k63K69K76q59k6J012P3m65k45M89Q8n22m63P15J10l37L6O6J15
$$ 560 712 346 83 352 628 -231 -257 755 828 363 118 607 695 173 -290 425 535 198 234 300 415
1934D15m75j52N70n3o32L60J99q1m25J32P7K37j26j03J91K53k32n32N97l10j59
$$ 415 -60 -212 358 305 -327 33 232 151 -274 -142 -65 172 46 -57 134 387 155 -377 220 -90 -249
1955b49J36m8J0N3j45J32m2l40J4L98P0m8m95N47J91o25Qp2P09k15l32k3P4j11
$$ -249 -113 -161 -151 -98 -243 -111 -153 -493 -479 -81 -11 -59 -554 -7 184 -441 -433 -505 204 -11 -343 -366 -292 -403
1979d03l05K60M55l44p3ON50m37J7o8L63r3p48N19N14j91l56K34J68k36P6q0N61
$$ -403 -708 -448 7 -337 -410 -404 146 -291 -274 -342 21 -72 -820 -301 213 22 -334 -100 68 -168 -92 -172 389
2002C89m24l86L01J85j46m74Q00O1o38N7P06J78n90l02L69M87l11l74K37L91l56
$$ 389 -35 -421 -120 65 -81 -555 245 306 -332 -275 431 609 19 -283 86 573 262 -112 125 516 160
2023A60j03l8K45j7n0L68j33l68K21k27M41n78k84N77J28j87O6k02M41J42j45
$$ 160 57 19 264 247 197 565 432 64 285 58 499 -79 -363 214 342 155 221 19 460 602 457
2044D57k98J01K18j99l04J55M19k76n34M53J8m60K38N48l49n09L33L00j98m0m77
$$ 457 159 260 478 279 -25 130 549 273 -261 192 210 -250 -12 536 187 -322 11 311 113 73 -404
2065d04M26oj23L16k79J38l54K63J68k37j10N7J57l91j43J03M22k21o1L86q8k01
$$ -404 22 16 -107 209 -70 68 -286 -23 145 -92 -202 -145 12 -379 -522 -419 3 -218 -279 107 19 -182
2087a82k38n2M72k3l31pJ1M22l74l71P28q4k03k12K36J93l52R0O3K60n70k1L53
$$ -182 -420 -472 0 -23 -354 -361 -350 72 -302 -673 55 -29 -232 -444 -208 -15 -367 -277 -214 46 -524 -545 -192
2110a92K10q2k81J50J35o17K60N93j48l24j97N50j39l89J89N06j80k01k37P24
$$ -192 18 -64 -345 -195 -60 -677 -417 176 28 -296 -493 57 -82 -471 -282 224 44 -157 -394 330
2130C30k04l44j30M34J89k03M8J03j42J60P9L9j26j52N9j18K91k40J39n8J43n02
$$ 330 126 -218 -348 86 275 72 120 223 81 241 320 359 233 81 140 22 313 73 212 154 297 -205
2152b05J86J98M75m65m2m3L39r1m25K05L3J24k64K5J48M4K83j77p4j61q2M14l0
$$ -205 -19 179 654 189 147 104 443 352 -73 132 165 289 25 50 198 242 525 348 274 113 31 445 415
2175D15j95k19K82K82n71j65K95M81n01j41K49r7r0l1J28J13m65J94KM71p84L68
$$ 415 220 1 283 565 -6 -171 124 605 104 -37 212 115 25 -6 122 235 -230 -36 -34 437 -347 21
2197B1r7R5j71j74M48O0j25l85K75P1j23o9K8J79l07k13N82j47J32l05K57k99
$$ 21 -76 19 -152 -326 122 182 57 -328 -53 18 -105 -174 -146 33 -274 -487 95 -52 80 -225 32 -267
2219b67J06k29n3L84l85j18K73M63n84J20o5L83l8l78M76j20Q8l40k03L89n3k96
$$ -267 -161 -390 -443 -59 -444 -562 -289 174 -410 -290 -355 28 -10 -388 88 -32 56 -284 -487 -98 -151 -447
2241d47K44R9l2j10o0O49n26o2n7K98m2l50K51L23l05l80M99R2l97R1M29L84n53
$$ -447 -203 -104 -136 -246 -306 343 -183 -245 -302 -4 -46 -396 -145 178 -127 -507 -8 84 -313 -222 207 591 38
2264C8m16M81Q6j13l25L70j4q9j31J52J60pl11K83k6l62K65j43M69Qj66j38J36
$$ 38 -378 103 189 76 -249 121 107 18 -113 39 199 192 -119 164 138 -224 41 -102 367 375 209 71 207
2287B07Nl54L59N9k08K8J5J46pq6j36J98J81k17j69J11Q0L6j83L94p4j76j91Q1
$$ 207 212 -142 217 276 68 96 111 257 250 164 28 226 407 190 21 132 212 248 65 459 385 209 18 99
2311I9J89l88L90P2J3j80j24K31k90j88M88k34Q9k52k05L65O5k44J69J40j23j92
$$ 99 288 -100 290 362 375 195 71 302 12 -176 312 78 167 -85 -290 75 140 -104 65 205 82 -110
2333a10kJ37l33J99k69J16L58l95k3L95R2j17l26J05J50p0m34N32n3l74L66J7
$$ -110 -112 25 -308 -109 -378 -262 96 -299 -322 73 165 48 -278 -173 -23 -93 -527 5 -48 -422 -56 -39
2355c9j87k48J36J00J78O4m09K34j4J58j84K41j48k73O6K55j47K30n70L89K39
$$ -39 -226 -474 -338 -238 -60 4 -405 -171 -185 -27 -211 30 -118 -391 -325 -70 -217 13 -557 -168 71
2376G1n57J52L87J5Rl23L16j38Q3kJ33j71J3l73O43k38k04K42J28j84N7K07K%
$$ 71 -486 -334 53 68 77 -246 70 -68 15 13 146 -25 -12 -385 258 20 -184 58 186 2 59 266 268 268
2400B68p5j20L05J3l45J28J39j4j80J55NK45m67J60n0j33k1J38J30J15l78M9J79
$$ 268 193 73 378 391 46 174 313 299 119 274 279 524 57 217 167 34 13 151 281 396 18 67 246
2423B46K4j01j11O2n4K31J39k66k98LP3L61j92N8j99rJ60j09j94L73J75l41M6
$$ 246 270 169 58 120 66 297 436 170 -128 -125 -52 309 117 175 -24 -33 127 18 -176 197 372 31 77
2446G7R6jP7j0N5k39p8K63j54R4Q2m30J23P9m75K97Q3J74k49rK61k92L3p4J57
$$ 77 173 172 249 239 294 55 -23 240 86 180 262 -168 -45 34 -441 -144 -61 113 -136 -145 116 -176 -143 -217 -60
2471f0L06k58j36K90n5l55J90LJj46Q2K37j2l1j94l0L3j88J77J8N9q8J48j99J95
$$ -60 246 -12 -148 142 87 -268 -78 -75 -74 -220 -138 99 87 56 -138 -168 -135 -323 -146 -128 -69 -157 -9 -208 -13
2496a3o2k15m2J74J66n05L35J79L4k66Q8j86M67k90j37K15j28J57l51M84l15J87
$$ -13 -75 -290 -332 -158 8 -497 -162 17 51 -215 -127 -313 154 -136 -273 -58 -186 -29 -380 104 -211 -24
2518b4j12R7J97k11Q1L39m00P1M12m95J81k84k29L49L2jq6J91J48m27L04L12q4
$$ -24 -136 -39 158 -53 28 367 -33 38 450 -45 136 -148 -377 -28 4 3 -83 108 256 -171 133 445 361
2541C61l91L27j28l05J97o1Q3J77j45K12k10k47P7M23l25Q3k0m3J76l6j64K63
$$ 361 -30 297 169 -136 61 0 83 260 115 327 117 -130 -53 370 45 128 108 65 241 205 41 304
2563C04l21k5K25m32M72l27L73k94O9j20L55l96J38KL6j37K63j38j67M75k94j64
$$ 304 -17 -42 183 -249 223 -104 269 -25 44 -76 279 -117 21 23 59 -78 185 47 -120 355 61 -103
2585a03k71K31J98Q2l69M03J08j75o1J7J83l53L7j73J54Q4k34r8L69k29nl9J26
$$ -103 -374 -143 55 137 -232 171 279 104 43 60 243 -110 -73 -246 -92 -8 -242 -340 29 -200 -205 -244 -118
2608a18n8o0n5K69j82J51j07N9J82j47k13J70j71j43L05J19q3k48K07j12J70l39
$$ -118 -176 -236 -291 -22 -204 -53 -160 -101 81 -66 -279 -109 -280 -423 -118 1 -82 -330 -123 -235 -65 -404
2630d04L92J78R4k50j02Mj64J71K8lM34m69K1lJ36p1j86K81K48k87q4J03n0J81
$$ -404 -12 166 260 10 -92 -88 -252 -81 -53 -56 378 -91 -70 -73 63 -8 -194 87 335 48 -36 67 17 198
2654A98n92P23j23k68r1N0K26k32J02L15l04O1p2J26l6m9N3L18l10j7J57L9J94
$$ 198 -394 329 206 -62 -153 -103 123 -109 -7 308 4 65 -7 119 83 34 87 405 95 78 235 274 468
2677D68k88j00J96J65j38l06R9J98j75J31p9M0K40n66J05M08m69O1J01J54j8k57
$$ 468 180 80 276 441 303 -3 96 294 119 250 171 211 451 -115 -10 398 -71 -10 91 245 227 -30
2699c0J57J97N7m68J50L1J22N6n1O6l68J38N3O5Rj72o8j07J82L6o8j37q7N3L15
$$ -30 127 324 381 -87 63 94 216 272 221 287 -81 57 110 175 184 12 -56 -163 19 55 -13 -150 -237 -184 131
2724A31l1k49j84J90J16K27m68L10q5L12o40M66j8m62L54r1M6k47q7M35N5k07
$$ 131 100 -149 -333 -143 -27 200 -268 42 -43 269 -371 95 77 -385 -31 -122 -76 -323 -410 25 80 -127
2746a27J55R9k26N6Q5j77M9j24O8j3r2L30j97p3J85l3j34JQ1P4j04j40K47r5J23
$$ -127 28 127 -99 -43 42 -135 -86 -210 -142 -155 -247 83 -114 -187 -2 -35 -169 -168 -87 -13 -117 -257 -10 -105 18
2771A8j77Q5J18k02O1Kj16k09O14K18l01m67J97J0K95l28K16J72k80k73L28J55
$$ 18 -159 -74 44 -158 -97 -95 -211 -420 194 412 111 -356 -159 -149 146 -182 34 206 -74 -347 -19 136
2793A36nj76M8o8O3l2K04o6M2j6N0Q0L2m15J95p1K71n44O00m7j42l02K10J30L3
$$ 136 131 -45 3 -65 -2 -34 170 104 146 130 180 260 292 -123 72 1 272 -272 328 281 139 -163 47 177 210
2818B10m5j69K02j71r5R6J24J52k60l4L3J48N8j71k02Q2l8r2M46O8j57k1j20j19
$$ 210 165 -4 198 27 -68 28 152 304 44 10 43 191 249 78 -124 -42 -80 -172 274 342 185 164 44 -75
2842g5P5J60k43n1M23p9J17l86N8k72K81k56K46j75m0K11J07m53K46O6l1J7j10
$$ -75 0 160 -83 -134 289 210 327 -59 -1 -273 8 -248 -2 -177 -217 -6 101 -352 -106 -40 -71 -54 -164
2865a64m2J60k19M45l63j00L12j18N7j44J42k05K18k06K52j30N0l61O8L23j79
$$ -164 -206 -46 -265 180 -183 -283 29 -89 -32 -176 -34 -239 -21 -227 25 -105 -55 -416 -348 -25 -204
2886b04K05k2q7J09J21k20J33k53O2J8j88L29q6M4J99k88K87k83L36rn17K15R1
$$ -204 1 -21 -108 1 122 -98 35 -218 -156 -138 -326 3 -83 -39 160 -128 159 -124 212 203 -314 -99 -8
2909hR3j53J31K04l46R8K6pn3J61l46K74K79j84k16o8K37j77J51J28r6j66L32
$$ -8 85 -68 63 267 -79 19 45 38 -15 146 -200 74 353 169 -47 -115 122 -55 96 224 128 -38 294
2932B94k18O6M9o6p3K15j36Q3j7P8p4k24M73m24M6q6J58J57q3J51l63K11j61p
$$ 294 76 142 191 125 52 267 131 214 197 275 201 -23 450 26 72 -14 144 301 218 369 6 217 56 49
2956D9K79k28P0k54K50n9l15J53J08l43M28k88L18j78J83k38L82l54q9K67k28
$$ 49 328 100 170 -84 166 107 -208 -55 53 -290 138 -150 168 -10 173 -65 317 -37 -126 141 -87
2977h7J4j12L05j26J19j84K11l83P8o9P3J33J21n4l8j75L06j63j65j7K85ml12
$$ -87 -73 -185 120 -6 113 -71 140 -243 -165 -234 -161 -28 93 39 1 -174 132 -31 -196 -213 72 68 -244
3000b44K94j38j86N3o9R3R3J55J64k25L4J48k25m5M6p4M3n8p4K1J43J50j22n9
$$ -244 50 -88 -274 -221 -290 -197 -104 51 215 -10 24 172 -53 -98 -52 -126 -83 -141 -215 -194 -51 99 -23 -82
3024h2j17P1J39P6n20N42j4k03Q3m7j38N28l66k03O1M57k19k53K05N0k2o7r2k17
$$ -82 -199 -128 11 87 -433 109 95 -108 -25 -72 -210 318 -48 -251 -190 267 48 -205 0 50 28 -39 -131 -348
3048c48J57qM26l45R8P8r2J10J03O9j08O1J44m94J48K56l94J09K53J0J0l3k98
$$ -348 -191 -199 227 -118 -20 58 -34 76 179 248 140 201 345 -149 -1 255 -139 -30 223 233 243 210 -88
3071h8J4J34j3J88J0j91J27m3j8q1J61j25m55L31L28j39m37K15K07j27j02L9M8
$$ -88 -74 60 47 235 245 54 181 138 120 39 200 75 -380 -49 279 140 -297 -82 125 -2 -104 -65 -17
3094a7J9J51l54j42N31k30J45k64k06K75k31K78K38l02Q3K0j48J19j77L84l11
$$ -17 2 153 -201 -343 188 -42 103 -161 -367 -92 -323 -45 193 -109 -26 -6 -154 -35 -212 172 -139
3115a39O7r4j38L62l46J21n6M90k70j96l3J20M7q5K89l44J97O2j70l0oQ6k07K95
$$ -139 -72 -166 -304 58 -288 -167 -223 267 -3 -199 -232 -112 -65 -150 139 -205 -8 54 -116 -146 -152 -66 -273 22
3139B2q0KM79n00K3j98L10j95q0K88j58k6j22O4J60r5r8JL69k67k1K49l94K74
$$ 22 -58 -56 423 -77 -54 -252 58 -137 -217 71 -87 -113 -235 -171 -11 -106 -204 -203 166 -101 -122 127 -267 7
3163Gl3Q9L5k11j95k5L47n3m7j02J83O8j72qJ88q7J71q5%j69M7j51K93ol08M27
$$ 7 -26 63 98 -113 -308 -333 14 -39 -86 -188 -5 63 -109 -117 71 -16 155 70 70 -99 -52 -203 90 84 -224 203
3189B03j05j8j11K99k96J82k11Q1k78M42l64L25l1j32L91l10Pj06J33j02j71K00
$$ 203 98 80 -31 268 -28 154 -57 24 -254 188 -176 149 118 -14 377 67 74 -32 101 -1 -172 28
3211B8J91j48k73p6N41O7p8j26j54L62m4k93o7J22m1Q5J5j81Q9O2Qk7P7o5k70
$$ 28 219 71 -202 -278 263 330 252 126 -28 334 290 -3 -70 52 11 96 111 -70 19 81 89 62 139 74 -196
3236a96K01O4L8k09L56n31J09Q5k8Jm10L93k59K08J97M3j95j50K91k0l32K41k55
$$ -196 5 69 107 -102 254 -277 -168 -83 -111 -110 -520 -127 -386 -178 19 62 -133 -283 8 -12 -344 -103 -358
3259c58J86q7L47j51j91P4n7N5k2K31j61k66L02k91J95L06j15j04k39M07m24L49
$$ -358 -172 -259 88 -63 -254 -180 -237 -182 -204 27 -134 -400 -98 -389 -194 112 -3 -107 -346 61 -363 -14
3281a4o0J4p0Jj40L44k19j90N26k61K69j83K54l94o3M40k66m56M99k17K49l4J11
$$ -14 -74 -60 -130 -129 -269 75 -144 -334 192 -69 200 17 271 -123 -186 254 -12 -468 31 -186 63 29 140
3304A40j78j06K11j84K69M2J8l43J05j5R7j80OK49k48J02K91j19k20M09k63J41
$$ 140 -38 -144 67 -117 152 194 212 -131 -26 -41 56 -124 -118 131 -117 -15 276 157 -63 346 83 224
3326B24l4j09Qr3pK42j34k69J15M1j03K13l10L01K5K81l72r0K64j89r3j06K05
$$ 224 190 81 89 -4 -11 231 97 -172 -57 -16 -119 94 -216 85 110 391 19 -71 193 4 -89 -195 10
3349A0k51K31l43L74N5J16k48K39j98q3p8K35J59m31j04K83K34m16m9P2J79J18
$$ 10 -241 -10 -353 21 76 192 -56 183 -15 -98 -176 59 218 -213 -317 -34 200 -216 -265 -193 -14 104
3371A04J1k50J29p1M0J12p6k38L73k68K11J37l91J09k2m6L78l27K2j62K07j55
$$ 104 115 -135 -6 -77 -37 75 -1 -239 134 -134 77 214 -177 -68 -90 -136 242 -85 -63 -225 -18 -173
3393a73J01n7J29m6j09J18J7k75M07L51n37k82K92M17k99j7q5o3N3pP7j57LR5
$$ -173 -72 -129 0 -46 -155 -37 -20 -295 112 463 -74 -356 -64 353 54 37 -48 -111 -58 -65 12 -145 -142 -47
3417d7j77P6J6n8K2J50K61m05J04q1M9M11N7m07l1N4L56l83p8j3J90l1R2k49r8
$$ -47 -224 -148 -132 -190 -168 -18 243 -162 -58 -139 -90 321 378 -29 -60 -6 350 -33 -111 -124 66 35 127 -122 -220
3442b20M63k52n2J06J21k84K34J05j31J2J42j04j34J0K88m49L5L1K81j53J20k14
$$ -220 243 -9 -61 45 166 -118 116 221 90 102 244 140 6 16 304 -145 -110 -79 202 49 169 -45
3464d5L39k10J45N1n75J69J32J26J40kj15j81j19n1N85l74k47J6J82q4L18j0p9
$$ -45 294 84 229 280 -295 -126 6 132 272 270 155 -26 -145 -196 389 15 -232 -216 -34 -118 200 190 111
3487A11P1j61j8Q1j21K26l15n6M03k27K74k16k43Q4K26m1k35l4J50Q0K35j45J2
$$ 111 182 21 3 84 -37 189 -126 -182 221 -6 268 52 -191 -107 119 78 -157 -191 -41 39 274 129 141
3510A41k6k75J80N5K58n04r1L05k23L26K9J37l51k34J56N6k24p7Q6K48j94J62
$$ 141 115 -160 20 75 333 -171 -262 43 -180 146 175 312 -39 -273 -117 -61 -285 -362 -276 -28 -222 -60
3532f0J09k56K52L5j10m6K4j16J30j48P6oM9N7J96p1l89K78J06p1m4j52R4K50
$$ -60 49 -207 45 80 -30 -76 -52 -168 -38 -186 -110 -116 -67 -10 186 115 -274 4 110 39 -5 -157 -63 187
3556A87j34O8O0l61J72l4l18L78Kl1K66k79k13M13k35N8k5Q7K47l85J34J69l64
$$ 187 53 121 181 -180 -8 -42 -360 18 20 -11 255 -24 -237 176 -59 -1 -26 61 308 -77 57 226 -138
3579a38j0N19m17J24n0P8j51K9l0J21k28M12p1m45N91l63mj96L20k34N4K33k27
$$ -138 -148 371 -46 78 28 106 -45 -16 -46 75 -153 259 188 -257 334 -29 -33 -229 91 -143 -89 144 -83
3602h3J13j74L80o27M98%j50o7M4J55q0r0L7q5M44k88j18J92j06k21J98L4J12
$$ -83 30 -144 236 -391 107 107 -43 -110 -66 89 9 -81 -44 -129 315 27 -91 101 -5 -226 -28 6 118
3625A18L1k06Kj85O4j7K40j48j6j2P3P5j70j1K72n64N58l92J62j01K47J32J80
$$ 118 149 -57 -55 -240 -176 -193 47 -101 -117 -129 -56 19 -151 -162 110 -454 104 -288 -126 -227 20 152 332
3648C32l29j25O0n5N3p1r0K06j65Q6j75K59J30l95L16k25l5K78m1l1K8j70M9k4
$$ 332 3 -122 -62 -117 -64 -135 -225 -19 -184 -98 -273 -14 116 -279 37 -188 -223 55 14 -17 11 -159 -110 -134
3672a34M9J96l48K9J38K5J16j93J78j97J63J70r5m84K93K86k08j18M44l43M1n3
$$ -134 -85 111 -237 -208 -70 -45 71 -122 56 -141 22 192 97 -387 -94 192 -16 -134 310 -33 8 -45
3694d5L0P6M7j1j59J34J55k3o6j3l4J24k87J03J54k44J63m03L65k81M10ok3l11
$$ -45 -15 61 108 97 -62 72 227 204 138 125 91 215 -72 31 185 -59 104 -299 66 -215 195 189 166 -145
3718a45M12j75l39L70j23J07Rk65J21Q4L90k20j12J3j2k17N5J89L0n7j03M5rq7
$$ -145 267 92 -247 123 0 107 116 -149 -28 56 446 226 114 127 115 -102 -47 142 172 115 12 57 48 -39
3742c9j40J19K8K43j96j66J13o0m6L55m66L43j48K21J6pm9q0o0k3Ml3k2kJ04j30
$$ -39 -179 -60 -32 211 15 -151 -38 -98 -144 211 -255 88 -60 161 177 170 121 41 -19 -42 -38 -71 -93 -95 9 -121
3768a21r7M92l71j1K17k83K28J18J14n44J69K0l14M25j61J35J1n5J15l14J57Q3
$$ -121 -218 274 -97 -108 109 -174 54 172 286 -258 -89 -69 -383 42 -119 16 27 -28 87 -227 -70 13
3790A3p2m6J1p4l4J84K17m74K61J21o7j05mP9k61J50J40o2O0j73K49j36J36j38
$$ 13 -59 -105 -94 -168 -202 -18 199 -275 -14 107 40 -65 -69 10 -251 -101 39 -23 37 -136 113 -23 113 -25
3814b5j04j10K24J44j81j20n3N8J90rj88N64k64k84mQ0j16K75om49R4M33J15q2
$$ -25 -129 -239 -15 129 -52 -172 -225 -167 23 14 -174 390 126 -158 -162 -82 -198 77 71 -378 -284 149 264 182
3838A82l79K54O9J4J3r6J19k54j01L29k10K42j17M3J7J49l20N0J99l06K82j10
$$ 182 -197 57 126 140 153 57 176 -78 -179 150 -60 182 65 108 125 274 -46 4 203 -103 179 69
3860F9J50j14k14K01J28k35K38k95L25n13L11J2m6N9j53k9J00L9RJr5L0L84m70
$$ 69 219 105 -109 92 220 -15 223 -72 253 -260 51 63 17 76 -77 -106 -6 33 42 43 -52 -22 362 -108
3884a08r2L73k95L30k99L3N1J51m14O20m80K69k24k44J94o0M53r2n11M98k02O1
$$ -108 -200 173 -122 208 -91 -58 -7 144 -270 350 -130 139 -85 -329 -135 -195 258 166 -345 153 -49 12
3906A2l43L36Q3j91k9K04l07p5J34K1j18K36l97M94r9k4j59K09K8j69K08k60M45
$$ 12 -331 5 88 -103 -132 72 -235 -310 -176 -155 -273 -37 -434 60 -39 -63 -222 -13 15 -154 54 -206 239
3929B39l55J63m9J0nL0m5K94k28k89M27k58j14M1r5L38J01m25K39l8P6m18J76
$$ 239 -116 47 -2 8 3 33 -12 282 54 -235 192 -66 -180 -139 -234 104 205 -220 19 -19 57 -361 -185
3952a85L47k12J26j04oK59k16P9k93J68J90k4j18J04K88k13mm5j16J99l9K19l34
$$ -185 162 -50 76 -28 -34 225 9 88 -205 -37 153 129 11 115 403 190 186 141 25 224 185 404 70
3975G0J7RJ46l10J46K21l80L26l89p2K13M93l54k39l2L50k18K33l06J22pj68L14
$$ 70 87 96 242 -68 78 299 -81 245 -144 -216 -3 490 136 -103 -135 215 -3 230 -76 46 39 -129 185
3998A85j95kp2K18l9k44L26L8j10j15lq9q1K26l50L09J65k68P5j01K32K02k30
$$ 185 -10 -12 -84 134 95 -149 177 215 105 -10 -13 -102 -183 43 -307 2 167 -101 -26 -127 105 307 77
4021G7j83L14l05j18kK67j35j35J28m1R7l0P9J51K2k40J46k6K9K01m27K73j81
$$ 77 -106 208 -97 -215 -217 50 -85 -220 -92 -133 -36 -66 13 164 186 -54 92 66 95 296 -131 142 -39
4044c9k29M52k97J08q4K59k59l4K28j49k05K15j20K04k44K07o4J46m04J22L6M7
$$ -39 -268 184 -113 -5 -89 170 -89 -123 105 -44 -249 -34 -154 50 -194 13 -51 95 -309 -187 -151 -104
4066a04K26j93J69J37k21k71K69J60l13K10k44k7P9Q1k4K39k59Q2J42k99k7K10
$$ -104 122 -71 98 235 14 -257 12 172 -141 69 -175 -202 -123 -42 -66 173 -86 -4 138 -161 -188 22
4088B2L9M7O2j22K87m09l2l6l2J42N5j8L9k17Q3L64j54N0k83L06m38K44P2k1l6
$$ 22 61 108 170 48 335 -74 -106 -142 -174 -32 23 5 44 -173 -90 274 120 170 -113 193 -245 -1 71 50 14
4113A4j5J33l05K28J2j15j19L57o3l13N0L03Q1k91K41l43J21n9J11k04K20j51
$$ 14 -1 132 -173 55 67 -48 -167 190 127 -186 -136 167 248 -43 198 -145 -24 -83 28 -176 44 -107
4135a07j01J73Q1k18L21k03K46p3kl12K00j86M62J2k22J27l10J31k46K61j38K74
$$ -107 -208 -35 46 -172 149 -54 192 119 117 -195 5 -181 281 293 71 198 -112 19 -227 34 -104 170
4157A70m85J55K61k02M4K8n3J83k18J6L11j65k70P7r0K02o4Lm2J47Q7j08O4p6
$$ 170 -315 -160 101 -101 -57 -29 -82 101 -117 -101 210 45 -225 -148 -238 -36 -100 -97 -139 8 95 -13 51 -25
4181b5J10m9k05n8J65L56j20j52j40J04K5J21l15R1J76j92M6P6J65j81K38j67
$$ -25 85 36 -169 -227 -62 294 174 22 -118 -14 11 132 -183 -92 84 -108 -62 14 179 -2 236 69
4203F9O9j58k7J26L9O5O7j96O3J61l11K21m01N6K52j30J84Nj2j59n8J79n5l9K71
$$ 69 138 -20 -47 79 118 183 250 54 117 278 -33 188 -213 -157 95 -35 149 154 142 -17 -75 104 49 10 281
4228B81m3l78J95j80p0K99j37L83j50R1m53N2K03N0j26QP0l39M31j69J9J9J8k75
$$ 281 238 -140 55 -125 -195 104 -33 350 200 291 -162 -110 93 143 17 25 95 -244 187 18 37 56 74 -201
4252b01J99M5k22j89L64r3j8J05L5J28l93J30J36K08l17K9j55K16o3K5K53k61
$$ -201 -2 43 -179 -368 -4 -97 -115 -10 25 153 -240 -110 26 234 -83 -54 -209 7 -56 -31 222 -39
4274c9k45K25j28M06k00K41j78j40J09j57K34J29j23q9R9m26J99J57p6p2q1M66
$$ -39 -284 -59 -187 219 19 260 82 -58 51 -106 128 257 134 45 144 -282 -83 74 -2 -74 -155 311
4296C11l01m45L20L31r5k25k09K39M8q3N5j68J76Nj8pJ74j94QO1k70K06J87k70
$$ 311 10 -435 -115 216 121 -104 -313 -74 -26 -109 -54 -222 -46 -41 -59 -66 108 -86 -78 -17 -287 -81 106 -164
4320a64K32R0k1K46k71J3k80J21M50l52k44N0m3K80r7n6J37l30J96K65j13j68
$$ -164 68 158 137 383 112 125 -155 -34 416 64 -180 -130 -173 107 10 -46 91 -239 -43 222 109 -59
4342e9L8Q8L3k43K90j23l82N09J2k28J60J71J10l89o5J71Oo2M7O6j22l00L35m3
$$ -59 -21 67 100 -143 147 24 -358 151 163 -65 95 266 376 -13 -78 93 99 37 84 150 28 -272 63 20
4366B0k9j92K45j75o7N69n26L57j27j26J36j79r1J42k29M75Lk32j89K97m1n2N7
$$ 20 -9 -201 44 -131 -198 371 -155 202 75 -51 85 -94 -185 -43 -272 203 206 -26 -215 82 41 -11 46
4389D6j94j17L23o1p2n5nJ82k45L64k4J4nl30K05K8L00j54l30Q6J22KOj47O2J5
$$ 46 -148 -265 58 -3 -75 -130 -135 47 -198 166 142 156 151 -179 26 54 354 200 -130 -44 78 80 86 -61 1 16
4415A6j15j12K78k1M2l03P9J80PNjJ52j54j5j51J3J51m16L23J28P2k83J31n6P0
$$ 16 -99 -211 67 46 88 -215 -136 44 51 56 55 207 53 38 -113 -100 51 -365 -42 86 158 -125 6 -50 20
4440B0J37O6k27j9j91M36ON4k62k00J60n9m3r2K55J07j21R0o2r3Qp4l4K16J75
$$ 20 157 223 -4 -23 -214 222 228 282 20 -180 -20 -79 -122 -214 41 148 27 117 55 -38 -30 -104 -138 78 253
4465B53M9m68K03l16M44k17K72m07J95J11j15k56L42l70Rn2M64j46K3m9n8M65
$$ 253 302 -166 37 -279 165 -52 220 -187 8 119 4 -252 90 -280 -271 -323 141 -5 18 -31 -89 376
4487C76j99J46j65o6j77Q8M05l82LJ82j15J25k31J43j25Q1Kj28J01j83J13K16
$$ 376 177 323 158 92 -85 3 408 26 29 211 96 221 -10 133 8 89 91 -37 64 -119 -6 210
4509B10n47K91L31L1j40k73k1L42r9j57M22j72k46jkj04J22J7j9J96j17k48m7
$$ 210 -337 -46 285 316 176 -97 -118 224 125 -32 390 218 -28 -29 -31 -135 -13 4 -15 181 64 -184 -231
4532b31J03Q8K84l11K26l02J48p5L8K06j44q7L7J9J8j50J13p8M6J17j42K05j21
$$ -231 -128 -40 244 -67 159 -143 5 -70 -32 174 30 -57 -20 -1 17 -133 -20 -98 -52 65 -77 128 7
4555Gj17k91N00j90J43J83k14k80O61m74K1J57o9k2k50K31M0j69q0L09qR1j86
$$ 7 -110 -401 99 -91 52 235 21 -259 402 -72 -51 106 37 15 -235 -4 36 -133 -213 96 88 179 -7
4578gJ4pr2J66o5L7N8l07RK44j28J86k02K23k8j72J68j8j31kl6J04J22j51k8N0
$$ -7 7 0 -92 74 9 46 104 -203 -194 50 -78 108 -94 129 101 -71 97 79 -52 -54 -90 14 136 -15 -43 7
4604Gk69M46J0k84J69k27K8N6K2K95j53l2j84J22J68J30k42P3n7j07l9K10J15
$$ 7 -262 184 194 -90 79 -148 -120 -64 -42 253 100 68 -116 6 174 304 62 135 78 -29 -68 142 257
4627B57k38LK4O%J54q6q0M0j57N6k5O6j42n8J22K37l55J30j46J14M15m56J33j0
$$ 257 19 22 46 52 52 206 120 40 80 -77 -21 -46 20 -122 -180 -58 179 -176 -46 -192 -78 337 -119 14 4
4652DJ7j46M8j3L66l40J10K0r6K26l1j76J83j98L1q1rN3J6j2l2L1K16l70j2L31
$$ 4 21 -125 -77 -90 276 -64 46 66 -30 196 165 -11 172 -26 5 -76 -85 -32 -16 -28 -60 -29 187 -183 -195 136
4678A36l11J43k48K10O0j05j27K17J24j28M4m73M78k02J26qL48l25K01l33lJ22
$$ 136 -175 -32 -280 -70 -10 -115 -242 -25 99 -29 15 -458 20 -182 -56 -64 284 -41 160 -173 -176 -54
4700e4K42qp6k69P7j62J61K14k56j53KN43l23kj47N89n45RK08K8l84J19L78k13
$$ -54 188 180 104 -165 -88 -250 -89 125 -131 -284 -282 261 -62 -64 -211 378 -167 -158 50 78 -306 -187 191 -22
4724b2QJ25k81O4M43j43k28R3L21l00Q8j11p8K16j37k70K88L5j42L3m7K69l31
$$ -22 -14 111 -170 -106 337 194 -34 59 380 80 168 57 -21 195 58 -212 76 111 -31 2 -45 224 -107
4747a07K51j27p5R0K90k69L1l60M01J53q5J6j58j60J54l61M98k92R8Q3j15J29
$$ -107 144 17 -58 32 322 53 84 -276 125 278 193 209 51 -109 45 -316 182 -110 -12 71 -44 85
4769H5p5j01K64l28K55n3k51J24L5Q9P7j93l08J91L45j46o7nN0j62M10n06L37
$$ 85 10 -91 173 -155 100 47 -204 -80 -45 44 121 -72 -380 -189 156 10 -57 -62 -12 -174 236 -270 67
4792F7k40J30L9n7J64r5M40m22j40M7j3J34M4k89K65k70M42n00K58o6l03N12k74
$$ 67 -173 -43 -4 -61 103 8 448 26 -114 -67 -80 54 98 -191 74 -196 246 -254 4 -62 -365 147 -127
4815a27J68%J66m5ol24J68L43o13L27O9j66pJ88j59j09J68k76J23K41k6j91N3
$$ -127 41 41 207 162 156 -168 0 343 -270 57 126 -40 -47 141 -18 -127 41 -235 -112 129 103 -88 -35
4838c5j29M4J29k32R7J54n8J21k21r0Q7r9L40l29M22J2j04k25K10k17L30j81N4
$$ -35 -164 -120 9 -223 -126 28 -30 91 -130 -220 -133 -232 108 -221 201 213 109 -116 94 -123 207 26 80
4861H0p6K23l26K02J6k37L23j39m9J83k75J66n0J58m06P4l20L48l0N5J23j05R3
$$ 80 4 227 -99 103 119 -118 205 66 17 200 -75 91 41 199 -207 -133 -453 -105 -135 -80 43 -62 31
4884C1j35R0n4J68l19J58J35q3O1J14l55M5L04K13n31R8J29k15O8K60j32J00k11
$$ 31 -104 -14 -68 100 -219 -61 74 -9 52 166 -189 -144 160 373 -158 -60 69 -146 -78 182 50 150 -61
4907f1q5J40J2K2Q6j46J9J37l35K21k49%M01k57J30K18k93Nk9J0P8J7l30K70J00
$$ -61 -146 -6 6 28 114 -32 -13 124 -211 10 -239 -239 162 -95 35 253 -40 -35 -64 -54 24 41 -289 -19 81
4932H1j33K2O5M6n2J57j71R2j87J0j10M4J36q0J65%k70J93m15L69K4J57j3j4k83
$$ 81 -52 -30 35 81 29 186 15 107 -80 -70 -180 -136 0 -80 85 85 -185 8 -407 -38 -14 143 130 116 -167
4957a67R4L19k86Kj07M12l15O7J56J04k68R4j97K7J31k67M18j84Q1k5J10O5l44
$$ -167 -73 246 -40 -38 -145 267 -48 19 175 279 11 105 -92 -65 66 -201 217 33 114 89 199 264 -80
4980h0m2l5J22J45j46L63k27k81J33q8L64j09M6j01n3ko5L6P3j34K7j27K53k20
$$ -80 -122 -157 -35 110 -36 327 100 -181 -48 -136 228 119 165 64 11 9 -56 -20 53 -81 -54 -181 72 -148
5004a48K54K7k27J85k68K53K09l42j36j05L48Q9j25N1j13q6J4J14j63M13j30o35
$$ -148 106 133 -94 91 -177 76 285 -57 -193 -298 50 139 14 65 -48 -134 -120 -6 -169 244 114 -521
5026e21P17l31j16K19R5J72p8k86J92j06J38j12J15J97l75K49m42L04n0j2J27
$$ -521 196 -135 -251 -32 63 235 157 -129 63 -43 95 -17 98 295 -80 169 -273 31 -19 -31 96
5047I6k69M29l45K52j57l7K71l71jJ40Q7K0o1j57l1K44j24J01j23n1KJ35j75o
$$ 96 -173 256 -89 163 6 -31 240 -131 -132 8 95 115 54 -103 -134 110 -14 87 -36 -87 -85 50 -125 -131
5071a31Q8NJ94j16k54R1j48L24l9P9k57K11L0j13l22J06L96l7j59k26K38J22P1
$$ -131 -43 -38 156 40 -214 -123 -271 53 14 93 -164 47 77 -36 -358 -252 144 107 -52 -278 -40 82 153
5094A53j95Nj45J05J30L4r2q8n2K8J84j40J62j14k57L11L5j45L44l22m1M30m72
$$ 153 -42 -37 -182 -77 53 87 -5 -93 -145 -117 67 -73 89 -25 -282 29 64 -81 263 -59 -100 330 -142
5117a42O6J26k4j14q2J76K13r4j98m8K41k29J1L28m63K98K29m70J91j13p3J50
$$ -142 -76 50 26 -88 -170 6 219 125 -73 -121 120 -109 -98 230 -233 65 294 -176 15 -98 -171 -21
5139b1l3k3P3j86K62j86J56nn2K47k41J58k29k84M83j93jM31n41K61n1j16L20
$$ -21 -54 -77 -4 -190 72 -114 42 37 -15 232 -9 149 -80 -364 119 -74 -75 356 -185 76 25 -91 229
5162B29k2l30j28K97Oj77J7pJ51r5J79m0l89k7L47j53M32Q4k00l0lr1r3J2j29
$$ 229 207 -123 -251 46 52 -125 -108 -115 36 -59 120 80 -309 -336 11 -142 290 374 174 144 141 50 -43 -31 -160
5187a60J73k30M25q9J2m91M09k77M2J39J83p9r9pL4k76J89Q8P9k75L9J42L7J57
$$ -160 13 -217 208 119 131 -360 49 -228 -186 -47 136 57 -42 -49 -15 -291 -102 -14 65 -210 -171 -29 8 165
5211A65k36O2j03K40j88K85j31k95J95j38J17J32Q3K2m3j74P5n26M07K78l04l6
$$ 165 -71 -9 -112 128 -60 225 94 -201 -6 -144 -27 105 188 210 167 -7 68 -458 -51 227 -77 -113
5233a13J09M7p2j96K54%n4l7q6R8Q4M5k5r9J18l63K02J54j12p9K27j97PJ6R0j30
$$ -113 -4 43 -29 -225 29 29 -25 -62 -148 -50 34 79 54 -45 73 -290 -88 66 -46 -125 102 -95 -88 -72 18 -112
5259a12j53K01J42j02J95k06kJ31k51L18m19J45k44M34ll93J19n8K93k47K03R9
$$ -112 -265 -64 78 -24 171 -35 -37 94 -157 161 -258 -113 -357 77 74 -319 -200 -258 35 -212 -9 90
5281I0j16K64l08J87J16j07m6k39q6K26M0R5M6j75j31j24J75OL3J97o3R7k33K98
$$ 90 -26 238 -70 117 233 126 80 -159 -245 -19 21 116 162 -13 -144 -268 -93 -87 -54 143 80 177 -56 242
5305B42n01J19RJ75qK2j66j73L56K8j2q5Q7J52k84k09M18j51o1q6PM82k80NRJ0
$$ 242 -259 -140 -131 44 36 58 -108 -281 75 103 91 6 93 245 -39 -248 170 19 -42 -128 -121 361 81 86 95 105
5331A05j08O3K0k50Q0p7L5J56l9j35J97k38L54k52Q6K21m57L48j65J74j70l23
$$ 105 -3 60 80 -170 -90 -167 -132 24 -15 -150 47 -191 163 -89 -3 218 -239 109 -56 118 -52 -375
5353c75M67k80J10J77q4k97oK02P4j02K45N8kk92J1J79R8j97k4J23l54M68j38
$$ -375 92 -188 -78 99 15 -282 -288 -86 -12 -114 131 189 187 -105 -94 85 183 -14 -38 85 -269 199 61
5376F1L8k38L7n0K15q7K42k60p4K23o7j53qQ1k72O55k20k01N9L8K08j53n51K81
$$ 61 99 -139 -102 -152 63 -24 218 -42 -116 107 40 -113 -121 -40 -312 343 123 -78 -19 19 227 74 -477 -196
5400a96J8L26p5J96j20j16J49j99j77K58k28M09j45PL7q3K7J79k45k92L93k38
$$ -196 -178 148 73 269 149 33 182 -17 -194 64 -164 245 100 107 144 61 88 267 22 -270 123 -115
5422a15K99n67L75N2J13j74q6K19j07j28J47N5K5k80K42l01M64o4l41L7J75J4
$$ -115 184 -383 -8 44 157 -17 -103 116 9 -119 28 83 108 -172 70 -231 233 169 -172 -135 40 54
5444E4K64m02k82N16l99K31k08K70k79N2M1l8K88j18r5J04j81J62J82J19l05q9
$$ 54 318 -84 -366 150 -249 -18 -226 44 -235 -183 -142 -180 108 -10 -105 -1 -182 -20 162 281 -24 -113
5466a13pl24O20j50m8L30k56k3r9n2L02n9k68K34O8k56M7J31rj14l0j01j22K78
$$ -113 -120 -444 176 26 -22 308 52 29 -70 -122 180 121 -147 87 155 -101 -54 77 68 -46 -76 -177 -299 -21
5490b1K40K6k69j72K82j68M4o6k7K74j45L2j88J76j55N24l71j80J82k52L25r0
$$ -21 219 245 -24 -196 86 -82 -38 -104 -131 143 -2 30 -158 18 -137 387 16 -164 18 -234 91 1
5512AJ77k04O4r4k70K70N6k5K75K8j76j79J76k92O7K00J57k92p7K41MJ30l9j17
$$ 1 178 -26 38 -56 -326 -56 0 -25 250 278 102 -77 99 -193 -126 74 231 -61 -138 103 107 237 198 81
5536H1P7L0n34K90R2J20j06j62J01R2L8j73o9j16J32R5n7J76k65K18k67R0M5j23
$$ 81 158 188 -346 -56 36 156 50 -112 -11 81 119 -54 -123 -239 -107 -12 -69 107 -158 60 -207 -117 -72 -195
5560a95j11J58l4M35p4k3j21j34J73r4J08l12L03l32L70K3j17j5L3K01j45k28
$$ -195 -306 -148 -182 253 179 156 35 -99 74 -20 88 -224 79 -253 117 140 23 8 41 242 97 -131
5582a31NL10k23K11J8m01L07k64K70K4r1j95J52o7K44j29n4Q3o1O4k08JP2K27
$$ -131 -126 184 -39 172 190 -211 96 -168 102 126 35 -160 -8 -75 169 40 -14 69 8 72 -136 -135 -63 164
5606A64k24J20P2q5R1j9M1j0k76q7O7K61J78l94l2K12k93J58J08j80R6l66M13
$$ 164 -60 60 132 47 138 119 160 150 -126 -213 -146 115 293 -101 -133 79 -214 -56 52 -128 -32 -398 15
5629A5j45J99j35Q4j02j55L12k43M21m08J34KJ18q0J69k78K93k62pQM64l84Q5
$$ 15 -130 69 -66 18 -84 -239 73 -170 251 -157 -23 -21 97 17 186 -92 201 -61 -68 -60 404 20 105
5652A05j00J14j79Q6l5Q5J22k08J07P4k42K68l71j09K83l83K75P0O1j9l1k5K75
$$ 105 5 119 -60 26 -9 76 198 -10 97 171 -71 197 -174 -283 0 -383 -108 -38 23 4 -27 -52 223
5675B23k45K9k9J22k87J55J48j62Q8R5l11m4M16o8k03P8j22J87k15L29n43K26
$$ 223 -22 7 -22 100 -187 -32 116 -46 42 137 -174 -218 198 130 -73 5 -117 70 -145 184 -359 -133
5697a33L53r3r0k14J39j48K13k1k23K39jj51O9RMj70K02l44M97j11j35J35p1J95
$$ -133 220 127 37 -177 -38 -186 27 6 -217 22 21 -130 -61 -52 -48 -218 -16 -360 137 26 -109 26 -45 150
5721A50kk17l9M4r8J09k0O5N9O5k34j68k9J58L59Ok32O8k38K26l64L37J37l21
$$ 150 148 -69 -108 -64 -162 -53 -73 -8 51 116 -118 -286 -315 -157 202 208 -24 44 -194 32 -332 5 142 -179
5745a79J36P0q3L13k25K29o45O35k62k6K24l34O3r9J94r1J53j18j67J10R0J40
$$ -179 -43 27 -56 257 32 261 -384 251 -11 -37 187 -147 -84 -183 11 -80 73 -45 -212 -102 -12 128
5767A28R1l73J1JJ4J16J36j79j91J55j30l3L90kk66K23j59j72J41L08m34J45J60
$$ 128 219 -154 -143 -142 -128 -12 124 -55 -246 -91 -221 -254 136 134 -132 91 -68 -240 -99 209 -225 -80 80
5790H0N1l58J60m7k46K70k90K42J20m0Q8j82K63k22J51j47J24m1j30J42k17J86
$$ 80 131 -227 -67 -114 -360 -90 -380 -138 -18 -58 30 -152 111 -111 40 -107 17 -24 -154 -12 -229 -43
5812d3k79J60L17R2k88l2j8j81J96J53n0l10L52j79K46k7qLk98L18l70p9R6J31
$$ -43 -322 -162 155 247 -41 -73 -91 -272 -76 77 27 -283 69 -110 136 109 101 104 -194 124 -246 -325 -229 -98
5836i8k1J44O9q3n5O5k24m5L26R4j57K88n94P1J63K38m32J20J08m8K02J13k09
$$ -98 -119 25 94 11 -44 21 -203 -248 78 172 15 303 -291 -220 -57 181 -251 -131 -23 -71 131 244 35
5859C5J65l04j3J05K06J05k27m9K84j68k91M25l46Q5p1K36jm12J16J03q3J77O5
$$ 35 200 -104 -117 -12 194 299 72 23 307 139 -152 273 -73 12 -59 177 176 -236 -120 -17 -100 77 142
5882A42k11K90l21M22k10k29oJ50K40j26j03L5P7j55j68J09R0p6Q6N0N6Ok5j77
$$ 142 -69 221 -100 322 112 -117 -123 27 267 141 38 73 150 -5 -173 -64 26 -50 36 86 142 148 123 -54
5906e4k69L91L6j14l15J38Pk05N54mk14n4R3k8Q3o2J29j98K61l50J08J08j37j79
$$ -54 -323 68 104 -10 -325 -187 -180 -385 169 165 -49 -103 -10 -38 45 -17 112 -86 175 -175 -67 41 -96 -275
5930b75K22M7J08k83M06m8j91l8P2M8m00K18K3l16L41n1L08k88j11Q3L43j48k29
$$ -275 -53 -6 102 -181 225 177 -14 -52 20 68 -332 -114 -91 -407 -66 -117 191 -97 -208 -125 218 70 -159
5953a59J37J88j28j78rR0p3l0K57pP5j88Q3j64L68m18K23J84l21J83o8j60l3k7
$$ -159 -22 166 38 -140 -149 -59 -132 -162 95 88 163 -25 58 -106 262 -156 67 251 -70 113 45 -115 -148 -175
5977a75J71O8o5l1N9j53J73k60J75J90p6j88J34o4j74M23j94r9J97p3j80N25n89
$$ -175 -4 64 -1 -32 27 -126 47 -213 -38 152 76 -112 22 -42 -216 207 13 -86 111 38 -142 383 -206
6000b06J27Q6J12j17J9m5j94L07j1j10r3J81k22k4K33R4j85P7l19L73K88k01l25
$$ -206 -79 7 119 2 21 -24 -218 89 78 -32 -125 56 -166 -190 43 137 -48 29 -290 83 371 170 -155
6023a55J49j0j27K35K45m40K4K60j26m8j47K73l21M05m98N6M05N9m82L21M5o4
$$ -155 -6 -16 -143 92 337 -103 -79 181 55 7 -140 133 -188 217 -281 -225 180 239 -243 78 123 59
6045E9j1k9k36K61q8j89K6L40p4J3j73j94K26J49J44l31J73k16J45j34J41j44
$$ 59 48 19 -217 44 -44 -233 -207 133 59 72 -101 -295 -69 80 224 -107 66 -150 -5 -139 2 -142
6067a42J15r7K73l75N32j93k53p9J85m6J43r8k06M71m67J78q9L82k72O8k43L64
$$ -142 -27 -124 149 -226 306 113 -140 -219 -34 -80 63 -35 -241 230 -237 -59 -148 234 -38 30 -213 151
6089A51j34J82m3j17k34K34j10M9R9Q8j89J71k06k05J38L0R7J69k62L70k22k46
$$ 151 17 199 156 39 -195 39 -71 -22 77 165 -24 147 -59 -264 -126 -96 1 170 -92 278 56 -190
6111a90l8L81o4Kj28j0J61m8pk0j99j13L45k04K6o4K58m03L16j54K01n0o3K75
$$ -190 -228 153 89 91 -37 -47 114 66 59 39 -160 -273 72 -132 -106 -170 88 -315 1 -153 48 -2 -65 210
6135B10l19J4J9J00m4J02k99K41P1k98J40j35J90j91J32O5JJ05o9K6N8k76J19
$$ 210 -109 -95 -76 24 -20 82 -217 24 95 -203 -63 -198 -8 -199 -67 -2 -1 104 35 61 119 -157 -38
6158c8N8r0j81L46k77J69J92j46K83k44l84J08L73l17K89j88J82l0j6m3j12J9
$$ -38 20 -70 -251 95 -182 -13 179 33 316 72 -312 -204 169 -148 141 -47 135 105 89 46 -66 -47
6180d7l6L23n02J74R5J7j69P0K2j20M6j45L02k19K45k35k02M84j02J34j04j20
$$ -47 -83 240 -262 -88 7 24 -145 -75 -53 -173 -127 -272 30 -189 56 -179 -381 103 1 135 31 -89
6202h9L97l41K2J28j24mK00o0m02N07j17k15j8J30l8m4j0K17L8P3k17J62j66K45
$$ -89 308 -33 -11 117 -7 -11 189 129 -273 234 117 -98 -116 14 -24 -68 -78 139 177 250 33 195 29 274
6226B74l27o8K66J8l03J10L37k72Kj11K08l3J66m19L81k45J18k95M91l8k88N7
$$ 274 -53 -121 145 163 -140 -30 307 35 37 -74 134 101 267 -152 229 -16 102 -193 298 260 -28 29
6248B9K13k55Q2p9L48p66L07J4J04K48m51K66p1J6%k20L6M65k24k28m4K60K2p5
$$ 29 242 -13 69 -10 338 -428 -121 -107 -3 245 -206 60 -11 5 5 -215 -179 286 62 -166 -210 50 72 -3
6272ck63M36k81J37j59J80K69m39j29L33K3j30R8J17j47K9J77n44K27L31m47M6
$$ -3 -266 170 -111 26 -133 47 316 -123 -252 81 104 -26 72 189 42 71 248 -296 -69 262 -185 -139
6294a39L17k50M8j70R6J07K35l65o4L18j17J47k20J75p0j87K49o5P2j55k63M83
$$ -139 178 -72 -24 -194 -98 9 244 -121 -185 133 16 163 -57 118 48 -139 110 45 117 -38 -301 182
6316A82j7j18l6k40L7k28O96l46K5r8J47K62l78J00j3K10l68K80j15J26k47K30
$$ 182 165 47 11 -229 -192 -420 276 -70 -45 -143 4 266 -112 -12 -25 185 -183 97 -18 108 -139 91
6338I1k42K10j81L0K3K33k98K44K6l34J2K64M8O1q1J19l19J1l7j00K05k09K17
$$ 91 -151 59 -122 -92 -69 164 -134 110 136 -198 -186 78 126 187 106 225 -94 -83 -120 -220 -15 -224 -7
6361gj18M6L30j54qJ75m8k32K53l30P1k3m0M1J31K45k30k05p3K03Rk36K5P9J8
$$ -7 -125 -79 251 97 89 264 216 -16 237 -93 -22 -45 -85 -44 87 332 102 -103 -176 27 36 -200 -175 -96 -78
6386g8j4O5o0R1j18n3K83o6k91M40l08j21K86J47n46M34j33j12j2n2Q9R4P2J4
$$ -78 -92 -27 -87 4 -114 -167 116 50 -241 199 -109 -230 56 203 -343 91 -42 -154 -166 -218 -129 -35 37 51
6410E1l59L78j18J44m50M63j08j6J67m9J07m97L59q6K9j20j8k0R1M59k41k44J83
$$ 51 -308 70 -48 96 -354 109 1 -15 152 103 210 -287 72 -14 15 -105 -123 -143 -52 407 166 -78 105
6433A05J95n58L76l62J72L7l9J61K7k36J65j42k8O5L11o54K46L78m73M26j14Q4
$$ 105 300 -258 118 -244 -72 -35 -74 87 114 -122 43 -99 -127 -62 249 -405 -159 219 -254 172 58 142
6455A42j50j02J96O8l58J04k5J03L49n17M7J46K32P1p03L85J68k89Q4J89l89M15
$$ 142 -8 -110 86 154 -204 -100 -125 -22 327 -190 -143 3 235 306 -397 -12 156 -133 -49 140 -249 166
6477A66k99J43Pj0J1k5J61j37J7k6PnJ15j53j2K69q2j21j96K44j16J98k24L7R8
$$ 166 -133 10 17 7 18 -7 154 17 34 8 15 10 125 -28 -40 229 147 26 -170 74 -42 156 -68 -31 67
6502F7n4o6J24l92N05j75J30kj05r2j37L90L4n5m39K99l3J97l52j10L60j03P3
$$ 67 13 -53 71 -321 184 9 139 137 32 -60 -197 193 227 172 -267 32 -1 196 -156 -266 94 -9 64
6525F4j21j84R6N5P6L71k67j13M7q6J13q7j43Q7J63l0pj4n4P9q3j22K81j02j74
$$ 64 -57 -241 -145 -90 -14 357 90 -23 24 -62 51 -36 -179 -92 71 41 34 20 -34 45 -38 -160 121 19 -155
6550a55J69n4K20j91j29L48k18M7l1R9J84l41Q4P9J18j90oJ65M1k57J11n0k03
$$ -155 14 -40 180 -11 -140 208 -10 37 6 105 289 -52 32 111 229 39 33 198 239 -18 93 43 -160
6573a60J7K39J25k60j85J21L76m46J59J61j13q4n9N97m96P1j70r1K33k6k31O2
$$ -160 -143 96 221 -39 -224 -103 273 -173 -14 147 34 -50 -109 488 -8 63 -107 -198 35 9 -222 -160
6595a60k66M14l4L45k52N3p3JN2k61K38K65k81K5j42J3P8j76L58j73k42J59j41
$$ -160 -426 -12 -46 299 47 100 27 28 80 -181 57 322 41 66 -76 -63 15 -161 197 24 -218 -59 -200
6618b00J54m8j26n1J46L31k09P2j33j2J14j32L45m22J22O8J38k42J48l4l48L35
$$ -200 -46 -94 -220 -271 -125 206 -3 69 -64 -76 38 -94 251 -171 -49 19 157 -85 63 29 -319 16
6640A6p6j5j3K65m35M31pl06J40R0j71K30j39j9K32k72K11l37k2J59r0N7Q0k93
$$ 16 -60 -75 -88 177 -258 173 166 -140 0 90 -81 149 10 -9 223 -49 162 -175 -197 -38 -128 -71 9 -284
6664b84L76J44l21J31J07J6j09l33J66K52k39q7K56k67K27K26k28m9o3j0M6J48
$$ -284 92 236 -85 46 153 169 60 -273 -107 145 -94 -181 75 -192 35 261 33 -16 -79 -89 -43 105
6686A05k9pl44M40l30L9l7K17%J56l57P0J06nm0p5N4j66J02Q8j36K96l7l62%O9
$$ 105 76 69 -275 165 -165 -126 -163 54 54 210 -147 -77 29 24 -16 -91 -37 -203 -101 -13 -149 147 110 -252 -252 -183
6712a83K67K6J1l41K73K22k69p0J32L7j94J80j7P5m69M98p7N5l91L72Ql63L96
$$ -183 84 110 121 -220 53 275 6 -64 68 105 -89 91 74 149 -320 178 101 156 -235 137 145 -218 178
6735A78l59J82R7j0k51m5L58j21K1J33l43J02K53o24N62j34K14Lk5l71J20nJ19
$$ 178 -181 1 98 88 -163 -208 150 29 50 183 -160 -58 195 -429 133 -1 213 216 191 -180 -60 -65 54
6758E4L4p4m5j03J50o3m3n6K35j61J35k09L94k07J1km9Q5j72R8K46n70M08K7p4
$$ 54 88 14 -31 -134 16 -47 -90 -146 89 -72 63 -146 248 41 52 50 1 86 -86 12 258 -312 96 123 49
6783D9Q9j30J62l13K95jk80O7N9m7m5K84N1r3k92L63k29M6j41J42L14n55K42o7
$$ 49 138 8 170 -143 152 151 -129 -62 -3 -50 -95 189 240 147 -145 218 -11 35 -106 36 350 -205 37 -30
6807c0q5k99K48j89N9M78j26Mr1j42K37k68J36N4R8L0j45k42L35j24J15J64j16
$$ -30 -115 -414 -166 -355 -296 182 56 60 -31 -173 64 -204 -68 -14 84 114 -31 -273 62 -62 53 217 101
6830A01K43k64j42n9K35j45J95j49n6M4K50k10Q1k05J74N6lj40J5R6j52J68n43
$$ 101 344 80 -62 -121 114 -31 164 15 -41 3 253 43 124 -81 93 149 146 6 21 117 -35 133 -410
6853d10O47k14Jo8j01m3J69O6K05j66P5p8O3%p1M1j20L37j94j62J12k32K5n0J81
$$ -410 237 23 24 -44 -145 -188 -19 47 252 86 161 83 146 146 75 116 -4 333 139 -23 89 -143 -118 -168 13
6878A3K4P3r9kJ60j41j62K76l6r0KL0o1J1k80l4M82l09J86k19L39k36J01q1K01
$$ 13 37 110 11 9 169 28 -134 142 106 16 18 48 -13 -2 -282 -316 166 -143 43 -176 163 -73 28 -53 148
6903A48K49n30L1o4K55n7k32J65K56m17J78l2J5q6J35k40mK50j35K43j92K1J82
$$ 148 397 -133 -102 -166 89 32 -200 -35 221 -196 -18 -50 -35 -121 14 -226 -230 20 -115 128 -64 -43 139
6926A39k20J00R4j99P4j27J86P3J88m76L74k99L96m55J42P3k84J86J26j27j95
$$ 139 -81 19 113 -86 -12 -139 47 120 308 -168 206 -93 303 -152 -10 63 -221 -35 91 -36 -231
6947b31L45p8O3j90L5P0P7J10J4j46j27J72l10L01l14J11J58k82K97q1J91k42
$$ -231 114 36 99 -91 -56 14 91 201 215 69 -58 114 -196 105 -209 -98 60 -222 75 -6 185 -57
6969e7M17l31k4R7J87m56L15o0j87J20K5J6k11P6J38J17j8j77N7K10l52R6p7K75
$$ -57 360 29 5 102 289 -167 148 88 -99 21 46 62 -149 -73 65 182 164 -13 44 254 -98 -2 -79 196
6993A96m54L39l5k0l0J05J19j66mj65p0K95m2J4J69k15J57n0j17J27j64P5k1k79
$$ 196 -258 81 46 26 -4 101 220 54 50 -115 -185 110 68 82 251 36 193 143 26 153 -11 64 43 -236
7017b36J88k42M63j64l40L61N3p3p3J68l7l16k03M19J78p1k24J80Mj09J41k30
$$ -236 -48 -290 173 9 -331 30 83 10 -63 105 68 -248 -451 -32 146 75 -149 31 35 -74 67 -163
7039a63K87j23j25J04k05J46O44l88m40J64k9K49j73Jp0M64j89J54k22J21l64
$$ -163 124 1 -124 -20 -225 -79 565 177 -263 -99 -128 121 -52 -51 -121 343 154 308 86 207 -157
7060a57J84p8k1l00O09m53j03J15Q5J84j41N0K58k96k17M62l06R1J09J25j10R7
$$ -157 27 -51 -72 -372 237 -216 -319 -204 -119 65 -76 -26 232 -64 -281 181 -125 -34 75 200 90 187
7082A87k81LL6j35K3J78R5j54k7qj59K00M7J44j91M5j3j1K34j43j05J79l73J70
$$ 187 -94 -91 -55 -190 -167 11 106 -48 -75 -83 -242 -42 5 149 -42 3 -10 -21 213 70 -35 144 -229 -59
7106e9j61NP8L4o0j5M59k02k34K81o0k08J71K02m19O4J82j75k29K78J79k50J34
$$ -59 -220 -215 -137 -103 -163 -178 281 79 -155 126 66 -142 29 231 -188 -124 58 -117 -346 -68 111 -139 -5
7129eM2J7j47L89n10N6L3j18J66k7L27k02P3j02K28k83l0R4J31l02K71Q2P4n10
$$ -5 37 54 -93 296 -214 -158 -125 -243 -77 -104 223 21 94 -8 220 -63 -93 1 132 -170 101 183 257 -253
7153b53R5J19J64l14O2J27J52m25J58J67j27J76j54L97k04k26m9J28N8J88m13
$$ -253 -158 -39 125 -189 -127 0 152 -273 -115 52 -75 101 -53 344 140 -86 -135 -7 51 239 -174
7174a74P5J06K1K44k84K6L0L5m8o7M2J06l49J33J82Qj5l2j24O6k68K81p3J16j39
$$ -174 -99 7 28 272 -12 14 44 79 31 -36 6 112 -237 -104 78 86 71 39 -85 -19 -287 -6 -79 37 -102
7199a02OJ48k52K66K7p4m4l71J51J44L7J6KP7k03L28k64J8N1J64R6k34J81j56
$$ -102 -96 52 -200 66 93 19 -25 -396 -245 -101 -64 -48 -46 31 -172 156 -108 -90 -39 125 221 -13 168 12
7223A2P9j42J58k56M4J21K86k07J02m78rL90j47QJ33J28m13K66m6N6q5j37q2M01
$$ 12 91 -51 107 -149 -105 16 302 95 197 -281 -290 100 -47 -39 94 222 -191 75 29 85 0 -137 -219 182
7247A82m87N04j82j72LJ07j24J62K46j80j33N6k22M7K39j6p3L5L5l72L18J57j32
$$ 182 -305 199 17 -155 -152 -45 -169 -7 239 59 -74 -18 -240 -193 46 30 -43 -8 27 -345 -27 130 -2
7270bj05L28J4k81j23K13P0j35LQ1q1N3K60n0m7L8k31J24k52M05m18J37mJ08k22
$$ -2 -107 221 235 -46 -169 44 114 -21 -18 63 -18 35 295 245 198 236 5 129 -123 282 -136 1 -3 105 -117
7295a17K16o3k67L26q7k04q3M83k55L76n18j67K29J23k8kk9J22n6J60o1k0kn6
$$ -117 99 36 -231 95 8 -196 -279 204 -51 325 -193 -360 -131 -8 -36 -38 -67 55 -1 159 98 78 76 20
7319B0p1J02j39QR8j34J70k24M18k86q0N18k20j93K13j38j22J03j43j00K92j67
$$ 20 -51 51 -88 -80 18 -116 54 -170 248 -38 -118 400 180 -13 200 62 -60 43 -100 -200 92 -75
7341g5n2M8r0L19n0k65K76j7r5oJ1j27K86j57k46P0P3Q2k03M53k75k8k4N4K3j30
$$ -75 -127 -79 -169 150 100 -165 111 94 -1 -7 4 -123 163 6 -240 -170 -97 -15 -218 235 -40 -68 -92 -38 -15 -145
7367a45Q3K08k65K07o6K4p2K01l09K46pp7N5J5j61Q1J65j8O3l40J35j1M9j72K6
$$ -145 -62 146 -119 88 22 46 -26 175 -134 112 105 28 83 98 -63 18 183 165 228 -112 23 12 61 -111 -85
7392h5k30J65K73o6p8J57L4l25Qj0L3j18N06j88j40J06k8K73k27J79l44K30j23
$$ -85 -315 -150 123 57 -21 136 170 -155 -147 -157 -124 -242 264 76 -64 42 14 287 60 239 -105 125 2
7415Bj50J16R3Mn0p3K24j62qj61N6L03m31M7J44Q8J1J86l61L68j41k3l90M20j18
$$ 2 -148 -32 61 65 15 -58 166 4 -4 -165 -109 194 -237 -190 -46 42 53 239 -122 246 105 82 -308 112 -6
7440fn1J69k06J93k55Kk86M41M5k26K85k23l1J20l54L91j25J17Np4K36J02l76
$$ -6 -57 112 -94 99 -156 -154 -440 1 46 -180 105 -118 -149 -29 -383 8 -117 0 5 -69 167 269 -107
7463a07n9j44N16m66J10J22J92l3l98P8J23J73k04K52k9o7J26j32j20K90k57k1
$$ -107 -166 -310 206 -260 -150 -28 164 131 -267 -189 -66 107 -97 155 126 59 185 53 -67 223 -34 -55
7485e5j90M19l09K67m3m1N2n4k44J64N1j05J04J20k00N9K55k08L9M3N6j06K9m2
$$ -55 -245 174 -135 132 89 48 100 46 -198 -34 17 -88 16 136 -64 -5 250 42 81 124 180 74 103 61
7509F1J74j75l27L05k50L33L0Q4j03K9J12k8k48J40l88O14k91l84K31J73j61o8
$$ 61 235 60 -267 38 -212 121 151 235 132 161 273 245 -3 137 -251 363 72 -312 -81 92 -69 -137
7531a37k9j56K06J12L51k32k2n1J19l39L52j95o7M3L15k06k8l9K4q5m2k3Q0L7
$$ -137 -166 -322 -116 -4 347 115 93 42 161 -178 174 -21 -88 -45 270 64 36 -3 21 -64 -106 -129 -49 -12
7555a2o7N9J05O7j10Qj3j1J84rl03J13j64L55k37K46k28n5J13j02J28m7l3j06
$$ -12 -79 -20 85 152 42 50 37 26 210 201 -102 11 -153 202 -35 211 -17 -72 41 -61 67 20 -13 -119
7579a19K09l23N34k85L8j74jl3K94k11j1J63qk45K16j79m6o6QM35j2m36L61j52
$$ -119 90 -233 301 16 54 -120 -121 -154 140 -71 -82 81 73 -172 44 -135 -181 -247 -239 196 184 -252 109 -43
7603d3R7r5J15m02M46N5j84%l5L13j93j93o2J87j12J97k83K00j55K33k25P5R5
$$ -43 54 -41 74 -328 118 173 -11 -11 -46 267 74 -119 -181 6 -106 91 -192 8 -147 86 -139 -64 31
7626C1P4P0l16R3j86L96m63M54j33j94L60j08J15l22K24p7k5o1J98l25J51J27
$$ 31 105 175 -141 -48 -234 162 -301 153 20 -174 186 78 193 -129 95 18 -7 -68 130 -195 -44 83
7648H3k13J45L2J18r3n9K24N0n75K01K85k9q7m57M24j22q6M16m87K22N6J35j91
$$ 83 -130 15 47 165 72 13 237 287 -288 -87 198 169 82 -375 49 -73 -159 257 -230 -8 48 183 -8
7671hj15L3K51j37n58O69k44K46r6j79O0R0k4j68L21n0l34N65r6l9j76l05K54
$$ -8 -123 -90 161 24 -534 135 -109 137 41 -138 -78 12 -12 -180 141 91 -243 322 226 187 11 -294 -40
7694d0J05k01O5R1l40M88k33J35p2k6K08l73j20K59L90l77r7Q2Q2k41J34j56K27
$$ -40 65 -136 -71 20 -320 168 -65 70 -2 -28 180 -193 -313 -54 336 -41 -138 -56 26 -215 -81 -237 -10
7717a0j0k17K61K30k61k72K50l71K50p3L75l17K57r4k17J00K06j94j22L94j58
$$ -10 -20 -237 24 254 -7 -279 -29 -400 -150 -223 152 -165 92 -2 -219 -119 87 -107 -229 165 7
7738GJ86k82J16o7l8J33K83l53k3m0n0K53l0M7k48nL24L2j07J50l70k48O26m18
$$ 7 193 -89 27 -40 -78 55 338 -15 -38 -78 -128 125 95 142 -106 -111 213 245 138 288 -82 -330 296 -122
7762a22p8L67k36jl22L89J51q9j2K8j85R0K56n39J15J57J33j21j12K57q3J23l5
$$ -122 -200 167 -69 -70 -392 -3 148 59 47 75 -110 -20 236 -303 -188 -31 102 -19 -131 126 43 166 131
7785A31J00j08P6n8j13q3pK04j04j26L05p7J1q8Q5o0J12l89l6K35O2K27k70J6
$$ 131 231 123 199 141 28 -55 -62 142 38 -88 217 140 151 63 148 88 200 -189 -225 10 72 299 29 45
7809D5k58L04n1J52j12j51J74l26K78k42K23M7k31J26j92R4J33P8k4J5j81L68
$$ 45 -213 91 40 192 80 -71 103 -223 55 -187 36 83 -148 -22 -214 -120 13 91 67 82 -99 269
7831B69n21K09J23m78N62j12k45j53N28j68k70M23j89j24J55k46M27j37n0Q2j47
$$ 269 -252 -43 80 -398 164 52 -193 -346 182 14 -256 167 -22 -146 9 -237 190 53 3 85 -62
7852f2j12M13k46K2J51k33M0j4J34k51L18j45l4k41L13p9J09q7J26j00l7nK5j94
$$ -62 -174 239 -7 15 166 -67 -27 -41 93 -158 160 15 -19 -260 53 -26 83 -4 122 22 -15 -20 5 -189
7876a89L54n4p3J81l09J5K34j69L50j74l49L03%j70j65L79l48n2K77o1J24J18
$$ -189 165 111 38 219 -90 -75 159 -10 340 166 -183 120 120 -50 -215 164 -184 -236 41 -20 104 222
7898B22j25k24J96J61k74l4J12k5K24k49J43q6P1r2Q6j66Q1L4q0j97K50l05K28
$$ 222 97 -127 69 230 -44 -78 34 9 233 -16 127 41 112 20 106 -60 21 55 -25 -222 28 -277 -49
7921d9k69K51j52Q5Q0j89K19j09J19o9K42J12l05Q0m3N2L98k16k27%p1m9J65N9
$$ -49 -318 -67 -219 -134 -54 -243 -24 -133 -14 -83 159 271 -34 46 3 55 453 237 10 10 -61 -110 55 114
7945A14m12K85k4j55OK56k78R8q7K15j31m3J56j05L15j87k8p7L49k16k27K65m5
$$ 114 -298 -13 -37 -192 -186 70 -208 -110 -197 18 -113 -156 0 -105 210 23 -5 -82 267 51 -176 89 44
7968D4j94r3L5L85r0k1l58j7J89J95k02K10j28j66K4N4Mj1K04j11K13l03K81j79
$$ 44 -150 -243 -208 177 87 66 -292 -309 -120 75 -127 83 -45 -211 -187 -133 -129 -140 64 -47 166 -137 144 -35
7992c5N6k74K78qk09O3K57o2k78K29J70l83jN9K67o8o8K3k3P0j07Q3k48L09k74
$$ -35 21 -253 25 17 -192 -129 128 66 -212 17 187 -196 -197 -138 129 61 -7 16 -7 63 -44 39 -209 100 -174
8017a74J90l80M81k59L15j48J75l9l58K57l7K11m3l65K83j72J08k15K1J65o1l0
$$ -174 16 -364 117 -142 173 25 200 161 -197 60 23 234 191 -174 109 -63 45 -170 -149 16 -45 -75
8039g5L03m47L8P6J50j06J8M9j4j45K40l03L18J5k25J89MNj6p8j62L48k55j4P7
$$ -75 228 -219 -181 -105 45 -61 -43 6 -8 -153 87 -216 102 117 -108 81 85 90 74 -4 -166 182 -73 -87 -10
8064a0q5J98m6K55m10K26j83J35j99K41q1PJ21l17J51j0J26mj84j22K17N4k91
$$ -10 -95 103 57 312 -98 128 -55 80 -119 122 41 48 169 -148 3 -7 119 115 -69 -191 26 80 -211
8087b11M69M1n50K34J0n1l6J53R3m6l10K97R3m55O01m05j48K59k53M14n6k17k07
$$ -211 258 299 -251 -17 -7 -58 -94 59 152 106 -204 93 186 -269 332 -73 -221 38 -215 199 143 -74 -281
8110b81K22O8k08K99K8m9o5O9m05K73o5q9K39Jn2l79M34q9M2j27J78J56k98Q0
$$ -281 -59 9 -199 100 128 79 14 83 -322 -49 -114 -203 36 37 -15 -394 40 -49 -7 -134 44 200 -98 -18
8134a8j67M50m54M9J28j16L78N5l70J74j05r2l66L69nq2K9l9J44o1J72j04J4K79
$$ -18 -185 265 -189 -140 -12 -128 250 305 -65 109 4 -88 -454 -85 -90 -172 -143 -182 -38 -99 73 -31 -17 262
8158B62l97O8j65L01j4k7J86l12K17N6k88K09k44J30l3P7O4l35M66j52j07j09
$$ 262 -135 -67 -232 69 55 28 214 -98 119 175 -113 96 -148 -18 -51 26 90 -245 221 69 -38 -147
8180a47L02j71J37j24m4r1L74k51L72o48J49
$$ -147 155 -16 121 -3 -47 -138 236 -15 357 -291 -142
8191a42
$$ Imaginary data points
##PAGE= N=2
##DATA TABLE= (X++(I..I)), XYDATA
0@%%%%QqQj6K4l2L2m0N6p2Q8j04J28j52J76k08K46k86L28l82M42n06N78o58P46
$$ 0 0 0 0 0 8 0 8 -8 16 -16 16 -24 32 -40 48 -56 72 -80 96 -112 134 -152 176 -206 236 -270 308 -350 396
29C96q42R49j068J198j340J497j671J860k064K290k539K811l113L449l820M230
$$ 396 -446 503 -565 633 -707 790 -881 979 -1085 1205 -1334 1477 -1636 1813 -2007 2223
45B223m692N214n804O478p260Q183r285J0628j2311J4494j7447K1687k8333M0302
$$ 2223 -2469 2745 -3059 3419 -3841 4342 -4943 5685 -6626 7868 -9579 12108 -16225 24077
59B4077o8447K47252J69407n78764k8230L95932P2331l94674n5456L07832Q5467
$$ 24077 -44370 202882 372289 -206475 -234705 161227 233558 -161116 -216572 91260 176727
70A76727k48810l3060J89074J7890j73980Q073J34630j4879j26200K6209J06777
$$ 176727 -72083 -105143 83931 101821 -72159 -64086 70544 55665 -70535 -44326 62451
81F2451j1021r0490R862O9010J721n9817j2833M1522K7183l1323l8531J3810M5230
$$ 62451 51430 -39060 -29198 39812 41533 -18284 -31117 10405 37588 6265 -32266 -18456 26774
94B6774p511m7521O265N7254l655n7997O360N7360j9688o5130K6687P2940l0856
$$ 26774 19263 -28258 -21993 35261 31606 -26391 -20031 37329 17641 -47489 -20802 52138 21282
107B1282p3913L8136P5658m7442p8593N0259P6225n7392p4817O2828P1293o9489
$$ 21282 -52631 -14495 61163 13721 -64872 -14613 61612 4220 -70597 -7769 63524 -5965
119e965o6308Q1737P2099q6415p7653Q5113P7724q7312q5718Q0846Q9874o8624
$$ -5965 -72273 9464 81563 -4852 -82505 2608 80332 -6980 -92698 -11852 78022 9398
131I398q5564O2780Q4871n4324q3831M2250P5806l5545p0091K8526O4769k0290
$$ 9398 -76166 -13386 71485 17161 -66670 -24420 51386 15841 -54250 -25724 39045 18755
143A8755n2176J9123M4549j9972m0224J8872L3506k1870l2013K3410L3770k0201
$$ 18755 -33421 -14298 30251 10279 -29945 -11073 22433 563 -31450 -8040 25730 5529
155E529l2415J9494L3001j6060l2986R671K8534o888k5416M335K3253K05j5391
$$ 5529 -26886 -7392 25609 9549 -23437 -13766 14768 7880 -17536 -13201 10052 10257 -5134
168e134K696J0600p581j1997J1360J5270j3149k0950J2797K5888q764k8506O306
$$ -5134 -2438 8162 581 -11416 -56 15214 2065 -18885 -6088 19800 11036 -17470 -11164
181a1164L1453k135l2993k355L1289J436l1473K06L5480L973l5637m552L4811
$$ -11164 20289 18154 -14839 -17194 14095 15531 -15942 -15736 19744 23717 -11920 -16472 18339
194A8339L335l7680o015L8109P930l6424p833L5704R067l3802r847L0814R880
$$ 18339 21674 -16006 -22021 16088 24018 -12406 -20239 15465 24532 -9270 -19117 11697 21577
207B1577k7485q606K2722M257k1520l72K1701j725j9429N978K2452q138k6824
$$ 21577 -5908 -14514 8208 12465 -9055 -9427 12274 10549 -8880 -2902 19550 11412 -15412
220a5412L083K4024m108k3997M924K7611Q86k4163l279J8441J86j8490q27J6238
$$ -15412 -12329 11695 7587 -16410 -11486 16125 17011 -7152 -10431 8010 8196 -10294 -11121 5117
234E117J165j3397K682J4718m523j7017L012J7832k059j8732K81J7439m43j6835
$$ 5117 6282 -7115 -4433 10285 5762 -11255 -8243 9589 7530 -11202 -10921 6518 6075 -10760
248a0760L25J6880M28j4226k12J3190j641j4043M09J2125j44r409K741R751l116
$$ -10760 -10435 6445 6873 -7353 -7565 5625 3984 -10059 -9650 2475 2331 -7078 -4337 5414 2298
263B298q766K422O319m978o761N963Q356n600p975N282P486m522q174M746R243
$$ 2298 -6468 -4046 2273 -2705 -9466 -3503 4853 -747 -8722 -3440 4046 -476 -8650 -3904 5339
278E339k046r117J205Q039k327j0249J528J2990J737j2068j573J3112K438j6805
$$ 5339 3293 -5824 -4619 3420 1093 -9156 -7628 5362 7099 -4969 -6542 6570 9008 -7797
292g797o363J5223P424j2816m950J5466O327j5029n734J3528L705j5062k471J6184
$$ -7797 -14160 1063 8487 -4329 -9279 6187 12514 -2515 -8249 5279 8984 -6078 -8549 7635
306G635J902j6122j245J6592J149j5654r36J5127J53j4170L62J2957j490j1853
$$ 7635 9537 -6585 -7830 8762 9911 -5743 -6679 8448 8601 -5569 -5207 7750 6260 -5593
320e593L128J2693k050j1326K929R805n109j1347L826J2428l262j1327L994J2121
$$ -5593 -2465 10228 8178 -3148 -219 9586 4477 -6870 -3044 9384 6122 -5205 -1211 10910
334A0910l779j4355K880J4176j800j5490K462J6987r74j7811J7J8560J68j9098
$$ 10910 7131 -7224 -4344 9832 8032 -7458 -4996 11991 11017 -6794 -6777 11783 11951 -7147
348g147j403J8407J373j8963k596J8582K658j6584j688J5132J025j4747j154J3195
$$ -7147 -8550 9857 11230 -7733 -10329 8253 10911 -5673 -7361 7771 8796 -5951 -7105 6090
362F090O98j1986L71R477p24q393J576P506j474p071M44N923j517n882m86N972
$$ 6090 6788 -5198 -4827 4650 3926 -4467 -2891 4615 3141 -3930 -3486 2437 920 -4962 -5448 524
378E24J298m306j613N230L300o448n237N462N392p666n986R940Q309j0430q701
$$ 524 1822 -2484 -4097 1133 4433 -2015 -7252 -1790 3602 -4064 -10050 -110 8199 -2231 -10932
393a0932J0980R221j4470j0124J6185J1093j7031j0845J8794J0729j9903j1222
$$ -10932 48 9269 -5201 -15325 860 11953 -5078 -15923 2871 13600 -6303 -17525
405a7525K0383J0785k0541r194K1628Q393k2207q089K1053P452j9731n797J9567
$$ -17525 2858 13643 -6898 -16092 5536 13929 -8278 -16367 4686 12138 -7593 -13390 6177
418F177N477j8378n553J6030M085j3963l427J3554M205j0930l411R777K951r343
$$ 6177 11654 -6724 -12277 3753 7838 -6125 -9552 4002 8207 -2723 -6134 3643 6594 -2749
432b749m116Q324M813o654m949O472N775n663o918N207Q182n496q539O204R118
$$ -2749 -6865 1459 6272 -382 -5331 1141 6916 1253 -5665 -458 7724 2228 -6311 -107 9011
447I011p148j0761Q113J2333p732j2465R311J3097r810j4850R501J3933r339j4531
$$ 9011 1863 -8898 -785 11548 3816 -8649 662 13759 3949 -10901 -1400 12533 3194 -11337
461a1337J1500J4656j1314j5408J0558J4593r608j4371R294J4419q520j3767O441
$$ -11337 163 14819 3505 -11903 -1345 13248 3640 -10731 -1437 12982 4462 -9305 -2864
474b864J3115n671j1880M811J0986m113j0135L568Q922m239r546L140J0855k880
$$ -2864 10251 4580 -7300 -2489 8497 4384 -5751 -2183 6739 2500 -7046 -3906 6949 4069
488D069j0895L083J1244l137j2624K257J3020j756j3091K681J3089k869j4498
$$ 4069 -6826 -3743 7501 4364 -8260 -6003 7017 5261 -7830 -5149 7940 5071 -9427
501i427K626J4789m368j4479N039J4690m897j5445N676J4831o702j4540P114J4875
$$ -9427 -6801 7988 3620 -10859 -5820 8870 3973 -11472 -5796 9035 2333 -12207 -5093 9782
515I782o866j4832O610J4073o393j3415O089J2275n694j1465N037J0328l989r775
$$ 9782 2916 -11916 -5306 8767 2374 -11041 -4952 7323 1629 -9836 -4799 5529 1540 -8235
529h235L795Q820l158q369K823Q329j440q186M03P470J372o858k244O597K768
$$ -8235 -4440 4380 1222 -7147 -4324 4005 2565 -5621 -5218 2252 3624 -3234 -5478 1119 3887
544C887n887l837O130L680m937l631N049L242n616k237O343K231p299k018Q897
$$ 3887 -2000 -5837 293 3973 -964 -4595 454 3696 -1920 -4157 2186 4417 -2882 -4900 3997
559C997K265r255l198J0423L670j0098l905J0040M149r774l851R604L519j0216
$$ 3997 6262 -2993 -6191 4232 7902 -2196 -6101 3939 8088 -1686 -5537 4067 7586 -2630
573b630k722R975L063j0756k969J1705L532j1582l008J1664L908j2201m876J1518
$$ -2630 -5352 4623 7686 -3070 -6039 5666 9198 -2384 -5392 6272 10180 -2021 -6897 4621
587D621M978j1072m709J0129M822r733l937R388K740r220j799R133J184j0214
$$ 4621 9599 -1473 -6182 3947 8769 -964 -4901 4487 7227 -1993 -3792 5341 6525 -3689
601c689rJ0316K6j0380o14J0307P59r320p90Q369l52p713KO005o36n231K515M910
$$ -3689 -3698 6618 6644 -3736 -4350 5957 6716 -2604 -3394 4975 4623 -3090 -3088 2917 2281 -2950 -435 4475
619D475l268n459L511M921l485n321L262O060j861o618q9N767J050n499k375M614
$$ 4475 1207 -4252 -741 4180 695 -4626 -1364 4696 2835 -3783 -3872 1895 2945 -2554 -4929 -315
635c15L745l655m649L225M737l644n274L451N308l297n253M391O679n636q272
$$ -315 3430 -225 -4874 -1649 3088 -556 -5830 -2379 2929 -368 -5621 -1230 5449 -187 -8459
650h459N845Q377n643r101N212R358m536r128M382Q182m392o842N047O164n889
$$ -8459 -2614 5763 120 -8981 -3769 5589 1053 -8075 -3693 4489 97 -6745 -1698 4466 -1423
665a423n559O481N226p452m622Q350M990q330n380Q360N460q479n234P441N505
$$ -1423 -6982 -501 4725 -2727 -7349 1001 5991 -2339 -7719 641 6101 -2378 -7612 -171 5334
680E334o924m323O779L618o151k710O368J872p202j003P974J685q175k266Q858
$$ 5334 -1590 -5913 866 4484 -1667 -4377 1991 3863 -3339 -4342 3632 5317 -2858 -5124 3734
695C734K447q384l406P999M058o557n258N428M770l580l689K664L298k354j645
$$ 3734 6181 -2203 -5609 2390 6448 -109 -5367 61 4831 1251 -2438 226 3524 1170 -475
710d75K024J675k965j446K317K552k089l127J652M087m82n106o97M644J833m774
$$ -475 1549 3224 259 -1187 1130 3682 1593 -1534 118 4205 3723 -1383 -2080 2564 4397 -377
726c77j831L975J921m094p07M640k1n604Q62N607j533p457K183Q359k000r588
$$ -377 -2208 1767 3688 -406 -1113 3527 3506 -2098 -1236 4371 2838 -4619 -2436 5923 3923 -5665
742e665K715R108k217r946K594R476k979r045L002Q717l994p577M479P353n433
$$ -5665 -2950 6158 3941 -6005 -3411 6065 3086 -5959 -2957 5760 1766 -5811 -1332 6021 588
757E88o841N970O389p068o859O496P525o520o768N001O664m112n703K110M916
$$ 588 -6253 -283 6106 -962 -7821 -1325 6200 -320 -7088 -2087 4577 465 -5238 -3128 1788
772A788j970l246K065J928j966j145K361J092k401k040K412K592j772l788R66
$$ 1788 -182 -3428 -1363 565 -1401 -2546 -185 907 -1494 -3534 -1122 1470 -302 -4090 -3124
787c124M648l1m824l73M914J091n096j241N023J528n150r37N236O06n555R61N278
$$ -3124 1524 1493 -3331 -3704 1210 2301 -2795 -4036 987 2515 -2635 -3572 1664 2270 -3285 -2324 2954
804B954p24o193O91O747j181p086R86Q205n20p427N2O552L02n272n19M737J91
$$ 2954 2230 -3963 -3272 3475 2294 -4792 -3806 4399 3879 -3548 -3496 3056 3358 -1914 -2433 2304 2495
821B495l839M15L685k46m122P93M245m90m517l54M699Q20m156j663M233K995l969
$$ 2495 -1344 -929 2756 2510 -1612 -819 3426 2936 -1581 -1935 2764 3584 -572 -2235 1998 4993 1024
838A024k646L024K470l380k043L753J412l689j393N159Q74n513j080N851N48o758
$$ 1024 -1622 1402 3872 492 -1551 2202 3614 -75 -1468 3691 4565 -948 -2028 3823 4371 -2387
854b387p64P343J045p856m82P676J058p309j383O923J102o839q25N429N87n365
$$ -2387 -3151 4192 5237 -2619 -3101 4575 5633 -1676 -3059 3864 4966 -1873 -2698 2731 3318 -2047
870b047O15N021q09m855O27M438j048m268k81L748O52k725p79K567J105j731j352
$$ -2047 -1432 3589 2780 -2075 -1448 2990 1942 -2326 -2607 1141 1793 -932 -1711 856 1961 230 -1122
887a122O68P85o25j579J027J217j485j198K020K129k424k703K069L029k338l730
$$ -1122 -454 331 -294 -1873 -846 371 -1114 -2312 -292 1837 -587 -3290 -1221 1808 -530 -4260
903d260K341L997k797l438L245L827l805l416M000K897m624l861N375L693n117
$$ -4260 -1919 2078 -719 -4157 -912 2915 -890 -4306 -306 2591 -2033 -5894 -519 3174 -1943
918a943l175N789L109o096l106N855L155o290l130O124L487n003l484M621L352
$$ -1943 -5118 671 3780 -2316 -5422 433 3588 -2702 -5832 292 3779 -1224 -4708 -87 3265
933C265m293k568L640J919l335k004L396J947k832j191L266R05k587j438K006
$$ 3265 -1028 -3596 44 1963 -1372 -3376 20 1967 -865 -2056 1210 2115 -472 -1910 96
948I6J948k348j789J800J928o94j540J542J089j191j828J213J802j908j898K123
$$ 96 2044 -304 -2093 -293 1635 941 -599 943 2032 841 -987 226 2028 120 -1778 345
964C45K346j370k733K090K642j693l076J492K739j501l002K152L251j841l740
$$ 345 2691 1321 -1412 678 3320 1627 -1449 43 2782 1281 -1721 431 3682 1841 -1899
979a899K423L608k605m044K197M033k661l881K089M551k097m272K246M018j629
$$ -1899 524 4132 1527 -2517 -320 3713 1052 -2829 -740 3811 1714 -2558 -312 3706 2077
994B077m309J139M253j859l778J450M090j511l675J571L359j862l215J162K736
$$ 2077 -2232 -1093 3160 1301 -2477 -1027 3063 1552 -2123 -552 2807 945 -2270 -1108 1628
1009A628j713k306J970K187j318k614J846K230k014k448J589J870j606j653J817
$$ 1628 -85 -2391 -421 1766 448 -2166 -320 1910 -104 -2552 -963 907 -699 -2352 -535
1024e35J926j568k203J594J982j777k470J149K799j205k452J159L052j015k789
$$ -535 1391 -177 -2380 -786 1196 -581 -3051 -1902 897 -308 -2760 -1601 1451 436 -2353
1039b353O42L125o97l669N5L366J48k957jL383L2l505N15K944j01l424L7L345
$$ -2353 -1711 1414 717 -2952 -2897 469 617 -2340 -2341 1042 1074 -2431 -1916 1028 927 -2497 -2460 885
1057H85L50l165M02K703K35k729k14K681l17k524R5K461n8k003M21K446l25j987
$$ 885 1235 -1930 -1528 1175 1410 -1319 -1533 1148 831 -1693 -1598 863 805 -1198 -777 1669 1344 -643
1075f43j36K082j68k239Q9K359nj877K64K169k1k113k79K330m17k468L4L055O05
$$ -643 -779 1303 1135 -1104 -1015 1344 1339 -538 -274 1895 1874 -239 -518 1812 1395 -1073 -1039 2016 2621
1094B621l559l8L520O25l679j97L226L72l546l27L311M44l361L1K732P49l226
$$ 2621 -938 -976 2544 3169 -510 -707 2519 2891 -655 -982 2329 2773 -588 -557 2175 2924 -302
1111c02p16K910O01l099l95K674P46k403n09K197K83k078l88J508N96j808o01
$$ -302 -1018 1892 2493 -606 -1001 1673 2419 16 -493 1704 1987 -91 -479 1029 1625 -183 -784
1128g84J318R63j777o78J841Q46j674j167J603P80j711j124K161J067k606q61
$$ -784 534 1497 -280 -958 883 1729 55 -1112 491 1271 -440 -1564 597 1664 -942 -1803
1144a803K622J021k749j732K725J270k534j699L006J067k549r30K529R95k458
$$ -1803 819 1840 -909 -2641 84 1354 -1180 -2879 127 1194 -1355 -2285 244 1239 -1219
1159a219j408K585R18k543r89K684Q38j975j224K135Q81j651j147J619P25j537
$$ -1219 -2627 -42 876 -1667 -2656 28 866 -1109 -2333 -198 683 -968 -2115 -496 229 -1308
1175a308j068J535J302q46j469R78J586j209j284R93J212j211p33J055J189q68
$$ -1308 -2376 -841 461 -385 -1854 -876 710 -499 -1783 -790 422 -789 -1522 -467 722 -146
1191a46j385Q97J593j425j804J747K136j839j907K082J823j671j813J837J704
$$ -146 -1531 -634 959 -466 -2270 -523 1613 -226 -2133 -51 1772 101 -1712 125 1829
1206A829j966j742K329J271j845j668K625J637k568j990K699K012k215k224K151
$$ 1829 -137 -1879 450 1721 -124 -1792 833 2470 -98 -2088 611 2623 408 -1816 335
1221C35J931j756j235J246J486j641o37Q37R31j085j016J316R55j260r44J275
$$ 335 2266 510 -725 521 2007 366 -271 566 1497 412 -604 712 1667 407 -537 738
1237G38J257j281q99O71J198q16j423N37J552p56j528Q65J138k82j503O35J046
$$ 738 1995 714 -185 486 1684 868 -555 -18 1534 778 -750 115 1253 971 -532 103 1149
1254A149o24j503J020J350r86j468J119J828j389k021Q60K247j312j929P36K415
$$ 1149 525 -978 42 1392 406 -1062 57 1885 496 -1525 -665 1582 270 -1659 -923 1492
1270A492r31k083N16J973m26j725O78R79l83j499O41J278r45j197P02J691m64
$$ 1492 561 -1522 -1006 967 541 -1184 -506 473 90 -1409 -768 510 -435 -1632 -930 761 297
1287B97k048m1J801R4j509l11J307P09j433n0J039K91j429M07Q27k58j266J94
$$ 297 -1751 -1792 9 103 -1406 -1717 -410 299 -1134 -1184 -145 146 -1283 -876 -49 -307 -1573 -1379
1305a379K180n78k234O18K189k59k360O8K055O5j981K10J868k77j262L09J912
$$ -1379 801 223 -2011 -1393 796 537 -1823 -1755 300 365 -1616 -1406 462 185 -1077 -768 1144
1322A144r09j465Q87J411q87j784N69K249r54j678O97J972m38j500k00J724L0
$$ 1144 235 -1230 -343 1068 181 -1603 -1034 1215 261 -1417 -720 1252 814 -686 -886 838 868
1339H68r93l18J192R9o65o3P86K17r62j38J303m16j100J82J248L51j841q3J811
$$ 868 -125 -443 749 848 183 120 906 1123 161 23 1326 910 -190 -8 1240 1591 -250 -333 1478
1358A478L11j534m04J292P18j143q40J049M71j022j64J163m92j248K25J634j8
$$ 1478 1789 255 -149 1143 1861 718 -122 927 1398 376 212 1375 883 -365 -140 1494 1476
1375A476k097M6J779P09k099n14J795R70k082n78J113N05j111m19J101N34j578
$$ 1476 -621 -575 1204 1913 -186 -700 1095 2065 -17 -595 518 1023 -88 -507 594 1128 -450
1392d50j90J436J92j731m72J759O26j923o55K091O28j903p23J739M72j240r84
$$ -450 -640 796 988 -743 -1215 544 1170 -753 -1408 683 1311 -592 -1315 424 896 -344 -1328
1409a328P25R47j124n12R82L96r85K4R12K83j423q7J114M01j294n95J613L29r12
$$ -1328 -603 344 -780 -1292 -310 86 -899 -875 37 320 -1103 -1190 -76 325 -969 -1564 49 378 -534
1428e34j048Q61J269j137r01O67R22n87p20J032O9o46o93J157R27j227j139J450
$$ -534 -1582 -721 548 -589 -1490 -823 99 -488 -1208 -176 -107 -753 -1446 -289 638 -589 -1728 -278
1446b78J226j428j331J269J353q78j128P41J239r68j059Q13J097j022n12J082
$$ -278 948 -480 -1811 -542 811 -67 -1195 -454 785 -183 -1242 -429 668 -354 -866 216
1462B16Q59j666m53J840M34j271j249J423R33j373p01J070J002q83q92Q02Q91
$$ 216 1075 -591 -1044 796 1230 -41 -1290 133 1066 -307 -1008 62 1064 181 -711 91 982
1479I82r30l60J058J21p55m82J082M38n24j078Q68J131j019o74N14Q78n43j169
$$ 982 52 -308 750 871 116 -366 716 1154 630 -448 420 1551 532 -142 372 1250 707 -462
1497d62P40R76l81j245M60J033m08r75L38J217r09r55O24R60m53j049N82J275
$$ -462 278 1254 873 -372 88 1121 713 -262 76 1293 384 -571 53 1013 560 -489 93 1368
1515A368r54j329R36J133l88j533K46J007R8j127M04M82k99q03L30Q57n12p32
$$ 1368 414 -915 21 1154 766 -767 -521 486 584 -543 -139 343 44 -759 -429 428 -84 -816
1533h16L71J060q83r56M42J392m90j250J47J109o2r28J46N99J85q39J47Q51k63
$$ -816 -445 615 -268 -1224 -782 610 120 -1130 -983 126 64 -864 -718 -119 66 -773 -626 225 -38
1552c8j004L30J084n83r17J74J330m79q57l7J670m97j095L9J143K6j352J38J103
$$ -38 -1042 -712 372 -211 -1128 -954 376 -103 -960 -997 673 176 -919 -880 263 289 -1063 -925 178
1571A78q3o39k14R28J24q37k84R81P7q19J37P64j48p17n6J092Oq59J11P75J48
$$ 178 95 -544 -758 170 294 -543 -827 154 231 -588 -451 313 165 -552 -608 484 490 -369 -258 517 665
1592F65q32O3N78o5n20j1J021l52r07N87P48q9r31j05J254j4j602M99R51K19j128
$$ 665 -167 -104 474 409 -111 -122 899 547 -360 227 975 886 -45 -150 1104 1090 -512 -13 938 1157 29
1613B9m1R82k73n27J23P00k63p71K3J026j66q70P09J02K66q50k65R75k18l59l8
$$ 29 -12 970 697 170 293 993 730 -41 -18 1008 842 -28 681 783 1049 199 -66 909 691 332 294
1634B94J69M51o16k14M64K31l23p92N52J77o9l79M46L17p00l78N08M57o73l44
$$ 294 463 914 298 84 548 779 456 -336 216 393 324 -55 391 708 8 -370 138 595 -78 -422
1654d22N90N64j180m77R51O33r08q01J199N26r77o64J038J96q31j75O94No86j73
$$ -422 168 732 -448 -925 26 659 -249 -1050 149 675 -302 -966 72 268 -563 -738 -44 -39 -725 -898
1674h98J004j45r01j53J066M73j254J34O81R8n38m88O64N0n4o17M65J08k02m93
$$ -898 106 -39 -940 -1093 -27 446 -808 -674 7 105 -433 -921 -257 -207 -261 -878 -413 -305 -507 -1000
1694a000Q04Q9k70m85K22O10q7p20N14M03l39m54N82L93n89l61P63K52n77o99
$$ -1000 -196 -107 -377 -862 -640 -30 -117 -837 -323 80 -259 -713 -131 262 -327 -688 75 327 -250 -949
1714i49Q73O40q31j32L78M61n13j90J31P83n80l51J49O93n61j32M22O55q75m77
$$ -949 -76 564 -267 -399 -21 440 -73 -263 -132 651 71 -280 -131 562 1 -131 291 946 71 -406
1734d06M67N51j27n32J45N15k78l38M05L79p7q17K35N31k7n97L9M00p0k51L3P33
$$ -406 61 612 485 -47 98 613 335 -3 402 781 704 -113 122 653 626 29 68 468 398 147 180 913
1756I13p78n18N95N34o06m15K84P22j17r69L82Q32n29m59Q5N52l05p15L32Q05
$$ 913 135 -383 212 746 140 -275 9 731 614 -355 27 859 330 -129 -44 508 203 -512 -180 625
1776F25p03m60M14N17k73n61J95P21m53o28M08N76l73n34J12P72k28p76M34L39
$$ 625 -78 -538 -124 393 120 -441 -246 475 22 -606 -198 378 5 -529 -417 355 127 -649 -215 124
1796A24l32n60K89N03j96n75L13N60j42p10K54J66J97m06J58M99n46O3K25j66
$$ 124 -208 -768 -479 24 -172 -747 -434 126 -16 -726 -472 -306 -109 -515 -357 142 -404 -341 -116 -282
1816b82M9m4k98L42K42q04J07O53Kk58k58K65N07l84o42R18p9k47k22O46N1o35
$$ -282 -233 -277 -575 -233 9 -795 -688 -35 -33 -291 -549 -284 223 -161 -803 115 36 -211 -433 213 264 -371
1838c71N4M82K90r37J10R39k86p49J96P43N7r24J27J055l14p91M55O79k98q41
$$ -371 -317 165 455 -482 -372 567 281 -468 -272 471 528 -396 -269 786 472 -319 136 815 517 -324
1858c24K1R74j87p26M83K44k37l56qQ10j94k62O6M16k77o45O23J89K9o20K20K48
$$ -324 -303 671 484 -242 241 485 248 -108 -116 694 500 238 304 720 443 -202 421 610 639 19 239 487
1880D87l16J13k3L98o8k37l5j33L88n53Q1K43M50o43n0J16L53k21j61n6L41k09
$$ 487 171 284 261 659 591 354 319 186 574 21 102 345 795 152 102 218 571 350 189 133 474 265
1902B65o76R16P6o28j68N09N96r01o19M66K84k81l66M98k4l04p8N60M1m29r9N5
$$ 265 -411 505 581 -47 -215 294 890 -11 -630 -164 120 -161 -527 -29 -53 -357 -435 125 166 -263 -362 -307
1924c07N76o35K7L83J4l39j2L44M6n63J23L27l52j39P0L74l64k54J62K81K09l53
$$ -307 269 -366 -339 44 58 -281 -293 51 97 -466 -343 -16 -368 -507 -437 -63 -427 -681 -519 -238 -29 -382
1946c82k53L03M04k69m20K37K18p7l23K89K35k59m9J28J27j53k50M86o9j65k76
$$ -382 -635 -332 72 -197 -617 -380 -162 -239 -562 -273 -38 -297 -346 -218 -91 -244 -494 -8 -77 -242 -518
1967e18N07J57l10k11L44L05l03l13K50M10n38J12J89M50m47Qj31M28k21l80N30
$$ -518 -11 146 -164 -375 -31 274 -29 -342 -92 318 -220 -108 81 531 84 92 -39 389 168 -212 318
1988C18j88N6J28k53J84L2l17K68J58l55k53N61M0J04o64N16n3J87l82K00L71
$$ 318 130 186 314 61 245 277 -40 228 386 31 -222 339 379 483 -181 335 282 469 87 287 658
2009F58m62l79L49N13o14k78O49J75k63p54L88L61j64j24O4J21O6l80M09m2l34
$$ 658 196 -183 166 679 65 -213 436 611 348 -406 -18 343 179 55 119 240 306 -74 335 293 -41
2030d1R4l5L02j10m63K50R0K96m84M0K13p5k32j83J68L09o21K07J98l0j70J46
$$ -41 53 18 320 210 -253 -3 87 383 -101 -61 152 77 -155 -338 -170 139 -482 -275 -77 -107 -277 -131
2052a31J91m08K59k10K93j37k35j10P38m98k91L24J77Q1k40K36L8j15j89K27J38
$$ -131 60 -348 -89 -299 -6 -143 -378 -488 250 -248 -539 -215 -38 43 -197 39 77 -38 -227 0 138
2073A38o21L50J00j13k8k04K1N32k76k71mN52r0j18k88J40l2j56mJ4L14l7p0J9
$$ 138 -483 -133 -33 -146 -174 -378 -357 175 -101 -372 -376 176 86 -32 -320 -180 -212 -368 -372 -358 -44 -81 -151 -132
2097a32M33j77k01L07K65o36j51O04P6m20j37M76K00k92m61L16K53k29j70K17
$$ -132 301 124 -77 230 495 -141 -292 312 388 -32 -169 307 507 215 -246 70 323 94 -76 141
2117A41K12m89J42O01l85L1K8J63j57k43J18Q5L26m74j16N19m59qj6J58O5l8K02
$$ 141 353 -136 6 607 222 253 281 444 287 44 162 247 573 99 -17 502 43 35 19 177 242 204 406
2140D06M4j20p8K0k58K62j33J58J66j90l78K30j3l9R9K06j43K8j96k51L40R0k32
$$ 406 450 330 252 272 14 276 143 301 467 277 -101 129 116 77 176 382 239 267 71 -180 160 250 18
2163A8jp7K32j82k48K86O6k46J4M05m0m46j09J87J74p1l64M02J3l42k42N00r5
$$ 18 17 -60 172 -10 -258 28 94 -152 -138 267 227 -219 -328 -141 33 -38 -402 0 13 -329 -571 -71 -166
2186a66J8m03N46p3j72j26K74K08o07P3M0L33k39m6K04j0l91O6J78K92k59m09
$$ -166 -148 -551 -5 -78 -250 -376 -102 106 -501 -428 -388 -55 -294 -340 -136 -146 -537 -471 -293 -1 -260 -669
2208f69M56J34j75l12M21J60m78L00Q9j69R6j14K75M4j86k9r4K67O2l37r9M28
$$ -669 -213 -79 -254 -566 -145 15 -463 -163 -74 -243 -147 -261 14 58 -128 -157 -251 16 78 -259 -358 70
2230G0k01n9R6L05j3l09j88J65K94l57J48M00j74m05J75O47n90j16L21K31m94
$$ 70 -131 -190 -94 211 198 -111 -299 -134 160 -197 -49 351 177 -228 -53 594 4 -112 209 440 -54
2251e4q2J48K11j52N0J12L06p60M17m4L35n55k03M82L00l23j13L38j8j21l59L49
$$ -54 -136 12 223 71 121 233 539 -221 196 152 487 -68 -271 211 511 188 75 413 395 274 -85 264
2273B64j24K7Q7J46k45o3J10J34j04n0k34J83L0j25O7o3nok29L76R6j30k70J00
$$ 264 140 167 254 400 155 92 202 336 232 182 -52 131 161 36 103 40 35 29 -200 176 272 142 -128 -28
2297b8K00l22J88j65j9J78j66j59O83m25j00Q8N2J96k56k18J47j10o7O3Q6M9j47
$$ -28 172 -150 38 -127 -146 32 -134 -293 390 -35 -135 -47 5 201 -55 -273 -126 -236 -303 -240 -154 -105 -252
2320b52L71r5l88J41k86M99j12o6k4K38k43j75J52J89J5k0Jm4J40k01K77Ok44
$$ -252 119 24 -364 -223 -509 -10 -122 -188 -212 26 -217 -392 -240 -51 -36 -56 -55 -99 41 -160 117 123 -121
2343a21j33RK41k14J17m0L22j42k23J20K66n2j12m95M83l7R9N7q5l3p3Q2j98M96
$$ -121 -254 -245 -4 -218 -101 -141 181 39 -184 -64 202 150 38 -457 26 -11 88 145 60 27 -46 36 -162 334
2367C34n38K60Q6m81N14k10K49P3j77k62M67M1k40L6J04o8l9l48L72N48m52l92
$$ 334 -204 56 142 -339 175 -35 214 287 110 -152 315 356 116 152 256 188 149 -199 173 721 269 -123
2389a23K69K42l75Q4K4j51J2M39j79j48O2oK69m19o1l1K85J52l46O0R2k38RL63
$$ -123 146 388 13 97 121 -30 -18 421 242 94 156 150 419 0 -61 -92 193 345 -1 59 151 -87 -78 285
2413B85k47j5r2K9M1N8j09M3J98j62L15r8k78L12l82j07o4L10k82q8J58rO5j30
$$ 285 38 23 -69 -40 1 59 -50 -7 191 29 344 246 -32 280 -102 -209 -273 37 -245 -333 -175 -184 -119 -249
2437b49N6K34m94K26M4L8J74k23kJ91k14j46J2L68k21j84J55r0J18MJ94J7l42
$$ -249 -193 41 -453 -227 -183 -145 29 -194 -196 -5 -219 -365 -353 15 -206 -390 -235 -325 -207 -203 -9 8 -334
2460c34J18L15K9m03k43L67L2K69l79Q7p1M6p3n4K81l65L37J07r3n50M69O0o6
$$ -334 -216 99 128 -275 -518 -151 -119 150 -229 -142 -213 -167 -240 -294 -13 -378 -41 66 -27 -577 -108 -48 -114
2483a14J24M7j1O8j24m68M37K71j54j14j94L41L4j16p4J30k0K4j74J71l6m39N81
$$ -114 10 57 46 114 -10 -478 -41 230 76 -38 -232 109 143 27 -47 83 63 87 -87 84 48 -391 190
2506A90J2j45j19L50k55j27j5J12K62j38j5P0j34M4K46j4j1L8l23J70P5j04k69
$$ 190 202 57 -62 288 33 -94 -109 3 265 127 112 182 48 92 338 324 313 351 28 198 273 169 -100
2529a00L87j79j21J21K4m8o7K22J39k94J38m65L26NP0q2J64k89J72n3k36MJ56
$$ -100 287 108 -13 108 132 84 17 239 378 84 222 -243 83 88 158 76 240 -49 123 70 -166 -162 -6
2552fM6j76o9K48j54Qo4o4K55O8n3j75K11l52M06k62J2o3Q3J23j96R1L38n78m1
$$ -6 40 -136 -205 43 -111 -103 -167 -231 24 92 39 -136 75 -277 129 -133 -121 -184 -101 22 -174 -83 255 -323 -364
2577c64M82k12j95q1R0K71q4p6j6j05M00k24pJ38O8l49l8N08l05j94J99K69k13
$$ -364 118 -94 -289 -370 -280 -9 -93 -169 -185 -290 110 -114 -121 17 85 -264 -302 206 -99 -293 -94 175 -38
2600c8L1L3Q7j4m0k73J13J31p7j48M32k91rK71j1k14j61J9J77k40K46q5K05n9
$$ -38 -7 26 113 99 59 -214 -101 30 -47 -195 237 -54 -63 208 197 -17 -178 -159 18 -222 24 -61 144 85
2624H5j62M77j62K8k3k20J32L9j01J22R0k49J98ql74K74j05k6J76K1l31L34o7
$$ 85 -77 400 238 266 243 23 155 194 93 215 305 56 254 246 -128 146 41 15 191 212 -119 215 148
2647A48L12l64J06k51L66l51J08L76j66j70j95L10l1l35K06M03k40o3q4K8K73
$$ 148 460 96 202 -49 317 -34 74 450 284 114 -81 229 198 -137 69 472 232 169 85 113 386
2668C86l97J53k38K95l06J15O9J07p1j2j76K8P1P0k99k9K09M4R6j78k03J89R8
$$ 386 -11 142 -96 199 -107 8 77 184 113 101 -75 -47 24 94 -205 -234 -25 19 115 -63 -266 -77 21
2691B1j80r7l2R4J27mp8K6J33l23L24j13K2j05L7p1L6J83j30J76j11J56m58M73
$$ 21 -159 -256 -288 -194 -67 -71 -149 -123 10 -313 11 -102 -80 -185 -148 -219 -183 0 -130 46 -65 91 -367 106
2715A06k37O4l00K63Q7j22j72J98J59l21K19K8K1m16N67k06O0j04O4j16k6L50
$$ 106 -131 -67 -367 -104 -17 -139 -311 -113 46 -275 -56 -28 -7 -423 144 -62 -2 -106 -42 -158 -184 166
2737A66P7l97J93k13K33j41K8J18l20l0L09k63K40J2l9J30K29p13L43K1l4L21
$$ 166 243 -154 39 -174 59 -82 -54 64 -256 -286 23 -240 0 12 -27 103 332 -381 -38 -17 -51 270
2759B70j30j01n13N62j36K13R3m00l4K48l3J35r4K14n74N45j84j12p0L95M8r9
$$ 270 140 39 -474 88 -48 165 258 -142 -176 72 39 174 80 294 -280 265 81 -31 -101 294 342 243
2781B43l37O19k0k45J99l78k31J41L63l78J55r1r6O9q1J97p9r8J73J08k48k39
$$ 243 -94 525 505 260 459 81 -150 -9 354 -24 131 40 -56 13 -68 129 50 -48 125 233 -15 -254
2803b54L24kl1l6J75r9l0m5K89j39k43K22j14L3l68K88O9o8l4j18K75k03l0j77
$$ -254 70 68 37 1 176 77 47 2 291 152 -91 131 17 50 -318 -30 39 -29 -63 -181 94 -109 -139 -316
2827c16M97j17l10L32k27j15j22rL64J36l02j1J95J71L9j60j79J46j60k3r2k6
$$ -316 181 64 -246 86 -141 -256 -378 -387 -23 113 -189 -200 -5 166 205 45 -134 12 -148 -171 -263 -289
2849b89N9K92k19K37k51O8J07Lj96J87j30K04r5j0m6P1j46K33k17M8m4K2J50j83
$$ -289 -230 62 -157 80 -171 -103 4 7 -189 -2 -132 72 -23 -33 -79 -8 -154 79 -138 -90 -134 -112 38 -145
2873a45J59J16n1j87P3j53J52Q2J3l18J99Q5j04M33m11K08k01j20K83J38j75j39
$$ -145 14 130 79 -108 -35 -188 -36 46 59 -259 -60 25 -79 354 -57 151 -50 -170 113 251 76 -63
2895f3J8J97op9Kl50P14o8m00N2J12l2l39O81l78m1J80j16K25j59o2m0o3NJJ04
$$ -63 -45 152 146 67 69 -281 433 365 -35 17 129 97 -242 439 61 20 200 84 309 150 88 48 -15 -10 -9 95
2921I5mk42J15J65J38l32J15K03r7J72k96P1RL5r9j76j0n3J99k9M9J37l00J20
$$ 95 91 -151 -36 129 267 -65 50 253 156 328 32 103 112 147 48 -128 -138 -191 8 -21 28 165 -135 -15
2945a5J37l90J76J3j14P6K69k44J7j64m2o4J74o7K63n3M7J85l83K86N3j38p7R3
$$ -15 122 -268 -92 -79 -193 -117 152 -92 -75 -239 -281 -345 -171 -238 25 -28 19 204 -179 107 160 22 -55 38
2969C8n5j15J70m1K4j86J09k98K53n3K51j73j41J03J60j9pjj50n2K26l0q6Q1m4
$$ 38 -17 -132 38 -3 21 -165 -56 -354 -101 -154 97 -76 -217 -114 46 27 20 19 -131 -183 43 13 -73 8 -36
2994c6jQ2Mj00L9K9J31l70j85N39l67K61k11J31N2p4M12m93Q6K44M1n9j15l8M28
$$ -36 -37 45 49 -51 -12 17 148 -222 -407 132 -235 26 -185 -54 -2 -76 336 -157 -71 173 214 155 40 2 430
3019D30l40n2q4L30j56j10L52j2l39K61j92l55N99m68L12J33n15K98L2K11p13
$$ 430 90 38 -46 284 128 18 370 358 19 280 88 -267 332 -136 176 309 -206 92 124 335 -378
3040c78O82j71Rj29oK64m43J86mn4J72om5R0m13J94J64J46j55k7l8j26r7L72j13
$$ -378 304 133 142 13 7 271 -172 14 10 -44 128 122 77 167 -246 -52 112 258 103 76 38 -88 -185 187 74
3065G4j75L76j17j08n2j52J89p5K68l94K24j11j9o1K81j03j64M8k32L37R8n17
$$ 74 -101 275 158 50 -2 -154 35 -40 228 -166 58 -53 -72 -133 148 45 -119 -71 -303 34 132 -385
3087c85P40n02O3L46l92K62j88k86J41J2M3N0J90k16j45K48k63J06k3K97j50J77
$$ -385 355 -147 -84 262 -130 132 -56 -342 -201 -189 -146 -96 94 -122 -267 -19 -282 -176 -199 98 -52 125
3109A25l50J82j38K54j09L1l02J90J9L3K0k6j9kK83j2l43R3k5N35n76R5m8%J21
$$ 125 -225 -43 -181 73 -36 -5 -307 -117 -98 -65 -45 -71 -90 -92 191 179 -164 -71 -96 439 -137 -42 -90 -90 31
3134C1l30K45K07j20k44K90j04j20K80R3p3J53l13n8K47K0J68k09K69m95P4L1
$$ 31 -299 -54 153 33 -211 79 -25 -145 135 228 155 308 -5 -63 184 204 372 163 432 -63 11 42
3156D2k60L37j90P9q8J8k8L03j45M50k43j80N2p9J42l54L06J63n02R4K6k9N1J0
$$ 42 -218 119 -71 8 -80 -62 -90 213 68 518 275 95 147 68 210 -144 162 325 -177 -83 -57 -86 -35 -25
3180b5q0J88K9J32j38jj68J36k13K87j56Q5p7M4l0k24L77r9q7k33M84j20p1j80
$$ -25 -105 83 112 244 106 105 -63 73 -140 147 -9 76 -1 43 13 -211 166 67 -20 -253 231 111 40 -140
3204a40m0n5O3P9Rn7P0r2K61n7l6l6k82J37K30k87L7J93m9l2l1j12o6K33J7k19
$$ -140 -180 -235 -172 -93 -84 -141 -71 -163 98 41 5 -31 -313 -176 54 -233 -196 -3 -52 -84 -115 -227 -293 -60 -43 -262
3230b62K91k0k07M83n32MJ76k13J83L8j91k15M22Qr7Q6M8j56J20K06k19K1K54
$$ -262 29 9 -198 285 -247 -243 -67 -280 -97 -59 -250 -465 -43 -35 -132 -46 2 -154 -34 172 -47 -26 228
3253B28l91p1k3M02l03J74m6J6J8P5m9k84JR4j08M16O7k16K73l89k58K08q3L36
$$ 228 -163 -234 -257 145 -158 16 -30 -14 4 79 30 -254 -253 -159 -267 149 216 0 273 -116 -374 -166 -249 87
3277H7L78m76K91n50J79J69N1Q5l46L01J10j84M3j5q9J10j89K13l26K29J60K8
$$ 87 465 -11 280 -270 -91 78 129 214 -132 169 279 95 138 123 34 144 -45 168 -158 71 231 259
3299B59P4m46J72nP2K10k62j09O7O2k45K3J38K13k27n9J45K0j38M4j04k9k0J20
$$ 259 333 -113 59 54 126 336 74 -35 32 94 -151 -128 10 223 -4 -63 82 102 -36 8 -96 -125 -145 -25
3323b5K04k75P1K0J21q8q0O2R9POj72pj60J6K16o2J05m5l78K25K70k74J08O6k8
$$ -25 179 -96 -25 -5 116 28 -52 10 109 116 122 -50 -57 -217 -201 15 -47 58 13 -365 -140 130 -144 -36 30 2
3349BL3o7j92RJ92m4K71j31j66o0o6N88l86j00j94J85N4j5q5P3L21k83M6J26J23
$$ 2 35 -32 -224 -215 -23 -67 204 73 -93 -153 -219 369 -17 -117 -311 -126 -72 -87 -172 -99 222 -61 -15 111 234
3374B34l45J58l0j5M32n83J1N6K21j83j12K52p9L8R1k1j26k01J05r5J13k29M04
$$ 234 -111 47 17 2 434 -149 -138 -82 139 -44 -156 96 17 55 146 125 -1 -202 -97 -192 -79 -308 96
3397I6J21j53L3O6j74K31q5J33m64J00J17J76k00J01k29K5M2lL00m2K32m60J62
$$ 96 217 64 97 163 -11 220 135 268 -196 -96 21 197 -3 98 -131 -106 -64 -67 233 191 423 -37 125
3420A25J17j95p5J07j63K29j71J74j76lo6m2K10J18k00K14Q6j55j97K50q6m9N1
$$ 125 242 47 -28 79 -84 145 -26 148 -28 -31 -97 -139 71 189 -11 203 289 134 -63 187 101 52 103
3443A03k64q3L06J0j34o1J29JK38r0j34k43K07j24K31J4k83J80Lk0L3n6J04j25
$$ 103 -161 -244 62 72 -62 -123 6 7 245 155 21 -222 -15 -139 92 106 -177 3 6 -14 19 -37 67 -58
3467e8j2L51j22N7l06J01k94O90m10j03L16r0l61k8J65J16n1O3r1k3l2L7J05l4
$$ -58 -70 281 159 216 -90 11 -283 407 -3 -106 210 120 -241 -269 -104 12 -39 24 -67 -90 -122 -85 20 -14
3491a4q7J43k01j07N06p36M33J03l6j96J75k45K19k49L51k54j85N17k10J1K09
$$ -14 -101 42 -159 -266 240 -496 -63 40 4 -192 -17 -262 -43 -292 59 -195 -380 137 -73 -62 147
3512A47j65p5J98N5k99J02n8L48j47n3q7O1OR6l13M51l07o7m2L27K45m43L65m65
$$ 147 -18 -93 105 160 -139 -37 -95 253 106 53 -34 27 33 129 -184 267 -40 -107 -149 178 423 -20 345 -120
3536a20K82J1j53R8k03K54j03j23K77k75K79O5l04J37k11K05j20j39J26L4J43
$$ -120 162 173 20 118 -85 169 66 -57 220 -55 224 289 -15 122 -89 116 -4 -143 -17 17 160
3557A60k31O6K70K30l49j4J45l89J71Q4J80k10j56K34k70l4j21L50m5rj28N6J46
$$ 160 -71 -5 265 495 146 132 277 -112 59 143 323 113 -43 191 -79 -113 -234 116 71 62 -66 -10 136
3580A36l58K70L7l14M47k16o5J69k89K2L64m0l03k1J73K21l36N1j27K30j8K2j17
$$ 136 -222 48 85 -229 218 2 -63 106 -183 -161 203 163 -140 -161 12 233 -103 -52 -179 51 33 55 -62
3603f2K75m42J43r4J78j9j38K24j23n1J22K34l06j05J14K47k81p5J22N8j51k33
$$ -62 213 -229 -86 -180 -2 -21 -159 65 -58 -109 13 247 -59 -164 -50 197 -84 -159 -37 21 -130 -363
3625c63L85o6o5n0J9N2K11k54J5L03m38j48L9K34N3J97M0j21K7j74j69L93M7k42
$$ -363 22 -44 -109 -159 -140 -88 123 -131 -116 187 -251 -399 -360 -126 -73 124 164 43 70 -104 -273 120 167 -75
3649g5J36k12J80J91j41j48R9j23J40j35j5R2k9J23J38j79P5L5j78j54N0L25j63
$$ -75 61 -151 29 220 79 -69 30 -93 47 -88 -103 -11 -40 83 221 42 117 152 -26 -180 -130 195 32
3672C2j15K12O7kj63j89L96j50k02k2J97k5L14k17R2k02o2L41l32Q9J45J3k01
$$ 32 -83 129 196 194 31 -158 238 88 -114 -136 61 36 350 133 225 23 -39 302 -30 59 204 217 16
3695A6j18K46k38o1L80j9n8k1j44Q7M0j12K00n3j90r9K54j93M4J77J28k21Q2j5
$$ 16 -102 144 -94 -155 225 206 148 127 -17 70 110 -2 198 145 -45 -144 110 -83 -39 138 266 45 127 112
3719A12j63L97o6m43J77k7%j11K42j44J12k4j39J21P2j75J09l52L05J18o8P1j14
$$ 112 -51 346 280 -163 14 -13 -13 -124 118 -26 86 62 -77 44 116 -59 50 -302 3 121 53 124 10
3742A0p1LJ79j59J66j90K78k66R3J5r2l7j70K66l9R4k71J86k01k1L16j9M8m4k6
$$ 10 -61 -58 121 -38 128 -62 216 -50 43 58 -34 -71 -241 25 -14 80 -191 -5 -206 -227 89 70 118 74 48
3767D8j59K6j5K7j03K18k09n4R8K2J55oKp5J94l51p0M57r3J01k87K21j56K16l50
$$ 48 -111 -85 -100 -73 -176 42 -167 -221 -123 -101 54 48 50 -25 169 -182 -252 205 112 213 -74 147 -9 207 -143
3792a43K78N5J85m14K45j70j76K81k38J03J02J7k36N6J40n3J71l1k48M34n41K36
$$ -143 135 190 375 -39 206 36 -140 141 -97 6 108 125 -111 -55 85 32 203 172 -76 358 -183 53
3814E3k74L12j17K7L01j59k74M66m04L33J20m73L4J32p2l3L69o35J31o6M20J42
$$ 53 -221 91 -26 1 302 143 -131 335 -69 264 384 -89 -55 77 5 -28 341 -294 -163 -229 191 333
3836C33k62k8o5K4J24J55j99r5J8oj53J34L7j77K3K60k55J42r7M7O2k48N16j88
$$ 333 71 43 -22 2 126 281 82 -13 5 -1 -154 -20 17 -160 -137 123 -132 10 -87 -40 22 -226 290 102
3860A02oj13j0Q5j29Q2J39q0J5j18J4p6q8K3M31m03J16j59J12j18j29K00J54J67
$$ 102 96 -17 -27 58 -71 11 150 70 85 -33 -19 -95 -183 -160 271 -132 -16 -175 -63 -181 -310 -110 44 211
3884B11m24J07K83j86p9L91j85k90K06j93J92r0J30j74j01M11l41J61L5M5k26
$$ 211 -213 -106 177 -9 -88 303 118 -172 34 -159 33 -57 73 -101 -202 209 -132 29 64 109 -117
3905a17N3j71J82Q9m2L29k20q9j23L87j68l7k2j15K32r6o3l74L37j18J90J34J23
$$ -117 -64 -235 -53 36 -6 323 103 14 -109 278 110 73 51 -64 168 72 9 -365 -28 -146 44 178 301
3928C01l22j10J56L94n41J07J34n03N10j25J0N1o3JO4o9L79j11j05mj07K17j89
$$ 301 -21 -131 25 419 -122 -15 119 -384 126 1 11 62 -1 0 64 -5 374 263 158 154 47 264 75
3951G5o6Q2o2J24k65J50r3k57J79K43k39J6N00l04j4M8J86j19k35l4J60l87L75
$$ 75 9 91 29 153 -112 38 -55 -312 -133 110 -129 -113 387 83 69 117 303 184 -51 -85 75 -312 63
3974F3j49K77m18L11m10K44o1p8J17K51m12J57L74o50N98l16p9Q3J10r8j02L56
$$ 63 -86 191 -227 84 -326 -82 -143 -221 -104 147 -265 -108 266 -384 214 -102 -181 -98 12 -86 -188 168
3996A68k60O6j28J59j81P0l60M81M2l29J35%p1k8J83L52l68l4r5j67L47L01m74
$$ 168 -92 -26 -154 5 -176 -106 -466 15 57 -272 -137 -137 -208 -236 -53 299 -69 -103 -198 -365 -18 283 -191
4019a91K36O6l37K42k57K55L7o8J73kk74J14K49j71j87j65J31L11o34P10k49q6
$$ -191 45 111 -226 16 -241 14 51 -17 156 154 -120 -6 243 72 -115 -280 -149 162 -472 238 -11 -97
4041i7K24l49N48l14K70l01N2P5j80J10J08j21k09J99j0P1K1l26N62o68M42k21
$$ -97 127 -222 326 12 282 -19 33 108 -72 38 146 25 -184 15 5 76 97 -229 333 -335 107 -114
4063a14J90m3j48K56j90R2M6%l35L15j84o0L27p9O3k14P9q0j9L25k17l8j06K27
$$ -114 76 33 -115 141 -49 43 89 89 -246 69 -115 -175 152 73 136 -78 1 -79 -98 227 10 -28 -134 93
4087I3j89q7L11j61m1K57k91K6J45J5p9K81n09K94K50n28M24j83j77L79m00K30
$$ 93 -96 -183 128 -33 -74 183 -108 -82 63 78 -1 280 -229 65 315 -213 211 28 -149 230 -170 60
4109F0j0O3k54o0K98J04K3l20J56j34j29J20N3q3J23J09l9k81L80k65j83L49J28
$$ 60 50 113 -141 -201 97 201 224 -96 60 -74 -203 -83 -30 -113 10 119 80 -201 179 -86 -269 80 208
4132B08n89N48j27j85J35k39K61k2k96K49j86J69J54k68J38N1L17l59r5J22N3
$$ 208 -381 167 40 -145 -10 -249 12 -10 -306 -57 -243 -74 80 -188 -50 1 318 -41 -136 -14 39
4153C9l31J15K48L4K3pm29J91j75K79j57k17L04p3K31j01j58l5K61j27k0K94p9
$$ 39 -292 -177 71 105 128 121 -308 -117 -292 -13 -170 -387 -83 -156 75 -26 -184 -219 42 -85 -105 189 110
4176A10j44J65j82L03k10l34M42j60P3k99L03J29j7J58m37K98rn16K97K48J13
$$ 110 -34 131 -51 252 42 -292 150 -10 63 -236 67 196 179 337 -100 198 189 -327 -30 218 331
4197C31m71K75j27L95l49j49K3j71K40L3j3lM4j20J66k62J34m1P7m2O3j6J06n5
$$ 331 -140 135 8 403 54 -95 -72 -243 -3 30 17 14 58 -62 104 -158 -24 -65 12 -30 33 17 123 68
4221F8l06L77k40K68J09n01J73o1J52P4k61j11L78k29L50k48j06J93L00m54k92
$$ 68 -238 139 -101 167 276 -225 -52 -113 39 113 -148 -259 119 -110 240 -8 -114 79 379 -75 -367
4242c67M09J9l45j38N22Q0l74L39r3j29J23l06Q9K29r4l39N45n06J59M2j29J4
$$ -367 42 61 -284 -422 100 180 -194 145 52 -77 46 -260 -171 58 -36 -375 170 -336 -177 -135 -264 -250
4264b50K66p2m2J74r8j30J95L5q7J34j00k9L9k22J19P1k5k06J59L8l8m9J22OM
$$ -250 16 -56 -98 76 -22 -152 43 78 -9 125 25 -4 35 -187 -68 3 -22 -228 -69 -31 -69 -118 4 10 14
4289A4K59n23K07R3j27j7J86j36j64K28l2J60J93l68j18K54p9j38K65m60N33j95
$$ 14 273 -250 -43 50 -77 -94 92 -44 -208 20 -12 148 341 -27 -145 109 30 -108 157 -303 230 35
4311C5J40k54M0R2k8n4J19j59J19j33L7J33j55J77k36K50K06l15o8L8p3Q8J16
$$ 35 175 -79 -39 53 25 -29 90 -69 50 -83 -46 87 -68 109 -127 123 329 14 -54 -16 -89 -1 115
4334A15j08Q8j43J30k40J20J34O4j27j46Q0K98l00J34N5j87Q9k6j32J4o9jJ24
$$ 115 7 95 -48 82 -158 -38 96 160 33 -113 -33 265 -35 99 154 -33 56 30 -102 -88 -157 -158 -34
4357c4L01l31pJ53M4k25r8K07O7MM48k99l42j4P8K7J68k09K44j59q6jk6m8J77
$$ -34 267 -64 -71 82 126 -99 -197 10 77 81 529 230 -112 -126 -48 -21 147 -62 182 23 -63 -64 -90 -138 39
4382C9k27J57j01l32O95j18l05L51q1k0l4l4M0j18J54j70J17m4J4j70N43l32j96
$$ 39 -188 -31 -132 -464 231 113 -192 159 78 58 24 -10 30 -88 66 -104 13 -31 -17 -187 356 24 -172
4405a72K17k00R1j7J11j13M4K78j21j66n0J74N1N7q7j39J96l89O3K18m0K61j68
$$ -172 45 -155 -64 -81 30 -83 -39 239 118 -48 -98 76 127 184 97 -42 154 -235 -172 46 6 267 99
4428I9n3jpm1K49m35K80k34J88J33k35J95m15L93k42K24l20L93j87k9J50p8j50
$$ 99 46 45 38 -3 246 -189 91 -143 45 178 -57 138 -277 116 -126 98 -222 171 -16 -45 105 27 -123
4451a23K21J9k62K10K37m82k4L08l41J68j9J57O5n2l78K20o7K46R1r5k31Q4K22
$$ -123 98 117 -145 65 302 -180 -204 104 -237 -69 -88 69 134 82 -296 -76 -143 103 194 99 -132 -48 174
4474A74k89L17j90k04L23J10m20K80l61N7J77J75k51k4J48M2j67J57j81J20j18
$$ 174 -115 202 12 -192 131 241 -179 101 -260 -203 -26 149 -102 -126 22 64 -103 54 -127 -7 -125
4495a25j52M65j66j68J36Jk7O6j68K73m7l2k54K03k14o3M23P7m97M64l60R1j3
$$ -125 -277 188 22 -146 -10 -9 -36 30 -138 135 88 56 -198 5 -209 -272 151 228 -269 195 -165 -74 -87
4518h7j41Q7R7k36M97k99J69k05Pk45J17L08L0k05R7J50k65k0O9L56l26N0k36
$$ -87 -228 -141 -44 -280 217 -82 87 -118 -111 -356 -239 69 99 -106 -9 141 -124 -144 -75 281 -45 5 -231
4541b31L84j27k27k9J50J98j81k42L79j65n2L61J54n52q0L94l18L89k36J65l92
$$ -231 153 26 -201 -230 -80 118 -63 -305 74 -91 -143 218 372 -180 -260 134 -184 205 -31 134 -258
4562b58L75R0q8J45k57j62J08O9o6K44k30l9J7J40J23K1jm67K56j85J24K3q5Q8
$$ -258 117 207 119 264 7 -155 -47 22 -44 200 -30 -69 -52 88 211 232 231 -236 20 -165 -41 -18 -103 -15
4586a5J17K09m14N9J1J65k61J93k66K55j4l20L10k49L16J30m20M34j06l1j55J59
$$ -15 102 311 -103 -44 -33 132 -129 64 -202 53 39 -281 29 -220 96 226 -194 240 134 103 -52 107
4608A07j80J45K08l30Mj08K94k70L2N9k2j83K41j1j2j35K87k95Q1j02M64j59p
$$ 107 -73 72 280 -50 -46 -154 140 -130 -98 -39 -61 -244 -3 -14 -26 -161 126 -169 -88 -190 274 115 108
4631A08j15q3L8Kj41K67j02l2M14m89J06k8J66l75pM83r4j96o2O9P3m7Kj36L9
$$ 108 -7 -90 -52 -50 -191 76 -26 -58 356 -133 -27 -55 111 -264 -271 212 118 -78 -140 -71 2 -45 -43 -179 -140
4656a40O2m2M6j10p6L38k25J11j69L05j99J47j71K39j88j43L30J8l32K34K45p5
$$ -140 -78 -120 -74 -184 -260 78 -147 -36 -205 100 -99 48 -123 116 -72 -215 115 133 -199 35 280 205
4678B05k06p3k12K04j50K82n3j0mj62M11k59J11l30K32rJ63K04k17J12j55j15
$$ 205 -1 -74 -286 -82 -232 50 -3 -13 -17 -179 232 -27 84 -246 -14 -23 140 344 127 239 84 -31
4700c1q9M5K10l80M59j09P8J16j84j44no0M2K52j81K10j51k84J55N4n9k16N85
$$ -31 -120 -75 135 -245 214 105 183 299 115 -29 -34 -94 -52 200 19 229 78 -206 -51 3 -56 -272 313
4723C13k96q6J79L9j51K55m99M74k98o7K20k9J36o5k32K02m9K51o0n6j89O1J9
$$ 313 17 -69 110 149 -2 253 -246 228 -70 -137 83 54 190 125 -107 95 46 297 237 181 -8 53 72
4746G2m41M98o4k8J18l72J70j22K10Jn7L00l75J33J2k20N2K88k78K2l01R0J55
$$ 72 -369 129 65 37 155 -217 -47 -169 41 42 -15 285 -90 43 55 -165 -113 175 -103 -81 -382 -292 -137
4769a37J34N3j90J08K51k07j45Qj62L02j28R1n6q1L6J79K0k46N3L27l69O0J04
$$ -137 -3 50 -140 -32 219 12 -133 -125 -287 15 -113 -22 -78 -159 -123 56 76 -170 -117 210 -159 -99 5
4792Ek6N8J10L4j29j57J9N8j88K73j64J35q3N8q2J54J29o5m05K10L6j16J56m2
$$ 5 -21 37 147 181 52 -105 -86 -28 -216 57 -107 28 -55 3 -79 75 204 139 -266 -56 -20 -136 20 -22
4816b2Lj51pJ61Pj29L9Q9R6k8n3l33M34m31K44K09k22O3J89j47j34N21l52j25
$$ -22 -19 -170 -177 -16 -9 -138 -99 -10 86 58 5 -328 106 -325 -81 128 -94 -31 158 11 -123 398 46 -79
4840g9J6J59K72l47j00J67k77O56m41j71J87qN18m47rO7j86J63j62j84K28L2p
$$ -79 -63 96 368 21 -79 88 -189 467 26 -145 42 34 552 105 96 163 -23 140 -22 -206 22 54 47
4863D7o3K10l84L42j66P4p2l9J18j01j6m3l5p9L35l17J15L6j5K06n4p9l4p6Nj4
$$ 47 -16 194 -190 152 -14 60 -12 -51 67 -34 -50 -93 -128 -207 128 -189 -74 -38 -53 153 99 20 -14 -90 -85 -99
4889i9j31J31m2K35o2k24K21N4j47M0J10k75O9j63O4K51K6L8o7j43K03j95K8L9
$$ -99 -230 -99 -141 94 32 -192 29 83 -64 -24 86 -189 -120 -283 -219 32 58 96 29 -114 89 -106 -78 -39
4913c9r0L63l28J93n2kk36K43j26J97M9m1J05m8q0q2J44l50M30l98K67J47j23
$$ -39 -129 234 -94 99 47 45 -191 52 -74 123 172 131 236 188 108 26 170 -180 250 -148 119 266 143
4936A43l41J81j37R9J61K41l91J44k10j54K13J68j34r1j49J3K03J00pk6J25j75
$$ 143 -198 -17 -154 -55 106 347 -44 100 -110 -264 -51 117 -17 -108 -257 -244 -41 59 52 26 151 -24
4958b4Q5N6o3p1M03l79o6nK01j91K18j84Q1j07k29L23k19K43l43J59R9J31k58
$$ -24 61 117 54 -17 386 7 -59 -64 137 -54 164 -20 61 -46 -275 48 -171 72 -271 -112 -13 118 -140
4981a40J39L6P2L2k38J44k36K67j35J04J94j07rj5R1l01Q6R0R7l47J74R2k12J05
$$ -140 -1 35 107 139 -99 45 -191 76 -59 45 239 132 123 108 199 -102 -16 74 171 -176 -2 90 -122 -17
5005a7l3K8N5L6k25J27J87j19m7m7K54k10P1j68r7K04R9l4m07K40Q6o1J90p9p4
$$ -17 -50 -22 33 69 -156 -29 158 39 -8 -55 199 -11 60 -108 -205 -1 98 64 -343 -103 -17 -78 112 33 -41
5030d1J24j68r3O6J44r3k12N06k47n6K90o10J32L59j79J23J07l82L27n4j82M32
$$ -41 83 -85 -178 -112 32 -61 -273 233 -14 -70 220 -390 -258 101 -78 45 152 -230 97 43 -139 293
5052B93k61J43l26K28j04k58K87j76K54j15j14J71l83N13k10p2k00O12j80j74
$$ 293 32 175 -151 77 -27 -285 2 -174 80 -35 -149 22 -361 152 -58 -130 -330 282 102 -72
5072g2P2j65K65m7J57n03K60P0L4p1J89l90M1Q9k1j63K77J0r1n2L5l7K24r4L7
$$ -72 0 -165 100 53 210 -293 -33 37 71 0 189 -201 -160 -71 -92 -255 22 32 -59 -111 -76 -113 111 17 54
5097E4K16k58L7N7Q7m75M66k24KJ17j41n5Q3J19k40J70R3Ok63J05jRj05L49l09
$$ 54 270 12 49 106 193 -282 184 -40 -38 79 -62 -117 -34 85 -155 15 108 114 -149 -44 -45 -36 -141 208 -101
5122a01O6l9j03l10Q46j96m33K97n3K26l15K61j14r7K67k04R4J29n22L53m37L51
$$ -101 -35 -74 -177 -487 359 163 -270 27 -26 200 -115 146 32 -65 202 -2 92 221 -301 52 -385 -34
5144c4J23K98l07k48L70j12k08K87k40j73J39M5J65j6l39J54M5j15r9J04J10q8
$$ -34 89 387 80 -168 202 90 -118 169 -71 -244 -105 -60 105 89 -250 -96 -51 -166 -265 -161 -51 -139
5166a39N0J14j75N0J1j07M5K21p6O3R1k51K61k50K77k91Q6o2k9J89k64J14n6L15
$$ -139 -89 25 -150 -100 -89 -196 -151 70 -6 57 148 -103 158 -92 185 -106 -20 -82 -111 78 -186 -72 -128 187
5190A87l42L74q8j7o9j21K15j49J12k20o0L4R3J12k45K79k29j00L71q8l5O5j12
$$ 187 -155 219 131 114 45 -76 139 -10 102 -118 -178 -144 -51 61 -184 95 -134 -234 137 49 14 79 -33
5213c3L50l03l79N87j58l91M63j65J44l09R9K50j56p2J76j23j63J47J63p3p1j54
$$ -33 317 14 -365 222 64 -327 136 -29 115 -194 -95 155 -1 -73 103 -20 -183 -36 127 54 -17 -171
5235a71K79J25n04M43l74K58j63j48N34l66K28L4j15Mk37M6mJ33j17K37rk51O5
$$ -171 108 233 -271 172 -202 56 -107 -255 279 -87 141 175 60 64 -173 -127 -131 2 -115 122 113 -138 -73
5258g3nL09k42k98J1M77k22n6K82j70k20K59l86J38K65J37q7p9j3R6k9k44K91
$$ -73 -78 231 -11 -309 -298 179 -43 -99 183 13 -207 52 -334 -196 69 206 119 40 27 123 94 -150 141
5281A41j86K33l07J47l8p2L63l87J61l30M31k31K35r2P0l54p6K75R9L8l56L09
$$ 141 -45 188 -119 28 -10 -82 281 -106 55 -275 156 -75 160 68 138 -216 -292 -17 82 120 -236 73
5303G3j01j08J06m24K06L32r6j73J36M0J35k51j93J05P3J2r2J25K52j01Q7j12
$$ 73 -28 -136 -30 -454 -248 84 -12 -185 -49 -9 126 -125 -318 -213 -140 -128 -220 -95 157 56 143 31
5325C1j29k6K61p5k73K89j71lO1M9J5J1k49L64p6j27L50l74L9J24k4KL8J8j96
$$ 31 -98 -124 137 62 -211 78 -93 -96 -35 14 29 40 -209 155 79 -48 302 -72 -33 91 67 69 107 125 -71
5350g1lL50k71K00l17M74m84J42j88L0K96l55P6j80N75m11L0J43N9j74J61N3l03
$$ -71 -74 276 5 205 -112 362 -122 20 -168 -138 158 -197 -121 -301 274 -137 -107 36 95 -79 82 135 -168
5373a68K11n1p8R7J49k87J48j04J57J69k56L13l75K07M0l77J66K8J88j73j89K55
$$ -168 43 -8 -86 11 160 -127 21 -83 74 243 -13 300 -75 132 172 -205 -39 -11 177 4 -185 70
5395G0q1K03L7k0l90L32q2Mq4l5Q4K7l4o3%K98o1rJ2k12k32K95j11P1M8k4P0J97
$$ 70 -11 192 229 209 -181 151 69 73 -11 -46 38 65 31 -32 -32 266 205 196 208 -4 -236 59 -52 19 67 43 113 310
5423C10l27M4L7k20K50p7J0R6J84k55J94o36M07k0k97J34K21J08o6k1K06k31J10
$$ 310 -17 27 64 -156 94 17 27 123 307 52 246 -390 17 -3 -300 -166 55 163 97 76 282 51 161
5446A61l85L48l71L64j72K9L4k47J48j52M87m80K61k4o4p2K5j8J57nP6k92N04
$$ 161 -224 124 -247 117 -55 -26 8 -239 -91 -243 244 -236 25 1 -63 -135 -110 -128 29 24 100 -192 312
5469C12j86l76K72L7mn8K5K48j87O6r0NR4K8m66J23L4J8lK29j0j34oQj65J80j6
$$ 312 126 -250 22 59 55 -3 22 270 83 149 59 64 158 186 -280 -157 -123 -105 -108 121 111 -23 -29 -21 -186 -6 -22
5496b2K53m30R8o5K71l18L42K0j13K30j98L41m31r1J35q9L0J09q3j35j9M1J28
$$ -22 231 -199 -101 -166 105 -213 129 149 36 266 68 409 -22 -113 22 -67 -37 72 -11 -146 -165 -124 4
5519Dlj26J41K32n9k44J53j12L23j79j64k59N6L14q7k06K33o8N7Q3k89K94j40
$$ 4 1 -125 16 248 189 -55 98 -14 309 130 -34 -293 -237 77 -10 -216 17 -51 6 89 -200 94 -46
5542d6J94k19R5j75K96j02p0K22j40j24p1K03j43j7L74o62M02Oj06l6K05M1m3
$$ -46 148 -71 24 -151 145 43 -27 195 55 -69 -140 63 -80 -97 277 -385 17 23 -83 -119 86 127 84
5565H4p7j54K07p3k97k9L04K02m82L85m92L55K69k87M6k6K23L8m07K82m0K44k40
$$ 84 7 -147 60 -13 -310 -339 -35 167 -315 70 -422 -67 202 -85 -39 -65 158 196 -211 71 31 275 35
5588C5K6K32l33O2p3j93J51P6No4J5Q1Nj92N16l70qqq9J06j55M7j17J13J41L50
$$ 35 61 293 -40 22 -51 -244 -93 -17 -12 -76 -61 20 25 -167 349 -21 -29 -37 -126 -20 -175 -128 -245 -132 9 359
5614C59j82J43l72K64l24J23q3J23L2p4J69l18L40l11L30j47l41L59j80J07m0
$$ 359 177 320 -52 212 -112 11 -72 51 83 9 178 -140 200 -111 219 72 -269 90 -90 17 -23
5635b3L30k52P1K12n34P9R7k11J58o3K00j47q7M03L0l26K22P9m51K15M4J30l47
$$ -23 307 55 126 338 -196 -117 -20 -231 -73 -136 64 -83 -170 233 263 -63 159 238 -213 2 46 176 -171
5658a71L81m16K63j59K72k58K53M6m43L93j25o6N7M0k32K6K61j35Q6m2n7L7J6
$$ -171 210 -206 57 -102 170 -88 165 211 -232 161 36 -30 27 67 -165 -139 122 -13 73 31 -26 11 27
5681B7l09L27K57j81j86J8l2R2l8J1M4Qj13J94J94m04j9J73k32j49M26k69J00
$$ 27 -282 45 302 121 -65 -47 -79 13 -25 -14 30 38 -75 119 313 -91 -110 63 -169 -318 108 -161 -61
5704f1j55j04K66J01j25N4k27J94J27Q1J4j27j56o1J28J04pj70K0J08L53l58n6
$$ -61 -216 -320 -54 47 -78 -24 -251 -57 70 151 165 38 -118 -179 -51 53 46 -124 -104 4 357 -1 -57
5727e7k53L35j39K39l33M63n09M25pK05k03m5k05K9RO1P2l00L12j97m0j25K31
$$ -57 -310 25 -114 125 -208 255 -254 171 164 369 166 121 -84 -55 -46 15 87 -213 99 -98 -138 -263 -32
5750c2m9J20N5j25R3p0l75N70j02j38K04j8J1K7o6j53j61J01J84PJ8j10K6j88
$$ -32 -81 39 94 -31 62 -8 -383 187 85 -53 151 133 144 171 105 -48 -209 -108 76 83 101 -9 17 -171
5774a71J79J57l45L53j29o3n8K20k88Q5K96ql24P8k81p4N68m22L36Ql8l41L03
$$ -171 8 165 -180 173 44 -19 -77 143 -145 -60 236 228 -96 -18 -299 -373 195 -227 109 117 79 -262 41
5797D1j34L31k33q2L13j29k20j50R7p7L10o7k57J98l6M5K73m50K98j88Q8Q5j15
$$ 41 -93 238 5 -77 236 107 -113 -263 -166 -243 67 0 -257 -59 -95 -50 223 -227 71 -117 -29 56 -59
$$ [...]
8191c11
##END NTUPLES=NMR FID
##END=
