##TITLE=1H_Costus(fel24)-ACN-A
 CDCl3
 8 sc, 
 6.3.2024
##JCAMPDX= 6.0         $$ Bruker NMR JCAMP-DX V2.0
##DATA TYPE= NMR FID
##DATA CLASS= NTUPLES
##ORIGIN= UXNMR, Bruker Analytische Messtechnik GmbH
##OWNER= root
$$ XWIN-NMR		Version 3.5
$$ Wed Mar  6 17:29:06 2024 Russian Standard Time (UT+4h)  she@DPX200
##.OBSERVE FREQUENCY= 200.1313
##.OBSERVE NUCLEUS= ^1H
##.DELAY= (6, 6)
##.ACQUISITION MODE= SIMULTANEOUS
##.ACQUISITION SCHEME= undefined
##.AVERAGES= 8
##.DIGITISER RES= 18
##SPECTROMETER/DATA SYSTEM= spect
##.PULSE SEQUENCE= zg30
##.SOLVENT NAME= CDCl3
##.SHIFT REFERENCE= (INTERNAL, CDCl3, 0, 15.7039)
##AUDIT TRAIL= $$ (NUMBER, WHEN, WHO, WHERE, WHAT)
$$ ##TITLE= Audit trail, XWIN-NMR		Version 3.5
$$ ##JCAMPDX= 5.01
$$ ##ORIGIN= Bruker BioSpin GmbH
$$ ##OWNER= she
$$ F:/spectra/data/she/nmr/H-F/1/audita.txt
$$ ##AUDIT TRAIL=  $$ (NUMBER, WHEN, WHO, WHERE, WHAT)
(   1,<2024-03-06 17:27:51.39 +0400>,<she>,<DPX200>,
      <created by zg, POWCHK disabled, PULCHK disabled
       configuration hash MD5:
       00 E9 B6 7A A2 85 ED C7 34 08 36 98 17 FE 4E 26
       data hash MD5: 16K
       A4 76 35 E8 42 6E 20 3A 34 03 E5 3E 1E 06 50 80>)
$$ ##END=
$$ 
$$ hash MD5
$$ 14 F0 D1 BE D2 D0 21 51 49 71 9B C4 04 54 93 88
##$RELAX= 
##$RELAX= 
##$RELAX= 
##$RELAX= 
##$RELAX= 
##$RELAX= 
$$ Bruker specific parameters
$$ --------------------------
##$DU= <F:/spectra>
##$EXPNO= 1
##$NAME= <H-F>
##$PROCNO= 1
##$TYPE= <nmr>
##$USER= <she>
##$AMP= (0..31)
100 100 100 100 100 100 100 100 100 100 100 100 100 100 100 100 100 100 
100 100 100 100 100 100 100 100 100 100 100 100 100 100 
##$AQSEQ= 0
##$AQ_mod= 1
##$AUNM= <au_zg>
##$AUTOPOS= <>
##$BF1= 200.13
##$BF2= 200.13
##$BF3= 200.13
##$BF4= 200.13
##$BF5= 200.13
##$BF6= 200.13
##$BF7= 200.13
##$BF8= 200.13
##$BYTORDA= 1
##$CFDGTYP= 0
##$CFRGTYP= 5
##$CHEMSTR= <none>
##$CNST= (0..31)
1 1 145 1 1 1 1 1 1 1 1 1 1 1 1 1 1 1 1 1 1 1 1 1 1 1 1 1 1 1 1 1 
##$CPDPRG= <>
##$CPDPRG1= <>
##$CPDPRG2= <>
##$CPDPRG3= <>
##$CPDPRG4= <mlev>
##$CPDPRG5= <mlev>
##$CPDPRG6= <mlev>
##$CPDPRG7= <mlev>
##$CPDPRG8= <mlev>
##$CPDPRGB= <>
##$CPDPRGT= <>
##$D= (0..31)
0 1.2 0 0 0 0 0 0 0 0.06 0 0.03 0 0 0 0 0.0002 0 0 0 0 0 0 0 0 0 0 0 0 
0 0 0 
##$DATE= 1709731670
##$DBL= (0..7)
120 120 120 120 120 120 120 120 
##$DBP= (0..7)
150 150 150 150 150 150 150 150 
##$DBP07= 0
##$DBPNAM0= <>
##$DBPNAM1= <>
##$DBPNAM2= <>
##$DBPNAM3= <>
##$DBPNAM4= <>
##$DBPNAM5= <>
##$DBPNAM6= <>
##$DBPNAM7= <>
##$DBPOAL= (0..7)
0.5 0.5 0.5 0.5 0.5 0.5 0.5 0.5 
##$DBPOFFS= (0..7)
0 0 0 0 0 0 0 0 
##$DE= 6
##$DECBNUC= <off>
##$DECIM= 32
##$DECNUC= <off>
##$DECSTAT= 4
##$DIGMOD= 1
##$DIGTYP= 9
##$DL= (0..7)
0 120 120 120 120 120 120 120 
##$DP= (0..7)
150 150 150 150 150 150 150 150 
##$DP07= 0
##$DPNAME0= <>
##$DPNAME1= <>
##$DPNAME2= <>
##$DPNAME3= <>
##$DPNAME4= <>
##$DPNAME5= <>
##$DPNAME6= <>
##$DPNAME7= <>
##$DPOAL= (0..7)
0.5 0.5 0.5 0.5 0.5 0.5 0.5 0.5 
##$DPOFFS= (0..7)
0 0 0 0 0 0 0 0 
##$DQDMODE= 0
##$DR= 18
##$DS= 0
##$DSLIST= <SSSSSSSSSSSSSSS>
$$ [...]
##$SUBNAM2= <"">
##$SUBNAM3= <"">
##$SUBNAM4= <"">
##$SUBNAM5= <"">
##$SUBNAM6= <"">
##$SUBNAM7= <"">
##$SUBNAM8= <"">
##$SUBNAM9= <"">
##$SW= 18.0517328524113
##$SWIBOX= (0..15)
0 0 2 0 0 0 0 0 0 0 0 0 0 0 0 0 
##$SW_h= 3612.71676300578
##$TD= 16384
##$TD0= 1
##$TE= 0
##$TE2= 300
##$TE3= 300
##$TEG= 300
##$TL= (0..7)
0 120 120 120 120 120 120 120 
##$TP= (0..7)
150 150 150 150 150 150 150 150 
##$TP07= 0
##$TPNAME0= <>
##$TPNAME1= <>
##$TPNAME2= <>
##$TPNAME3= <>
##$TPNAME4= <>
##$TPNAME5= <>
##$TPNAME6= <>
##$TPNAME7= <>
##$TPOAL= (0..7)
0.5 0.5 0.5 0.5 0.5 0.5 0.5 0.5 
##$TPOFFS= (0..7)
0 0 0 0 0 0 0 0 
##$TUNHIN= 0
##$TUNHOUT= 0
##$TUNXOUT= 0
##$USERA1= <user>
##$USERA2= <user>
##$USERA3= <user>
##$USERA4= <user>
##$USERA5= <user>
##$V9= 5
##$VALIST= <valist>
##$VCLIST= <CCCCCCCCCCCCCCC>
##$VD= 0
##$VDLIST= <DDDDDDDDDDDDDDD>
##$VPLIST= <PPPPPPPPPPPPPPP>
##$VTLIST= <TTTTTTTTTTTTTTT>
##$WBST= 1024
##$WBSW= 4
##$XGAIN= (0..3)
0 0 0 0 
##$XL= 0
##$YL= 0
##$YMAX_a= 215470
##$YMIN_a= -306246
##$ZGOPTNS= <>
##$ZL1= 120
##$ZL2= 120
##$ZL3= 120
##$ZL4= 120
##$ABSF1= 10
##$ABSF2= 0
##$ABSG= 5
##$ABSL= 3
##$ALPHA= 0
##$AQORDER= 0
##$ASSFAC= 0
##$ASSFACI= 0
##$ASSFACX= 0
##$ASSWID= 0
##$AUNMP= <proc_1d>
##$AZFE= 0.1
##$AZFW= 0.1
##$BCFW= 1
##$BC_mod= 2
##$BYTORDP= 1
##$COROFFS= 0
##$CY= 11.3945322036743
##$DATMOD= 1
##$DC= 2
##$DFILT= <>
##$DTYPP= 0
##$F1P= 15.7292609196834
##$F2P= 12.9074282941183
##$FCOR= 0.5
##$FTSIZE= 0
##$FT_mod= 4
##$GAMMA= 1
##$GB= 0.15
##$INTBC= 1
##$INTSCL= 1
##$ISEN= 128
##$LB= 0.24
##$LEV0= 0
##$LPBIN= 0
##$MAXI= 10000
##$MC2= 0
##$MEAN= 0
##$ME_mod= 0
##$MI= 1.114404
##$NCOEF= 0
##$NC_proc= 0
##$NLEV= 6
##$NOISF1= 3.799351
##$NOISF2= 2.8
##$NSP= 1
##$NTH_PI= 0
##$NZP= 0
##$OFFSET= 15.70392
##$PC= 1
##$PHC0= -24946.83
##$PHC1= 17.18731
##$PH_mod= 1
##$PKNL= yes
##$PPARMOD= 0
##$PSCAL= 0
##$PSIGN= 0
##$REVERSE= no
##$SF= 200.130013532006
##$SI= 16384
##$SIGF1= 3
##$SIGF2= 2
##$SINO= 400
##$SIOLD= 16384
##$SREGLST= <1H.CDCl3>
##$SSB= 0
##$STSI= 0
##$STSR= 0
##$SW_p= 3612.71676300578
##$SYMM= 0
##$S_DEV= 0
##$TDeff= 0
##$TDoff= 0
##$TI= <>
##$TILT= no
##$TM1= 0
##$TM2= 0
##$TOPLEV= 0
##$USERP1= <user>
##$USERP2= <user>
##$USERP3= <user>
##$USERP4= <user>
##$USERP5= <user>
##$WDW= 1
##$XDIM= 8192
##$YMAX_p= 0
##$YMIN_p= 0
$$ End of Bruker specific parameters
$$ ---------------------------------
##NTUPLES= NMR FID
##VAR_NAME=  TIME,          FID/REAL,        FID/IMAG
##SYMBOL=    X,             R,               I
##VAR_TYPE=  INDEPENDENT,   DEPENDENT,       DEPENDENT
##VAR_FORM=  AFFN,          ASDF,            ASDF
##VAR_DIM=   8192,          8192,            8192
##UNITS=     SECONDS,       ARBITRARY UNITS, ARBITRARY UNITS
##FACTOR=    0.0002768,     1,               1
##FIRST=     0,             0,               0
##LAST=      2.2672688,     0,               0
##MIN=       0,             -306246,         0
##MAX=       2.2672688,     215470,          0
$$ Real data points
##PAGE= N=1
##DATA TABLE= (X++(R..R)), XYDATA
$$ [...]
$$ plain form
1878 180 782 690 343 308 635 857 993 794 642 97 -89 65 389 94 -261 -662 -621 -643 -237 69 -326
1899 -326 -514 -560 27 631 498 81 92 -239 -53 242 201 -336 -974 -558 -331 -213 -244 -701 -664 -998 -955 -260
1921 -260 435 -151 -477 -375 319 236 543 463 21 27 61 425 397 -104 267 208 -177 -72 219 -101 -468 -488 99
1944 99 88 677 420 -26 420 397 532 989 868 744 81 187 616 1068 736 96 -719 -219 -322 5 -195
1965 -195 -222 -305 -157 -296 221 553 286 -23 56 493 303 315 67 -227 -525 -442 -177 -329 -909 -1097 -1317 -414
1987 -414 -442 -191 -369 -628 -719 251 670 459 206 68 -396 -231 59 479 -149 -721 -518 -539 -573 -359 16
2008 16 -464 -638 -362 -53 534 526 721 495 585 1017 959 748 -81 234 643 596 438 98 -68 -358 51 477
2030 477 512 377 -89 -345 109 723 393 473 592 195 -534 167 666 427 433 -227 -353 -187 130 201 -364 -482
$$ packed form
1878A80O02r2l47l5L27K22J36j99j52n45j86J54L24k95l55m01M1k2M06L06l95
1899c26j88m6N87O04j33m17J1l31J86K95m1n37o38M16K27J18l1m57L7l34M3O95
1921b60O95n86l26J02O94q3L07q0m42OL4L64k8n01L71n9l85J05K91l20l67k0N87
1944I9j1N89k57m46M46k3J35M57j21j24o63J06M29M52l32o40q15N00j03L27k00
1965a95k7q3J48j39N17L32k67l09P9M37j90J2k48k94k98Q3K65j52n80j88k20R03
1987d14k8K51j78k59r1R70M19k11k53j38m64J65K90M20o28n72K03k1l4K14L75
2008A6m80j74K76L09N87qJ95k26R0M32n8k11q29L15M09m7j58l40j66k90M09M26
2030D77L5j35m66k56M54O14l30Q0J19l97p29P01M99k39Oo60j26J66L17P1n65j18
$$ plain form
2052 -482 -545 -509 -185 -713 -575 -959 -514 -281 -151 6 21 -623 -348 258 291 47 -143 -529 -696 -508 -221
2073 -221 -195 -489 -798 -1075 -991 -565 47 -188 -267 -30 359 532 561 775 755 366 192 455 435 -82 5 -438
2095 -438 -30 -38 -65 -362 -160 343 136 825 1177 1014 529 544 827 1000 1251 871 280 -157 -156 1 -167 -7
2117 -7 -368 -430 -456 -402 485 236 56 -260 426 150 176 165 30 -490 -295 -81 150 -174 -421 -1039 -636 -435
2139 -435 -662 -571 -361 -694 -983 -429 202 -168 -130 -374 -507 -399 -59 483 50 -339 -41 31 252 286 321 -156
2161 -156 -363 -269 117 122 -283 80 -39 24 -59 357 352 -44 -34 435 655 787 523 658 650 824 582 401 642
2184 642 -256 -577 -35 400 -38 -40 -73 -290 -245 287 505 393 159 458 281 477 933 804 343 -444 -462 -260
2206 -260 -389 -642 -889 -904 -937 -666 -309 -372 -233 -259 -4 286 745 368 51 -26 -176 -398 -192 -243 -560 -852
$$ packed form
2052d82o3L6L24n28J38l84M45K33J30J57J5o44K75O06L3k44j90l86j67J88K87
2073b21K6k94l09k77Q4M26O12k35p9K37L89J73K9K14k0l89j74K63k0n17Q7m43
2095d38M08qk7k97K02N03k07O89L52j63m85J5K83J73K51l80n91m37JJ57j68J60
2117gl61o2k6N4Q87k49j80l16O86k76K6j1j35n20J95K14K31l24k47o18M03K01
2139d35k27R1K10l33k89N54O31l70L8k44j33J08L40N42m33l89K98P2K21L4L5m77
2161a56k07R4L86Nm05L63j19O3q3M16nl96J0M69K20J32k64J35qJ74k42j81K41
2184F42q98l21N42M35m38kl3k17M5N32K18j12k34K99j77J96M56j29m61p87j8K02
2206b60j29k53k47j5l3K71L57o3J39k6K55K90M59l77l17p7j50k22K06n1l17k92
$$ plain form
2228 -852 -875 -961 -627 -372 -268 -587 -452 226 585 627 843 458 185 445 518 681 -23 174 -45 -249 51
2249 51 149 10 -349 -232 404 257 769 664 316 351 482 465 538 311 -67 34 -15 349 430 -22 -12 -15 -59 163
2273 163 440 355 -91 -204 31 -363 -403 -205 -178 -715 -458 230 86 30 -3 -184 -322 132 -5 390 -246 -211
2295 -211 -181 40 -160 -182 -621 -792 -600 -275 -339 -135 272 142 160 386 540 693 477 261 227 211 686 208
2317 208 -210 -705 -463 -184 -394 -213 -146 -530 92 226 572 596 664 640 688 569 647 740 506 167 -436 -285
2339 -285 -105 -63 -108 -568 -525 -514 102 30 32 416 239 337 574 629 487 199 -167 -61 180 -89 -810 -496 -697
2362 -697 -679 -435 -176 -296 -605 -381 62 6 413 241 169 -331 -157 113 -57 287 -183 -324 -268 -383 -365 182
2384 182 -42 -407 -197 -23 108 114 60 35 -104 174 513 275 11 -300 214 322 400 546 490 168 34 228
$$ packed form
2228h52k3q6L34K55J04l19J35O78L59M2K16l85k73K60P3J63p04J97k19k04L00
2249E1R8j39l59J17O36j47N12j05l48L5J31j7P3k27l78J01m9L64Q1m52J0lm4K22
2273A63K77q5m46j13K35l94m0J98K7n37K57O88j44n6l3j81j38M54j37L95o36L5
2295b11L0K21k00k2m39j71J92L25o4K04M07j30J8K26J54J53k16k16l4j6M75m78
2317B08m18m95K42K79k10J81O7l84O22J34L46K4O8k4M8j19P8R3k34l39o03J51
2339b85J80M2m5m60M3J1O16p2KL84j77R8K37N5j42k88l66J06K41k69p21L14k01
2362f97J8K44K59j20l09K24M43n6M07j72p2n00J74K70j70L44m70j41N6j15J8N47
2384A82k24l65K10J74J31On4k5j39K78L39k38k64l11N14J08P8J46n6l22j34J94
$$ plain form
2406 228 199 575 263 -239 -285 -442 -145 136 97 -232 -379 -121 282 264 329 300 390 -31 284 396 204 37
2428 37 -376 -88 -236 -555 -375 -790 -804 -491 -269 -19 20 -86 128 261 458 642 242 281 4 -128 -6
2449 -6 71 -230 -507 -581 -955 -454 -203 -261 -387 -144 -55 168 468 531 514 206 186 426 475 -65 -97 -255 -223 -378
2473 -378 -73 29 39 -163 -111 -211 334 561 334 145 -80 123 378 669 510 32 48 131 -57 5 18 -82
2495 -82 -405 -219 -230 -6 122 -190 -90 -21 -291 7 31 -274 -168 -167 32 103 107 -241 -72 25 -4 235 -71 -169
2519 -169 -203 -314 93 -173 -90 -426 -448 -420 31 224 -136 -158 -10 201 219 459 464 -78 -210 103 -21 -292 -118
2542 -118 -7 -343 -330 -49 -196 -268 -392 -257 -17 181 519 657 327 163 171 282 385 84 -179 -255 -287 -213
2564 -213 -343 -173 -264 -485 -459 -110 203 206 213 571 145 219 635 755 212 -39 -224 -49 -21 -58 -163 -373 -637
$$ packed form
2406B28k9L76l12n02m6j57K97K81l9l29j47K58M03j8O5k9R0m21L15J12j92j67
2428C7m13K88j48l19J80m15j4L13K22K50L9j06K14J33J97J84m00L9k77j32J22
2449fP7l01k77p4l74N01K51n8j26K43Q9K23L00O3j7l08k0K40M9n40l2j58L2j55
2473c78L05J02J0k02N2j00N45K27k27j89k25K03K55K91j59m78J6Q3j88O2J3j00
2495h2l23J86j1K24J28l12J00O9k70K98K4l05J06JJ99P1Ml48J69R7k9K39l06r8
2519a69l4j11M07k66Q3l36k2K8M51J93l60k2J48K11J8K40Nn42j32L13j24k71J74
2542a18J11l36J3K81j47p2j24J35K40J98L38J38l30j64QJ11J03l01k63p6l2P4
2564b13j30J70r1k21K6L49L13LPL58m26P4M16J20n43k51j85J75K8l7j05k10k64
$$ plain form
2587 -637 -627 -118 -103 -51 29 -60 -195 429 165 78 231 78 61 59 163 -74 -207 -228 -227 56 90 -184 -397 -244
2611 -244 -82 -72 122 210 -11 -180 119 345 290 -232 111 -91 -282 120 393 252 -31 18 -94 -89 469 222
2633 222 -539 -146 -389 -142 20 73 101 -161 -157 349 459 274 319 97 -23 329 452 -197 -55 -87 -293 -479
2655 -479 134 -55 -305 -769 -245 22 -110 99 584 577 -42 30 497 327 228 260 -78 -131 194 -247 -128 -212
2677 -212 -365 -448 -153 62 -79 -10 129 139 340 322 409 224 170 296 298 287 141 103 -488 -748 215 184 -413 -467
2701 -467 -160 -367 -183 316 33 -137 1 -60 114 313 304 177 -94 74 127 271 -92 -90 -195 -267 -94 203
2723 203 -134 -193 -170 -352 -22 226 288 114 157 94 163 298 446 109 37 -92 377 13 32 40 -75 -394 -78
2746 -78 -340 37 -66 -146 -219 84 372 340 152 446 372 -50 177 344 -23 89 -212 137 181 -393 -105 -375
$$ packed form
2587f37J0N09J5N2Q0q9j35O24k64q7J53j53j7kJ04k37j33k1JK83L4k74k13J53
2611b44J62J0J94Q8k21j69K99K26n5n22L43k02j91M02K73j41k83M9j12NN58k47
2633B22p61L93k43K47J62N3K8k62MN06J10j85M5k22j20L52J23o49J42l2k06j86
2655d79O13j89k50m64N24K67j32K09M85po19P2M67j70r9L2l38n3L25m41J19q4
2677b12j53q3K95K15j41O9J39J0K01j8Q7j85n4J26Kj1j46l8n91k60R63l1n97n4
2701d67L07k07J84M99k83j70J38o1J74J99rj27k71J68N3J44l63Kj05p2J73K97
2723B03l37n9K3j82L30K48O2j74M3o3O9J35J48l37p2j29M69l64J9Qj15l19L16
2746g8k62L77j03q0p3L03K88l2j88K94p4m22K27J67l67J12l01L49M4n74K88k70
$$ plain form
2768 -375 -516 -230 -181 -162 -252 -320 -4 -301 141 421 272 89 88 113 -46 64 -11 -175 -619 -628 -343 -313 -207 -222
2792 -222 -472 -495 -193 40 326 178 300 288 96 318 98 203 -47 -51 -202 -124 -46 -207 -390 -393 -29 -324 -6
2815 -6 267 150 -64 184 627 430 294 120 288 125 -26 149 246 111 -84 55 169 129 -19 -215 -116 -43
2837 -43 -218 50 299 -44 -142 144 14 -112 30 77 -269 78 95 203 114 -199 -257 -374 49 -91 19 -31
2859 -31 -220 -134 -262 -23 -31 38 -49 -85 -73 148 164 132 -154 -80 -110 66 7 -197 -160 -616 -205 210 -13 59 -143
2884 -143 -65 -20 178 619 124 197 156 184 453 322 240 -73 -46 -70 110 138 -38 -225 -364 -105 126 -21 273
2907 273 232 -35 216 130 332 34 336 40 73 0 386 343 17 -379 -130 29 -238 -151 -228 -264 -171 -125 7
2930 7 -43 59 -292 -193 -62 64 -92 175 -99 -284 26 14 -130 -371 -279 -692 -454 -226 -313 -270 -285 15 -131
$$ packed form
2768c75j41K86M9J9r0o8L16k97M42K80j49j83jK5j59J10p5j64m44rK85L0J06j5
2792b22k50k3L02K33K86j48J22j2j92K22k20J05k50mj51P8P8j61j83lL64k95L18
2815fK73j17k14K48M43j97j36j74J68j63j51J75R7j35j95J39J14m0j48j96R9P3
2837d3j75K68K49l43r8K86j30j26J42M7l46L47J7J08q9l13n8j17M23j40J10n0
2859c1j89Q6j28K39qO9q7l6J2K21J6l2k86P4l0J76n9k04L7m56M11M15k23P2k02
2884a43P8M5J98M41m95P3m1K8K69j31q2l13K7k4J80K8j76j87j39K59K31j47K94
2907B73m1k67K51q6K02k98L02k96L3p3L86m3l26l96K49J59k67Q7p7l6R3M6J32
2930Gn0J02l51R9J31J26j56K67k74j85L10j2j44k41R2m13K38K28q7M3j5L00j46
$$ plain form
2953 -131 95 -29 112 78 84 -98 273 -16 284 -117 -88 -80 38 -16 177 -283 -244 -39 220 185 -182 294 137
2976 137 303 60 524 458 252 185 70 295 331 209 -15 -55 -313 165 -61 -112 -326 103 -32 -57 387 103
2998 103 -167 -132 32 232 227 213 -120 16 -7 -67 -179 20 -244 -502 -352 -28 -183 -280 -32 -265 -239 116 298
3021 298 24 -36 -78 52 247 174 25 114 -215 -318 -32 -88 -73 -88 -394 -155 -171 -73 -15 -69 -147 -20 18 323
3045 323 235 185 351 305 68 388 73 64 -92 -232 93 147 -17 -23 -119 -42 183 522 48 42 161 101 92 491 608
3070 608 321 105 168 -164 -16 252 11 -449 -388 -23 -273 -22 -52 -281 -453 -304 -127 -40 -86 84 -114 79
3092 79 121 220 -83 -408 -194 -140 -379 -169 -126 -565 -217 -325 43 -182 60 113 91 116 240 147 5 400 -79
3115 -79 58 -6 448 271 -263 -138 -130 -37 183 235 -47 -193 25 -41 77 242 75 95 -105 60 413 60 469
$$ packed form
2953a31K26j24J41l4Oj82L71k89L00m01K9QJ18n4J93m60L9K05K59l5l67M76j57
2976A37J66k43M64o6k06o7j15K25L6j22k24m0k58M78k26n1k14M29j35k5M44k84
2998A03k70L5J64K00nj4l33J36k3o0j12J99k64k58J50L24j55r7K48k33K6L55J82
3021B98k74o0m2J30J95p3j49Q9l29j03K86n6J5j5l06K39j6R8N8n4p8J27L8L05
3045C23q8n0J66m6k37L20l15rj56j40L25N4j64or6P7K25L39m74oJ19o0rL99J17
3070F08k87k16O3l32J48K68k41m60O1L65k50K51l0k29j72J49J77Q7m6J70j98J93
3092G9M2R9l03l25K14N4k39K10M3m39L48j08L68k25K42N3k2K5J24r3j42L95m79
3115g9J37o4M54j77n34J25QR3K20N2k82j46K18o6J18J65j67K0k00J65L53l53M09
$$ plain form
3138 469 387 148 54 315 205 67 -79 -166 -240 107 122 -88 -180 -246 -380 -242 106 196 -56 -27 184 318 149
3161 149 87 255 22 -236 -210 -364 -175 -441 -286 -683 -313 51 -147 -163 52 -122 -72 -11 190 2 -157 390
3183 390 256 12 103 -115 -269 -130 11 174 -131 -333 -151 -159 -348 259 246 95 225 397 233 442 499 338
3205 338 111 151 95 33 34 45 -128 -207 -40 145 136 -71 -5 -22 -71 97 233 63 -57 17 -24 -105 227 198 -357
3230 -357 -411 20 -15 -2 -354 -149 -250 -246 -72 79 -34 56 137 -195 -169 147 2 21 -55 -55 -67 70 101 -111 -355
3255 -355 -127 52 -68 -17 -124 -95 -88 323 314 299 -77 100 -171 138 244 232 89 65 178 254 214 310 154 -87
3279 -87 -8 -211 -58 -90 21 -86 -130 -76 280 294 396 34 -158 39 508 406 -1 42 240 -81 143 -3
3301 -3 -307 -328 -320 -219 -361 -368 -18 -292 -227 145 208 50 132 139 -151 20 105 23 -241 -142 -314 -410 -529 -197 -227 -498
$$ packed form
3138D69q2k39r4K61j10j38j46q7p4L47J5k10r2o6j34J38L48R0k52K9K11J34j69
3161A49o2J68k33k58K6j54J89k66J55l97L70L64j98j6K15j74N0O1K01j88j59N47
3183C90j34k44R1k18j54J39J41J63l05k02J82qj89O07j3j51J30J72j64K09N7j61
3205C38k27M0n6o2JJ1j73p9J67J85rk07O6j7m9J68J36j70j20P4m1q1L32k9n55
3230c57n4M31l5J3l52K05j01MJ74J51j13R0Q1l32K6L16j45J9p6%j2J37L1k12k44
3255c55K28J79j20N1j07K9PM11rj5l76J77k71L09J06j2j43k4J13P6m0R6j56k41
3279h7P9k03J53l2J11j07m4N4L56J4J02l62j92J97M69j02m07M3J98l21K24j46
3301cl04k1QJ01j42pL50k74O5L72O3j58Q2Pk90J71Q5q2k64R9j72r6j19L32l0k71
$$ plain form
3327 -498 -305 -26 96 -68 75 -124 176 -30 122 321 71 52 30 125 -109 181 36 57 69 -192 -65 186
3349 186 454 309 -58 169 243 358 560 406 192 24 218 151 -21 -69 -84 50 -153 203 109 74 17 -53 -206
3372 -206 -82 -136 -184 7 -207 45 101 143 250 -212 -245 -46 353 324 154 -139 -266 -327 -62 44 113 -197 -268
3395 -268 -35 14 -161 -44 -148 1 -104 49 40 165 27 -40 66 370 14 -102 -173 -629 -348 -211 -242 -353
3417 -353 -81 -308 -251 69 118 177 155 34 110 364 78 540 53 -15 194 73 2 62 -61 88 -259 -212 -39
3440 -39 -61 -117 -52 192 220 447 594 215 235 93 142 -21 120 126 -165 -36 -147 -76 -256 129 -384 0 -88 22
3464 22 144 -59 65 -58 -260 -24 179 143 -77 -25 -312 60 5 73 -32 -102 -266 -152 344 -103 51 7
3486 7 72 139 -71 -33 -75 -16 67 -9 59 107 115 240 264 164 -170 322 -138 -93 -121 -172 -39 134 187 -201 -110 -183 296
$$ packed form
3327d98J93K79J22j64J43j99L00k06J52J99k50j9k2R5k34K90j45K1J2k61J27K51
3349A86K68j45l67K27P4J15K02j54k14j68J94o7j72m8j5J34k03L56r4l5n7p0j53
3372b06J24n4m8J91k14K52N6M2J07m62l3J99L99k9j70k93j27o1K65J06O9l10p1
3395b68K33M9j75J17j04J49j05J53rJ25j38o7J06L04l56j16p1m56K81J37l1j11
3417c53K72k27N7L20M9N9k2j21P6K54k86M62m87o8K09j21p1O0j23J49l47M7J73
3440c9k2n6O5K44K8K27J47l79K0j42M9j63J41Ok91J29j11P1j80L85n13L84q8J10
3464B2J22k03J24j23k02K36K03l6k20N2k87L72n5O8j05p0j64J14M96m47J54m4
3486GO5O7k10L8m2N9Q3p6O8M8QJ25K4j00l34M92m60M5k8n1J33J73N3l88R1p3M79
$$ plain form
3513 296 223 35 44 -99 302 523 242 268 -114 251 32 -59 -199 -188 -365 -354 -237 -160 -263 -121 50 -378 69
3536 69 172 360 157 381 -269 133 100 19 43 -344 5 -252 -104 -197 -63 -52 -240 -412 -39 153 78 62 147
3559 147 58 231 311 323 360 -18 -96 -27 59 -279 -134 -153 -145 -117 1 313 211 -22 94 150 266 22 0 171
3583 171 -1 146 8 373 -59 -83 -46 75 109 81 -279 -156 -173 -36 36 188 -49 -276 -212 51 169 192 30
3606 30 97 -179 122 137 120 214 -267 -104 181 -6 -255 -2 -133 -340 -170 138 23 -55 -161 177 58 75
3628 75 201 150 65 -12 139 254 235 -46 2 -278 -347 63 89 -144 -126 -201 -104 -150 304 77 106 56 48 214 385
3653 385 -69 72 -87 -115 89 -309 113 -283 -254 -127 -297 18 89 -281 100 -48 104 404 67 -95 236
3674 236 -78 109 82 -79 -106 -482 -203 269 59 -71 -278 6 -214 -78 138 95 113 -168 233 75 100 139
$$ packed form
3513B96p3j88Rj43M01K21k81K6l82L65k19r1j40J1j77J1J17P7j03J42J71m28M47
3536F9J03J88k03K24o50M02l3q1K4l87L49k57J48r3J34J1j88j72L73J92p5j6Q5
3559A47q9J73Q0J2L7l78p8O9Q6l38J45j9QK8J18L12j02k33J16N6J16k44k2J71
3583A71j72J47j38L65m32k4L7J21L4k8l60J23j7J37P2J52k37k27O4K63J18K3j62
3606C0O7k76L01J5j7R4m81J63K85j87k49K53j31k07J70L08j15p8j06L38j19J7
3628G5J26n1q5p7J51J15j9k81M8k80o9M10K6k33J8p5R7m6M54k27K9n0qJ66J71
3653C85m54J41j59k8K04l98M22l96K9J27j70L15P1l70L81j48J52L00l37j62L31
3674B36l14J87k7j61k7l76K79M72k10j30k07K84k20J36K16m3J8k81M01j58K5L9
$$ plain form
3696 139 20 112 -8 197 84 -235 -56 -16 42 -89 29 -164 -91 -164 15 -213 218 -102 159 -27 81 58
3718 58 209 73 76 157 1 58 -144 -21 115 -143 -112 65 92 57 -106 -12 -189 -294 -305 61 232 7 83 95
3742 95 -6 367 72 76 -277 -297 -145 -2 -88 -46 -243 -134 -188 188 -98 112 -66 -21 244 254 82 341 -78
3765 -78 -236 51 415 66 -213 -30 -257 -181 -285 -89 -23 7 -182 -180 80 213 16 177 128 99 351 239 -143
3788 -143 67 -61 67 -108 -108 -86 -339 -117 214 -252 -54 -56 -17 -197 -191 45 287 4 74 -65 336 169 272
3811 272 232 -223 -74 -220 84 -150 -171 -44 -367 -23 249 62 -13 124 36 -315 -66 66 -60 -118 -9 -37
3833 -37 -281 15 75 -35 27 -8 -117 89 33 -205 171 135 78 156 -5 -61 75 -325 164 246 302 398 117 -23
3857 -23 1 71 -267 9 -349 85 -58 -235 133 -83 78 -73 28 -156 196 143 -12 -132 -12 245 -37
$$ packed form
3696A39j19R2j20K05j13l19J79M0N8j31J18j93P3p3J79k28M31l20K61j86J08k3
3718E8J51j36LQ1j56N7k02J23J36k58L1J77K7l5j63R4j77j05j1L66J71k25P6J2
3742I5j01L73k95Ml53k0J52J43q6M2j97J09n4L76k86K10j78M5K65J0j72K59m19
3765g8j58K87L64l49k79J83k27P6j04J96O6L0j89KK60J33j97J61m9k9K52j12l82
3788a43K10j28J28j75%K2k53K22L31m66J98kL9j80OK36K42k83P0j39M01j67J03
3811B72m0m55J49j46L04k34k1J27l23L44K72j87p5J37q8l51K49J32j26n8J09k8
3833c7k44K96O0j10O2l5j09K06n6k38L76l6n7P8j61n6J36m00M89Q2N6R6k81j40
3857b3K4P0l38K76l58M34j43j77L68k16J61j51J01j84L52n3j55j20J20K57k82
$$ plain form
3878 -37 -166 -330 -164 -107 95 93 -36 -298 -123 -78 15 63 22 -146 -53 100 206 3 -5 128 144 256 110 127
3902 127 -145 6 -82 -275 -63 -26 36 -129 -282 60 -49 78 138 255 241 160 93 5 35 43 -278 -61 -28 141
3926 141 -45 -248 22 -157 -43 -40 89 -12 -115 -360 -120 56 508 104 -138 -57 10 260 313 107 -302 -134
3948 -134 -256 -111 13 -232 -16 -40 -143 -51 48 -164 -214 -138 13 -100 -12 -35 32 -208 79 125 37 19 29 -216
3972 -216 -242 -97 -82 -156 -307 77 164 106 -86 108 -44 50 294 -83 67 218 -42 -124 187 86 4 -15 -106
3995 -106 54 -143 36 41 105 -308 217 -121 46 364 83 59 64 122 -39 155 -52 -63 -300 44 24 3 35 -129
4019 -129 87 -135 196 402 192 -37 201 4 106 54 -110 15 -455 137 48 236 80 -110 -269 -200 -379
4040 -379 -129 -130 -149 -193 10 -112 -96 140 31 -49 42 -273 164 -44 537 -117 -153 49 -10 70 -119 -164 23 -84
$$ packed form
3878c7j29j64J66N7K02kj29k62J75M5R3M8m1j68R3J53J06k03qJ33J6J12j46J7
3902A27k72J51q8j93K12L7O2j65j53L42j09J27O0J17j4q1o7q8L0Ql21K17L3J69
3926A41j86k03K70j79J14LJ29j01j03k45K40J76M52m04k42Q1O7K50N3k06m09J68
3948a34j22J45J24k45K16k4j03R2R9k12n0P6J51j13Q8k3O7k40K87M6q8j8J0k45
3972b16k6J45J5p4j51L84Q7n8j92J94j52R4K44l77J50J51k60q2L11j01q2j9r1
3995a06J60j97J79NO4m13N25l38J67L18k81k4NN8j61J94k07j1k37L44k0k1L2j64
4019a29K16k22L31K06k10k29K38j97J02n2j64J25m70N92q9J88j56j90j59O9j79
4040c79K50jj9m4K03j22J6K36j09q0R1l15M37k08N81o54l6K02n9Q0j89m5J87j07
$$ plain form
4064 -84 -15 -74 -84 -13 -305 -6 136 32 260 170 347 163 142 239 303 -31 -7 -72 -72 -16 -119 -142 -184 -100 16 -190
4090 -190 -80 15 -53 111 195 208 -18 115 92 -126 -87 57 -340 -229 -108 -62 -249 11 -128 -60 -273 -258 -181
4113 -181 -140 -192 96 40 -131 -20 188 119 -121 -472 -220 348 -115 192 -167 191 -163 274 140 -274 -27
4134 -27 -306 -233 -13 216 -57 -21 126 221 0 192 38 238 -37 92 47 67 228 -1 -33 -146 -198 18 278
4157 278 -11 4 84 192 294 56 -2 107 290 -200 30 217 46 -208 -47 -215 -281 -326 -151 -410 -193 -44
4179 -44 57 -93 -33 311 88 -174 -116 -38 -21 -274 -143 -36 -144 -101 -75 -107 49 -171 -263 -179 -113 -31 -326 -255
4203 -255 21 73 44 74 -289 -30 -80 177 -68 222 125 -159 -397 75 -2 -174 -18 124 -172 23 -38 -113 -6
4226 -6 -46 44 195 -49 240 199 41 133 112 -16 2 290 48 53 203 17 -29 -222 -30 -169 -183 178 -91 -175
$$ packed form
4064h4O9n9j0P1k92K99J42j04K28r0J77j84k1R7O4l34K4o5%N6j03k3m2Q4J16k06
4090a90J10R5o8J64Q4J3k26J33k3k18L9J44l97J11J21M6j87K60j39O8k13J5P7
4113a81M1n2K88n6j71J11K08o9k40l51K52N68m63L07l59L58l54M37j34m14K47
4134b7k79P3K20K29k73L6J47R5k21J92j54K00k75J29m5K0J61k29l2j13n2K16K60
4157B78k89J5Q0J08J02k38n8J09J83m90K30J87j71k54J61j68o6m5J75k59K17J49
4179d4J01j50O0L44k23k62N8P8J7k53J31J07j08M3K6l2J56k20r2Q4O6Q2k95P1
4203b55K76N2k9L0l63K59n0K57k45K90r7k84k38M72p7j72J56J42k96J95o1p5J07
4226fm0R0J51k44K89m1j58R2k1j28J8K88k42NJ50j86m6j93J92j39j4L61k69q4
$$ plain form
4250 -175 -105 -15 139 -236 -38 33 -139 76 5 6 -185 73 -181 -147 37 -65 142 -83 76 54 -87 19 -270
4273 -270 -110 -81 22 107 -188 110 218 -136 -257 120 -233 276 -65 -171 -276 -268 34 -17 9 -199 97 51
4295 51 102 241 259 219 82 339 -31 93 38 -13 -12 -13 -277 -43 21 -52 47 -175 -32 134 104 58 -19 -80 13 132
4321 132 400 -171 -66 15 -210 11 27 83 -99 -24 -120 -147 -175 -128 -75 -264 1 176 145 83 246 -35 -141 16
4345 16 -90 154 -10 -175 -110 -7 37 193 -390 -63 -266 11 -43 -71 79 -39 -57 199 215 58 233 -150
4367 -150 -9 38 434 46 242 24 54 1 250 81 73 -79 -86 123 -72 -23 82 -194 113 344 -3 430 89
4390 89 371 70 -63 49 -149 -106 13 -271 -133 -138 18 -195 -227 -110 -99 46 -32 15 36 -135 133 141 132 415
4414 415 -47 -114 78 -186 -109 9 -189 -190 -38 97 51 -173 -65 -7 -159 229 229 62 27 198 104 71 -37 -37
$$ packed form
4250a75P0R0J54l75J98P1j72K15p1Jj91K58k54L4J84j02K07k25J59k2j41J06k89
4273b70J60K9J03Q5k95K98J08l54j21L77l53N09l41j06j05QL02n1K6k08K96m6
4295E1N1J39J8m0j37K57l70J24n5n1Jjk64K34O4p3R9k22J43J66l0m6p7o1R3J19
4321A32K68n71J05Q1k25K21J6N6j82P5r6k7k8M7N3j89K65J75l1o2J63k81j06J57
4345A6j06K44j64j65O5J03M4J56n83L27k03K77n4k8J50j18j8K56J6j57J75l83
4367a50J41M7L96l88J96k18L0n3K49j69qj52pK09j95M9J05k76L07K31l47M33l41
4390H9K82l01j33J12j98M3J19k84J38nJ56k13l2J17J1J45p8M7K1j71K68QrK83
4414D15m62o7J92k64P7J18j98jJ52J35m6k24J08N8j52L88%j67l5J71r4l3j08%
$$ plain form
4438 -37 127 -181 134 -33 -148 -96 -158 75 154 81 144 81 206 -57 149 50 272 -23 81 -351 159 100 37
4461 37 97 -97 -131 -11 -54 -10 203 -250 136 116 -145 145 -38 -71 -146 310 67 68 54 -148 -60 144 176 -99
4485 -99 246 -53 -157 -110 -18 94 56 -243 -260 -185 -111 13 -19 81 -50 63 -47 139 160 -169 -45 270 -50
4508 -50 -295 -112 -146 -212 -39 -241 -102 44 -155 339 40 -89 172 131 197 99 209 312 -148 79 -75 -139
4530 -139 -230 -104 -57 -149 -141 -76 195 -34 -23 -12 -76 -34 91 191 97 119 -70 -27 -94 -151 8 -42 -97 -35 39 21 -32
4557 -32 -17 -213 -198 -120 28 189 -59 72 165 -84 -32 139 -1 54 -44 -135 -286 84 -49 -100 23 -316 23
4580 23 -140 -146 274 -51 -57 96 -151 14 -72 -131 54 116 -193 145 102 170 -80 -152 9 -100 -104 70 -17 -37 29
4605 29 72 -163 24 -152 67 41 31 331 19 -66 94 188 -35 -131 73 -157 -32 -65 -37 -46 -73 -28 -153 102
$$ packed form
4438c7J64l08L15j67j15N2o2K33P9p3O3o3J25k63K06r9K22k95J04m32N10n9o3
4461C7O0j94l4J20m3M4K13m53L86k0k61K90j83l3p5M56k43Jj4k02Q8K04L2k75
4485i9L45k99j04M7R2J12l8k99j7P5P4J24l2J00j31J13j10J86K1l29J24L15l20
4508e0k45J83l4o6J73k02J39J46j99M94k99j29K61m1O6r8J10J03m60K27j54o4
4530a39r1J26M7r2QO5K71k29J1J1o4M2J25J00r4K2j89M3o7n7J59n0n5O2P4j8n3
4557c2J5j96J5P8J48J61k48J31R3k49N2J71j40N5r8r1j51L70j33n1J23l39L39
4580B3j63oM20l25oJ53k47J65q6n9J85O2l09L38m3O8k50p2J61j09mJ74q7k0O6
4605B9M3k35J87j76K19k6j0L00l12q5J60R4k23r6K04k30J25l3K8rk7M5j25K55
$$ plain form
4629 102 264 -47 -13 45 163 243 325 -58 24 -14 31 113 53 62 1 -219 -254 -37 6 35 52 -101 -132 51 51 83 43
4656 43 240 136 -13 -22 -57 100 74 -65 160 173 94 215 -306 -59 87 -116 97 124 83 -83 -82 155 228 122
4680 122 33 -48 -143 -34 293 84 122 53 -106 51 -95 109 -51 -1 -85 -106 34 -27 44 35 139 -208 63 138
4704 138 15 135 -112 -17 92 314 209 45 -293 -269 -144 18 -194 -55 -72 209 42 122 164 -195 -65 -139
4726 -139 213 -20 -114 -71 95 79 -238 -318 105 112 283 175 -92 250 137 -240 -86 -6 -159 -95 304 153 -58
4749 -58 111 138 -133 37 -342 -196 -86 -281 -165 -167 137 8 -4 -54 146 105 150 124 183 -36 19 335 19 -55
4773 -55 108 -91 -11 -177 -49 -97 -437 -220 73 214 47 41 -40 420 293 -153 -16 -135 -43 140 88 93 68 62
4797 62 -45 -107 -31 119 -151 -98 -200 -132 -43 80 -159 240 159 -86 118 210 167 -73 86 67 -67 19 102 -155
$$ packed form
4629A02J62l11L4N8J18Q0Q2l83Q2l8M5Q2o0Ro1k20l5K17M3K9J7j53l1J83%L2m0
4656D3J97j04j49rl5J57k6j39K25J3p9J21n21K47J46k03K13K7m1j66JK37P3j06
4680A22q9q1r5J09L27k09L8o9j59J57j46K04j60N0q4k1J40o1P1rJ04l47K71P5
4704A38j23J20k47R5J09K22j05j64l38K4J25J62k12J39j7K81j67Q0M2l59J30p4
4726a39L52k33r4M3J66j6l17q0M23PJ71j08k67L42j13l77J54Q0j53O4L99j51k11
4749e8J69K7k71J70l79J46J10j95J16kL04j29j2n0K00m1M5k6N9k19N5L16l16p4
4773e5J63j99Q0j66J28m8l40K17K93J41j67oq1M60j27m46J37j19R2J83n2Nk5o
4797F2j07o2P6J50k70N3j02O8Q9J23k39L99q1k45K04R2m3k40J59j9j34Q6Q3k57
$$ plain form
4821 -155 -161 83 227 -67 -57 -139 -101 -292 -90 131 121 -70 112 -111 -29 339 260 -163 92 -81 87 137 213
4844 213 -104 5 -187 -31 21 -151 171 -178 -28 -95 0 -21 51 77 113 91 131 -43 28 -12 65 -20 -127 -134 29
4869 29 5 -227 -89 29 160 55 216 198 -54 62 287 71 89 218 182 83 172 30 -187 -109 -73 -309 165
4892 165 -31 -9 33 -292 205 161 -86 82 310 -117 71 -14 -146 -141 -226 -227 -8 89 114 -140 52 -117 45 154
4916 154 110 108 -66 47 121 -66 100 245 129 -236 192 13 193 -86 -340 158 -152 -29 0 -1 -38 -44 -100 -25
4940 -25 -431 121 -34 95 119 201 218 159 45 -142 142 4 174 32 159 105 -332 174 2 -171 127 -92
4962 -92 -87 -19 -284 -123 29 298 221 51 160 156 203 -163 -185 -95 42 -201 -14 -429 -22 -212 104 -37 -117 -109
4986 -109 -14 -55 -155 84 201 -60 325 -16 -100 81 -285 -127 96 -24 47 -82 -29 93 -304 -199 80 -22
$$ packed form
4821a55oK44J44k94J0q2L8j91K02K21j0j91J82k23Q2L68p9m23K55j73J68N0P6
4844B13l17J09j92J56N2j72L22l49J50o7R5k1P2K6L6k2M0j74P1m0P7q5j07pJ63
4869B9k4k32J38J18J31j05J61j8k52J16K25k16J8J29l6r9Q9j42k17P8L6k36M74
4892A65j96K2M2l25M97m4k47J68K28m27J88q5j32Nq5jK19R7K5k54J92j69J62J09
4916A54m4kj74J13P4j87J66J45j16l65M28j79J80k79k54M98l10J23K9jl7on6P5
4940b5m06N52j55J29K4Q2J7n9j14j87K84j38J70j42J27n4m37N06j72j73K98k19
4962i2NO8k65J61J52K69p7j70J09mM7l66k2R0J37k43J87m15M07j90L16j41q0Q
4986a09R5m1j00K39J17k61L85l41q4J81l66J58K23j20P1j29N3J22l97J05K79j02
$$ plain form
5008 -22 531 247 237 81 30 -158 80 -114 -8 198 148 -55 -227 -58 -10 -92 -97 -158 159 -115 -82 -114 -34 303
5032 303 -91 -110 -100 91 -377 -32 209 92 82 -241 -1 -101 -77 -254 -159 -205 -121 -20 -372 -7 -128 -33 39
5055 39 53 64 173 70 224 212 10 191 130 -195 -173 -22 184 -159 56 59 79 116 -89 66 -73 -304 -141
5078 -141 66 -99 358 72 79 27 -70 -117 119 62 118 -25 8 -35 -221 -175 -64 7 -74 -74 167 42 -108 3 300
5103 300 153 120 22 124 -200 62 17 4 -284 -26 120 82 45 -152 27 -207 -197 -179 13 236 -171 227 152
5126 152 -129 -93 120 204 -54 -257 -35 27 -74 -189 59 -37 -83 -96 -293 -70 -42 39 -190 56 70 -58 -211
5149 -211 89 -178 83 -160 35 -37 -247 -271 -171 -75 -2 66 -197 171 -134 146 60 -131 -232 160 -63 -51
5171 -51 293 23 161 -186 -91 43 232 77 -260 6 -56 -67 122 112 -158 43 -11 271 -40 -173 -4 133
$$ packed form
5008b2N53k84j0j56n1j88K38j94J06K06n0k03j72J69M8q2no1L17k74L3l2Q0L37
5032C03l94j9J0J91m68L45K41j17j0l23K40j00K4j77R5m6Q4J01l52L65j21R5P2
5055C9J4J1J09j03J54j2k02J81o1l25K2J51K06l43K15LK0L7k05J55j39k31J63
5078a41K07j65M57k86Pn2r7m7K36n7N6j43L3m3j86M6J11P1q1%K41j25j50J11K97
5103C00j47l3r8J02l24K62m5j3k88K58J46l8l7j97J79k34J0J8J92K23m07L98p5
5126A52k81L6K13Q4k58k03K22O2j01j15K48r6m6j3j97K23K8Q1k29K46J4j28j53
5149b11L00k67K61k43J95p2k10k4J00R6P3O8k63L68l05K80q6j91j01L92k23J2
5171e1L44k70J38l47R5J34J89j55l37K66o2j1J89j0k70K01n4K82l11j33J69J37
$$ plain form
5193 133 110 195 170 103 91 -14 39 -124 -168 91 -341 -21 -113 -69 -78 -183 -156 179 -39 314 116 5 295 -47
5217 -47 10 125 -33 27 -35 187 -31 7 -59 -20 18 -171 -6 -21 -40 75 150 70 6 -93 194 111 -134 27 -2
5242 -2 106 172 21 50 29 -166 198 -50 -111 74 -205 -22 159 80 229 -85 123 14 154 62 233 -56 126
5265 126 -276 -101 1 67 -186 -194 -92 113 11 100 -90 -127 31 246 -245 20 -13 38 -283 -163 71 18 -124
5288 -124 -222 -174 -169 -33 -81 -60 47 176 50 38 -115 -72 82 -177 124 13 69 -338 -129 -206 0 212 -275
5311 -275 -206 -118 -47 72 -34 1 -14 6 157 -171 106 397 -111 -16 191 -56 316 123 82 77 78 92 73 -6 -26
5336 -26 -93 -32 -223 66 -201 312 52 -92 -17 35 198 272 33 -120 -223 36 81 0 -31 -102 -103 -82 -22 11 -47
5361 -47 -173 -157 46 -79 8 13 81 -33 -147 -184 -43 91 45 31 127 -104 -317 56 -171 -98 -43 93 -102 -288
$$ packed form
5193A33k3Q5k5o7j2j05N3j63m4K59m32L20r2M4rj05K7L35k18L53j98j11K90l42
5217d7N7J15j58O0o2K22k18L8o6L9L8j89J65j5j9J15P5q0o4r9K87q3k45J61k9
5242bJ08O6j51K9k1j95L64k48o1J85k79J83J81p9J49l14K08j09J40r2J71k89J82
5265A26m02J75J02O6k53qJ02K05j02Q9j90l7J58K15m91K65l3N1l21J20K34n3j42
5288a24r8M8NJ36m8K1J07J29j26j2j53M3J54k59L01j11N6m07K09p7K06K12m87
5311b75O9Q8P1J19j06L5j5K0J51l28K77K91n08R5K07k47L72j93m1nJJ4j9p9k0
5336b6o7O1j91K89k67N13k60j44P5N2J63P4k39j53j03K59M5q1l1p1jK1O0L3n8
5361d7j26J6K03j25Q7NO8j14j14l7J41J34m6j4R6k31k13L73k27P3N5J36j95j86
$$ plain form
5385 -288 0 50 -4 107 189 51 -39 127 229 28 -68 -11 -37 -110 247 195 44 -11 -29 72 174 -84 -372 25
5409 25 185 82 -174 2 -123 23 28 -22 193 -13 -64 180 19 130 -61 -123 77 68 188 -49 30 -43 95
5432 95 181 -40 -181 -16 42 -314 -3 114 -22 194 -48 -55 84 48 184 -152 -45 98 -109 69 -69 134
5454 134 11 -103 172 199 51 -6 66 -93 -66 218 -98 27 -46 165 -52 -193 22 96 82 -96 106 214
5476 214 56 -129 -174 303 -314 -2 348 -209 279 241 -4 51 -112 -7 -25 -108 79 144 -205 -91 77 -243
5498 -243 242 80 -170 -71 17 208 89 72 -220 -182 -3 -128 -24 -60 67 -51 42 3 77 28 -233 26 -40
5521 -40 -93 -120 -150 99 74 173 55 -86 -54 -85 -52 -174 3 88 232 -99 -117 114 109 4 224 -104 85 -129
5545 -129 -51 -206 -175 -72 -234 -39 -105 230 179 232 -228 -59 72 -13 171 9 -163 -33 50 -19 59 138 109 -42
$$ packed form
5385b88K88N0n4J11Q2j38r0J66J02k01r6N7k6p3L57n2j51n5j8J01J02k58k88L97
5409B5J60j03k56J76j25J46Nn0K15k06n1K44j61J11j91o2K00rJ20k37P9p3J38
5432I5Q6k21j41J65N8l56L11J17j36K16k42pJ39l6J36l36J07J43k07J78j38K03
5454A34j23j14K75K7j48n7P2j59K7K84l16J25p3K11k17j41K15P4j4j78K02J08
5476B14j58j85m5M77o17L12L50n57M88l8k45N5j63J05j8q3J87O5l49J14J68l20
5498b43M85j62k50R9Q8J91j19j7k92L8J79j25J04l6J27j18R3l9P4m9k61K59o6
5521d0n3k7l0K49k5R9j18j41L2l1L3j22J77Q5J44l31j8K31nj05K20l28J89k14
5545a29P8j55L1J03j62J95o6L35n1N3m60J69J31q5J84j62j72J30Q3o9P8P9k9j51
$$ plain form
5569 -42 98 331 -68 -117 4 -27 88 -70 104 -34 100 -72 -76 -4 -71 2 -48 -101 -213 -108 107 -201 60
5592 60 -217 -39 -54 -30 74 119 -30 -32 48 -52 -139 -93 -50 -275 -322 -97 -200 -109 115 -199 25 -95 127 -31
5616 -31 -58 123 110 180 82 -23 -96 -105 34 -123 -88 -198 -99 -158 -215 -12 15 44 43 -90 -29 116 151 1 -188 110
5642 110 -236 125 -12 -84 118 138 -215 55 -77 -95 -120 -30 -6 3 191 -314 229 -146 -168 -264 247 34 54 173
5666 173 200 165 -63 -138 41 -179 71 -63 114 99 26 27 -79 63 -60 262 135 -91 -1 -162 34 -23 -65
5689 -65 19 -49 -154 127 -125 21 -183 -43 -21 124 -60 116 -31 -257 -65 27 326 -47 -61 91 -146 -149 -97
5712 -97 65 -30 45 101 -32 -184 204 -11 -35 -178 185 -76 -176 -291 364 57 180 59 89 15 203 37
5734 37 67 -17 -233 -44 -81 104 -93 -197 8 -67 558 102 -10 109 124 44 -78 85 61 -36 42 72 -11 26
$$ packed form
5569d2J40K33l99m9J21l1J15j58J74j38J34j72mP2o7P3n0n3j12J05K15l08K61
5592F0k77J78j5K4J04M5j49kQ0j00q7M6M3k25m7K25j03R1K24l14K24j20K22j58
5616c1k7J81j3P0r8j05p3rJ39j57L5j10R9n9n7K03K7K9jj33O1J45L5j50j89K98
5642A10l46L61j37p2K02K0l53K70j32j8k5R0K4RJ88n05N43l75k2r6N11k13K0J19
5666A73K7l5k28p5J79k20K50j34J77j5p3Jj06J42j23L22j27k26R0j61J96n7m2
5689f5Q4o8j05K81k52J46k04J40K2J45j84J76j47k26J92R2K99l73j4J52k37lN2
5712i7J62r5P5N6j33j52L88k15k4j43L63k61j00j15O55l07J23j21L0p4J88j66
5734C7L0q4k16J89l7J85j97j04K05p5O25m56j12J19J5q0j22J63k4r7P8L0q3L7
$$ plain form
5758 26 -134 -124 143 -69 -102 -90 31 -181 81 -76 -93 156 121 167 -138 -106 -53 -39 36 -51 44 45 -27 196 -249
5783 -249 -75 -98 -61 -363 110 13 -251 4 67 -14 -156 -155 72 126 143 -11 8 59 40 173 1 13 -99 153
5807 153 100 -93 61 26 73 35 50 1 56 140 -55 115 1 -158 80 -227 -1 160 -221 -173 -100 -221 -87
5830 -87 34 -141 107 -217 -232 40 1 51 138 111 5 290 -117 -59 260 -40 113 249 212 89 107 171 -50
5853 -50 118 6 -12 135 -83 121 25 -61 75 165 -25 -141 -291 88 -84 74 -21 158 25 5 -88 -16 -56
5876 -56 -55 173 223 -222 -241 105 0 -173 70 330 -86 99 160 333 83 104 72 -212 -96 -11 -118 159 71
5899 71 203 21 -223 -125 10 -104 120 37 102 -43 -26 -123 52 209 -170 126 -38 103 -81 -9 19 -73 -229
5922 -229 129 174 21 -3 -34 146 155 192 78 215 72 66 -25 -133 26 10 45 16 -125 -101 -88 -265 -324 -109 43
$$ packed form
5758B6j60J0K67k12l3J2J21k12K62j57j7K49l5M6l05L2N3J4P5q7R5Jp2K23m45
5783b49J74k3L7l02M73r7k64K55O3q1j42JK27N4J7j54J9N1j9J33j72J2j12K52
5807A53n3j93J54l5M7l8J5m9N5Q4j95J70j14j59K38l07K26J61l81M8P3j21J34
5830h7J21j75K48l24j5K72l9N0Q7k7j06K85m07N8L19l00J53J36l7j23J8O4k21
5853e0J68j12j8J47k18K04r6q6J36R0j90j16j50L79j72J58r5J79j33k0r3P2m0
5876e6JK28N0m45j9L46j05j73K43K60m16J85O1J73k50K1l2k84J16Q5j07K77q8
5899G1J32j82k44R8J35j14K24q3O5j45J7r7J75J57l79K96j64J41j84P2K8r2j56
5922b29L58M5j53k4l1J80RL7j14J37j43or1j08J59j6L5k9j41K4J3j77n9K15J52
$$ plain form
5947 43 -19 211 -54 238 142 -99 -69 -33 117 84 61 291 94 116 215 -68 -79 -464 137 158 181 130 -99 -50 -36
5972 -36 66 -169 -17 130 -69 -2 -16 360 -60 -90 -149 34 45 -236 -113 34 -67 -61 236 138 52 34 109 82
5996 82 68 -64 -192 -75 -93 30 7 -48 12 -262 -20 -4 8 -90 -65 -102 -77 -7 24 178 -128 51 116 67 -96
6021 -96 -52 67 -35 111 64 -42 -179 -37 -184 -59 5 -46 118 -161 86 -183 -1 -79 216 192 69 37 285
6044 285 -80 201 168 120 -36 -80 28 183 -164 71 -164 -48 -114 5 -22 -149 149 -20 42 -47 5 -53 315
6067 315 -95 77 6 203 -83 10 -65 -2 200 -190 -98 -160 -410 -84 -131 11 68 91 -48 -430 -158 69 89
6090 89 -204 -53 -83 47 26 7 -87 -4 -160 81 25 -78 -172 -94 -125 41 109 138 170 186 203 64 33 192 -226
6115 -226 269 107 52 295 31 17 -205 -52 -93 -124 146 118 -163 -62 -308 363 -14 -182 -194 -241 83 274
$$ packed form
5947D3o2K30k65K92r6k41L0L6J50l3k3K30j97K2R9k83j1l85O01K1K3n1k29M9J4
5972c6J02k35J52J47j99O7j4L76m20l0n9J83J1k81J23J47j01OK97r8q6j8P5k7
5996H2j4j32j28J17j8J23k3n5O0k74K42J6J2r8K5l7K5P0L1J54l06J79O5m9j63
6021i6M4J19j02J46m7j06j37J42j47J25O4n1J64k79K47k69J82p8K95k4j23l2K48
6044B85l65K81l3m8j56m4J08J55l47K35k35J16o6J19k7j27K98j69O2q9N2n8L68
6067C15m10J72p1J97k86R3p5O3K02l90R2o2k50L26m7J42N7K3j39l82K72K27K0
6090H9k93J51l0J30k1j9r4Q3j56K41n6j03r4P8l1J66O8K9L2J6J7j39l1J59m18
6115b26M95j62n5K43k64j4k22J53m1l1K70k8k81J01k46O71l77j68j2m7L24J91
$$ plain form
6137 274 -73 -20 246 68 -42 -5 -17 94 150 -111 39 201 217 54 91 164 100 62 57 -104 42 -27 26 -225
6161 -225 65 -99 -130 -24 33 -65 31 -87 -53 -34 57 -217 35 228 14 95 125 -148 176 222 128 147 -164 222
6185 222 111 -134 -42 14 57 -49 129 -239 -30 145 17 -35 -8 74 -15 -9 109 178 -68 -55 43 90 -136 19
6209 19 135 90 206 -137 62 158 105 68 -109 119 39 107 108 223 -328 -209 110 -153 126 48 54 -30 57 151 -173
6234 -173 -113 35 -242 -106 79 19 40 67 178 -117 108 19 -350 28 206 36 -60 -37 6 58 89 23 141 -131
6258 -131 35 54 60 174 -116 -40 184 206 -7 -232 192 198 30 93 -66 180 21 -10 234 24 189 -268 -141
6281 -141 -142 -85 346 307 30 -43 -70 131 447 2 -45 41 -96 61 -194 -34 -304 25 329 26 -6 -124 128
6304 128 -107 144 22 -21 8 -214 0 -32 -81 116 60 12 3 -143 66 -125 -141 168 -354 -68 2 46 -257 -134
$$ packed form
6137B74l47N3K66j78j10L7j2J11N6k61J50J62J6j63L7P3o4l8nj61J46o9N3k51
6161b25K90j64l1J06N7r8R6j18L4J9R1k74K52J93k14Q1L0k73L24M6r4J9l11L86
6185B22j11k45R2N6M3j06J78l68K09J75j28n2K7Q2q9OJ18O9k46J3R8M7k26J55
6209A9J16m5J16l43J99R6n3l7j77K28q0O8JJ15n51J19L19k63K79p8Oq4Q7R4l24
6234a73O0J48k77J36J85o0K1K7J11k95K25q9l69L78J78j70r6K3M3N2L1o6J18k72
6258a31J66J9OJ14k90P6K24K2k13k25M24Oj68O3j59K46j59l1K44k10J65m57J27
6281a41jN7M31l9k77p3k7K01L16m45m7Q6j37J57k55J60k70L29L04l03l2j18K52
6304A28k35K51j22m3K9k22K14l2m9J97n6m8rj46K09j91j6L09n22K86P0M4l03J23
$$ plain form
6328 -134 71 49 16 -54 35 66 -144 301 -84 -51 1 -43 -117 71 168 15 -55 66 54 8 219 -69 -62 196 -73
6353 -73 -63 49 -87 -241 -70 66 -34 -73 47 71 -59 -226 -73 8 -128 21 -96 -4 -151 -15 -30 37 -91
6376 -91 -16 129 38 -82 107 103 -23 15 239 -346 8 -57 -41 -222 -13 188 107 239 60 -61 6 178 151 -55
6400 -55 -6 116 -65 -70 -369 -274 -26 359 28 168 -180 81 -157 -38 -222 -195 -46 280 82 143 161 -137 31
6423 31 61 154 0 73 145 -76 -52 115 34 -195 -212 -83 263 89 -74 -15 15 27 44 -16 48 -23 222 130 58 16
6449 16 46 -193 -75 115 -190 14 12 83 -176 8 10 -54 133 80 2 -112 -26 154 79 -83 283 -67 -74 307 -85
6474 -85 -261 -27 -128 -258 -32 48 45 118 21 -183 -3 62 -117 -295 230 12 -16 -11 -138 -287 66 -11 -25 25
6498 25 -36 -145 28 -121 64 98 -87 71 106 140 -12 20 91 144 -263 26 100 164 23 235 0 -100 30
$$ packed form
6328a34K05k2l3p0Q9L1k10M45l85L3N2m4p4J88R7j53p0J21j2m6K11k88PK58k69
6353g3J0J12j36j54J71J36j00l9J20K4j30j67J53Q1j36J49j17R2j47J36j5O7j28
6376i1P5J45r1j20J89mj26L8K24n85L54o5J6j81K09K01q1J32j79j21O7J72k7k06
6400e5M9J22j81nk99R5K48L85l31J40l48K61k38J19j84K7J49L26j98O1J8k98J68
6423C1L0R3j54P3P2k21K4J67q1k29j7J29L46j74j63N9L0J2J7o0O4p1K45r2p2m2
6449A6L0k39J18J90l05K04kP1k59J84Ko4J87n3p8j14Q6J80p5j62L66l50pL81l92
6474h5j76K34j01j30K26Q0lP3r7k04J80O5j79j78N25k18k8Nj27j49L53p7j4N0
6498B5o1j09J73j49J85L4j85J58L5L4j52L2P1N3m07K89P4O4j41K12k35j00J30
$$ plain form
6521 30 -7 30 174 -7 -63 -140 85 -122 75 -81 -87 -100 -68 74 -87 -46 144 43 -10 261 -158 -207 21 -44
6545 -44 28 -204 14 187 -116 -186 143 -7 -329 -40 42 42 178 -50 -31 -35 -14 -128 -41 116 128 -109 -136 -124 -88
6570 -88 41 114 41 -170 -55 -40 7 -219 299 132 12 63 103 -58 -202 -88 20 -82 -8 27 -29 250 -40
6593 -40 24 -22 -73 -94 -83 2 96 -53 -83 89 131 -67 176 -172 111 47 176 8 -100 136 73 -220 -72 -190
6617 -190 -104 -139 -1 10 -52 260 -144 10 27 200 104 -31 239 -191 204 -36 -69 111 107 -51 -7 47 -112 91
6641 91 111 -6 177 406 149 116 -157 0 -103 -199 -136 -171 17 -249 -240 -249 -149 63 -246 -70 -152 61 -58 -131
6665 -131 -52 53 -26 -32 -132 62 6 -140 -65 -78 -28 60 187 -16 52 232 105 43 -80 -69 -278 -30 103 -112
6689 -112 -65 -43 99 -238 136 24 21 138 -3 -35 129 -186 140 -27 122 55 -59 116 -131 -151 -102 -8 -137
$$ packed form
6521C0l7L7J44j81n6p7K25k07J97j56oj3L2J42j61M1J90j01n3K71m19m9K28o5
6545d4P2k32K18J73l03p0L29j50l22K89Q2%J36k28J9mK1j14Q7J57J2k37k7J2L6
6570h8J29P3p3k11J15J5M7k26N18j67j20N1M0j61j44J14J08j02P4L5n6K79k90
6593d0O4m6n1k1J1Q5R4j49l0J72M2j98K43l48K83o4J29j68j08K36o3k93J48j18
6617a90Q6l5J38J1o2L12m04J54J7J73r6j35K70m30L95k40l3J80mj58M4N4j59K03
6641I1K0j17J83K29k57l3k73J57j03r6O3l5J88k66RrJ00K12l09J76q2K13j19p3
6665a31P9J05p9oj00J94n6j46P5j3N0Q8J27k03O8J80j27o2j23J1k09K48J33k15
6689a12M7K2J42l37L74j12lJ17j41l2J64l15L26j67J49o7j14J75k47k0M9R4j29
$$ plain form
6712 -137 114 91 -48 -37 -85 57 30 240 36 -144 65 109 -149 -185 -123 -237 -39 -234 58 -66 96 142 -48
6735 -48 -107 107 -21 114 112 45 24 -34 47 55 -12 -156 -177 -18 -228 -81 93 -6 -73 66 35 -49 -80 234 28 89
6761 89 -63 51 -80 21 107 87 -147 -83 77 17 -97 -242 -61 -77 91 -226 -65 -173 64 83 -182 95
6783 95 -43 -67 213 109 392 -114 -110 -232 -118 -87 -86 -119 127 226 -98 1 -2 81 -310 88 35 65 -38 115 -16
6808 -16 31 -46 113 177 46 -3 54 -76 149 64 224 127 -110 -15 -90 84 -25 144 -61 142 -27 94 -112
6831 -112 209 -84 12 106 95 -56 67 -52 264 -80 -60 -19 110 39 213 111 64 234 -225 166 -53 -108 -110
6854 -110 -2 -196 -51 148 6 -109 -229 77 146 286 90 67 -101 -117 -119 121 64 54 -81 25 247 151 -71
6877 -71 150 72 195 48 -194 -178 163 -60 -47 33 -50 -204 259 67 108 71 20 182 116 -180 21 -52 -40 -9
$$ packed form
6712a37K51k3j39J1m8J42k7K10k04j80K09M4k58l6O2j14J98j95K92j24J62M6j90
6735d8n9K14j28J35ko7k1n8Q1Qo7j44k1J59k10J47J74r9o7J39l1q4l1L14k06O1
6761H9j52J14j31J01Q6k0k34O4J60o0j14j45J81j6J68l17J61j08K37J9k65K77
6783I5j38k4K80j04K83n06Mj22J14L1Jl3K46R9l24R9lQ3l91L98n3L0j03J53j31
6808a6M7p7J59O4j31m9N7j30K25q5J60r7k37R5p5J74j09J69k05K03j69J21k06
6831a12L21k93R6R4j1j51J23j19L16l44K0M1J29p1J74j02m7J70m59L91k19n5k
6854a10J08j94J45J99j42j15j20L06O9J40j96k3j68j6kK40n7j0j35J06K22r6k22
6877g1K21p8J23j47k42J6L41k23J3Q0q3j54M63j92M1l7n1J62o6k96K01p3J2L1
$$ plain form
6901 -9 -148 -42 83 -158 -236 170 73 -285 -184 -81 -5 198 -173 202 -85 -3 217 78 -97 -153 204 42
6923 42 46 260 183 -105 -133 -27 -57 -77 243 -86 -2 92 -161 -117 38 -19 120 -104 -25 -140 -67 -39 -25 -238 95
6948 95 76 -139 19 -106 78 199 -107 87 -27 -110 -168 -24 24 137 -201 54 175 -62 -5 -72 -46 243 93
6971 93 -101 -35 38 172 44 -99 46 301 18 -106 -174 120 -19 51 -46 126 -186 80 -6 183 -307 -163
6993 -163 -35 176 93 -21 -131 4 -61 25 -272 50 34 -229 49 103 116 -101 66 -140 -77 -51 -18 -156 -63
7016 -63 118 124 -111 134 -80 109 -134 29 23 -34 -26 67 8 32 284 -289 47 -245 -151 -183 113 -65 -224 -36
7040 -36 -127 62 -447 -158 64 59 2 -7 -9 42 -8 -117 30 -190 -55 167 220 -101 -212 -26 -63 -17 -187 151 -36
7065 -36 106 15 -242 -42 150 67 -103 44 -24 -2 -57 17 -66 -41 158 213 116 -77 202 -38 -90 -43 -244 75
$$ packed form
6901ij39J06J25k41p8M06r7l58J01J03P6K03l71L75k87Q2K20j39j75n6L57j62
6923D2MK14p7k88k8J06l0k0L20l29Q4R4k53M4J55n7J39k24P9j15P3K8J4k13L33
6948I5j9k15J58j25J84J21l06J94j14q3n8J44M8J13l38K55J21k37N7o7K6K89j50
6971I3j94O6P3J34j28j43J45K55k83j24o8K94j39P0r7J72l12K66q6J89m90J44
6993a63J28K11q3j14j10J35o5Q6k97L22j6k63K78N4J3k17J67k06O3K6L3j38R3
7016f3J81Ok35K45k14J89k43J63on7QR3n9K4K52n73L36k92R4l2K96j78j59J88
7040c6r1J89n09K89K22nn7rkN1n0j09J47k20J35K22N3l21j11J86l7M6j70L38j87
7065c6J42r1k57K00J92q3j70J47o8K2n5P4q3K5J99N5r7j93K79k40n2M7k01L19
$$ plain form
7089 75 1 57 -139 51 -20 -58 -430 -121 153 35 -42 -4 -247 61 -161 75 113 -126 -259 86 80 -182 -234 -169
7113 -169 -217 -52 48 -70 -111 -378 253 -71 -37 96 -129 154 65 -260 -25 -69 -103 -198 -8 84 -20 125 -37
7136 -37 113 36 103 -68 86 149 60 -16 -16 93 228 50 111 95 -77 11 -141 3 -40 64 48 45 -106 14 0
7161 0 -42 141 15 179 -64 19 124 161 7 -270 112 -156 -126 -34 -30 174 -193 28 -20 -16 72 -55 -98 107 99
7186 99 58 -85 -121 -3 100 52 35 121 -280 130 -196 23 -28 142 -95 15 104 307 193 5 36 36 19 134
7210 134 43 -308 213 112 148 231 -155 25 257 3 33 -35 15 112 -85 29 -38 -53 -68 69 -50 9 -29 48
7234 48 204 181 -54 200 -83 -173 -43 -82 -12 -75 -124 -40 -104 127 -91 125 223 -68 92 20 38 7 32 -23 -19 41
7260 41 32 -195 -91 57 -50 83 -60 -60 33 120 -91 -68 -224 75 -123 -186 -72 231 83 10 -71 -29 116 112 -8
$$ packed form
7089G5p4N6j96J90p1l8l72L09K74j18p7L8k43L08k22K36L8k39j33L45ok62n2O5
7113a69m8J65J00j18m1k67O31l24L4J33k25K83q9l25K35m4l4r5J90R2j04J45j62
7136c7J50p7O7j71J54O3q9p6%J09J35j78O1j6j72Q8j52J44m3J04j6lj51J20j4
7161@m2J83j26J64k43Q3J05L7j54k77L82k68L0R2MK04l67K21m8MQ8j27m3K05q
7186I9m1j43l6J18J03m8j7Q6m01M10l26K19n1J70k37J10Q9K03j14j88L1%j7J15
7210A34r1l51N21j01L6Q3l86J80K32k54L0o8N0R7j97J14o7j5j5J37j19N9l8P7
7234D8J56k3k35K54k83r0J30l9P0o3m9Q4o4K31k18K16R8k91J60p2J8l1K5n5MO0
7260D1rk27J04J48j07J33j43%R3Q7k11K3j56K99j98o3J14L03j48p3q1M2J45mj20
$$ plain form
7285 -8 -186 -172 75 317 118 -134 -45 -70 25 57 19 -29 138 -9 141 172 220 151 83 -76 -126 119 -256 17 -1
7310 -1 -125 98 74 -19 -127 58 241 108 -21 39 358 149 -95 100 71 -3 91 -125 -13 304 -57 46 135
7333 135 -100 -3 -36 11 -6 -167 18 -49 95 -142 -5 193 51 -220 -55 -137 111 156 30 -271 31 3 91
7356 91 188 -311 32 -42 212 -75 -51 105 -31 -70 -102 20 12 20 -306 -140 -234 58 164 -105 137 50 171 -111
7380 -111 55 -47 96 276 12 -47 291 -49 275 -65 -60 18 -190 153 -89 -83 -178 85 9 -134 -122 -258 -114
7403 -114 -261 -222 -153 21 33 -103 -150 107 101 125 -37 137 115 -274 58 80 -198 -202 -85 -175 -99 37 76 137 58
7428 58 -134 -36 -146 -4 3 -111 -138 0 191 -108 27 30 163 47 -70 -202 152 -137 -9 53 279 44 77
7451 77 -190 116 157 -44 87 -218 235 -16 39 135 -29 -82 -82 33 144 196 84 -107 12 97 -60 -12 -181
$$ packed form
7285hj78J4K47K42j99k52Q9k5R5L2l8m8J67j47J50L1M8o9o8j59n0K45l75K73j8
7310aj24K23k4r3j08J85J83j33j29O0L19k09k44J95k9p4R4k16J12L17l61J03Q9
7333A35k35R7l3M7j7j61J85o7J44k37J37J98j42k71J65q2K48M5j26l01L02k8Q8
7356I1R7m99L43p4K54k87K4J56j36l9l2J22qQl26J66r4K92J06k69K42q7J21k82
7380a11J66j02J43J80k64n9L38l40L24l40NP8k08L43k42Or5K63p6j43J2j36J44
7403a14j47L9O9J74J2j36m7K57oK4j62J74k2l89L32K2k78mJ17r0P6J36L9O1p9
7428E8j92R8j10J42Pj14k7J38J91k99J35LJ33j16j17j32L54k89J28O2K26k35L3
7451G7k67L06M1k01J31l05M53k51N5R6j64n3%J15J11N2j12j91J19Q5j57M8j69
$$ plain form
7474 -181 -7 -266 12 78 145 156 198 88 -353 198 -125 136 -162 26 -94 108 19 107 55 64 234 186 -26
7497 -26 80 92 138 -151 -156 -40 -208 91 -93 -238 188 128 252 415 22 -99 -100 -37 187 50 130 44 -79 -234
7521 -234 174 126 24 9 -80 24 51 73 -56 165 -105 29 -159 -242 5 380 27 -11 282 -137 -31 -22 20
7544 20 -249 83 -111 -42 228 62 159 134 -66 44 -23 -15 -125 -263 -94 105 -259 161 -51 -75 251 29 103
7567 103 -120 117 -31 -32 -319 205 -88 13 180 -16 8 -135 27 257 -51 -4 40 38 126 76 -102 -252 -185
7590 -185 -249 13 -178 122 -122 216 51 -76 119 371 23 18 -76 -28 -258 -10 -103 -149 24 -206 -42 -160
7612 -160 -21 -123 -96 81 -190 -41 -144 25 49 129 82 31 -64 -29 -15 -5 125 -22 412 -45 -123 -279 8
7635 8 114 -131 329 166 106 -23 -90 79 -150 -365 198 189 13 69 182 -151 105 29 210 88 -51 2 -82
$$ packed form
7474a81J74k59K78O6O7J1M2j10m41N51l23K61k98J88j20K02q9Q8n2RJ70m8k12
7497b6J06J2M6k89nJ16j68K99j84j45M26o0J24J63l93j21jO3K24j37Q0q6j23j55
7521b34M08m8j02j5q9J04K7K2j29K21k70J34j88q3K47L75l53l8K93m19J06RM2
7544B0k69L32j94O9K70j66R7k5k00J10o7Qj10j38J69J99l64M20k12k4L26k22P4
7567A03k23K37j48jk87N24k93J01J67j96K4j43J62K30l08M7M4kQ8n0j78j50O7
7590a85o4K62j91L00k44L38j65j27J95K52l48nr4M8k30K48r3m6J73k30J64j18
7612a60J39j02K7J77k71J49j03J69K4Q0m7n1r5L5J4J0J30j47M34m57p8j56K87
7635HJ06k45M60j63o0j29o7J69k29k15N63rj76N6J13l33K56p6J81j22j39N3q4
$$ plain form
7658 -82 -177 33 -63 223 98 -348 -115 -127 -7 43 48 88 -62 -180 160 -94 -196 -9 185 138 57 57 10 -310
7682 -310 -54 45 -4 -72 24 -159 -14 43 110 -102 -133 -117 98 88 69 246 -50 -100 -48 -16 53 -87 211 63 8
7707 8 -3 -183 58 44 26 0 95 95 63 110 -229 -46 -172 81 -42 80 87 -148 99 21 -116 -71 133 -95 -27
7732 -27 19 35 -72 48 33 93 133 73 -58 229 178 24 66 121 -15 52 62 -85 100 78 -258 -102 -130 -174 -238
7757 -238 213 109 -27 48 215 -34 263 22 -37 114 -6 200 10 143 -49 47 -184 178 149 -30 -206
7778 -206 21 -131 155 -47 173 -169 -32 -47 77 84 -152 32 35 -94 390 -101 -17 112 206 142 117 6 -133
7801 -133 1 -3 -151 -77 -33 56 -114 -123 -57 28 47 -1 52 -1 288 -220 -90 -132 325 2 173 110 163 -154 77
7826 77 -72 -33 -148 -179 -47 -107 92 162 289 -117 371 -40 146 -132 -118 -204 -41 192 143 -36 145 -45 -276
$$ packed form
7658h2r5K10r6K86j25m46K33j2J20N0NM0j50j18L40k54j02J87J94m7q1%m7l20
7682c10K56R9m9o8R6j83J45N7O7k12l1J6K15j0j9J77k96n0N2L2O9j40K98j48n5
7707Hj1j80K41j4j8k6R5%l2M7l39J83j26K53j23J22Pk35K47p8j37M5K04k28O8
7732b7M6J6j07J20j5O0M0o0j31K87n1j54M2N5j36O7J0j47J85k2l36J56k8m4o4
7757b38M51j04j36P5J67k49K97k41n9J51j20K06j90J33j92R6k31L62k9j79j76
7778b06K27j52K86k02K20l42J37j5J24Pk36J84Lj29M84m91Q4J29R4o4k5j11j39
7801a33J34mj48P4M4Q9j70rO6Q5J9m8N3n3K89n08J30m2M57l23J71o3N3l17K31
7826G7j49L9j15l1J32o0J99P0J27m06M88m11J86k78J4q6J63K33m9j79J81j90k31
$$ plain form
7849 -276 -195 -21 79 -63 -7 316 181 16 5 161 75 65 38 92 114 -125 147 54 -133 27 131 -141 127
7872 127 239 245 127 62 30 24 11 47 -55 71 106 22 208 92 -125 -7 -56 108 -66 80 -90 17 -80 116
7896 116 180 91 169 -162 33 47 303 -65 92 -23 -77 100 161 131 3 -242 -79 -121 6 337 -250 -33 129
7919 129 -50 -45 30 243 17 199 -5 -50 148 -417 -316 127 -3 -21 -216 97 -62 -11 -14 -272 -9 137 117
7942 117 27 -179 -61 -37 -46 129 115 -114 -141 -36 -253 -14 161 22 227 -160 -85 -29 26 217 -128 50 157
7965 157 -30 -53 -97 -131 209 -11 96 -49 -44 223 207 -57 -154 -49 114 -124 -72 -11 -70 -145 43 -241 -86 -91
7989 -91 -31 128 22 46 -63 -2 20 -261 -64 133 -33 18 -108 192 14 -3 -226 103 -137 204 -10 88 29
8012 29 10 -45 52 -140 -218 -122 115 105 73 -25 -85 83 -110 -46 -115 -144 -29 -165 -94 -27 -34 -24 -65 -62 63 -200 47
$$ packed form
7849b76Q1J74J00j42N6L23j35j65j1J56q6j0k7N4K2k39K72r3j87J60J04k72K68
7872A27J12Oj18o5l2oj3L6j02J26L5q4J86j16k17J18m9J64j74J46j70J07r7J96
7896A16O4q9P8l31J95J4K56l68J57j15n4J77O1l0j28k45J63m2J27L31n87K17J62
7919A29j79NP5K13k26J82k04m5J98n65J01M43j30j8j95L13j59N1lk58K63J46k0
7942A17r0k06J18K4rJ75j4k29k7J05k17K39J75j39K05l87P5N6N5J91l45J78J07
7965A57j87k3m4l4L40k20J07j45NK67j6k64r7J05J63k38N2O1n9p5J88k84J55n
7989i1O0J59j06K4j09O1K2k81J97J97j66N1j26L00j78j7k23L29k40L41k14R8n9
8012B9j9n5R7j92p8R6K37j0l2r8o0J68j93O4o9k9J15j36P1O7pJ0m1LJ25k63K47
$$ plain form
8039 47 -13 133 155 -146 8 -29 124 -95 57 195 -69 -119 -52 46 153 -134 -114 19 186 -185 210 54 40
8062 40 219 4 6 -193 205 -148 4 -59 176 -25 -12 99 26 -118 -205 -91 -43 264 -64 -316 -30 -32 -65 -55
8086 -55 243 170 -147 2 45 -179 -31 156 -31 -149 -215 -90 55 -52 -256 197 158 117 -30 14 -50 -151 53
8109 53 -184 -113 20 -98 62 -22 -25 -218 353 53 -149 -97 140 -158 258 -66 35 64 111 36 49 -175 69
8132 69 6 -106 24 152 34 207 -7 -156 138 130 218 161 27 -49 -179 94 197 169 47 -19 71 32 54 -150
8156 -150 -46 270 98 -123 -22 -66 137 -67 160 53 -32 -280 -104 -281 92 -60 16 47 -64 -273 -28
8177 -28 -112 79 51 228 -100 10 -37 140 -6 -9 -77 -67 72 96
$$ packed form
8039D7o0J46K2l01J54l7J53k19J52J38k64n0O7R8J07k87K0J33J67l71L95j56j4
8062D0J79k15Kj99L98l53J52o3K35k01J3J11p3j44q7J14M8L07l28k52K86kl3J0
8086e5K98p3l17J49M3k24J48J87j87j18o6J25J45j07k04M53l9m1j47M4o4j01K04
8109E3k37P1J33j18J60q4lj93N71l00k02N2K37k98M16l24J01K9M7p5J3k24K44
8132F9o3j12J30J28j18J73k14j49K94qQ8n7j34p6j30K73J03k8j22o6R0l9K2k04
8156a50J04L16j72k21J01m4K03k04K27j07q5k48J76j77L73j52P6L1j11k09K45
8177b8q4J91k8J77l28J10m7J77j46lo8J0J39K4
8191I6
$$ Imaginary data points
##PAGE= N=2
##DATA TABLE= (X++(I..I)), XYDATA
$$ plain form
0 0 0 0 0 0 0 0 0 0 0 0 8 -8 8 -8 16 -16 16 -24 32 -32 40 -48 57 -72 80 -96 112 -128 145 -169 193 -219 249
33 249 -281 320 -360 404 -452 506 -565 629 -698 774 -857 949 -1048 1156 -1275 1406 -1548
50 -1548 1705 -1878 2071 -2285 2523 -2795 3102 -3455 3868 -4353 4935 -5649 6551 -7727 9334
65 9334 -11667 15390 -22271 39233 -173388 -129848 215470 -24174 -136756 33836 130069
76 130069 8569 7214 19984 -12297 -16320 15131 -35457 -48366 -5650 18060 -20 14203
88 14203 18212 -6025 -35417 -17219 7525 -1703 -16460 24710 45733 8373 3215 35064 1817
101 1817 -24048 31785 41249 -34030 -37490 21720 27134 20604 33220 -4376 -26930 25601 28994
114 28994 -42264 -34721 36648 37074 -1230 -6689 -9447 2044 40998 26801 -40584 -38854 26990
$$ packed form
0@%%%%%%%%%%Qj6J6j6K4l2L2m0N6o4P2q8J05j29J52j76K08k40K73l14L62m12M68
33B49n30O01o80P64q56R58j071J194j327J472j631J806j997K204k431K681k954
50a548L253l583L949m356M808n318N897o557P323q221R288j0584J2200j4278J7061
65I334k1001K7057l7661O1504k12621M3540L45318k39644j12582J70592R6233
76A30069j21500j355J2770l2281m023L1451n0588j2909M2716K3710j8080J4223
88A4203M009k4237k9392J8198K4744r228j4757M1170K1023l7360n158L1849l3247
101A817k5865N5833R464p5279l460N9210N414o530J2616l7596k2554N2531L393
114B8994p1258P543P1369M26l8304n459k758J1491L8954j4197o7385J730O5844
$$ plain form
127 26990 35070 -16490 -29840 8211 31170 9888 -20782 -22292 -7173 -4544 -5500 4091 8508
140 8508 527 -5486 -5506 -3928 -3911 -10280 -17469 -18495 -17455 -11013 4326 10486 7652 22007 25005 -13123
156 -13123 -31955 4678 15651 -26906 -40632 -12983 -6577 -10800 944 -88 -5920 16432 29723
169 29723 5864 -8048 5751 9421 2203 1124 -2339 -2382 9714 11062 -4097 -3859 13442 14292
183 14292 -5362 -16952 -7495 1921 -1740 1460 16268 15677 4261 12833 25523 15929 5510 4348
197 4348 -5113 -10758 -242 -3183 -18127 -9199 5953 191 -4558 1329 -980 -6830 -3254 -3140 -4765
212 -4765 2584 7108 5257 6478 4316 -470 3067 1248 -18427 -28566 -15354 -5968 -7333 -5340
226 -5340 -1150 2730 7398 8539 4578 2144 -1190 -6759 -6696 -3780 -2493 378 1388 -2500 -1732 2207
$$ packed form
127B6990Q080n1560j3350L8051K2959k1282l0670j510J5119K629r56R591M417
140H508p981o013k0J578J7o369p189j026J040O442J5339O160k834J4355K998l8128
156a3123j8832L6633J0973m2557j3726K7649O406m223J1744j032n832K2352J3291
169B9723k3859j3912J3799L670p218j079l463m3J2096J348j5159K38J7301Q50
183A4292j9654j1590R457R416l661L200J4808n91j1416Q572J2690r594j0419j162
197D348r461n645J0516k941j4944Q928J5152n762m749N887k309n850L576J14j625
212d765P349M524j851J221k162m786L537j819j9675j0139J3212R386j365J993
226e340M190L880M668J141l961k434l334n569O3K916J287K871J010l888P68L939
$$ plain form
242 2207 1589 162 2622 3313 3961 6348 6487 6052 3843 -6862 -13750 -5259 703 -5045 -2591 7744
258 7744 9833 11360 19596 16464 752 -3916 -541 -4446 -8742 -2747 4005 2875 2499 8281 9484
273 9484 2199 -2044 -1897 -9564 -15343 -4537 5798 -54 -1202 9610 12238 7247 6491 2228 -7390
288 -7390 -9226 -6172 -6936 -4229 165 -3930 -7600 -1913 -369 -7861 -11336 -9118 -8396 -5304 1744 6629
304 6629 9300 11808 9799 1802 -2229 657 -1583 -13464 -18907 -8621 -382 -4333 -3682 4708 5052
319 5052 350 4184 9570 4393 -495 2069 3773 4299 5994 4442 -287 -732 451 -1448 -93 4118
335 4118 2821 -925 1175 4352 4377 5234 2813 -4581 -6106 -647 800 593 5276 7306 3707 4965
351 4965 8870 3991 -4453 -7227 -5201 -4262 -5808 -5605 -1713 1726 1723 2476 5097 3221 -2088 -6346 -9329
$$ packed form
242B207o18j427K460O91O48K387J39m35k209j0705o888Q491N962n748K454J0335
258G744K089J527Q236l132j5712m668L375l905m296N995O752j130l76N782J203
273I484p285m243J47p667n779J0806J0335n852j148J0812K628m991p56m263r618
288g390j836L054p64K707M394m095l670N687J544p492l475K218P22L092P048M885
304F629K671K508k009p997m031K886k240j1881n443J0286Q239l951O51Q390L44
319E052m702L834N386n177m888K564J704N26J695j552m729m45J183j899J355M211
335D118j297l746K100L177K5Q57k421p394j525N459J447k07M683K030l599J258
351D965L905m879q444k774K026R39j546K03L892L439lP53K621j876n309m258k983
$$ plain form
368 -9329 -7354 -573 2160 -750 -141 324 -1761 1446 5494 559 -3810 -2808 -4754 -5469 1825 1624
384 1624 -7009 -3608 3202 -4468 -9613 -90 2576 -3969 -262 7908 5327 679 3371 5209 3977
399 3977 3957 3785 1523 -3544 -6884 -5897 -3177 683 3536 -1234 -8380 -2551 10053 9493 4252 8103
415 8103 8361 340 -910 2791 -244 -562 2161 -1720 -4985 239 2596 -906 -130 165 -4991 -5927
431 -5927 -1004 -1783 -5161 1009 9962 9003 1801 -136 283 -3906 -4782 1954 3332 -5538 -8390 -2962
447 -2962 -1608 -2096 1581 147 -7030 -7636 -2706 -152 1947 5922 7924 6221 -662 -7422 -3710 4263
463 4263 -882 -10031 -3337 6805 3636 -2473 389 3478 4168 2730 -3266 -8924 -5422 -142 -413
478 -413 2690 9773 8493 -726 -3559 365 2189 742 1015 1639 -901 -2004 2713 7997 6514 2711
$$ packed form
368i329J975O781K733k910O09M65k085L207M048m935m369J002j946p15P294k01
384A624q633L401O810p670n145R523K666o545L707Q170k581m648K692J838j232
399C977k0j72k262n067l340R87K720L860K853m770p146N829J2604n60n241L851
415H103K58q021j250L701l035l18K723l881l265N224K357l502P76K95n156r36
431e927M923p79l378O170Q953r59p202j937M19m189q76O736J378q870k852N428
447b962J354m88L677j434p177o06M930K554K099L975K002j703o883o760L712P973
463D263n145r149O694J0142l169o109K862L089O90j438n996n658L502N280k71
478d13L103P083j280r219k833L924J824j447K73O24k540j103M717N284j483l803
$$ plain form
494 2711 -1071 -6906 -11066 -6681 -185 -454 -700 3383 6465 7280 6836 1812 -2812 997 2802 -5248
510 -5248 -7909 135 1832 -1019 3075 5323 -2056 -4917 -2755 -8140 -10774 -318 6605 993 -2777
525 -2777 1596 5008 4443 2025 861 486 -2039 -5546 -2692 3871 2462 -2277 -2490 -1344 -3331 -5285
541 -5285 -5188 -3423 -470 1073 2544 5438 4482 2010 3360 4463 408 -1360 -353 -2860 -4947 -1786
557 -1786 1499 3404 4521 -1046 -7475 -3984 2457 342 -2422 1047 1392 -605 2069 5166 4862 2850
573 2850 113 -2725 -1991 1156 720 -924 -610 128 67 7 -995 -2191 -3049 -1504 -320 -1545 -738 4613
591 4613 3177 -4024 -529 8921 4801 -4291 -847 3677 -1423 -2102 3117 943 -4492 -3141 -1480
606 -1480 -1436 290 570 -1485 423 2464 -617 -746 2496 410 -3282 -168 3968 3128 827 1503 2207
$$ packed form
494B711l782n835m160M385O496k69k46M083L082Q15m44n024m624L809J805q050
510e248k661Q044J697k851M094K248p379k861K162n385k634J0456O923n612l770
525b777M373L412n65k418j164l75k525l507K854O563j409m739k13J146j987j954
541e285R7J765K953J543J471K894r56k472J350J103m055j768J007k507k087L161
557a786L285J905J117n567o429L491O441k115k764L469L45j997K674L097l04k012
573B850k737k838P34L147m36j644L14P38o1o0j002j196q58J545J184j225Q07N351
591D613j436p201L495R450m120r092L444M524n100o79N219k174n435J351J661
606a480M4J726K80k055J908K041l081j29L242k086l692L114M136q40k301O76P04
$$ plain form
623 2207 352 -1252 -1414 -2100 -4427 -5875 -2936 48 1455 2457 584 -2606 -430 3950 1113 -2383
639 -2383 -211 1547 -927 1711 5192 2585 -1124 -1285 -4056 -5576 -2429 -979 -3624 -2715 116 1070
655 1070 2123 3887 1324 -1956 -633 -143 -633 1688 3059 242 541 3757 2952 -267 -1395 -2772
671 -2772 -5274 -4136 379 1607 -387 -512 2880 3521 732 366 2366 -210 -3295 -257 3518 4002
687 4002 3819 4015 732 -586 1825 -848 -5384 -4233 -2863 -4045 -1063 3589 1620 -255 1641 1222
703 1222 -593 1107 847 -3037 -1315 3212 2977 1316 2616 1633 -2798 -4970 -3581 -2671 -3388 -4331 -2962
720 -2962 -1502 85 3237 4684 823 -2060 282 1102 -1095 -167 1366 -291 -58 2818 2011 -713
736 -713 -1087 -3044 -4515 -1849 -312 -1926 -287 2462 680 318 4218 4639 741 -1141 -235 -259 1681
$$ packed form
623B207j855j604j62o86k327j448K939K984J407J002j873l190K176M380k837l496
639b383K172J758k474K638L481k607l709j61k771j520L147J450k645R09K831R54
655A070J053J764k563l280J323M90m90K321J371k817K99L216q05l219j128j377
671b772k502J138M515J228j994j25L392O41k789l66K000k576l085L038L775M84
687D002j83J96l283j318K411k673m536J151J370j182K982M652j969j875J896m19
703A222j815J700k60l884J722M527k35j661J300r83m431k172J389R10p17r43J369
720b962J460J587L152J447l861k883K342Q20k197R28J533j657K33K876q07k724
736g13l74j957j471K666J537j614J639K749j782l62L900M21l898j882R06k4J940
$$ plain form
753 1681 3721 2559 539 489 994 851 132 -1327 -2327 -1986 -1659 -377 1256 1021 442 1813 2410 1148
771 1148 526 176 -643 -1157 -7 1285 2184 1409 -1261 -2393 -1045 -875 -929 -816 -3275 -5637 -3409 280
789 280 1035 153 -93 -1662 -2758 90 1515 -753 -459 2082 1096 -1222 -162 1534 -228 -2496 -1833
806 -1833 -1327 -2029 -2636 -2315 -1962 -336 1135 1455 1595 1801 1445 1070 3445 6202 4533 952 -949 -655
824 -655 200 1329 2014 -641 -3141 -1638 261 -782 -849 2369 3097 -383 -701 3271 4881 3284 2600
841 2600 2651 1061 342 321 -1294 -2673 -1412 -323 -1100 -1208 -1036 -2193 -2919 -1063 1632 1464 -1193 -2973
859 -2973 -1765 350 1789 1889 1160 -510 -2567 -2814 -1934 -1883 -1735 -1117 -2280 -3896 -2744 -199 1163
876 1163 -443 -2404 -2426 -1195 -607 -1435 -1217 543 1738 2219 1849 913 -384 -886 -703 -383 474 1017
$$ packed form
753A681K040j162k020n0N05j43p19j459j000L41L27J282J633k35n79J371N97j262
771A148o22l50q19n14J150J292Q99p75k670j132J348J70n4J13k459k362K228L689
789B80P55q82k46j569j096K848J425k268K94K541r86k318J060J696j762k268O63
806a833N06p02o07L21L53J626J471L20J40K06l56l75K375K757j669l581j901K94
824f55Q55J129O85k655k500J503J899j043o7L218P28l480l18L972J610j597o84
841B600N1j590p19k1j615j379J261J089p77j08J72j157p26J856K695j68k657j780
859b973J208K115J439J00p29j670k057k47Q80N1J48O18j163j616J152K545J362
876A163j606j961k2J231N88q28K18J760J195M81l70r36j297n02J83L20Q57N43
$$ plain form
894 1017 140 -1244 133 2604 3135 844 -1127 -1171 -387 -113 486 3785 5959 3067 462 2438 4656
911 4656 3064 954 180 -223 110 938 118 158 623 73 -674 -567 -683 -1716 -1486 -499 907 2921 3502
930 3502 2436 1788 611 -830 282 846 -3039 -5597 -3613 -2516 -3374 -1855 555 -2228 -4332 -2536
946 -2536 -858 -716 -662 -272 621 1633 1673 923 992 298 -2017 -3243 -2545 -2181 -2785 -2637 -1779 -475 394
965 394 1279 1927 398 -1662 -220 3025 2543 1203 1973 2171 758 1049 2676 1193 -888 -902 -876 -926
983 -926 426 2474 2100 1082 818 1161 2156 2334 475 -544 214 1151 1476 1626 1749 913 75 388 1517
1002 1517 1425 -33 -1294 -826 488 276 -272 -302 -950 -2242 -2898 -1696 -318 -853 -2014 -2083 -494 279
1020 279 367 867 663 -783 -1355 -145 -260 -1520 -2223 -2751 -2804 -1549 -1380 -2666 -2454 -1088 -1215 -658 1795
$$ packed form
894A017q77j384J377K471N31k291j971m4P84K74N99L299K174k892k605J976K218
911D656j592k110p74m03L33Q28q20M0M65n50p47J07j16j033K30R87J406K014N81
930C502j066o48j177j441J112N64l885k558J984J097q58J519K410k783k104J796
946b536J678J42N4L90Q93J012M0p50O9o94k315j226O98L64o04J48Q58J304Q69
965C94Q85O48j529k060J442L245m82j340P70J98j413K91J627j483k081j4K6n0
983i26J352K048l74j018k64L43R95J78j859j019P58R37L25J50J23q36q38L13J129
1002A517r2j458j261M68J314k12n48l0o48j292o56J202J378n35j161o9J589P73
1020B79Q8N00k04j446n72J210j15j260p03n28n3J255J69j286K12J366j27N57K453
$$ plain form
1039 1795 2105 103 1177 2922 2061 1613 3117 1250 -1597 -650 944 174 -1150 -1113 -1382 -1657 -483
1056 -483 1543 2264 1513 1348 2518 3389 3518 3624 2555 904 610 915 235 366 -64 -2075 -3152 -834
1074 -834 -310 -1885 -1314 3 -437 -898 2033 2750 1451 1025 331 -619 94 783 -1472 -2657 -1822 -1839
1092 -1839 -2182 -978 -564 -1599 -2067 -1827 -823 143 46 -791 -579 245 685 445 -798 -1111 -521 -488 -1361
1111 -1361 -1137 311 -321 -1051 -112 649 1414 1725 -634 -1610 177 1304 -506 155 1419 -15 -1350
1128 -1350 644 2565 1912 786 359 864 2309 3335 2240 1072 1949 1847 387 -305 289 -34 -2200
1145 -2200 -1837 -627 389 736 714 56 449 1696 2531 2190 1243 671 -371 -593 791 1014 -1646 -3519
1163 -3519 -2543 -2929 -4214 -2403 -1327 -1960 -2705 -892 639 918 1329 1452 393 410 694 -70 -929 -550
$$ packed form
1039A795L10k002J074J745q61m48J504j867k847R47J594p70j324L7k69k75J174
1056d83K026P21p51j65J170Q71J29J06j069j651k94L05o80J31m30k011j077K318
1074h34N24j575N71J317m40m61K931P17j299m26o94r50P13O89k255j185Q35j7
1092a839l43J204M14j035m68K40J004R66r7q37K12Q24M40k40j243l13N90L3q73
1111a361K24J448o32p30R39P61P65L11k359r76J787J127j810O61J264j434j335
1128a350J994J921o53j126m27N05J445J026j095j168Q77j02j460o92N94l23k166
1145b200L63J210J016L47k2o58L93J247Q35l41r47n72j042k22J384K23k660j873
1163c519R76l86j285J811J076o33p45J813J531K79M11J23j059J7K84p64q59L79
$$ plain form
1181 -550 -1044 -2370 -2148 -1419 -1790 -2834 -2518 -972 845 1492 395 400 2029 2834 2557 2355 2733 1409
1199 1409 -577 -1114 315 1179 371 -814 -1287 -1170 -40 1698 1349 784 1008 1204 857 1603 2619 1440
1217 1440 499 1404 761 -65 -50 446 -1060 -769 1001 1395 -518 -355 -68 -762 -163 1120 137 -952
1235 -952 -1495 -1528 -1355 292 1273 -107 -1982 -1770 -505 -245 -355 115 458 -824 -1519 -592 -194 -722 -675
1254 -675 -1684 -2493 -2040 -783 -1570 -1920 -906 -459 -92 762 546 -425 340 1881 1908 1666 1091 -369 -865
1273 -865 -387 -520 -308 243 -771 -2124 -1230 523 940 1906 1992 1503 1493 2239 2710 3194 2941 1529 341
1292 341 395 676 30 -1151 -1613 -891 -96 -803 -1175 -451 55 192 1273 2008 1053 817 993 96 -292 1026
1312 1026 1313 -1160 -2084 -1844 -2046 -1565 -347 -921 -2766 -2069 -1100 -693 92 625 400 67 -78 510 452
$$ packed form
1181e50m94j326K22P29l71j044L16J546J817O47j097NJ629Q05k77k02L78j324
1199A409j986n37J429Q64q08j185m73J17J130J738l49n65K24J96l47P46J016j179
1217A440r41R05o43q26J5M96j506K91J770L94j913J63K87o94N99J283r83j089
1235i52n43l3J73J647R81j380j875K12J265K60j10M70L43j282o95R27L98n28M7
1254f75j009q09M53J257p87l50J014M47L67Q54k16r71P65J541K7k42n75j460m96
1273h65M78j33K12N51j014j353Q94J753M17R66Q6m89j0P46M71M84k53j412j188
1292C41N4K81o46j181m62P22P95p07l72P24N06J37J081P35r55k36J76q97l88J318
1312A026K87k473r24K40k02M81J218n74j845O97R69M07P85N33k25l33j45N88n8
$$ plain form
1331 452 -346 -480 -844 -843 -841 -974 -743 -1254 -1175 -584 126 135 455 54 -855 -381 873 1325 319 -172 -780 -581
1353 -581 911 1600 608 377 806 373 582 1250 1219 719 226 43 -116 368 514 -290 -427 -32 94 258
1373 258 888 547 -19 731 1858 1838 1442 951 -70 -182 497 523 31 -972 -2198 -2180 -1643 -415 -573
1392 -573 -898 -807 -417 -305 531 889 939 207 -383 -98 373 213 -428 -1032 -1352 -1529 -1051 -1141 -2005 -2027 -1333
1413 -1333 -1023 81 999 928 406 532 1244 1551 1783 1256 123 -538 -460 -23 -383 -831 -1060 -1035 -977 -629
1433 -629 518 957 408 52 893 1101 988 1028 1040 263 172 834 1340 757 -226 -296 -138 -120 -133 259 -288 -618
1455 -618 -592 -92 610 766 168 -898 -174 657 329 -28 443 -3 -764 -274 806 574 -242 -620 -392 -787
1475 -787 -667 -276 -846 -1082 -1421 -798 227 404 -275 -549 -382 259 264 339 587 469 -525 -231 1132 1440
$$ packed form
1331D52p98j34l64JKj33K31n11P9N91P10RL20m01r09M74J254M52j006m91o08J99
1353e81J492O89r92k31M29m33K09O68l1n00m93j83j59M84J46q04j37L95J26J64
1373B58O30l41n66P50J127k0l96m91j021j12O79K6m92j003j226J8N37J228j58
1392e73l25R1L90J12Q36L58N0p32n90K85M71j60o41o04l20j77M78r0q64k2O94
1413a333L10J104R18p1n22J26P12L07K32n27j133o61P8M37l60m48k29K5N8L48
1433f29J147M39n49l56Q41K08j13M0J2p77r1O62N06n83r83p0J58J8j3L92n47l30
1455f18K6N00P02J56n98j066P24Q31l28l57M71m46p61M90J080k32q16l78K28l95
1475g87J20L91n70k36l39O23J025J77o79k74J67O41NP5K48j18r94K94J363L08
$$ plain form
1495 1440 152 -674 -648 -740 -375 72 -598 -1196 -716 -571 -597 690 1767 772 436 1227 1725 1598 1574 798
1515 798 -232 -702 -166 -431 -1440 -1241 -697 -1493 -1028 319 760 -331 -301 1044 1134 1017 986 683 8
1534 8 -150 603 230 220 122 -957 -1760 -743 -157 -846 -1039 -950 -693 -542 1072 1352 -13 303 788 286
1554 286 34 709 216 -478 -614 76 87 -159 2 -778 -1364 -328 340 -104 -508 -402 -322 -51 972 1412
1574 1412 372 -34 -275 -160 -38 838 495 -458 -886 -75 107 -269 754 354 -733 -704 151 -246 -614
1593 -614 94 -87 -1003 -245 752 604 -165 894 987 997 968 871 -377 -913 -161 -88 -769 -267 -672 -1344 -995
1614 -995 213 404 52 374 -129 -543 350 1330 1163 724 705 389 -93 317 365 -105 -848 -803 -834 -1027 -650
1635 -650 -325 -954 -750 992 1349 92 272 419 276 -46 1557 1284 -129 -488 -375 -671 -273 562 -139
$$ packed form
1495A440j288q26K6r2L65M47o70n98M80J45k6J287J077r95l36P91M98j27k4p76
1515G98j030m70N36k65j009J99N44p96M65J347M41j091L0J345R0j17l1l03o75
1534Hj58P53l73j0r8j079q03J017N86o89j93Q9K57J51J614K80j365L16M85n02
1554B86k52O75m93o94j36O90J1k46J61p80n86J036O68m44m04J06Q0K71J023M40
1574A412j040m06k41J15J22Q76l43r53m28Q11J82l76J023m00j087K9Q55l97l68
1593f14P08j81r16P58R97j48p69J059R3J0k9r7j248n36P52P3o81N02m05o72L49
1614i95J208J91l52L22n03m14Q93R80j67m39j9l16m82M10M8m70p43M5l1j93L77
1635f50L25o29K04J742L57j257J80J47j43l22J603k73j413l59J13k96L98Q35p01
$$ plain form
1654 -139 -1276 -1114 -806 -683 135 780 -160 -444 236 517 255 1152 1339 148 -330 254 320 -885 -961 -205
1674 -205 -397 -1078 -297 -253 -605 -765 619 474 -38 145 37 -655 -79 727 926 761 502 -327 -456 247
1694 247 976 99 -309 -173 -770 -880 178 570 -262 -460 61 291 126 421 653 311 308 789 589 774
1714 774 468 -83 -217 52 457 -92 -747 -752 -707 -891 15 498 -70 -868 -337 88 100 981 695 268 -233
1735 -233 216 378 491 190 -399 -914 -723 -603 -939 -581 -190 -1007 -1321 -202 440 -398 -745 286 528
1754 528 255 428 1027 265 -219 270 219 -186 -27 -556 -1132 -1068 -366 311 341 -300 -193 -348 195 592 569
1775 569 -126 211 714 276 851 1442 773 -106 220 676 108 -108 -21 -582 -1064 -243 527 -130 -616 163
1795 163 80 124 583 1036 358 269 -18 88 491 1024 151 -723 -837 -407 -408 -456 -560 -741 -624 -738 -408 -59
$$ packed form
1654a39j137J62L08J23Q18O45r40k84O80K81k62Q97J87j191m78N84O6j205p6P56
1674b05j92o81P81M4l52j60J384j45n12J83j08o92N76Q06J99j65k59q29j29P03
1694B47P29q77m08J36n97j10J058L92q32j98N21K30j65K95K32l42lM81k00J85
1714G74l06n51j34K69M05n49o55nM5j84R06M83n68p98N31M25J2Q81k86m27n01
1735b33M49J62J13l01n89n15J91J20l36L58L91q17l14J119O42q38l47J031K42
1754E28k73J73N99p62m84M89n1m05J59n29n76O4P02O77L0o41J07j55N43L97k3
1775E69o95L37N03m38N75N91o69q79L26M56n68k16Q7n61m82Q21P70o57m86P79
1795A63q3M4M59M53o78q9k87J06M03N33q73q74j14M30jm8j04j81J17j14L30L49
$$ plain form
1817 -59 230 -52 -341 -102 332 565 93 -248 229 37 -51 182 -195 -952 -874 -479 -499 -342 24 -262 -839
1838 -839 -610 102 459 582 13 192 204 804 701 555 130 40 -151 238 317 116 -170 -581 -327 -133 322
1859 322 1032 392 31 61 468 699 947 686 430 166 394 959 620 -54 -53 -435 -245 196 215 -160 -736
1880 -736 -861 -405 -74 -56 -293 -362 -278 -134 254 625 224 -66 -439 -99 -85 19 42 -580 -754 -576 -392 -435
1902 -435 -428 -1064 -820 -678 -214 -27 450 111 71 157 976 845 608 409 112 -209 39 352 426 -243 -713 -364
1924 -364 -312 98 -110 -110 31 174 798 1110 1034 627 673 880 517 489 736 309 -471 -202 175 175 -288 -708 -990
1947 -990 -530 -151 47 413 336 -117 -79 283 483 789 464 -46 -500 -443 -171 -89 -342 -614 -818 -515 -629
1968 -629 -644 -341 -404 -825 -781 -104 -46 -346 31 73 -161 304 438 6 -362 -552 -372 254 249 220 -454 -851 -519
$$ packed form
1817e9K89k82k89K39M34K33m72l41M77j92q8K33l77p57P8L95k0J57L66k86n77
1838h39K29P12L57J23n69J79J2O00j03j46m25r0j91L89P9k01k86m11K54J94M55
1859C22P10o40l61L0M07K31K48k61k56k64K28N65l39o74Jl82J90M41J9l75n76
1880g36j25M56L31J8k37o9Q4J44L88L71m01k90l73L40J4J04K3o22j74J78J84m3
1902d35Po36K44J42M64J87M77l39m0Q6Q19j31k37j99k97l21K48L13P4o69m70L49
1924c64N2M10k08%J41J43O24L12p6m07M6K07l63k8K47m27p80K69L77%m63m20k82
1947i90M60L79J98L66p7m53L8L62K00L06l25n10m54N7K72Q2k53k72k04L03j14
1968f29j5L03o3m21M4O77N8l00L77M2k34M65J34m32l68j90J80O26nk9o74l97L32
$$ plain form
1991 -519 116 393 189 -268 -260 104 193 745 1141 555 150 319 618 471 457 744 483 96 125 377 277 -112
2013 -112 -92 -48 -207 17 163 -20 -362 -35 472 1004 417 112 53 524 544 363 458 -145 -971 -865 -498 -489
2035 -489 -490 -731 -748 -1145 -1111 -656 213 32 28 111 179 162 310 378 -93 -679 -308 -58 -551 -971 -1150 -872 -407
2058 -407 -310 -178 -344 -78 -531 268 858 1094 738 310 -128 161 391 777 568 31 -438 -300 89 49 158
2079 158 246 -15 -95 550 633 443 757 507 380 673 384 675 285 459 270 403 357 418 65 38 74 -31
2101 -31 98 189 -363 -626 -443 -240 -118 -136 -103 -690 -678 143 264 -71 69 -1 -182 -239 -124 -71 -154 -797 -1041
2124 -1041 -544 -437 -902 -1102 -852 -745 -407 -73 -3 -74 -198 -147 310 622 630 381 232 -73 -233 22 509
2145 509 -307 -458 -791 -513 -366 376 177 236 284 651 805 642 1127 1077 521 458 615 740 595 42 -247
$$ packed form
1991e19O35K77k04m57QL64Q9N52L96n86m05J69K99j47j4K87k61l87K9K52j00l89
2013a12K0M4j59K24J46j83l42L27N07N32n87l05n9M71K0j81R5o03q26J06L67R
2035d89jk41j7l97L4M55Q69j81mQ3O8j7J48O8m71n86L71K50m93m20j79K78M65
2058d07R7J32j66K66m53P99N90K36l56m28m38K89K30L86k09n37m69J38L89m0J09
2079A58Q8k61q0O45Q3j90L14k50j27K93k89K91l90J74j89J33m6O1l53k7L6j05
2101c1J29R1n52k63J83K03J22j8L3n87J2Q21J21l35J40p0j81n7J15N3q3o43k44
2124a041M97J07m65k00K50J07L38L34P0p1j24N1M57L12Qk49j49l05j60K55M87
2145E09q16j51l33K78J47P42j99N9M8L67J54j63M85n0n56o3J57J25j45n53k89
$$ plain form
2166 -247 -140 -443 -432 -98 -15 -489 117 189 377 729 713 274 434 715 607 404 105 -287 -464 -299 10
2187 10 -246 -709 -520 -705 -358 -353 -180 -537 -310 -22 88 -39 290 395 -347 -543 -223 -2 -243 -327 -346 -367
2209 -367 -586 -272 -88 1 -405 -441 -220 268 40 84 -418 -343 90 156 88 204 -72 -113 339 660 669 868 680
2232 680 168 163 460 234 116 223 142 -236 -267 366 51 104 75 306 296 593 801 688 660 616 602 522 -20 -165
2256 -165 -181 -753 -571 -406 -645 -682 -825 -586 -139 74 183 36 146 216 209 507 746 140 -668 -680 -313 -488
2278 -488 -825 -768 -764 -1056 -817 -280 26 -399 -265 124 197 458 796 576 274 232 222 571 69 -261 -547 -423
2300 -423 -433 -211 -115 111 201 63 124 136 692 484 531 305 334 469 677 595 -154 48 155 85 -124 374 -99
2323 -99 -41 -58 291 266 193 140 -295 -54 13 245 207 72 -481 -339 182 278 198 37 -45 -392 -504 -36 166 -239
$$ packed form
2166b47J07l03J1L34Q3m74O06P2J88L52j6m39J60K81j08k03k99l92j77J65L09
2187A0k56m63J89j85L47NJ73l57K27K88J10j27L29J05p42j96L20K21k41q4j9k1
2209c67k19L14J84Q9m06l6K21M88k28M4n02P5M33O6o8J16k76m1M52L21RJ99j88
2232F80n12nK97k26j18J07q1l78l1O33l15N3k9K31j0K97K08j13k8m4j4q0n42j45
2256a65j6n72J82J65k39l7j43K39M47K13J09j47J10P0pK98K39o06q08j2L67j75
2278d88l37N7Mk92K39N37L06m25J34L89P3K61L38k20l02m2j0L49n02l30k86J24
2300d23j0K22R6K26R0j38O1J2N56k08M7k26K9J35K08q2p49K02J07p0k09M98m73
2323i9N8j7L49k5p3n3m35K41O7K32l8j35n53J42N21R6q0j61q2l47j12M68K02m05
$$ plain form
2347 -239 -353 -171 -90 -376 -331 -474 -817 -543 -256 2 27 -278 -68 264 34 97 643 222 32 -289 21
2368 21 31 -161 -19 -549 -700 -616 37 121 -72 -89 266 191 586 855 854 677 194 276 528 521 88 -145 34 -586
2392 -586 -430 -220 -60 -509 -357 -106 133 278 575 247 131 339 393 648 302 -139 -347 -617 -140 -347
2412 -347 -376 -482 -807 -893 -110 -17 149 11 140 104 159 436 430 29 -289 -220 70 -268 -460 -39 -474 -490 -291
2435 -291 46 -301 -325 -259 -41 30 195 348 231 -185 -304 -230 144 406 169 27 -202 -113 367 490 414 6
2457 6 97 171 300 156 75 86 -66 144 3 231 71 -84 280 24 338 735 531 238 223 71 283 221 27
2480 27 -460 -533 -590 -235 -440 -36 -502 -346 -166 102 99 239 277 216 -26 274 318 175 -20 -325 -360 -247 -434
2503 -434 -633 -391 -849 -554 -231 -76 66 166 -2 196 260 405 558 147 0 -37 265 180 97 16 -159 -573
$$ packed form
2347b39j14J82Q1k86M5j43l43K74K87K58K5l05K10L32k30O3N46m21j90l21L10
2368B1J0j92J42n30j51Q4O53Q4j93j7L55p5L95K69jj77m83Q2K52pm33k33J79o20
2392e86J56K10J60m49J52K51K39J45K97l28j16K08N4K55l46m41k08k70M77k07
2412c47k9j06l25q6P83R3J66j38J29l6N5K77om01l18O9K90l38j92M21m35j6J99
2435b91L37l47k4O6K18P1J65J53j17m16j19P4L74K62k37j42k29Q9M80J23p6m08
2457FR1P4J29j44q1J1j52K10j41K28j60j55L64k56L14L97k04k93j5j52K12o2j94
2480B7m87p3n7L55k05M04m66J56J80K68lJ40L8o1k42L00M4j43j95l05l5J13j87
2503d34j99K42m58K95L23J55J42J00j68J98O4J45J53m11j47l7L02q5q3q1j75m14
$$ plain form
2525 -573 -507 -182 -19 -257 -501 -48 73 158 333 613 504 5 295 557 261 218 47 -147 -311 -136 207
2546 207 -246 -605 -156 -163 -21 -66 -37 -62 -116 270 339 270 234 74 17 116 392 267 233 -30 -519 -363 85 202
2570 202 -158 -181 -131 -251 -465 -8 -20 -410 -353 229 -8 261 -104 -42 103 -3 61 292 33 -67 -77 -82 -251
2593 -251 -9 -313 -321 -407 -572 -113 1 -146 -3 32 -33 380 119 795 480 142 276 204 195 221 114 -404 -652
2616 -652 -360 122 -139 -251 114 -250 -27 565 624 703 313 352 320 140 465 279 -308 -307 -239 -193 -462 11 -330
2639 -330 -159 -394 296 155 -148 -9 196 -301 157 867 205 -6 -46 47 -424 7 369 96 -458 -254 72
2660 72 -33 -207 153 -212 -248 -20 289 -9 -96 136 75 124 98 89 208 249 -208 -132 102 158 -227 -480 8 -171
2684 -171 -161 119 -46 -351 -484 170 -78 196 73 215 51 128 342 838 257 -207 -218 -232 -27 225 50
$$ packed form
2525e73O6L25J63k38k44M53J21Q5J75K80j09m99K90K62k96m3j71j94j64J75L43
2546B07m53l59M49pJ42m5K9k5n4L86O9o9l6j60n7R9K76j25l4k63m89J56M48J17
2570B02l60k3N0j20k14M57j2l90N7N82k37K69l65O2J45j06O4K31k59j00j0nj69
2593b51K42l04qq6j65M59J14j47J43L5o5M13k61O76l15l38J34p2rK6j07n18k48
2616f52K92M82k61j12L65l64K23N92N9P9l90L9l2j80L25j86n87JO8M6k69M73l41
2639c30J71k35O90j41l03J39K05m97M58P10o62k11m0R3m71M31L62k73n54K04L26
2660G2j05j74L60l65l6K28L09k98q7K32o1M9k6rJ19M1m57P6K34N6l85k53M88j79
2684a71J0K80j65l05j33O54k48K74j23J42j64P7K14M96n81m64j1j4K05K52j75
$$ plain form
2705 50 -393 -401 -345 -162 23 64 -401 -128 2 188 8 355 240 163 -19 440 207 291 -317 -227 -230 -149 58 -129
2729 -129 -330 -377 -267 12 -176 502 388 -246 290 192 686 352 30 63 -18 142 -148 137 -219 -502 -475 -398
2751 -398 -71 194 -286 -69 -133 346 -37 495 116 17 -316 290 271 146 165 112 -355 -333 -48 -62 -353 -303 -275
2774 -275 -81 -38 281 74 -225 -7 83 358 279 405 132 -28 -124 -1 -68 -86 -162 -438 -263 -128 12 28 -38
2797 -38 -234 -142 150 88 77 -136 110 287 111 245 364 -39 -51 426 165 26 282 14 -160 -116 -99 -95 -191
2820 -191 -108 -65 -18 -84 235 219 188 90 22 220 129 226 104 -266 -47 -26 -190 -92 62 -434 -458 -273 -384 -289 -96
2845 -96 -54 -29 -240 509 580 -24 80 -13 -156 178 305 21 -175 -234 -274 -36 -232 -276 -202 -416 -308 54 390
2868 390 163 118 -100 208 470 297 234 77 59 89 113 225 -113 -337 -63 -256 73 -55 109 -112 -117 -323
$$ packed form
2705E0m43qN6J83J85M1m65K73J30J86j80L47j15p7j82M59k33Q4o08R0lQ1K07j87
2729a29k01m7J10K79j88O78j14o34N36r8M94l34l22L3q1J60k90K85l56k83K7P7
2751c98L27K65m80K17o4M79l83N32l79r9l33O06j9j25J9n3m67K2K85j4k91N0K8
2774b75J94M3L19k07k99K18R0K75p9J26k73j60r6J23o7j8p6k76J75J35J40J6o6
2797c8j96R2K92o2j1k13K46J77j76J34J19m03j2M77k61j39K56k68j74M4J7Mr6
2820a91Q3M3M7o6L19j6l1r8o8J98r1R7j22l70K19K1j64R8J54m96k4J85j11R5J93
2845i6M2K5k11P49P1o04J04r3j43L34J27k84j96n9m0K38j96m4P4k14J08L62L36
2868C90k27m5k18L08K62j73o3j57j8L0K4J12l38k24K74j93L29j28J64k21nk06
$$ plain form
2890 -323 527 192 264 159 -85 47 112 372 30 60 -444 -101 6 27 12 -62 -442 -335 -367 -218 -88 -620
2912 -620 -158 58 -119 118 221 90 -137 -241 -156 141 -205 -18 137 -187 -165 54 -77 -139 -720 -632 -46
2933 -46 -49 45 -229 -50 235 -20 159 411 261 318 128 -72 38 415 17 121 -196 -4 -24 256 3 -194
2955 -194 -236 73 236 250 557 201 208 33 189 488 143 160 -74 -35 141 85 -74 -293 -198 -184 -130 -238 -162 78
2979 78 -302 -260 -49 163 -133 31 203 -177 8 218 15 -285 -421 -3 0 -212 54 -133 -476 -397 -332 -63
3001 -63 207 -190 -198 -155 4 28 19 52 48 -111 111 139 -79 -225 -111 -89 -380 -73 99 -275 -392 -423 79 297
3025 297 305 325 73 -254 128 624 548 312 -43 9 72 155 382 124 174 -54 -185 -44 104 -4 -73 315 90
3048 90 -63 214 411 187 -57 81 288 157 301 134 -300 -395 70 -67 -421 -494 -267 -250 -249 95 185 -81
$$ packed form
2890c23Q50l35P2j05k44J32O5K60l42L0n04L43J07K1j5p4l80J07l2J49J30n32
2912f20M62K16j77K37J03j31k27j04Q5K97l46J87J55l24K2K19j31o2n81Q8N86
2933d6lR4k74J79K85k55J79K52j50N7j90k00J10L77l98J04l17J92k0K80k53j97
2955a94m2L09J63J4L07l56Pj75J56K99l45J7k34L9J76n6j59k19R5J4N4j08P6K40
2979G8l80M2K11K12k96J64J72l80J85K10k03l00j36M18Lk12K66j87l43P9O5K69
3001f3K70l97qM3J59K4rL3mj59K22K8k18j46J14K2k91L07J72l74j17l1N02K18
3025B97QK0k52l27L82M96p6k36l55N2O3Q3K27k58N0k28j31J41J48j08o9L88k25
3048I0j53K77J97k24k44J38K07j31J44j67m34r5M65j37l54p3K27J7JL44R0k66
$$ plain form
3070 -81 -317 -107 7 -186 162 -86 -84 -187 -38 101 -89 -223 -257 -648 -159 -62 -109 -106 -188 -151 -114 -133 325 -27
3094 -27 -133 20 139 433 416 506 -29 137 297 414 178 12 -5 137 -69 -16 -110 23 -288 222 -76 129
3116 129 296 293 -91 -201 192 295 397 311 230 -277 -169 -151 -137 -188 -267 -553 -184 40 62 -271 182 -58 -94
3139 -94 175 253 287 -98 -21 186 87 -27 201 -278 -493 -422 -307 -249 -57 -390 -261 -275 -192 110 -60 132 -48
3162 -48 -413 62 205 81 119 180 21 -257 65 332 -98 -394 -203 119 -123 -94 -155 298 168 42 274 94
3184 94 202 -70 340 293 271 137 208 16 18 158 -223 194 -121 -22 -157 243 -65 14 219 104 -273 -123 83
3207 83 78 284 190 -207 -38 187 278 108 -186 -295 -377 -322 -96 -364 -363 -278 -51 7 -223 122 -129 -13 -252 138
3231 138 193 193 283 290 -197 -63 224 79 -74 -227 -157 -144 -383 177 -163 -399 57 192 -4 370 102 314 167
$$ packed form
3070h1k36K10J14j93L48k48Kj03J49J39j90j34l4l91M89R7m7Lq2L7L7j9M58l52
3094b7j06J53J19K94j7R0n35J66J60J17k36j66j7J42k06N3r4J33l11N10k98K05
3116A29J67ll84j10L93J03J02q6q1n07J08J8J4n1p9k86L69K24K2l33M53k40l6
3139i4K69P8L4l85P7K07r9j14K28m79k15P1J15N8J92l33J29j4Q3L02j70J92j80
3162d8l65M75J43j24L8O1j59k78L22K67m30k96J91L22k42K9o1M53j30j26K32j80
3184I4J08k72M10m7k2j34P1j92KJ40l81M17l15R9j35M00l08P9K05j15l77J50K06
3207H3nK06r4l97J69K25R1j70k94j09q2N5K26k68JQ5K27N8k30L45k51J16k39L90
3231A38N5%R0Pm87J34K87j45j53j53P0J3k39N60l40k36M56J35j96L74k68K12j47
$$ plain form
3254 167 278 279 332 -39 74 -120 -146 48 169 67 -224 -215 124 -76 8 209 -261 207 247 639 400 130 136
3277 136 64 129 -130 175 -176 -198 -283 -221 47 221 -231 -127 -208 52 -113 -71 75 -4 104 -85 362 609 236
3300 236 -276 -307 -464 -108 -346 7 -210 -300 -259 -315 -94 -2 -106 -70 -158 -135 168 22 92 271 -207 144 206
3323 206 414 324 66 -72 111 57 204 191 120 -224 -179 265 152 -110 -75 -80 230 251 342 269 119 73 371 368 187
3348 187 63 -298 -10 -111 55 272 -114 -231 -371 -411 45 101 -28 -75 220 -155 317 89 151 15 70 -50
3370 -50 -179 113 -6 -474 -370 -453 -169 19 -335 -285 -40 -363 -81 90 354 227 -13 244 272 -18 54 -207
3392 -207 81 -359 -223 -61 -442 -278 -214 -155 41 207 196 120 85 39 25 416 -38 156 40 25 198 166 189
3415 189 -37 225 226 111 184 157 259 113 -3 -224 21 190 -105 -39 124 -124 128 228 43 75 -261 81
$$ packed form
3254A67J11JN3l71J13j94k6J94J21j02k91RL39k00Q4K01m70M68M0L92k39k70O
3277A36p2O5k59L05l51k2q5O2K68J74m52J04q1K60j65M2J46p9J08j89M47K47l73
3300B36n12l1j57L56k38L53k17r0M1n6K21R2j04L6q8K3L03j46P0J79m78L51O2
3323B06K08r0k58j38J83n4J47j3p1l44M5M44j13k62L5nL10K1R1p3j50m6K98lj81
3348A87j24l61K88j01J66K17l86j17j40m0M56N6j29m7K95l75M72k28O2j36N5j20
3370e0j29K92j19m68J04q3K84J88l54N0K45l23K82J71K64j27k40K57K8k90P2k61
3392b07K88m40J36J62l81J64O4N9J96J66j1p6l5m6j4L91m54J94j16j5J73l2K3
3415A89k26K62Jj15P3k7J02j46j16k21K45J69k95O6J63k48K52J00j85L2l36L42
$$ plain form
3437 81 -76 282 163 8 -152 -10 -146 -99 14 -94 -319 -118 245 -30 -127 -189 -92 130 -24 166 95 -101
3459 -101 -101 -180 -370 -110 9 -146 -205 -165 -576 22 106 -333 -198 -13 -2 431 385 161 415 168 -5 202 5
3482 5 -46 148 -352 -196 -57 -155 -246 -217 -107 -82 -55 406 231 32 162 282 281 222 466 155 -91 84 113 186
3506 186 67 -67 -362 -204 -117 25 -177 -30 -172 -62 342 191 -114 133 241 27 291 200 180 -79 -73 -245
3528 -245 49 -346 -36 -416 -20 -305 63 178 236 -144 -25 -220 55 -84 5 86 16 87 36 361 -4 176
3550 176 2 18 -111 -39 37 -139 131 -167 -68 -164 87 91 -50 -94 49 186 122 -123 196 95 101 54 100 -2
3574 -2 -174 -192 -221 -112 -105 -235 -214 -178 -96 123 95 127 228 -4 39 284 205 -33 177 -144 151 79 -81 -209 -164
3599 -164 -281 -142 46 -10 -30 49 -85 -38 143 136 110 -10 126 73 269 208 62 -218 -285 -209 -69 -113 -54 41 -21
$$ packed form
3437H1j57L58j19j55j60J42j36M7J13j08k25K01L63k75r7o2R7K22j54J90p1j96
3459a01%p9j90K60J19j55n9M0m11N98Q4m39J35J85J1M33m6k24K54k47j73K07j97
3482En1J94n00J56J39r8r1K9J10K5K7M61j75j99J30J20jn9K44l11k46J75K9P3
3506A86j19j34k95J58Q7J42k02J47j42J10M04j51l05K47J08k14K64r1k0k59Oj72
3528b45K94l95L10l80L96k85L68J15N8l80J19j95K75j39Q9Q1p0P1n1L25l65J80
3550A76j74J6j29P2P6j76K70k98R9r6K51Mj41m4J43J37o4k45L19j01Om7M6j02
3574bj72j8k9J09Pj30K1L6Q2K19k8L2J01k32M3K45p9k38K10l21K95p2j60j28M5
3599a64j17J39J88n6k0P9j34M7J81pk6j20J36n3J96o1j46k80o7P6J40m4N9R5o2
$$ plain form
3624 -21 -311 -60 198 46 331 100 31 38 175 88 111 -138 -82 94 59 48 -5 -132 -487 -101 2 24 -26 -32 -241
3649 -241 -186 243 -106 -62 357 61 165 129 -157 9 115 50 151 75 111 100 -71 -92 -207 148 30 149 43
3672 43 3 5 216 145 97 40 220 80 240 126 -28 -110 -35 -165 30 176 -352 -190 -201 -119 -44 239 69 127
3696 127 -152 121 77 217 244 109 206 -156 265 218 135 99 -232 -104 -246 -118 87 -236 -238 10 -6 147 230
3719 230 -15 -83 120 175 250 114 250 -14 -33 108 22 -152 -217 -113 -86 -117 42 -96 -215 11 -78 94 235
3742 235 115 169 -105 96 -113 48 -15 -101 -261 -201 83 -120 -6 16 -180 -265 -15 72 -113 -16 192 -8 290
3765 290 -86 410 138 268 10 50 90 113 -198 -192 -97 -332 182 9 31 -39 -194 -159 -120 -102 -22 -49 -54 -125 -165 159
3791 159 -9 118 114 64 -104 -229 -35 -201 -100 -122 -282 -61 -18 -93 -337 -7 263 36 94 9 193 -68 62
$$ packed form
3624b1k90K51K58j52K85k31o9PJ37q7K3k49N6J76l5j1n3j27l55L86J03K2n0ok09
3649b41N5M29l49M4M19k96J04l6k86J66J06o5J01p6L6j1j71k1j15L55j18J19j06
3672D3m0KK11p1m8n7J80j40J60j14j54q2P5j30J95J46n28J62j1Q2P5K83j70N8
3696A27k79K73m4J40K7j35R7l62M21m7q3l6l31J28j42J28K05l23kK48j6J53Q3
3719B30k45o8K03N5P5j36J36k64j9J41q6j74o5J04K7l1J59j38j19K26q9J72J41
3742B35j20N4k74K01k09J61o3q6j60O0K84k03J14K2j96q5K50Q7j85R7K08k00K98
3765B90l76M96k72J30k58M0M0K3l11OR5k35N14j73K2p0j55L5L9J8Q0k7np1m0L24
3791A59j68J27mn0j68j25J94j66J01k2j60K21M3p5k44L30K70k27N8q5J84k61J30
$$ plain form
3814 62 -10 88 149 -115 -40 -41 257 95 -169 -235 10 -428 182 21 145 -119 12 88 55 -8 212 -51 -73 20
3838 20 123 -68 236 -51 -161 -70 -77 -51 -164 -57 -100 77 176 49 0 64 301 -32 104 336 168 -107 -58
3861 -58 40 161 -65 -80 136 -194 303 -179 -44 -83 -60 -257 -87 63 -60 -30 14 208 31 5 164 83 100
3884 100 91 -280 220 135 -138 2 -40 -238 -153 23 38 12 -57 340 -185 125 -40 107 53 60 11 -110 27 -18
3908 -18 -104 75 -148 -189 -10 -156 -100 39 -125 107 220 97 162 -7 60 211 271 320 -161 120 119 55 51 81 -227
3933 -227 -141 245 -152 -91 -228 -27 -249 -171 155 307 49 160 30 56 175 172 -7 -88 -174 -163 -184 -84 -94 -249
3957 -249 -145 -238 6 -81 184 -94 118 -48 -202 156 -51 296 27 129 -129 252 28 -152 -38 -185 88
3978 88 -123 -19 -310 34 2 54 -34 130 3 243 120 270 226 476 139 138 163 -184 274 288 -81 -40 -129 -126
$$ packed form
3814F2p2R8O1k64P5jK98j62k64o6K45m38O10j61J24k64J31P6l3o3K20k63k2R3
3838B0J03j91L04k87j10R1pK6j13J07m3J77R9j27m9O4K37l33J36K32j68k75M9
3861e8R8J21k26j5K16l30M97m82J35l9K3j97J70J50j23L0M4J94j77k6J59q1J7
3884A00rl71N00q5k73J40m2j98Q5J76J5k6o9L97n25L10j65J47n4Pm9j21J37m5
3908a8q6J79k23m1J79j46N6J39j64K32J13j23O5j69O7J51O0M9m81K81jo4mL0l08
3933b27Q6L86l97O1j37K01k22P8L26J52k58J11j30K6J19lj79q1q6J1k1J00j0j55
3957b49J04r3K44q7K65k78K12j66j54L58k07L47k69J02k58L81k24j80J14j47K73
3978H8k11J04k91L44l2N2q8J64j27K40j23J50m4K50l37jK5l47M58J4l69M1q9L
$$ plain form
4002 -126 93 -217 15 -97 155 -9 -356 -51 -8 -246 48 33 135 121 -147 36 112 -189 -153 -241 4 -201
4024 -201 -408 -133 -24 329 -35 12 6 -217 62 -73 389 28 -198 137 -66 183 53 62 250 -18 -2 34
4046 34 -85 -13 65 -168 7 39 91 -69 -74 -18 300 55 179 -179 237 92 -9 73 28 13 -302 -155 -152 -70 -75
4071 -75 -111 -151 92 -25 119 66 19 97 84 244 123 159 190 56 -7 -6 -212 10 48 -118 17 -278 -112 55
4095 55 -89 -134 -82 -138 -34 -32 115 -54 -238 89 -26 35 123 53 -16 -379 -154 170 -121 19 -346 -100 75
4118 75 171 330 -87 198 133 340 188 90 236 41 90 34 88 -41 -28 -255 -157 -28 262 -69 -128 148 1
4141 1 -50 147 215 189 184 48 -169 228 293 55 -1 127 -161 254 65 -48 -96 119 -299 -122 51 -275 -269 -39
4165 -39 14 79 132 32 2 -27 -175 -133 -222 -122 -75 -233 -201 -98 -236 -372 -294 -472 5 -182 -83 -198 -58 36
$$ packed form
4002a26K19l10K32j12K52j64l47L05M3k38K94j5J02j4k68J83P6l01L6q8K45k05
4024b01k07K75J09L53l64M7ok23K79j35M62l61k26L35k03K49j30RJ88k68J6L6
4046C4j19P2P8k33J75L2N2j60nN6L18k45J24l58M16j45j01Q2m5j5l15J47LQ2n
4071g5l6m0K43j17J44n3m7P8j3J60j21L6L1j34o3Jk06K22L8j66J35k95J66J67
4095E5j44m5N2n6J04KJ47j69j84L27j15O1Q8p0o9l63K25L24k91J40l65K46J75
4118G5R6J59m17K85o5K07j52r8J46j95M9n6N4j29J3k27R8J29K90l31n9K76j47
4141An1J97O8k6nj36k17L97O5k38n6J28k88M15j89j13m8K15m18J77J73l26OK30
4165c9N3O5N3j00l0k9j48M2q9J00M7j58L2J03j38j36P8j78M77j87R9j15J40R4
$$ plain form
4189 36 46 -172 64 37 71 -89 -197 5 -64 263 173 -74 -272 -53 77 78 -49 -16 -295 -68 173 87 158 4
4213 4 -31 64 294 154 -29 88 197 76 45 -22 -121 31 -151 45 52 181 144 -18 4 -4 74 183 65 9 -90
4238 -90 37 283 -33 2 -307 -279 -234 -204 -146 -150 -270 -137 -131 -78 -141 145 21 16 -170 65 27 127 86 -28 -329
4263 -329 -5 84 -92 87 -84 -61 -39 -124 22 -20 -92 131 -67 38 120 337 123 217 -128 444 -9 -40 -143
4286 -143 56 -11 296 210 -76 20 -243 -135 310 -12 -83 -157 -62 -15 -22 89 165 -140 -183 147 -62 17 -20 -53 -204
4311 -204 -39 -163 67 -192 -76 -148 -162 -5 147 49 -99 -139 34 122 377 42 -20 12 167 26 171 -66
4333 -66 -47 -30 -49 -64 -353 -235 -19 -16 -16 153 21 -149 -289 14 81 -54 40 157 311 41 -241 153 193 -142
4357 -142 -105 -2 -169 -150 -11 -5 -6 83 104 260 246 239 -73 38 142 196 59 65 130 -286 29 42 -91 12 -87 -111
$$ packed form
4189C6J0k18K36k7L4j60j08K02o9L27r0k47j98K19J30Jj27L3k79K27K41q6P1j54
4213Dl5R5K30j40j83J17J09j21l1o7r9J52j82J96PJ29l7j62K2qP8J09j18n6r9
4238i0J27K46l16L5l09K8M5L0N8mj20J33ON3o3K86j24nj86K35l8J00m1j14l01
4263c29L24Q9j76J79j71K3K2q5J46m2p2K23j98J05Q2K17k14R4l45N72m53l1j03
4286a43J99o7L07q6k86R6k63J08M45l22p1p4R5M7pJ11P6l05m3L30k09P9l7l3j51
4311b04J65j24K30k59J16p2j4J57J52r8j48m0J73Q8K55l35o2L2J55j41J45k37
4333f6J9J7j9j5k89J18K16L%J69j32j70j40L03O7j35R4J17J54k70k82L94M0l35
4357a42L7J03j67J9J39OjQ9K1J56j4pl12J11J04N4j37OO5m16L15J3j33J03r9k4
$$ plain form
4383 -111 -237 -91 -149 151 135 -143 -301 104 52 -119 -7 -233 -121 133 96 -75 -119 -65 -145 -40 108 172 -73
4406 -73 49 -112 91 -59 45 214 -137 -24 -47 134 -20 -153 36 203 70 34 -21 -77 120 -42 -86 -166
4428 -166 -64 -66 4 165 24 33 181 -188 -91 -138 -149 92 -78 315 168 361 18 -123 113 -126 -170 -107 -135 -64
4452 -64 67 71 -206 -56 88 74 -137 235 128 -270 72 -108 14 73 -109 -199 -350 -177 -9 -73 19 -115 -18
4475 -18 80 -37 17 116 37 11 19 47 19 -34 445 23 3 68 40 17 -168 -64 165 -8 -160 -53 -296 28 -31
4500 -31 192 227 298 -262 -31 71 149 -117 -1 -5 -32 50 -75 73 -1 8 73 90 -143 -174 -10 -234 -62 119 -237
4525 -237 440 26 60 172 93 102 252 -15 130 -31 -134 -30 -127 -170 148 -226 -216 27 145 178 -217 -242 -318
4548 -318 -2 187 -5 112 53 262 -76 228 305 94 -75 -19 93 229 -24 7 -145 155 10 -30 -16 -82
$$ packed form
4383a11j26J46n8L00j6k78j58M05n2j71J12k26J12K54l7j71m4N4q0J05J48O4k45
4406g3J22j61K03j50J04J69l51J13k3J81j54j33J89J67j33l6n5n6J97j62m4q0
4428a66J02kP0J61j41RJ48l69R7m7j1K41j70L93j47J93l43j41K36k39m4O3k8P1
4452f4J31Mk77J50J44j4k11L72j07l98L42j80J22N9j82r0j51J73J68o4R2j34R7
4475a8R8j17N4R9p9k6QK8k8n3M79m22k0O5k8k3j85J04K29j73j52J07k43L24n9
4500c1K23L5P1n60K31J02P8k66J16mk7Q2j25J48p4RO5J7k33l1J64k24J72J81l56
4525b37O77m14L4J12p9RJ50k67J45j61j03J04r7m3L18l74J0K43J18L3l95k5p6
4548c18L16J89j92J17n9K09l38L04P7k11j69N6J12J36k53L1j52L00j45m0J4o6
$$ plain form
4570 -82 -2 95 151 55 192 -13 -106 14 -212 -83 263 182 -174 -52 -13 -241 -91 -281 -51 6 232 -20 -9
4593 -9 294 74 52 -126 145 -17 -70 -220 -140 -198 -192 -55 -19 -13 -238 35 59 91 -36 349 50 16 305 251 -274
4618 -274 123 -6 -90 -48 -31 173 62 60 -152 -338 -155 -103 -88 -16 145 96 177 124 91 -59 -52 140 190 117 418
4643 418 -127 27 22 154 -16 129 -119 88 39 8 115 -152 -287 237 -120 88 238 137 121 -94 229 22
4665 22 -72 -109 -76 15 -262 83 -129 -21 -2 7 -34 -99 -39 22 -322 116 -114 32 -20 49 90 87 107 22 99 -87 33
4692 33 -22 138 -29 39 96 59 -136 -222 -113 71 -90 64 131 -20 400 227 155 -57 -183 -99 106 4 -30
4715 -30 -164 195 -327 -185 -195 166 201 199 21 98 207 32 113 166 88 90 -188 180 67 -261 84 -152 77 -107
4739 -107 -78 -222 -55 -104 -19 40 66 -59 -10 -53 66 205 -121 -57 -38 82 -74 137 -64 85 98 -262 -4
$$ packed form
4570h2Q0R7N6r6J37k05r3J20k26J29L46q1l56J22L9k28J50j90K30N7K26k52J1
4593iL03k20k2j78K71j62n3j50Q0n8OJ37L6Ok25K73K4L2j27L85k99l4K89n4n25
4618b74L97j29q4M2J7K04j11kk12j86J83N2J5P2J61m9Q1n3l3j50PJ92N0p3L01
4643D18n45J54nJ32j70J45k48K07m9l1J07k67j35N24l57K08J50j01j6k15L23k07
4665B2r4l7L3R1k77L45k12J08J9Rm1o5O0O1l44M38k30J46n2O9M1lK0q5P7j86J20
4692C3n5J60j67O8N7l7j95q6J09J84j61J54O7j51M20j73p2k12j26Q4K05j02l4
4715c0j34L59n22J42j0L61L5kj78P7J09j75Q1N3p8Kk78L68j13l28L45k36K29j84
4739a07K9j44J67m9Q5N9K6j25M9m3J19J39l26O4J9J20j56K11k01J49J3l60K58
$$ plain form
4762 -4 86 -100 37 -169 5 19 128 -17 -328 -55 -23 31 355 -64 200 212 135 -110 175 -68 -24 198 153
4785 153 54 -194 4 -127 -47 -189 62 2 146 -48 -235 65 -142 176 149 -112 107 133 -189 177 -14 1
4807 1 -73 -75 -195 74 111 23 86 -97 101 103 145 172 96 16 38 -37 256 -218 -26 121 -16 -210 48 -14 178 -157
4833 -157 -74 -128 186 168 118 20 5 76 -49 -20 253 8 7 190 -137 125 -1 -82 92 137 -71 -197 -107 16
4857 16 -93 56 77 228 132 -44 -86 105 43 141 -263 -88 202 41 214 -122 -66 -50 -143 -285 -243 69 53 57
4881 57 5 44 -19 256 72 -53 -226 104 -3 60 -53 -65 -248 58 -52 -70 173 -15 30 -193 87 -85 99
4904 99 -86 -32 269 41 -46 -59 4 4 182 22 -19 41 -151 -213 30 -105 -266 -52 -108 -77 -39 109 138 101 -37
4929 -37 -72 390 -65 186 26 30 -212 157 -71 -74 -70 -211 -229 3 111 4 113 244 133 -18 -30 87 157 32
$$ packed form
4762dR0j86J37k06J74J4J09j45l11K73L2N4L24m19K64J2p7k45K85k43M4K22m5
4785A53r9k48J98j31Q0j42K51o0J44j94j87L00k07L18k7k61K19K6l22L66j91J5
4807Ap4kj20K69L7q8O3j83J98KM2K7p6q0K2p5K93m74J92J47j37j94K58o2J92l35
4833a57Q3n4L14j8n0r8j5P1j25K9K73k45jJ83l27K62j26q1J74M5k08j26R0J23
4857A6j09J49K1J51r6j76m2J91o2R8m04J75K90j61J73l36N6J6r3j42M2L12j6M
4881E7n2L9o3K75j84j25j73L30j07O3j13j2j83L06j10j8K43j88M5k23K80j72J84
4904I9j85N4L01k28q7j3O3%J78j60m1O0j92o2K43j35j61K14n6L1L8J48K9l7j38
4929c7l5M62m55K51j60Mk42L69k28lMj41j8K32J08j07J09J31j11j51j2J17P0j25
$$ plain form
4953 32 -59 17 13 -14 84 -66 -184 -276 -265 28 -109 69 -177 -89 118 -152 -21 39 65 -76 -136 101 71 142 148 -176
4979 -176 -65 -10 22 -41 55 76 -139 -75 -21 86 19 119 -82 133 253 207 167 99 -105 215 273 188 -17 -70 -114
5004 -114 -158 30 17 -249 7 41 138 -109 -20 60 32 73 44 109 -62 -32 223 104 236 189 24 162 -77 -16
5028 -16 127 161 -121 -284 -121 -81 28 116 30 -276 -13 -77 -137 -29 -111 184 383 -108 -34 63 -137 -61 -60 -1 20
5053 20 -169 -2 65 -108 -218 -44 23 209 228 107 154 5 -77 182 -31 162 61 309 212 -21 68 122 69
5076 69 -98 6 29 164 93 108 -76 -13 -144 110 22 -118 -4 239 5 193 -60 74 -89 -3 -37 -244 64
5099 64 -33 3 -217 60 -309 -9 75 -48 -98 -137 95 214 16 -8 85 98 210 -28 -153 -298 -70 80 112
5122 112 -74 -183 -130 85 -202 -239 -148 13 -28 36 121 101 23 55 254 -128 23 -131 -324 41 -23 -150 25
$$ packed form
4953C2r1P6mk7R8j50j18r2J1K93j37J78k46Q8K07k70J31O0K6j41o0K37l0P1Ol24
4979a76J11N5L2o3R6K1k15O4N4J07o7J00k01K15J20m6m0o8k04L20N8q5k05n3m4
5004a14m4J88j3k66K56L4R7k47Q9Q0k8M1k9O5j71L0K55j19J32m7j65J38k39O1
5028a6J43L4k82j63J63M0J09Q8q6l06K63o4o0J08q2K95J99m91P4R7k00P6JN9K1
5053B0j89J67O7j73j10J74O7J86J9j21M7j49q2K59k13J93j01K48r7k33Q9N4n3
5076F9j67J04K3J35p1J5j84O3j31K54q8j40J14K43k34J88k53J34j63Q6l4k07L08
5099F4r7L6k20K77l69L00Q4j23n0l9K32J19j98k4R3J3J12k38j25j45K28J50L2
5122A12j86j09N3K15k87l7R1J61m1O4Q5k0p8L2J99l82J51j54j93L65o4j27J75
$$ plain form
5145 25 -61 35 43 10 -63 113 340 24 149 -159 47 57 97 167 141 -102 128 -81 205 -128 -38 -71 87 255
5169 255 70 64 127 41 -11 -28 9 -4 232 -99 -15 229 -210 -93 -83 -16 -42 -27 -18 182 -118 -232 -131 -119 -91 92
5195 92 83 91 32 -45 228 189 119 -94 62 10 83 -88 -27 -100 -61 -115 -6 -15 -28 -18 -35 -165 -33 18 40 -164 13
5222 13 300 122 -19 -84 -11 -147 -73 -86 118 -80 -15 -61 -4 52 -203 -1 -102 75 4 35 84 140 66 27 -59
5247 -59 242 -166 92 158 -96 -25 -192 -299 195 -214 153 87 -92 101 100 12 139 189 114 -57 -116 -73 -81 -151 -90
5272 -90 -71 39 -194 84 -77 -102 -136 32 25 -358 63 -109 195 229 -130 30 -11 12 -89 353 -16 -16 -111 -159
5296 -159 -124 139 -13 -212 44 37 49 58 -32 -194 -106 29 12 36 -50 77 215 36 87 -17 -49 -174 -309 -86
5320 -86 -273 -53 -43 62 17 -72 137 115 -173 -220 207 33 303 59 39 -1 60 -95 -12 -167 88 -19 -168
$$ packed form
5145B5q6R6Ql3p3J76K27l16J25l08K06J0M0P0k6k43K30k09K86l33R0l3J58J68
5169B55j85oO3q6n2j7L7j3K36l31Q4K44m39J17J0O7k6J5RK00l00j14J01J2K8J83
5195I2rQn9p7K73l9p0k13J56n2P3j71O1p3L9n4J09rj3J0j7j30J32N1K2k04J77
5222A3K87j78j41o5P3j36P4j3K04j98O5m6N7N6k55K02j01J77p1L1M9N6p4l9q6
5247e9L01m08K58O6k54P1j67j07M94m09L67o6j79J93jq8J27N0p5j71n9M3qp0O1
5272i0J9J10k33K78j61k5l4J68pl83M21j72L04L4l59J60m1K3j01M42l69%r5m8
5296a59L5K63j52j99K56pJ2Rr0j62Q8J35j7K4q6J27J38j79N1j04l2j25j35K23
5320h6j87K20J0J05m5q9K09k2k88m7M27j74K70k44k0m0O1j55Q3j55K55j07j49
$$ plain form
5343 -168 -329 -172 -97 -388 -291 -137 -198 20 195 355 -56 61 275 83 166 136 -257 -209 -13 -279 99 -91
5365 -91 -12 -97 93 -155 -155 -119 -110 211 218 -185 -53 -77 167 45 -30 84 182 60 196 -116 -164 -276 -114 -83 -22
5390 -22 -9 -174 108 -8 8 -49 -105 68 250 -103 79 334 -57 -116 -99 129 -190 122 -190 -54 -149 11 -24
5413 -24 68 215 50 -64 194 331 -81 -41 -211 24 168 -168 248 -10 -43 -172 -157 138 250 36 78 -32
5435 -32 -140 44 59 141 1 -140 -1 -78 278 123 -61 -128 252 114 15 86 -41 207 -104 -30 113 -100 -49
5458 -49 174 -201 316 -138 193 254 193 119 -86 143 161 -82 25 76 -72 75 34 -155 -180 -67 65 -49 -224
5481 -224 234 -93 51 -88 168 98 128 405 245 56 -308 37 225 -105 -154 -155 -38 -146 -239 -130 -149 -23
5503 -23 92 -26 -16 31 40 174 23 51 -28 -23 119 75 -172 18 -55 -82 -140 151 -5 55 73 -68 -36 -38 37 -240
$$ packed form
5343a68j61J57P5k91R7J54o1K18J75J60m11J17K14j92Q3l0l93M8J96k66L78j90
5365i1P9q5J90k48%L6RL21Pm03J32k4K44j22p5J14R8j22J36l12m8j12J62L1O1
5390b2J3j65K82j16J6n7n6J73J82l53J82K55l91n9J7K28l19L12l12J36r5J60l5
5413b4R2J47j65j14K58J37m12M0j70K35J44l36M16k58l3j29J5K95J12k14M2j10
5435c2j08J84J5Q2j40j41J39p7L56j55j84o7L80j38r9P1j27K48l11P4J43k13N1
5458d9K23l75N17m54L31O1o1p4k05K29J8k43J07N1j48J47m1j89k5J13J32j14j75
5481b24M58l27J44j39K56p0L0K77j60j89l64L45J88l30m9jJ17j08r3J09j9J26
5503b3J15j18J0M7RJ34j51K8p9NJ42m4k47J90p3k7n8K91j56O0J8j41L2kP5k77
$$ plain form
5529 -240 -39 113 324 146 90 -25 9 10 -58 -266 93 -117 -255 185 -79 -165 -120 -254 -113 -164 -12 69 -164
5552 -164 170 58 -23 186 98 7 -94 97 27 -61 132 -44 119 150 83 161 -64 -141 -53 69 73 -4 -112 -31 5
5577 5 191 48 -133 225 84 -323 80 120 -120 16 -38 -51 105 -107 98 -87 60 239 30 -113 -2 378
5599 378 87 11 128 154 85 45 257 298 -33 14 -81 -23 27 -285 -248 116 -54 -226 146 -127 47 162 84 80
5623 80 -53 -37 65 71 53 207 57 1 -48 -31 78 32 -84 -189 123 -31 -291 -31 62 -148 158 143 213 192
5647 192 -36 -11 164 414 -86 -20 -57 -104 -99 129 -56 -114 119 165 -93 -132 119 110 -29 132 293 52 -283 -165
5671 -165 261 -226 176 -35 60 142 -28 98 -372 100 -167 11 -238 -95 1 -237 188 -242 6 182 -167
5692 -167 -71 97 207 85 62 130 -19 -61 -70 -67 -229 -6 194 -64 -205 -162 5 -128 128 83 -18 -163 72
$$ packed form
5529b40K01J52K11j78n6j15L4Jo8k08L59k10j38M40k64q6M5j34J41n1J52Q1k33
5552a64L34j12q1K09q8r1j01J91p0q8J93j76J63L1o7P8k25p7Q8J22Mp7j08Q1L6
5577EJ86j43j81L58j41m07M03M0k40J36n4j3J56k12K05j85J47J79k09j43J11L80
5599C78k91p6J17K6o9m0K12M1l31M7r5N8N0l12L7L64j70j72L72k73J74J15p8m
5623H0j33J6J02Oj8J54j50n6m9J7J09m6j16j05L12j54k60K60R3k10L06j5P0k1
5647A92k28K5J75K50n00O6l7m7NK28j85n8K33M6k58l9K51rj39J61J61k41l35J18
5671a65M26m87M02k11R5Q2j70J26m70M72k67J78k49J43R6k38M25m30K48J76l49
5692a67R6J68J10j22k3O8j49m2rLj62K23K00k58j41M3J67j33K56m5j01j45K35
$$ plain form
5715 72 -330 -171 128 30 -91 44 -310 288 131 -138 154 -5 60 -19 50 -124 130 -242 176 108 70 -37
5737 -37 -75 -61 94 186 67 2 -116 -34 81 -219 -122 -109 46 -147 -140 48 -201 109 -59 26 236 75 137 201
5761 201 69 30 222 -193 -53 -16 -308 -167 -143 191 271 94 103 23 212 5 168 174 -11 95 -4 366 145
5784 145 130 -136 181 -32 -4 140 -35 -10 -64 -58 12 -100 187 -52 142 -6 -108 -4 91 6 -13 64 -7 241
5808 241 -62 84 -152 9 10 -91 -25 60 -177 61 -38 -255 99 -113 77 43 182 39 -226 169 -59 -52 -116
5831 -116 -204 108 -308 -103 -133 28 -125 280 -179 -117 -60 74 124 -151 291 44 157 118 54 33 174 20 53
5854 53 121 -154 -203 65 -203 -131 -148 -133 28 120 45 -227 -101 47 253 -8 162 23 -285 183 -154 -60 -111
5877 -111 100 56 86 -118 -253 -11 -72 9 1 52 -50 -56 50 118 34 29 -99 213 277 -58 166 27 -4 -87 260
$$ packed form
5715G2m02J59K99r8j21J35l54N98j57k69K92j59O5p9O9j74K54l72M18o8l8j07
5737c7l8J4J55R2j19o5j18Q2J15l00R7J3J55j93PJ88k49L10j68Q5K10j61O2O4
5761B01j32l9J92m15J40L7k92J41K4L34Q0j77Rq0J89k07J63Oj85J06r9L70k21
5784A45j5k66L17k13K8J44j75K5n4OP0j12K87k39J94j48j02J04R5q5j9P7p1K48
5808B41l03J46k36J61Jj01O6Q5k37K38r9k17L54k12J90l4J39j43k65L95k28Po4
5831a16q8L12m16K05l0J61j53M05m59O2N7J34N0k75M42k47J13l9o4k1J41j54L3
5854E3O8k75m9K68k68P2j7J5J61R2p5k72J26J48K06k61J70j39l08M68l37R4n1
5877a11K11m4L0k04j35K42o1Q1qN1j02oJ06O8q4nj28L12O4l35K24j39l1q3L47
$$ plain form
5902 260 -79 -169 -187 119 -79 53 125 20 248 49 22 166 -227 -89 205 51 227 -305 122 82 -209 -246
5924 -246 -52 -190 -16 -239 5 193 15 -42 -155 133 -117 64 98 -181 232 108 11 112 118 60 56 -195 142
5947 142 9 -39 83 99 -6 75 8 4 267 -33 -50 -23 33 -8 177 62 -49 -148 -71 218 -287 116 37 -24 -188
5972 -188 37 -214 -39 21 119 -89 -184 -55 176 -2 85 -123 100 131 -106 -86 -90 34 9 -9 -12 -142 -133 -259 -45
5997 -45 -118 -16 34 -256 -164 -57 92 -13 -173 56 -144 -57 -8 112 9 43 -117 -42 39 -15 -161 212 -17
$$ packed form
5902B60l39r0j8L06j98J32P2j05K28j99k7J44l93J38K94j54J76n32M27m0k91l7
5924b46J94j38J74k23K44J88j78n7j13K88k50J81L4k79M13j24r7J01On8mk51L37
5947A42j33m8J22J6j05Q1o7mK63l00j7K7N6m1J85j15j11r9P7K89n05M03p9o1j64
5972a88K25k51J75O0R8k08r5J29K31j78Q7k08K23L1k37K0mJ24k5j8lj30Rj26K14
5997d5p3J02N0k90R2J07J49j05j60K29k00Q7M9J20j03L4j60P5Q1n4j46L73k29
$$ [...]
8191A3
##END NTUPLES=NMR FID
##END=
