##TITLE=1H_Costus(feb24)-ACN-B
 CDCl3
 8 sc, 
 6.3.2024
##JCAMPDX= 6.0         $$ Bruker NMR JCAMP-DX V2.0
##DATA TYPE= NMR FID
##DATA CLASS= NTUPLES
##ORIGIN= UXNMR, Bruker Analytische Messtechnik GmbH
##OWNER= root
$$ XWIN-NMR		Version 3.5
$$ Wed Mar  6 17:35:38 2024 Russian Standard Time (UT+4h)  she@DPX200
##.OBSERVE FREQUENCY= 200.1313
##.OBSERVE NUCLEUS= ^1H
##.DELAY= (6, 6)
##.ACQUISITION MODE= SIMULTANEOUS
##.ACQUISITION SCHEME= undefined
##.AVERAGES= 8
##.DIGITISER RES= 18
##SPECTROMETER/DATA SYSTEM= spect
##.PULSE SEQUENCE= zg30
##.SOLVENT NAME= CDCl3
##.SHIFT REFERENCE= (INTERNAL, CDCl3, 0, 15.7039)
##AUDIT TRAIL= $$ (NUMBER, WHEN, WHO, WHERE, WHAT)
$$ ##TITLE= Audit trail, XWIN-NMR		Version 3.5
$$ ##JCAMPDX= 5.01
$$ ##ORIGIN= Bruker BioSpin GmbH
$$ ##OWNER= she
$$ F:/spectra/data/she/nmr/H-F/1/audita.txt
$$ ##AUDIT TRAIL=  $$ (NUMBER, WHEN, WHO, WHERE, WHAT)
(   1,<2024-03-06 17:34:17.21 +0400>,<she>,<DPX200>,
      <created by zg, POWCHK disabled, PULCHK disabled
       configuration hash MD5:
       00 E9 B6 7A A2 85 ED C7 34 08 36 98 17 FE 4E 26
       data hash MD5: 16K
       0B 49 A7 83 88 8E 26 1E 7F E3 8E F5 BD 76 FC D9>)
$$ ##END=
$$ 
$$ hash MD5
$$ 9D E6 08 50 25 E9 FC 85 7C B6 54 6A 7D BC 08 B3
##$RELAX= 
##$RELAX= 
##$RELAX= 
##$RELAX= 
##$RELAX= 
##$RELAX= 
$$ Bruker specific parameters
$$ --------------------------
##$DU= <F:/spectra>
##$EXPNO= 1
##$NAME= <H-F>
##$PROCNO= 1
##$TYPE= <nmr>
##$USER= <she>
##$AMP= (0..31)
100 100 100 100 100 100 100 100 100 100 100 100 100 100 100 100 100 100 
100 100 100 100 100 100 100 100 100 100 100 100 100 100 
##$AQSEQ= 0
##$AQ_mod= 1
##$AUNM= <au_zg>
##$AUTOPOS= <>
##$BF1= 200.13
##$BF2= 200.13
##$BF3= 200.13
##$BF4= 200.13
##$BF5= 200.13
##$BF6= 200.13
##$BF7= 200.13
##$BF8= 200.13
##$BYTORDA= 1
##$CFDGTYP= 0
##$CFRGTYP= 5
##$CHEMSTR= <none>
##$CNST= (0..31)
1 1 145 1 1 1 1 1 1 1 1 1 1 1 1 1 1 1 1 1 1 1 1 1 1 1 1 1 1 1 1 1 
##$CPDPRG= <>
##$CPDPRG1= <>
##$CPDPRG2= <>
##$CPDPRG3= <>
##$CPDPRG4= <mlev>
##$CPDPRG5= <mlev>
##$CPDPRG6= <mlev>
##$CPDPRG7= <mlev>
##$CPDPRG8= <mlev>
##$CPDPRGB= <>
##$CPDPRGT= <>
##$D= (0..31)
0 1.2 0 0 0 0 0 0 0 0.06 0 0.03 0 0 0 0 0.0002 0 0 0 0 0 0 0 0 0 0 0 0 
0 0 0 
##$DATE= 1709732056
##$DBL= (0..7)
120 120 120 120 120 120 120 120 
##$DBP= (0..7)
150 150 150 150 150 150 150 150 
##$DBP07= 0
##$DBPNAM0= <>
##$DBPNAM1= <>
##$DBPNAM2= <>
##$DBPNAM3= <>
##$DBPNAM4= <>
##$DBPNAM5= <>
##$DBPNAM6= <>
##$DBPNAM7= <>
##$DBPOAL= (0..7)
0.5 0.5 0.5 0.5 0.5 0.5 0.5 0.5 
##$DBPOFFS= (0..7)
0 0 0 0 0 0 0 0 
##$DE= 6
##$DECBNUC= <off>
##$DECIM= 32
##$DECNUC= <off>
##$DECSTAT= 4
##$DIGMOD= 1
##$DIGTYP= 9
##$DL= (0..7)
0 120 120 120 120 120 120 120 
##$DP= (0..7)
150 150 150 150 150 150 150 150 
##$DP07= 0
##$DPNAME0= <>
##$DPNAME1= <>
##$DPNAME2= <>
##$DPNAME3= <>
##$DPNAME4= <>
##$DPNAME5= <>
##$DPNAME6= <>
##$DPNAME7= <>
##$DPOAL= (0..7)
0.5 0.5 0.5 0.5 0.5 0.5 0.5 0.5 
##$DPOFFS= (0..7)
0 0 0 0 0 0 0 0 
##$DQDMODE= 0
##$DR= 18
##$DS= 0
##$DSLIST= <SSSSSSSSSSSSSSS>
$$ [...]
##$SUBNAM2= <"">
##$SUBNAM3= <"">
##$SUBNAM4= <"">
##$SUBNAM5= <"">
##$SUBNAM6= <"">
##$SUBNAM7= <"">
##$SUBNAM8= <"">
##$SUBNAM9= <"">
##$SW= 18.0517328524113
##$SWIBOX= (0..15)
0 0 2 0 0 0 0 0 0 0 0 0 0 0 0 0 
##$SW_h= 3612.71676300578
##$TD= 16384
##$TD0= 1
##$TE= 0
##$TE2= 300
##$TE3= 300
##$TEG= 300
##$TL= (0..7)
0 120 120 120 120 120 120 120 
##$TP= (0..7)
150 150 150 150 150 150 150 150 
##$TP07= 0
##$TPNAME0= <>
##$TPNAME1= <>
##$TPNAME2= <>
##$TPNAME3= <>
##$TPNAME4= <>
##$TPNAME5= <>
##$TPNAME6= <>
##$TPNAME7= <>
##$TPOAL= (0..7)
0.5 0.5 0.5 0.5 0.5 0.5 0.5 0.5 
##$TPOFFS= (0..7)
0 0 0 0 0 0 0 0 
##$TUNHIN= 0
##$TUNHOUT= 0
##$TUNXOUT= 0
##$USERA1= <user>
##$USERA2= <user>
##$USERA3= <user>
##$USERA4= <user>
##$USERA5= <user>
##$V9= 5
##$VALIST= <valist>
##$VCLIST= <CCCCCCCCCCCCCCC>
##$VD= 0
##$VDLIST= <DDDDDDDDDDDDDDD>
##$VPLIST= <PPPPPPPPPPPPPPP>
##$VTLIST= <TTTTTTTTTTTTTTT>
##$WBST= 1024
##$WBSW= 4
##$XGAIN= (0..3)
0 0 0 0 
##$XL= 0
##$YL= 0
##$YMAX_a= 156888
##$YMIN_a= -197910
##$ZGOPTNS= <>
##$ZL1= 120
##$ZL2= 120
##$ZL3= 120
##$ZL4= 120
##$ABSF1= 10
##$ABSF2= 0
##$ABSG= 5
##$ABSL= 3
##$ALPHA= 0
##$AQORDER= 0
##$ASSFAC= 0
##$ASSFACI= 0
##$ASSFACX= 0
##$ASSWID= 0
##$AUNMP= <proc_1d>
##$AZFE= 0.1
##$AZFW= 0.1
##$BCFW= 1
##$BC_mod= 2
##$BYTORDP= 1
##$COROFFS= 0
##$CY= 11.3945322036743
##$DATMOD= 1
##$DC= 2
##$DFILT= <>
##$DTYPP= 0
##$F1P= 15.7292609196834
##$F2P= 12.9074282941183
##$FCOR= 0.5
##$FTSIZE= 0
##$FT_mod= 4
##$GAMMA= 1
##$GB= 0.15
##$INTBC= 1
##$INTSCL= 1
##$ISEN= 128
##$LB= 0.24
##$LEV0= 0
##$LPBIN= 0
##$MAXI= 10000
##$MC2= 0
##$MEAN= 0
##$ME_mod= 0
##$MI= 1.114404
##$NCOEF= 0
##$NC_proc= 0
##$NLEV= 6
##$NOISF1= 3.799351
##$NOISF2= 2.8
##$NSP= 1
##$NTH_PI= 0
##$NZP= 0
##$OFFSET= 15.70392
##$PC= 1
##$PHC0= -24946.05
##$PHC1= 16.38731
##$PH_mod= 1
##$PKNL= yes
##$PPARMOD= 0
##$PSCAL= 0
##$PSIGN= 0
##$REVERSE= no
##$SF= 200.130013532006
##$SI= 16384
##$SIGF1= 3
##$SIGF2= 2
##$SINO= 400
##$SIOLD= 16384
##$SREGLST= <1H.CDCl3>
##$SSB= 0
##$STSI= 0
##$STSR= 0
##$SW_p= 3612.71676300578
##$SYMM= 0
##$S_DEV= 0
##$TDeff= 0
##$TDoff= 0
##$TI= <>
##$TILT= no
##$TM1= 0
##$TM2= 0
##$TOPLEV= 0
##$USERP1= <user>
##$USERP2= <user>
##$USERP3= <user>
##$USERP4= <user>
##$USERP5= <user>
##$WDW= 1
##$XDIM= 8192
##$YMAX_p= 0
##$YMIN_p= 0
$$ End of Bruker specific parameters
$$ ---------------------------------
##NTUPLES= NMR FID
##VAR_NAME=  TIME,          FID/REAL,        FID/IMAG
##SYMBOL=    X,             R,               I
##VAR_TYPE=  INDEPENDENT,   DEPENDENT,       DEPENDENT
##VAR_FORM=  AFFN,          ASDF,            ASDF
##VAR_DIM=   8192,          8192,            8192
##UNITS=     SECONDS,       ARBITRARY UNITS, ARBITRARY UNITS
##FACTOR=    0.0002768,     1,               1
##FIRST=     0,             0,               0
##LAST=      2.2672688,     0,               0
##MIN=       0,             -197910,         0
##MAX=       2.2672688,     156888,          0
$$ Real data points
##PAGE= N=1
##DATA TABLE= (X++(R..R)), XYDATA
0@%%%%%%%%%%%%%%%%%%%%%%%jOj2J5j6J6j6J6j7J8k2K7k9L2l5L8m2M5m8N5o0O4
45C4p1P7q5R3j02J13j24J38j55J72j92K18k48K86l33L94m79N93p58J014j433K195
67A347l845Q646m4218j59840J98295J14238j94428j3300J56977l5409p2195P8449
79C4717Q108p4284L6865M2288o9136k1996N7980p312m4196K3976L2437l1020k4226
92c5799L8335K2964m1103j2175N2688N028m2282K0591K7133m9946j0628N7832
104C2638j7885n7280L0676K2927m5757J6203M9260m2784k1443P2474l576p4903
116c9450L4456O2675n4401l9954N4709M254m9910K4003L6230m3270k0757M7831
128A6416O560l9747P170K4590j6429p054K2291r015k5451J6609K1100k3320j1262
$$ plain form
0 0 0 0 0 0 0 0 0 0 0 0 0 0 0 0 0 0 0 0 0 0 0 0 0 -1 5 -7 8 -8 8 -8 8 -9 9 -13 14 -15 17 -18 20 -22 23 -25 30 -30 34
45 34 -37 40 -45 48 -54 59 -65 73 -82 90 -102 116 -132 154 -179 215 -264 329 -429 585 -848 1347
67 1347 -2498 6148 -38070 -197910 385 114623 -79805 -93105 63872 28463 -43732 34717
79 34717 42825 -31459 5406 47694 -21442 -43438 14542 7230 -36966 -12990 19447 -11573 -35799
92 -35799 2536 25500 -15603 -27778 24910 29938 -12344 8247 35380 -14566 -25194 32638
104 32638 14753 -42527 -11851 11076 -34681 -18478 30782 -12002 -33445 39029 35453 -39450
116 -39450 -4994 57681 3280 -36674 18035 22289 -27621 -3618 32612 -10658 -31415 16416
128 16416 22976 -16771 -9601 14989 -1440 -8494 13797 4782 -20669 -4060 17040 -6280 -17542
141a7542L2858P483l0459J683K6255q182j6646Q354l638j7194J0916J2007j7905
154a2010J305K3106j4347k0673K7321J6015k8868k025K6970j0644j8038K0372
166H484O542k6030J181J9915r354j3276J1760K620j3792L212J0510m895k859Q972
180B990n25o796Q535J1095j0995j2871R302N217j4468l26J7225k883j4733P262
194a971R641o916o43N874r111m512J2563m28j2472N763P023j0208J426J4101m417
209E713q829R034L102j1126J874P829o819o144O487p39m826P755J708j3515j883
224a0379J1095j425n994P093M570o309K849J0490l141r004J865J274p745q49N891
239B81k333n002L240J966l360K173M376l519l038N671M307k768J780K434o253
$$ plain form
141 -17542 15316 22799 -7660 -5977 20278 12096 -4550 3804 166 -17028 -6112 5895 -12010
154 -12010 -10705 12401 -1946 -22619 4702 20717 -8151 -10176 16794 6150 -11888 8484
166 8484 15026 -11004 -9823 10092 738 -12538 -778 1842 -11950 -8738 1772 -3123 -5982 2990
180 2990 2465 -4331 4204 15299 4304 -8567 735 5952 -8516 -8842 8383 5500 -9233 -1971
194 -1971 7670 754 111 5985 -3126 -7638 4925 4497 -7975 -2212 4811 -5397 -3971 10130 5713
209 5713 -3116 5918 9020 -2106 -232 7597 778 -5366 1121 382 -4444 3311 5019 -8496 -10379
224 -10379 716 -709 -6703 390 4960 -1349 1500 11990 8849 -155 1710 2984 -4761 -5610 281
239 281 -2052 -7054 -3814 -1848 -5208 -3035 1341 -2178 -5216 455 4762 1994 3774 6208 -45
254d5l762O040R23o604L16L706l042O33P205k363q322K873M445p450r87J0169
270C735k318q163O995P499o240j40R227o226r660P931N700j0411k903P045l697
285a626n273Q306L077q617K24N509l592j667Q363J306q045K994Q455m850n389
300h25N229j688r992J662P507l896k437P312j240q049O295P716r773o081R192
315I32J39p599O499O745q036l262Q491l28o008M264K524p836j092Q356k219o546
331d976L349K059p279K14R054j666o399M218M643m496K121Q424m604p582O075
346C155K778q294M08O240o157o517Q621M093p766Q63N438m930l546P477J398o851
362c590K477O541l010j549P618k00j0792lO321m716l937P298j121r073M665P603
$$ plain form
254 -45 -3807 2233 3156 -3448 -3132 574 -2468 -1835 5370 3007 -5315 -2442 2003 -5447 -6434 3735
270 3735 1417 -6746 249 7748 1508 1368 10595 4369 -5291 2640 8340 -2071 -4974 2071 -1626
285 -1626 -6899 1407 4484 -4133 -3909 1600 -1992 -3659 4704 6010 -2035 959 9414 4564 -825
300 -825 4404 2716 -7276 -5614 1893 -2003 -4440 2872 1632 -6417 -122 7594 -2179 -8260 932
315 932 1071 -6528 -29 6716 -1320 -4582 3909 3581 -2427 1837 4361 -3475 -4567 3789 1570 -4976
331 -4976 -1627 432 -6847 -6633 2421 755 -5644 -1426 3217 -1279 842 9266 4662 -2920 3155
346 3155 5933 -2361 -1953 4287 -1870 -8387 234 4327 -3439 -2576 2862 -2068 -5614 1863 3261 -3590
362 -3590 -1113 5428 2418 869 8487 8287 -2505 -2508 3813 -903 -4840 2458 1337 -7736 -3071 4532
378D532o602k233P781l922p219Q861P060q827j459R570m397p083O699L204r858
393c893q71P169k218n377M418K258o816o15P601J08m781L753J830o143J383Q832
409F638l059p818M560L570o715J769P562m891p117N266J792o641K687N752n773
424b418l736P188J327m907L237M730n272k803P312R81p811l78O293k290l868N308
440B893J072q332j53O369k698l469N725j07p434M271Q210m048k958N109k575n854
456c979M519L699n434J076N606o116n076Q634K187j0947j709Q505k152m324N541
471C0K147m276L050N580m276l213M315k314n658M101O279m271m309K806M6l945
487c908J454M089k886l870J776L378j167J901M747k547m724L549L605m583j494
$$ plain form
378 4532 -2070 -4303 3478 -444 -7663 1198 8258 -569 -2028 7542 3145 -3938 2761 5965 -3893
393 -3893 -4764 2405 187 -5190 -772 1486 -5330 -5945 1656 1764 -3017 736 2566 -3577 -2194 6638
409 6638 3579 -4239 321 3891 -2824 -1055 6507 1616 -5501 -235 1557 -5084 -2397 3355 -2418
424 -2418 -6154 1034 2361 -2546 691 5421 149 -2654 4658 5639 -2172 -2550 3743 1453 -2415 2893
440 2893 3965 -4367 -4520 1849 -849 -4318 1407 1300 -6134 -1863 6347 2299 -659 4450 1875 -3979
456 -3979 540 4239 -1195 -119 5487 -629 -5705 2929 5116 -5831 -7540 965 -1187 -5511 30
471 30 2177 -2099 951 6531 2255 -958 3357 1043 -4615 -514 5765 1494 -2815 -9 37 -3908
487 -3908 -2454 1635 -1251 -5121 -3345 33 -1134 767 5514 2967 -1757 1792 5397 814 -680
502f80L391l220l218N909Q43p489K178N863n875l386P994o30p534L665N527m028
518f90J033O475l463o061L769K774m004M70J985m248j339N506m78m336J207J532
534A32l349o54M830N80k656J228K482k436j21L470j213n115J706M044k022j861
550i55K832o71l842J033K994k978k160K227p04j541M374L242l677j421L032M13
566B198j856K251J214l923k108L003kj399J739l36n298M92N275j313m086L135
582a014L089l650K19N331j546l406M169o60m625L118M971o955m312O155J727n001
598b390J464K999n317j242N454J03l170K452R13l316J785M221k644j751L130k34
614B457l413J715L084l696l159J574N22k081J314K141k472j666L449L255k196
$$ plain form
502 -680 2711 -509 -3727 2182 3025 -4464 -2286 3577 -2298 -5684 2310 1680 -5854 -2189 3338 -690
518 -690 343 6818 3355 -2706 1063 3837 -167 303 2288 -1960 -3299 2207 1729 -2607 -1400 132
534 132 -3217 -3871 959 1539 -1117 111 2593 157 36 3506 2293 -2822 -1116 2928 906 -955
550 -955 1877 1206 -2636 -1603 1391 -1587 -3747 -1520 -2224 -3765 609 3851 174 -1247 1785 2198
566 2198 342 2593 3807 -116 -2224 779 777 -622 1117 781 -4517 -4025 1250 -63 -4149 -1014
582 -1014 2075 -1575 -1356 3975 2429 -977 3192 2532 -2093 1025 5996 -959 -5271 884 2611 -2390
598 -2390 -926 2073 -3244 -4486 968 1071 -2099 353 1266 -2050 -265 3956 1312 -439 2691 2457
614 2457 -956 759 3843 147 -3012 -1438 -916 -2997 -1683 458 -2014 -3680 -231 3024 828
629H28j290J863p11j537K605K229l325q43K523j626k864K753P67m689m70L840
645E3p41j812M252L27n379J778M969k432k115L281j073l732M214K934m700j390
661a566L698k258l148L351J733m776J23K941j537o27L651p5m311J360M132o82
677B009k371J393J297k587j32L539j060l617P2L58k401Q50L389j943k403L448
693a59J861k619J804L122l599k560L696J425k860Q79J578l000j189L598o62l757
709b442K84K210k272l18M030P3l065R33K274j734k99K865j004l748J991L564j838
726A504j073K259j813l116K177J678l529q30J960j078j010L528J202l215L26K852
742A822j215j177K882P40m189J75L371r31j860J302n80m122J112L117j332k146
$$ plain form
629 828 -462 1401 690 -847 1758 3987 662 -181 2342 716 -2148 605 1372 -3317 -3787 53
645 53 -688 -2500 1752 2079 -3300 -1522 3447 1015 -1100 2181 1108 -2624 1590 4524 -176 -1566
661 -1566 2132 -126 -3274 77 1810 -2966 -2843 98 -1439 -2066 1585 1510 -2801 -1441 2691 2009
677 2009 -362 1031 2328 -259 -391 3148 2088 -1529 -1457 -1099 -3500 -2650 739 -1204 -3607 -159
693 -159 1702 -917 887 4009 410 -2150 1546 2971 111 990 2568 -432 -1621 1977 1315 -2442
709 -2442 -2158 52 -2220 -2538 1492 1565 -1500 -567 1707 -27 -326 2539 1535 -2213 -222 3342 1504
726 1504 431 2690 877 -2239 -62 1616 -1913 -2743 -783 -1861 -2871 657 1859 -1356 -1030 1822
742 1822 607 -570 2312 3052 -1137 -962 2409 1478 -382 920 340 -3782 -2670 447 -885 -3031
758c031K343J80j414K523J880k132r51J634j14j371J477J187k344q58J794J55
774I58j424O12p0k576n19K982Q83k585P58J211j427O38M080p53m285J929K118
791B530j828L01K673k647k852J834Q14k823Q50J778k495j791K991J457j407M18
807a97J750j096m05K632Q6k357n55J363j315l81J545j139l049P70K693j200n26
824a381J545q47j901J766K501j417p92K068j022k173K033K395j788k081J028J80
840A14r64P28J207k169j143J811K73j175J121N06k092P4L114k23j639J488P01
857A732j635Q98K394k024k067R14J0j534J368J307k573j290J888L47r61J955P33
874A462j910n50K602O53q87O26j7j684l4J443o04k333L47N00j099L12J662p10
$$ plain form
758 -3031 -688 -508 -1922 601 2481 349 -602 1032 918 -453 1024 2211 -133 -991 803 958
774 958 -466 146 76 -2500 -3019 -37 846 -1739 -981 230 -1197 -559 3521 2768 -1517 412 2530
791 2530 702 1003 3676 1029 -1823 11 825 -1998 -1148 630 -1865 -3656 -665 792 -615 -197
807 -197 1553 457 52 2684 2770 413 -142 1221 -94 -475 1070 -69 -3118 -2348 345 -855 -1381
824 -1381 164 -683 -2584 -818 1683 266 -526 1542 520 -1653 380 2775 987 -1094 -66 114
840 114 -850 -122 1085 -1084 -2227 -416 -143 -1318 -197 309 -1783 -1709 1405 1182 -457 1031 1732
857 1732 97 995 3389 1365 -702 212 222 -1312 56 1363 -1210 -2500 -612 -265 -1226 729 1462
874 1462 -448 -998 1604 2257 1370 1996 1979 295 261 1704 1100 -1233 -886 -386 -1485 -1173 489 -221
892b21j874O67J401N7j14Q12p71r59J830J278r60l17Q80j875k156K042J681k637
910a236j114J184k65o80J766L99j841L36J912r51J16K419k17k086J160J617j474
927A045r55M77j448j311J252J190j170n37P22j07M7J539P46j216o92P35L89O91
945A397M55j2j450l62P68Q4n59o5l15j251j39K210n7j142J90L29o98K87J345n19
965D96j261O03J217j62L90Q14j460j196J447M1j281n5L29j680n79K347K94j570
983a266K85M40j077P71K171P4k213Q73J400p56M1Q99j274j647L34Q72j196K50
1001a019N80j468o33J978P22j090L83R86q28P4K218P36j305j150R36m54l01O88
1019A053m33j548p57J093M10o40N89J33j060K45K217Mj608J194Q82j219K77J843
$$ plain form
892 -221 -2095 -1428 -27 30 -84 728 -43 -1002 828 2106 1146 829 1709 -166 -2322 -280 1401 -1236
910 -1236 -2350 -1166 -1431 -2111 -345 54 -1787 -1451 461 -490 -374 2045 1828 -258 902 2519 1045
927 1045 90 567 -881 -2192 -940 250 -920 -1457 -735 -842 -795 744 1490 274 -418 317 706 1397
945 1397 1852 1840 390 28 796 880 321 256 -59 -1310 -1449 761 704 -438 -248 81 -617 -330 1015 496
965 496 -765 -162 1055 893 1283 2097 637 -559 888 929 -352 -407 -78 -1758 -2337 10 304 -1266
983 -1266 -981 -541 -1618 -847 1324 1398 -815 58 1458 702 743 1642 368 -1279 -945 -73 -1269 -1019
1001 -1019 -439 -1907 -2540 -562 160 -930 -547 439 -389 -315 1903 2639 1334 184 1120 666 365 1053
1019 1053 620 -928 -1685 -592 -182 -822 -233 -100 -1160 -915 1302 1306 -302 892 1774 555 832 2675
1037B675p66k383P09J49j208M43R31j791j131J638O04q60O61P84j031j74J575
1054H25M43r26l4O15j219M67J412r91j673O81K8q00N15J244j456j419J196J079
1072a3l73K46N56n77p34J142R15n72M3l35k58OJ006j4o54j418P26K52q20Q17M31
1093C72j704n64J960K03o08J367O2j611P03K218p20r34O31l62j109M62R50j387
1111g1o11K74q18k21J333K94j600j80J893N73n84O88N24j193l83J470R1q38q8
1130E53m81j139N39Q38n42j531Q15K91j230Q69J268j90r28N04R92J89K31k29o87
1149A32p13P27O64p40o37L0p56p8P42Q67j260n41J146O3j02J399P86j747Q1J251
1169A314j33j65M90j059j507P25J058p72OO53j243o79J428P74j018j0M38L0J74
$$ plain form
1037 2675 1909 -474 235 384 -824 -381 550 -1241 -2372 -734 -130 -990 -329 455 -576 -750 825
1054 825 1268 342 308 923 -296 171 1583 592 -1081 -400 -372 -1172 -657 587 -869 -2288 -1092 -13
1072 -13 -386 -140 416 -161 -895 247 1162 590 633 298 40 46 1052 1038 384 -1034 -308 -56 -876 -59 372
1093 372 -1332 -1896 64 267 -341 1026 1088 -523 180 2398 1678 744 1375 1013 -96 366 1316 -71
1111 -71 -682 -408 -1226 -1447 -114 180 -1420 -1600 293 866 282 970 1494 301 -82 1388 1479 641 553
1130 553 72 -1067 -528 310 -232 -1763 -948 -657 -1887 -1018 250 60 -868 -364 628 817 1048 819 132
1149 132 -581 146 810 70 -567 -537 -1293 -1371 -629 238 -1022 -1563 -417 -354 -456 943 1729 -18 63 1314
1169 1314 1181 1016 1506 447 -1060 -335 723 -49 -43 610 -633 -1312 116 890 -128 -138 300 330 504
1188E04Q76j08j290K87K43MJ1M89m37j387j21J324J16r16P2o14p43O10J346j12
1208A54r33M13L47n95Q61J202p01r76L71L86n44L30N02j218r27P21M31j132K24
1227a084N80q81m8J807j36q21N38Q32p45P53Q46o30j192R8M03n9j19Q5p03j269
1247a745O33M41K35J83J59n86k03J398O20l8j53O9m16J45N65q0j410J36K97m38
1267a88q1K96n85r62R33P67j28K9N14o55m43J380Q25q40m53J40m86k16O53J76
1287F76j293k21j69M3J21O32J83j108J70J063j4n2K09L57p23n6J172k24p34j15
1307h3J66j046R67R68j021j228O04K06m03P64M05j110m39J338J10j81R09K11j329
1326a92P5Q51K17l73M4k37r26K85O87k98o41k78j93L14P80L07o34n39N38P55L19
$$ plain form
1188 504 1380 1272 -18 269 512 516 527 1016 579 -808 -929 395 511 -405 -333 -947 -1690 -1080 266 154
1208 154 -779 -366 -19 -614 247 1449 748 -228 143 529 -15 315 817 -401 -1328 -607 -176 -1308 -1084
1227 -1084 -504 -1385 -1433 374 238 -583 -45 787 42 795 1641 1011 -181 -83 320 261 142 227 -476 -1745
1247 -1745 -1112 -671 -436 -253 -94 -680 -883 515 1135 1097 944 1013 597 742 1307 1227 -183 -47 250 -188
1267 -188 -269 27 -558 -1520 -587 180 52 81 595 -60 -503 877 1702 862 409 549 63 -153 500 676
1287 676 -617 -838 -1007 -964 -843 -211 -28 -1136 -966 97 83 31 240 597 -126 -182 990 766 32 -83
1307 -83 83 -963 4 972 -49 -1277 -673 -467 -870 -106 299 -811 -1250 88 198 17 926 1137 -192
1326 -192 -117 734 951 578 622 385 -541 -256 431 133 -508 -786 -979 -665 115 422 -212 -751 -213 542 861
1347H61P5K13p36l9N40K80o93m45k95k11p12Q02O43j008k48M05J64k45J275J62
1367G88r96K55Q66j06r0M61q52r59P21P56j066o29L72n72o28J082N10p19J40K39
1387d27J94L08J053j98o90k5M37k1p8K70p34r53l1O39r3P2j5o62j35M36R57p4
1409B30l70K02M09l15N48N45n54r03L91L94l2j43k41p36m99P63M47k66j57K01
1429h6o22J07R77L19o20j17J6J38K21P06N8j150o1K87k87K88K56q92o36N15L64
1450b19n52l7O25p90J64J194M70q67L78j34p7N44K07j42m83l19j48j61qL99q39
1471g95m09K31L64M80Q2K32l27L7M57N25M12p70k54J15O1R8K78o24o63K6j41K10
1493c75J80k7n18r4M46P06j20J9K14k76j22Q80L61m52o30o2k83R4P63n55j238
$$ plain form
1347 861 936 1149 413 374 914 1194 501 56 -239 -450 -1162 -360 283 -725 -973 -568 -404 -649 626 788
1367 788 -208 47 913 807 717 1178 326 -633 88 844 -222 -851 -479 -1051 -1679 -597 -87 -806 -666 -427
1387 -427 -233 75 1128 930 240 215 652 631 553 823 89 -864 -895 -256 -349 -277 -292 -954 -1089 -653 304 230
1409 230 -140 62 471 156 704 1249 695 -208 183 577 545 402 161 -575 -1074 -311 136 -130 -287 -86
1429 -86 -708 -601 376 695 75 -42 -26 112 333 1039 1097 -53 -114 173 -114 174 430 -462 -1098 -583 -219
1450 -219 -771 -808 -183 -973 -809 385 855 -12 366 232 155 699 906 764 281 -38 -186 -347 -355 44 -795
1471 -795 -1204 -973 -609 -129 -47 185 -142 -105 352 877 1289 519 265 380 441 539 817 193 -470 -444 -585 -375
1493 -375 -195 -222 -740 -834 -388 318 198 217 431 155 33 913 1274 822 192 130 -153 -59 704 149 -1089
1514a089J78K39j71M14O70p63j19Q11n2J64O26k98q59P38N6k37mo0m03n36P15
1535B0K7j07l98j90k08O70K13j33O3k78j80O91M54J43m19J86n63k7N05K29n41
1556A57k08l53j29J82O60p76n93N49K29k20P30K82r01M15N57j6K27K87o34r70
1576e25O62K17j17l85l33l26L6N06K14L7m73k08M8P52M02K39k23k72m5M50L3j68
1598E21o2l80n94K83L98o42k13J48l20J85M72M84p93K17M74L9M72K46k4q55O3
1619A19L63o1q4k2l27m78KJ75%Q6l26j35J67M86O05q1m62L51R9L3Q5K45o60l08
1643a28K15k6K4p0n00k30J90M12p7k02O6o7j2L28R63k64p10K85j17J61L32J27
1665G00o71k98j99K98lJ30k52l11j21K56N19N4k27L2j34K94N27rj96j20j07K30
$$ plain form
1514 -1089 -911 -672 -843 -429 241 -522 -641 170 118 282 908 610 -249 489 545 308 304 244 -159 -695 20
1535 20 47 -60 -458 -648 -856 -186 27 -106 -43 -321 -501 190 644 787 368 554 -9 -36 469 698 157
1556 157 -51 -404 -533 -351 309 -467 -1060 -511 -282 -502 228 510 -391 24 581 565 792 1079 445 -525
1576 -525 137 354 237 -148 -481 -807 -771 -265 -51 -14 -487 -695 -647 105 507 746 523 251 206 656 689 521
1598 521 459 79 -515 -232 166 -476 -689 -541 -861 -676 -204 280 -513 -296 178 217 689 935 911 56 119
1619 119 482 421 337 315 -12 -490 -488 -313 -313 -227 -553 -688 -521 -35 570 489 27 378 477 510 595 840 180 -128
1643 -128 87 61 85 15 -485 -715 -525 -113 -190 -392 -326 -393 -405 -77 886 622 -88 197 80 241 573 700
1665 700 29 -269 -468 -170 -173 -43 -295 -606 -727 -471 48 102 -125 -93 -227 67 594 585 389 269 162 392
1687C92J28L18o24n16l76L61L29k75j75o3r9M29J52J72Q2p7k69K88N23J09j02
1708G07m36k13RJ43J92l68n50O7M8J54k55L64k15l84O73M84j66J52qk51K03J59
1730E09R4j44j68p14n0K50L0J17l21k69k31O57Q3J66P9m17M1N29L45o6l29K74
1752D65l17j71O36k38l96o4r3l94M72K17o59q5P9K43L18L59J14o85J76N60j04
1773D33o2K44l86k44J80k0j3L8k25o03K6N05q2j68k2l3L12J78N14k86R1r1M5K06
1797E37m3j89l17l12j94K17M71n04j98r6k1K54J20N63m05k26J96K06M58K69k53
1818E33q50K45N36o1j99K3m40n20L23L49l81N1q2o5k7N66K15j2j57lL63j61K02
1841D48K64m13m56M4K77J18l51j82l41Q6O28k61j21R9j30k36P20J41p7J12q6j09
$$ plain form
1687 392 520 838 214 -302 -678 -317 12 -263 -438 -501 -600 -171 -19 153 235 158 -111 177 700 809 707
1708 707 271 58 67 210 402 34 -516 -449 -401 -247 -502 -138 -353 -737 -64 420 254 406 398 147 350 509
1730 509 603 459 291 -423 -473 -223 -193 -76 -397 -666 -897 -240 -157 9 88 -329 -288 241 586 520 191 465
1752 465 148 -23 613 375 -21 -85 -178 -572 -100 117 -542 -627 -548 -305 13 372 486 -199 -23 537 433
1773 433 371 615 229 -15 165 145 132 170 -55 -658 -632 -127 -209 -377 -399 -432 -120 58 572 286 377 286 331 537
1797 537 494 305 -12 -324 -518 -301 170 -334 -532 -628 -649 -395 -275 288 -117 -343 -147 59 517 786 533
1818 533 -317 -72 464 403 204 227 -213 -733 -410 -61 -442 -391 -473 -538 -565 1 216 204 47 44 407 246 448
1841 448 712 299 -157 -113 164 282 -69 -251 -592 -506 122 -139 -260 -161 -291 -527 193 334 257 369 283 174
1863A74kL71j78l68o8l5N4j94L79l97l72pK13M89L3n71K27L0K50L78K45m48p5
1886A28P4J89p2Qq0o43q0K84J2m3m7j75m38O13L84l15J99K40j90n6O41P4k67j22
1910C18j87k2J50O4m41k38J66l38J35P34j06o08K04K79J08J1L20o7k44j77M10
1931D71J71n02M96p01m28L26pO4k03j67j37N60q8N9K47o1m80Q59M6l85R1J69m00
1954@M9K97P6o25k07r6j54M35K80l83l74K10M12j14K76J85n19l8N09k56L35K48
1976E46k08n20K2L75n9j00k61k39j05M32J35j05k95K53j03M53J35j23j19J31k31
1997A4K92J07K58m10l19p0%M10l94j94j5L4N7q7O37n31K32J89m3K20J6K5L5k21
2021B42j0J04j96J34l05k28L9J97k38l46M6J3J28M09J43M5k62O7L51k39M39L8
$$ plain form
1863 174 172 543 365 -3 -71 -106 -52 -246 133 -264 -636 -643 -430 59 92 -479 -252 -222 28 406 651 203 128
1886 128 202 391 319 327 247 -396 -476 -192 -180 -223 -270 -445 -883 -270 114 -201 -2 238 48 -8 633 707 440 318
1910 318 131 109 259 323 -118 -356 -190 -528 -393 341 235 -373 -169 110 218 229 549 482 238 61 471
1931 471 642 140 636 -65 -493 -167 -174 -110 -313 -480 -617 -57 -145 -86 161 100 -380 479 525 140 231 400 0
1954 0 49 346 422 -203 -410 -506 -660 -225 55 -328 -702 -492 -80 -194 82 267 -252 -290 219 -37 298 546
1976 546 338 -182 -160 215 156 56 -205 -444 -549 -117 18 -87 -382 -129 -232 221 356 233 114 245 14
1997 14 306 413 671 261 -58 -128 -128 282 -112 -306 -321 -287 -230 -317 320 -211 21 210 167 387 403 428 463 242
2021 242 232 336 140 274 -31 -259 -220 -23 -261 -607 -561 -548 -420 -11 132 177 -85 -18 333 94 533 571
2043E71p96Q9J72m8J42r8k30n73J63M35k16M38k86m2l9M64L69P5n90L5J93K56
2065D84j23j83o0o23K76K91J44k73l41J51n4J96lL31m00l2p0K61M51p3J19m26
2087D3J62l7ML45j06o86%N35k1j94p9k71k57M25M8J70j34j41k28N18M89Qk88j06
2111A99k94J26k44L64j38k73k18k5K88Q6j15k19P0q0N35K5K07o6j79j4L33nJ44
2134E07l00o11J52L1k05L13J02k86j64M67j08K9K34j98p2L53J50rK14o26K14J7
2156B04Q2L52n27q8l81j21L00j37K57j60P1j30K99K15K56n35J49K55j29J72k06
2177A98j38M1K9J7L2k37q8l1l17K12J59P6l5k03M1K41L87k12j15j22m2L02M40
2200F35l51k36j68o0K66j75Q6k75l2q4O9N76m38Kj68l0L56L92M0k60m2R4J53p8
$$ plain form
2043 571 -225 -136 36 -12 130 32 -198 -771 -608 -173 -389 49 -237 -279 -318 146 515 590 0 35 228 484
2065 484 361 178 118 -505 -229 62 206 -67 -408 -257 -311 -115 -118 213 -187 -219 -289 -28 423 350 469 43
2087 43 205 168 172 517 411 -275 -275 260 239 45 -34 -305 -562 -137 -89 81 -53 -194 -422 96 585 593 305 199
2111 199 -95 31 -213 151 13 -260 -478 -503 -215 -129 -244 -463 -393 -473 62 87 294 228 49 35 368 363 507
2134 507 207 -404 -252 -221 -426 -113 -11 -297 -461 6 -102 -73 161 -37 -109 244 394 385 599 -27 187 204
2156 204 286 638 111 23 -358 -479 -179 -316 -59 -219 -148 -278 21 236 492 -43 106 361 232 404 198
2177 198 60 101 130 147 179 -58 -146 -177 -494 -282 -123 -47 -82 -285 -244 -3 384 172 57 -65 -107 195 635
2200 635 284 48 -120 -180 86 -89 -3 -278 -310 -394 -325 251 -187 -185 -353 -383 -27 365 405 145 103 197 350 272
2224B72j53j31p8L5K5j82M21m48k01J93NK54J71o3k77J20J11L93Q8N8m74j75J8
2247a8K73K9k32j69l31j27M13L72k78J36l40K93j82N41l01L18j46k4J98J53m88
2268I0n8l21q6N9J38M0m50J71J9P2L6J58J60o0P6P3J90J00N1m40o0m9K03p2l6
2293Dm74n0J12K26P2l6j09O3k0M55M1j78p1J19k13M82P0k84l09K9N9MJ65m7j99
2318h9O6K9k57K89j92J93K8J43k27M7M76m03l11K07K20K13k95p0kn2mO3jl71j04
2343d04m5J59R5K05J12o04L50N5J59J68J29j80p4k39L48Q5k63q9j99J93j55q0
2365b74J25m59N37k93L88J86o2j63R5K67Q2k63J41k34j36J11L1Q7J25n37Jj8N5
2388b08M3J35N1l25J49J91L44l4q7J64k26O7P9L6k82k17j3L7L75n12K75n28Q8
$$ plain form
2224 272 119 -12 -90 -55 -30 -212 209 -239 -440 -247 -242 12 183 120 -157 -37 74 467 555 613 139 -36 -18
2247 -18 255 284 52 -117 -448 -575 -162 210 -68 68 -272 21 -161 380 79 397 251 227 425 578 90
2268 90 32 -289 -375 -316 -178 -138 -588 -417 -398 -326 -290 -132 28 -32 44 117 307 407 458 18 -42 -91 112 40 4
2293 4 -470 -520 -408 -182 -110 -146 -255 -192 -212 243 284 106 35 154 -59 423 493 209 -100 -71 -12 -8 157 110 -89
2318 -89 -23 6 -251 38 -154 39 67 210 -17 30 506 103 -208 -1 219 432 137 67 65 13 9 72 71 -300 -404
2343 -404 -449 -290 -195 10 122 -482 -132 -77 82 250 379 199 125 -114 234 319 56 -33 -232 -39 -194 -274
2365 -274 -149 -608 -71 -364 24 210 148 -15 80 347 429 166 307 73 -63 48 79 166 291 -246 -245 -263 -208
2388 -208 -165 -30 21 -304 -155 36 380 346 259 423 197 264 343 379 97 -120 -133 -96 279 -233 42 -486 -398
2411c98L14Q9R8O4m60L27K27R4k9Q3l39q0P8J88j23J09l17k03J74k60M04k10J8
2434a52O6J36l0k0k4j3P4j64K09K94j53k36p1J37O8J82J00n77o0j44N02k44r0
2457b10Q0r1R0J46J45j2Pn8k19N02L4r7p6l14j48K69Q8l88o6l8kK97J10J35j68
2482A6Q3j77R7J65K88l59m5J19k7j37K38o5m17k35K43N1l35M70l44j70K17N89
2504B65j82J33L8m08J95K61K26l34l8K26n84J61J12p2k94L6lJ68J18o3j84KJ9
2527b02K59K79l02Pj11J02K81k6l4l71p6K74p7P2j65L7j24L3P9k9K91k28J69l61
2551b23M65J05k59K39J3l03j11J93j20l5j36q1Q4J24j36R3P1J60m04J73M29m22
2573h1p6O7K16O6J94j59j29o4P0j08R8p8J0m46L71j30oj66K94j82J57K27l31M89
$$ plain form
2411 -398 -84 5 103 167 -293 34 261 355 326 409 70 -10 68 256 133 242 -75 -278 -104 -364 40 -170 -152
2434 -152 -86 50 20 0 -24 -37 37 -127 82 376 223 -13 -84 53 121 303 403 -174 -234 -378 124 -120 -210
2457 -210 -130 -221 -131 15 160 148 155 97 -122 380 414 317 241 -73 -221 48 136 -252 -318 -356 -358 -61 49 184 16
2482 16 99 -78 19 184 472 113 68 187 160 23 261 196 -221 -456 -213 -162 -497 -27 -371 -541 -324 265
2504 265 83 216 254 -154 41 302 528 194 156 382 -202 -41 71 -1 -295 -259 -262 -94 24 -39 -223 -221 -202
2527 -202 57 336 34 41 -70 32 313 287 253 -118 -194 80 3 75 -90 -53 -177 -144 -65 -94 197 -31 138 -223
2551 -223 242 347 88 327 340 37 -74 119 -1 -36 -172 -253 -169 -45 -181 -88 -17 143 -261 -88 341 -81
2573 -81 -157 -90 126 192 386 227 98 34 104 -4 94 16 26 -420 -49 -179 -185 -351 -57 -239 -82 145 -186 303
2597C03k76NK94j26m6J32n55J22k2r5K74j96P3l47J89M1P5J91Qj88K44q3J70l3
2621A54J21k56J14J1K35l51P0k07j11j15L66q4n8k44J67l19M95L60j38j83j18
2642i1J19K28l34K80l3l22nL61j58q4O8k28j29L59q3k27K59j63k90N48J03N5j22
2665A11O4k6RQ4j3k92j43K38n5M1L4j89j7l74L67K31J16k90m9J17M7N9K56j84
2689A42k4p9L70j40n5l3q8l21L54j82k32L99m66K08l7K46J79k22j79M1k2K56J99
2712C14n8l2m23K55j90K28j56k57P7j4K26k20J21k4n1K39J40M4m6j78N3k01N36
2735C83j27r1j11j49j51L66j05j53l0N7O5j33K2K8Q0K03k45L3J18K73Q1l92qo3
2759d9L01L7n12j28Q5K35j46J55k8M7J8j98K97N1k90P5mJ72L55m91J70j22n7J31
$$ plain form
2597 303 27 32 326 200 154 286 -269 -147 -169 -264 10 -186 -113 -460 -271 -230 -155 36 44 -144 100 17 187 154
2621 154 275 19 133 144 379 28 98 -109 -220 -335 31 -53 -111 -355 -188 -507 -12 348 210 27 -91
2642 -91 28 256 -78 202 169 -153 -158 203 45 -39 29 -199 -328 31 -52 -279 -20 -183 -473 75 178 233 111
2665 111 175 149 158 242 229 -63 -206 32 -23 18 52 -137 -154 -528 -161 70 186 -104 -153 -36 11 70 326 142
2689 142 118 39 409 269 214 181 93 -228 126 -56 -288 111 -355 -147 -184 62 241 19 -160 -119 -141 115 314
2712 314 256 224 -199 56 -134 94 -62 -319 -242 -256 -30 -250 -129 -153 -204 35 175 219 173 -5 48 -153 383
2735 383 256 165 54 -95 -246 120 15 -138 -168 -111 -46 -179 -157 -129 -49 154 -91 -58 60 333 414 22 14 -49
2759 -49 252 289 -223 -351 -266 -31 -177 -22 -50 -3 15 -183 114 165 -125 -50 -54 118 473 -18 152 30 -27 104
2783A04P9m5p5k6l35J4k0J99mM4k15J69K56pj0O9j99j6L38k27MN9j79p5J53J3
2809F8k0l09K37j19k88J83L58j22r6Q2J68p5Q5J47j72j04O1J04j41J42l44Rk9
2832a75K64j50l6Q0N1j06K44k02R9R7r5k2K72J06l39j17N3j01K91k76P0J26k01
2855f7q4J23l0m0j44J95m9j07K45K0J6O3n8P4Q8j51j11j43n1K22k3j02L08n58
2879c64L1K9K77K0N2J34o5J3J63n2j73m7P0P7M3k04j95L6K58j11j85L83k74p3
2903a57J55k44J56J53k22j1o0K09L49j14k18N9J92r9k11L39m39K32j55j57K07
2924c6q6qk02M15j34J6Q1K52k18J22j04J52L7L1k19k71n8J70K72j11m2k24j93
2947c58l8M47k34P8j9j02j21L28K03j28L81k92n6K48l34J49%k25Q7M5j64J65J3
$$ plain form
2783 104 183 138 63 37 -298 -284 -304 -105 -109 -65 -280 -111 145 138 128 197 -2 -18 320 93 97 156 -23 -98 55 68
2809 68 48 -261 -24 -143 -431 -248 110 -12 -108 -26 142 67 152 299 127 23 84 188 47 189 -155 -146 -175
2832 -175 89 -61 -97 -17 34 -72 172 -30 69 166 71 49 321 427 88 -29 24 -77 214 -62 8 134 -67
2855 -67 -151 -28 -58 -98 -242 -47 -96 -203 42 62 78 141 83 157 245 94 -17 -160 -211 11 -12 -114 194 -364
2879 -364 -333 -304 -27 -7 45 179 114 127 290 238 65 18 88 165 208 4 -191 -155 103 -8 -193 190 -84 -157
2903 -157 -2 -246 -90 63 -159 -170 -230 -21 328 214 -4 55 247 148 -63 276 -163 69 -86 -243 -36
2924 -36 -122 -130 -332 83 -51 -35 46 298 80 202 98 250 287 318 99 -172 -230 -60 212 101 59 -165 -358
2947 -358 -396 51 -183 -105 -124 -226 -347 -19 184 56 437 145 89 337 3 152 152 -73 14 59 -105 60 73
2970G3j87j16K10N8Q2j74J26p6J06J55Oj65j37J10k16K61j39j69KK44L4k22k6
2993a60j89K72j01M09k30J2J02J95k82J32m8j09JJ11k66R4L32l83J53k18j58K10
3015a21J14n0R9k70K30R2j9K87k98o3j26K83k25r7J18j90M22n78K56N8j06o2l7
3038b83N8L36k05j9L71k44K11K07k89J23j86k71J89J77J53n08J54k03K79j99J10
3059c9OK3k25Q7J19Q5P4r1j19K71J61l18P4j33k5l0K52k47q3l7K5j94M50j38K18
3084A66m03L56j36q6K46R2Q3k31j32J83OJ26Nk94N7k66L9J26n3j09j24R4P7K30
3108E2k18o5K97M9J21j54o4J15j07r8K41l93K30J04J51n99K23R7K3j35j26K44
3130a2J82k9J59l07j1J62k73K29J09k17J66l62K91k6J7kj81r5N75k77j04K1r9
$$ plain form
2970 73 -114 -230 -20 38 120 -54 72 -4 102 257 263 98 -39 71 -145 116 -23 -192 -190 54 88 -134 -160
2993 -160 -349 -77 -178 231 1 13 115 310 28 160 112 3 4 115 -151 -57 275 -108 45 -173 -331 -121
3015 -121 -7 -57 42 -228 2 94 75 362 64 1 -125 158 -67 -164 -46 -236 186 -392 -136 -78 -184 -246 -283
3038 -283 -225 111 -94 -113 258 14 225 432 143 266 80 -191 -2 175 328 -180 -26 -229 50 -149 -39
3059 -39 -33 -10 -235 -148 -29 56 130 39 -80 191 352 34 108 -25 -50 -80 172 -75 -158 -195 -170 -364 86 -52 166
3084 166 -237 119 -17 -103 143 235 318 87 -45 138 144 270 275 -19 38 -228 -189 -63 -116 -225 -349 -255 -178 52
3108 52 -166 -231 66 115 236 82 18 133 26 -72 169 -224 6 110 261 -338 -115 -18 5 -130 -256 -12
3130 -12 170 141 300 -7 -18 144 -129 100 209 -8 158 -204 87 61 78 76 -105 -200 375 98 -6 15 -84
3153h4J90j27J93J15k36n1J01p9j7L48j61l11L1L2l3Q3p8k29J38J27J25Q9k14
3176d8r6J12K58j1j06m9J43n9j43j10L92l28j07q8O1K00j90L18k24O0L1l6L18
3199B98k66R7k65N7K82K6J94k40l78K80p7J7j0m4k1r6j72J93K94k39J3K62q3j5
3223A07n9j7K5O8j31K29p3j16j18J73k95l3K96k11K95l22L26l31J9L41j27j3o6
3246c3J46N3j46K44m14L32O0k15j58J67n9j36q7O33l14k36RK61k49R7J13k41L38
3269A65r4l9J21l8j21o3J33l3k21J61p9n4K08k98L88k42K8J43l42K09K52P7m1
3292B20n5l52M61m9j10J5j74q5J03RN7R8j35k8r5K88q6q2M2k62J18j31M66j99
3316C4j04J79j17P6P5k59P0L5k17K33J34l66K77j91J59r6K96j99p3PM2j48K26
$$ plain form
3153 -84 106 -21 172 287 51 0 101 22 5 353 192 -119 -88 -56 -89 -6 -84 -313 -175 -48 77 166 -48
3176 -48 -144 -32 226 215 109 60 203 144 1 -109 283 -45 -152 -240 -179 21 -169 149 -75 -15 16 -20 298
3199 298 32 129 -136 -79 203 229 423 183 -195 85 8 25 15 -29 -50 -146 -318 -125 169 -70 -57 205 122 107
3223 107 48 31 56 124 -7 222 149 33 -85 88 -207 -240 56 -155 140 -182 144 -187 -168 173 46 33 -33
3246 -33 113 166 20 264 -150 182 242 27 -131 36 -23 -159 -246 387 73 -163 -154 107 -142 -45 68 -173 165
3269 165 71 32 153 115 -6 -69 64 31 -190 -29 -108 -162 46 -252 136 -106 -78 65 -277 -68 184 261 220
3292 220 165 -187 274 225 115 130 -44 -129 -26 -17 40 138 3 -25 -120 168 82 0 42 -220 -102 -233 233 34
3316 34 -70 109 -8 68 143 -116 -46 -11 -228 5 139 -227 50 -141 18 -78 218 19 -54 -47 -5 -153 73
3339G3J35j50k90Q2J58J09P8k04J09o7j35J97k28p1L14k19J21j35J42J56j19j16
3361f0m5J49J88J3k21O9k00K32j99O1k40J62J85j38j7n3R5J05j59J35j4K9K67
3384C44n51N67o98M29k08J51j76J79O3j44j27r6K60K3l1o9j6M1Q8p5K03k13J57
3407A01l28N55n24P7J63m47J68J42J5j44K26J57l68P2J22q5J78n3o6J81L5j8J26
3430B85k44L4r9M9Rr5J70k11m7j19K98J6J36j40j56J8n3L51P5j46j4j07m7Q9r6
3455d4O1j1K46l02P3k86L70p1j67r3K47K12l53O7l2K66q6R9n4k43k5J21L5r5L03
3480B38k92k0P0k88QK44j43L14k22o4j4J64J55j29K64k26j05P4m4K00k72r3J76
3503ep4R7p5j10J04l9q0L51k51L2J05M4J64r8j59k7J34j23m0M0m05L99j42J49
$$ plain form
3339 73 208 58 -232 -150 8 117 195 -9 100 33 -102 95 -133 -204 110 -109 12 -123 19 175 56 -60
3361 -60 -105 44 232 245 24 93 -107 125 -74 -13 -253 -91 94 -44 -61 -114 -19 86 -73 62 48 77 344
3384 344 -207 360 -338 91 -117 34 -142 37 100 -44 -171 -267 -7 16 -15 -84 -100 -59 29 -46 157 -56 101
3407 101 -227 328 -196 -119 44 -403 -235 -93 -78 -222 4 161 -207 -135 -13 -98 80 27 -39 142 177 159 285
3430 285 41 75 -24 25 34 -61 109 -102 -149 -268 30 46 182 42 -114 -96 -149 202 277 131 117 10 -37 52 -44
3455 -44 17 6 252 -50 23 -263 107 36 -131 -224 23 235 -118 -51 -83 183 97 196 142 -101 -126 -5 30 -65 238
3480 238 -54 -74 -4 -292 -284 -40 -183 131 -91 -155 -169 -5 150 21 285 59 -46 28 -16 184 -88 -181 -5
3503 -5 -79 18 -57 -167 -63 -102 -182 169 -82 -50 55 99 263 165 6 -21 113 -10 -50 -10 -415 -16 -158 -9
3527iqJ74l56J18K26j09ML5k2j59q3N9L25p9j10J63m15J34L1P1l97M55l4O3j43
3552f6q5nj4J61m2N2J52j26k7j36L17j24j91J69J21l62j39L85j50P5l22M04m03
3575c56L36J11j74J08l39J26L21j46M33l98J34r0Kk1jj19n5K99l16J10j26R6J94
3598A29j33J04q7o4K4J16M5k60J39N7p3J43k4l6N2l88L49k68R7k4r4K6L17m02
3622b55J30L30k31O2J7M2j71J35j0L4K54k11j44J14r2J99k76L7j90J6L50r3j72
3645a25J46qj51M37k11q7J01n8j33NK44k53M7K37l83J37j26o3L01q9J38N0o5l2
3669E9M2q3j20L55k30K74j91k83L56l28N6O7j11nj03J00J66q2k4J11j57j63L77
3692H3j65K26n3p7j55J90K51k39J71j73j67M3L2J02o6k9O9l2j32J01r8j04J7M14
$$ plain form
3527 -9 -17 157 -199 -81 145 36 40 75 53 -106 -189 -130 195 116 6 169 -246 -112 -81 -10 -407 48 14 77 -66
3552 -66 -151 -156 -170 -9 -51 1 153 27 0 -136 181 57 -134 35 156 -206 -345 40 -110 -35 -357 47 -356
3575 -356 -20 91 -83 25 -314 -188 133 -13 420 22 156 66 68 47 46 -73 -128 171 -145 -35 -161 -65 129
3598 129 -4 100 13 -51 -27 89 134 -126 13 70 -3 140 116 80 132 -256 93 -175 -78 -102 -196 -170 147 -255
3622 -255 -125 205 -26 36 53 95 -76 59 49 83 337 126 -18 96 4 203 -73 -36 -226 -210 140 47 -125
3645 -125 21 13 -138 299 88 1 102 44 -89 -84 160 -93 -46 191 -192 -55 -181 -244 57 -32 106 156 91 59
3669 59 101 18 -102 253 23 297 106 -177 179 -149 -93 -26 -137 -142 -245 -145 21 -61 -85 26 -131 -294 83
3692 83 -82 144 91 14 -141 49 300 61 232 59 -108 -65 -33 69 3 -26 43 11 -121 -20 -118 -222 -205 209
3716B09j87r7K00k06k3J34j30m7N2J61R9m71K22K17k69r9K05J97m96M89q3J15
3738A92o0n1J44k32N5M7P6j90nJ26j44j06l7K15o8Q8m1m6N8q6K7j00K04lr6K77
3764B44l54L98j53l38M0K17k7k69J12J03o2j49L47O7rj53j43J74j80J45J01l14
3786b03j05K40Q3N6pj22o2j5K4K19Pp6q4k9J65n7j20n6K66K5K0j21j42J71j86
3811a09N5n5M25l19o9k26K17j77M59m32L74k16j23L31j26QjO2o8J29o8P6r3r9
3835d5j65J34l7m5L21q0l57J04m2L30k01L09k40l4K76k25K48k1j37m7J64k49o3
3858a02j49K18J19j72J30r2j38J47J15j33L71k95k30K97M5k01N6N4J8k22O4k3
3880a23K04l54K09j00J96l3j8K5j57K59jj0R6r8j59J08j05p5L70k22r8K07j59
$$ plain form
3716 209 22 -75 125 -81 -104 30 -100 -147 -95 66 165 -306 -84 133 -136 -235 -30 167 -329 160 77 192
3738 192 132 81 225 -7 48 95 171 -19 -24 102 -42 -148 -185 30 -38 50 9 -37 21 -65 -38 -138 66 63 -33 244
3764 244 -110 288 135 -203 -163 54 27 -242 -130 -27 -89 -238 109 176 167 14 -129 45 -135 10 111 -203
3786 -203 -308 -68 15 71 64 -58 -120 -135 -111 108 115 39 -45 -74 91 34 -86 -142 124 149 169 48 -94 77 -109
3811 -109 -54 -109 316 -3 -72 -298 -81 -258 201 -231 143 -73 -196 135 9 17 16 78 10 139 71 147 54 -45
3835 -45 -210 -76 -113 -158 163 83 -274 -170 -212 118 -83 226 -14 -48 228 3 251 230 93 46 210 -39 -102
3858 -102 -251 -33 86 -86 44 -48 -186 -39 76 -57 314 19 -211 86 131 -70 -14 40 58 -164 -100 -123
3880 -123 81 -273 -64 -164 32 -1 -19 6 -151 108 107 97 193 95 -64 44 -61 -136 234 12 -86 121 -38
3903c8k31k0K42J88j18q8j35J17K66k36q1M4K17m2l1K67l52J0J78n4M5J29l46
3926f9q1r2L59ll27L45k80j68J88J85l9o3K64k40j42J39Q4k2R9p8l3j2L4J12j44
3951A6J0k48k6K72j84J2J94pQ6o5k33J25J70o6J26l39K89r4Rj22p2J78R4p4k08
3976a57Mo2L27j72L14l45J02J24j32J94j05j08j18J99M0k03J71J8p3l83M58j18
3998b5j54J79p7N6Q4p1l3J92K8j90P1k31K33j56Q6j42K18k04K12j17j19J36P3
4021D9k5j99KM2K77j89N4J72r0k18j03J55K51j64M7j67k80L23M0j53J08j83J02
4044a49n4K46M1k22J87J62j0J8k00j65K35K1m7j59q9M3K31jj47O4k1nk8nMQ9j00
4071f1j72M92l82J44L3J2k2J08k38L4L40m32M6k5k2J42j56K77j88L0L9N1M7j97
$$ plain form
3903 -38 -269 -289 -47 141 23 -65 -200 -83 183 -53 -134 -90 127 85 54 321 -31 -21 157 103 148 277 -69
3926 -69 -150 -242 117 114 -213 132 -148 -316 -128 57 18 -45 219 -21 -163 -24 60 38 137 59 26 14 48 160 16
3951 16 26 -222 -248 24 -160 -148 46 39 125 60 -173 -48 122 56 182 -157 132 38 47 -75 -147 31 125 51 -157
3976 -157 -153 -215 112 -60 254 -91 11 135 3 197 92 -16 -134 65 105 -98 73 91 18 -365 93 -25
3998 -25 -179 0 -77 -21 63 -8 -41 151 179 -11 60 -171 62 -94 -8 -150 68 -136 76 -41 -160 -24 49
4021 49 24 -175 -173 -131 146 -43 11 183 93 -125 -228 -73 178 14 61 -106 -386 -63 -23 -176 -68 -251 -149
4044 -149 -203 43 84 -138 49 211 201 219 19 -146 89 110 63 -96 -185 -142 89 88 -59 5 -16 -21 -49 -54 -50 39 -61
4071 -61 -233 259 -123 21 54 66 44 152 -86 -52 288 -144 -98 -123 -145 -3 -159 118 -70 -40 -1 50 97 -100
4095a00Q2J89k59k1N9j27M3K96l29l5nK30N5j5q4k83L13j39K15j24J17j22J81
4118A37k56Q2J59j49K92j53j14o2P7k98K20JJ79k41O0j98L27L6PM3k23K03J07
4141B36k13O3rk0l09L19j76L1o2K48k68L18j78l1J96j85j6j15K76j19K19l99M02
4164B08j9j72J4M1p6O8R8k70J70r3R9L1j91J61p3Q3o4J22k03Q1J00q5P0l17J61
4189e6N0N3P7r8j63P1j21J07R0j03J9O6Q1l3O4n2k4j29J37j27L87j95k05J71k37
4214a70J75J77o0j12o2o6J50O1p4j72J59o2l6K17j4q9J70j16j24J35m2j71J11
4237a5k25k1O1M12o1l65J35O5nM3n3n4J07l30K21k03N47l31l83N02j5j6m9K61
4261B28k50j88Q1n7J86l1j47J23p0L4K38K60n10K70J3l3J46k85n5K12k44j82M01
$$ plain form
4095 -100 -18 171 -88 -109 -50 -177 -134 162 -167 -202 -207 23 78 63 -21 -304 9 -130 85 -39 78 -44 137
4118 137 -119 -37 122 -27 265 112 -2 -64 13 -285 -65 -64 115 -126 -66 -264 63 99 106 149 -74 129 236
4141 236 23 86 77 57 -252 67 -109 -78 -140 108 -160 158 -20 -51 145 -40 -56 -171 105 -14 205 -194 208
4164 208 189 17 31 72 -4 64 162 -108 62 -31 68 99 -92 69 -4 79 15 137 -66 15 115 30 100 -217 -56
4189 -56 -6 47 124 26 -137 -66 -187 -80 10 -93 -74 -8 73 40 104 52 28 -101 36 -91 296 101 -104 67 -170
4214 -170 5 182 122 10 -52 -118 32 93 19 -153 6 -56 -92 125 111 22 192 76 -48 87 45 -126 -15
4237 -15 -240 -261 -200 212 151 -214 -79 -14 -19 24 -29 -83 24 -306 -85 -288 259 -72 -455 47 32 16 -33 228
4261 228 -22 -210 -129 -186 0 -31 -178 -55 -125 -91 147 407 -103 167 180 147 293 8 -47 165 -79 -261 140
4284A40k62k03M39Ml52M77k38%k6or7L6Q2j82m3J76K39j04n7p2j9m3J26K2q1k5
4310f9M01n11M01m59M69l60L43k35M3R1k85K10r6J2Q5n5k10n8J32J65M7K4j12
4333b7O5p7p8J85o7N7j3q9J00j94L9P7j81J25J97J63k45K17l22M8K5K88k02j27
4357c6J10k58J07j43L90j91o1l7K50j67J53J44k26J4l32K21J23j01j00m9O4K47
4379A22j20l48N69k8k53J74k47K43j5Q2l49O1O8N9K39k06n0o0J14M1q0Oj22J22
4403B2K5K5j16P1k21K45J43j15j06M7J15m1j2j60K17j62j92J77q5M5J32lj57K36
4427A30j84K07q3j25j60J53PJ62L7J75l21N8j39J7J21r4J97k69Q8m4J23J88k31
4450A3J00j35R4J60k06p5j2J16j80J90L8k07Jm5J70o5J31l28K35j96K01M7n1l4
$$ plain form
4284 140 -122 -325 114 118 -234 243 5 5 -21 -27 -124 -88 -6 -188 -231 -55 184 80 23 -49 -68 -111 15 37 -44 -69
4310 -69 332 -179 222 -237 232 -128 215 -20 23 114 -171 39 -57 -45 40 -15 -225 -283 -151 14 61 85 -27
4333 -27 38 -39 -117 68 1 58 45 -44 56 -138 -99 -22 -203 -78 119 282 37 254 -68 -20 5 293 91 -36
4357 -36 74 -184 -77 -220 170 -21 -82 -119 131 -36 117 261 35 49 -283 -62 61 -40 -140 -189 -125 122
4379 122 2 -346 223 195 -58 116 -131 112 97 179 -170 -109 -41 18 257 51 1 -59 55 96 16 22 -100 22
4403 22 47 72 -44 27 -194 51 194 79 -27 20 135 94 82 -78 139 -23 -215 -38 -123 -78 54 51 -106 130
4427 130 -54 153 70 -55 -215 -62 -55 107 144 319 -2 56 -83 -66 55 -39 158 -111 -23 -67 56 244 13
4450 13 113 -22 72 232 26 -49 -61 55 -125 65 103 -104 -103 -148 22 -43 88 -240 -5 -201 0 47 -4 -38
4474c8K7O2j56K57l70K37J18n2k06K18k15K64m29J62J72j07kK72j23l2%N6J16
4497B31l19J53q9j51k4K93m9L9k32K4J83p4j06K76k43J06l52L28j1%J3L9J53j42
4521D6m4mK42j82k34K9K05r4J01r5l0j56J36K06l04m7K36J37k52J26Qk11K22j10
4545f9Q1l64L93L2j65RJ53l1q9k51O35k34k92m3K63O7o0K65l53J99k64k2o9J86
4569b3J78k6K2j04K39k17j28K92k11lJ94k97l6J13J75r5Q7m1J4l10K84m8K5j87
4593a03J49o0o6J44q3r3o2j7L64m24J14J85J2j17J19J03J24l45K7Q6Q0k21l2M7
4617f9j79M69l84K10l6j94M17j83L8l6k89J57J71r8M9K00k32j49J28K02l78q2
4639b68K71K54j10k55J89l9%J1j40J26j2N3O3p9n8M8M0k93l6M46j66j75K4J8R2
$$ plain form
4474 -38 -11 51 -105 152 -218 19 137 85 -121 97 -118 146 -283 -121 51 -56 -58 214 91 59 59 115 231
4497 231 -88 65 -24 -175 -199 94 45 84 -148 -124 59 -15 -121 155 -88 18 -334 -6 -17 -17 -4 35 188 46
4521 46 2 -2 240 58 -176 -147 58 -36 65 -30 -60 -216 -80 126 -178 -225 11 148 -104 22 30 -181 41 -69
4545 -69 12 -352 41 73 -92 -83 70 39 -50 -301 334 100 -192 -235 28 95 35 300 -53 146 -118 -140 -209 -23
4569 -23 155 129 151 47 286 69 -59 233 22 19 213 -84 -120 -7 168 73 160 119 133 -177 107 59 84 -103
4593 -103 46 -14 -80 64 -19 -112 -174 -191 173 -251 -137 48 60 -57 62 165 289 -56 -29 57 137 -84 -116 -69
4617 -69 -248 221 -163 47 11 -183 234 51 89 53 -236 -79 92 -6 43 243 11 -138 -10 192 -186 -268
4639 -268 3 257 147 -108 81 42 42 53 -87 39 27 80 143 64 6 54 94 -199 -235 211 45 -130 -106 -88 4
4664DR5j58J20j39J68p4j55J35n4O4J99k04k8J87j51PK40l32O0M3J15j54l1k66
4688c09L64K4j22j01K63j46j46ML6J56J6k27K68j20K3q1J16o9K4P4j7Q1q3m8j01
4713a21J06M4k03J39Q2j21K97j81K21k15j57K26j00J80k08K6J45p8p0l6j16q4
4735b24J92q5P8R8M35m82k59K40J25r8J3J09p6n2q8J14J86l41o0J07J80J04J20
4758C36m09M9q1J08l2k55K84R0j19l5j04K59l3j5k21q4L94m51J34N0J1L25l47
4781a46L50l54k7J16K31j01j79l4J71J36l24L17k48J96l46L60j26N4J7o1N6M1
4803I9k21L53l35J84n36M68O6N0O4j93L16l23m7j61R8R3n3J31j53k54N78j03l85
4826b64J80K53j48Jo6K6p5J76r0rk4N9kj3k69J95L39m30m3J83j60Q6n0K37J5%
$$ plain form
4664 4 99 -59 61 -78 90 16 -139 -4 -58 6 205 1 -27 160 9 16 256 -76 -16 27 142 -12 -43 -309
4688 -309 55 79 -43 -144 119 -27 -173 -169 -133 23 39 -188 80 -40 -17 -98 18 -51 -27 47 30 111 28 -20 -121
4713 -121 -15 29 -174 -35 47 -74 223 42 263 48 -109 117 17 197 -11 15 160 82 12 -24 -140 -224
4735 -224 -32 -117 -39 59 494 12 -247 -7 118 20 33 142 66 14 -74 40 226 -115 -175 -68 112 216 336
4758 336 -73 -24 -105 3 -29 -284 0 90 -29 -64 -168 91 58 43 -178 -262 132 -319 -185 -135 -124 201 -146
4781 -146 204 -150 -177 -61 170 69 -110 -144 27 163 -161 156 -92 104 -242 118 -8 46 63 2 58 99
4803 99 -122 231 -104 80 -456 12 78 128 192 -1 315 -8 -55 -216 -118 -25 -78 53 -100 -354 224 121 -264
4826 -264 -84 169 21 22 -44 -18 -93 83 -7 -16 -40 19 17 4 -265 -70 269 -161 -204 -21 -181 -95 -145 92 107 107
4852A07j59J48l1L7j99k2P1J01j56J89k15P4N3j01j71M20J6m6P6k83k9NJ92k31
4876a54J23L18k31r8K03j59K27j40k75K47O2p3J84o41O53m15J54j88Q2O9P1r1
4898g2J96L01l99K77l31J30O9j75j47J44q3J70LN3k13j24K94j79J60m8n4J25j32
4921c5o0q2J1Q5J37o3L6pJ5o3p1R3P7j19K7L0K2o2J50j76P8o2O5L5n4L0j82J34
4949a1j46K18r4P4qk11K9l6K22m3M5o8P2J4J41k43RL40k81j75J67j8k8P0lj13
4975g7j84K53R3J04l66J04q5J33J2K83k68Kr9k3o6K17l8j48K38k34J62l1k2k39
4999b79M92j36Q3m6r8n8J40j83J04o7J5J12k13J41J54K0n39L87K03q4k1k58m0
5022a71J32j57L65k21lr2L07k04k69N31m9k39J08K35k58j9J3k88J41O1J6L13k08
$$ plain form
4852 107 -52 96 65 102 -97 -119 -48 53 -103 86 -129 -55 -2 -103 -274 146 162 116 192 -91 -120 -115 77 -154
4876 -154 -31 287 56 -42 161 2 229 89 -186 61 123 50 234 -407 246 -169 -15 -203 -121 -52 19 -72
4898 -72 124 425 26 303 -28 102 171 -4 -151 -7 -90 80 83 136 -77 -201 93 -86 74 26 -28 97 -35
4921 -35 -95 -177 -166 -81 56 -7 29 22 37 -26 -97 -4 73 -46 -19 11 33 -29 121 -55 23 -39 26 61 7 37 -145 -11
4949 -11 -157 61 -33 41 33 -178 -149 -185 37 -6 39 -29 43 57 198 -45 -36 304 23 -152 15 -3 -31 39 36 -77
4975 -77 -261 -8 85 189 -177 -73 -158 -25 -13 270 2 4 -95 -118 -184 33 -5 -153 85 -149 13 -18 -40 -279
4999 -279 213 77 160 114 16 -42 98 -85 19 -48 -33 79 -134 7 161 181 -358 29 232 148 127 -131 -171
5022 -171 -39 -196 169 -52 -55 -147 160 -44 -313 218 169 -70 38 273 15 -4 9 -279 -138 -77 -61 252 44
5045D4j75N8RO2P7l1m26K56J81J56m83K59L6j70J74J68N5l04P2k03P7K7K11j11
5069A9J03l63q4J97lj31J06M8L65l74J2K29m9j92l2K39j90OJ58j76LJ94j7j13
5093d5K03n5l7Q8k05M3j31K44L61m31N5L5j42l36L22J19j14j4m4N8j00K04J67
5116B45k85q4K1L9K83j16l46M45k72N5Q2k57K04J62p3J0k80J28R7o5m8j44L7J95
5140C3o1r8J04o8J82K0p0j11oJ06j6M6J1r0o8Q6L7k7rK67m93K27j45J4M43l24
5166a0j32r0K62j61K60q0j78n4K31k08J40Qk09K80k17m2J82RO5j48n1k1J05J47
5190H8j56J57j86KL26k34J60j91K9J65k28K47l43K58j75M4O6p2P7Q4l8k10J29
5213aO6j91J14J13j3l1Pj57J94l08L15R7k19r4J91r7n6L0J50j18o8K40l03K15
$$ plain form
5045 44 -131 -73 -64 -2 75 44 -382 -126 55 211 -272 -13 23 -147 27 195 250 -54 18 -185 -108 -81 130 19
5069 19 122 -241 -325 -128 -131 -262 -156 -108 257 -117 -105 124 75 -117 -149 90 -100 -94 64 -112 -109 85 68 -45
5093 -45 158 103 66 154 -51 -8 -139 105 466 35 90 125 -17 -353 -31 88 -26 -40 -84 -26 -126 78 245
5116 245 -40 -124 -103 -64 219 103 -243 202 -70 -15 67 -190 14 176 103 113 -167 -39 58 -7 -55 -199 -162 33
5140 33 -28 -126 -22 -90 92 112 42 -69 -75 31 15 61 72 -18 -86 0 37 10 1 268 -225 2 -143 -129 314 -10
5166 -10 -142 -232 30 -131 129 49 -129 -183 48 -160 -20 -12 -221 59 -158 -200 -18 -9 56 -92 -143 -164 -59 88
5190 88 -68 89 -97 -95 231 -3 157 -34 -5 160 -68 179 -164 94 -81 -37 29 -43 34 118 80 -130 -1
5213 -1 65 -126 -12 101 88 57 64 -93 101 -207 108 205 -14 -108 83 -14 -70 -40 110 -8 -76 164 -139 76
5237G6J94pl91Q2J2K73n3q4o8oq3R6L1j03J15J41j14j07j78K88j67k00L79j64
5261c8L0j1m9l1J38j1m1j60L34j2k27J89j82p2K31j64m0K67m99N27j28K29k78
5284BKJ31n0l66J80K91j64L2j63J10L6j5j3Q4k48M0J14j34L15k00L21r4k73P1
5308IJ52j20N2j80q7J79RL6j65J33k20P5RO4k1J67k93J91K4L11k83n6m6J56J57
5333B53m66M76k48O4L07m76ko2J65j42J76j57K71j56m3K2Q4m4j46q4J95J39l10
5356a84K60j4O7j67K66j44p1m27N09j3Lk96L09k5l9o8q3J60k4O0qR7k52K85k64
5381f3j42J01ml3O7p7P4L9O8j16K69k82J17N9J46n79N42m29K26j91J53J99M7K9
5405B20k63J68N6j56J77mj42j07J62n3J1j99K04k27j49J89j15J37J29P8k07J43
$$ plain form
5237 76 270 263 -128 -46 -34 239 186 102 34 28 -55 41 72 -31 84 225 111 4 -174 114 -53 -253 126 -38
5261 -38 -8 -19 -68 -99 39 28 -13 -173 161 149 -78 111 -71 -143 88 -76 -116 151 -348 179 51 280 2
5284 2 4 135 85 -281 -101 190 26 58 -105 5 41 26 13 97 -151 -111 3 -131 184 -16 305 211 -62 9
5308 9 161 41 93 -87 -174 5 14 50 -115 18 -202 -127 -118 -54 -75 92 -201 -10 14 325 42 -14 -60 96 253
5333 253 -213 263 15 79 386 -90 -92 -154 11 -131 45 -112 159 3 -40 -18 66 22 -124 -208 -13 126 -184
5356 -184 76 62 129 -38 228 84 13 -414 95 82 85 -211 98 73 34 -34 -117 43 19 79 71 168 -84 201 -63
5381 -63 -205 -104 -108 -141 -74 -151 -77 -38 30 -86 183 -99 18 77 223 -356 186 -243 -17 -208 -55 144 191 220
5405 220 -43 125 181 25 202 198 56 -51 111 58 69 -130 74 -153 -302 -113 -228 -91 38 116 -91 52
5427E2J7np0l7o1n5J26MJ91j20Lj01o1P5J14k8k01M18l62K78k21l1K15j85K67
5452B22k26L02k75N4qk0K3j8O5j24j97K33J0K77k41j16J72l6j29Q7o6m1qj46Q9
5477a17lK54j23L3k15L0O5J64m6j51L00j40K37k14R3Q3n5j66j04K43N0m80K73
5500A1j01M52k58RJ14k67P2J78qj04l5k2k35L16k23k83K47K7J17O9j50R5K3j22
5524g8J68j3j03J98n3j83K97o7q5pq7J6l6J65l2j28J47Nj29K6q5l7K70j65kj31
5550a29L31j05k0p4l0J11J82k09l19L13M2j26J8J77k63kRK20k0M9k72J90NM6j51
5575b7J62k08K71j01j71j43K26l8m3J3j31K37J6K5K6j64m2p3K63j43K48l38K93
5598A58p0j00P5j86J66j69N4Q3J1k47J02K82o9j32L7m5K39j80R2p8p2J90j48j0
$$ plain form
5427 52 69 64 -6 -43 -104 -159 -33 -29 162 42 45 -56 -117 -42 72 44 -157 261 -101 177 -44 -75 140 -45 222
5452 222 -4 298 23 77 69 49 72 54 119 -5 -202 31 41 318 77 -39 133 97 -32 55 -11 -52 -60 -206 -117
5477 -117 -120 134 11 44 -171 -141 -76 88 42 -109 191 51 288 74 167 250 195 29 -75 168 218 -262 11
5500 11 -90 362 104 113 227 -40 32 210 202 98 63 41 -194 122 -101 -384 -137 -110 7 76 -74 21 44 -78
5524 -78 90 77 -26 172 119 -64 233 166 81 74 -13 3 -33 132 100 -28 119 124 -5 21 -64 -101 169 4 2 -129
5550 -129 202 97 77 3 -27 84 266 57 -262 51 93 -33 -15 162 -101 -103 -94 126 106 155 -117 73 78 124 -27
5575 -27 135 -73 198 97 -74 -217 9 -29 -72 -59 -190 47 63 88 114 -50 -92 -165 98 -45 203 -135 158
5598 158 88 -12 63 -123 43 -126 -72 11 22 -225 -123 159 90 -42 -5 -50 189 9 101 23 -49 141 -7 -17
5622a7p4J54LQ7l03R1j35N08l20j3j8j8O8N0O5l26K85M7n2j38N3J70j07j22k17
5647b79L79o6k02K10P9j66p6K28o8j48K78j69n3J07J3j70N7j28J60J16o0j56M0
5670g4k5R7j92J07k6L13m48L77j65L23k98J48R7Kn14K54j01K86O5r8k44J77j35
5693g4o7J0k25J97K74lr9m3j61L58j59j22K46j5j59J50k2j04o4j6J56J09j56k08
5717a97L33k55k16K26L55l80K9R7N9L9J69l54q6K35j9q6J39k20l4O8l0l5K67K2
5741A26j53J49j12J96k44L45k88K27j09p4Q5l36L92j53Q1k83m0L70k13j74K30
5762B2j05l2q1L21Ok74K79k48K04j07m7M45k94j49N4k9j01K72l60J33n5K85n6
5785H3J62k71K41l18K09k59l2J69l9M6R3j75q6L04j39k42JL36J3k24J79n5k55
$$ plain form
5622 -17 -91 63 66 153 -150 -59 -194 314 -6 -19 -37 -55 13 63 128 -198 87 134 82 -56 -3 167 60 -62 -279
5647 -279 100 34 -168 42 121 -45 -121 107 39 -109 169 0 -53 54 67 -103 -46 -174 -14 102 42 -114 -74
5670 -74 -99 -2 -194 -87 -113 200 -248 129 -36 287 -11 137 234 236 -278 -24 -125 161 226 128 -116 61 -74
5693 -74 -141 -131 -356 -159 115 112 13 -30 -191 167 8 -114 132 117 -42 108 86 -18 -82 -98 58 167 11 -197
5717 -197 136 -119 -335 -109 246 -134 -105 -8 51 90 259 -95 -181 54 35 -51 88 -132 -166 -98 -128 -163 104 126
5741 126 -27 122 10 206 -38 307 19 246 137 63 148 -188 204 51 132 -151 -191 179 -34 -208 22
5762 22 -83 -115 -196 125 131 -143 136 -112 92 -15 -62 383 89 -60 -6 -35 -136 136 -224 -91 -146 139 83
5785 83 245 -26 215 -103 106 -153 -185 -16 -55 -9 84 -91 -177 127 -12 -254 -253 83 96 -128 51 -4 -259
5808b59K7L61j62J22j08Q9j10J65r8p9K7J04j49K26k01Q1j6j34K02j12j66J07
5830h3L47j92k32K75L5j81m7p3L10k06Q0J1l0L14k90J03j95N6K0j9lJ63j57l18
5854c12J64J94r1m7M7jQ8p6J07j69J54j12r2K03k05J48o9j67K96k79J00K77k90
5877a32K41j90L8K40rj75k58L19k68J80QK80j54r4k8Pj43K11l81M48m0k42K84
5900A42J8j21j82K53k90L55m5q3k08K44k15J24n0J40j96J53K37l58P6o3M0J2R4
5923G7j85J21P5l51K50p1l9O6J38j19k36L28M0p2l3J67j80J21l02K4M79j85n1
5946F2r7j12K56m0O4m00M05j2r4k1L7l33L84R9p6m39L25k6K2j74NJ53M1K68j48
5971A49RJ37k27q7K6k46J38l1M7L0M02k70m27K00j57K66q4j4RK93k1r1o4K10l07
$$ plain form
5808 -259 -232 129 -33 89 -19 70 -40 125 27 -52 -25 79 -70 156 -45 36 20 -114 88 -24 -190 -83
5830 -83 264 72 -160 115 150 -31 -78 -151 159 -47 33 44 14 328 38 141 -54 2 22 3 0 163 6 -312
5854 -312 -148 46 -45 -92 -45 -46 42 -34 73 -96 58 -54 -146 57 -148 0 -69 -236 60 -219 -119 158 -132
5877 -132 109 -81 -43 197 188 13 -245 74 -194 -14 -6 274 120 26 -2 5 -138 73 -308 140 100 -142 142
5900 142 160 39 -143 110 -180 175 130 47 -161 83 -132 -8 -58 82 -114 39 276 -82 -6 -69 -29 -17 77
5923 77 -108 13 88 -263 -13 -84 -123 -57 81 -38 -274 54 94 22 -11 156 -24 97 -205 -181 298 113 62
5946 62 -35 -147 109 69 133 -267 138 126 32 11 48 -285 99 198 122 -317 8 -18 4 -170 -165 -12 29 297 149
5971 149 158 295 68 -19 7 -239 -101 -132 -85 -55 347 77 -350 -150 -307 -41 -125 -139 -130 163 142 51 -13 197 -110
5996a10J20M7j45L08k38Q7j76J17l17J85K16n1J2j06j2J88k49J93J13k37r6Q2
6018f9j01K68r4j25L23m5j8qk09K3L1j92L21j19K49l56j05K25j55L42j71R5k43
6041a33K8J20K18j58k31L08j23j05L18k40J38j42L6L5k27K27q8P1j73j79K30N7
6063a3q4R7Q2m4R7jj34j52p8K94Mk0Q9j49L5K52k17N7n2qjj95K73k44J44r1m6
6090a05Q9K32k72Pk17K99K2m5P4m5J29k75L6J05j64lK00l59L69L6o7Qn2L3j62
6115a27J73MJ13l17L18K5k80KK52l0k62J90o9J04k2R5l15l4J48k19ML62K6J5j5
6140A41l4j32N3k57K97m1q0rk48O9K64RJ26j38J35k40j4J72j5l5rk08J12K05j58
6165c5p6J6L31k48j30J2K75j25p7K39k78o1K70l13N12k62%N8j71R2j00j40K13
$$ plain form
5996 -110 10 57 -88 220 -18 69 -107 10 -307 -122 94 43 55 -51 -63 125 -124 69 182 -55 -151 -69
6018 -69 -170 98 4 -121 202 157 139 131 -78 -55 -24 -216 105 -14 235 -121 -226 -1 -156 186 15 110 -133
6041 -133 -105 15 233 75 -156 152 29 -76 242 2 140 -2 34 69 -158 69 -19 52 -121 -300 -70 -13
6063 -13 -97 0 82 38 135 134 0 -152 -230 64 68 48 137 -12 23 275 58 115 63 55 54 -141 132 -112 32 -59 -105
6090 -105 -16 216 -56 -49 -266 33 55 10 84 39 168 -107 -71 34 -130 -133 67 -292 77 113 46 54 2 35 -127
6115 -127 46 50 163 -154 164 189 -91 -89 163 133 -129 61 -8 96 74 169 -146 -180 -32 -251 -247 115 141 156 141
6140 141 107 -25 28 -229 68 27 -53 -62 -310 -241 23 32 158 20 155 -85 -99 73 58 23 14 -194 -82 123 -35
6165 -35 -111 -95 236 -12 -142 -130 145 20 -57 182 -96 -157 113 -200 312 50 50 108 -63 29 -71 -211 2
6188BJ9J43k87k3J04k1Jj94L96k06J34J02j76q2Q4l4J74m2j11o3J76p2k92K85
6212A7p3J64j56K98j96l22J30K26Rl4r8K45k39M4o6L9N2p9M4Mr7J03j49L30l82
6237a86L71Jj00l1j17J13p7o0J32j48J62J78j56J16k64M1J85j74Q9j17J48R8k85
6260h1K62k17J2J37j88L8Q1j2r0O5J10r6R9r0o7o6L37k68k24M55j03n5J47o3j27
6285dJ38j94J19p5M1k9LM6J09k42O7K55k09r3J07j05j27J77j70L97m13J13N3j02
6309a38Mj3L08r2q9K22l40L60k14q9J98l34K63l97L88j18K27P2k23J47l74J53
6331g9k5J52q0O3p8R2R1J5m8k54J0k0Q6rK25j23n4j23J90K49l22l3P8k4P0K61
6357C10l12j24K81j22Q4M0k36m8J43K09O2k24j18K24Lqj94K8j01L0L06o3k3r6
$$ plain form
6188 2 21 164 -123 -146 -42 -63 -62 -256 140 -66 68 170 -6 -88 -4 -38 136 94 -17 -80 96 24 -268 17
6212 17 -56 108 -48 250 54 -268 -138 88 97 63 -35 210 -29 15 -51 -12 40 -39 5 9 -88 15 -134 196 -186
6237 -186 185 186 86 55 -62 51 -26 -86 46 -102 60 238 82 198 -66 -25 160 -14 75 -42 106 204 -81
6260 -81 181 -36 -24 113 -75 -37 44 32 -58 7 117 21 120 30 -37 -103 234 -34 -258 197 94 39 186 123 -4
6285 -4 134 -60 59 -16 25 -4 -1 45 154 -88 -21 234 25 -68 39 -66 -193 -16 -186 211 -202 -89 -36 -138
6309 -138 -134 -147 161 69 -20 202 -138 222 8 -81 117 -217 46 -351 37 -81 146 218 -5 142 -232 -79
6331 -79 -104 48 -32 31 -47 45 136 151 103 -151 -141 -161 -75 -84 141 18 -36 -159 31 280 -42 -75 3 -21 49 310
6357 310 -2 -126 155 33 117 157 -79 -127 16 225 287 63 -55 169 172 164 -30 -2 -103 -73 233 170 147 51
6381E1j16K02r7r2J68l23O9K39r3m8J15o3N3N5Pk07m5K51K01j25l35J89L8j61
6405f7j05L6K4K10m5l7j86K24k10N7J11%K41k01J1j67J74J13k19J63o2r8O4J34
6429A65l45L37j48j70L74m03K98k70K95l14R8q4K14j07K37P1k49N0Qj48K5N8K24
6452B16m53J03o0L13k23L15n2j32Q4j03j80J79J7%n7j5N7l4K20k25O6j69o5L14
6476A16k17kN3j05L05j73J00k04JJ19j67M02k28J18j82P0J55j84Q4o0L5P5j61
6499e0L37j56n2j00j00J51j25K2J60j06L7r5k97L10J12j86L20k6m07O1M33k60
6521a7j48J96J1M4j20K11j95R3k8q2J56k8p2k6pK89j60p9K7R5l5j42j8j86J53
6546f8j9J90j62pK39j78j60L48j38k38L79l13J45k29K77K6j10QJ05l06L77m35
$$ plain form
6381 51 -65 137 40 -52 116 -207 -138 101 8 -40 75 12 65 120 127 -80 -125 126 327 202 -133 56 94 -67
6405 -67 -172 -136 -112 98 53 16 -170 54 -156 -99 12 12 253 52 63 -104 70 183 -36 127 65 -33 31 165
6429 165 -180 157 9 -161 213 -190 108 -162 133 -181 -83 -167 47 -60 177 248 -1 49 57 -91 -66 -8 216
6452 216 -237 -134 -194 119 -104 211 159 27 111 8 -172 7 24 24 -33 -48 9 -25 195 -30 36 -133 -198 116
6476 116 -101 -103 -50 -155 150 -23 77 -127 -126 -7 -174 228 0 118 -64 6 161 -23 61 1 36 111 -50
6499 -50 287 131 79 -21 -121 30 -95 -73 87 -19 18 -77 -374 -64 48 -138 182 156 -251 -190 243 -17
6521 -17 -165 31 42 86 -34 177 -18 75 47 -35 121 93 21 -5 -12 277 117 38 65 160 125 -17 -35 -221 -68
6546 -68 -87 103 -59 -66 173 -5 -165 183 45 -193 186 -127 18 -211 66 92 -18 -10 95 -211 166 -269
6568b69M21J11m44M02j72j43J29j73J34l66K25M31l42K1P0r5K15l32PJ63np3J48
6591F3m2J62o6%k24j7L00j66Q1p9o1N1n9nKk98O50l73L0K36m5j01m0q4M4j62L19
6618A16l9n8L4o0J47n9j10q6J65J07k25J09M3%j59J08j07J27q6K4j84K58K05j66
6642A04j59MN0k15Q0J28MjpJ20r5M8l0J43k16J88j97k1j01K46oj09j1J6R7nr1
6669c6J77J9r6j28K7j22M1J8j6J74j64L1R3K74l84Q0j36K40k9J37Rk47J22k9r7
6694d2L67k45L8k77Q2k9J24j06L1o3r0M09J37n01K61M9n5K3J1k35J85k9l5j9J18
6719A09j83p2J51k3qk28K15J17J48o2r8O2R7j63m3R5l52K93j40K3j8N4Nr6L8j27
6745b06L8J60k41J92k6J1J22M5j11P8O3j2j5j78j61J55L5J90k08K4j57K00q2k9
$$ plain form
6568 -269 152 263 -181 221 49 -94 35 -138 -4 -370 -145 286 -56 -35 35 -60 155 -177 -170 -7 -12 -85 63
6591 63 21 183 117 117 -107 -124 176 10 91 12 -49 2 -57 -62 -60 -358 292 -81 -51 185 140 39 -1 -85 -41 -203 116
6618 116 77 19 53 -7 140 81 -29 -115 50 157 -68 41 84 84 -75 33 -74 53 -33 -9 -193 65 270 104
6642 104 -55 -51 -1 -216 -136 -8 -4 -5 -12 108 13 61 31 174 -42 146 -51 -72 -173 73 67 -42 -53 -37 60 55 -36
6669 -36 141 160 64 -64 -37 -159 -118 -100 -116 58 -106 -75 18 292 -92 -12 -148 92 63 200 209 -38 84 55 -42
6694 -42 325 80 118 -159 -77 -106 18 -88 -57 -120 -210 199 336 -165 96 145 90 113 124 -111 74 45 10 -9 109
6719 109 -74 -146 5 -18 -26 -254 -39 78 226 164 66 128 225 62 19 114 -238 55 -85 -62 -80 -26 -21 -117 -79 -206
6745 -206 -168 -8 -249 -57 -83 -72 50 95 -16 62 125 113 98 -80 -241 -86 -51 139 -69 -45 -202 -2 -84 -113
6769a13J26J45n5k41O3j29J80N9k36J77O1r5K01j71j05J32P6k17J35j13J73j15
6791f2o3KJ30j17nN9J3J51r3k97k2M42j47o5K44m3l19K59K6j32J46j61P0J22m39
6816c01R7J9L12p9k65J30Q6M9O2P9R0m11j6m8K9J78J20j05Q8M9k37J39r3K3k31
6841b36J13J09J50K5n7p8j9j16j15J95r1K12l8j74l7R7J90k07L06n10J10J63J29
6864A21q2O4k5j10j56L3L17o0j78r8K24m5j36L48j80m1o5Q2K62j12j09j4J00k89
6888a49J55K30k28j14M00l95L07l08J42O1j38q2k6L83m48K10q7L06k76j1J81M0
6910A53j95M3k00K19J73k19j32J53L35r0l02j01q0J13J48J38k83J29q9N9o5m2
6932a35l36L78J47l1R0K2J02k23j40j2LM9N6L97l89P7n2M08n02L04r4q3K0l24
$$ plain form
6769 -113 13 158 103 -138 -75 -204 -24 35 -201 -24 37 -58 143 -28 -133 -1 75 -142 -7 -120 53 -62
6791 -62 -125 -123 7 -110 -115 -56 -43 108 15 -282 -304 138 -9 -74 170 127 -192 67 93 -39 107 -54 16 138 -301
6816 -301 -204 -185 127 48 -217 -87 -1 48 110 189 279 -132 -148 -196 -167 11 131 26 114 163 -74 65 -28 -5 -236
6841 -236 -123 -14 136 161 104 26 7 -109 -224 -29 -120 92 54 -120 -157 -60 130 -77 229 -281 -171 -8 121
6864 121 39 103 78 -32 -188 -155 162 102 -76 -174 50 5 -131 217 37 -4 -69 13 275 163 54 40 140 -149
6888 -149 6 236 8 -106 294 -101 206 -102 40 101 -37 -119 -145 238 -210 0 -87 219 -57 -68 113 153
6910 153 -42 1 -199 20 193 -26 -158 -5 330 240 -62 -163 -243 -130 18 156 -127 2 -87 -28 -93 -135
6932 -135 -471 -93 54 23 113 135 237 14 -126 -138 -135 -86 -30 367 -22 55 3 411 -91 213 119 36 56 -268
6956b68K96J83j10k29K87o0J56m6m31J82M9j0n7J42j90p6J49j79J02J09j50O4
6978h7Q8j65J29K04l31j24L42j17k2n7L4K20j62j14J71k20K50q2K24l36J08K0
7000b7J96j27K0P5k18O0K27R2m13L59l01Q2Jk20L01m34L58J04j42J67r7lj23O1
7024bN6L7o8K28l37K06j17o3J79m8j28J84k59J49p2J45n2j57J98j07J93j10k6
7047B9R9N9j88k01K40k07o0K30J29p1j66J91j37m4R7k73L21K61l25Q6Jm4l4l0
7071c7J44P5j63kj22K99m13J38K37j44lL8J39k42q2J78j88O1J61n5j76J90l39
7094c06J60L96P4k99J25j68r9K33k32Q2K4L4j42J69l23L49j64O2K43l20J45r8
7116e5N6J36l05K54J79m38J87mk12J64N2o8k9J13j98J95q4K1l2j9K04k2p4J08
$$ plain form
6956 -268 28 211 101 -128 159 99 255 209 -222 -40 9 -1 -58 84 -106 -182 -33 -212 -110 -1 -151 -87
6978 -87 1 -164 -35 169 -162 -286 56 -61 -83 -140 -106 114 -48 -162 9 -211 39 -43 181 -155 -47 -27
7000 -27 169 42 62 137 -81 -21 206 298 -115 244 -57 25 26 -194 107 -327 31 135 -7 160 63 60 -63 -2
7024 -2 54 91 23 251 -86 120 3 -60 119 71 -57 127 -132 17 -55 90 38 -119 79 -28 165 55 29
7047 29 128 187 -1 -202 38 -169 -229 1 130 59 -107 84 -53 -97 0 -273 48 309 -16 70 71 27 -7 -37
7071 -37 107 182 19 17 -105 194 -219 -81 156 12 9 47 186 -56 -138 40 -148 -87 74 19 -157 33 -306
7094 -306 -146 250 324 25 150 -18 -117 116 -116 -34 -10 24 -118 51 -272 77 -87 -25 218 -102 43 -55
7116 -55 1 137 -168 86 265 -173 14 10 -202 -38 14 -54 -83 30 -168 27 -57 -36 -68 -87 117 95 21 129
7140A29K7j14J09j21J24j94J44m9n3j24K07k02N43l23r6j7L2J15k01K45j3o1J10
7163B17j49J42j84j80N8O8mj3rJ48K35k31m9j56L48k87k42K45P6j7k7r5lJ23n8
7188d4j39L01l8j88j88M56k58K31k85K02j23j02J98l0J10j14j11K75k48J05o5
7209e5K07l42P4J51j53J35kJ49j2j47J38p4p7q5K88l55J85Pr1J21m5R7k20L8J61
7234I3j10N7j14J31p2j99K54K16j24j5J53k65j67J76J65l42K23m00L22L5o4J15
7256F8K2N2l10J62L2J87o3l2j72R0r4j03K02JM4N4l27J96R1n9j61J6L1J65qk26
7282a42J67j6P6j28J91j85k6l9J23J83m0j29K14j93k81J31R0k0j75J17j33L03
7304H8qJ65l89j8O8o7l0K2rJ64r3N7K15k75O6R0r5L6j24K25k05k6J05Oj73Q5L2
$$ plain form
7140 129 156 42 151 30 154 -40 104 55 2 -122 85 -117 426 103 7 -10 22 137 -64 181 168 107 217
7163 217 68 210 26 -154 -96 -28 -32 -45 -54 94 329 98 49 -107 241 -46 -288 -43 33 16 -11 -106 -109 14 -44
7188 -44 -183 118 80 -108 -296 160 -98 133 -152 50 -73 -175 23 -7 103 -11 -122 153 -95 10 -55
7209 -55 152 -190 -116 35 -118 17 15 164 152 5 143 69 -8 -93 195 -160 25 32 -59 62 17 114 -106 -68 93
7234 93 -17 40 -74 57 -15 -214 40 256 132 117 270 5 -162 14 179 -163 60 -340 -18 17 -47 68
7256 68 90 142 -168 -6 26 213 150 118 -54 36 -58 -161 41 42 86 140 -187 9 100 41 -120 -104 -73 92 84 -142
7282 -142 25 9 85 -43 148 -37 -63 -102 21 204 164 35 249 56 -225 -94 -4 -24 -199 -82 -215 88
7304 88 80 245 -144 -162 -94 -161 -191 -169 -178 -14 -107 -50 165 -110 -44 46 -49 -13 -137 88 -117 -143 -38 -32 -205 -120 -88
7331h8pR6J56r0L4l98M69j0j86R2k16L7o3K20N4j67J04k34P8J7K18k7j4j30L2
7356b3k94L29p6j5qj5j38L55K1K51l23k05K50j13Q5r2k7n0lJ16j98j3M64j88k10
7381a20K18k03J17J33k30%j21J55P1Mo6n1j3K69j5k28M3l20K53J41l24K23J05
7404D1j27K14j49N7j73j1K45p5j06J21J30l22J65r8K64j52j92J74p7K18k35K44
7426A56o2j82J92Pl09J50L27k16k94J93m7Qj71J81j4J6Rj3o3PK08j26N4J85l67
7451a71L2K91k75j06J74r8J7o2o8K62j50K58l30j19K60ml2L3k1J95J04j10l3l9
7475Ho1j81K58j4L2J08j29j57K59k76J83J61l64Q1M5j24r3N27j66l40L77k03J1
7498e8m1R7O1J71l04J18P7k2m1K69j64j77J78q1k06P8J8Mj70R2J59N5j97j48M14
$$ plain form
7331 -88 -95 1 157 67 101 -297 172 162 -24 68 -148 -111 -174 46 100 -67 37 -197 -119 -102 116 89 75 -55 -23
7356 -23 -317 12 -64 -79 -87 -102 -240 115 136 387 64 -141 109 -4 81 -11 -38 -88 -91 25 -173 -186 278 90 -120
7381 -120 98 -105 12 145 -85 -85 -206 -51 20 24 -42 -93 -106 163 148 -80 -37 -357 -104 37 -287 -64 41
7404 41 -86 128 -21 36 -137 -148 97 22 -84 37 167 -155 10 -88 176 24 -168 6 -71 147 -88 156
7426 156 94 -88 104 111 -198 -48 279 63 -231 -38 -85 -77 -248 -67 -81 -65 -56 -69 -132 -125 83 -43 11 196 -171
7451 -171 -139 152 -123 -229 -55 -153 -136 -198 -266 -4 -154 104 -226 -345 -85 -89 -121 -88 -109 86 190 80 47 8
7475 8 -53 -234 24 10 42 150 21 -136 123 -153 30 191 -173 -92 -47 -171 -264 263 97 -243 134 -69 -58
7498 -58 -99 -2 59 230 -74 44 121 99 58 327 163 -14 164 83 -123 -45 -27 -23 -193 -101 58 113 -84 -232 182
7523A82m15N9K41j10k1R7p9N2j09M86k92J77j89J65m52K96Oj50q8n4L63j80J64
7546A49j06J66k22j53K3J73p3R2k33L14j29o6O3n5J06k14K23P0k17J3m0L21j16
7569H9j49L1K3q5p3P1j53J17J33j31J88k1p2j17J74P7O2k78K80k96J12o0J75k56
7593a59J54J33j48M3J2j06m7J69l3n4N7K74j51j20j66K41j43N9p7M2J88k10J6
7616b6M2J08k05j4Q0J24K17l64J45j81J70m3kP2l14J91k51K35R0l83L33N9K62
7639C45m39J36O5k04K56k38P3j23jJ13J69j29L11l54j27L05j73l3R6J74l78J57
7661Am3q3R9J38j52L2J2l3J23k85K44K42m03M4K31L1L6k03m5mJ37k47J97j90J50
7686B9k28K27k74Q3P4R8J67r2J48j86J18k23J63Q1r7J1m53J08L67j07M8k28Q4
$$ plain form
7523 182 -233 -174 67 -43 -64 33 -46 6 -103 383 91 268 79 244 -208 88 94 -56 -144 -198 165 -15 149
7546 149 43 209 -13 -166 -143 30 -43 49 -184 130 1 -65 -2 -57 49 -165 58 128 -89 -76 -116 205 89
7569 89 -60 -29 -6 -91 -164 -93 -246 -129 4 -127 61 40 -32 -149 25 102 164 -114 166 -130 -18 -78 97 -159
7593 -159 -5 128 -20 23 35 -71 -118 51 18 -36 21 295 144 24 -142 99 -44 15 -62 -20 168 -42 -26
7616 -26 16 124 -81 -95 -15 109 326 -38 107 -74 96 53 51 123 -191 0 -251 -16 74 -309 24 83 345
7639 345 -94 42 107 -97 159 -79 -6 -129 -130 -17 152 23 334 -20 -147 158 -15 -48 48 222 -156 1
7661 1 -42 -125 -26 112 -40 -8 4 -29 94 -191 53 295 -108 -64 167 198 234 31 -14 -18 119 -128 69 -121 29
7686 29 -199 28 -246 -163 -89 9 176 84 232 46 164 -59 104 185 88 99 -354 -246 121 14 62 -166 -82
7709h2j29K5J22r5K35k59J76n8j38K95l01L17k43K03r9k42L01j43J00o6%K25k67
7732a23O5J48j54K44m8j51k2K53k20J10P0j68M5m2J25l48K09j89J86rK25jk84
7755g9J88j74J64j55R1M0n6M6j29R6r4N5j98J41L7K6J28k80J02J02q6nk0j75O6
7780a69M00mj98L1m5j48L53k11j5L4j4j20J1q1J22J12r6j35L40j92R0j35J69q
7804I1j44O6j2m1N3J01m10K41J17j64P1J29j99j16J93o7J16m0K1l5J01q3l9On
7829d9O1M5R6k98J24L3o9j44L24Q7k02P4L7l08J29J69q9k08P1J95p1l6J59p3j45
7854h8j5J35k43L60l94L05k59L17l05L43j11j33J00M0K12l31j44L92n9r4K04j64
7876F8j97K88J6j34r3K5j54N1J46M7j68J71j63J12J19j87J89l1LQ1k81K32J4m19
$$ plain form
7709 -82 -211 -186 -64 -159 76 -183 -7 -65 -203 92 -209 108 -135 68 -31 -273 28 -115 -15 -81 -81 144 -123
7732 -123 -58 90 -64 180 132 -19 -41 212 -8 102 172 4 49 7 132 -216 -7 -196 -10 -19 206 205 -79
7755 -79 109 -65 99 -56 35 75 19 65 -64 32 -62 -7 -205 -64 -27 -1 127 -153 -51 51 -35 -40 -60 -235 -169
7780 -169 231 227 29 60 15 -133 220 9 -6 28 14 -106 -95 -176 -54 58 -38 -173 167 -25 65 -70 99 91
7804 91 -53 13 1 -40 13 114 -296 -55 62 -102 -31 98 -101 -217 -24 -91 25 -15 6 -29 72 -11 -50 -44 -49
7829 -49 12 57 153 -145 -21 12 -57 -201 123 210 8 82 119 -189 -60 109 20 -188 -117 78 7 -29 130 57 -88
7854 -88 -103 32 -211 149 -245 60 -199 118 -187 156 45 -88 12 52 264 -67 -211 181 122 28 232 68
7876 68 -129 159 175 41 -52 -27 -181 -130 16 63 -105 66 -97 15 134 -53 136 105 108 189 -92 140 154 -265
7900b65M53k51M8k09J0J75J7J4O7K1k12K23j14L0J8j72L4OJ44j5k4m5K3k05M69
7925B40l5j35k98J96J05l9k09J58N7Q8m58J38J9K15j50J77l44M10P9j25k25J35
7947al4K41j92n0n3J43p0J27m31L70l8J79k31J56k16K09j4m9J05k15J19L3k18
7970a30j35L35J5k44K13J17j83K07k37J39j47j45K29MJ71k70o2K03j41Q8J23k2
7992A28k24J26l68K95K82k54J59m44L72PQ3l24%J40J19r0R7q1m3j09J32J18l8
8015H3qJ52m74L22j03o9L24l22P4j38J94L5o4j57L4K09J08j15Q6k95J79k30K12
8038C7j14mM49l95K11l67L73k26J48p4J77j53pMk63N10o6m32L68l47K91k29l3
8061a42K83j03j15L41m08J67M7k01K72j03K08j39K6j16L1Q7k75J35j81L6p1J48
$$ plain form
7900 -265 188 -63 -15 -224 -214 -39 -22 -8 59 80 -132 91 -23 7 25 -147 -113 -107 37 22 -2 -47 -24 -229 240
7925 240 205 70 -228 -32 73 34 -175 -17 40 128 -330 -192 -173 42 -108 69 -275 135 214 89 -136 -1
7947 -1 -35 206 14 -36 -89 54 -16 111 -320 50 12 191 -40 116 -100 109 95 46 151 -64 55 88 -130
7970 -130 -265 70 85 -159 54 171 -12 195 -42 97 -50 -195 34 38 209 -61 -123 80 -61 27 150 128
7992 128 -96 30 -338 -43 239 -15 144 -300 72 79 162 -162 -162 -22 97 7 104 23 -20 -129 3 121 83
8015 83 75 227 -247 75 -28 -97 227 -95 -21 -159 35 70 6 -151 -117 92 200 85 171 -124 55 -175 37
8038 37 -77 -81 368 -27 184 -183 190 -36 112 38 215 62 55 59 -204 306 240 -192 176 -171 120 -109 -142
8061 -142 141 38 -77 264 -144 23 70 -131 141 38 246 107 133 17 48 135 -140 -5 -186 -150 -221 -73
8083g3P3j91L44k1j10j33L85r0p4J0l79N05n83O1J57J36j94J92r1J73k94J95o1
8106f3M9P3k35OK57j30nO3R9j44j14J43m4K27j08J4l12K05kK6J5RP2J7k99K3L9
8133a19J12q1M6Mk7J03Nj44jn5J36o8K38m24P7K43o4k3n1m4J21m6l7J91j09J6
8159ar8K98O4o1k51K94l46J38J57j65J25p7n2k36k8R3K26l8n40N43L1p1m2J01
8183F4j43K72j48k76K25J33J31k7
$$ plain form
8083 -73 0 -191 153 132 22 -111 274 184 110 120 -259 246 -337 -276 -119 17 -177 15 -76 97 -197 -2 -63
8106 -63 -14 59 -176 -170 87 -43 -48 15 114 -30 -144 -1 -45 182 74 88 -224 -19 -21 5 20 29 101 118 -181 -158 -119
8133 -119 -7 -88 -42 -38 -65 38 43 -101 -102 -157 -21 -89 149 -275 -198 45 -19 -42 -93 -137 -16 -62 -99 92 -17 -1
8159 -1 -99 199 263 202 -49 245 -101 37 194 29 154 77 25 -211 -239 -146 80 42 -498 45 76 5 -37 64
8183 64 -79 193 45 -231 -6 127 258 231
8191B31
$$ Imaginary data points
##PAGE= N=2
##DATA TABLE= (X++(I..I)), XYDATA
0@%%%%%%%%%%%qJ6j6J6j6K4l2L2m0N1n9P2q8J04j20J37j61J85k10K42k77L17l60
34a91M06m58N14n77O47p21Q03q95R93j098J217j346J485j639J806j988K191k414
52a265K662k936L240l585L974m419M934n537O256p127Q211r603J1464j4098J8130
67A0301k5143M0742j38929O0838K09079k20275l4550J71539J182j23233P0468
78B2019K9928p6460R096O2160o3656k9276O1746Q928n5011J8728L4530k6635k9632
91c3535L6970K2880l6835j7441N0552J0032m7291N564L6485l6379j8778N5320
103B7544l790o1293K5924M2353l8408l138N0381l1704l8348N7475P928p8227J8350
116b4953P0135m6284n2060N7550K4113n0714J2590M5168l3823k7603M7078J2555
$$ plain form
0 0 0 0 0 0 0 0 0 0 0 0 0 -8 8 -8 8 -8 16 -16 16 -24 27 -32 40 -48 56 -64 73 -88 97 -113 129 -148 169 -191
34 -191 215 -243 271 -306 341 -380 423 -472 521 -577 640 -706 779 -860 946 -1042 1149 -1265
52 -1265 1397 -1539 1701 -1884 2090 -2329 2605 -2932 3324 -3803 4408 -5195 6269 -7829 10301
67 10301 -14842 25900 -113029 -52191 156888 -63387 -97937 73602 74784 -48449 22019
78 22019 51947 -24513 -15417 46743 -16913 -46189 15557 24485 -30526 -11798 22732 -3903 -33535
91 -33535 3435 26315 -10520 -27961 22591 32623 -14668 -9104 27381 -8998 -27776 27544
103 27544 23754 -37539 -11615 30738 -7670 -10808 39573 7869 -30479 26996 34924 -43303 -24953
116 -24953 45182 -1102 -53162 4388 28501 -22213 -9623 35545 1722 -25881 21197 33752
128C3752m5967q27L0931j4290j7998J7543k993k5269J3672K4930j8838j4443L0363
141A0566J0991l1488k392K9333n433k2505Q114N566j3650Q259J5718j5706o267
154h894J9655q489k3653K0968J9144k9453r216K9352m272k2042J7223J3166k3241
167i752j329K4597n543j6307J1063P721j3937L53J1806m907p361O077L78q439
181e580M039P947j0284j2252J0359J1085r656o10J7987M3j5899N472J2206q030
195F827o624M718o371o818J0113J299j4168K996J0468p672j906J3884j813j1493
209f560P905O659r986L9R717m466p633O825K145o629K887J655j2163k464J2299
224B30Q81q356N344O053o063Q9Q617k761j0335K452N402m164l25P601m59n735
$$ plain form
128 33752 -12215 -13042 17889 3599 -14399 3144 151 -25118 -11446 13484 -5354 -19797 10566
141 10566 21557 -9931 -12323 17010 11577 -10928 -2814 2752 -10898 -2639 13079 -2627 -8894
154 -8894 10761 2272 -21381 -413 18731 -10722 -19938 9414 5142 -16900 323 13489 -9752
167 -9752 -11081 13516 7973 -8334 2729 10450 -3487 -3134 8672 3765 -3596 2481 2859 -5580
181 -5580 -1541 6406 -3878 -16130 -5771 5314 -4342 -4952 13035 13078 -2821 2651 14857 6827
195 6827 203 4921 -1450 -8268 1845 3144 -11024 -8028 2440 -5232 -7138 6746 4933 -6560
209 -6560 1345 8004 -1982 -1943 7774 3308 -4325 2500 4645 -1984 903 2558 -9605 -12069 230
224 230 1111 -7245 -1901 4152 -1911 -1822 6795 4034 -6301 -3849 1553 -2611 -2936 4665 4206 -1529
240a529K722K678l777p25L361l897m285M619L917m546j185K419l769k381P461
255A083L703n281O60N905p14j697M526k752r594J028N901n994l213Q992q68r143
271g458M847R045o646l232Q203k684q969P250Q680r138m309R183n84o366N903
286C725L293j0169k729O918k050m310O121J555q190J124Q631l889o738N681J897
301H70o892L387J0106k279m684N212j97q892K453O968r716q239R328L252q009
316g332L773Q175p024m580R594K236o238K859M799n989j822P872q79q641K006
331a191L914o144j396P892r83p897K750O163l801j022P106l129q071N749O231
346F171p001r86P967l512o417P717M552r237k257N663l709n473O161K139p019
$$ plain form
240 -1529 1193 3871 94 -631 2730 -1167 -5452 -833 3084 -1462 -2647 -228 -3997 -6378 1083
255 1083 4786 -495 165 6070 5356 3659 8185 5433 -4161 -3133 2768 -3226 -6439 2553 1685 -7458
271 -7458 -2611 6434 -212 -3444 4759 2075 -6894 356 9036 -102 -4411 4772 4188 -2178 3725
286 3725 7018 -3151 -5880 1038 -1012 -5322 799 2354 -5836 -4712 3919 30 -6708 -1027 870
301 870 -6022 -2635 7471 5192 508 5720 5523 -3369 -916 6052 -3664 -11903 -2575 677 -7332
316 -7332 -3559 4616 -2408 -6988 2606 4842 -1396 1463 6262 273 -1549 6323 5444 -3197 -1191
331 -1191 2723 -3421 -4817 3075 2092 -5805 -3055 3108 -693 -1715 5391 2262 -5809 -60 6171
346 6171 -830 -1816 6151 2639 -3778 3939 8491 -746 -3003 2660 -1049 -6522 -361 1778 -5241
361e241R43P749k044l546N668L78r229M49R387j737n127O114J188q982K946P938
377F854o616o435O571q61q327O842P783q688l908R377p40p858N928N833q015j386
393c646R142m48o864K916L366o369j827P148l15p287J217L121n007K24Q499k120
409A750p895M490O644m544l43P713l431p996M801M363o954R0N719n128n096O295
425D78K209o405P48M961l933l355O885K569p066j40Q355q00m909M077J709p289
441a906j360O877j699n992L813J390p104K322P936m010n833M756O09m964M578
456e87O179m710p43N457l453n870P027L162j1039k364R295n99o374L776L489n134
472b488M40M959l751m593M841J110l840L943O506l761n434L578J818l823M20L022
$$ plain form
361 -5241 -4298 3451 1407 -2139 3529 3907 -5322 -4873 4514 2777 -2350 3764 4952 -4030 -1084 6854
377 6854 238 -6197 374 -487 -8814 -1972 5811 -2877 -6785 2592 1852 -6006 -78 5755 -2260 -3646
393 -3646 5496 5048 -1816 1100 4466 -1903 -3730 3418 3103 -4184 -2967 154 -4853 -4629 3870 1750
409 1750 -6145 -1655 4989 445 102 7815 4384 -3612 1189 5552 -1402 -1312 4407 -721 -5817 478
425 478 2687 -3718 -2970 1991 -1942 -5297 1588 4157 -2909 -3049 5306 4506 -403 3674 5383 -1906
441 -1906 -3266 3611 1912 -4080 -267 1123 -5981 -3659 4277 267 -5566 -810 -201 -5165 -587
456 -587 5592 882 139 5596 2143 -3727 3300 6462 -4577 -6941 2354 1755 -4619 -843 2646 -2488
472 -2488 -2048 2911 -840 -5433 -592 518 -3322 621 7127 3366 -2068 1510 3328 -495 -75 2947
488B947k666m606J828M000j502l74K542k464n002L379M681l205k351M759j07l264
504a405M920K145o723L24O126m649n534O355R53q187J914O871l788k516N448k432
520a78n914M449N373l800l69L574k311j469M890K61n454j25K414l314j190L937
536G74O35m655m8K779j577r23L468o4l706K711M899j034k496K245L76l880N15
553A9L040l036l145K143L05j773K512K040m195k465L800J094j943J784K276l123
569f67r33L842J631k253N64L3m009K49M610j561n322K099L191l452j567M873j043
586B85m139K994K334l927K453N449m991m470P166L288n992p07L636m341k857N071
602A252N45m999J012J875l100O71M590j673k629L398J253k971J166L542k338l682
$$ plain form
488 2947 281 -4325 -2497 1503 1 -373 2169 -295 -5297 -1918 2763 -442 -2793 1966 1859 -1405
504 -1405 3515 5660 -1063 -739 5387 738 -4796 1559 2512 -5675 -3761 3110 -678 -3194 2254 -178
520 -178 -6092 -1643 3730 -70 -439 3135 824 -645 4245 4506 -948 -1073 1341 -1973 -3163 774
536 774 1409 -3246 -3294 -515 -2092 -3015 453 389 -3317 -606 4293 3259 763 3008 3384 -496 19
553 19 3059 23 -3122 -979 -674 -2447 65 2105 -2090 -4555 -755 339 -1604 180 2456 -667
569 -667 -1600 2242 3873 1620 2184 2217 -1792 -1543 3067 1506 -3816 -1717 1474 -1978 -3545 1328 285
586 285 -3854 -860 1474 -2453 0 5449 458 -4012 3154 6442 450 -257 3379 -962 -3819 1252
602 1252 1797 -3202 -2190 -315 -3415 -2744 1846 173 -2456 942 2195 -776 390 3932 1594 -2088
618b088K462J747j976P3J697k457k110K493K241k988k714J997M94j086K267K509
634B561k306j596K923M08k654K075J948m163q55M030K0l492J495O62n676P52N443
651A575k318l520L492R65k614K977M206m200k151M270o73l274K812K309m446j630
667b220L528j237k492K718k53m190R68M244j80k919J579J990j664j22L487l46
683B891l739L09J859j042P8K895j972l417J998K237l275n04K625k937k940M410
699e24K663k851L51K475j694r45L532K18m451O11K840j488j245K695l09m234o
716b362K265j334j622K768M1l048K057M617j511j977K183l88k933J947K387l675
732e85j391K178l30j529J771J049l604q46L415n05k278K902J224k977l1M110J18
$$ plain form
618 -2088 374 2121 145 218 1915 -542 -2652 -159 2082 -906 -3620 -1623 -1129 -2215 52 2561
634 2561 255 -1341 1582 1990 -664 1411 3359 -804 -1659 2371 2391 -1101 394 1056 -4620 -3868 1575
651 1575 -743 -4263 -771 194 -2420 557 4763 563 -1588 2682 2009 -1265 1547 3856 -590 -2220
667 -2220 1308 71 -2421 297 44 -4146 -3178 1066 886 -2033 -454 1536 -128 -250 3237 2891
683 2891 -848 -539 1320 278 356 3251 1279 -2138 -140 2097 -1178 -1682 943 -1994 -4934 -524
699 -524 2139 -712 -361 2114 420 -525 3007 3225 -1226 -615 2225 737 -508 2187 1878 -2356 -2362
716 -2362 -97 -1431 -3053 -285 -244 -3292 -1235 3382 1871 -106 2077 1689 -1244 703 3090 -585
732 -585 -1976 202 -128 -1657 114 1163 -2441 -3287 128 -377 -2655 247 1471 -1506 -1537 2573 2691
749B691k553Q99O01l084P94L575j636k953J598O49k214Q03J587k188j876K244
765a063P52o88J377J769j421o84K215Q73k205p3O95j807n00K158K71k986k77J502
783i2j344k51L013q39m089K154L284j457k85K737j427k947K147K053k653m99K099
800A604j819k202K568J398k797n23J403p69q91J899N10k346J30K229j70m19J870
817A675k58k607J147L041j215k046N56j91k658J252K158j595j929J342J91j902
833c039K503L110j800j811J775J311o94L26J096j726j593J450M10k180J0O47j788
850a993j62K767k19k055J016J696j534J040K276j389k408J533J332j261O90J058
866B387k711j076J406P25j738M06O62k356m35K652R55j402j00Q25n09l6J809j64
$$ plain form
749 2691 138 1037 1638 -1446 -652 2923 1287 -1666 -68 581 -1633 -830 757 -1431 -3307 -1063
765 -1063 -311 -999 378 2147 726 42 2257 3130 925 852 1547 -260 -760 1398 1669 -1317 -1594 -92
783 -92 -1436 -1687 1326 487 -3602 -1448 1836 379 94 2831 1404 -1543 604 2657 4 -495 1604
800 1604 -215 -2417 151 1549 -1248 -1771 -368 -1137 -2028 -129 381 -1965 -1835 394 224 -195 1675
817 1675 1417 -1190 -43 2998 1783 -263 293 102 -2556 -1304 854 -741 -2670 -1328 -1137 -3039
833 -3039 -536 2574 774 -1037 738 2049 1355 1681 2777 1051 -542 908 1318 -862 -852 -205 -1993
850 -1993 -2155 612 393 -1662 -646 1050 -484 556 2832 1443 -965 568 1900 639 1329 2387
866 2387 -324 -1400 6 731 -1007 -601 61 -2295 -2730 -78 877 -525 -625 200 -309 -345 1464 1300
884A300j738N79J160p60k66P52q87k494M70J661o20p30M90m65q52K133J552j421
902a36n02J333l27j625K258K083k338j839J780K72j094P40L8k382j22J869p51
919g43p93K220j68k322J453K169q69j578J712k94q93J669J596j762j216O79k01
936F59n41K20J39j821p26Q68Q06J23M86r1j102N29J535M95p01n8K41q16K51J441
956A937p17k106l40K23p13m27J218j63j510O96J872LQ6R76r59n99J648P69j269
975F25l50N80j481n95J758K67k194q21J105o90K20J966rk265P72J986k41l21R55
994A267m59j298J151J352j220m51P34j184p44J593L91j959o31J143m15j89J794
1011H75N08j334r39J094J173l96N67k20j204R8R81K76r70m55K20j083l53J699
$$ plain form
884 1300 -438 141 1301 541 275 1027 140 -2354 -1884 -223 -843 -1573 -1083 -1548 -2400 -267 1285 -136
902 -136 -638 695 368 -1257 1001 3084 746 -1093 687 959 -135 605 643 -1739 -1861 8 -743
919 -743 -1536 684 516 -1806 -353 1816 947 -631 1081 787 -106 1563 3159 1397 181 860 659
936 659 118 338 477 -1344 -2070 -1202 -396 -273 213 122 -980 -451 1084 1579 878 820 1061 245 496 1937
956 1937 1220 -886 -1226 -1003 -1716 -2143 -925 -1088 -2598 -1902 -30 -27 59 1035 76 -523 1125 1894 625
975 625 275 855 -626 -1221 537 804 -1390 -2211 -1106 -1796 -1576 390 381 -1884 -1112 874 633 312 1267
994 1267 808 -490 661 2013 793 342 1076 -108 -852 741 1132 -827 -1458 -315 -730 -919 875
1011 875 1383 49 -890 204 1377 981 1548 1328 124 222 1203 1479 509 54 274 -809 -1162 537
1029E37m60j904M35J272p12J42J316k15j865J201J390m88k2J014j525j167J724
1046F73O16j405n69K73j043n82J497K23j193q9O12j0P77J258k12j317P65J264
1064A538l85o8J053j479j571R32Q16j043o80J59n01p31J126J142n26k58N95O2
1082A81O46Q11L74q69j057J111K31j078p0M10j498j028J867L44j373M29J57q58
1100a270N34J958m14j516J309M26r57Q76R24j195j144O63l22l86N58L34k122l10
1118b054J935Q9n84m6M34j084K61J828L44j051k52L91j38L67J148j029j486M29
1136d98Q39j059P3J158r39j133P17R00k29Q6k48l97K02J093P74n22o55M91K81
1155I34l17Q96J1j473j091J160J45q39N81O16j830m07J666J09n66R43k10j135
$$ plain form
1029 537 77 -1827 -1392 -120 -832 -690 626 411 -1454 -253 1137 649 627 1641 116 -1051 673
1046 673 1289 -116 -685 -412 -1455 -2037 -540 -317 -1510 -1599 -987 -997 -220 1038 826 -491 274 1538
1064 1538 1153 1085 2138 659 -912 20 836 -207 -887 -728 -1229 -1960 -834 308 -218 -476 119 181
1082 181 827 1638 2012 1143 86 1197 1428 350 280 690 -808 -1836 31 375 -998 -569 -412 -1270
1100 -1270 -736 1222 808 -708 601 1027 70 946 1870 675 -469 194 -128 -514 44 378 -1744 -2054
1118 -2054 -119 -30 -614 -660 -226 -1310 -1049 779 1123 72 -180 211 73 440 1588 559 -927 -498
1136 -498 341 -718 -645 513 -426 -1559 -842 58 -171 -85 -333 -730 -528 565 1339 817 162 653 934
1155 934 617 1513 1524 51 -1040 120 265 -574 7 623 -1207 -1614 52 161 -405 538 328 -807
1173h07J215J543p26n85O11l15j470J399q1j364r37O77M6n11R40m42o78%J424
1192f1j69J37O43K91j187L24J404K4j120n98K8o19N47P17r42j077R1M70P8O04
1212d15R47q31o63J143P14n9n1O51j046q73J147P92j716r3K53p74r1J082P3j514
1232a324J48J178k1J58J035n33j260P61J199l08L7R6p47q36P29K60k23j49j46
1251E4r20p6J011L79n62m88L65P2L7R38P7j133J64Q68k34l07N62m69j082M69R36
1272F61n11o25J22j007k43J409L28q27m95O93J87p8Q96M73q06m91P18N0M26m9
1292H31n35j034K2O20J08j003j88N88p03KJ532M13r27K94M29O8O30R85j285j177
1312c30P33O73n72m61J39j155n62J055M95m96J96M18p94J07J551J76o46J26K15
$$ plain form
1173 -807 408 1951 1225 640 1251 936 -534 865 784 -580 -1517 -840 -794 -1305 -365 -807 -1485 -1485 -61
1192 -61 -230 -93 550 841 -346 -22 1382 1406 286 -312 -284 -903 -356 361 -581 -1658 -1567 -1097 -1019 -415
1212 -415 532 -299 -962 181 895 836 785 1436 390 -483 664 1456 -260 -353 -100 -874 -965 117 190 -1324
1232 -1324 -1176 2 -19 139 1174 641 -619 142 1341 1033 1070 1166 419 -417 312 572 349 200 54
1251 54 -866 -942 69 448 -114 -602 -237 -165 -128 810 887 -246 -82 786 552 245 807 338 -744 -275 661
1272 661 150 -475 -353 -1360 -1603 -194 134 -693 -1188 -495 -308 -386 510 983 177 -314 404 454 880 831
1292 831 296 -738 -716 -96 12 -991 -1179 -591 -1294 -1292 240 653 -274 20 449 517 1147 2132 847 -330
1312 -330 403 1076 504 43 182 -973 -1535 -480 15 -481 -285 133 -661 -554 997 1173 527 653 868
1331H68m76M12L99p1j035k15L7j76J73J09j023m76N57Q93M7j31k57K70k10P31
1351D26Q22o64n60K38k25l27Q84J5q84n79J50p8l6L48K54r32j7R95J11k39M86
1372A88K36r37O17J017m58q09N35j81l92R38l9j016n07O93l87QO49m9j191K33
1392h52R19j5kO20m22n34N41J133j51p96J8l93l46L22L67l93q16j64K45J79M00
1413a40M24p33l25M63J019M7j59m0k19q5N01K40n74l52l22k02k88N86J03p88p34
1434a578P99L2K90P95Q4n99J63J019j13k4Q2o69p79N87N05r63j41K15o45j75J154
1455C9k70l06j14J25M13K33Q63k40o76J58L31Q0qJ65p95n66L66K18j13m02K04
1476b95j22l48L94Q74n83l65L7M70L26K68K89m93j21j03L83J07j86m51l24k82
$$ plain form
1331 868 392 804 1203 1132 97 -118 -81 -257 -84 25 -998 -1474 -917 -24 23 -108 -365 -95 -305 426
1351 426 1248 584 24 262 37 -290 594 609 -275 -854 -704 -782 -818 -470 -216 -1148 -1165 -170 -59 -298 188
1372 188 424 -513 104 1121 663 -146 389 208 -184 754 715 -301 -808 -115 -502 -494 155 106 -1085 -852
1392 -852 67 52 50 670 248 -286 255 1388 1237 441 459 66 -280 42 409 16 -800 -964 -719 -540 -140
1413 -140 284 -449 -774 -311 708 755 596 556 337 252 753 993 419 67 -255 -457 -745 -159 -56 -844 -1578
1434 -1578 -779 -747 -457 338 422 -177 -14 1005 892 868 950 281 -498 89 594 -369 -510 -295 -940 -1115 39
1455 39 -231 -537 -651 -526 -113 120 983 743 67 225 556 636 628 793 -2 -568 -202 16 -97 -499 -295
1476 -295 -417 -765 -371 503 -80 -445 -408 62 388 656 945 452 331 228 611 718 532 81 -243 -525
1496e25K52M14o69q1J50j25l9Q42N67j056k3L33K69l6N63k33r18K89O52n19p2
1517C5N43q55q34Q47L97o32N6m17k21O94N10J74j68L84n1l53R15O4o25k8l69n90
1539e24M35M73p60m09j58j02O62L78j42q5L2J19N81M09k30j48k42J55L7j54L89
1560G16r00q11M38K70j12J10L54j124K24J173k62R7J16n17p2M23Q12j25o01j23
1580H6Nr2M94Qp44n3j32p8M0M46m45L0k07J99Q10N6j09o2Q4j33L62K01l21o64
1604b19J49l8J07J48k28p75j08O28L9N6J53M5n13L96P82m8k9J3l65j33M44L56
1626H60k90o80o7k43o9N59K16q23l00K97K46K60Q3k8p4n2L69M54Rk70j35O0Pl6
1650C53j5m48p23K74j04M20P6k87k33K25L99K82J44J79k60k03K19K41L49k33n10
$$ plain form
1496 -525 -273 141 -528 -609 -459 -584 -623 219 786 -270 -293 40 309 273 836 603 -315 -26 626 107 35
1517 35 578 -277 -1111 -264 133 -499 -443 -860 -1081 -387 123 297 129 513 462 109 1024 1088 463 435 66 -524
1539 -524 -89 384 -376 -785 -943 -1045 -383 -5 -147 -232 -200 -81 500 909 679 531 289 444 481 327 716
1560 716 -184 -995 -557 -287 -399 -289 65 -1059 -835 338 76 173 289 -228 -300 123 935 810 209 86
1580 86 91 -1 493 501 -243 -296 -428 -506 -466 -20 -465 -435 -642 -443 367 423 314 252 336 203 565 766 445 -219
1604 -219 -70 -108 -1 147 -81 -856 -964 -336 -297 -241 -88 -43 -556 -160 622 574 545 558 193 60 504 860
1626 860 570 -110 -177 -420 -489 70 286 -537 -837 -540 -294 -34 49 21 -53 -105 264 718 727 457 322 382 389 353
1650 353 338 -110 -833 -559 -663 -243 -167 -454 -687 -462 -63 219 363 542 282 79 298 539 888 655 145
1671A45l84L93K03l03j86m53k76Q6J36O25Q5m54J45R0O16N8K55k44o67J31L87
1692C88L60q50J39m78m99N87L88l34k62K2J35PL59M61m62kK79j26L01j9J82l36
1714B40k08o6L8m4Nl55l04M79J04Q0l55j42k9K56M30K75n23P8K87M9L04O4j66
1737D97l93J16m70M97O2l16m49m67L38M41M65m58K3J78p4p4P18J20n30o7M11M8
1759F16r2J79o74j85n4J06rR3j19p27J19O04O4K18k3L4j62K63M32k37P4k94k35
1782iJ69L66m28k89k75R2j69K18K0k38m4J52J65L30J78k2j44j02K00M01L56n06
1804D21n73K4j97K68Q8j95k98q0j66K95K20L76k73k77M35K57K61M5q5k62k10K41
1826C15J12L3l85n3k39L5L69j23l11l59j86O36K10K82k76j50J33M55P9J26k22
$$ plain form
1671 145 -239 154 357 54 -132 -585 -861 -775 -639 -14 71 -383 -238 -148 468 526 781 537 -130 1 388
1692 388 748 -102 37 -441 -940 -353 35 -299 -561 -539 -404 -397 -38 423 -39 -41 238 112 413 394 576 240
1714 240 32 -34 4 -40 -35 -390 -694 -215 -111 -31 -386 -528 -557 -301 129 404 -119 -41 246 295 599 663 497
1737 497 104 220 -250 247 309 -7 -456 -923 -585 -144 321 -137 -114 64 -10 -84 634 754 224 157 568 616
1759 616 524 703 29 -156 -210 -104 -113 -20 -139 -866 -747 -143 -79 139 116 150 -12 251 683 446 520 226 -9
1782 -9 160 526 98 -191 -466 -374 -543 -325 -305 -543 -587 -435 -270 60 238 216 72 -30 170 571 927 421
1804 421 -152 -128 -325 -57 31 -164 -462 -542 -708 -413 -193 183 -90 -367 68 325 586 631 546 284 74 315
1826 315 427 460 75 22 -217 -182 187 64 -247 -606 -792 -156 54 336 60 -90 43 498 577 703 481
1847D81m63J17O9J72l68k87k19j05p1O17J00n86L9RPO01J40N4k84J36J43QR4p1
1871C33j19l36j10K76j55k35k58J50J12M2K92m4j65k72M95L27R6N9J59n12m0N93
1893F88l47j95R2l86m04M75K87m18m05M61k69n3O86K69n93J46J92k02J74N15l47
1914C66m57J45J79j84K82J24r15j60L92JP4j26Rl59L62K80L39j01J0l33P6K98
1936C02K74n3k99m91m6M07K8l37l62J44l48Q17j13l28J38j65K75K32L25J63n49
1957A4n5J78J6L5L9o0m41j8K48m52M40q4l49o3M15J42n3K31N1j10J02N25m6k30
1981D75l13J16j86Q5P8j14o50L94q4r0K63m32j22J68L16K12N04k30k37j24J26
2002A55K53q3P9m34k42n3K98l5p1l4m10L91O3q0K09l76j4M5L40K06k68J95J07
$$ plain form
1847 481 18 135 204 376 8 -279 -498 -603 -674 -57 43 -543 -504 -495 -488 113 253 307 23 159 302 310 404 333
1871 333 214 -122 -232 44 -111 -346 -604 -454 -342 -300 -8 -52 -217 -489 6 333 429 488 647 135 95 688
1893 688 341 146 238 -148 -552 -77 210 -208 -613 -152 -421 -474 212 481 -112 34 226 24 198 713 366
1914 366 -91 54 233 49 331 455 -460 -620 -228 -227 -153 -279 -270 -629 -267 13 352 251 261 -72 4 302
1936 302 576 523 224 -267 -313 94 122 -215 -577 -433 -781 36 -77 -405 -267 -432 -157 75 400 563 14
1957 14 -41 137 153 188 227 167 -274 -292 -44 -496 -56 -140 -489 -552 -137 5 -48 183 234 124 226 751 705 475
1981 475 162 278 92 177 255 141 -509 -115 -199 -289 -26 -458 -580 -412 -96 116 620 390 153 29 155
2002 155 408 325 404 -30 -272 -325 -27 -62 -133 -167 -577 -186 -123 -203 6 -370 -384 -339 1 207 -61 134 241
2025B41m75L71K58q6m26k77J70J87O5k18l34k06M58L13P2k35M52o18r1N80K99
2046E00j29j62m3l22L86R9r7k43n5l56K1K74o9n4K8j52J53N06P9o0j55N1J55K72
2070F27P0m9l60m78L83j87J0P9l36m14J4M08k4J84o1k56L77o8N24N2l31j8J77
2093C23RO5k41k12j1m52R0L13j76l84L25k31L42J0L40l07j44M56J60o1O2kl03
2116b9j16K0L18M0l07k21J0m5K06N7j13L8l84M86L59k67K55m5L1j34L32Pk07m1
2140B50j98J48J14j82k07jJ26k01J68r1j7j16O6K5L8L98J48m21J00j08L09J20
2162D68l6o80P1j9j37J40M02l15m50K26O2J45J09n9k2j35N39L9k34K20J34l43
2184A25j9J27l5l47r6j30k58K26K85j33r8K2J20L11J11r3J07j04Q5K4M50l84j49
$$ plain form
2025 241 -234 137 395 309 -117 -394 -224 -37 28 -190 -524 -730 -272 41 113 -122 330 -288 -379 201 500
2046 500 371 209 166 -156 230 329 232 -11 -66 -422 -401 -127 -196 -250 -222 -374 -221 285 364 304 149 200 355 627
2070 627 697 648 288 -190 193 6 16 95 -241 -655 -641 -233 -257 -73 -134 -390 -13 -81 443 495 164 146 323
2093 323 332 397 156 -56 -67 -519 -429 -116 -292 -676 -351 -582 -240 -230 110 -197 -341 115 275 214 276 274 -29
2116 -29 -145 -125 193 233 -74 -295 -285 -330 -124 -67 -180 -142 -526 -40 319 52 307 262 293 159 491 498 291 250
2140 250 52 200 314 132 -75 -76 50 -151 17 -74 -91 -207 -141 -116 -78 320 468 47 147 39 348 468
2162 468 432 -248 -177 -196 -333 -193 209 -106 -556 -330 -268 -123 -14 -73 -95 -230 309 348 114 334 468 125
2184 125 106 233 198 -149 -245 -375 -633 -407 -122 -255 -353 -331 -211 100 211 118 225 121 206 230 680 296 147
2207A47j10j51M1J22n1n51Q9K83m8M70l28j04m3J06K54L65k75m9L49l96K6M20
2229E66l37l9m73k71O93k42Q5k50k9O9J79J93K6P4k20k23M65J8O6j74l51j15L96
2252A06n9J00l80K35j90j34Q1O1j60j36L49JK53N9J60l01j00L07J07r5j19M9m80
2275b86J31J15K47m1k86j11k82L99R3P9k85jK90L9K0K20j03l4J14L3R8k82K19
2298C86o28N6l2L89k15p6k86M0K47N3K32j85J05r5M9K29K87j71k94j26J99L7K86
2321D87n39k46o7n7J90J62p2j09p6N00k54J92K76k14j43M5K40j21J42l13k12R2
2343i7O1j2l3j41k64R4L91M0m6j36J54p9M90k7m3k40J45j95K5M4K46k06k20R8
2367D9j18j13L03k77l01L34K47L9j07q0r3p5K6O60J8l49J78k04j87K76k06P4r2
$$ plain form
2207 147 37 -114 -73 49 -2 -553 -464 -181 -229 241 -87 -191 -234 -128 126 491 216 167 516 120 146 566
2229 566 229 190 -283 -554 139 -103 -18 -268 -297 -228 -49 144 170 244 24 -199 266 284 350 176 -175 -290 106
2252 106 47 147 -233 2 -188 -322 -241 -180 -340 -476 -127 -126 127 186 346 45 -55 252 359 264 145 194 -286
2275 -286 -155 -40 207 166 -120 -231 -513 -114 -21 58 -227 -228 62 101 121 341 238 204 318 351 449 167 386
2298 386 -242 -186 -218 171 -44 -120 -406 -366 -119 -66 166 -19 86 -9 40 269 556 385 91 -35 164 201 487
2321 487 -52 -298 -365 -422 -232 -70 -142 -251 -327 173 -81 111 387 173 30 75 315 194 336 23 -189 -97
2343 -97 -36 -48 -81 -222 -486 -392 -1 39 -7 -143 11 -68 422 395 352 112 257 62 87 131 377 171 -49 49
2367 49 -69 -182 121 -156 -457 -123 124 163 56 -24 -117 -192 -166 494 512 163 341 137 -50 226 20 94 2
2390Bk12k1L83q1l12q1J18K38j58K54j0j62J98J7o7K18P8k29m18J78J78J14k60
2413c5j97k42L19Q7O5j21J77l57K7M01L19k2l26J47j43J82J61j36m68K29k69j4
2435b16L48l45j49J91Km6R4J44l8L0k9K81qK91k42j80r1J1K39j23Rl14L4k75M66
2460H4j36k15K33k03o4K50K49j2J36k65J8K29J02l42K90k92m2L2q7j07j83k60
2482e85M17k34N32j62o5k65K27K19K09p4pk73j15L51j34L02l45n9j50J51K64k81
2504g7MJj0k10K94j74J84j61K06N4Q3J30j31j26J48o4LM6j92j86m0J83j38J17
2528e6J76l66k96L91K65j18J01j45J77J40%N0j36o2j3N1R2Mn38K10r1j8p4J48
2552a08J12m55L11q3J19K15K68l05r4M96k72k09j5N1k26q1K96k36k57K90k15j00
$$ plain form
2390 2 -210 -231 152 71 -241 -322 -204 34 -124 130 120 -42 156 173 106 324 402 173 -245 -67 111 225 -35
2413 -35 -232 -474 -155 -68 -3 -124 53 -304 -277 124 443 421 95 242 99 281 442 306 -162 67 -202 -216
2435 -216 132 -213 -362 -171 -169 -215 -121 23 -15 15 -14 267 259 550 308 128 37 48 287 164 173 -141 -107 -382 84
2460 84 -52 -267 -34 -237 -301 -51 198 186 322 57 75 304 406 64 354 62 20 52 -35 -142 -325 -585
2482 -585 -168 -402 130 -32 -97 -362 -135 84 293 219 212 -61 -176 175 41 343 -2 -61 -211 -60 204 -77
2504 -77 -73 -72 -82 -292 2 -172 12 -149 57 111 194 324 193 67 215 151 154 200 8 -178 -218 -35 -173 -56
2528 -56 120 -246 -542 -151 114 -4 97 -48 129 269 269 319 183 121 108 159 251 255 -283 -73 -164 -182 -256 -108
2552 -108 4 -451 -140 -223 -104 111 379 74 -20 476 204 -5 -20 31 -195 -276 20 -216 -473 -183 -398 -498
2574d98K55J28J95l43J63j05M87j01K40j81l49N0PK84k96m8k66J83O8J06kk78
2596c01kR6J43K97l00L52p1k15L47j73p2P4m8k83J54m7o3K79m47k5J83N4j28J94
2620bl41J72K56j68K15r4J73r3q5o6K28k2j5j88j32J14J14k7k41O3k33L30j72
2643b14L75k55J42N2J39M01m28j23J70k98L26j10q1k24l9N9n6q4J41Jj80j05M39
2666D8N3j80J49j2K04k61J11K21L4k86lK0O7j37o6J09m57nj9K73Q0k31P4J67K34
2691A87J02N6k53j73J95pJ20K3l24J58n18L34j13L6j54L1O7J86J60J41j11l6j58
2714e1J55p2K88l43l6m3K86q1J27k98j75J8M2K94j76J44n70M38M9j47J52K17j92
2737B6j74K66M04j80j86p5k11L59k07%k05P8k6k78L2M33r1j09QL9J8L45j65J27
$$ plain form
2574 -498 -243 -115 80 -263 -100 -205 282 181 421 240 -109 -59 -52 232 -64 -112 -378 -195 -127 -21 -23 -301
2596 -301 -303 -207 -64 233 -67 285 214 -1 346 173 101 175 127 -156 -2 -49 -112 167 -280 -305 -122 -68 -196 -2
2620 -2 -343 -171 85 -83 132 38 211 118 33 -33 195 173 158 -30 -162 -48 66 39 -202 -139 -372 -42 -214
2643 -214 161 -94 48 100 239 640 212 89 259 -39 287 177 96 -128 -167 -108 -164 -248 -107 -106 -286 -391 48
2666 48 101 -79 70 58 262 1 112 333 367 81 78 98 165 28 -38 71 -386 -391 -410 -137 -57 -288 -214 -47 187
2691 187 289 345 92 -81 114 107 227 250 -74 84 -434 -100 -213 -177 -331 -300 -233 -47 113 254 143 107 -51
2714 -51 104 32 320 -23 -59 -102 184 103 230 -68 -243 -225 -183 111 -65 79 -491 -53 -4 -151 1 218 26
2737 26 -148 118 522 342 156 81 -130 229 22 22 -183 -105 -131 -409 -377 56 -35 -144 -136 -97 -79 266 101 228
2761B28o0J13k54L24j92m0m06r6L51L0k3j66j61J13M31k04J9l4j0k02K53P6K51
2784C41k08M4k20J00r8N7m5m6MP4J48P3m26J5k15K73L96p5k00K3j55J9K34L3K62
2809D08m49MJ03j89R1J09k96q2L6M31j49o0j76J87j95J75M29j50l2O7P8m10K69
2832A99L3k30J59k61j67K70k4j57m1J55l08J88M62k29q3j11L96Jq7o7q4K43nq2
2856A70n9j53j23M7o3N0j00J43k88K93j66J69ML42j77M1r7J02J4K5j06j38l8J46
2880C8J28j80O3o0j27m9K30j40k46R9K51j05L11QP8j67k75L59j02q5L5m88K04
2903b20M06p2j58k36M6K49j86J32M8J1l10M70j83R9J46k68j57P1P0L6J45o1j01
2926b3k33P2N5K08k68K6OJ48j46J78j14N0K61n8rM2J2%l67R3J69m6kj06m9j51
$$ plain form
2761 228 168 281 27 351 159 119 -287 -383 -32 -2 -25 -191 -352 -239 192 -12 7 -27 -37 -239 14 90 341
2784 341 133 177 -43 57 -41 16 -29 -75 -71 3 151 224 -202 -187 -402 -129 267 192 -8 15 -140 -121 113 146 408
2809 408 -41 -37 66 -123 -32 77 -219 -301 -265 166 17 -43 -219 -32 -227 -52 377 227 195 262 340 -70 199
2832 199 232 2 161 -100 -267 3 -21 -178 -219 -64 -372 -184 278 49 -34 -145 251 252 165 98 14 257 252 170
2856 170 111 -42 -165 -118 -181 -131 -231 -88 -376 -83 -249 -80 -76 266 89 130 33 135 149 174 68 -70 -108 38
2880 38 166 -14 49 -11 -138 -187 43 -97 -343 -244 7 -98 213 221 299 132 -143 216 114 29 64 -424 -220
2903 -220 186 114 -44 -280 -234 15 -171 -39 9 20 -290 180 -3 96 242 -26 -183 -112 -42 -6 139 78 -23
2926 -23 -256 -184 -129 79 -189 -163 -157 -9 -155 23 -91 -41 220 162 153 195 207 207 -160 -67 102 56 54 -52 -101 -252
2952b52RP5K06l9k2J02j83K46J48k0q9N2Q6o0o6o7M8j74l34K52K8j01l7l4J54
2977g2J36m43K17J07P7M9OQ7j8k4k46L09L15l39m9j50j14j57N1J72j17J19P4k97
3001c07K39K14j30K10l13l4M32l62K45l9k93J18j15nK08O2o00N54o2J19j42k18
3023b19K93Jr2L26k51K11l06L36j67n7L50m62k36R5j07N46P2l92j59J13L0L2N1
3046HO4k11L91j50M3K77l13J75k79m9j5K23k87k9J29P6m25L19l7j37N9K04qO2
3070I0j36Q3N1l1m5L16j00j21j97L10j21Pj11m9J0l67L15m8K53k65k4J72J04j61
3094f5K28O0j29j03N8L41j06k56J41l34L0K15k09q6j50lJ97P5k02K07n9JK11J70
3118B32l19J88j8R5o6k65J68j50P3LQ1l3j54N3k64L29p3K85k15K47j50k32J75
$$ plain form
2952 -252 -243 -168 38 -1 -23 79 -104 142 290 270 181 233 319 259 193 126 174 0 -334 -82 -54 -155 -192 -226 -72
2977 -72 64 -379 -162 -55 22 71 77 164 146 122 -124 185 500 161 112 -38 -152 -309 -258 -86 -203 -84 -10 -307
3001 -307 -68 146 16 226 -87 -121 311 -51 194 155 -138 -20 -135 -140 68 130 -470 84 22 141 -1 -219
3023 -219 74 75 -17 309 58 269 -37 299 132 75 425 -37 -273 -178 -285 261 333 -59 -218 -105 -75 -43 8
3046 8 72 -139 252 102 145 422 109 284 5 -44 -59 164 -123 -152 -23 53 -372 -53 -90 -227 -168 36 28 90
3070 90 -46 37 88 57 12 328 228 107 -90 220 99 106 -5 -54 -44 -411 -96 -144 109 -156 -180 -8 96 -65
3094 -65 163 223 94 -9 49 390 284 28 169 -165 -135 80 -129 -215 -365 -368 -171 -96 -298 -91 -150 -149 62 232
3118 232 -87 101 83 178 112 -153 15 -135 -62 -59 22 -11 -165 -112 -376 -47 -120 165 -50 197 47 -185 -10
3141a0J72Lk97p2p6l2K18K52k40k19K31k22J77K72j56j58L1p8J47J29k07o1K40
3164D4J9J19j8m6m4o1q8O3J7M7n04K36P6K25n3k34K36j0r3N8J43O4M0q6k45J45
3190E0K5m4j2O1k21J55J00l32J32P2J38m1O1l2k1k39J58J8J08lj2k46%J89n0k
3216A2r9j02m9n9N7L82k35j01K53j07J54q8j16N3K98l14k9L55M2l86J0j06j23
3239b98K85p5k18K78k27KK57Q4R1k13J52k75M09j20N7m26J98J04J10K50l19l51
3261b45J47k9q7K37Q7p7O3J2kl3j5Q1j12q8J40J37q6j33k2Q9k43K26q8r8J48M9
3287E8j86L09j70j0k76J08Q0L08l34L04J7k51K17j78J78j14o9k28M03k41r9p9
3309b53K34l66K45K1J94J6Q9l48R2M52k73N2k43R9J60p5l4q5OJ5j29M5J65j59
$$ plain form
3141 -10 162 165 -132 -204 -280 -312 -94 158 -82 -301 -70 -292 -115 157 1 -157 -126 -204 -57 72 -135 -196 44
3164 44 63 182 164 118 74 13 -75 -12 5 52 -452 -216 -140 85 32 -202 34 24 -69 -11 132 196 236 150 -95 50
3190 50 75 31 19 80 -141 14 114 -218 -86 -14 124 83 144 112 91 -148 10 28 136 133 121 -125 -125 64 14 12
3216 12 -87 -189 -238 -297 -240 142 -93 -194 59 -48 106 18 -98 -45 253 -61 -90 265 307 -79 -69 -175 -298
3239 -298 -13 -88 -306 -28 -255 -253 4 88 179 -34 118 -157 252 132 189 -237 -39 65 175 425 106 -245
3261 -245 -98 -127 -214 23 110 33 96 108 106 73 58 139 27 -61 79 216 130 -3 -25 64 -179 47 -41 -139 9 58
3287 58 -128 181 11 1 -275 -167 -87 221 -113 191 208 -43 174 -4 174 60 -9 -237 166 -75 -174 -253
3309 -253 -19 -385 -140 -119 75 91 180 -168 -76 376 103 155 -88 11 171 96 62 -23 -17 -2 -131 -86 79 -80
3333h0nj36N9L0K32J50k37Mp2L40l46N7J13m35L68l8Rj28O5K04k91K6Kr1J00k8
3359a28j7K99J74k25J08j15j29r6J72J18j35l25L65M6N0q8l67K16k5K81j7o4j75
3382g7K11k94K40J61j81j5k30J30L2N8k02J78k80K41l03L79R1l33J59P4j89M0
3404a10K53lk26m9J21j8L86N1m49J65J41j10K2J14j84j91Q1k93K31R4j17j2K11
3427A08n3q4J32J23k88J48O6m5k8M1j9k34k7J0J22q9J23P1k73L04j65lJ45N2j34
3452Cm5K35j70J36k22O6J72k69m6M2K6j73J00k6k5l0P3J69M1M8k48M00q3j35n6
3477a7K17r8k45j50K76o2j95L76p0j69J53Qj93J31%l28K57P5J48Pn3J37J17n6
3501B66k36j14n4J08K0k5j19K24ok93O5P2Q0l1J22J1J8j78J75j72J76l28J19r9
$$ plain form
3333 -80 -85 -221 -162 -132 100 250 13 17 -55 285 -61 -4 109 -326 42 4 13 -115 -50 154 -137 -111 -109 -200 -100 -128
3359 -128 -145 154 328 103 211 96 -33 -129 43 161 26 -299 66 112 162 74 -293 -77 -102 179 162 98 -77
3382 -77 134 -160 80 241 60 45 -185 -55 -23 35 -167 11 -269 -28 -331 48 139 -194 -35 39 -150 -110
3404 -110 143 140 -86 -135 -14 -32 354 405 -44 121 262 152 174 288 104 -87 -6 -299 -68 26 -91 -103 108
3427 108 55 -29 103 226 -62 86 152 107 79 120 101 -133 -160 -150 -28 -117 6 77 -196 108 -57 -60 85 137 3
3452 3 -42 193 23 159 -63 3 175 -94 -140 -98 -72 -245 -145 -171 -196 -226 -153 16 57 105 -143 257 174 39 -17
3477 -17 200 102 -143 -293 -17 -79 -274 102 32 -137 16 24 -169 -38 -38 -366 -109 -34 114 121 68 205 322 266
3501 266 30 -84 -138 -30 -10 -35 -154 70 64 -229 -164 -92 -12 -43 79 90 108 -70 105 -67 109 -219 -100 -199
3525a99J61M0K37k36l13J90j05P5N8%J10j76P3K5J47r2J36j97L36l37K72j10k18
3548a23L55k15L3j78J31j24l8p6L29k30l3J21j3J48J4J3j79K83j42Np9K69k61
3571A0o3O7J04j02J44j10q9J06j03J59K2j34m0OK17k77P5J28k21J36P9j31J14
3594I7N3j39k87L08l89L23o1J14j96P2j29L78j19j13J55j73n0K04L48m48mK37
3616A81j00L2K0j93J6k8o9K91j58K7r3o7J26J05J71r2j51J84n8l14N20l31O9l5
3640E3j35J93J6j92r6P5k13M25j95L06k85K4j1Q5pK78l09j8K26k92O6O7k30J04
3664f5J13PP3j35k6k19J28N3j06J13K66m02K80J1m2K41j07Nk91Q8j60O6j42j45
3688c96K71O9j91J73m0J26l3J32KJ1O1j85J66j93R8J53l65K15p6J95r7j42J98
$$ plain form
3525 -199 -38 2 239 3 -310 -120 -225 -150 -92 -92 18 -158 -85 -60 87 -5 131 -66 270 -67 205 95 -123
3548 -123 232 17 50 -128 3 -121 -159 -235 94 -136 -169 -48 -61 87 101 114 -65 218 76 81 2 271 10
3571 10 -53 14 118 16 160 50 -39 67 -36 123 145 11 -29 -23 194 -83 -8 120 -101 35 114 -17 97
3594 97 150 11 -276 32 -357 -34 -95 19 -177 -105 -234 144 25 -88 67 -106 -156 48 396 -52 -56 181
3616 181 81 113 133 -60 -44 -72 -141 150 -8 19 -74 -141 -15 90 261 169 18 202 144 -170 350 19 88 53
3640 53 -82 111 127 -65 -161 -86 -299 126 -69 237 -48 -24 -35 50 43 321 12 -6 220 -72 -6 61 -169 -65
3664 -65 48 55 128 -7 -33 -252 -124 -71 -177 -64 202 -200 80 91 49 290 183 188 -103 -15 -175 -109 -251 -396
3688 -396 -125 -56 -247 -74 -114 12 -21 111 113 124 185 0 166 -27 71 224 -141 74 -2 193 96 -46 152
3711A52j16K7o0Rj6p3N2k63M43j16J38k58l9n7L10J3k19k5R6j54K2J01O3l24L36
3736D2j63J67J56l47K24j64J08M3q4j33J4K86r8J97j79n0j9P4k86J97J80j99J5
3759a9k30J49M9o5J76J92m4l32J3L37k10O7J06k36J20j72K4N5j5j84L62%j34m2
3783c3J4p9k17L74j74L56k30o0L6L13l98J58m7k95K58m8l5P8k31J07Q4j78K89
$$ plain form
3711 152 36 63 3 12 -4 -77 -25 -288 155 39 177 -81 -120 -177 133 146 -73 -98 -2 -156 -134 -33 30 -294 42
3736 42 -121 46 202 -145 79 -85 23 66 -18 -151 -137 149 51 248 69 19 0 74 -212 -15 165 -34 -19
3759 -19 -249 -100 -51 -116 60 252 208 -124 -111 226 16 83 189 -47 73 -99 -75 -20 -35 -219 143 143 9 -33
3783 -33 -19 -98 -315 59 -115 241 11 -49 -13 300 -98 60 13 -282 -24 -72 -107 -29 -260 -153 -69 -247 42
$$ [...]
8191E4
##END NTUPLES=NMR FID
##END=
