##TITLE=1H_Chycory2-PEpart
 CDCl3, 8 sc, 
 27.04.2021
##JCAMPDX= 6.0         $$ Bruker NMR JCAMP-DX V2.0
##DATA TYPE= NMR FID
##DATA CLASS= NTUPLES
##ORIGIN= UXNMR, Bruker Analytische Messtechnik GmbH
##OWNER= root
$$ XWIN-NMR		Version 3.5
$$ Tue Apr 27 14:26:41 2021 Russian Standard Time (UT+4h)  she@DPX200
##.OBSERVE FREQUENCY= 200.131506
##.OBSERVE NUCLEUS= ^1H
##.DELAY= (6, 6)
##.ACQUISITION MODE= SIMULTANEOUS
##.ACQUISITION SCHEME= undefined
##.AVERAGES= 8
##.DIGITISER RES= 18
##SPECTROMETER/DATA SYSTEM= spect
##.PULSE SEQUENCE= zg30
##.SOLVENT NAME= CD3CN
##.SHIFT REFERENCE= (INTERNAL, CD3CN, 0, 15.7039)
##AUDIT TRAIL= $$ (NUMBER, WHEN, WHO, WHERE, WHAT)
$$ ##TITLE= Audit trail, XWIN-NMR		Version 3.5
$$ ##JCAMPDX= 5.01
$$ ##ORIGIN= Bruker BioSpin GmbH
$$ ##OWNER= she
$$ F:/spectra/data/she/nmr/H-F/1/audita.txt
$$ ##AUDIT TRAIL=  $$ (NUMBER, WHEN, WHO, WHERE, WHAT)
(   1,<2021-04-27 14:25:32.53 +0400>,<she>,<DPX200>,
      <created by zg, POWCHK disabled, PULCHK disabled
       configuration hash MD5:
       00 E9 B6 7A A2 85 ED C7 34 08 36 98 17 FE 4E 26
       data hash MD5: 16K
       65 1C 02 66 47 41 5B 5E 94 92 E2 07 02 73 A4 96>)
$$ ##END=
$$ 
$$ hash MD5
$$ 9A AD F6 10 B3 14 B2 1D AF E5 4E 97 2E B3 6C FC
##$RELAX= 
##$RELAX= 
##$RELAX= 
##$RELAX= 
##$RELAX= 
##$RELAX= 
$$ Bruker specific parameters
$$ --------------------------
##$DU= <F:/spectra>
##$EXPNO= 1
##$NAME= <H-F>
##$PROCNO= 1
##$TYPE= <nmr>
##$USER= <she>
##$AMP= (0..31)
100 100 100 100 100 100 100 100 100 100 100 100 100 100 100 100 100 100 
100 100 100 100 100 100 100 100 100 100 100 100 100 100 
##$AQSEQ= 0
##$AQ_mod= 1
##$AUNM= <au_zg>
##$AUTOPOS= <>
##$BF1= 200.13
##$BF2= 200.13
##$BF3= 200.13
##$BF4= 200.13
##$BF5= 200.13
##$BF6= 200.13
##$BF7= 200.13
##$BF8= 200.13
##$BYTORDA= 1
##$CFDGTYP= 0
##$CFRGTYP= 5
##$CHEMSTR= <none>
##$CNST= (0..31)
1 1 145 1 1 1 1 1 1 1 1 1 1 1 1 1 1 1 1 1 1 1 1 1 1 1 1 1 1 1 1 1 
##$CPDPRG= <>
##$CPDPRG1= <>
##$CPDPRG2= <>
##$CPDPRG3= <>
##$CPDPRG4= <mlev>
##$CPDPRG5= <mlev>
##$CPDPRG6= <mlev>
##$CPDPRG7= <mlev>
##$CPDPRG8= <mlev>
##$CPDPRGB= <>
##$CPDPRGT= <>
##$D= (0..31)
0 1.2 0 0 0 0 0 0 0 0.06 0 0.03 0 0 0 0 0.0002 0 0 0 0 0 0 0 0 0 0 0 0 
0 0 0 
##$DATE= 1619519131
##$DBL= (0..7)
120 120 120 120 120 120 120 120 
##$DBP= (0..7)
150 150 150 150 150 150 150 150 
##$DBP07= 0
##$DBPNAM0= <>
##$DBPNAM1= <>
##$DBPNAM2= <>
##$DBPNAM3= <>
##$DBPNAM4= <>
##$DBPNAM5= <>
##$DBPNAM6= <>
##$DBPNAM7= <>
##$DBPOAL= (0..7)
0.5 0.5 0.5 0.5 0.5 0.5 0.5 0.5 
##$DBPOFFS= (0..7)
0 0 0 0 0 0 0 0 
##$DE= 6
##$DECBNUC= <off>
##$DECIM= 32
##$DECNUC= <off>
##$DECSTAT= 4
##$DIGMOD= 1
##$DIGTYP= 9
##$DL= (0..7)
0 120 120 120 120 120 120 120 
##$DP= (0..7)
150 150 150 150 150 150 150 150 
##$DP07= 0
##$DPNAME0= <>
##$DPNAME1= <>
##$DPNAME2= <>
##$DPNAME3= <>
##$DPNAME4= <>
##$DPNAME5= <>
##$DPNAME6= <>
##$DPNAME7= <>
##$DPOAL= (0..7)
0.5 0.5 0.5 0.5 0.5 0.5 0.5 0.5 
##$DPOFFS= (0..7)
0 0 0 0 0 0 0 0 
##$DQDMODE= 0
##$DR= 18
##$DS= 0
##$DSLIST= <SSSSSSSSSSSSSSS>
$$ [...]
##$SUBNAM2= <"">
##$SUBNAM3= <"">
##$SUBNAM4= <"">
##$SUBNAM5= <"">
##$SUBNAM6= <"">
##$SUBNAM7= <"">
##$SUBNAM8= <"">
##$SUBNAM9= <"">
##$SW= 16.9725357007746
##$SWIBOX= (0..15)
0 0 2 0 0 0 0 0 0 0 0 0 0 0 0 0 
##$SW_h= 3396.73913043478
##$TD= 16384
##$TD0= 1
##$TE= 0
##$TE2= 300
##$TE3= 300
##$TEG= 300
##$TL= (0..7)
0 120 120 120 120 120 120 120 
##$TP= (0..7)
150 150 150 150 150 150 150 150 
##$TP07= 0
##$TPNAME0= <>
##$TPNAME1= <>
##$TPNAME2= <>
##$TPNAME3= <>
##$TPNAME4= <>
##$TPNAME5= <>
##$TPNAME6= <>
##$TPNAME7= <>
##$TPOAL= (0..7)
0.5 0.5 0.5 0.5 0.5 0.5 0.5 0.5 
##$TPOFFS= (0..7)
0 0 0 0 0 0 0 0 
##$TUNHIN= 0
##$TUNHOUT= 0
##$TUNXOUT= 0
##$USERA1= <user>
##$USERA2= <user>
##$USERA3= <user>
##$USERA4= <user>
##$USERA5= <user>
##$V9= 5
##$VALIST= <valist>
##$VCLIST= <CCCCCCCCCCCCCCC>
##$VD= 0
##$VDLIST= <DDDDDDDDDDDDDDD>
##$VPLIST= <PPPPPPPPPPPPPPP>
##$VTLIST= <TTTTTTTTTTTTTTT>
##$WBST= 1024
##$WBSW= 4
##$XGAIN= (0..3)
0 0 0 0 
##$XL= 0
##$YL= 0
##$YMAX_a= 485299
##$YMIN_a= -567675
##$ZGOPTNS= <>
##$ZL1= 120
##$ZL2= 120
##$ZL3= 120
##$ZL4= 120
##$ABSF1= 10
##$ABSF2= 0
##$ABSG= 5
##$ABSL= 3
##$ALPHA= 0
##$AQORDER= 0
##$ASSFAC= 0
##$ASSFACI= 0
##$ASSFACX= 0
##$ASSWID= 0
##$AUNMP= <proc_1d>
##$AZFE= 0.1
##$AZFW= 0.1
##$BCFW= 1
##$BC_mod= 2
##$BYTORDP= 1
##$COROFFS= 0
##$CY= 11.3945322036743
##$DATMOD= 1
##$DC= 2
##$DFILT= <>
##$DTYPP= 0
##$F1P= 15.9154993809931
##$F2P= -4.1035820241983
##$FCOR= 0.5
##$FTSIZE= 0
##$FT_mod= 4
##$GAMMA= 1
##$GB= 0.15
##$INTBC= 1
##$INTSCL= 1
##$ISEN= 128
##$LB= 0.24
##$LEV0= 0
##$LPBIN= 0
##$MAXI= 10000
##$MC2= 0
##$MEAN= 0
##$ME_mod= 0
##$MI= 1.114404
##$NCOEF= 0
##$NC_proc= 0
##$NLEV= 6
##$NOISF1= 3.799351
##$NOISF2= 2.8
##$NSP= 1
##$NTH_PI= 0
##$NZP= 0
##$OFFSET= 15.70392
##$PC= 1
##$PHC0= -11121.27
##$PHC1= 13.80096
##$PH_mod= 1
##$PKNL= yes
##$PPARMOD= 0
##$PSCAL= 0
##$PSIGN= 0
##$REVERSE= no
##$SF= 200.130013532006
##$SI= 16384
##$SIGF1= 3
##$SIGF2= 2
##$SINO= 400
##$SIOLD= 16384
##$SREGLST= <1H.CDCl3>
##$SSB= 0
##$STSI= 0
##$STSR= 0
##$SW_p= 3612.71676300578
##$SYMM= 0
##$S_DEV= 0
##$TDeff= 0
##$TDoff= 0
##$TI= <>
##$TILT= no
##$TM1= 0
##$TM2= 0
##$TOPLEV= 0
##$USERP1= <user>
##$USERP2= <user>
##$USERP3= <user>
##$USERP4= <user>
##$USERP5= <user>
##$WDW= 1
##$XDIM= 8192
##$YMAX_p= 0
##$YMIN_p= 0
$$ End of Bruker specific parameters
$$ ---------------------------------
##NTUPLES= NMR FID
##VAR_NAME=  TIME,          FID/REAL,        FID/IMAG
##SYMBOL=    X,             R,               I
##VAR_TYPE=  INDEPENDENT,   DEPENDENT,       DEPENDENT
##VAR_FORM=  AFFN,          ASDF,            ASDF
##VAR_DIM=   8192,          8192,            8192
##UNITS=     SECONDS,       ARBITRARY UNITS, ARBITRARY UNITS
##FACTOR=    0.0002944,     1,               1
##FIRST=     0,             0,               0
##LAST=      2.4114304,     0,               0
##MIN=       0,             -567675,         0
##MAX=       2.4114304,     485299,          0
$$ Real data points
##PAGE= N=1
##DATA TABLE= (X++(R..R)), XYDATA
0@%%%%%%%Qj6J6j6K4l2M0n6P2q8J04j20J44j76K08k44K88l37L93m56N25o05O96
30C72p92Q96j016J150j298J460j637J833k047K279k533K811l115L447l808M203
46B205m635N107n625O195o820P509q278R137j0098J1183j2422J3847j5508J7475
60I272j9841K2746k6410L1188l7685M7034o1616Q7380j44984M65176o8897q71038
72e67675J052974o89439K3382N77712p45485M44746Q5774m00371M31480l39474
82a26376P8485K03566l22449K21514L8750j55561J13366p5095l7808R8894O041
93D3327j21924J28782J4631j45605J28944j01178K8015J32328k25064J83406k4856
104D0806j43804K26358k35359R3070J47955k94701K80728r6196j58346L33223
$$ plain form
0 0 0 0 0 0 0 0 0 8 -8 8 -8 16 -16 24 -32 40 -48 56 -64 80 -96 112 -132 156 -181 212 -244 281 -324 372
30 372 -420 476 -540 610 -688 772 -865 968 -1079 1200 -1333 1478 -1637 1810 -1998 2205
46 2205 -2430 2677 -2948 3247 -3573 3936 -4342 4795 -5303 5880 -6542 7305 -8203 9272
60 9272 -10569 12177 -14233 16955 -20730 26304 -35312 52068 -92916 372260 303363 -567675
72 -567675 485299 -204140 -180758 396954 -348531 96215 181989 -218382 213098 -126376
82 -126376 -47891 155675 -166774 54740 93490 -62071 51295 -23800 -61608 37286 43327
93 43327 -78597 50185 64816 -80789 48155 -53023 -25008 107320 -117744 65662 40806
104 40806 -102998 123360 -111999 -18929 129026 -165675 115053 18857 -139489 193734
114A93734l33988N3554K91673l52791J70723O9311k30847K33573j08453r4158
124a07669K10106j34717K1647O7838j37322J26745k7544j23935J77305o4621o1680
135e3847J46100j50458K2302J28202j77879Q3211O8921j08772Q9830q1700O772
146b7318J01981j50511R7585K2090j07718J55331j24766l0926J64087j62663O2646
157a82O0248j29045J36035n9540q2443J36423p5453r56N2780p2925O5842r602
169B1182p5075P2944p755k6510M0398m9686K5224M4621r3011M1726L5693o9985
181d0234P6571l4835m7761J02606p7089j4050O3094n2817N3197l5144l3780R2979
193E2737q0302Q703M6208p6750Q8432k0974q1512J08397m7622l2110O5117o4216
$$ plain form
114 193734 -140254 -86700 204973 -147818 22905 92216 -138631 94942 -13511 -107669
124 -107669 102437 -32280 -10633 57205 -80117 46628 19084 -104851 72454 7833 -53847
135 -53847 92253 -58205 -35903 92299 -85580 -2369 66552 -42220 47610 -34090 -27318
146 -27318 74663 -75848 21737 43827 -63891 91440 -33326 -64252 99835 -62828 -182
157 -182 60066 -68979 67056 7516 -74927 61496 -13957 -14913 37867 -35058 30784 21182
169 21182 -53893 19051 11296 -15214 25184 -24502 722 45343 -47668 -5942 29751 -40234
181 -40234 36337 1502 -46259 56347 -20742 -34792 28302 -24515 28682 -6462 -40242 52737
193 52737 -27565 -18862 27346 -49404 39028 18054 -63458 44939 -2683 -34793 30324 -33892
205c3892M6130K3047p9197N7163j0044k1172M3986n9204L9824L6658q4490M6356
217E165R019l8584N4750m7424k542P0492o6898J917L2823m3169M7721j5220l8371
230c0321O7040l7214j4083L0920m3299N5112j3355n5988P9063l6935j6722M2290
242B6508o4399N4380J4983p0649N9210j4341j6642L0912n2265L8570K0375m9673
254b3031L3645j4099o706L4610n0748J3714M6854m9511O459K0104l0936L6384
266A6739j5164m0092O4790k0111k4904L5597m3753L5858R031o0253O6282j9352
278D668k3431M6384o6276M4739K8043q0191O3078p533k9727N0514o0272K3610
290f394M1285o2729L5179j892j9383M6623n5330O411N1976n4850K3331R656l9676
$$ plain form
205 -33892 12238 35285 -43912 13251 3207 -17965 26021 -33183 6641 43299 -41191 5165
217 5165 14184 -24400 30350 -17074 -19616 50876 -16022 -14105 18718 -24451 23270 8050 -30321
230 -30321 36719 -495 -14578 16342 -26957 28155 14800 -41188 37875 940 -15782 26508
242 26508 -37891 16489 31472 -39177 20033 5692 -10950 19962 -32303 6267 26642 -23031
254 -23031 10614 -3485 -10191 24419 -26329 -12615 34239 -15272 -8813 11291 -19645 16739
266 16739 1575 -38517 26273 6162 -18742 16855 -26898 8960 17991 -42262 24020 4668
278 4668 -18763 27621 -38655 6084 34127 -46064 17014 9481 -20246 30268 -30004 -6394
290 -6394 34891 -27838 7341 5449 -13934 32689 -22641 -16230 35746 -19104 4227 13883 -25793
303b5793N6073k8926l6482O8448l2058j4297L3429m2129L3955J1179n6844M5804
315A2359o7k5577L4998m0592J6950L4655o3478L3629J4320l6612M5977m1071o343
328b0852O1070o0763J1757K7403m1320M6253k7051k6996O2881m2305l112K9247
340A6212m0847M3494q080m9506O0913j8722k4602M2201m3169K1896L0833o8443
352c7820M0106J6458m2298M3484l3621j330N1698o3314K1651K3124m2771M9898
364B5265l4275j5728O5897n9908O449L3609m4978M5434j5705l7782N9440k6898
376H20j3933K8178l2135K9741L364m4109M2836m148k5543L2016l0654J1396L3217
389C1046n5477K2976K2610l8815L2364j8153j2987M8358m3406j878L1471l0160
$$ plain form
303 -25793 30280 1354 -35128 33320 1262 -13035 20394 -21735 12220 23399 -33445 12359
315 12359 12292 -13285 21713 -18879 -1929 32726 -30752 2877 17197 -19415 26562 -14509 -20852
328 -20852 40218 -20545 -8788 18615 -22705 23548 -3503 -30499 32382 -9923 -13035 16212
340 16212 -24635 18859 10779 -38727 22186 3464 -21138 21063 -22106 -210 30623 -37820
352 -37820 2286 18744 -23554 19930 -13691 -15021 36677 -26637 -4986 18138 -24633 25265
364 25265 -9010 -24738 41159 -18749 -12300 21309 -23669 21765 6060 -31722 27718 820
376 820 -13113 15065 -17070 12671 16035 -28074 14762 10614 -14929 17087 -13567 -2171 31046
389 31046 -24431 -1455 21155 -17660 14704 -3449 -16436 31922 -11484 -13362 18109 -12051
401a2051K3518j1483k1001M5721k6697j1790K6468k6218K3411j102l6712M4504
413A6568p746k7989L0951k3366R462K2645m5848K5799J4615l2087K6057j8207
425i146k4L4489m6195J3170K5808l4322K5815j2530j7894M7183l2523j1332L4243
438A6742k7781J7059J68k9521M1936j3886k1332K8871k1849J6354N777l8121L8782
451A3199j863k5885K6367k0539R691J9869m1316K0506J6982k7169J7578r536o422
464h538L0556k8728m864K8065k2985J1200K87k3595M0023j8088k4862L9404k3660
477e785N844J3497l8439L8406j234l1877L1378j9917Q577J4645l9272L2359J998
490A0180k4151K3465k1626J1007J8865l6647J6992J1944j7881J2426j2489J006
$$ plain form
401 -12051 11467 -16 -21017 24704 -1993 -13783 12685 -13533 9878 8776 -27936 16568
413 16568 8822 -19167 11784 -11582 -2120 20525 -25323 476 15091 -16996 9061 -9146
425 -9146 -9170 25319 -20876 -7706 18102 -16220 9595 -2935 -20829 26354 -6169 -17501 16742
438 16742 -11039 6020 6188 -23333 18603 4717 -16615 12256 -9593 6761 12538 -25583 13199
451 13199 11336 -14549 11818 -8721 970 20839 -20477 29 17011 -10158 7420 -2116 -8538
464 -8538 22018 -6710 -11574 16491 -6494 4706 4993 -18602 21421 3333 -21529 17875 -5785
477 -5785 59 13556 -24883 13523 12289 -19588 11790 -8127 450 15095 -24177 8182 10180
490 10180 -13971 9494 -12132 -1125 17740 -18907 -1915 10029 -7852 4574 -7915 -6909
502f909K3218k4115l460K1502j4261M297J993j7916K7159m936k3392K4578j0726
515b968J785J1658l0690K8303O468l2671K5723j0005j099K0370l4274J7345J6101
528A6046k6238J5793r413O14K1230l0098Q612J7269k0569J4111q484r860K8961
541A7974j8800j0996K2420j0743L760j381j5767K6373p054j9404K2006j0379K576
554E85J0170k8905K2266R008k6442J9371q896r45J9010l1247J2930J6176k2615
567i534J4571j0205r99K2025k8090L639J9035j6109Q979o602o744K2986j5937
580b985q526J7561q919M733J970j7313J8023L442j9491J2389K53j078P128j9593
594a2406J2344J2684k2978J1098J250n860J8159k3016r78K5474k0908M747M740
$$ plain form
502 -6909 16309 -7806 -11266 10236 -4025 272 2265 -15651 11508 6572 -16820 7758 -2968
515 -2968 -1183 10475 -20215 8088 14556 -18115 7608 -2397 -3496 16874 -17400 -55 16046
528 16046 -10192 5601 -3812 -3198 18032 -12066 -3454 13815 -6754 7357 -1127 -10987 17974
541 17974 -826 -11822 10598 -145 3615 2234 -13533 12840 5786 -13618 8388 -1991 585
554 585 10755 -18150 4116 13124 -13318 6053 -2843 -3788 15222 -16025 -3095 13081 -9534
567 -9534 5037 -5168 -6167 15858 -12232 -8593 10442 -5667 3312 -3290 -10034 12952 -2985
580 -2985 -11511 6050 -2869 1864 3834 -13479 4544 7986 -11505 884 1137 59 7187 -12406
594 -12406 -62 12622 -10356 742 1992 -3868 14291 -8725 -9703 15771 -5137 -390 4350
607D350j2839K3501j5969j1187K4767j6974P781K787k0856L1817j3623k0668K9645
620A2532j5425M272P910k4707K5111j821j9601J7066r383P128O422k1574J4161
633B091M795j1658N069m382M823Q503j4583j868J4488p681m794N475n955J3378
647G701m232j8716K2075o120o472J1366j8560K0409J210k5390K3861j1021Q50
660c039J4242k9298K3388P197k6687J8592q011J258J2382k1697J2087R081j4163
673d668N413m270J842J1312j3540j421J3955q137k148K510p537J4941j720j7652
687a1120J7432k137p394Q563j4835J4658N805k2006J7013m083n068J2215k1269
700a2226J4136J2353k4315J3515k987n529J6883k0611K768J8720j5571K303R8
$$ plain form
607 4350 -8489 15012 -957 -12144 12623 -4351 3430 6217 -14639 17178 3555 -17113 12532
620 12532 -2893 1379 9289 -15418 9693 7872 -11729 5337 -4046 3082 9504 -12070 2091
633 2091 6886 -4772 297 -4085 738 9241 -5342 -7210 7278 -403 -5197 278 -5677 7701
647 7701 3469 -15247 6828 708 -5764 5602 -12958 7451 8661 -16729 7132 -3889 -3039
660 -3039 11203 -18095 5293 12490 -14197 4395 -3616 -2358 10024 -11673 414 9495 -4668
673 -4668 745 -3525 -1683 9629 -3911 -5332 8623 486 -1662 848 -6689 8252 6532 -11120
687 -11120 6312 4175 -3219 5344 -9491 5167 10972 -11034 5979 1896 -3172 9043 -12226
700 -12226 1910 14263 -10052 3463 476 -5053 11830 -8781 -6013 12707 -2864 -561 -463
713d63m892J3369j1451m687J5610p141j735J113p796J3634k217j4897J5113j59
727C401o722O145j2670R126J0457j9401Q891M304p048R662j5816N234J5921j9152
741g668P404K814p878J5339j6782j352J9946j4451J833K933p723J4307r071r079
755i428J5014k752j710k27n264R389p69j1575Q951L189m568L849q949L435J2144
770A0729j6800K949R873q870Q438q729n187J8795j3536j849R225r022J1844q932
784a072r798K1100j1227l410R242j2046J4183l484j6498J8549l770n044O770j1553
798h058J1926K182j6521J1237l73j538N719j3548R323O980j4632O033J427j872
812a715P159j0598Q50J1483q776k310L691j655P123n245p533J1899j909n691M181
$$ plain form
713 -463 -5355 8014 -3437 -8124 7486 345 -1390 -277 -8073 5561 3344 -11553 3560 3401
727 3401 -3321 2824 -9846 -720 9737 -9664 -773 3531 -3517 6145 -9671 -4437 11484 -7668
741 -7668 -264 2550 -5328 10011 -6771 -8123 11823 -2628 -795 2138 -5585 8722 -349 -9428
755 -9428 5586 2834 1124 897 -4367 5022 4253 -7322 1629 4818 250 4099 -4850 -1415 10729
770 10729 -6071 -3122 6751 -2119 6319 -2410 -7597 11198 -2338 -4187 5038 -3984 7860 -1072
784 -1072 -10870 10230 -997 -4407 4835 -7211 6972 3488 -13010 5539 1769 -3275 3495 -8058
798 -8058 3868 6050 -10471 766 393 -1145 4574 -8974 349 7329 -7303 -1270 157 -1715
812 -1715 5444 -5154 -4304 7179 -1597 -3907 -216 -1871 5252 7 -7526 4373 2464 -3227 954
827I54m869Q853o7j3185J1471N10o344N600p395O208O804j4170M034N713m355
842b38L214o227K666R135j0290q91M978l573O323n985n613J5783q210o718R574
857C928o967O592M35j3489J4809j738q101O651q009R270K163j5245J2002K19n470
872b950N765r900P985N804j3515N866K374k452M114r076L525R094q669j411L346
887a00p79L763n262k783R563l121m217K873k677O462k153r664J1340J516q610
902c849N262m205L345N504j1366M386O155n646K970o570L323R238j3019L146O409
917E083o596O148o857k448J3014q618k288M594k467N462o281l811J0418m046k804
932a497K260k973N811j355q869Q055K416n882K563l737L591N543j2105L704P106
$$ plain form
827 954 -3915 4938 4871 -8314 3157 3667 -2677 2923 -4472 1736 8540 -5630 -1596 4117 -238
842 -238 2976 -3251 -585 8550 -1740 -2631 2347 -1226 5097 -888 -6501 9282 1072 -5646 3928
857 3928 -3039 3553 3988 -9501 5308 3570 -4531 2120 -5889 3381 5544 -9701 2301 2520 -2950
872 -2950 2815 -7085 900 6704 -6811 -945 1429 -1023 3091 -5985 -2460 6634 -2035 -3446 -100
887 -100 -879 2884 -2378 -5161 4402 1281 -2936 -63 -2740 3722 1569 -8095 3245 4761 -3849
902 -3849 1413 -2792 553 6057 -5309 -923 5232 -414 2556 -4014 -691 8547 -4472 -1326 5083
917 5083 -1513 4635 -2222 -4670 8344 -274 -2562 2032 -435 5027 -1254 -5065 5353 1307 -1497
932 -1497 763 -2210 3601 2246 -6623 1432 3848 -2034 529 -3208 383 5926 -6179 -2475 4631
947D631o660L287m213o53J0456j0196p75O268l657N056p045j396J1561q646j732
962c714N466m695O459k989p247R526k7n626J415l66M963j182p368O396J229l273
978a033K538m774M188N153j0885L028O068m549K189l879M4Q518p448k572N342
993A928j606K763l238l884R322l100n614M830j596L149p77q138R237Q55p420N303
1009B014m153L255L980j1157N290M720n383K342m490L681M992r849L180L825l847
1024a600L859n155j023R877o944l898O578k040J436j552n025Q422j175n590L789
1039d1j786M176n87q738Q668J428n732K727k574L496L275r075L361M691l526N37
1055C00k064J442M924n791k223O017j377l74j189k753Q310l434o384P434k628
$$ plain form
947 4631 -2029 1258 -2955 -3608 6848 -3348 -4123 2145 -1512 3544 -3501 -4897 6664 -1982 -3714
962 -3714 1752 -2943 3516 527 -6720 2806 2779 -2847 -1432 -1798 3165 1983 -5385 1011 2240 -1033
978 -1033 1505 -3269 919 6072 -4813 -1785 4283 -266 1923 -1956 -1912 6606 -842 -3414 1928
993 1928 322 3085 -153 -4037 5285 2185 -3429 1401 -195 2954 2177 -5961 3276 4131 -3289 2014
1009 2014 -2139 1116 5096 -6061 -771 3949 -1434 908 -3582 99 5091 -4758 -1578 2247 -1600
1024 -1600 2259 -2896 -3919 5958 -986 -4884 1694 -346 1090 -462 -5487 2935 1760 -3830 -41
1039 -41 -1827 2349 1762 -6976 1692 3120 -2612 115 -2459 1037 4312 -4763 -1402 3289 -237 300
1055 300 -1764 -322 4602 -1189 -3412 2605 1228 854 -335 -3088 5222 1788 -4596 2838 210
1070B10J475J134q477R295Q26q489N230j485K080J429q333O299K601n203K237
1085H29l349L487L937r046K562N232m403O51j380p18O598m826m645O946j599J7
1101B93j442l342Q024k480n283N246k627L010l45p540R133M1o381L724j846K953
1117A138J388p457M663L420l756k04j554L095K455n499K26M423j518p48j392o30
1133a950N958k950n261O199l2j831M95l815N453J865p982M497M94m97K228p535
1149d664O022L497p757L904j335L12M770q920L012N932n927J448j973J067M884
1164D272o618j48M151j046L47l210L55N279l772k888L849J94k96r57l428N217
1180A301J131o131K616J705k17N34n015L435L968n569J817o48R80L460p457K042
$$ plain form
1070 210 1685 2819 -5658 3637 4463 -4026 1204 -281 1799 3228 -5105 1194 3795 -1408 829
1085 829 -2520 967 4904 -4142 -1580 3652 -751 -100 -1480 -2198 4400 -426 -5071 1875 276 293
1101 293 -1149 -4491 3533 1053 -4230 1016 -1611 1399 1054 -6486 2647 2688 -3693 31 -1815 1138
1117 1138 2526 -4931 -268 3152 -604 -808 -2362 733 3188 -2311 -2085 2338 820 72 -1320 -1950
1133 -1950 4008 1058 -4203 1996 1964 133 628 -3187 2266 4131 -3851 646 1140 643 2871 -4664
1149 -4664 1358 4855 -2902 1002 -333 -21 4749 -4171 -1159 4773 -1154 294 -1679 -612 4272
1164 4272 -2346 -2494 1657 611 958 -2252 -1897 3382 -390 -3278 571 765 469 -488 -3916 1301
1180 1301 2432 -3699 -1083 622 405 939 -4076 -641 3327 -2242 -425 -1073 -93 3367 -4090 -2048
1196b048N175m169Q77j036K09M490m508k094M932m65j104j425o34M783j852m367
1212c236L537J168o9m18m047M775J988o334K762J210p43K097n371J974M809n093
1228i91n3J226L76K822n278r1N071l054m17l20o05N418m290l665N930j825l37
1245h3J57l084N625j128n025L405K2J015o41m082N395O58m576J188P7J957P55
1262A635m927K015L960l238j217O99R50K150l144j606M562q29k133J06l07M390
1278C066k616l738M776k34j107j06k620N241K97n567K639J176m81N74l762K998
1294E36L042m378J65O86Q27J607m637J275M809m147j60J31j67L779l951k307N425
1311B535j389j412o78o79M202k187l112L365R1J36j294k776M626M77m653K016
$$ plain form
1196 -2048 3127 -1042 -165 -1201 -992 3498 -1010 -3104 1828 1363 259 -1166 -1800 2983 1131 -3236
1212 -3236 301 1469 1400 982 -3065 1710 3698 -2636 126 1336 593 2690 -2681 -707 4102 -991
1228 -991 -1044 182 558 3380 -1898 -1989 3082 28 -389 -709 -1314 4104 -186 -3851 2079 254 -83
1245 -83 74 -3010 2615 1487 -3538 -133 -111 904 263 -3819 1576 2234 -2342 -1154 -1077 880 1635
1262 1635 -3292 -1277 2683 -555 -1772 -1073 -123 2027 -1117 -2723 1839 1010 -1123 -1017 -1324 3066
1278 3066 450 -3288 1488 1254 147 41 -2579 2662 2959 -2608 31 1207 726 1300 -2462 536
1294 536 3578 -800 -635 51 878 2485 -2152 -877 3932 -215 -375 -244 -411 3368 -583 -2890 2535
1311 2535 1146 -266 -944 -1623 2579 392 -2720 645 736 872 -422 -3198 1428 1905 -2748 -732
1327g32J049l6J84l873K656L466m045k53J257L61J299l563K6M273k053r59j75
1344a118N65L017l546j610M289q22q43m58j417L952n68m139K574J719j193o73
1360b71j369K782J363l747O10J561N1Q09l951J450M359m256k32J709p88K452l369
1377h37j521N168j796j521K91n11L559k535l124M470q26p35Q0k430M702j134m081
1394b781L128m1O61n60l095L357R11l154J05Q77J824j157k482J748J950j485j182
1411a376K61J177J339k279j993M030J12l555J901j06J291N72m700L206K020k599
1427f99R06k181L284J194n611L371P88j464K063l773K298K820m194P37N41R50
1443A030J064m212J575L015k186o52l63J117J738k543j101K911K89k117j18n8
$$ plain form
1327 -732 317 281 465 -3408 -752 2714 -1331 -1584 -327 34 1333 -2230 -2204 2069 16 -943 -1118
1344 -1118 -553 2464 -1082 -2692 1597 775 -68 -526 -1943 2009 1441 -2698 -124 1595 402 -271
1360 -271 -1640 1142 2505 -1242 -632 929 980 1789 -2162 -712 3647 -609 -841 868 80 2532 -837
1377 -837 -2358 2810 1014 -507 -216 -727 2832 297 -2827 1643 817 82 162 -2268 2434 1300 -2781
1394 -2781 347 306 967 407 -2688 669 1580 -1574 -1469 -592 1232 75 -2407 -659 1291 -194 -1376
1411 -1376 -1115 62 1401 -878 -2871 1159 1271 -2284 -383 -489 802 1374 -3326 -120 1900 -699
1427 -699 207 -1974 1310 2504 -3107 264 1052 -412 1651 -2122 176 2996 -1198 -461 80 1030
1443 1030 2094 -2118 -543 2472 286 -366 -729 388 2126 -417 -1518 1393 1682 -435 -553 -611
1459f11K342k12m083K590K187k846R17j576J676J902m582J501J773r04R34l779
1475b771K277L318m678R97M67M33J482l489K02L056r92j081o36J346J591k931
1491a409m54K264N14j155j315P29J792J45l160Q72L229j936r22r8O19K773l498
1508a010n67L211j433M75j673j10M349l676q83K066n78K180l032j103M221j535
1524I02j547Q09l17K367j618k452K838L87j106r16j67K448l75k963J425J349m23
1541F41n55j606J717K164l350o03K036p0j89j791J49L158j867j538J540k26J324
1558I34j758j403L470n57k116P39k99K129p29k877K545J099j551k51q56K326R5
1575I40k697Q91J652J01p34j857J656J951k284r07J708N03l79j090n05L137r40
$$ plain form
1459 -611 1731 1519 -2564 26 2213 -633 284 -1292 384 2286 -2296 -795 978 74 1008 -2771
1475 -2771 -494 2824 -1854 -857 -390 43 1525 -1964 -1762 1294 302 -779 -1415 -69 1522 -1409
1491 -1409 -1863 401 915 -240 -1555 -826 966 1111 -2049 -1177 2052 116 -806 -904 -285 2488 -1010
1508 -1010 -1577 1634 201 676 -997 -1107 3242 -434 -1317 749 171 2351 -681 -1784 2437 902
1524 902 -645 164 -153 2214 596 -1856 982 1369 263 -653 -820 1628 1253 -1710 -285 1064 641
1541 641 86 -1520 197 2361 -989 -1592 444 374 185 -1606 -1457 1701 -166 -1704 -164 -390 934
1558 934 -824 -2227 1243 686 -1430 -691 -990 1139 410 -2467 78 1177 -374 -625 -1481 845 940
1575 940 -1757 -866 786 887 153 -1704 -48 1903 -381 -1288 420 923 544 -546 -1051 2086 1146
1592A146k710J897L36N17o56k472L221N28k746J238q09K253j22l744K676Q90j524
1609h1q7q79K106P18l012N98J316J21o72j718J683J410j757q08Q47J010l43j591
1627a139l85K450j10k363R56L76Q13n66k296K525J162k582O6J14J487N59l008
1644a941J040K053j492j63j059J366J958k965J67J910l13k11j589M44K775j861
1660A19j319J479L65M62j509q90K994o41j620L85J58J597j159j953K041J122j161
1677D70j006K48J366j31j729K7K125n56j001n10P72J509k163q85K218j38j69j348
1695i01q5K639j222j898J634J26L03q06j569K796l50k128O75M03J188m57k633
1712b285K104J115j296l61m21J652P04k806M34J712l98m08j076J230J520j980
$$ plain form
1592 1146 -1564 333 669 1186 530 -1942 1279 1807 -939 299 -510 1743 1621 -2123 553 1443 -81
1609 -81 -168 -1047 1059 1777 -1235 -637 679 800 128 -1590 93 1503 -254 -1062 -215 795 452 -1139
1627 -1139 -1524 926 816 -1547 -591 -215 598 32 -2264 261 1423 -1159 -1093 -979 508 1067 -1941
1644 -1941 -901 1152 -340 -503 -1562 -196 1762 -1203 -1036 874 561 350 -1239 -795 1980 119
1660 119 -1200 279 644 1106 -403 -1293 1701 1060 -560 -175 -17 1580 421 -1532 509 1631 470
1677 470 -536 -288 1078 947 -782 -755 1370 814 -187 -697 75 1584 -579 -1464 754 616 447 -901
1695 -901 -986 1653 431 -1467 167 293 596 -210 -1779 1017 667 -1461 -786 -383 805 348 -2285
1712 -2285 -181 934 -362 -723 -1144 508 1212 -1594 -1160 552 154 -254 -1330 -100 1420 -560
1728e60j087J732K88j97p26l57K179n42k278J450O53L65n82j977K378Q25k201
1745f37O45l31J239K8k560J909J105j134n69m09J496Q38k785N76J321J83n60j242
1763h87Q65J341j048j558J303Q39l73j148k74K028l48j635L7J080J51l71j332
1780a330J496J112j879l35K71Q02N24k136O03J699r85m39n68J147J352k327k27
1797a220J738j18n22r47K72K050j332j272J599K54J83q62j061J990J29j623Q7
1814f55Q92Q47p65j400J667Q90j598l61N15O81M46j852k53K318q80p41P3O4J474
1833A362j479j028J755J59m74p29n02K279j174j476J451K97K72r63j192K235m3
1850G50j502L04J69R97n50j502J444P70j149n60rJ291L32k094M02J407j79r14
$$ plain form
1728 -560 -1647 85 373 176 -550 -907 1272 730 -1548 -98 555 920 338 -1639 739 1564 -637
1745 -637 8 -323 916 944 -1616 293 1398 264 -305 -714 782 1620 -1165 -589 732 915 355 -887
1763 -887 -22 1319 271 -1287 16 855 482 -666 -940 1088 740 -895 -858 222 373 2 -1330
1780 -1330 166 1278 -601 -936 -665 137 661 -1475 -872 827 -158 -597 -1165 -18 1334 -993 -1220
1797 -1220 518 400 -122 -1069 -797 1253 -79 -1351 248 502 685 -177 -1238 752 881 -742 -655
1814 -655 237 1084 319 -1081 586 1476 -122 -483 32 713 1159 -693 -946 1372 492 -249 -176 -112 1362
1833 1362 -117 -1145 610 769 295 -434 -936 1343 169 -1307 144 441 713 -250 -1442 793 750
1850 750 -752 -448 -279 718 168 -1334 110 880 -269 -829 -838 453 785 -1309 -907 500 321 -593
1868e93m32J078Q45j034j201J211P87o49o70MJ415j32j660M95J354k38n40j324
1886a284J665J001j887m0Q64M23J12j786Q04J727j729j8k37R33Q99k355L47J414
1904H53j99m33r84R18R97j069q65P27R96j85j430O5J610k05j323k12J505m52l74
1923f0p36M92J491j396p68J028M25j01j585K64J992j099q25K90M24J078j462p91
1941a339J856m60k43m88l20J905q07j396J023Q44l39o78l11J547l4j669N70K95
1959d4O26l88j336J505R40j429n37M08N90M18j085k40J664l84r77k04P03J008
1977A238j104r45J669K8p06k89n81J919m28j641J208M01k70p84m09J458k36q88
1995c60m14Q27Q85r46j129J037Q75q36r62N49Q89j24q03o63J601K92j491P5M74
$$ plain form
1868 -593 -1025 53 898 -136 -1337 -126 661 12 -658 -654 761 629 -1031 -536 818 580 40 -1284
1886 -1284 381 1382 -505 -545 319 742 854 -932 -128 1599 -130 -148 -385 548 1447 -908 -561 853
1904 853 654 221 -763 155 1152 83 -782 -55 941 756 -674 -609 1001 796 -527 -739 766 314 -60
1923 -60 -796 -304 1187 -209 -977 51 476 375 -1210 -946 1046 -53 -878 -588 -164 914 -548 -1339
1941 -1339 517 57 -186 -674 -994 911 104 -1292 -269 575 236 -442 -753 794 760 -909 -339 -44
1959 -44 582 194 -1142 363 1303 -126 -663 -255 335 753 -332 -572 1092 708 -269 -473 230 1238
1977 1238 134 -811 858 886 180 -109 -690 1229 801 -840 368 769 499 -285 -694 764 528 -360
1995 -360 -774 53 938 -8 -1137 -100 775 -61 -1023 -474 415 291 -512 -1175 426 718 -773 -698 -224
2014b24Q32p40j266J301Q12j173K70q54J905l36j896J049P44k89K7j357J488P21
2032A014j794J43M92R35m96j562J400P32j043j6m23J288L08j600k1J251J35r19
2050a76n2L74R13o87j264R52R01p58o97L81Q33K47j510K8J096Q8l94r95Q74J050
2070A204j431n09O52O51j72r26q5J220n32p43j63R38K23r38m32J198K96n51n45
2089f45L85O31r6j377P20J027p43m85k05J114M75j605J23J030J62m70j096J076
2107B1J177j363q4K36J69O81j458JJ398k23p44j43O35N91j048m58J013m3j78p21
2127e41J09J597p58j081P49Q84m04o98m48J249J04o99m89Q35J19n57q30Q43O52
2146F36n72n54L41N49J89r55p71J861m72r24M96L54L75o49j206J330N85r74j8
$$ plain form
2014 -224 608 -132 -1398 -97 715 -458 -188 -1042 863 527 -1369 -320 424 135 162 -1195 293 1014
2032 1014 -780 -637 -145 790 294 -1268 132 864 -179 -195 -618 670 978 -622 -643 608 743 -176
2050 -176 -228 146 1059 372 -892 60 961 203 -494 -113 720 967 -543 -515 581 669 275 -720 154 1204
2070 1204 -227 -736 -84 567 395 -531 -616 604 72 -671 -834 104 327 -611 -1043 155 451 -100 -645
2089 -645 -260 371 275 -1102 -382 645 -98 -583 -788 326 801 -804 -681 349 511 41 -1055 21
2107 21 1198 -165 -249 -13 156 837 -621 -620 778 555 -189 -332 303 894 -154 -612 401 358 180 -541
2127 -541 -432 1165 407 -674 75 959 555 -143 -591 658 762 63 -426 409 528 -29 -859 -16 636
2146 636 64 -490 -149 400 589 -366 -1137 724 252 -672 -176 178 553 -96 -1302 28 613 -361 -379
2165c79l00J264j78j484O22N25J32l24q33J199N33j544N42M68J43j19j139P04
2183a68O63l72n89J25Q90j18q17m36J391j71o20J5L94O25n51r36P80R31p24o38
2203c26J72J073m08r38K7Q97L05r45n83J075N68j314K08O41q9mr08J49R86l05
2223B81r32M41O05j74n62j93R41j32n92m00P27K94l77p25K73J112p35m49j02R69
2243B70L05j346J4J042j06m56m39O75O04q83Q9L15J67L17r35j22J321p02m83K20
2263a33J18O67p44p04J095K63o12q3m0R17n78q46J020R8m9m79l06J038Q8r49k86
2284e05R76L60q22m25M25O21l89o96L45O84j66j019J73Q72p2p15J83J70N67o91
2304a24j278J282M47o86l20L71N75L9r38K85O73k76p33j46J055ko64k56R94l55
$$ plain form
2165 -379 -679 585 407 -1077 -455 70 202 -122 -955 244 777 -767 -225 243 386 267 -872 -168
2183 -168 495 123 -466 -341 549 431 -386 -822 569 398 -222 -207 187 812 261 -675 105 1036 312 -326
2203 -326 -154 919 511 -427 -400 497 802 -143 -726 349 917 -397 -189 452 363 359 -549 -400 586 281
2223 281 -651 -210 395 221 -341 -534 407 275 -317 -717 10 304 -73 -798 -525 587 -148 -597 -699 270
2243 270 575 -771 -757 285 179 -277 -716 -41 563 -320 -231 84 251 568 -367 -489 832 130 -353 -133
2263 -133 -15 652 -92 -796 299 562 -50 -133 -173 744 166 -680 340 438 389 -90 -396 642 730 -219 -505
2284 -505 471 831 9 -416 9 630 241 -455 -110 574 408 -611 -438 434 362 -353 -170 0 567 -124
2304 -124 -1402 -120 327 -359 -679 -308 267 306 -632 -347 326 50 -683 -829 226 224 -440 -696 298 -57
2324e7J33o16J84J010n69q34M27O79j49m14n93J379k09n93j36L74O34m91r79J088
2344B68M47p79Kj49P15j27j102M49Q84l41p1q84R65L44o31m38O56L38k20o69o
2365c49J028l33q77M26N30pn13n83J085K83r17m65P08L26m20l89K73O91n14m37
2385d54m3N48K91j103L53R11m81m15k78K65J046q04r57P02R03n28m78J3J141o19
2405A3m23j05O26M91r38l52Q44N93r84P6J29O39n05p06M24R30n85m91J50P34L60
2426I20j240J09P66j84j72n80M91O05n72q80P72M69r8o42l9P51j4q42L80Q0N83
2447F63n62p24R87M20r44m18L27O01Kr86L47O25r1o54KK96L15o62k80Q91J30m60
2469a75m36K42J131q08p10N63P81l90n03o99J306J17q80N3N12M01m72r19Q44P01
$$ plain form
2324 -57 76 -540 -356 654 85 -749 -322 357 208 -206 -799 580 371 -222 -358 16 650 159 -820 268
2344 268 715 -64 -62 -211 504 377 -725 -276 608 267 196 -688 277 621 -10 -448 208 546 326 -343 -349
2365 -349 679 346 -531 -105 425 418 -95 -678 407 690 -227 -692 16 342 -78 -467 -194 497 -17 -454
2385 -454 -497 51 342 -761 -408 503 22 -393 -671 -406 640 -164 -1121 -419 484 -44 -522 -509 632 13
2405 13 -410 -515 111 602 -336 -688 156 749 -235 -159 -30 609 104 -602 -178 752 167 -324 -174 560 920
2426 920 -320 -211 555 371 199 -381 110 715 143 -737 35 504 406 -236 -275 476 462 -380 0 80 663
2447 663 101 -623 364 784 -160 -578 -251 350 352 -634 -287 338 247 -407 -405 -109 206 -456 -736 155 285 -175
2469 -175 -611 -369 762 -46 -756 -193 588 198 -305 -1004 302 419 -461 -408 104 505 33 -886 -42 659
2489F59p52j10j13Q29P5j273M56O65L3n97k3M28L11m49p45P83M90m38p45L21P38
2510E43k61p96K91M78J07n31k50O86L99r87M0N02L03m36n34K44O80l59o48K91
2530b38L72J50o09k62N68J00l46l14O26L12q12m94P18P05m69n25Q9Q24l7j134
2550g76J13P49M50q09l60Q35M47j116N5M17L16j4r26M87P08n25l02j03N06L84
2570E36n33k26N70k7j68n42M33Q96o66o58M55M22Q4r09m5Q45R8q14P0M10N59j099
2592c09r4P72J32p98q8L04L51N7r87L43P26k59m45k18M43N29o40k16M54J39k27
2613c1o71M98O13n87l17L38M71k99n12O4M43L49j121K72P28j09j2n76L53O14l29
2634A79p14N21K57J11j041K69P71l1m60m9L94L61n81l91O76l2m6n56K52Q23m97
$$ plain form
2489 659 -93 -203 -316 513 588 -685 -229 436 469 -128 -151 277 588 139 -606 177 667 229 -516 -195 543
2510 543 282 -514 -223 255 362 -169 -419 267 666 -321 -281 221 524 88 -446 -202 478 119 -529 -238
2530 -238 134 284 -325 -587 -19 81 -265 -579 47 359 -453 -947 -229 476 7 -518 -429 395 358 -776
2550 -776 -663 86 536 -273 -633 202 649 -467 -412 5 321 307 -619 -132 576 51 -251 -354 152 536
2570 536 3 -223 347 320 152 -390 43 939 273 -385 70 492 576 -333 -378 467 565 -249 -179 231 790 -309
2592 -309 -403 369 501 -297 -385 -81 270 327 -660 -317 409 150 -295 -513 -70 459 -181 -397 57 196 -31
2613 -31 -702 -204 409 -178 -495 -157 314 15 -497 -433 10 359 -762 -490 238 129 117 -459 -106 508 179
2634 179 -535 -14 243 354 -687 -418 353 322 -138 -187 207 568 -13 -404 272 240 194 -362 -110 713 216
2655B16o73M79M35j31n93p6O83j19k51j68N63O8l65l28K81K84k53m60K09N72K3
2676C96o20j54N57J11n13k23L85N24m38o88N68K14j19o10K09J042n73o25J30K69
2696a58K88l28k94N92J23m45k8K2O37j13p76K42P72m16l22j35M07L26p06M3M14
2717A45L66n68n05O39M58o86l24M91O16l74m38N3P02q8n00j04L21K43m95l18N38
2738A72L00k24o48L75K27K8m19q7Q72k56q02Q9P06J42o53k10K86L80m23j56J79
2759a22M03k87q48P63K91K8n43k44R55k21m41j97M77L64l33o43O26M04n64m17
2779e49L25N15j33p09p5J060k89k49j59J20M77l19l17L90L17k69l48L01N47m71
2799A65m76J37N88k01l88l2O65J72p98j12N33J8l27k49M46M73l30o13K72L62J42
$$ plain form
2655 216 -457 22 457 326 -267 -343 340 221 -30 -198 365 433 68 -260 21 305 52 -408 -199 373 396
2676 396 -224 -378 179 290 -223 -446 -61 463 25 -663 -95 119 0 -610 -401 641 68 -557 -427 -158
2696 -158 130 -198 -492 100 223 -222 -250 -228 409 296 -480 -238 534 118 -204 -339 68 394 -312 -269 145
2717 145 511 -57 -562 77 535 -151 -475 16 632 258 -180 -127 575 487 -13 -117 204 447 -48 -366 172
2738 172 472 248 -400 -25 202 230 -189 -276 596 340 -462 -373 333 475 -178 -388 -102 278 -145 -301 -122
2759 -122 281 -6 -854 -91 200 228 -315 -559 396 175 -266 -463 14 378 45 -598 28 432 -132 -549
2779 -549 -224 291 158 -551 -626 434 145 -104 -263 -143 334 15 -302 88 405 136 -212 89 636 165
2799 165 -311 -174 414 213 -175 -207 458 630 -168 -280 253 271 -56 -305 141 614 284 -329 -57 305 447
2820D47p54qQ99k39o92p3M60M25n79m53O59L46m06o86M44K61J90p35K76M42j61
2841F3k80l38P57J44p72m3O16J92k71n17L18K93l51m35K37N56J41n90j22P05K40
2862E43r76J16L62L02k52n22O48K67j72m77j3M40L55q18L21K74j09j26n85P85
2882C63r6l48k78M51L91l93m52K03N39j32o52K88K27K57o10r4M61K71m18m99N26
2903EM92n17l51R5N22j41m06J27L36K31p35q2N46O1k76k44K98M37o18k52M08L51
2925B87l86l33kO23p7m36J70J77M65o05l95O16K97l45k96J82L74j5p33L27L56
2946B51j30k80Q2M93K31n45m33J29O43j90n92N23J71k04m80N87J01qn49N3O48
2967E01j82m23j07L00K90l34n94Q77j10k93l5k42Q00m32k81J55L40p3l34l88Q18
$$ plain form
2820 447 -307 -315 584 345 -347 -420 40 465 -114 -567 92 438 32 -654 -210 51 241 -494 -218 224 63
2841 63 -217 -555 202 346 -426 -469 147 339 68 -449 -131 162 -189 -624 -387 169 310 -280 -402 303 543
2862 543 -433 -317 45 347 95 -427 221 488 316 -161 -174 266 621 -197 124 398 289 163 -422 363
2882 363 267 -81 -359 92 483 90 -362 -159 380 248 -404 -116 111 368 -242 -336 125 396 -22 -521 5
2903 5 497 -20 -371 -276 246 105 -301 -174 162 393 -342 -424 122 183 -93 -337 -39 398 -220 -472 -64 287
2925 287 -99 -432 -434 189 112 -324 -154 23 488 -117 -512 104 401 56 -240 -58 316 301 -432 -105 251
2946 251 121 -159 -77 416 647 102 -331 -202 441 251 -341 182 353 149 -331 256 357 349 -200 -147 501
2967 501 319 -104 -211 89 379 45 -549 328 218 -75 -110 -352 448 16 -265 -110 230 157 -177 -565 253
2988B53l2k57l76L26L63m79k66K31M66l52k53M10L88l08m07l83P98K19m95j03
3008b57K09M10k57n10O17N8l05j59j33P63O5j107L53N57j07j9m52L00L71m69j80
3029b52J01N16k61j21j3J95J05k57j47K75K96o56r8M95J77n73j34M70L56j54o64
3050c44J99M65r1n46nP59l19m66RL27J80k07l35R2N87o36k25L93Q8Q8l95J56M98
3073B72j80l73l76O29M40q57P1K65L27k80j85J8L51O7n16M05J51J4p18L48L80
3094B53K3n72N0M22K56m63l48M92N31k70q29O27n8K75l43l63P82P7r35M1O28J23
3116C99m52j38L24K23j40l48j69N15j97l99M30k2K19o00Q9N73k59j63l68M13L28
3137B58l30m06M22L69n19l25K91M30k2n59qM74L9m06j62O49J42k95m70L68K10
$$ plain form
2988 253 221 -36 -412 -86 277 -202 -468 -237 229 -123 -376 34 422 114 -293 -676 122 341 -154 -257
3008 -257 -48 362 105 -405 212 270 -35 -194 -327 436 501 -606 -253 304 197 178 -274 26 397 -72 -252
3029 -252 -151 365 104 -17 -30 165 270 13 -134 141 437 -219 -317 178 355 -218 -352 118 474 320 -344
3050 -344 -145 320 229 -317 -322 437 118 -348 -339 -12 168 -39 -374 -282 305 -331 -556 -163 -75 13 -382 -226 272
3073 272 92 -281 -657 -28 412 -445 -374 -109 218 -62 -247 -229 122 189 -327 78 229 243 -475 -127 253
3094 253 276 -296 -246 176 432 -31 -379 113 644 374 -455 172 114 389 46 -317 465 542 -393 -352 276 399
3116 399 -53 -191 133 356 216 -132 -301 214 17 -382 48 26 245 -355 -266 307 48 -115 -483 -70 258
3137 258 -72 -478 -56 313 -206 -531 -240 190 168 -391 -399 75 114 -292 -454 195 337 42 -428 -60 150
3158A50k41j23J76L97k82n10J39O54r4l64j17M83K32n65l71J95O49m06k92M62
3178A72K30j05n91K28M59P2o45o3O27N9m88K7nJ89J32p00K21N56k04l38J37o1
3200i1O39n74k28K54J61j76m37O09J08n46r0J37N14n4n93j03Q49r2p24n9O27K0
3222A51l28j12K97K51j23m89J86M61k62m72J79M86Q6l58k73K59K38j29m42O69
3242B75l60K03j93j58N24l20l82L10M34nn23n9N75J33m89j0K82k4K2o02M64K24
3264C21M9n87J57N75q2o00R7O81k08o62j82P80q0m16j87M70J47m14n8J62K51L3
3286B47o71J80L37K7o55J78M14m6l88j44N12J18k27o42Q47L4k30l80L01L16P3
3307B01m98J11L85l5k69k55O09K4m75p6K26K23k49j64L18K07j61j47K6J74P6l61
$$ plain form
3158 150 -91 -214 -38 359 77 -433 -294 360 266 -98 -215 268 500 -65 -436 -241 408 2 -290 172
3178 172 402 297 -294 -66 393 465 -180 -243 384 443 -45 -18 -23 166 298 -402 -181 375 171 -167 -30 -91
3200 -91 548 -26 -254 0 161 -15 -452 157 265 -281 -371 -234 280 226 -367 -470 379 287 -437 -496 131 151
3222 151 -177 -289 8 259 136 -353 -167 294 32 -440 -261 225 311 -47 -320 -61 177 48 -394 275
3242 275 -85 118 -75 -233 291 -29 -411 -101 333 328 -195 -254 321 454 -35 -45 237 213 235 -367 97 321
3264 321 370 -217 -60 515 433 -167 -70 611 403 -259 -441 339 259 -157 -344 126 273 -141 -199 -37 214 247
3286 247 -424 -244 93 120 -535 -357 57 11 -377 -521 -9 109 -118 -760 87 121 -109 -489 -188 128 201
3307 201 -297 -186 199 164 -105 -360 249 273 -202 -278 -52 171 -78 -242 76 283 122 -25 1 175 251 -110
3329a10j51K83K28j67k63L20J91l43j28K79K63k90j19j66N48k37m79K69J99J04
3349B31l91k2J14L33j96l36J53M49m91m22O09J82k74k74K8N01pn51P4J55L61n45
3371c19r7M94J52k88k17n2M73l0o98M13J50M99o12j83M95n5j52l40L37L41l42
3392c1m48L54M05qo21l6P57l3m18q8M55K9n30L6L08J34l24J1R3N0M7Kj65N87k83
3417B83m35J24J46j0l7k98L64K00m73n5p4O43k35m58N6L56j28r1k8K94N3o96O4
3440d35M56L38n38j26N26J80k53n91O6P90n77j97N1M31k09J47l14M55p2k38jP8
3462c3K96k92k33L72J44o6n49L72L85k90j67k71P03P6m07k84N32J3P2o23J51N48
3484D49k91l77J72L13K32m06m8L11J36m06j06o2M09l86p6M03J1n7k83J5K87j24
$$ plain form
3329 -110 -261 22 250 83 -180 140 331 -12 -140 139 402 112 -7 -173 375 138 -341 -72 127 231
3349 231 -160 -182 -68 265 69 -267 -114 335 -156 -578 31 213 -61 -335 -307 194 187 -364 -290 -135 226 -319
3371 -319 -416 78 230 -58 -275 -327 146 116 -582 -169 -19 480 -132 -315 180 125 -27 -367 -30 311 -31
3392 -31 -479 -125 280 272 -349 -385 372 339 -79 -167 288 317 -213 -177 131 265 -59 -48 45 95 142 144 -21 566 283
3417 283 -152 -28 118 108 71 -227 137 337 -136 -191 -265 378 143 -315 -259 97 -31 -122 -150 144 197 -499 -435
3440 -435 21 359 -179 -305 221 401 148 -443 -377 413 -164 -361 -310 121 -88 59 -255 200 128 -110 -111 -33
3462 -33 263 -29 -262 110 254 188 -361 11 396 106 -61 -332 371 447 40 -244 288 301 373 -250 -99 449
3484 449 158 -219 -47 266 498 92 44 355 491 85 -21 -83 326 -60 -136 267 278 221 -62 -47 240 116
3506A16k85q6N60k93k79R7K38L21n42k58M59K70j26m83K52K69j44k78J04R4K6
3527C2l05j18L99O5j90k94M21J13r9m15K08N00l87M2q0K46J39l11j13J01K93j44
3549A03k43J4L81q0k55R9L70k32k02J16L6J52l76p4L80P0k63l51O21Qj03k92J50
3572B9M28n84n6K75J90j04k41j52M67j04l3l81J70L78k21l77P6N23k61j06k31
3593c15N10k69k31jJ92J86l47J5M05j80j59q1K35L94o58P6k6M44jn49P9O87m2
3616C64n59j83N96l0m61K58K95p8J6o61K47M34ql67n9M61o8j84k28N04j76j22
3638ip6L19J36k95l53J07N44l08k88K88J28k9l94J70L60M3n00j23K48K85j37k95
3660a79Q3K23k18k26qL05K20n78K09K89n8l95l9M97l7j19l19K89m8q5j3m6K88
$$ plain form
3506 116 -169 -255 305 12 -267 -170 68 389 -153 -411 48 318 192 -291 -39 230 86 -192 -88 6 32
3527 32 -273 -391 8 73 -117 -411 10 123 24 -391 -183 317 -70 -28 -108 138 277 -34 -147 -46 247 103
3549 103 -140 -126 255 175 -80 19 389 157 -45 71 107 259 -117 -191 189 259 -4 -355 266 274 171 -121 29
3572 29 457 -127 -183 92 282 178 -63 -215 252 148 115 -266 -96 282 61 -316 -240 283 22 -84 -315
3593 -315 195 -74 -305 -306 -114 72 -275 -260 145 -35 -194 -275 -40 354 -304 -228 -254 190 189 -360 -281 406 364
3616 364 -195 -378 218 188 -273 -15 280 202 218 -443 -196 238 230 -137 -196 265 197 13 -215 289 113 -9
3638 -9 -85 234 370 75 -278 -171 373 65 -223 65 193 164 -230 -60 300 343 -157 -280 -32 253 116 -179
3660 -179 -96 127 -91 -317 -325 -20 200 -378 -169 120 62 -333 -372 125 88 -31 -350 -61 -109 -194 -207 -253 35
3683C5l0l10J45M24l7k07l40K92J43o8j42J6K34j78j92J08M61l12j09jP9M9m4
3706A6r7J21K46m62O0J36L25k49k31J61L06k34k09J59L47m0k77k17K52j9k63J45
3728b4J64J32k59j99K74J16k1n27K16K48k35O1k08J92Q5k31k09M35Mj95j48L25
3750dN6j41M9k61M21L00p41P6M63m50J00m2K25k7j88M5k0K07r1j61K5K38o1k56
3774b38L95k0j60P1j04K52K23m46k1N5L30k97j00L02L00l25k36j68M84p8m32j10
3796c23M49N5k71J30l3L55j84k67M57k34j0q0k62M10Ql42K3K59k11k60k3M26L7
3819A09l50K7R7K55l5k14Q4K89k93j77J13K18r7k44j14M56L9n04P2K69K76j15
3841A61m01K03J02j7k36J18K99j97j18LJ51K69n94L2L82j66N0J39k57M55l3n61
$$ plain form
3683 35 5 -305 -160 264 227 20 -320 -28 115 47 -95 -79 155 -23 -215 -107 354 42 -67 -68 11 60 16
3706 16 -81 40 286 -176 -116 20 345 96 -135 26 332 98 -111 48 395 355 78 -139 113 94 -169 -24
3728 -24 140 272 13 -186 88 204 183 -344 -128 120 -115 -54 -262 -70 15 -216 -425 10 14 -181 -329 -4
3750 -4 52 -89 -40 -301 120 420 -321 -245 218 -232 -132 -174 51 24 -164 -119 -139 68 -23 -184 -159 79 18 -238
3774 -238 157 137 -23 48 -56 196 419 -27 -48 7 337 40 -60 242 542 217 -19 -187 297 219 -213 -323
3796 -323 126 181 -90 40 7 362 178 -89 368 134 124 44 -218 192 200 -142 -119 140 -71 -331 -354 72 109
3819 109 -241 -214 -117 138 103 -111 -27 262 -31 -208 -95 123 26 -218 -332 124 163 -341 -269 0 276 161
3841 161 -240 -37 65 48 -188 -70 229 32 -86 -83 68 337 -257 -225 157 -9 41 180 -77 378 345 -216
3863b16K15K70q2l19K70K52K3n68J19K22O1l60k00M47J26j02j46J68j0j63%k66
3885b59O27j85m32J77O0O4j77j71K61L78m56o4O9K70l52n3M6K32P2j99j31J70
3907e3J21m41J49L0O90m68k50J17J66p2%j19L31m22K93k81JJ79j20j8K66P0l7
3930A32l69L27K16j7m43O7L57j65J19k97J95N1q3n64N81K90l26k17L39L0k66p4
3952a17N3M14j77k82j34K84K39n99P6J10M21j90l36L37O9l28j5L24l3k71J58j46
3974a43K86j64q0j85K75P3j79l12N69J38o21K16J95J66l05l20K25L47p7l40p1
3995c07M32p6M6m91N19J26k92n3k7L75k21j73L20j49k06J47O3J80K15n59J37J3
4017A9K84l38r6K16J74j6l40K41R8j60l11K89L1J94m35J12N1J91j84j61K44J1
$$ plain form
3863 -216 -1 269 187 -132 138 390 413 -155 -36 186 247 -113 -313 134 260 158 12 180 170 7 7 -259
3885 -259 368 183 -249 -72 -12 52 -125 -296 -35 343 -113 -177 -108 162 -190 -243 -197 35 107 -92 -223 -53
3907 -53 68 -373 -224 -194 496 28 -222 -105 61 -11 -11 -130 201 -221 72 -209 -208 -29 -149 -167 99 169 132
3930 132 -237 90 306 289 -154 -87 270 105 224 -73 122 173 90 -474 107 397 71 -146 193 223 -43 -117
3952 -117 -64 350 173 -109 -243 41 280 -319 -243 -133 288 98 -238 99 168 -160 -175 149 116 -155 3 -143
3974 -143 143 -21 -101 -286 -11 62 -117 -429 140 278 -343 -127 68 234 -71 -391 -166 181 104 -236 -307
3995 -307 125 49 95 -396 123 249 -43 -96 -123 252 31 -142 178 29 -177 -30 33 213 428 -131 6 19
4017 19 303 -35 -131 85 259 243 -97 144 242 82 -229 60 91 285 -150 -38 13 204 20 -141 103 114
4039A14R4m16K29j3q2M5j30K5J06j52o4K96m8k45m8K08J26j58l7P4J01Q4m30J30
4063a91J28Pl0o7J91Q6l24nL49j7k53j75N23k47J50k67k5M19k54l0l1K70Qk90
4087g5K1r0K42p2r2J59rr2j37J29K07j76L7J01J4j80q1P4K10O3k91l9J49m0j01
4112f9N4o9K75k16j71J28jM18m43j07J99J60k81M8K3L06k49j76J50K10j96j72
4134a79J51J09j9l88Q1L86m8l80p8J80L65l46J07J44J95l16q3PL64q0m06j14L11
4157c7J12j95J11J90M0k12k21K39R5o9J6N4K92m5m05MJ49j08k19K5L05J86l87
4180h0k05N22J07j90l07K43J4K1l66K42J28ok51J95J89j6m31j78L47K07l12l29
4202d56M65L4j84l3J34J13j49j79rL35j8r7k88K42K62l41O8J07Rr7R2j19J20%
$$ plain form
4039 114 208 -208 21 8 -74 -29 -159 -134 -28 -180 -244 52 4 -241 -289 -81 45 -113 -150 -76 25 109 -321 -191
4063 -191 -63 -56 -86 -153 38 124 -200 -205 144 127 -126 -301 222 -25 125 -142 -167 252 -2 -32 -63 207 215 -75
4087 -75 -54 -144 98 26 -66 93 84 -8 -145 -16 191 15 52 153 167 -13 -94 -20 190 253 -38 -77 72 32 -69
4112 -69 -15 -84 191 -25 -196 -68 -69 349 -94 -201 -2 158 -123 -75 -52 254 5 -171 -21 189 -7 -179
4134 -179 -28 81 62 -326 -245 141 93 -287 -365 -185 180 -166 -59 85 280 -36 -119 -112 252 172 -234 -348 -37
4157 -37 75 -120 -9 181 221 9 -212 27 122 53 69 123 415 370 -35 -31 118 10 -209 -184 121 307 -80
4180 -80 -285 237 344 154 -153 90 104 125 -241 1 129 123 -128 67 256 240 -191 -369 -22 185 -127 -456
4202 -456 9 43 -141 -174 -40 73 -76 -255 -264 71 53 -44 -332 -90 172 -169 -101 6 15 -82 10 -109 11 11
4226A1k21k84N76J23k60J49J9j02K55m89R1K42j04j12MK71l1k38n6O37k80k81
4248h0Q3J75P0k27p8M4J65J41m02J92Mk07j03n9L99J5l67K24L3m0lk29K15J58
4272A23j64k32K72R0l2m31J31J19J64o15K46J94K91l36n7N3K12j60k5K66j56K10
4294A63l84K31J92k21L2m04M32J3l31K13K81l0l10J36J27K7l78J0R9J91J26m47
4316b32K54J32J22j38o0l5K31l42J99n7J27j34k22j11L12J80k66m5j26L32j21
4337@m91N95Q3j95l06L39J7k81j75L40K09k96JJ40J32j93j86K89j02M98l37m12
4359c31K64NR8k60J54p1J1r9L85r7J2n7l63M88n3q5l9R7Qn8l26M26J27k98l66
4384d28L65K15L48o05L4L50j63k80J53N1J05r1k53L05j8mj34R3K45n3n06O46k20
$$ plain form
4226 11 -210 -494 82 205 -55 94 113 11 266 -223 -132 110 6 -106 -102 169 138 -100 -156 481 201 -80
4248 -80 3 178 248 21 -57 -13 152 293 -109 83 87 -120 -223 -282 117 132 -235 -11 22 -18 -21 -250 -35 123
4272 123 -41 -273 -1 89 57 -374 -243 -124 40 -575 -329 -135 156 -180 -237 -184 28 -132 -157 109 -47 163
4294 163 -221 10 202 -19 13 -391 41 54 -277 -64 217 187 -123 13 140 167 -211 -201 -102 89 215 -232
4316 -232 22 154 276 138 78 43 274 -68 131 74 201 67 -155 -266 46 226 -40 -85 -211 121 0
4337 0 -491 104 187 -8 -314 25 42 -239 -414 -74 135 -161 -160 -20 112 -81 -267 22 -80 418 81 -331
4359 -331 -67 -62 36 -224 -70 -141 -130 -229 156 59 71 14 -349 139 86 1 -38 59 67 9 -317 109 236 -62 -428
4384 -428 -63 152 500 -105 -71 279 116 -164 -11 40 145 54 -199 106 88 84 -50 43 288 235 -271 375 155
4407A55P9o25L95J94J32n23N8N44j78k72N3lJ8K70k03j15qj37kK14O4j04j18J
4431a11J08L18l07k21J74K01k91j26K70J17j94O8o3K72n0l87L30M0k58L5k0J90
4453I5J82j07l75K25R3M6j58j20L61k12j77K63J38p3j27j06J4O8jJ0mK27R6n69
4477b11M6K12J94k60o1K87rk05k0K79k6m29K4L74K3k29m2k1J46j42j04M6K08J29
4501B09k62j64J42r5j7J18k05J81Q5l80L55qk46K57n8L55l96JN1J67kq5j37J48
4525A4N8j76J08l1OJ83k93Q8J18r2j72J22K02oj32OM9J72k11j52K25M8k14k4M54
4550C50L5o34K31M8Q6J49l06J36q9k4J90k84K49p4Mj0j20k16J86J62k96K98J32
4573B03k82j04J56K18l81n5J94K58k46l03L72j73J54K18o19M58r4k5k27K80n9
$$ plain form
4407 155 234 -391 4 198 330 -193 -135 409 231 -41 12 9 27 297 94 -21 -29 -166 -168 46 110 6 -112 -111
4431 -111 -3 315 8 -213 -39 162 -129 -255 15 132 -62 6 -57 215 165 -222 108 148 -110 -75 -95 95
4453 95 277 170 -205 20 113 159 1 -119 242 30 -147 116 254 181 54 -52 -38 30 29 39 35 262 358 -211
4477 -211 -165 47 241 -19 -80 207 198 -7 -27 252 226 -203 -179 195 218 -11 -53 -74 72 -70 -174 -128 80 209
4501 209 -53 -217 -75 -170 -187 -69 -274 -93 -8 -388 -33 -41 -287 -30 -88 267 -129 -128 -77 90 88 3 -134 14
4525 14 72 -104 4 -27 -21 162 -131 -43 75 -17 -189 -67 135 129 -3 3 52 224 13 -139 86 134 -80 -104 350
4550 350 385 -249 -18 30 116 265 -41 95 6 -18 172 -112 137 63 67 57 -63 -279 -93 69 -227 71 203
4573 203 -79 -183 -27 191 -190 -245 -51 207 -39 -342 30 -143 11 229 -390 68 -26 -51 -278 2 -57
4594e7k6k53L00L17k09j50j36M46j45m5J33M7J75m87q6O21k90j0k67R1J16L4n3
4617F6N0J52k01k63L5J09J85j02j31J43K67k41J8o8J79l69J02o9K24j49J65k18
4639a16M1L50n40J16K82K23m18j54L86Ql21n0K30K14l12j56J50J29m1l21m3M85
4661A42J1j53j78J75l3k8j60L17Kl21M4j3K6K10K7k04K17k16K15l40K76J37j92
4684c9j40L49J81l16K12m71N68n86M5P9K99j22J34m46L64q7q7J68MJ50j21j65
4706b7Q0J97l09J45l23N14k02j73k27N74o4l17J39J29R0l79p7K94L5j78n4j44
4728b77J38K21j18j04K73j77l8J14j7M9j56pJ80L5l25L8K30j04kn9R1O2J54k97
4752i6K38j21J43j76m4jJ60l69Q6Q3K45J18m08K04l89K89j53K08J91q2l4k19K85
$$ plain form
4594 -57 -83 -336 -36 281 72 -78 -214 232 87 42 175 222 397 -90 -176 445 155 145 -122 -31 85 119 66
4617 66 116 268 67 -196 -161 -52 133 31 -100 43 310 69 87 19 198 -171 -69 -138 86 -63 102 -116
4639 -116 -75 275 -265 -149 133 356 -62 -216 170 178 -143 -193 37 251 -61 -217 -67 62 21 -300 -343 142
4661 142 153 0 -178 -3 -36 -64 -224 93 95 -226 -182 -195 -169 41 68 -136 81 -135 80 -260 16 153 -39
4684 -39 -179 170 351 35 247 -224 344 -242 -197 -118 181 59 193 -253 111 24 -63 105 109 259 138 -27
4706 -27 53 250 -59 86 -237 277 75 -98 -325 249 185 -132 7 136 226 -153 -230 64 99 -79 -133 -277
4728 -277 -139 82 -36 -140 133 -44 -82 32 15 64 -92 -99 81 116 -209 -171 59 -45 -47 -106 -15 47 201 -96
4752 -96 142 21 164 -12 -56 -57 103 -266 -180 -97 148 266 -142 62 -327 -38 -191 17 208 126 92 -127 158
4775A58j8o0j91OJ86J05k56J57L5J92n32J67P8J62k71j44N25j55j69j43J47J81
4797A60j19k71p3M65k20j52J17m9L45k46j15R5L3N3M3j65J25p0k35M25j25r5m8
4820a22l1L80p4m09M9M15n60L37J39j32N4J7j27n6L72l51m7J87r1J24l0K00j99
4843D5L15n16J72J61k9nR7j90j46O6m4Q4P6l1l87L00p6P9O3l00M63k80K14k4l16
4868b09M46j13j03j47K80j90j23R3J03%j85O2K50k82J45k03J20P0j14j11L05K8
4890A22k19K35l74K62p8q5N4K08J21k98j08K88N2k74l7m9M31k76j1K57j50J45
4912B16j90Q0KO6m37K18K56K3k11K37j91k6J61l22K01J09P2k61j12K39k8j50m9
4935i7J80o7q5J1PJ75j18K58j96K05j30j02k16J25R3p8m4J0Q3n2j0J08Ol11K36
$$ plain form
4775 158 140 80 -111 -105 81 186 -70 87 122 314 -218 -51 27 189 -82 -226 299 144 -25 -168 -21 160
4797 160 41 -230 -303 162 -58 -210 -93 -142 203 -43 -158 -63 -30 23 66 -99 26 -44 -279 146 21 -74 -122
4820 -122 -153 227 153 -256 -207 208 -352 -15 124 -8 46 63 -64 -120 252 -99 -146 41 -50 74 44 244 45
4843 45 360 -156 16 177 148 143 240 50 -96 -30 -74 10 86 55 -332 -32 -108 -29 34 -266 197 -83 131 107 -209
4868 -209 237 124 21 -126 154 -36 -159 -66 37 37 -148 -86 164 -118 27 -176 -56 14 -100 -211 94 122
4890 122 -97 138 -236 26 -52 -137 -83 125 246 -52 -160 128 180 -94 -131 -180 251 -25 -36 221 71 216
4912 216 26 106 108 174 -263 -45 211 234 23 260 69 43 204 -118 83 192 264 3 -109 130 102 -48 -97
4935 -97 83 16 -69 -58 -51 124 6 264 68 273 143 41 -175 -50 43 -35 -79 -69 14 -38 -48 60 66 -245 -9
4960iQ4ro0j61R2M3J34k81M3J98k94L34l53J78J71q0n1L8J94n8k92J44J58J1n0
4985A24q1j89K85j13o6J39j56L06m12J74l5M35o46K89J80j16L4q8J06n0j59P4
5007C5L35m05J5o5J50L9j43k4RK0k5L0K86k52K03j64j81QJ98j37k37N16j79N2
5031H4k38J57K9R5j91N8J51p3k22J30o7J28K8n41M78K47l17k4O3k1J96j40q1L05
5055B34j97o9j07P8o7J2J0O6J11L0m5Q9N7N0m11L86j65jk76O6J97N4m0N7J95k50
5081F4J16q8m0J18j05q9Q0M5L5j88K51l38O7P8j26J62o9j29K30l12M53k85k7m3
5105a40J04k33j17J92L55r4j35j98J97j44J56k52J46L69k21K3rJ22N3j9l88K53
5127B0J12n00L93k72K94l30L42jK51j75k01J79j04k9J12l0M04m48Q4j42O4J00
$$ plain form
4960 -9 75 66 6 -155 -63 -20 114 -167 -124 74 -220 114 -239 -61 110 30 -21 17 211 153 -139 5 163 174 124
4985 124 43 -146 139 26 -40 99 -57 249 -163 11 -24 411 -235 54 234 118 152 64 170 120 -39 35
5007 35 370 -35 -20 -85 65 104 -39 -63 -54 -34 -59 -29 257 5 208 44 -137 -129 69 -68 -305 211 32 84
5031 84 -154 3 32 127 -64 -6 145 72 -150 -20 -87 41 69 -472 6 253 -64 -88 -25 -46 150 10 -71 234
5055 234 37 -32 -139 -61 -128 -116 -106 -40 71 101 56 145 202 252 -159 227 62 61 -215 -149 48 102 62 119 314 64
5081 64 180 92 52 170 65 -24 56 101 136 -52 199 -139 -72 6 -120 42 -27 -156 74 -238 215 -70 -97 -140
5105 -140 -36 -269 -386 -194 161 67 -68 -266 -69 -213 -57 -309 -163 206 -15 8 -1 121 174 155 -233 20
5127 20 132 -368 25 -247 47 -283 59 58 309 134 -67 112 8 -21 91 61 465 17 101 -41 23 123
5149A23j65J25r0q8J34l7M7k26K95K8LN7k82N7R2k8o6j24q8J22K34J6k53J09K
5174cm1k96M42M3k33k44J75kL04k76M8J54o5k57J74K59j17K23k48M8oj40l54N74
5198A62l84J80j65j1J95L6J19k82Q5M06k17k9o0k00P7J26k3J28L0m68K12L51Q3
5221C51o20L40M2j81K58m60L13P7k54J12J06mJ68j73Kj85j19J73mM4J01P9m77
5244c11M18M56m71p1j83J35L9j64J31r6K69m7j22K51k78k4j12J41J99k46q7R7
5266g6p0K09l18J23L02l45J04k4m1K25k01j37M46k51j95l1L13K9k68J79J20j9
5288G4K1l29o6L73J91l55J02R7J03k38J03k97L23n5j14l6M73n45J84k6J77k09
5310d9J98k00m5J30k52L73n3M2k91J3J80J35ll76J48M1P2m7j53OK05l02K03K5
$$ plain form
5149 123 -42 83 -7 -95 39 2 49 -177 118 146 149 206 -76 -19 73 45 -21 -145 -233 -111 123 139 -114 -5 -3
5174 -3 -44 -340 102 145 -88 -332 -157 -159 145 -131 -83 71 6 -251 -77 182 65 288 40 88 82 -58 -412 162
5198 162 -222 -42 -207 -218 -23 13 132 -150 -65 341 124 95 35 -165 -88 38 15 143 173 -295 -83 268 351
5221 351 -269 71 113 -68 190 -270 43 120 -134 -22 84 80 248 75 77 -108 -227 -54 -58 -14 87 166 -311
5244 -311 107 563 92 21 -162 -27 12 -152 -21 -117 152 105 -17 234 -44 -68 -180 -39 160 -86 -173 -76
5266 -76 -146 63 -255 -132 170 -175 -71 -95 -136 89 -112 -249 197 -54 -249 -280 33 62 -206 -27 93 74
5288 74 95 -234 -300 73 264 -91 11 108 211 -27 76 -221 102 47 -67 -103 370 -175 9 -17 160 -49
5310 -49 149 -51 -96 34 -218 155 102 144 -147 -134 46 181 178 -198 -50 -9 63 16 -137 -131 74 -228 -25 0
5334@rj31J06l4Jj9Nj23J77o1L9j20J86K4k00R2j04K29j0k76L62o1j90J35K5L03
5360C46n56j0J82J44m4J4q3L65l16n9pJ43l2p2J23nN8q2j65K3r5J73J47k24R5
5385F3M6j34J12J05J5j36r3J8K11k75j22J02L4J65l11J86P2O7k86J70p8P5k9j54
5409a77K78Qk04N7r2L1J71k34R0l8M03l81M1J6K25m00J30K20L2r7q8m3L23k04
5433F7l0l54N84m54J87P5j39K27k69o2L80k39J73k33j8M94L0m53J05N1nk77Mj46
5457c02J88K33k41L81j90K44n60L22j30J77L7j91L46l02q6J78k26J28j13M4k27
5478b90N3o8J04J06J93p5j60J37K0J7k58qL12k16R9J8p7P1P5m04K87k3m0j58J13
5503a72J20N1l06J91J97j66K9L5J53j51J21j74M52j06j26j80K42k76J60j0j38
$$ plain form
5334 0 -9 -140 -34 -68 -67 -86 -81 -204 -27 -88 -49 -169 17 41 -159 -67 -171 58 48 -228 134 73 -117 18 43 346
5360 346 -210 -220 -38 106 62 76 -7 358 42 -17 -24 119 87 15 138 133 191 109 -56 -33 -128 45 192 -32 63
5385 63 109 -25 87 192 207 71 -22 -4 207 -68 -190 -88 -54 111 -200 -14 58 125 -161 9 -69 6 -23 -177
5409 -177 101 109 -95 -38 -130 -99 72 -162 -72 -110 293 -88 -47 -31 194 -206 -76 144 176 79 -9 -52 271 67
5433 67 37 -317 267 -187 0 75 -64 163 -106 -168 212 -27 146 -87 -105 389 419 -34 71 122 117 -160 -156 -302
5457 -302 -114 119 -122 259 69 313 -247 75 -55 122 159 -32 314 12 -74 104 -122 6 -107 -63 -290
5478 -290 -237 -305 -201 -95 98 23 -137 0 20 37 -221 -229 83 -133 -34 -16 -93 -22 53 -351 -64 -87 -127 -285 -172
5503 -172 -52 -1 -307 -116 81 -85 -56 -21 132 -19 102 -72 380 274 148 -32 210 -66 94 84 -54
5524e4K01L9j44N8L67k98p0o3P2J32n8n92L48K46k67J66k00L56k93Q9J07l61L30
5547A11l51P8M41j98j97L5K18k61Q7r8LK24p2p6lMJ59j87J36M3p8J62l42J10J47
5572I5o4q5Q3J1J14l11J33M3J99k77M5K38m50L23k21K51J41j11m2J87j19j82j73
5595a72J50K06k51LO7J78j71J45l1j98K07n5j03m8l6K97o6j23J12j69R9r5J45
5618I1k06L14j34J17p8k91K73r0J3l2j53R7K01l40k0J28P3J15l42P7K35Nl42N9
5642b30J63j06j36M80k93J49K01k79o5J36O2j63O9j80N1K53r3L70n79J52J44j63
5664e7L13j25L9k71K29j65j14K0K86j59Q1k24L99K5l30J97P5M0j54M2l10L67l6
5687A68l30J41L41l48J33j11j71L55J3k84Q4j26K77k98M0Q8n7K33l3j32j43J82
$$ plain form
5524 -54 147 186 42 100 467 169 99 36 108 240 182 -410 -62 184 -83 83 -117 239 -54 35 142 -219 111
5547 111 -240 -162 279 81 -116 -81 137 -124 -37 -135 -132 92 20 -56 -59 -55 104 -83 53 96 18 180 -162 -52 95
5572 95 31 -54 29 40 154 -157 -24 19 218 -59 -14 224 -226 97 -124 127 268 157 115 302 183 1 -172
5595 -172 -22 184 -67 -64 3 181 10 155 124 -74 133 78 -25 -73 -109 188 122 -1 111 -58 41 -54 91
5618 91 -115 199 65 182 104 -187 86 -4 9 -23 -176 -79 122 -218 -238 -110 -37 78 -264 -187 48 53 -289 -230
5642 -230 -67 -173 -309 171 -122 27 228 -51 -116 20 82 -81 -12 -192 -141 112 19 389 -190 -38 106 -57
5664 -57 256 131 170 -101 128 -37 -151 -131 155 -4 77 -147 252 277 -53 144 219 259 105 147 -163 204 168
5687 168 -162 -21 320 -28 105 -6 -177 178 191 -93 -9 -135 142 -156 -116 -28 -85 148 115 -17 -160 22
5709B2k59L58nj42jJ34j21K21j59l34L07j81J60r8K47l71L00K51l55L3kj36J62
5732C1l2J08p8k65L19r6j9n7J9O7J61M5k11K34l91M4J95k3j32M1p1K00m6k94K32
5757a9P5j08Rlj50P9J94j55L39j01j58j1JJ08j13j85J93R5L3M5j32P2j79k10k
5782b83L09k07J72R0l6n9J6lK3j3N9j38n6K07o4p9j37J49N6J9k93M00k89L06l19
5807a70L65j07l5l68M12J82j64p4l42K63O7J2J34k2P6j78q7J01K0m7j67K05NJ4
5831I5j39L11p8n6j27j67J56j44R3N1L2j21J71k01J72lJ07k15M7k7Q2O0l32M35
5855B02j00j35j09J85J3j13q7L30j68J38n31J54J19R0k82J84K52Ok56L6M1q3K7
5878h7r3J50J17k87p6K04J44Q3m42K92L8j22K32n9o6J32o5k30J48M5j00o2R1L1
$$ plain form
5709 22 -237 121 116 -26 -27 107 -14 207 48 -286 21 -160 0 -98 149 -222 78 329 -26 7 5 -131 31
5732 31 -1 107 29 -236 83 -13 -32 -89 -70 -3 158 203 -8 226 -165 -121 74 51 -81 -40 -111 89 43 -251 -19
5757 -19 56 -52 -43 -46 -196 -117 77 -78 261 160 2 -9 -8 100 -13 -198 -5 90 123 168 36 108 -71 -281 -283
5782 -283 26 -181 -9 81 45 -14 2 -1 22 9 68 -70 -126 81 17 -62 -199 -50 6 25 -268 132 -157 149 -170
5807 -170 195 88 53 -315 97 279 115 41 -301 -38 29 41 175 153 229 51 -36 65 85 38 -129 76 81 95
5831 95 -44 267 189 133 6 -161 -5 -149 -56 -5 27 -94 77 -124 48 45 152 -63 -16 -43 39 99 -233 202
5855 202 102 -33 -142 43 56 -57 -144 186 18 156 -375 -221 -102 -12 -294 -110 142 148 -108 -72 -31 -114 -87
5878 -87 -180 -30 87 -200 -276 -72 72 155 -287 5 43 -79 153 94 28 160 95 -135 13 58 -42 -104 -13 18
5902A8L01k10q7Q8l08oL60k2k03K9k80M42q5l5j13L57o5j47k26J27J88j13J7J6
5926D3J9m4J01k17J18P5k72P0L4K51l06K40j35k5j34K48n5k42K80k58O7J46M1
5949D5j90L1K97k38R7j07P9J98j44j60Q5K81j81j28l5J94k05J93j25j37L48q0
5971A18l91M81j17j42J25K44k72J97l84q6K29qj0k8L8J36p1k64K22Q4j35r2K05
5994G9Q2o5j94M5m6J33r3J73k86J14J21j71k03K99N2j02J52m0O1J4j56m1j2j42
6018b26K15J1J23M5k43j1n6L1K7j81J40J9R0j78J98m4J09k01L18n6j79R2o3J78
6042A58L3j36m7j30J48o6j76K5L51k71J49K24m9k47MJ96j47J28M9o8l3L7j24j45
6066a37J67J2j29R4l9J55j28J91k02J35J50k41P8J40l55J56j80L36j77j1j10P1
$$ plain form
5902 18 319 109 22 110 -198 -204 156 134 -69 -40 -320 122 37 2 -111 246 181 34 -192 -65 123 10 27 43
5926 43 62 18 119 -98 20 95 -177 -107 -73 178 -128 112 -23 -48 -182 66 11 -231 49 -209 -142 4 45
5949 45 -145 -114 183 -55 42 -65 14 212 68 -92 -7 274 93 -35 -70 124 -81 112 -13 -150 198 118
5971 118 -273 208 91 -51 74 318 46 243 -141 -227 2 -6 -16 -44 -6 130 59 -205 17 101 -34 -126 79
5994 79 161 96 -98 -53 -99 34 -59 114 -172 -58 63 -108 -311 -12 40 -62 90 50 111 125 -31 -72 -84 -226
6018 -226 -11 0 123 168 -75 -86 -142 -111 -84 -265 -125 -106 -16 -194 4 -40 69 -132 186 130 -49 43 -20 158
6042 158 191 55 8 -122 26 -40 -216 -191 160 -111 38 262 213 -34 -30 166 19 147 196 128 95 132 8 -137
6066 -137 30 42 -87 7 -32 123 -5 186 -16 119 269 28 106 246 -109 47 -133 203 26 15 -95 -24
6088b4k1o2k26J85J54p4j38L6K89K11o9k16n9Ok01L74r0pj01J36l7K27m83j47
6112c37J37M16k18l1LK3J62n0l42K15K88l18l0L19l53J99j86L12k64q9K42Q6N0
6135B34n6k48L21j82J45m29J86K50L3j01k93J79Q4m0k39N0K09k38L63k59J94j77
6157a4M1j51rR6j33K59L7J3j66q7P8M4J6k98K70K3j13J52j87J79j38Q9jj03M0
6182f3j35J86mn8Q8n3n0J96m2j50K10j41L7O8K49r9r9K4l92J74j7J7J07K4m8K21
6208B50r9p2M8n3pk63M43l42L73j92j53M21m40L67j78n8k77M0J00K52q1k12J90
6231E7M2j06j66J00L2J99k93J48J06j90P4j22k5J08j3K34J6l63QN5R4Q3j2j15
6255d9j35J63k18K64J22l10Q7K28m86L08l3l7J90k06K62nj97K83j66p1j90L52
$$ plain form
6088 -24 -45 -107 -333 -148 6 -68 -206 -170 119 330 261 45 -14 -8 -209 165 75 68 -33 103 66 293 -190 -337
6112 -337 -200 216 -2 -33 -30 -7 155 105 -237 -22 266 -52 -82 237 -116 83 -103 209 -55 -144 98 184 234
6135 234 178 -70 251 69 214 -215 -29 221 254 153 -140 39 123 83 -156 -106 103 -135 228 -31 163 -14
6157 -14 27 -124 -133 -37 -170 89 126 139 -27 -114 -36 8 24 -274 -4 19 -94 58 -129 50 -88 1 0 -103 -63
6182 -63 -198 -12 -16 -74 14 -39 -89 107 65 -85 125 -16 21 89 338 239 140 164 -228 -54 -71 -54 53 77 29 250
6208 250 151 79 127 74 67 -196 247 -95 278 86 -67 354 -86 281 103 45 -232 -192 -92 160 79 -133 57
6231 57 99 -7 -173 -73 -41 158 -135 13 119 -71 3 -119 -144 -36 -49 185 201 -162 -154 -99 -5 78 66 -49
6255 -49 -184 -21 -239 25 147 -163 -76 152 -334 -26 -59 -96 94 -112 150 145 -52 231 65 -6 -196 156
6277A56j44j34L82l41P5J55o7p6J12j53J72k22r2J92j82J59q9J18l09M30J01k62
6299a9J36p3p7K57j46k45K16qL1K9q6j33M2n8K08p7k02J28j0n2r4M61l35N7J69
6324A19n5P5k31P9M5O6j63l7K25J3k1r0P4j54L2J20q1k11J73l0k40j7N34l90J8
6349a47K23n7j19L9J37M9j86oJ40L8K52l60k03K20m4Pj39K19J65k33Q3j95K42
6372A25k47M3k11K93J43Rj63P6k80J40K43l48K57jN6ql10M43m39J94J43k14K57
6395B01l14J31n6RK12j76j22J91k59K57o0J77k73K7M1j39K16j01k24L49l42M50
6417A95m19M19l89J84J4L0M8p4K06k94M01m36L7J77o3J14J2k2j82j7j41K15Pl43
6441c21N07k87o9J93n0k4J00J58l48K1L3K09l18J09M8J58j96j44j4M64l51O0m9
$$ plain form
6277 156 12 -122 260 -81 -6 149 82 6 118 -35 137 -85 -177 15 -167 -8 -97 21 -288 142 243 -19
6299 -19 117 44 -33 224 78 -167 49 41 72 101 15 -118 -76 -134 74 -3 -205 -77 -87 -139 -233 228 -107 -50 119
6324 119 64 139 -92 -13 32 98 -65 -102 123 136 115 25 99 -55 -23 97 16 -195 -22 -52 -292 -309 225 -165 -147
6349 -147 76 19 -100 -61 76 125 -61 -67 73 111 363 3 -200 20 -24 -17 -156 63 228 -5 78 -117 125
6372 125 -122 -79 -290 3 146 155 -8 68 -212 -72 171 -177 80 79 135 127 -183 260 -179 15 158 -56 201
6395 201 -113 18 -38 -29 183 7 -115 76 -183 74 14 191 -82 -55 -14 -153 63 -38 -262 87 -255 195
6417 195 -224 195 -194 -10 4 34 82 8 214 -80 321 -115 -78 99 36 150 162 140 -42 -59 -200 15 22 -321
6441 -321 186 -101 -170 23 -27 -51 49 207 -141 -120 -87 122 -196 -87 -39 119 -77 -221 -235 229 -122 -62 -111
6464a11J07Q5j2N6p6Q6o0K67k70j35p0q1J67Jk54J55J38J32q6R4k00k6J37k01
6488a57k06M72n0j08n1K64j44j33j57K19o0L93k41j8L5K35j67l4q0L0K51k28j78
6511a13M40r5k10j95J57N3k35K07J9M7Mj74q0k5L82k39K08l02L79j82J66p3j24
6534A5l80J3K60K01k44p2J60j22L78j57j13J55j28O6k7kk2J11j13J86k08L40j91
6557A06K6r9j66J0K67J69m66K67k36m8L08k0j85K2J92q3J0J41j62k5j47L25j76
6580C0k58K82j62K12j40j2r5K39p6k3m7K09m03J55J92j90J15J41k42J35J13j35
6602D0K30k68j54R5n3O7J03o9N0J59j67Nj91L13k37j5j76J51K76k57J99j71pN9
6626a8j48O9O2j58J04m0L30j30l4k40K30o7K01j51k5j31L96j57k76K29P1p1L23
$$ plain form
6464 -111 -4 81 69 125 49 135 75 342 72 -63 -133 -214 -47 -46 -300 -145 -7 125 39 133 -67 -93 44 -157
6488 -157 -363 109 59 -49 -100 164 20 -113 -270 -51 -111 282 41 23 58 293 126 92 12 42 293 65 -113
6511 -113 327 232 22 -173 -16 37 -198 9 28 75 79 -95 -175 -200 182 -57 151 -151 228 46 212 139 15
6534 15 -365 -352 -92 109 -135 -207 -47 -169 209 52 -61 94 -34 32 5 3 -19 92 -21 165 -43 297 106
6557 106 132 33 -133 -123 144 313 -153 114 -122 -170 138 118 -67 -45 147 64 74 215 53 28 -119 206 30
6580 30 -228 54 -108 104 -36 -48 -143 96 20 -3 -50 159 -244 -89 103 -87 28 169 -73 62 175 40
6602 40 270 2 -152 -57 -110 -43 60 -9 41 200 33 38 -153 160 -77 -92 -268 -117 159 -98 101 -70 -77 -18
6626 -18 -166 -97 -35 -193 -89 -129 201 71 37 -203 27 -40 161 10 -15 -146 250 93 -183 46 117 46 369
6649C69l33J01P5k76J26r4J01P3k95L02j17O2m1N9o5J03j38p6J18l8J18j31j6
6672a3J39J38n08J82Q1J1N2Q7j37l41J21m6L36J53j26q5j38J41r9K8o7J27r3j45
6696b02N3K87K47l26j96K15P9k50k38J55J32k3RJ74j44J30Ql4P6j54J21N5l00
6719a26M32k32o0k06J11mJ33m8j7j0J55m2k05O0n0j5K40n5R1k38K06J00o1k0j52
6744a3j2n5J43K48k80J10j09L4j5k32J78J08j52l2J96k01J04r9j5Q9N4J29m39
6767b61J83k31L84J67o1j51N7p1j9q7L4J49k82p9J80L52m35J85k65L76j41k9J68
6790A23j26R4p3K37k87k06J88K18m7j28N8K4r3k8O4j30k3J59n6jj06K37j54J23
6814F7r1R3r7j01J32J42M8l67j8L19j26J00k14Q9J7J29l3j28j8M1K5J0p7J3K52
$$ plain form
6649 369 36 137 212 -64 62 -32 69 142 -153 149 32 94 53 112 47 150 12 -64 54 16 134 3 -13
6672 -13 126 264 -244 -62 19 30 82 169 32 -309 -188 -234 102 255 129 44 -94 47 -52 -24 -91 36 -57 -202
6696 -202 -149 138 385 59 -137 78 157 -93 -331 -176 -44 -67 -58 116 -28 102 110 76 152 -2 119 174 -126
6719 -126 306 74 14 -192 -81 -85 48 0 -17 -27 128 86 -119 -59 -109 -124 116 61 152 -86 120 220 159 139 -13
6744 -13 -25 -80 63 311 31 141 32 66 51 -181 -3 105 -47 -79 117 -84 20 -79 -94 -5 49 178 -261
6767 -261 -78 -309 75 242 181 30 87 16 -3 -90 -56 93 -189 -268 -88 264 -171 14 -251 125 -16 -45 123
6790 123 -3 91 18 255 -32 -238 -50 168 121 -7 51 75 -18 -46 18 -112 -135 24 -32 -33 -139 98 -56 67
6814 67 -24 69 -28 -129 3 145 193 -174 -192 127 1 101 -113 -24 -7 122 89 -39 -57 -16 9 19 -58 -45 207
6839B07q3k80J5K3l10J79J92J62k28q2J52M8K09q1k22L32m12J72J23J7l01K8L48
6862B08j98K41j78j92J86q2j62J64J32j70PJ96j79j57J98ok17K75j11j5K8J17
6884H5k30J89k57K06J58j72k3K9O8k4RJ50l08J63K8o4O9k26J32j19J03J19k05
6907a20N5Q5R3j11r0J03K14m41M12p9n9L7l69J08R7J09Q9l40K00J86J03n15K03
6930c0K4j05K66j1o6j15J35k66k4mL8J21J3L4J40k13L94q2n5k99R0M4J42l29l
6955a61K97j3k64K06k20L04k0j35R9L7j90Q2LK73l16m7K5P5J57j92K16k31K87
6978B72j11k34n8J87k80M9Q0J14lq4K0j09J97k07P4J20K6P6j30Q4k69K12L5j22
7002f1q3k4L3J76j9rR9j22k0J40J62q2m9q7o2N9j72J71L6j00K42o1k88K08N8k69
$$ plain form
6839 207 124 -156 -141 -118 -428 -249 -57 105 -123 -205 -53 -5 204 123 -99 233 -179 -7 116 133 -168 -140 208
6862 208 10 251 73 -119 67 -15 -177 -13 119 -51 -44 152 -27 -184 14 8 -209 66 -45 -60 -32 85
6884 85 -145 44 -213 -7 151 -21 -44 -15 53 29 38 188 -120 43 71 7 76 -150 -18 -137 -34 85 -120
6907 -120 -65 20 113 2 -88 15 229 -212 200 121 62 99 -270 -162 -65 44 133 -207 -7 179 282 -233 -30
6930 -30 -6 -111 155 144 78 -37 98 -168 -192 -196 -158 -37 -24 10 150 -63 331 249 194 -105 -15 29 171 -158 -161
6955 -161 136 123 -141 65 -155 149 129 -6 93 130 -60 22 25 298 -18 -65 -40 35 192 0 216 -15 272
6978 272 161 -73 -131 56 -224 -175 -95 19 16 -68 -48 -157 40 -167 -93 27 53 129 -1 83 -186 26 61 -61
7002 -61 -144 -168 -135 41 22 13 112 -10 -30 110 272 190 141 54 -8 51 -121 50 86 -14 228 167 -121 87 145 -124
7028a24K24k0l40K83m4j39J96j50J7K56n1M9k03L01j16k15L40k21j7j20K49k62
7050a07J56j93J07n7%K41k52j7J37N7j63q3M56m45O0P0r3MQ2J99k46N5r5j59K73
7075a3n1L0j21P6K40k88N8J1j40O3J11Q2J1p4K5J25j29K07k60N6N6J75l84L36
7099B02l46k3N5j8J93j73R7J87j53J27j33k39K60J37M5k61J22nj40J06Nj83K59
7122A21k31n2J60J83r5k38K61L7l16J77k6Q3L5J73l66k6J55q9L7l4R4p6k1k12
7146b66K15j32K34K32l12N3M2j63P3J23q1r6K08p7Nj28RK25l48j58M55j32J64
7169A45k82J20O2J8l86N82l04J65l09J82J58j64k80K63R6k3j1k07L38J48l56J14
7191F9j15q2K88k77K0J51j0n3J39J8O7l14K46k7P3k83j22q1L42q4n7P9j1J09P7
$$ plain form
7028 -124 100 80 -260 23 -21 -160 36 -114 -97 159 108 157 -46 255 139 -76 264 43 26 -94 155 -107
7050 -107 49 -144 -37 -94 -94 147 -105 -122 15 72 -91 -174 282 -163 -103 -33 -126 -122 -40 159 -87 -32 -127 -286 -13
7075 -13 -64 -34 -155 -79 161 -127 -69 -58 -198 -135 -24 58 69 -5 20 145 16 223 -37 19 75 250 -134 202
7099 202 -144 -167 -112 -130 63 -110 -13 174 21 148 15 -224 36 173 218 -43 79 74 -66 40 45 -138 121
7122 121 -110 -162 -2 181 86 -152 109 146 -170 7 -19 64 99 272 -94 -120 35 -54 -17 -51 43 -33 -54 -266
7146 -266 -51 -183 51 283 -29 24 66 -97 -24 99 18 -78 130 53 58 -70 -61 164 -184 -342 113 -19 145
7169 145 -137 -17 45 63 -323 259 -45 120 -189 -7 151 -13 -293 -30 66 43 32 -175 163 311 -45 69
7191 69 -46 -128 160 -117 -97 54 44 -9 130 148 215 -99 147 120 193 -90 -212 -293 49 -35 -92 -13 -24 85 162
7216A62l5k32m3l6N7j71N05j82k18M06l87J37o5j05J48m3J22J17j83L1j08L20
7238A97k35J32j98L38l20n4K46l4k74J86j54M15m08k44M63l4j16J0K61j18j60
7259a01j1L32k60K75k0m33M99r4K5J04m22K45j11K00j76K82k76j91K63l98M89
7280B21np4j47j26o4P4J62j31J5J47j32N2J24P6j76M0r0R1J39m32J89j64L61k28
7304g8j3J76L4L4l02j19K6J94M5R1k75J77J25j70N2kN8L22l35j12N0J90j05L9
7328A02o1j92K78j14J83j71J91j81j72K6J54j54Q1J32J99l46M6J1R0q8r0J4n0
7351a12O6j82L52m20L60k26Q2K22k47R8n3J58l73M03j03k57O02m10J89l03O0J37
7373D3p2l08L49j06j43K11O7J65k39m3m6P8lJ09j17j71M88m23L1J44j8mo4L12
$$ plain form
7216 162 127 -105 -148 -184 -127 -298 207 25 -193 213 -174 -37 -102 -207 -59 -102 20 137 -46 -15 -123 197
7238 197 -38 94 -104 234 -86 -140 106 72 -202 -16 -170 245 -163 -407 56 22 -94 -84 177 59 -101
7259 -101 -112 220 -40 235 215 -218 281 187 212 316 -106 139 28 228 52 334 58 -133 130 -268 221
7280 221 216 142 -5 -131 -195 -121 41 -90 -75 72 -60 -8 116 192 16 56 -34 57 196 -236 -47 -211 150 -78
7304 -78 -91 85 119 153 -149 -268 -242 -48 -3 88 -187 -10 115 -55 -3 -5 53 375 40 -72 -22 168 63 102
7328 102 41 -151 127 13 196 25 216 35 -137 -111 43 -111 -30 102 301 -45 1 12 102 14 -76 -62 -112
7351 -112 -46 -228 124 -296 64 -162 -80 142 -105 -7 -60 98 -275 128 25 -232 370 -40 149 -154 -94 43
7373 43 -29 -337 12 -94 -237 -26 41 206 -33 -76 -122 -44 -47 62 -55 -226 262 -161 -130 14 -4 -8 -72 240
7397B40k5j7l30K37O2J8k91M17l42k5%O7Lj35j61J02R2J15j54J17J7K2Q8k27K18
7422A08m8l01J82J03P4k19K51m6P3j30k12K97L9o3k01P5O5j58Q9m1K05k38J9J86
7446A09j20j16K20j61K61l11J46M0R4j60j90K13J98k72K85n35K41k9Q4Q5k09K46
7468A19k38P9J67k8o7j86K7R7j43J26R4P2j3l2J91l52J89Q6l34k1L02j62k23J69
7492h1J61rK6J8J92k24M4qk58n5L00o6M4l7P5m9j46K73l05K89j51Q3r1o8r2M7
7518h8o4M18l46k88K60K43j46j50K20Q0M1k77q7J59J54j26j00JK68j83J24j81
7540f8K3O1j41J06k1J76j60j13J34M0j15N5J26O2l26J71J2N7j12j56N1L23j20
7563F5j87J66j15K41j85m5J12j39N3K01j12L5L6r1o9r6J51K54k07j19j05p0K04
$$ plain form
7397 240 215 198 -132 105 167 185 -106 311 -31 -56 -56 11 14 -121 -282 -180 -88 27 -127 -10 7 29 117 -110 108
7422 108 60 -241 -59 44 118 -101 150 104 177 47 -165 132 171 108 -93 -18 47 -111 -22 -63 142 -96 -77 109
7446 109 -11 -127 93 -68 193 -118 28 68 162 2 -188 25 223 -49 236 -299 -58 -87 -3 82 -127 119
7468 119 -119 -40 127 99 32 -154 -127 -30 -173 -47 47 119 106 74 265 -87 102 188 -146 -167 135 -27 -250 -81
7492 -81 80 71 97 115 307 83 127 119 -139 -194 106 40 84 47 122 73 -73 200 -105 184 33 116 25 -43 -135 -88
7518 -88 -152 266 -80 -368 -108 135 -11 -161 59 139 180 -97 -184 -25 129 3 -97 -96 172 -11 113 -68
7540 -68 -45 16 -125 -19 -40 136 -24 -137 -3 37 -78 -23 103 165 -161 10 22 79 -33 -189 -138 185 65
7563 65 -122 44 -71 170 -15 -60 52 -87 -34 167 55 90 126 35 -34 -130 21 275 68 -51 -156 -226 -22
7586b2mj08Q0l55N08l71K99k30K95j45q4K8K43P4k02J16j34K1L7J25k71J88n3
7609C5n7p4L8K7J35k43P5Q4J23j41P3j71L4p6J84p7K78j62l31J0J41J21j07J61
7633H0L3k26J2J05O7k37R4OK11j6j30L14m00J83j74K54j93j01K4K80k35J62j45
7656c2j51K45K0k22N3p4K94k73J21M8L0k12M28n05J54K68k96P9qJ67J31k21k34
7679a90L20m22M99l66Q9J14r5J28j11qL8j72J20l0n4l4J63J24q3k3l3%M5J37j02
7704E4j00J45k45J56l6m6K77j34j11J65j13L8k0K08J39n05J19J40j76J61l1R8
7726A83k06N7L0l28L89k52L19l83J29JK39j51Q5m07L34%J62k81J1L3J04J15k04
7749b1K12q7l03lK29k6J20k56K34q1J05j68R7k10M29l31J5J60j79J16j10q5j9
$$ plain form
7586 -22 -26 -134 -54 -409 99 -272 27 -203 92 -53 -137 -109 134 208 6 122 -12 9 46 171 -100 88 35
7609 35 -22 -96 -58 -31 104 -139 -64 20 143 2 75 -96 -62 -138 46 -31 247 85 -246 -236 -95 26 -81 80
7633 80 113 -113 -101 4 71 -166 -72 -66 145 129 -1 313 -87 96 -78 176 -17 -118 -94 186 -49 113 -32
7656 -32 -183 62 82 -140 -87 -161 133 -140 -19 29 59 -153 275 -230 -76 192 -104 -25 -33 134 265 44 -190
7679 -190 130 -292 207 -159 -70 44 -51 77 -34 -42 -4 -176 -56 -86 -140 -174 -11 113 30 7 -26 -26 19 156 54
7704 54 -46 99 -146 10 -26 -72 205 71 -40 125 12 50 30 238 377 -128 -9 131 -45 116 85 183
7726 183 -23 34 64 -264 125 -127 192 -191 -62 -61 178 27 112 -295 39 39 201 -80 -69 -36 68 183 -21
7749 -21 191 104 -199 -202 27 1 121 -135 99 18 123 -45 52 -158 271 -60 -45 115 -64 52 -58 -143 -162
7772a62J30RO9o8J13j0k15J54m0P2Kq7k89L67l8j0j0o1K48j99J7J79k29l2j3K28
7798A25k23O5l8l7J18J25J51m06M29j47k14J25J6j66K1K43l22K72k71l3L53j44
7820D2j34J12J81j65r1r5K73n6p7j05r0J54N1j70m7L52N7l69j78M00N6k40J42
7843Cp9o7M01l47K38r6j01K20j74K02k11k01K7K09J72j59J11k72J38k64K86N7
7865I3j61J06J44r9j13J11l19k5L33j9N5l8k35J48J04J21l14R3p7J39J29j04q2
7888a0J32k20Q2n7J74j18m7J48qR4m40K32k9J38k75J77j07K4M9J77k14K59J13
7911B74k31j14J56j64j44L02m51M43j26Q6r1j25K49J32l0j86k1J68n8O3k60j3
7933a41J75lJ10j33j4k14K0J86r6J0L97k16j80q2M12m38K19q8R7K6k46J59j03
$$ plain form
7772 -162 -32 -23 46 -22 91 81 -134 20 -20 52 54 -33 -322 45 7 -3 -13 -74 174 -25 -8 171 -58 -90 -103 125
7798 125 -98 -33 -71 -108 10 135 286 -120 309 162 -52 73 89 -77 -56 187 -135 137 -134 -167 186 42
7820 42 -92 20 201 36 -55 -150 123 67 -10 -115 -205 -51 0 -170 -217 135 192 -177 -355 45 101 -139 3
7843 3 -76 -143 258 -89 149 53 -48 172 -2 200 -11 -212 -185 24 196 37 148 -124 14 -250 36 93
7865 93 -68 38 182 83 -30 81 -238 -263 70 51 106 68 -167 -19 85 206 -108 -15 -92 47 176 72 -10
7888 -10 122 -98 -16 -73 101 -17 -64 84 76 170 -270 -38 -67 71 -204 -27 -134 -110 -61 116 -98 161 274
7911 274 43 -71 85 -79 -223 79 -372 71 -55 31 -60 -185 64 196 166 -20 -41 127 69 132 -128 -141
7933 -141 34 31 141 8 -6 -220 -200 -14 -110 -100 297 81 -99 -181 231 -207 12 -76 21 47 -199 -40 -143
7956a43J15K33k06M6j07P8J09p1L7o2N4j33K57m28L01j97j5L7K9l4L95j62j22
7979A1J7k5o8J15j63O3J6j2K29j74lK5L4K4j74J80j06K6N3k5k7K5l23R7R4k14
8005c05K14J13m3J65m01K98j08J80k87L97l8L9j86k57L26p9jJ05j53pp6K40mm12
8029b80L02j04K07Q6m16N30k99j91J99j68o6K51J5k50K7K33p1j81JJ28K61n89
8051c75K26k9J21k6j64L55k28J02j35o4L38l4l40K43j07K87k06k06M18k89Q0m5
8073g8K00K0j65N5m2RJ89m55K29M9K18k16J76j55j56J73l6K06j58j23J20Q9n4
8096I5l9m3L7Q9m1r3K74l83J38k04K18Q6j32l3J58j27K27j62M22m42J21p5o3j99
8120a71J50M5p1k5J18J49l24K18J9j16J17j00K53o6l8k55pN2QK14j44q8j49L07
$$ plain form
7956 -143 -28 205 -1 45 -62 16 125 54 91 29 83 -50 207 -221 80 -117 -132 -95 -66 -100 295 133 11
7979 11 28 3 -65 50 -113 -50 -34 -46 183 9 6 31 65 89 -85 95 -11 15 68 43 16 41 -282 -185 -91 -305
8005 -305 -91 22 -21 144 -257 41 -67 113 -174 223 185 224 38 -219 107 28 27 132 -21 -28 -104 136 132 -280
8029 -280 22 -82 125 211 -205 325 26 -165 34 -134 -200 51 66 -184 -157 76 5 -176 -175 -47 214 -375
8051 -375 -149 -178 -57 -83 -247 108 -120 -18 -153 -217 121 87 -253 -10 -117 170 -36 -242 176 -113 -33 -78
8073 -78 122 142 -23 32 -10 -1 188 -267 -38 11 229 13 189 34 -122 51 15 221 63 -60 60 149 95
8096 95 56 13 50 139 98 5 279 -104 34 -170 48 134 2 -31 127 0 227 65 487 45 166 91 28 -171
8120 -171 -21 24 -47 -72 46 195 -129 89 108 -8 109 9 262 196 158 -97 -104 -52 -44 170 26 -62 -211 96
8144I6k15j0K76k12j05R2K18k17j73K34K15k15%m3J09q0l0j05R9O2k13K08L45
8167C36l23K9p8KKj36L59k92K02k43L97j96j31M2j5L65l63j07J51k75J49K9M33
8190C37k43
$$ plain form
8144 96 -119 -129 147 -65 -170 -78 140 -77 -250 -16 199 -16 -16 -59 50 -30 -60 -165 -66 -4 -217 -9 336
8167 336 13 42 -36 -34 -32 -168 191 -101 101 -142 255 59 -72 -30 -45 320 -43 -150 1 -274 -125 -96 337
8190 337 94
8191I4
$$ Imaginary data points
##PAGE= N=2
##DATA TABLE= (X++(I..I)), XYDATA
0@%%%%%%%%qJ6j6J7k5L2m0N6p2R1j15J42j72K06k46K92l45M06m73N51o39P37q49
31d54R73j111J263j430J615j822K049k296K569k867L192l548L938m364M829n336
47b800N890o496P157p882Q679r559J0534j1614J2819j4176J5714j7467J9490k1862
61a1573K4679k8088L2318l7721M4896n4953P0231r7244K22361p09514O58953J35029
73B49374p38384R46964o20397J0324M96364n80817K89069P346k57158M06625l10175
84a00865O3372J91744k39236P2266K6922q5657J07225J7083j05060M4253R7553
95H9600j80691Q2041L1941q9829J75799j64303J8662J50177k42469J86611n6580
106I59j11742K77678k66646Q4631J47504l15171K95001j05621j90708M06842k71789
$$ plain form
0 0 0 0 0 0 0 0 0 0 -8 8 -8 9 -16 16 -24 32 -40 51 -64 78 -94 112 -134 158 -187 219 -254 297 -342 395 -454
31 -454 519 -592 671 -759 856 -966 1083 -1213 1356 -1511 1681 -1867 2071 -2293 2536 -2800
47 -2800 3090 -3406 3751 -4131 4548 -5011 5523 -6091 6728 -7448 8266 -9201 10289 -11573
61 -11573 13106 -14982 17336 -20385 24511 -30442 39789 -57455 164906 -544608 114345 249374
73 249374 -489010 457954 -162443 -152119 344245 -236572 52497 59843 -197315 209310 -100865
84 -100865 -37493 154251 -84985 -12719 14203 -71454 35771 52854 -52206 -7953 89600
95 89600 -91091 -9050 22891 -66938 108861 -55442 -36780 113397 -129072 57539 959
106 959 -110783 166895 -99751 -15120 132384 -182787 112214 6593 -184115 222727 -49062
117d9062n6867K65945k79193J28474P0686k10915K15535m4828j10385J39632j17674
128d8652L8492P7617j59778J28705L6716j52046J36815n6014q4108J78909j26069
139b9413k3426J54428j36152L1637J8654p3777J32381j02018o636J21068j47541
150f0795R1473k770j30851J90405q9706o0383J49641j38347N5589M6726j44148
161i3166J31464p532q0738R0726n9183J0714M2387q9523N4290L6075o1429L7062
173A1147j6048j6908O1296o9113n203Q2151p2965K7480K7786q5605Q7775j8656
185A3137p2325R5073l7687p41K1979o7397Q3726k8488n5421Q9243o2781K5215
197C533M3617j11234Q2337J7365q7212Q0048k8019j3573O0601q2772K5375M0694
$$ plain form
117 -49062 -105929 160016 -119177 9297 79983 -130932 84603 39775 -70610 69022 -48652
128 -48652 -10160 67457 -92321 36384 73100 -78946 57869 1855 -82253 96656 -29413
139 -29413 -52839 101589 -34563 -2926 15728 -58049 74332 -27686 -34322 86746 -60795
150 -60795 30678 27908 -102943 87462 -2244 -62627 87014 -51333 4256 50982 -93166
161 -93166 38298 30766 -49972 40754 -18429 -7715 34672 -54851 -561 35514 -25915 11147
173 11147 -4901 -21809 39487 -29626 -34829 47322 -25643 1837 29623 -55982 31793 13137
185 13137 -59188 35885 -1802 -2543 19436 -47961 35765 7277 -48144 41099 -21682 3533
197 3533 47150 -64084 18253 35618 -51594 28454 435 -13138 47463 -35309 -9934 30760
209C0760n5023M4804k5025r546O3751p7541P684N6855n8306L4970k884m1138P3460
222D2821m0687l9992O3845l5421J1754K3126n8329N1749j102n2153N0285k5343
234i447J1944K8042p4083N7466J0650o3154N8695l4851L638N5375q1479L2198
246e006L0416n1991L9005k6409J312M8472n7765J3457J9953l0270L5244k5570
258i152j4751N7997l8027k1981M3086k7191R931J5214m8751M7277J3088n6598
270b9858M0043j5446m407M1423o3137L5778K6611o1964N0519k9340p263O5364
282D8323q0425K5198M4056o4611M5866k1224k1202O6906n7297J204L8252m1892
294a6846L5790k0107k9039O7902m0224j5122M2705m4808K8956J0425n8885N9888
$$ plain form
209 30760 -24263 20541 -4484 -14030 49721 -27820 -20136 36719 -21587 13383 10499 -30639 42821
222 42821 2134 -37858 25987 -9434 2320 25446 -32883 18866 17764 -34389 15896 -9447
234 -9447 2497 30539 -43544 13922 24572 -38582 20113 -14738 -11100 44275 -37204 -5006
246 -5006 25410 -26581 12424 -13985 -12673 35799 -21966 -8509 11444 -18826 16418 -9152
258 -9152 -23903 34094 -3933 -25914 17172 -10019 -88 15126 -33625 13652 26740 -29858
270 -29858 10185 -5261 -9668 31755 -31382 4396 31007 -30957 19562 -9778 -17041 48323
282 48323 -32102 -6904 37152 -27459 18407 -2817 -24019 42887 -14410 -13206 25046 -16846
294 -16846 18944 -1163 -30202 37700 -2524 -17646 25059 -19749 9207 19632 -39253 20635
306B0635L61n0116M5224k2106k203L7174n7522K2404L3804m7416K7468r815j6860
319a8968N0133m9943j23M9362m9741K4208O54l9147O5988l4470k9576N8226m0749
332a4146J4937J3476n0709N7935j0960m0544M9459k9668Q390K5599n9570M2237
344F436J8553n3996M2705j3281j6836N0375n6305N258N3437n5608K2685O595l4618
357b4600N7726l9120j9223N7165m7000K0681R584m7833O5285k8136l6932O2187
369B9784l8869R382K2513n5589M8173L865m4768L9580j6787p04K6448m7220K4142
382e0K3463m3441K6525m201j7006M2016m0471o971M8468m1611R453J4882l3576
395b2520M2982j7595l1690M8226k2815k510J5556l2252L6140l578l5145L6105
$$ plain form
306 20635 20996 -29120 16104 -6002 -8205 28969 -28553 -6149 27655 -19761 7707 -2108 -18968
319 -18968 31165 -18778 -18901 30461 -19280 4928 5582 -33565 32423 -2047 -31623 26603 -14146
332 -14146 791 14267 -36442 21493 10533 -30011 19448 -10220 -1830 23769 -35801 6436
344 6436 24989 -29007 13698 417 -16419 33956 -22349 -17091 36346 -19262 3423 10018 -24600
357 -24600 33126 -5994 -25217 31948 -15052 5629 15213 -32620 32665 4529 -32403 29784
369 29784 -9085 297 22810 -32779 15394 19259 -25509 14071 -2716 -3420 23028 -24192 -50
382 -50 23413 -20028 6497 2296 -14710 27306 -13165 -20136 28332 -13279 -3826 11056 -22520
395 -22520 20462 2867 -28823 19403 -3412 -5922 9634 -22618 13522 9944 -25201 10904
407A0904j3346k851K0278l9068K6802J8546m5275K7404Q75j6657L2508l4236J415
420a2701L7922l9062J1781Q779k1460L6579k7524j4514M5497l2558K807J6271
432A1817l1490L7859q048l6247M3466j4374r632K1433l2672K5889J0405l9825
444b1419L0344m247r934K2542l5699J9381K2501m1352K1791O93j3750K9106l2054
457a2097L51L4524l0826L619J1445j8430K5525j2227k2544L5020j3027j0146J8112
470I299k4693K3023N886m1241L7081j707k2399K8752l0408J3703K4784m5551K4937
483A466M268j7484K7624l2068J0554K6367l7945J8122M44j1120K8665l0582K00
496a1489K9078k4112M367L045r315K2579j4160j5580K6841p724r625J2458j5236
$$ plain form
407 10904 -2442 -5293 14985 -24083 2719 21265 -24010 3394 4269 -12388 20120 -14116 -12701
420 -12701 25221 -13841 -2060 6719 -14741 21838 -5686 -20200 25297 -7261 -4454 11817
432 11817 -19673 18186 10138 -26109 17357 2983 -6649 14784 -17888 8001 18406 -21419
444 -21419 8925 4678 -5256 17286 -18413 968 23469 -17883 3908 4601 -9149 19957 -12097
457 -12097 -11746 22778 -8048 -4429 7016 -11414 14111 1884 -20660 14360 1333 -8813 9299
470 9299 -15394 7629 13515 -27726 9355 7648 -14751 14001 -16407 -2704 22080 -23471 1466
483 1466 5734 -11750 15874 -16194 -5640 20727 -17218 904 1348 -9772 18893 -11689 -11489
496 -11489 17589 -6523 -2156 889 -8426 14153 -7 -15587 11254 3530 -6095 6363 -8873
509h873J4020R762l1332J9654O091j6908J9101k1329P332K5202l8350J4123J2825
522A1318k0282K3075k1130k958L1941k9571L579J0473j4201K2263j8707q350K9418
535A6868k0418R2Q902j7824K3043m729k3822K5604l038j0396R317j4550J5266
548D315O844k7909J9007L832j4239J6328j9896N757K4392l1052Q738J0297j6161
561i747K0463j8496m647L0264k4707K442Q059j3481K2415j6225j1348K9303j4768
574d73l354P100j2728J8548m472j8573K0717k080p541Q434j3980Q705J3171k2586
588i112O829J0757j0265P346j1075J077K0234k1332M77J4849j3769J1844q308
601d48j3511K9730j3539j1277J7526j4386J2122Qk2975K6523n213j1313J5699
$$ plain form
509 -8873 5147 14909 -16423 3231 9322 -7586 11515 -9814 -2482 22720 -15630 -1507 11318
522 11318 -8964 14111 -7019 -9977 21964 -7607 -4028 6445 -7756 14507 -4200 -12550 16868
535 16868 -3550 -3458 5444 -12380 10663 5934 -17888 7716 4678 -5718 3599 -10951 4315
548 4315 11159 -16750 2257 6089 -8150 8178 -11718 -5961 18431 -12621 -3883 6414 -9747
561 -9747 10716 -7780 -12427 17837 -6870 -4428 3631 -9850 12565 -3660 -15008 14295 -473
574 -473 -3827 3273 -9455 9093 4621 -13952 6765 4685 -2856 5578 -8402 303 13474 -9112
588 -9112 -2283 8474 -1791 5555 -5520 -4443 15791 -5541 -5064 9785 -3984 7860 -448
601 -448 -13959 15771 2232 -9045 8481 -5905 6217 6225 -16750 9773 4560 -6753 8946
614H946k0811J7083O722l3657K8275Q17j6344J8485k0896J0381J4789k8765J4657
627c18L508p433J3139j8918N010J4791j6186K997L348j339Q306j0741n718J5547
641E993l314j0654Q809j615K942M192k0116J4973Q190j8771J4332q977L294J5128
655A4406k9852J5465Q201j7051K0768k0126M235K3464l2373J0660R499j3049J6178
668A0425j5195l50J8811j7725P02M933l194J0111q606p230J5374m407r392P716
682A973m264N904N646j9916J1103Q942j6815R407n132J545J4831k3512P952J0519
696H183j6359J3541j0221j011K1758k4454K478J2570j4603J4926r083r390K4265
709A2600j2688p877J0144p613R313k669j1343J6506k783r983O693n137O565N121
$$ plain form
614 8946 -11865 5218 11940 -21717 6558 7375 -8969 9516 -11380 -999 13790 -14975 -318
627 -318 3190 -4243 8896 -10022 -5012 9779 -6407 -3410 -62 -1401 6905 -3836 -9554 5993
641 5993 2679 -7975 834 -781 2161 6353 -13763 1210 9400 -9371 4961 -4016 -722 14406
655 14406 -15446 19 8220 -8831 11937 -8189 -3954 19510 -12863 -2203 7296 -5753 10425
668 10425 -4770 -5120 13691 -4034 -3332 1601 -1593 8518 -88 -7318 8056 3649 -5743 1973
682 1973 -2291 3613 9259 -10657 446 9388 -7427 1980 -3152 -1607 13224 -10288 -2336 8183
696 8183 -8176 5365 -4856 -5867 15891 -8563 -6085 6485 -8118 6808 -2275 -11665 12600
709 12600 -88 -7965 2179 -5434 3879 1210 -10133 6373 3590 -6393 300 -4837 1728 6849
723F849j7209J0621Q018j3636N923m106l0J5435j7213l49J4406j1836N676m904
737b355m680K0604j5464m067J4314j2779R348l968j1869K3352r123r830J2082
750E565r297P779K78j4130J4542K402r563K968l617N071L585j2172N589Q066q706
765a640K168k383k391J2947j1296n308J6120r069m2J875j0533J7071n211j2461
779a0153J5491p010J910K365j5298J8581j017j4947J4796p751K329P319j9742
792a3127J3840P088j4782R431n734J967J0000j7888O774Q906r080O022p393R22
806c054J2521j4701Q21R381o275N185m774m712J3102n931p374Q207j186K084p69
821B525r194R729L027j0619N391n36J567M579j3548O265Q528j1393M622r59j171
$$ plain form
723 6849 -10360 261 8279 -5357 566 -3540 -3570 11865 -5348 -5697 8709 -3127 2549 -2355
737 -2355 -7035 13569 -1895 -5962 8352 -4427 4921 953 -10916 12436 3313 -6517 5565
750 5565 -3732 4047 4325 -9805 4737 7139 -2424 544 -3073 1998 5583 -6589 -1000 7066 -1640
765 -1640 528 -1855 -4246 8701 -2595 -7903 8217 -852 -894 981 -9552 7519 2308 -10153
779 -10153 5338 -1672 238 2603 -12695 5886 4869 -10078 4718 -3033 -704 6615 -13127
792 -13127 713 7801 -6981 2450 -3284 -1317 8683 -9205 -2431 6475 -2605 3417 -3976 -3054
806 -3054 9467 -5234 -4413 4968 -1307 3878 -896 -5608 7494 1563 -5811 2396 1210 3294 2525
821 2525 -6669 3060 6087 -4532 859 323 1890 6469 -7079 -814 7714 -3679 943 -16 -1187
836a187R708j2601j276J1556o635R5l71k177R992p637n985R603l265J260k09q206
852g335J2488j318j3274J1503j682k145O604j3001Q345O999j4530P552j455K3
866a226Q334j5489O345Q819j1714O030l547J01J0496j3055O80R095o329L050l894
881b304j071J0646p357n030P303r36N63j864m444Q711l88p783M466m7J360J724
897C549r617P460O863j2501L587K123k150O920r125o81J0516p167n09Q5k045J0211
913G519r378l316J1467p642J450O58o829J2388m294q477Q551j878Q63j296o570
928f784J0288k24p655M275j396K131J876q762N352O023q275J208J125l41O006
943D847q913j277J1468p225j024K322l936R067n071p056J0491l407L70p74n138
$$ plain form
836 -1187 8521 -4080 -5356 6200 -435 -340 -711 -2888 7104 -533 -6518 3085 -180 1080 871 -7335
852 -7335 5153 3835 -9439 2064 382 -1763 4841 -8160 185 7184 -7346 206 -1249 -1226
866 -1226 7108 -8381 -2036 6783 -4931 1099 -2448 -2347 8149 -4906 -4226 4869 -1460 1590 -2304
881 -2304 -3375 7271 -86 -5116 2187 1251 1814 -50 -4494 4217 3829 -3954 512 465 1825 3549
897 3549 -6068 1392 8255 -4246 -659 1464 -686 6234 -2891 -3572 6944 -223 -732 -647 -2692 7519
913 7519 -1859 -5175 6292 -1350 100 758 -6071 6317 2023 -6454 2097 219 1082 -214 -6784
928 -6784 3504 3280 -4375 -100 -1496 635 2511 -6251 -899 5124 -3151 -1943 -818 -1159 4847
943 4847 -4066 -5343 6125 -1100 -2124 198 -3738 5329 258 -6798 3693 286 656 -118 -5256
958e256J1383m437p833R248l010Q95J791q561P709L978q915K085J913J178Q25
973B993p190M157M823o031J744r91jO654q833j670J0111n250j296J261k854P360
989D987m428o012P747q53j279L56m945P393O39q840N090J453j445K104p359N200
1005a92N687j0595L865J662k246O282r030N37R483p495K92N46o11O875q272r31
1021d143P803m635Q21o39l751R312l311q173Q650K45k946J612m493N183L008q518
1037c975M114J232o96K454p825N076N747r141K671J412j231M598p232M72P554
1052E230m701j536R71j78M411l790m541O749O0l527J075k550N253L09q882O510
1068H63J667m056L794o305M257N906j1407L961L179k790L460o702K386O301p227
$$ plain form
958 -5256 6127 1690 -6143 3105 95 990 2781 -5780 1929 5907 -3008 -923 990 2168 2993
973 2993 -4197 -40 4783 -1248 496 -495 -496 6158 -2675 -4345 5766 516 -780 481 -2373 4987
989 4987 559 -5453 2294 1441 162 518 -4427 2966 3605 -5235 -145 1308 -137 1967 -5392 -192
1005 -192 5495 -5100 -1235 427 -1819 4463 -4567 -4030 5453 -2042 -1750 -1204 -1815 5060 -3212 -4143
1021 -4143 3660 -975 -154 -793 -4544 4768 1457 -6716 1934 2179 -767 845 -3648 1535 4543 -3975
1037 -3975 139 1371 675 3129 -4696 380 6127 -3014 -343 1069 -162 4436 -2796 -2324 5230
1052 5230 529 -1007 -36 -214 4197 407 -4134 2615 2675 -852 223 -2327 2926 3235 -5647 863
1068 863 2530 -1526 2268 -4037 220 6126 -5281 -1320 1859 -931 2529 -4173 -1787 4514 -2713
1083b713J360P31n27N252p168j057Q148m497k072K201j890N123j944o629P007
1098A325Q40m151J712k783N239R85q433N776P98j859K851o771N110M561r135L383
1114e52J633j215L631o595J782O381n406q67Q30J150K642m433j475N619j184k816
1130h75O20m96L955j027o513N260K913n212J880j783J794L994p909J765M629m033
1146a038J961l692J177P186q744R72L874l430M795n517j265Q981o243j457K420
1161b0j381M476m549k532O172j541j505n30r15M954k050m801M525J376k542L66
1177d97j823K736L217o243N23M611k346L19k596P15N804n506n53K680r57K886
1193B970m436j333P281l898j797J862j351L840k732l626N285O92k965k56l64K999
$$ plain form
1083 -2713 -1353 -622 -1149 4103 -3065 -4122 4026 -471 -2543 -342 -2232 2891 947 -5682 1325
1098 1325 2165 -1986 -274 -3057 2182 3167 -5266 510 1308 -551 2300 -4471 639 5200 -3935 -552
1114 -552 1081 -134 3497 -3098 -1316 5065 -341 -1208 -378 772 3414 -1019 -2494 3125 1941 -875
1130 -875 -255 -751 3204 2177 -4336 924 3837 -1375 505 -1278 516 4510 -3399 -1634 2995 -1038
1146 -1038 923 -2769 -1592 5594 -3150 -2178 1696 -1734 3061 -2456 -3721 5260 -983 -2440 -20
1161 -20 -1401 3075 -1474 -4006 2166 625 -880 -1410 -2325 2629 579 -4222 303 1679 -863 -497
1177 -497 -2320 416 3633 -2610 -2087 2524 178 497 -2099 -1384 4420 -1086 -1639 1041 84 2970
1193 2970 -1466 -2799 4482 584 -1213 649 -702 3138 406 -3220 2065 2757 -208 -464 -828 2171
1209B171j66n106K993K692k007j60k278J932L823o237N18M150k288J183k801p84
1225b365O061m247k471L806n44J346k929k500O478j849l259K368j385L409j363
1240E56n503N762Q92l376J694k184L026J350o376L150K756j920O58l356K945L178
1256C252n991J315K229m24J101l509K08N111k927k555K409N80J192j814k545M593
1272B225Pl742J270M21K164m13n108M321J719l401J000j267K043K569o387J862
1288g17L069k491R26k282R68M225m827j241L230p09J221l031l72N422l503k392
1304b504K561q90K629j839l868N501j12l619J265n11K617m56m119L185J710k258
1320g08l16j589L168K092n317J112K892j329L3k086J041M051l603j674K873j78
$$ plain form
1209 2171 2005 -3101 -108 2584 577 417 -1861 71 3894 -2343 -1825 2325 37 1220 -1581 -2365
1225 -2365 3696 -551 -3022 784 240 1586 -1343 -3843 2635 786 -2473 -105 -1490 1919 556
1240 556 -4947 815 1707 -1669 25 -2159 867 2217 -4159 -1009 1747 -173 485 -2871 74 3252
1256 3252 -2739 -1424 805 381 1482 -2027 -1819 3292 365 -2190 219 799 1991 177 -2368 2225
1272 2225 2232 -1510 -240 181 2345 1932 -3176 1145 2864 -537 463 -804 1239 3808 -2579 -717
1288 -717 2352 -139 787 -1495 -527 3698 -1129 -2370 860 151 1372 -1659 -2031 3391 -112 -2504
1304 -2504 57 -833 1796 -43 -3911 1590 1478 -2141 -876 -1387 1230 774 -3345 -160 1550 -708
1320 -708 -1024 -2613 555 2647 -2670 -1558 1334 5 38 -2048 -1007 3044 -559 -2233 640 462
1336D62N03j945j110M739j142l023J279K71K006j851k670M234N92k966O00m24
1352d45J798P38m335J887L180k370j003k31J330K246m037k94L286j136K51k310
1368a445j40N045l513k541L879j056O50j324k393M806o04l249J692l27J952q04
1384F28m145M283R87l091J202j730K657J121n435K620K303j829M08k250K023K502
1400B254l964o2K035N76o17k307J645K025j318j472Q13J419J68j571j796L202
1416A030J600m423J215J739q98J567l489J181L519l626J66J27Q51K764n640J224
1432a093M048l584J703j695l02M560m668o43K866o75Q86k727J4L858k481j420
1448a353Q91N20J214j954j384L010O02k870j65J045R74N89l569J039L803l220
$$ plain form
1336 462 965 -980 -2090 2649 1507 -1516 -237 34 2040 189 -2481 1753 2345 -621 -21 -445
1352 -445 1353 2091 -2244 -357 2823 453 -550 -781 549 2795 -1242 -1536 1750 614 865 -1445
1368 -1445 -1585 3460 -53 -2594 1285 229 879 -445 -2838 1968 1364 -1885 -193 -520 1432 628
1384 628 -3517 766 1753 -1338 -136 -1866 791 1912 -3523 -903 1400 -429 -21 -2271 -248 2254
1400 2254 -1710 -1772 263 839 222 -2085 -440 1585 267 -1205 -392 1027 1195 -376 -2172 1030
1416 1030 2630 -1793 -578 1161 263 1830 -1659 -478 3041 -585 -419 -292 559 3323 -2317 -1093
1432 -1093 2955 -629 1074 -621 -923 3637 -1031 -1674 1192 517 1403 -1324 -1310 2548 67 -1353
1448 -1353 -462 58 1272 -682 -2066 944 1546 -1324 -1489 -444 530 1119 -2450 -1411 2392 -828
1464h28l10O74p8K459l615m06L654j831K8j444N89M142m086j323L174p28R59j651
1482f21j334L696j063j985M99J399J401k728p40K594K40j493o72R41J105J7k422
1499a166L35L458j813j733J132P2J792j958k258L970j122p64n3j096M068k325
1515E39k836L408m19J78r15k299M177n05l380K107k05J106m50k941K571J332k308
1532h40n42L36J916K6l208J434K261j618n99l23N55K187k522j562L150J1j150
1549d88n16j26K844j226k626K258L10j23n16j815L117Q27l561J153O61O87J73
1566A033k981K189J980k621p4K3J358Q09k752M26K236p65j064o96J126J782k149
1583a40j248J860J091j473m39l33J907J22l288J871J400r14J39k190K005J615
$$ plain form
1464 -828 -1138 -464 -542 1917 -1698 -2104 1550 -281 -253 -1697 -1108 3034 -1052 -2375 799 71 1030 -621
1482 -621 -1955 1741 678 -1307 -808 591 1992 -736 -1476 1118 1358 -135 -807 134 1239 1256 -1166
1499 -1166 -831 2627 814 -919 213 285 2077 119 -2139 1831 709 -55 -108 -1204 2864 539
1515 539 -2297 1111 692 870 -45 -2344 1833 1328 -2052 55 -150 956 506 -2435 136 1468 -840
1532 -840 -1382 -1046 870 896 -2312 -878 1383 -235 -834 -1157 -602 1585 -937 -2499 651 662 -488
1549 -488 -1004 -1130 1714 488 -2138 120 430 307 -209 -2024 1093 1920 -1641 -488 173 860 1033
1566 1033 -1948 241 2221 -400 -474 -451 907 1716 -1036 -610 1626 861 -203 -899 227 2009 -140
1583 -140 -1388 472 1563 90 -349 -682 1225 1347 -1941 -70 1330 416 555 -1635 370 1985
1599A985l446J041N19o4J056l054J693K361k875J6J25O73J348l005J19K376n86
1616B82p74r40J055J661j617j260J391P77n52j154p0K001m8k629J031J217k23
1633A48J61j881J690K082l079q6J285M12M17k586N69K879j964p94N51L09J764
1650A877k358q78K532j82j098m28k5K539j254k095J813N14l27p49j018K511j1
1667A363k635J000P74L99l69k074J985J223j850p72Q17N51L39k185L53J939l98
1684D60j456P4J041P63j449j686K954J14j335m7m99J854r7k821J793J138r57m85
1702f41j071J869J191k619O30J060l0o3k087J457J900k168Q4K51Q93M56k044j16
1720a048K245j61j246l11M86J635j395j419J926N20j121m14R5J285J55k399J071
$$ plain form
1599 1985 -1461 -420 99 35 1091 -1963 -270 2091 -784 -768 -643 30 1378 -1627 -1508 868 282
1616 282 -492 -1432 -377 1284 -333 -1593 -202 575 23 -1131 -1201 800 752 -1877 -846 371 148
1633 148 309 -1572 118 2200 -879 -965 320 732 1149 -1437 -868 2011 47 -747 -196 113 1877
1650 1877 -481 -1359 1173 991 -107 -535 -560 1979 725 -1370 443 957 630 -119 -1137 1374 1363
1667 1363 -1272 -272 502 901 532 -1542 443 1666 -184 -956 -139 412 751 -1434 -1081 858 460
1684 460 -996 -922 119 882 -567 -2253 701 815 -520 -567 -1066 788 691 -2130 -337 801 -156 -641
1702 -641 -1712 157 1348 -1271 -641 419 389 326 -1761 -304 1596 -572 -488 -237 656 1112 -932 -1048
1720 -1048 1197 1036 -210 -521 -35 1600 205 -1214 712 1232 111 -303 -208 1077 1232 -1167 -96
1737i6J459j055k34j285J483J651k697R5J113K01M7j886N31K147j540o76J77Q96
1755C31P65j998j91J862n37o96p71Q75J522j449j355J404R96q16r98P3J555K23
1773G95j983M61J517n37m45j024R86J653k076n38J413J51M8j307O5K388j328r64
1791g25O03M02J028j448j077K156%j453n0K99J543n94j844J384Q02n05n91o20
1809f90J762K48k204N32R99K70o66j162J186J317j453r06Q51M67R6j280m69K339
1827A237m90j676K12O48R14q46j454J841K90j616N94n52J489K43k678J385J078
1844F19o79l99q49J538O97j820K03Q30K74l04j328Q32J419j148q41Q80Q99j48
1862F75j510O3J592j71j106j48P85R64r31j281J050J181j034p48L39J159J52k149
$$ plain form
1737 -96 1363 308 74 -1211 272 1923 -774 -679 434 635 682 -1204 -673 1474 -66 -742 -565 331
1755 331 1096 -902 -1093 769 232 -464 -1235 -360 1162 -287 -1642 -238 758 -58 -1056 -983 572 795
1773 795 -1188 -727 790 253 -192 -1216 -230 1423 -653 -1191 222 373 421 -886 -821 1567 239 -725
1791 -725 -122 280 1308 -140 -1217 939 939 -514 -564 -265 1278 684 -1160 224 1026 521 -70 -690
1809 -690 1072 1320 -884 -352 647 917 251 -911 275 1592 139 -767 84 551 647 -633 -1102 1237
1827 1237 747 -929 -717 -69 845 -1 -1455 386 676 -940 -346 -898 591 834 -1844 -459 619
1844 619 -60 -459 -1308 230 927 -893 -690 140 414 110 -1218 -386 1033 -115 -956 -76 823 675
1862 675 -835 -772 820 649 -457 -605 180 1144 213 -1068 -18 1163 129 -619 -280 879 1031 -1118
1880a118O37J361o25j47n98M96J935k093l65J317j79j0j282J49J864j439o45Q21
1898G9J98P77j564p59K274m82r09k47N52J209j179j248J194L67l56p33j1J493
1916F55l82j408J38J295m4m83m33J86J520j451j069K000l64P9p78m41K001n98
1934D23j261N74L31P61j110j099K103k30r54K1Q3J329p22j115J189R70r19n28
1952a54m25J093O50j715M18Q22K0k61j223Q55J404j747l97Q96L10K4r66l45J644
1971I03p2j355k5Q86L09p00j110J760K18j146m0l2R41qj891J128J040q51m94o13
1991a152J490N01j542j01O00Q03o15r80J003O85n58j050N37Q74j61q88j34R68
2009B80N31j853M25R72j91K86j585R48J279j423LL21P52M76k451J048J364j177
$$ plain form
1880 -1118 -481 880 255 108 -490 6 1941 -152 -517 800 621 611 -671 -522 1342 -97 -742 79
1898 79 277 1054 -510 -1269 1005 523 -386 -633 -81 1128 -51 -1299 -105 262 -94 -827 -838 655
1916 655 273 -1135 -997 298 254 -229 -662 -476 1044 -407 -1476 524 160 239 -539 -980 1021 423
1934 423 -838 -264 67 828 -282 -1381 722 492 -462 -441 -358 971 249 -866 323 1293 374 -154
1952 -154 -579 514 1164 -551 -133 689 709 448 -775 80 1484 -263 -660 236 546 570 -396 -741 903
1971 903 831 -524 -549 337 646 -54 -1164 596 814 -332 -372 -404 537 529 -1362 -234 806 -45 -539 -1152
1991 -1152 338 839 -703 -804 -204 599 -16 -996 7 692 134 -916 -379 495 334 -554 -688 280
2009 280 811 -1042 -617 355 164 450 -1135 -187 1092 -331 -328 -7 745 1221 -1230 -182 1182 5
2027EK52p00N81J262k016K56J069J78k88j307N46J648j500l32PP74M54j428j49
2046f88J387J04j008k61O24L67l53r54L93J248q35q56P39N88J05j409K07J240
2064F38m64k90p83N33J256j637l52J367Jm14l68k57J293l91r51J22R59M89j289
2083e38k22J145N9r91lM02O31j70j295P53J247q04p04M04M51N13j096n43J398
2102F37k33l29m64L86J186j169p82J195k23M23p70n43J819o53q24K8N76P83j412
2121c69k79R98K20l85o75l8J372o46j042O80P27o03n93J40O83O08j205k93O62
2140c8M35n35o90M29P66n24o42N69P53m46m63m15J291K7j482N02N85k4J19j071
2160h54R13Q46j185k14J47R68k38j221O82J127q09j56l54N80P41j418j08R27M06
$$ plain form
2027 5 257 -443 138 1400 -616 -360 709 887 599 -708 -162 1486 -14 -346 -339 435 889 -539 -688
2046 -688 699 803 -205 -466 158 525 172 -782 -389 859 24 -832 -93 495 600 -809 -602 638
2064 638 174 -116 -899 -366 890 -747 -1099 268 269 -145 -513 -770 523 132 -819 -697 262 751 -538
2083 -538 -760 385 444 -547 -550 -148 483 313 -982 -229 1018 214 -490 -86 365 878 -218 -761 637
2102 637 404 75 -389 -3 1183 14 -768 427 204 627 -143 -686 1133 480 -344 -316 260 1043 -369
2121 -369 -648 350 570 185 -490 -528 844 198 -844 -164 563 -40 -633 -493 190 798 -407 -700 -38
2140 -38 397 -138 -828 -399 367 -157 -799 -230 523 77 -386 -801 490 517 -965 -463 122 98 217 -854
2160 -854 59 905 -280 -494 -347 621 383 -838 -156 971 162 6 -348 232 973 -445 -553 374 780
2179G80p23l99L12Q01l46j106O50O39q3o93k17R53L15j377K52L42M85k30j311
2198i56Q19J210j103k10J39M38K63r43rP94P8r35m32P04Q13j057j60Q21q4q1o40
2219e31l7J038Nj347M43N84O1p24j88Q41K55q22j21M85P53n73j038Q48P21q64
2239b11m21M21L12O30j043l70J067J4p55j60M48J056q30o33Q40Q3o3n32k23J441
2259A071o49j232Q03M92J4l16q52J061O78j144l82M08Q18l89j119O53P41n25j18
2278A3n78R16L42j202Q5P64j85n61l3L63P79q11o22N78Q69o53p30K00J053l21
2298B66r01M6O15J80k27q78P41P37j103l09N66M65J62r17j28J217l56p94R1O30
2318A03N57j086L2O49n9k65l41J00J092l70j196P49O23Q0m15n51P86J99o34k30
$$ plain form
2179 780 57 -342 -30 771 425 -681 -31 608 525 -168 -385 568 883 -494 -242 100 585 355 -956
2198 -956 -137 1073 -30 -240 -101 337 600 -343 -352 442 520 -415 -847 -143 670 -387 -547 274 190 109 -531
2219 -531 -568 470 475 -872 -429 155 216 -508 -696 145 400 -422 -543 -58 695 122 -916 -68 653 -211
2239 -211 -632 -211 101 731 -312 -682 385 399 -356 -516 -68 988 158 -475 365 448 385 -147 -370 1071
2259 1071 422 -810 -7 485 499 183 -669 392 1070 -74 -456 -48 770 381 -738 -85 656 131 13
2278 13 -565 351 693 -509 -424 340 155 -406 -439 -76 703 -108 -730 -152 717 64 -666 -466 587 266
2298 266 -635 -589 26 206 -21 -899 -158 579 -524 -833 -267 198 360 -557 -685 532 176 -618 -527 103
2318 103 660 -426 -394 255 196 -69 -410 -310 782 412 -784 -35 588 668 253 -298 488 687 53 -177
2338a77N91j19j68o33O76O69j011l7J22N85K5j045J88R96k04q57j66O59O63j132
2358c75m39J058L09l79p94K60R23o42q35N74M11K72j125J14N06Q11j077m37J119
2377B54O9o36l47L07R98m26o06l8O08L88j260M6R86k2r97M15J68O06l45p87O83
2398F4O18n37l28N2R49m99m68L84P9L57n22p11J027J09o52j66N06M31n5q87J81
2419f8N26j59q78K68Q06k15l73j95O11K7m73m22L54Q09n40o66P36L27n79m36J1
2440e29J063j65q58J5N47J93l64o57O96O52r21l08K56O22o3p33K97N84J74r74
2460d73N3O13n7n89m3O49N26r07k36K52P03m76p68Q09L86j87m54k76Q01N64j052
2481a62r1O89q1l05m82O96M19n83m35K89M95K37j182K57R49l67m99o1M82L46l99
$$ plain form
2338 -177 414 295 127 -506 170 839 -172 -209 -87 498 523 -522 -334 662 458 -399 -565 94 757 -375
2358 -375 -814 244 553 174 -620 -360 563 -79 -914 -340 71 343 -782 -668 -162 649 -428 -865 254
2377 254 323 -313 -660 -353 645 219 -387 -425 183 571 -689 -643 343 321 -676 -261 -93 513 168 -619 64
2398 64 682 145 -183 -131 818 319 -149 235 314 671 149 -562 465 574 -78 -244 262 693 638 -249 -68
2419 -68 458 299 -579 -311 495 280 -93 -288 323 350 -123 -545 -191 618 78 -588 148 475 -104 -540 -529
2440 -529 534 369 -489 -474 73 266 -98 -755 -59 593 -328 -636 -380 242 179 -554 -257 327 501 -473
2460 -473 -420 193 136 -453 -496 153 679 -228 -464 -212 491 15 -753 56 442 255 -199 -475 326 890 -162
2481 -162 -253 436 355 50 -432 264 683 100 -335 -46 449 686 -496 -239 710 343 -156 -217 265 611 212
2502B12n96L33P27l30q61L16P89m64p00J62Q93k94m10l44P13M99j233j04Q23J00
2522B31m16r7L3O72n59m97L42N95r2o03k37R46k4n35k1J39P11o82o27Q63L89m29
2544A02n52J66P94p1p11o5O86J31l39l42K70P37j074O5M78R0J79q74M36N71j75
2565E02q93K57O65K6n99l51R10O6o89j05K96O46p57l82M80L51l25k45l71Q08p1
2586B19p13K15M63P6o07k40M31K63k88l71M24M39qq04K23M85j15m77J25J85M22
2607C47n21o00Q88L14q00j1PQ62o18l77M99L39n1p01PO47K45r83J42P97O3n28
$$ plain form
2502 212 -384 -51 676 346 -515 -199 590 126 -574 -412 481 187 -223 -567 146 645 -588 -692 131 231
2522 231 -185 -282 -249 423 -136 -633 -291 304 212 -391 -628 318 294 -241 -262 -123 588 -94 -721 142 531 102
2544 102 -450 -284 510 439 -272 -337 349 480 141 -201 69 806 -268 -203 275 365 544 -330 106 677 502
2565 502 -391 -134 531 557 -42 -393 517 583 -106 -211 85 731 -26 -408 72 423 98 -147 -518 290 219
2586 219 -494 -279 184 260 -347 -587 -156 107 -181 -552 -128 311 303 -501 -278 207 92 -385 -260 -75 347
2607 347 -174 -774 114 428 -372 -383 -376 486 -132 -509 -10 329 278 -423 -416 231 476 -507 -365 432 495 -33
$$ [...]
8191C9
##END NTUPLES=NMR FID
##END=
