##TITLE=1H_Chycory2-MeOHpart
 CDCl3, 8 sc, 
 27.04.2021
##JCAMPDX= 6.0         $$ Bruker NMR JCAMP-DX V2.0
##DATA TYPE= NMR FID
##DATA CLASS= NTUPLES
##ORIGIN= UXNMR, Bruker Analytische Messtechnik GmbH
##OWNER= root
$$ XWIN-NMR		Version 3.5
$$ Tue Apr 27 14:12:58 2021 Russian Standard Time (UT+4h)  she@DPX200
##.OBSERVE FREQUENCY= 200.131506
##.OBSERVE NUCLEUS= ^1H
##.DELAY= (6, 6)
##.ACQUISITION MODE= SIMULTANEOUS
##.ACQUISITION SCHEME= undefined
##.AVERAGES= 8
##.DIGITISER RES= 18
##SPECTROMETER/DATA SYSTEM= spect
##.PULSE SEQUENCE= zg30
##.SOLVENT NAME= CD3CN
##.SHIFT REFERENCE= (INTERNAL, CD3CN, 0, 15.7039)
##AUDIT TRAIL= $$ (NUMBER, WHEN, WHO, WHERE, WHAT)
$$ ##TITLE= Audit trail, XWIN-NMR		Version 3.5
$$ ##JCAMPDX= 5.01
$$ ##ORIGIN= Bruker BioSpin GmbH
$$ ##OWNER= she
$$ F:/spectra/data/she/nmr/H-F/1/audita.txt
$$ ##AUDIT TRAIL=  $$ (NUMBER, WHEN, WHO, WHERE, WHAT)
(   1,<2021-04-27 14:11:54.70 +0400>,<she>,<DPX200>,
      <created by zg, POWCHK disabled, PULCHK disabled
       configuration hash MD5:
       00 E9 B6 7A A2 85 ED C7 34 08 36 98 17 FE 4E 26
       data hash MD5: 16K
       30 57 3B 7E 9A A7 BB C1 01 6A 4C 3E 5D 17 B4 F7>)
$$ ##END=
$$ 
$$ hash MD5
$$ A4 46 46 49 DC AB 31 45 79 EF 2A 73 E3 C8 10 3D
##$RELAX= 
##$RELAX= 
##$RELAX= 
##$RELAX= 
##$RELAX= 
##$RELAX= 
$$ Bruker specific parameters
$$ --------------------------
##$DU= <F:/spectra>
##$EXPNO= 1
##$NAME= <H-F>
##$PROCNO= 1
##$TYPE= <nmr>
##$USER= <she>
##$AMP= (0..31)
100 100 100 100 100 100 100 100 100 100 100 100 100 100 100 100 100 100 
100 100 100 100 100 100 100 100 100 100 100 100 100 100 
##$AQSEQ= 0
##$AQ_mod= 1
##$AUNM= <au_zg>
##$AUTOPOS= <>
##$BF1= 200.13
##$BF2= 200.13
##$BF3= 200.13
##$BF4= 200.13
##$BF5= 200.13
##$BF6= 200.13
##$BF7= 200.13
##$BF8= 200.13
##$BYTORDA= 1
##$CFDGTYP= 0
##$CFRGTYP= 5
##$CHEMSTR= <none>
##$CNST= (0..31)
1 1 145 1 1 1 1 1 1 1 1 1 1 1 1 1 1 1 1 1 1 1 1 1 1 1 1 1 1 1 1 1 
##$CPDPRG= <>
##$CPDPRG1= <>
##$CPDPRG2= <>
##$CPDPRG3= <>
##$CPDPRG4= <mlev>
##$CPDPRG5= <mlev>
##$CPDPRG6= <mlev>
##$CPDPRG7= <mlev>
##$CPDPRG8= <mlev>
##$CPDPRGB= <>
##$CPDPRGT= <>
##$D= (0..31)
0 1.2 0 0 0 0 0 0 0 0.06 0 0.03 0 0 0 0 0.0002 0 0 0 0 0 0 0 0 0 0 0 0 
0 0 0 
##$DATE= 1619518314
##$DBL= (0..7)
120 120 120 120 120 120 120 120 
##$DBP= (0..7)
150 150 150 150 150 150 150 150 
##$DBP07= 0
##$DBPNAM0= <>
##$DBPNAM1= <>
##$DBPNAM2= <>
##$DBPNAM3= <>
##$DBPNAM4= <>
##$DBPNAM5= <>
##$DBPNAM6= <>
##$DBPNAM7= <>
##$DBPOAL= (0..7)
0.5 0.5 0.5 0.5 0.5 0.5 0.5 0.5 
##$DBPOFFS= (0..7)
0 0 0 0 0 0 0 0 
##$DE= 6
##$DECBNUC= <off>
##$DECIM= 32
##$DECNUC= <off>
##$DECSTAT= 4
##$DIGMOD= 1
##$DIGTYP= 9
##$DL= (0..7)
0 120 120 120 120 120 120 120 
##$DP= (0..7)
150 150 150 150 150 150 150 150 
##$DP07= 0
##$DPNAME0= <>
##$DPNAME1= <>
##$DPNAME2= <>
##$DPNAME3= <>
##$DPNAME4= <>
##$DPNAME5= <>
##$DPNAME6= <>
##$DPNAME7= <>
##$DPOAL= (0..7)
0.5 0.5 0.5 0.5 0.5 0.5 0.5 0.5 
##$DPOFFS= (0..7)
0 0 0 0 0 0 0 0 
##$DQDMODE= 0
##$DR= 18
##$DS= 0
$$ [...]
##$SUBNAM2= <"">
##$SUBNAM3= <"">
##$SUBNAM4= <"">
##$SUBNAM5= <"">
##$SUBNAM6= <"">
##$SUBNAM7= <"">
##$SUBNAM8= <"">
##$SUBNAM9= <"">
##$SW= 16.9725357007746
##$SWIBOX= (0..15)
0 0 2 0 0 0 0 0 0 0 0 0 0 0 0 0 
##$SW_h= 3396.73913043478
##$TD= 16384
##$TD0= 1
##$TE= 0
##$TE2= 300
##$TE3= 300
##$TEG= 300
##$TL= (0..7)
0 120 120 120 120 120 120 120 
##$TP= (0..7)
150 150 150 150 150 150 150 150 
##$TP07= 0
##$TPNAME0= <>
##$TPNAME1= <>
##$TPNAME2= <>
##$TPNAME3= <>
##$TPNAME4= <>
##$TPNAME5= <>
##$TPNAME6= <>
##$TPNAME7= <>
##$TPOAL= (0..7)
0.5 0.5 0.5 0.5 0.5 0.5 0.5 0.5 
##$TPOFFS= (0..7)
0 0 0 0 0 0 0 0 
##$TUNHIN= 0
##$TUNHOUT= 0
##$TUNXOUT= 0
##$USERA1= <user>
##$USERA2= <user>
##$USERA3= <user>
##$USERA4= <user>
##$USERA5= <user>
##$V9= 5
##$VALIST= <valist>
##$VCLIST= <CCCCCCCCCCCCCCC>
##$VD= 0
##$VDLIST= <DDDDDDDDDDDDDDD>
##$VPLIST= <PPPPPPPPPPPPPPP>
##$VTLIST= <TTTTTTTTTTTTTTT>
##$WBST= 1024
##$WBSW= 4
##$XGAIN= (0..3)
0 0 0 0 
##$XL= 0
##$YL= 0
##$YMAX_a= 481845
##$YMIN_a= -495246
##$ZGOPTNS= <>
##$ZL1= 120
##$ZL2= 120
##$ZL3= 120
##$ZL4= 120
##$ABSF1= 10
##$ABSF2= 0
##$ABSG= 5
##$ABSL= 3
##$ALPHA= 0
##$AQORDER= 0
##$ASSFAC= 0
##$ASSFACI= 0
##$ASSFACX= 0
##$ASSWID= 0
##$AUNMP= <proc_1d>
##$AZFE= 0.1
##$AZFW= 0.1
##$BCFW= 1
##$BC_mod= 2
##$BYTORDP= 1
##$COROFFS= 0
##$CY= 11.3945322036743
##$DATMOD= 1
##$DC= 2
##$DFILT= <>
##$DTYPP= 0
##$F1P= 15.9154993809931
##$F2P= -4.1035820241983
##$FCOR= 0.5
##$FTSIZE= 0
##$FT_mod= 4
##$GAMMA= 1
##$GB= 0.15
##$INTBC= 1
##$INTSCL= 1
##$ISEN= 128
##$LB= 0.24
##$LEV0= 0
##$LPBIN= 0
##$MAXI= 10000
##$MC2= 0
##$MEAN= 0
##$ME_mod= 0
##$MI= 1.114404
##$NCOEF= 0
##$NC_proc= 0
##$NLEV= 6
##$NOISF1= 3.799351
##$NOISF2= 2.8
##$NSP= 1
##$NTH_PI= 0
##$NZP= 0
##$OFFSET= 15.70392
##$PC= 1
##$PHC0= -11123.81
##$PHC1= 15.60096
##$PH_mod= 1
##$PKNL= yes
##$PPARMOD= 0
##$PSCAL= 0
##$PSIGN= 0
##$REVERSE= no
##$SF= 200.130013532006
##$SI= 16384
##$SIGF1= 3
##$SIGF2= 2
##$SINO= 400
##$SIOLD= 16384
##$SREGLST= <1H.CDCl3>
##$SSB= 0
##$STSI= 0
##$STSR= 0
##$SW_p= 3612.71676300578
##$SYMM= 0
##$S_DEV= 0
##$TDeff= 0
##$TDoff= 0
##$TI= <>
##$TILT= no
##$TM1= 0
##$TM2= 0
##$TOPLEV= 0
##$USERP1= <user>
##$USERP2= <user>
##$USERP3= <user>
##$USERP4= <user>
##$USERP5= <user>
##$WDW= 1
##$XDIM= 8192
##$YMAX_p= 0
##$YMIN_p= 0
$$ End of Bruker specific parameters
$$ ---------------------------------
##NTUPLES= NMR FID
##VAR_NAME=  TIME,          FID/REAL,        FID/IMAG
##SYMBOL=    X,             R,               I
##VAR_TYPE=  INDEPENDENT,   DEPENDENT,       DEPENDENT
##VAR_FORM=  AFFN,          ASDF,            ASDF
##VAR_DIM=   8192,          8192,            8192
##UNITS=     SECONDS,       ARBITRARY UNITS, ARBITRARY UNITS
##FACTOR=    0.0002944,     1,               1
##FIRST=     0,             0,               0
##LAST=      2.4114304,     0,               0
##MIN=       0,             -495246,         0
##MAX=       2.4114304,     481845,          0
$$ Real data points
##PAGE= N=1
##DATA TABLE= (X++(R..R)), XYDATA
0@%%%%%%%Qj6J6j6J6k4L9m7N6p2Q8j04J28j56J84k19K55k96L48m04M65n36O15
30C28p01P98r07J024j154J299j458J632j822K028k253K502k774L069l389L742
46A964m127M547n007N512o072O688p372Q135q989R954j1054J2325j3804J5549
60H249j7651K0231k3483K7722l3482M1763n4651P7370j27972M07339q6790p33891
72d95246R77091o70142l4046N63555o01341L56153M2324l30112L96627l06742
82a01879L6882J72080k33796K06795o388j42123J27056o9885o3238Q9763L4600
93D9867j03200J07385J741j44676J38062q4309j4738J39454j65972J40932l3034
104C1512j36041K10872j89744N4653J26885k34313K57369j00241j68304L14055
$$ plain form
0 0 0 0 0 0 0 0 0 8 -8 8 -8 8 -16 23 -24 32 -40 48 -56 72 -84 100 -119 136 -160 188 -216 249 -287 328
30 328 -373 425 -482 542 -612 687 -771 861 -961 1067 -1186 1316 -1458 1611 -1778 1964
46 1964 -2163 2384 -2623 2889 -3183 3505 -3867 4268 -4721 5233 -5821 6504 -7300 8249
60 8249 -9402 10829 -12654 15068 -18414 23349 -31302 46068 -81904 325435 238645 -495246
72 -495246 481845 -188297 -222343 341212 -260129 96024 138348 -191764 204863 -101879
82 -101879 -64997 107083 -126713 80082 73694 -68429 58627 -11258 -74496 15267 49867
93 49867 -53333 54052 55793 -88883 49179 -35130 -49868 89586 -76386 64546 31512
104 31512 -104529 106343 -83401 -28748 98137 -136176 121193 20952 -147352 166703
114A66703k76011K3427K62693l03489J47667Q0283k30498J80537m6168q4579J48423
125F8988r2473J6808N9647j06020O4284o085o9418J21987n3839n3067J35920j20605
137c3873k8530J40845j33357L9663R0369j20000P0832k0494m5018Q1355q9897
148d8105O8809K7586j09284J26300p6725m7151J35253j30654N3685P3660j38911
159f5537R7962o161q2500R1576m1196r331M9625m5244J5032L411k8481K8508j791
172E873j4935K3924j5880q972K9210l9376J4424L1113o2592N4207R877p1298O9690
185B5265k5506l2119O0077m3604J6296J0789l4811M6195l9088J482M2708o1622
197c3938M4786J0764o0390O3248k3982l4526O2249l7874m027L7262l6571J3154
$$ plain form
114 166703 -109308 -85881 176812 -126677 20990 101273 -129225 51312 5144 -79435 68988
125 68988 -23485 -6677 52970 -53050 11234 5149 -64269 57718 3879 -49188 86732 -33873
137 -33873 -62403 78442 -54915 -15252 75117 -44883 25949 5455 -39563 41792 -48105
148 -48105 20704 48290 -60994 65306 -11419 -58570 76683 -53971 -286 73374 -65537
159 -65537 32425 26264 -56236 35340 -5856 -15187 34438 -10806 4226 7637 -20844 7664 5873
172 5873 -9062 14862 -1018 -9990 19220 -20156 -5732 25381 -37211 16996 26873 -44425 25265
185 25265 -241 -32360 27717 -15887 409 11198 -23613 22582 -16506 -15024 27684 -33938
197 -33938 10848 21612 -38778 24470 488 -34038 28211 -9663 -13690 23572 -12999 155
209A55K021j5456K5466k0453Q624J6640l6350K7303J499l0551L7369j5749j4594
222a4076L8360l1081j002K6671l6076J9238J3684k7530K4541j2077q237K2128
234A4543k6718J8342M102k6845L6719k1540j0121L2247l6537J6514J4021l0205
246a5478K7109r277j0814J8236j8076R939L0q541J9547j8529N5J6074k1761R318
260b168J2196k1366J0141J1415k1695J2883N163k4839K4631l344j5275K7179k4263
273i342K509J6884k7590K7563r001j5671L5025l4783J0298K0302m0298L4123l085
286F934k3950L5477k6422J299J9733k8236K2822l171j5463K8552k4637J844K0814
299A5596l2617K3074Q737l2481L2434r868k2405L5596k1570o300K8219k6965Q907
$$ plain form
209 155 2176 -13280 12186 -8267 357 16997 -19353 7950 9449 -21102 16267 518 -14076
222 -14076 24284 -6797 -7799 18872 -17204 2034 15718 -11812 12729 652 -7585 14543
234 14543 -12175 6167 10269 -16576 20143 -1397 -11518 20729 -15808 706 14727 -15478
246 -15478 11631 2354 -8460 9776 -8300 1639 1669 -6872 12675 -5854 -5799 10275 -11486 -2168
260 -2168 10028 -11338 -1197 10218 -11477 1406 6569 -18270 6361 3017 -12258 14921 -9342
273 -9342 -6833 10051 -17539 10024 1023 -14648 20377 -14406 -4108 16194 -24104 10019 6934
286 6934 -17016 18461 -7961 -6662 13071 -15165 7657 4486 -10977 17575 -7062 -5218 15596
299 15596 -17021 6053 14790 -17691 14743 4875 -17530 18066 -3504 -9804 18415 -8550 357
312C57J3587k7011J8359j408j4705K4713j5488k923J7659k6021J4668P720k4757
325a5250K7930j0560j4694K9297k6969M515J8725k8837K3782k354j9261K6922
337A3246k2082P50K1150k8138J9646M626k6529K8407j2808j5039L2246k3313L53
350g485K5214l2738J3973J1135k9093K8807p881j5089L0069k6743N928J6202l1019
363a8720K7759l679j9387L3130k7282j0K4339l1741K0723N802k4381K5840j2914
376e21q541K0973j9687P944J0894k0222J7208m188j5679K3605j4372m059K3655
389A7010k4765O447J4349k7542J9604J833j8592K4071j3048n676J6364j9228R962
402G89M930j4901J7858q721o893J5573j5785M241J1069j6868J2222J344j5570
$$ plain form
312 357 13944 -13067 5292 3884 -10821 13892 -1596 -4519 13140 -12881 1787 9507 -15250
325 -15250 12680 2120 -12574 16723 -10246 -5731 12994 -15843 7939 5585 -13676 13246
337 13246 -8836 -8086 13064 -15074 4572 9198 -17331 11076 -1732 -16771 15475 -7838 -7485
350 -7485 17729 -15009 -1036 10099 -18994 9813 1932 -13157 16912 -9831 -3903 12299 -18720
363 -18720 9039 5360 -14027 19103 -8179 -8189 16150 -15591 5132 10934 -13447 12393 -521
376 -521 -9062 11911 -7776 168 11062 -9160 8048 3860 -11819 11786 -2586 -6645 17010
389 17010 -7755 -1308 13041 -14501 5103 6936 -11656 12415 -633 -6309 10055 -9173 789
402 789 5719 -9182 8676 -45 -6938 8635 -7150 -2909 8160 -8708 3514 4858 -10712
415a0712J7078q873o248J8820j6563M727J0541k1340J6006r75j4127K2003j4451
428d114j586J6700k2268J1777N520j9322K2375p504j1242K1207j8176J576J4851
441I794j8849J2502J714j2800J5205j0944j55J1474j5697J2843R34j4817J6904
454H108q990n505J5890j3036K932Q905j3194O826J952r643J0629l057n177J1516
468H156j1702N77J1430j6647J0846M892j7269J7224o077r695J7209j5471N640
481h87Q887j6864J5281o410q611J6764j4093M862P197j3301J1356n517m953J1623
495E334j0651N023N651j1926Q771j424q141J1138m038m783J0873p405k813Q634
509D243q989L547M886q296R388n080n306J2375j2128L457R802j4027Q825J038
$$ plain form
415 -10712 6366 -2507 -8755 10065 -6498 -1771 8770 -12570 3436 2461 -11666 10337 -4114
428 -4114 -5700 11000 -11268 509 6029 -13293 9082 1578 -9664 11543 -6633 -5057 9794
441 9794 -9055 3447 5161 -7639 7566 -3378 -3533 7941 -7756 5087 6021 -8796 8108
454 8108 -882 -6387 9503 -3533 -601 8304 -4890 1936 3888 -5755 4874 1817 -3360 8156
468 8156 -3546 -2969 8461 -8186 2660 7552 -9717 7507 1430 -8265 8944 -6527 -887
481 -887 8000 -8864 6417 7 -8604 8160 -5933 -1071 6126 -7175 4181 -1336 -6289 5334
495 5334 -5317 -294 5357 -6569 2202 778 -7363 3775 -263 -5046 5827 -1578 -4391 4243
509 4243 -4746 -1199 3687 -4609 4779 -301 -5607 6768 -5360 -1903 7899 -6128 2697 3735
523C735r556J0390o347L17P250q820O146q06o582Q293n745O26P045q780M514K207
539C887q485O879j277l635P611n283l98M716q412N013L295r274Q908n28p690Q814
555D141n954j743P835q345O450N10r093J0743o713k491J0034j0015O017J665q413
570e372Q411n505j351P697p324M316O53o233P135m232k013P163n418R18M966o369
586b558M21L126l876M347k3l620N100m253j155O289p054K581N505p566N269j230
602A303n640P534m493Q56N880q584N144N27o759Q589n993M0Q547j0367N186J576
618C346r575J0229l878k524Q126r009M603J631q552Q501k870k730P441o007P33
633e35J900m561M067mk487K878q88k448K808j512j909M505k993N31L251o748N033
$$ plain form
523 3735 -5821 4569 -1778 -1461 5789 -3031 3115 2309 -4273 4020 -1725 -1099 5946 -2834 1680 3887
539 3887 -4598 2281 1004 -2631 4980 -303 -701 4015 -4397 616 3911 -5363 3545 3017 -4673 4141
555 4141 -1813 -3556 4279 -4066 2384 2894 -6199 4544 -2169 -4660 5374 -4641 1376 3041 -5372
570 -5372 3039 -2466 -3817 3880 -3444 872 1525 -4708 2427 -1805 -3818 3345 -2073 -1155 3811 -2558
586 -2558 -2137 989 -2887 1460 1437 -2183 2917 -1336 -2491 3798 -3256 -675 4830 -2736 2533 1303
602 1303 -4337 3197 -1296 -440 5440 -3144 2000 2527 -4232 4357 -1636 -1596 6951 -3416 1770 3346
618 3346 -6229 4000 122 -2402 5724 -3285 1318 2949 -5603 2898 28 -2702 4739 -1268 -535
633 -535 1365 -3196 871 867 -1620 1258 370 -2078 730 -782 -2691 1814 -1179 -648 2603 -4145 888
650H88j097m303Q660o805J554N126j0053Q668k682n605J1463r255J765O528r829
665d977O902j409m283P328n294J268L599n937L252J003l459L138N4k661L623j283
681H64k642M710m050K89M805o258L375J120n057O525m500n47N438p197N119P09
697B703p058P892m630j085P374q367L168L119p357P348k252m487O847m525M80
712h30L350n378K920O77l647N230k637k177M601l979O63L135n160L202J820m909
728c119M860k076k537N370m244R92K655n093M561r48l548N993n365J211N232p490
744c546M912J79n343P044l808j483N394n048J973K161m315K734n75j244K704j475
760B64m10J746k131N04K065l758K860J279m306M486k208k998N946m583J061L679
$$ plain form
650 888 -209 -4512 4148 -2657 -1103 4023 -6030 2638 -44 -5649 5814 -3441 -1676 4852 -4977
665 -4977 1925 516 -3767 3561 -1733 -465 3134 -2803 449 1452 -2007 1131 1185 -1476 2147 864
681 864 -1778 2932 -1118 -829 3976 -2282 1093 2213 -2844 3681 -819 -1366 4072 -3125 1994 2703
697 2703 -4355 3537 -1093 -2178 5196 -3171 -3 3116 -4241 3107 855 -3632 3215 -1310 -830
712 -830 2520 -2858 62 739 -2908 2322 -315 -2492 2109 -1870 -1207 1928 -3232 -30 1790 -3119
728 -3119 1741 -335 -2872 2498 -1746 -754 1901 -3192 1369 421 -3127 2866 -2499 -1288 3944 -3546
744 -3546 1366 1545 -3798 3246 -562 -2045 3349 -1699 274 2435 -1880 854 279 -965 1739 264
760 264 -146 1600 -531 -27 2038 -1720 1140 2419 -1887 2599 391 -2607 3339 -1244 -183 3496
776C496o017M170j301k713N304m652J795L287o574N224j516m353O991m741P6N124
792C600o511K843J433m739M518j811j070L976l871J274P71l259L888j308j269
807a535L671l513L83K283l887K796O41k318L109j382k011K628j760K37K191k184
823f51J322L93k474K885k092l76L136k904J566J222m248K915M77k798L727j278
839H22j147J843j933m7J165j257J557r5p05J060k285K62K257l280K391J548m366
856b210L912j599k873N138l405M14L150m457K851j414j988M278l222J749J673
871A997m678L900j460j976L890k912M86K344k948J160pj488J975k24m74J140j376
888f51J95P79j503J538k09p83K016j797o49J816k483J539K250l220J592N29k784
$$ plain form
776 3496 -2521 1649 348 -2365 2939 -1713 82 3369 -3205 2019 503 -3850 3141 -1600 -1524 3600
792 3600 -2911 -68 1365 -3374 1144 -667 -1737 2239 -1632 -358 413 -2846 1042 -266 -1535
807 -1535 2136 -1377 -994 1289 -2598 198 839 -1479 1630 248 -1763 865 -895 -658 1533 -651
823 -651 671 1064 -1410 1475 -617 -993 2143 -761 805 2027 -2221 694 1171 -1627 2100 822
839 822 -325 1518 -415 -462 703 -554 1003 908 203 1263 -1022 -760 1497 -1783 608 2156 -2210
856 -2210 1702 103 -2770 2368 -1037 -623 2527 -1930 921 -493 -2481 1797 -1425 324 1997
871 1997 -2681 1219 -241 -2217 1673 -1239 -753 1591 -1357 -197 -204 -1692 283 59 -415 725 -651
888 -651 -456 323 -1180 358 149 -634 1382 -415 -1064 752 -1731 -192 2058 -1162 430 959 -1825
905a825K486k61j189K247j456L62M29k076K381j030q84L557l431N51J857l745
921b027K498Q79k175K041q26p97J572k015R05L84q36J835j499p16J524j907P09
938d51J665k020R01P44k523K221l96j940L055j716k36J983l229J835N39k068K693
955A057j698R9J753l175K095k34j572L056j969k47K152k572N53J333j337R26L63
972E83r84N04m61J66M24o87J018L19j547J695r99j389K844j330p46K488k205K84
990b3J144j883J441n8q86J676j492l34J067j759J964J73j895K298j758m95K394
1007A574k994J512J371k704K243j002j336K156j518O52R23j715J534j151n54J656
1023F47j537L48J260j736Q95N47k251K045J38j743K274r06j185J726j376O58O31
$$ plain form
905 -1825 661 400 -789 1458 2 364 793 -1283 1098 68 -816 2741 -690 -139 1718 -2027
921 -2027 471 1350 -825 1216 390 -407 1165 -850 55 439 -397 1438 -61 -777 747 -1160 -451
938 -451 1214 -806 95 839 -1684 537 141 -1799 1256 -460 -696 1287 -1942 -107 432 -1636 1057
955 1057 -641 -542 1211 -1964 131 -103 -1675 1381 -588 -835 1317 -1255 -702 631 -706 220 583
972 583 -401 103 -358 -192 232 -455 563 882 -665 1030 31 -1358 1486 156 -590 1898 -307 -23
990 -23 1121 -762 679 621 -265 1411 -81 -415 652 -1107 857 1030 -865 1433 -325 -820 1574
1007 1574 -1420 92 1463 -1241 1002 0 -1336 820 -698 -46 877 -838 696 -455 -1009 647
1023 647 -890 -542 718 -1018 -123 424 -1827 218 356 -1387 887 -19 -1204 522 -854 -196 435
1040D35j389J716j170l69J687k212J224P68j858J995q76r54J769j132k43J550
1056I41r10J24N39j170N38N8m29J428p49n69J381k169J262R51k322K241o74j341
1074h70K297k493O72J764k112J541j86j152J524j416J89P50j137J164j09j318
1090h92J310m40j089J747j054j43J616k036M92J272k057J714n54o10J429j445
1106g40M76N27j707K203r05q70J935j965R96N56j517J555j68q05J136r29P5lk14
1125c64L25K84l12K73l70m99J029l25l79J240r75k04J062j194N25P24j336J123
1143F27j43j071J795j677L00J306j652J396p18q39J747j600M97R00j672J749o40
1160C05j002J462j127K43Q35j445Q61n3m17L94k56j41P41p83K60K53p90P15N7
$$ plain form
1040 435 -954 762 -408 -777 910 -1302 -78 690 -1168 827 -49 -1003 766 -366 -609 941
1056 941 31 155 694 -476 62 120 -309 1119 370 -199 1182 -987 275 1226 -1096 1145 471 -870
1074 -870 1427 -1066 -394 1370 -742 799 613 -539 985 -431 -242 508 -629 535 426 -892
1090 -892 418 -22 -1111 636 -418 -561 1055 -981 -489 783 -1274 440 -114 -724 705 -740
1106 -740 -264 263 -1444 759 -146 -1016 919 -1046 -50 506 -1011 544 376 -429 707 -222 -147 -150 -364
1125 -364 -39 245 -67 206 -164 -663 366 41 -338 902 -73 -277 785 -409 116 840 -496 627
1143 627 484 -587 1208 -469 -169 1137 -515 881 163 -676 1071 -529 -32 868 -804 945 305
1160 305 -697 765 -362 -119 716 -729 132 79 -338 56 -200 -341 400 -383 -123 130 -660 55 112
1179A12p30O14L5p73R75r30M33O11q92Q32m82k40Q22j209P09M55r48R50j25j017
1199g98J136o20K93K82n77L86J21m30K69J48p1K00k85n16R48o59J14O49p95P36
1219E31O6j042J358j122l71J428r84O12J06j095R68n06l97Q76o97P08K08j231
1237e84R74m19q05J498r05K44P19j462R34l08p91J142l80j38P27j144Q09m89r2
1256d70J261q77K2K96p03J32L08m74K28M98m42M81k44m86M04j0k97Q13m16j08
1276h4P8o27O49l08K20P34r14J90P34j307O98M24o80J084n29o06O18p15O31L18
1296F08n87P45l93m94O65q80K74O05q39J106l71q47R21p74P2P19p80N94k55m51
1316c62N95m83J31N67o95O74l67p35O40l73L26M01l41j35J96m96K96K05n15N82
$$ plain form
1179 112 -618 -4 31 -742 233 -697 -264 347 -545 287 -195 -435 387 -822 -113 342 -606 344 219 -798
1199 -798 338 -282 11 293 -284 102 223 -207 62 210 139 339 54 -462 486 -173 -59 590 -205 531
1219 531 597 -445 913 -209 -580 848 -136 476 582 -513 455 -51 -448 428 -269 439 647 -584
1237 -584 390 -29 -834 664 -241 3 722 -740 194 -114 -905 237 -143 -281 446 -698 111 -378 -470
1256 -470 791 -86 -64 232 -471 -339 -31 -505 -277 221 -221 260 16 -470 -66 -76 -373 440 24 -84
1276 -84 -6 -633 16 -292 -72 662 -252 -62 672 -635 63 487 -193 891 362 -244 374 -341 290 608
1296 608 21 766 373 -121 544 -336 -62 543 -296 810 439 -408 513 -261 -189 530 -250 344 89 -362
1316 -362 233 -250 -119 448 -247 427 60 -675 -35 -408 -82 319 -22 -157 39 -457 -161 44 -471 111
1336A11n8m25J75j58j25M62m13O15n5l07M09o31j62O56k93M20M53r57K93L25o93
1357c58P22k11k16N75p23L46L2n23P92j42j03N37r37K9P91j128J112o7m58M97
1377E67k64k87L76o22L15N92q35O11o43K08L39o11L91N90j077Q48o19k98Q69n25
1397g5J56K91l96M7j91k50L14j46M17K0l73L6M1l79M40J50m06M11J81q49O64l70
1419b67j2O98l97m97R95j026R17l98l81R11p65J86K98p99J081q77j14J018q94
1438c23M64L50j147Q63M9l36N98p31N50k74k99L29J4j70L27l04l7L44m17J46K75
1459B71l79J46N74j001O16j42m88Q89m22k19N97o69j48L53l17O11n32J69N17r10
1479d84O14k63l74Q04m18n9M15n52L13j75L7l2J42o0j97J09L66k99k79M18J57
$$ plain form
1336 111 53 -372 -197 -355 -480 -18 -431 184 129 -178 231 -400 -562 94 -199 221 674 -283 10 335 -358
1357 -358 364 153 -63 512 -211 135 167 -356 436 294 191 728 -209 -180 611 -517 595 528 70 567
1377 567 303 16 392 -230 85 677 -158 453 -190 18 357 -254 137 727 -350 498 -121 -419 450 -75
1397 -75 81 372 -24 23 -168 -418 -104 -250 167 187 -186 -150 -109 -488 -48 102 -304 107 288 -561 103 -267
1419 -267 -279 419 22 -475 520 -506 411 13 -368 543 -222 -36 262 -537 544 -333 -447 571 -323
1438 -323 141 491 -656 207 256 -80 518 -213 337 63 -236 93 107 -63 264 -40 -77 267 -150 -4 271
1459 271 -108 38 612 -389 227 85 -403 486 64 -155 442 -227 -375 -22 -339 272 -260 -91 426 -484
1479 -484 130 -133 -507 297 -121 -180 235 -317 -4 -179 -142 -174 -32 -92 -289 -180 186 -113 -392 26 183
1500A83k46k13K50l16L42J28m66N09r7m64P12p23M90K69m02N46o92K54K80p38
1520c94P75j55l78Q18o64k67P02n71K66J75m99N58j90j14K00j62r2K26m11K64
1540H7l0j58J41j05k7L77l49k2N2k77M34K57n22J80j33k4J14k69J64K81k86N62
1562D47k35m56M11l64o7L82n48N02j56j80K85r9m9K45l1L6p5k31k7J48j53P2J58
1585A5J0o6O7m8J53k27M30J06o16M27k79k11L42j60J21R6k01J13j01j39M02j37
1607I7M46l21j73L83n72J86J75j45O3N1k75m7K3J22rK9n6K22k54j55J27k86M46
1630G7o6m19O15n76K23J69l92J40K84l45L62m13M1K18%m2M11l73L3k10J65J45
1652D7m30J86L35l72L50j00k83M32l19j41N50j86L3k3l66M24J67l25K03r8m17
$$ plain form
1500 183 -63 -276 -26 -342 0 128 -338 171 74 -390 322 -401 89 358 -44 502 -190 64 344 -394
1520 -394 381 226 -152 666 2 -265 437 -134 132 307 -192 366 176 62 262 100 8 234 -177 87
1540 87 57 -101 40 -65 -92 285 -64 -86 -34 -311 123 380 -142 38 -95 -119 -5 -274 -110 171 -115 447
1562 447 212 -244 167 -197 -264 118 -430 72 -84 -264 21 -78 -127 118 87 123 48 -183 -210 -62 -215 -143 15
1585 15 25 -41 26 -22 131 -96 334 440 -176 251 -28 -239 103 -57 64 160 -41 72 -29 -168 234 97
1607 97 543 222 49 432 -140 46 221 76 139 190 -85 -132 -109 13 4 33 -23 199 -55 -210 -83 -369 77
1630 77 11 -408 207 -369 -146 23 -369 -229 55 -290 72 -341 -300 -82 -82 -124 287 -86 -53 -263 -98 47
1652 47 -383 -197 138 -234 116 16 -267 165 -154 -295 255 69 102 79 -287 137 304 -21 182 84 -333
1673c33L81n3K14Q9k36J58p1j56K57m76N41j4r4R2N0l20jJ30k71M11j25j27P1
1696A17O3j04n2l00M38l88J6K9QK10%k88K51M7n9p4L8j33K33m5L4k27j07K94k20
1721b19J96K6j96K57j20kM2j11k8J21J13l16K72j04j3M24l00Rk13R6N14r59M60
1744e1J86j05J78k16j37M34l75L22lj42j36K46J93p5l7k77L21j86j24K71j43j67
1766b3k7J04J2l1K2N8n3J21k68j7M16k16m2j62O9l35L1n3K21K77j64K02l14J52
1790b0J56j18j48J51l40O39m81j38K19J60o6K60l09p6J26m45M70n3Q7J00J5l36
1812a47K10l82L12J98j2k60J26o3k08J22K0J13J53r1J46k83K20k04O7J32OO0l35
1835a00k6J53o4K0L79k23k27K71n30L69J24m12M15j43P0L2k61K68k34K81n6k09
$$ plain form
1673 -333 48 -5 209 298 62 220 149 -7 250 -226 315 301 207 299 349 29 28 158 -113 298 173 46 117
1696 117 180 76 24 -276 162 -226 -210 -181 -173 37 37 -251 0 47 -12 -86 -48 -181 52 7 41 -186 -293 1 -219
1721 -219 -23 3 -193 64 -56 -58 -16 -127 -155 -34 79 -237 35 -69 -82 342 42 51 -162 -66 448 -511 -51
1744 -51 135 30 208 -8 -145 289 -86 236 233 91 -45 201 394 319 282 5 326 140 16 287 144 -23
1766 -23 -50 54 66 35 57 115 62 183 -85 -102 314 98 56 -106 -37 -372 -341 -394 -173 104 -60 142 -172 -20
1790 -20 136 18 -130 21 -319 320 -161 -299 -80 80 14 274 -35 -111 15 -430 40 -13 74 174 189 -147
1812 -147 63 -319 -7 191 179 -81 45 -18 -226 -104 -84 29 182 91 237 -46 174 -30 37 169 175 235 -100
1835 -100 -126 27 -37 -17 362 139 -88 183 -347 22 146 -266 149 6 76 108 -153 115 -119 162 106 -103
1857a03M1j5l1j19K22p0M6J4j6k16K16o4J32p3Q5n4n2p6j03J41j67J60k07K68
1881d1j93L0L73l75L15n7k16O2k58M07J35j29M9j12J19J2j5j26K01l68M55j77
1903I1j69L59l91J91k18K53O9q5j78j49J38K15m9m14M89rM1j87k63J15J82J4j71
1926a26Q6j8J70n3j02q0L24Kk43L8K06l09j1Q9j31J21J46j95J19J00m18n6L61
1949B0j11j73L58p0J98j96j67M43m09j18K55j01K44j58k02M67j04k70J31R8l9
1970I6j10r2J40j38k1J20j74J16L97l88J22Q1l39L79j17l48M69j11OJ89l61P0
1992a4K1J48m25L39j4P1p1j83j28L42j87L6n1K0J78j94J38p1Q4j92J12J4L9k94
2016b82M16m8q8J40k29m0K40l36L43J42j98J11m90L53k6N7LO0k49K6m9J92r0Q1
$$ plain form
1857 -103 -62 -77 -108 -227 -5 -75 -29 -15 -31 -247 -31 -95 37 -36 49 -5 -57 -133 -236 -95 -262 -102 -309 -41
1881 -41 -234 -204 169 -206 109 52 -164 -102 -360 47 182 53 102 -10 109 121 106 -20 181 -187 268 91
1903 91 -78 281 -110 81 -137 116 185 100 -78 -227 -89 126 77 -337 152 143 184 -3 -266 -151 31 45 -126
1926 -126 -40 -58 112 59 -43 -123 201 203 -40 -2 204 -105 -116 -27 -158 -37 109 -86 33 133 -285 -341 20
1949 20 -91 -264 94 24 222 26 -141 302 -107 -225 30 -71 173 15 -187 280 176 -94 37 135 96
1970 96 -14 -106 34 -104 -125 -5 -179 -63 334 -54 68 149 -190 189 72 -276 193 82 88 277 -84 -14
1992 -14 7 155 -270 69 55 126 55 -128 -256 86 -101 -65 -116 -96 82 -112 26 -45 39 -153 -41 -27 12 -282
2016 -282 134 86 -2 138 -91 -131 109 -227 116 258 60 171 -319 34 8 65 68 128 -121 -95 -144 48 -42 39
2040C9P6q6j02K82k59n5J95j40l4k4r4K43m2r6o1K56j03N03o47K26J56L0l95J03
2064b9J42l2J68p5j75r7J02j57K46p8j12j11M7O6J46J7L6j72J14k38K93k89K53
2087F5J11j45j07M8l66M01l7l4K35k43k24J86j03J01J45MN7K0nO4j40L0m6l28
2111c11N54k37j0p7K35m28J54L11k39J76j66Oo3J70k7K50l73J51j65K14l41K32
2133A6R6j20k5J13j71lK82k58Q7QJ11l25L30O0k00N9j8N2j88K98p1j64J92l35
2157a74J32O6j71K6K1R0R9Q5k35L16M3k06l10L95Kj3m8J4k37J0N3m3J3l6p9J83
2183dk31M37l66l0L44j37j22J27j84K40j47j16J54J8L3p0J41m7O4K0mn2L9k38
2207a31j0Q2k31K95J91k40O1Q2k10L89l46J3J2J74m9K5j45P2j25J14J62l04K08
$$ plain form
2040 39 115 29 -73 209 -50 -105 90 -50 -84 -108 -202 41 -1 -97 -158 98 -5 498 -149 77 233 263 -132 -29
2064 -29 113 81 249 174 -1 -98 4 -153 93 15 -97 -208 -161 -95 51 68 104 -68 46 -192 101 -188 65
2087 65 176 31 -76 -28 -394 7 -30 -64 171 -72 -296 -110 -213 -112 33 37 94 114 109 173 33 63 17 -311
2111 -311 243 6 -4 -81 154 -274 -120 191 -48 128 -38 -32 -95 75 48 298 -75 76 -89 125 -216 16
2133 16 112 -8 -33 80 -91 -94 188 -70 17 25 136 -189 141 201 1 60 42 94 -94 204 133 -31 161 -174
2157 -174 -42 24 -147 -121 -100 -10 89 174 -61 255 298 92 -218 177 179 166 118 132 -105 -95 -42 -85 -72 -108 -187 -4
2183 -4 -235 202 -164 -194 150 13 -109 18 -166 74 -73 -189 -35 -17 16 -54 87 40 104 124 120 68 107 -131
2207 -131 -141 -59 -290 5 196 -44 17 99 -111 278 -68 -55 -43 131 82 107 -38 34 -91 23 185 -119 89
2230H9m32K40j0J25m3J12K6j7m4l4j51K16j47L07l92L51k91N3k08L17P0J3j3j81
2254d4J88j88q5Q5O4K4q5j20J41L3O6j42J82n9j08j44q4L24j25R3J64r3J74k33
2278B8L1m7J29j83J39K23k56j80j0J77k09L01p5jJ1l8J40k21K9J58o6l5j34J87
2302I8j84p0K23k14J32q3Q1j20J32K20l15K05ll15K34n8O8l65M43j2j54j66OQ7
2326a30LK9p3M36n04J46%J32j90O3J41J2k9j58J16J47k28o4L96q9m09P08n81J71
2350D5R8k76KJ03J59k46K32m05L75r8J58j40q1J16oj12K62M2p1o7k2j10J1M05
2374C74m39J85j9k6j6R8j51Qn6l0J6J35P5P4l96K27k00j49L75n1j59K20k84J32
2398e7Q2p5J90j39j49K45r3m9J31j11j01J35k92M33m02l8M23l16J99j50K25q9
$$ plain form
2230 89 -343 -103 -113 12 -31 81 107 90 46 12 -139 77 -70 237 -155 196 -95 -42 -250 67 137 150 137 -44
2254 -44 144 -44 -129 -44 20 44 -41 -161 -20 13 79 -63 119 60 -48 -192 -276 48 -77 16 180 87 261 28
2278 28 59 12 141 -42 97 320 64 -116 -126 51 -158 143 68 67 78 40 180 -41 -12 146 80 45 -89 98
2302 98 -86 -156 67 -147 -15 -98 -17 -137 -5 215 -100 105 102 -213 21 -37 31 -334 109 97 -57 -223 -217 -130
2326 -130 -127 -98 -171 265 -239 -93 -93 39 -151 -88 53 65 36 -122 -6 141 -87 -151 245 156 -253 455 -126 45
2350 45 143 -133 -131 -28 131 -115 117 -288 87 -11 147 7 -74 42 36 -76 186 228 157 90 68 -42 -31 374
2374 374 -65 120 101 75 59 157 6 14 -42 -72 -56 79 154 228 -168 59 -141 -290 85 34 -125 95 -189 -57
2398 -57 25 -50 140 1 -148 97 4 -45 86 -25 -126 9 -283 150 -252 -290 133 -183 16 -134 91 2
2420Bj98J51k52M27J89m49R9L3J54k89O1j44K9L17o0j10j01J29j06K97j15L3j26
2443b9K91k48J58r8j17j21L49k55J23j73j63L83M9j07J79j99R9k28L36k54J60
2464A35j5q1l2N7m8KJ35k06k1Q3j28o6J34R3k6j36J13q0n7RL47l29K61j80J09
2489G3K7m19K22qK86l13L7q6K31K1k49K52pL6j93K2Q9r3o6j21J66J05j74L38j9
2514A57Q5k86J58pPj56R3Q4k74K39m1j62j63K44Q5p8K2O1j64q8J39q0%J27J20
2539A22k67K61Q7j88J1j72K37j62K09j82Q3r2O1K33l58m2J19qj86K80o4m4K05
2562A43l07L68p3p0O5j05J14k15L8K11k57lj05K81R8r7N0ML0j12m10J37R1k2R2
2587e4L1J17o4N4j96O1O4p8J9jJ02o9J51l10p1J25K54j17j0r8PN5K47k35J80l04
$$ plain form
2420 2 -196 -45 -297 130 319 -130 -31 2 156 -133 -72 -216 -187 130 70 -40 -141 -12 -118 179 64 97 -29
2443 -29 262 14 172 74 -43 -164 185 -70 53 -120 -283 100 149 42 221 22 121 -107 229 -25 135
2464 135 120 39 7 64 16 18 153 -53 -74 9 -119 -185 -51 42 16 -120 -7 -87 -144 -135 212 -117 144 -36 73
2489 73 100 -319 -97 -105 181 -132 -95 -181 50 71 -178 74 67 103 -90 -68 21 -72 -138 -259 -93 12 -162 176 157
2514 157 242 -44 114 107 114 -42 51 135 -139 100 59 -103 -266 -22 63 -15 7 68 -96 -184 -45 -125 -125 2 122
2539 122 -145 116 203 15 26 -146 91 -71 138 -44 39 -53 8 241 -117 -159 -40 -48 -234 46 -18 -62 143
2562 143 -164 204 131 61 126 21 135 -80 -42 169 -88 -91 -196 85 183 86 136 140 170 58 -352 -215 -124 -146 -54
2587 -54 -23 94 30 84 -112 -51 13 -65 -46 -47 55 -14 137 -173 -244 -119 135 18 8 -90 -83 -28 219 -16 164 -140
2613a40J25QQp6R9Kj63J41J0rO0k06J05J90j98P4j30M4Q6o1J26k51K17M1j49K6
2639b1j21J39j21L22j47R2n5l39K72k15L40k43R1o7J27p9J21l8p7J14j37J53k49
2662a38L04j59m2J3K16o1n9k02m5K63j68J23P7j83L1J02j5j74R1J4K08qk58J81
2686A11j14J98N0n1k24K0nJ70k4n8n1p9L50l57K7j29M0L4K06r7J43j36o4J67q0
2711D7K91r9l05M9k3P9J30L7qm77L24j59K27j90j7J58K16m73K60k84K88L4n4n9
2735hL04n01j1J46O1j63K48j38k9L49j92j18j72J88K8O0L7m0l43M06L3j63R7o8
2759A1K56K8m41J17j7J6k6J91k8j46J1L00n08K0K36m5k30L01K5M3j75m1k5M22
2783B95l33J85j55n6n2J69j04k9L13l70j79L92J3j07k5J36j89j65J27J20O0j08
$$ plain form
2613 -140 -15 -7 1 -75 24 26 -137 4 14 5 65 -141 -36 154 -44 30 -100 -56 30 -31 95 -156 61 102 -47 -21
2639 -21 -142 -3 -124 198 51 143 88 -251 21 -194 146 -97 -6 -73 54 -25 96 58 -19 95 -42 111 -138
2662 -138 166 7 -35 -22 194 133 74 -128 -173 90 -78 45 122 -61 -30 72 57 -117 -26 -12 196 188 -70 111
2686 111 -3 195 245 194 -30 -10 -15 155 131 73 22 -57 293 -64 -37 -166 -126 -92 114 17 160 24 -40 127 47
2711 47 338 239 -66 -17 -40 39 169 206 198 -279 45 -114 113 -77 -94 64 280 -193 67 -217 71 105 51 -8
2735 -8 296 -205 -216 -70 -9 -172 76 -62 -91 258 66 -52 -224 -36 -8 52 89 49 -294 112 145 -18 79 11
2759 11 267 295 -146 -29 -46 -30 -56 135 107 -39 -28 272 -236 -216 20 -25 -255 46 71 114 -61 -102 -127 295
2783 295 -38 147 -8 -64 -116 53 -51 -80 233 -137 -316 76 89 -18 -43 93 -96 -261 -134 -14 46 -62
2805f2J7K1L1j02J83k25J38j50Q4M1q2J45J79k22q0j7J88K01m78N46m19p9J79
2828C7L6R0m8m84L43J45R8n20L43on8r0L07n5k17J9J90k11J61j61J61j45J3K52
2852B00j31N2l45L08l16K88Q5k9l6J0j31P7k38J58j60ML59k50P4J23J60k36j02
2875g6R9j54j9j11L77m4k81K53l5q3k1K90j15J85k34r1J70q0J37k18j59P5J43
2898Hk90L14M5j27K04j08P8k59k2K16J60k03P5q2mn3J09j38L01j74J82m99M41
2921A74j09N5K66l88j7l6K42j32R5l3j62r0J95J9j09l2P7K84k42J90k28R7k09
2944i3j6L8K08k59L22j74q8J8j34K00K6P1j17j67J67j02Q5o7O2j77K42j22o1O7
2968g1j40k3K9K02K4K26n35nL00J09j74L0P2R7J39m14K83j45J81j25q2M6k5J14
$$ plain form
2805 -62 -45 -24 7 -95 88 -137 1 -149 -65 -24 -106 39 218 -4 -84 -101 87 288 -190 356 -63 -142 37
2828 37 73 163 115 -369 -26 119 217 -303 40 34 -24 -114 193 138 -79 -60 130 -81 80 -81 80 -65 -52 200
2852 200 69 121 -224 84 -232 56 141 112 76 86 -45 32 -206 -48 -208 -204 155 -95 -21 102 262 26 -76
2875 -76 23 -131 -150 -261 116 72 -209 44 9 -74 -95 195 80 265 31 -60 110 30 167 -51 -210 -135 8
2898 8 -282 32 77 -50 154 46 124 -135 -157 59 219 16 91 9 5 -48 61 -77 224 50 232 -267 174
2921 174 65 120 386 -2 -19 -55 187 55 150 117 -45 -135 60 79 -30 -62 15 299 57 247 19 116 -93
2944 -93 -109 -71 137 -122 200 26 -62 -44 -178 22 48 119 2 -165 2 -100 -15 -82 -20 -197 45 -77 -138 -71
2968 -71 -211 -234 -205 -3 21 247 -288 -293 7 116 -58 -28 44 141 280 -134 149 4 185 60 -22 24 -1 113
2992A13j89J33j5n9K7J5j4k54L67k46nk48M79K08m40K09q6P5j61J47k70N18k26
3015G8J5j33J68l4k90J80j34K24k9O2j01Ok26K28O2j79J43L2k17K9l8J68l1K73
3039B56r0m55K40O4n1J42k25p9J15J09n0r1J21j6q4p6j02M59K1k38J00J81k23
3062B8o9o7J16j92L14j81J87j63k24M32n8j17j44P04n20qQ1n7j99J44L5PJ6P1
3086A36j56K1n7K59l25R1K44l73Q8J83k8k12L53l01J94J67l38j56L93j69K6l41
3108c01K07j22k6L67j07MJ55k58K0J0P6m2j12K39l00L35o2p4r0J14r6j40RN4K17
3133G7pp6QPJ1k89M27m92N47M7l02k3K39j85k09K05Jn7l2j35L85k11J2O0p0J24
3159F2n2L58m80J38n4j58K76j24qQ5p4m5R3rj50R3j40o9K81J00j40k8M8j31np6
$$ plain form
2992 113 -76 57 42 -17 10 25 11 -243 124 -122 -127 -375 104 312 -128 81 -5 70 -91 56 -214 304 78
3015 78 93 -40 128 94 -196 -16 -150 74 45 107 6 12 -214 14 76 -103 40 72 -145 -116 -154 14 -17 256
3039 256 166 -289 -49 15 -36 106 -119 -198 -83 26 -24 -115 6 -10 -94 -170 -272 187 208 -30 70 251 28
3062 28 -41 -108 8 -184 130 -51 136 -27 -251 181 123 6 -138 566 46 38 119 62 -137 7 42 49 65 136
3086 136 -20 1 -56 203 -122 -31 213 -160 -72 111 83 -129 224 -77 117 284 -54 -210 183 14 40 -301
3108 -301 -94 -216 -242 125 18 22 177 -81 -61 -51 25 -17 -129 110 -190 145 83 9 -81 33 -63 -203 -194 -140 77
3133 77 70 -6 2 9 20 -269 158 -334 213 260 -42 -65 174 -11 -220 -15 -14 -71 -103 -238 147 -64 -52 8 -62 62
3159 62 10 368 -112 26 -28 -186 90 -34 -42 43 -31 -76 17 8 -142 -49 -189 -258 23 123 -17 -45 3 -128 -133 -209
3185b09K78l02O0K63O8p9l46L54j66J00Ol55L25n3P3j21L05k14P3L5l53K97K99
3208C38p7l61L5J92k24J39K9j8k0o9K35j47p4J7K76l56L66l40K01j40q7K78k68
3231g5J67j8j8J61j02l20K89k08K40j15K23k70P0j86K11j26oJ57k02J43p3K4M8
3254A4k62L78J52l46J32k41M54m08K37k50J32l3J48q7R3j12n5O1j73J84k63J04
3276a41K71j09k49K44M4J54l22J48k41J90k22J38J00p0J43k31J10K5KJ58R3k52
3298a7j04R8L50m7l48K65j77p2J35n1j7K67l06j65Q1k25L94q7K06k05K6q8J41
3321E4j84J94j41K54m76K65K00l02J32j3k09J06L85k08o7JP6j73P2L49m5m31J99
3344C8k4j72L09l0p6N7j80K07k4j77M7n6k28M58j52j45K29j30l2M04l29Nj83K94
$$ plain form
3185 -209 69 -233 -173 90 158 79 -267 87 -79 21 27 -328 -3 -56 17 -104 201 -13 60 95 -258 39 338
3208 338 261 -100 -65 127 -97 42 71 53 33 -36 199 52 -22 -5 271 -85 281 -59 142 2 -85 193 -75
3231 -75 92 74 56 217 115 -205 84 -124 116 1 224 -46 24 -162 49 -77 -83 74 -128 15 -58 -34 14
3254 14 -248 130 282 -64 68 -173 281 -127 110 -140 -8 -41 107 20 113 1 -54 7 -166 18 -245 -141
3276 -141 130 21 -228 16 60 214 -108 40 -201 -11 -233 -95 5 -65 78 -153 -43 -18 -16 142 235 -17
3298 -17 -121 -23 327 280 -68 197 20 -52 83 32 15 282 -24 -189 -108 -333 61 -26 180 -25 1 -87 54
3321 54 -130 64 -77 177 -299 -34 166 -136 -4 -17 -226 -120 265 57 -10 -9 67 -106 -34 315 270 -161 38
3344 38 14 -158 151 121 45 102 -78 129 105 -72 -25 -81 -309 149 -3 -148 81 -49 -81 323 -6 -1 -184 110
3368A10j2m5olj6k04L41j59r3Q8q0P3RL28l08K1O8j08J27l93M2L42J2j11J90l28
3394a15L10P6m25p7J91o9J4L4J48j65L43j48kn6j16M1n1J19J4j84K02j72l5N2
3418g1N2J53j82n7j8J07m4j01J96N7k20J34K6q6k30K43Qj46R3J92l03L06l45K90
3442E4j98J87l1j09J00o8r6M3J26mM8k28J25J56kk03P1J28J19k52oj7jo9J19J75
3468A67j17l32J28j3K39k11J2L84n42J07K79J73l52K73j74Pj03L00j90l9j36K75
3490A35Lj39O6J16m96L8L89j58J72j52K49j78J09l28L09k4j71J3J49j20P3j07
3512e2J70Q7j93J66j61j4j10j12P1K42J46k66K15J01l54J71%l83K54lJ24Q3k35
3535e3J24j76Q7j31J52r0R5k5J55N1j81O4Mj86J07l9k6K57p9k00J93j42k30M04
$$ plain form
3368 110 98 53 47 44 28 -176 165 6 -87 1 -79 -6 3 331 23 44 112 4 131 -262 -220 122 134 23 213 -115
3394 -115 195 271 -154 -231 -40 -109 -95 -61 87 -78 265 117 115 59 -57 -16 -67 52 66 -118 84 -88 -123 -71
3418 -71 -19 134 -48 -105 -123 -16 -60 -161 35 92 -128 6 32 -54 -284 -41 -33 -179 -86 106 -197 109 -236 54
3442 54 -144 43 12 -97 3 -65 -161 -118 8 4 52 -176 -51 105 103 -100 -29 99 218 -34 -40 -57 -58 -127 -8 167
3468 167 50 -282 -154 -167 72 -139 -127 257 -285 -178 101 274 -78 195 21 28 -75 225 35 -4 -140 135
3490 135 138 -1 65 181 -315 -277 112 -46 126 -26 223 45 154 -174 135 111 -60 -47 102 -18 55 -52
3512 -52 118 205 12 178 17 3 -107 -219 -148 94 240 -26 189 290 -64 107 107 -276 -22 -25 99 182 -53
3535 -53 71 -105 -18 -149 3 -87 8 -17 138 189 8 72 76 -110 -3 -42 -68 189 110 -90 103 -39 -269 135
3559A35n9l30K76J87j5l88K57q4M0j63J82N0l55M84m22MK96j7K2j53K55j79J11
3582A34l05J06K60k77K74j73P0r0P8j86J5j93M26o8k86J27n0J93J75l82J63j70
3604a59J49L12j70j82o6J25j54J73o6J16m2l3O5J17j85J25Lj64k8M3N5Q4lL0l38
3629a93R3L0K53k34J34j0J96k73O6j3j05K4N4j65J39o7M9J1q7J05O6R7k65QJ41
3654E4J27r8J30m28J95n3%J85m0k41K19j39J10r4O2Q0ok32K9Q6J08o3m0J85k44
3679a08J81k40L89j83J08l53K98j07j8m1J51N7m12M30P0q7j31J20k31L32l75J42
3701hj16L04k05J13j36n4J53n4K7k26M00j07j10l0K8j2N8n1J31l13L44j11j5J29
3725A39l55N3J55M2j25J35j9m2j08r1R9J57j71N2K0p3J30J11j33nj66J21R7K2
$$ plain form
3559 135 76 -254 22 209 194 -194 63 -21 19 -144 38 88 -267 217 -205 -201 95 78 100 -53 202 23 134
3582 134 -171 -65 195 -82 192 19 89 -1 77 -109 -94 -287 139 71 -215 -88 -138 55 230 -152 11 -159
3604 -159 -10 302 132 -50 -116 9 -145 28 -38 78 36 3 68 185 0 125 128 -36 -64 -21 34 118 115 145 -193
3629 -193 -100 -70 183 -51 83 73 269 -4 62 49 -56 -32 22 -143 -4 -71 -22 -11 -98 7 73 170 -95 -87 54
3654 54 181 83 213 -215 -20 -73 -73 112 72 -169 50 -89 21 -73 -11 69 63 -169 -140 -54 54 -9 -49 136 -108
3679 -108 73 -167 222 39 147 -206 92 -15 -33 -74 77 134 -278 152 222 135 4 124 -107 225 -150 -8
3701 -8 -124 180 -25 88 -48 -102 51 -3 24 -202 198 91 -19 -49 -21 -33 25 -26 105 -208 136 25 10 139
3725 139 -216 -163 -8 34 -91 44 25 -17 -125 -216 -117 40 -131 -79 -59 -132 -2 109 -24 -29 -195 -74 23 45
3749D5l04J66m8O1K87k38K49J49j64j62j66J28M2p1L9Q8o5J56j46N2k60m4K11
3772Ej87K09m2J21o7J23j59j39K07r1k2J10K58l53j5j98J91k54K41N1J79j96J69
3795A41j96J16j60J38o3o6k03K24J4P9J83j09j91K79j74m9nJ3j82N10k14k58K19
3818D6K66k90j82P7P0O8o2o7r5J12K04J15l28O7j81J98k40K21Q9j01k7K9n2J09
3842D6K1k4p4j24L75j27j06K87l94J93k01Q2M18m49Q5J01nk16J20J33k43j16K91
3865G3J89k00J12m5O6k27q0K33l73K16r3J09J34k44LQ0r3J63j19J22k40K15N6
3888E7l5R5o6j84J66lj58M9J32o2l4J7K66j11kL2j1k03J85j30r3J31P8k11K29
3913A34Q9j72j21Q5l62K83P9o2R3j85P8M0M1mL2lM1k04k2M0K49k35R9j50J5%J44
$$ plain form
3749 45 -259 -93 -141 -80 207 -31 218 367 203 41 -125 3 45 -26 13 101 36 192 46 98 -162 -206 5
3772 5 -182 27 -15 106 39 162 3 -136 71 -20 -42 68 326 -27 -42 -240 -49 -303 -62 -11 168 -28 141
3795 141 -55 61 -99 39 -24 -90 -293 -69 -55 24 207 98 -93 186 12 -37 -42 -29 -211 299 85 -173 46
3818 46 312 22 -160 -83 -13 55 -7 -74 -169 -57 147 262 -66 1 -180 18 -222 -1 88 -13 -40 -11 -63 46
3842 46 67 43 -31 -155 220 93 -13 274 -120 73 -128 -46 372 -77 8 109 104 -112 8 141 -102 -218 73
3865 73 262 62 174 129 195 -32 -112 121 -252 -36 -129 -20 114 -130 -127 -47 -140 23 -96 26 -214 1 57
3888 57 22 117 51 -133 33 30 -128 -79 53 -9 -43 -26 240 129 127 159 148 -55 130 0 -93 38 116 -95 134
3913 134 223 51 -70 15 -347 -64 15 -47 46 -139 -61 -21 20 16 48 45 86 -118 -140 -100 149 -86 13 -137 -122 -122 22
3940B2L1j67J29j24M2M8M6J9l4J8j79J60k15J00J25j53J65KJ28j76No2pO6k8K7
3966a2J46K6Q0n03J35K2J05P0L8j43K48k30L4J23m33L32o2p5o7M3Q9n3K36p9p8
3991hM2k95K24ql33O07k7l20J25l8J61n1L7J0l67J82N6J21j7k68P7K73l41L85
4015B27l49R5K15j39j14J00r7L06p1k67R8n5N1k1j4J7K46j03K57m81j68L66l22
4038b23K61n9oM8j40J36J81k63R4p7Q4o5P8j35M7L9j10K6P9J4n0q8K97j31j47
4063a10O4q8Q5oJ41k39R0M8J82j18p5K05k30o8k40N44N0k12K8k56K30J38o6M4
4087A41p5j82J73l1qJ44l80K25l4J03j17r9K14K2K30m56J93K17k32k82M81k56
4109io2K12n0k40K03j36j58J42K29r2m2k1J3j07j6J46j1N5J2j92K10m08L20k8
$$ plain form
3940 22 53 -114 15 -109 -67 -19 27 46 12 30 -149 11 -204 -104 21 -132 33 35 163 -13 -8 -70 -77 -11 -39 -12
3966 -12 134 160 240 -263 -128 -106 -1 69 107 -36 212 -18 16 139 -294 38 -24 -99 -166 -123 -34 -87 149 70 -8
3991 -8 34 -261 -37 -45 -378 229 202 -118 7 -31 130 79 116 126 -241 -59 -3 118 101 -167 -90 183 -158 227
4015 227 -122 -27 188 49 -65 35 -62 244 173 -94 4 -51 0 -21 -35 -18 228 125 382 -99 -267 99 -223
4038 -223 38 -21 -27 21 -119 17 198 -65 29 -48 36 -29 49 -86 -39 0 -110 -84 -5 9 -41 -129 168 37 -110
4063 -110 -46 -134 -49 -55 86 -153 -63 -15 167 49 -26 179 -51 -119 -359 185 235 23 51 -205 25 163 97 141
4087 141 66 -116 57 26 18 162 -218 7 -27 76 -41 -140 74 96 326 -130 63 280 48 -234 247 -9
4109 -9 -71 141 91 -149 54 -82 -240 -98 131 39 -3 -24 -11 -118 -134 12 1 56 68 -124 86 -322 -2 -30
4133c0o0m5J08J35j05k7p5J49N6J7j42J85l29J5J81K97l47K47j06o4K6r4nj14
4157a27J42N7p1J60j64Q4Jl53L69J58o0j62j38J99r0k3l35M97j18n7l0m1k6J37
4181IN6k00P3Q4O2q5k19O3R6J14N8j50m9N6K90j40k2m08K97n7K29k53K60k2m9
4206I3j45j41K43M6j38j67M5j4K68l2j50J26j53L33j01j41j47J72n8J39j87K59
4228A50J0j97l9J00J38l9k5K4k23L21j24k63L92j64p3m1J58p9o1o3R3R6j9k44
4252a72K0L09j15pP5j10K7J06n7l75J57pL6K7J16O3k16K16J63j62O1k10J16j67
4276a06J70j85j02J65l29L21nO7O8O7K8l00J12L3q3J3K0o2l5M7J61j15O4P4J48
4301B36l78K03j59l1K02j98m0J22j31J55K11j26m4R1l4J6p6K79o56L54K8J50l9
$$ plain form
4133 -30 -90 -135 -27 108 3 -24 -99 50 106 123 -19 166 -163 -148 33 330 -17 230 124 60 86 -8 -13 -127
4157 -127 15 72 1 161 -3 81 82 -271 98 256 196 34 -104 95 5 -18 -353 144 26 -31 -61 -102 -128 9
4181 9 65 -135 -62 22 84 -1 -220 -157 -61 53 111 -39 -88 -32 258 118 96 -312 -15 -72 157 -96 164 142 93
4206 93 -52 -193 50 96 -42 -209 -164 -178 90 58 -92 34 -119 214 113 -28 -175 -3 -61 78 -109 150
4228 150 160 -37 -76 24 162 123 98 122 -101 220 96 -167 225 61 -12 -53 105 26 -35 -98 -5 91 72 -172
4252 -172 -152 157 42 35 110 0 27 133 76 -299 -142 -149 -113 -86 30 93 -123 93 256 94 155 -55 61 -106
4276 -106 64 -121 -223 -58 -387 -66 -71 -4 64 131 159 -141 -29 4 -79 -66 -46 -108 -143 -96 65 -50 14 88 236
4301 236 -142 61 -98 -129 73 -125 -165 -43 -174 -19 192 66 22 113 79 95 19 298 -358 -4 24 174 135
4324A35k73R6r9P4J51p0j31O4K6l5j13K29O8n3j42O2j77J04jk32L37j78J27J19
4348H8k35K29k42M50m01j9J88j28j0K55J38l00J90j47j34L5j24O7J08n6n3K19
4370A18q9J50j51P0P0n2p3j58K12k04J75l5k85J69J66j6k31k5J33o2K01N2j37
4393bN1m7k47J22K38k05K73k33J20l11L20J67l72p9J02O9p9L13m71M21p6l6J06
4416A44j84j11J66k13L18l71L61l97K71j1j97J71J23L8j09j34K57k65K21j9qK35
4438B86m30J13kK2J22Q0k66K15j20n9l2j01R4N3L1j24j74M41j43q8o1J07r0J25
4462aK75m76l6J49k0o3p1K48l03N12J18l63L39j84l46K92q6J4j21J53P6N4m76
4485c16M22j01o0J64m7j09O0K30k11j44l7L75l35q1K86J26k54J5j88M36l82j2
$$ plain form
4324 135 -138 -42 -141 -67 84 14 -117 -53 -27 -62 -175 54 122 69 -73 -11 -188 -84 -85 -317 20 -158 -31 88
4348 88 -147 82 -160 290 -111 -130 58 -70 -80 175 313 13 203 56 -78 -43 -167 -100 8 -48 -101 118
4370 118 29 179 28 98 168 116 43 -115 97 -107 68 33 -252 -83 83 67 -164 -189 -56 -118 83 135 -2
4393 -2 49 2 -245 -123 115 -90 183 -50 70 -241 79 246 -126 -205 -103 -34 -113 200 -271 150 74 38 144
4416 144 -40 -151 15 -198 120 -251 110 -287 -16 -27 -224 -53 70 108 -1 -135 122 -143 78 59 51 286
4438 286 -144 -31 -33 -11 111 191 -75 140 20 -39 -71 -172 -78 -25 6 -118 -292 149 6 -82 -143 -36 -126 -1
4462 -1 274 -202 -238 -89 -109 -172 -243 5 -298 214 332 -31 308 124 -222 70 -16 -2 -123 30 106 160 -316
4485 -316 106 5 -55 109 62 -47 13 243 32 -112 -149 226 -109 -190 96 222 -32 -17 -205 231 -151 -163
4507a63N9oL7JL7J09J43k72M5Lm3J30j48L07k32J39p8Nk60L02j33J31J74l59M14
4532C42m22r4J89K00j82j37jQ8K4J53l50K75K3j38J98j77l21M60K9J5k00M3J37
4555A54q1M1j53J81j88j13M3N7j26K1j22J96J57j16O1kj12mLK8l2J12L49l67P1
4580E8K09k61p9r1J68n0j6L37j79m4j80J17j81%J22k8K77k20K27l44R3K22j39
4603A8k0KJ6j30K28l5m46M31r3M4L3p1J13l58K96Mj27p2J46n3J90j32O7l04K61
4628HJ98k20J9o7K1J94k09l0K04j13n3N3%JK09k62j7KN7K09j97k21L48k68J02
4653c2J7L13k36J28j18k39J04M7n2J49o8J2K33l25Kj09L30j69j9R4K4M2J13j35
4677A06j81K57o8j03oK09m37J73K44r2j50J2L29m40N7K17l02M15l99L42l58K5
$$ plain form
4507 -163 -104 -110 -73 -72 -35 74 217 -55 -10 -7 -50 80 -68 239 7 146 68 73 -187 115 -18 113 287 -72 342
4532 342 -80 -174 15 215 33 -104 -105 -17 7 160 -190 85 108 -30 168 -9 -330 130 159 174 -26 17 154
4555 154 73 114 -39 142 -46 -159 -116 -59 -185 -164 -286 -90 67 -49 12 10 -102 -106 -103 -75 -107 5 354 -13 58
4580 58 267 6 -73 -164 4 -46 -62 275 96 52 -128 -11 -192 -192 -70 -98 179 -41 186 -158 -65 157 18
4603 18 -2 0 16 -114 114 79 -367 64 -29 15 48 -23 90 -268 28 32 -95 -167 -21 -74 116 -16 51 -253 8
4628 8 206 -14 5 -62 -41 153 -56 -86 118 5 -48 5 5 6 215 -47 -64 -62 -5 204 7 -214 134 -134 -32
4653 -32 -15 298 62 190 72 -167 -63 -16 -68 81 13 25 258 -67 -65 -174 156 -13 -32 62 86 128 241 106
4677 106 -75 182 114 11 5 214 -223 -50 194 102 -48 -36 293 -147 -90 127 -175 240 -159 183 -175 -150
4699a50J50j24R4j46K77o8Nk45J99J55l67K50k64M10k96J44P0l28M07j44J26k38
4721h3J34k25J45n9J49J80l16J87l10L71k66K7L01j28J87m30J71k4J18J07k29
4742GK20m74K63p2j0J46j21J25k92L53p1j80K29MJ31j74m55L55J0k02J72q2J49
4765C1lJ60Pl53L63k30J3j27J20mo0oo6P4K25j95M6L3j73L16l11K07J52j57mO3
4791A21j17l4m2L4J04n0K7P3j70P6j5j08J02j76J52K11j0Qj77K17j92O7nl7L2
4816I1jj73K39k0j5Km8l8J24k55L6m3LJ9M9K03P1l93J33K82k41j36K8J08Q3P5
4842A83N6j4j67j86J51j50L12r7k92k2K19l1l2J23Q2j3k46J17r9K29l70M79j17
4865A15jq8J94l29Q7q9J69j07Q2Mj00r6J02J16k43J09J15Q8J27j75k24L29j69
$$ plain form
4699 -150 0 -124 -30 -176 101 33 38 -207 -8 147 -220 30 -234 176 -120 24 94 -234 173 29 155 -83
4721 -83 51 -174 -29 -88 61 241 -75 112 -198 173 -93 -66 235 107 294 -136 35 11 129 236 7
4742 7 227 -247 16 -56 -66 80 -41 84 -208 145 74 -106 123 127 258 84 -371 -16 -6 -208 -36 -118 31
4765 31 28 188 195 -158 205 -25 -12 -139 -19 -23 -83 -89 -155 -81 144 -51 -5 28 -145 171 -140 67 219 62 58 121
4791 121 4 -30 -72 -38 66 16 43 116 -54 22 7 -101 1 -175 -23 188 178 186 9 226 34 101 96 59 91
4816 91 90 -83 156 136 121 123 75 37 161 -94 -58 -101 -98 -79 -30 173 244 -149 -16 266 25 -111 -83 25 108 183
4842 183 239 225 58 -128 23 -127 185 88 -204 -226 -7 -38 -70 53 135 122 -124 -7 -106 123 -247 232 115
4865 115 114 26 220 -109 -22 -111 58 -49 33 37 -63 -159 -57 59 -184 -75 40 128 255 80 -144 185 16
4888A6j88M21k49j3l40K86P6J01L0k83J3k1L01j13j15p8J78Q9l5J3j06m8J55j37
4912d7L38m37J67O1q8r7K61j5J11n4k97L44k06J21k38J7J07j98M43l61J97r1K77
4935C15k53k34J81r8J36M7l42K0K80o7J23j18J2M8M6j16j54J69J33j18l59M68
4957A19L5j33K0r8K28k17mq7J00KJ39j57M6J12j71L48k11k91J10R9J69j50J93
4980B01n6N3n7k16l4j08J95j02K44j44J6J8m3n9J09q9o3o5L16j7ml84M18j99J98
5005A28p7J47O0l17jQ7K3n0j48k5L72k73K23j72J83m72L31Q2o0K8k86M05l57J81
5029A2Q0K2j16k42J97N2Q1j86J44l6Q4j01J58j07l26L48o6r9k19K80J20l28L16
5052F8r9pJ39r8J40j50L7j60O8l8L3J82m60M09k69J42j9J18k1L8j38o1N6j29L67
$$ plain form
4888 16 -172 249 0 -13 -353 -67 9 110 140 -143 -130 -151 150 37 -78 -156 22 111 76 89 -17 -65 90 -47
4912 -47 291 -146 21 82 -6 -103 158 143 254 200 -97 247 41 162 -76 -59 48 -150 293 -68 129 38 315
4935 315 62 -172 9 -89 47 94 -248 -228 52 -15 108 -10 2 50 96 -20 -174 -5 128 10 -349 119
4957 119 154 21 41 -57 171 -46 -50 -137 -37 -35 104 -53 -7 105 -66 282 71 -220 -110 -11 158 8 201
4980 201 145 198 141 -75 -109 -217 -22 -124 120 -24 -8 10 -33 -92 17 -72 -135 -200 116 99 95 -289 129 -70 128
5005 128 51 198 258 -59 -60 27 50 0 -148 -173 199 -74 149 -23 160 -312 19 101 41 69 -217 188 -169 12
5029 12 92 114 -2 -244 -47 5 86 -100 44 8 92 -9 149 42 -284 64 -2 -101 -320 -40 80 -248 68
5052 68 -31 -38 101 3 143 -7 30 -130 -62 -100 -67 115 -345 64 -205 -63 -82 36 15 53 -85 -146 -90 -219 148
5077A48k71N3J61m8l14K37j46M91m15j50K60J03m13M59j85J12k1J75n3j58M7j01
5099b9l6nP8L7l5nq7j0j9K12l30L72j5k22P4k04M11l48K00j49J57k61N11l15L0
5124A2n0k97J75K09L15m30P0K4j41K10k08J86P6k1k53NJ46J01Pj70J15JJ50k90
5148e8j38O0K09l9j05k19N41n1k53L9J94j81JJ42J4k90J2pRK45j26J70m20K93
5172D2n1j36K50o1o9k9K12J00j89q5p7J28j72K59m21M57k08K78k73M8K43k18J67
5195A95m09K54N2J57j3k96J88j59M4Qn6K15j76r3j38M11j48k78K20J84j42N4M4
5218A18j54O8J09k37O2qJ18n8j52KM1J41J69k6j74k44R7L29p6o7M3l5Qk51K04
5243B7K5j66J63J43n16M12j00Q2r1o3M3j07K23j37Q0j47L6K87k93k22K60K4Q3
$$ plain form
5077 148 -123 -70 91 43 -271 -34 -180 311 -104 -254 6 109 -304 155 -30 82 61 236 183 25 72 -29
5099 -29 -65 -70 8 45 10 5 -82 -92 -111 101 -229 143 128 -94 -20 -224 187 -161 39 -110 47 -214 297 -18 12
5124 12 -38 -335 -160 49 364 -66 4 28 -113 97 -111 75 151 130 -123 -118 28 129 136 -34 81 82 232 -58
5148 -58 -196 -136 73 34 -71 -290 251 200 -53 -14 180 -1 0 142 156 -134 -122 -129 -120 125 -1 169 -251 42
5172 42 -9 -145 105 44 -25 -54 158 258 69 -16 -93 35 -137 122 -299 158 -50 228 -45 3 246 28 195
5195 195 -214 40 92 249 236 -60 128 -31 13 21 -35 180 4 -89 -227 184 36 -242 -22 162 20 74 118
5218 118 -36 32 141 -96 -34 -42 76 18 -134 -132 -91 50 219 193 19 -225 -128 201 125 58 101 66 74 -177 27
5243 27 52 -114 49 192 -324 88 -12 70 -21 -84 -41 -148 75 -62 18 -129 -93 194 -99 -321 -61 -37 46
5266D6n4j60K09L9j48m0J32k22K42l45L91m4J65k32Rq1J11K32l17M4K41n11K78
5289a5J78k28J67j09J44k00L4j3j29J16J40j01J19k72O2J0R3j91K38Pp4M2j34
5312a16L16l68J53K93k37n8n8K71j20j0m4Q8k28k40K81LP0k2j12q7L47r6rj97
5336a80R9J55j52J38k06J8J63J17j78K88j12k12mQJ62r2j24J02k65M78Nk50j52
5359a94N1J36J38l87K89o3K6N5j20J51q2j05K64k79R5j4L18k92Q9J10n2o3O5r1
5383D5J7j37K19j21k1L36n53L32R4j63K4M2j65q1K42k45J79O9k74K57m6j26J23
5406D7j95L3K72m4k93j28O34l58O3J7j55J02L9N1j00o4J53J42k29J76l16O5O2
5429b6P5l33J90K04M6m0O3k81N1L7j5J71k86L9pJ93N6k81j01J75P3r0K59j5m9
$$ plain form
5266 46 -8 -168 41 80 -68 -108 24 -198 44 -301 90 46 211 -21 -12 -93 18 250 -67 -23 218 -293 -15
5289 -15 163 -65 102 -7 137 -63 -29 -42 -171 -55 85 -16 103 -169 -107 -97 -4 -195 43 50 -24 18 -116
5312 -116 200 -168 -15 278 41 -17 -75 196 76 66 22 110 -118 -358 -77 -74 -4 -26 -138 -225 122 26 17 -180
5336 -180 -81 74 -78 60 -146 -128 35 152 -26 262 150 -62 -66 -58 104 12 -112 -10 -275 203 208 -42 -194
5359 -194 -143 -7 131 -256 33 -30 -4 51 -69 82 0 -105 159 -120 -25 -39 279 -13 76 186 134 71 136 45
5383 45 62 -75 144 23 2 338 -215 117 211 48 72 114 -51 -132 110 -135 44 113 -161 96 50 -76 47
5406 47 -148 -115 157 113 -180 -308 326 -32 31 48 -107 -5 34 85 -15 -79 74 216 -13 163 -153 -88 -26
5429 -26 49 -284 -94 110 156 116 179 -102 -51 -14 -29 142 -144 -105 -112 81 137 -144 -245 -70 3 -87 172 157 108
5454A08j56R7L7k35J10J05m5L19k61J60m58j0Q3J35j40M90n11J50J05Rj41O2R4
5477A07L1l31L66j19n8K2K4J5q1J3l4jN0K0j70J54n8q5Q9k2j20L06l1l30K40J77
5503A74pk60lQ1j83L43j33l3M4k62M81k90o5k07L51J72l38LJ24RQ5r4J4K8Q2j63
5529d7N9K6r1J30l18L43o6RK33k93M4j54J54l0j6o4O0J07k02J34j91L32l19L75
5553B15k90K14p6j71K18k52J73l7J61j15R9L1j02p7p8K05j1J89n2k15j97M6L2
5576i0J97k67K89j54pP8q9J78m6P3p3l38K96J5K0p5N6J57n2J48k28k19K29j82
5600h4J42J4J57k86k2K6J45j36j28J47O1moJ08j37l97J25J22L6l1l8J96R5nq3
5625A7j16J8J09j55K22r0J07j85J53k62L62j08j36j14J36J55j46l3r9M24m17J86
$$ plain form
5454 108 -48 49 86 -149 -39 66 21 340 79 239 -219 -229 -146 -11 -151 339 -172 -22 83 92 -49 13 107
5477 107 138 -193 173 54 -4 18 42 57 -24 -11 -45 -46 4 24 -146 8 -50 -135 -46 -68 -188 118 87 -243 -3 174
5503 174 167 -93 -96 -15 -198 145 12 -21 23 -239 242 -48 -113 -320 31 203 -135 -132 -8 1 86 -8 6 34 116 -47
5529 -47 12 38 -53 77 -241 102 36 45 278 -15 29 -125 29 -1 -17 -81 -21 86 -116 18 -173 159 -160 215
5553 215 -75 139 63 -108 110 -142 31 -6 155 40 139 170 68 -9 -87 118 107 296 244 29 -168 -122 -90
5576 -90 107 -160 129 -25 -32 46 -43 135 89 162 89 -249 47 62 82 7 63 220 168 316 88 -131 98 -84
5600 -84 58 72 229 -57 -79 -53 92 -44 -172 -25 36 32 26 134 -3 -400 -275 -153 -117 -148 -186 10 105 100 17
5625 17 -99 -81 28 -127 95 5 112 -73 80 -182 180 72 -64 -178 -42 113 -33 -66 -165 259 -158 28
5647B8j63RMJ39K09j16n5k28K59M5j34q4Q9j59L54j81j68J59j56J04N3n5k68J93
5671a22J37R5j88kK4J21mJ5k1j10K53l66K02j44J12O9L15k45j91L2J32k4K00p6
5695B14j6mj18JK22k20j03j11R1J49k6j32k44J76Q8K09p8r8p4K10j78K29l06Q0
5719c9P4Kj6J13j66nRL8J27j75J13j68K80j40r3P9j09J1J5Q6l7r%j50J34m3k7
5746i6m3P0O6J79k2k59L1PJ31n1O8j71J26O9Qk07J34O3j89j19K96k59J82J36j89
5771c9K6K0Q9M6k3l1J45j89n6J85l27K96j51K26k23L1p4Q3n7k04K76l09L94j50
5795a6j59j72K65K00J16o5K3ro1J2j63K4J18L1o8P6l27J23K96l51LJ09pk7J67
5820A38j8r6j68J01k87M12l55L51J1J16l1p9k08J71J2J14j6k92L92n79M26j57
$$ plain form
5647 28 -135 -126 -122 17 226 110 55 -173 86 131 -3 -87 2 -157 197 16 -152 7 -149 -45 8 -47 -315 -122
5671 -122 15 110 -78 -80 -56 65 61 76 55 -55 198 -168 34 -110 2 71 386 141 -50 -18 114 90 290 214
5695 214 198 194 76 77 299 79 -24 -135 -44 105 79 -53 -297 -121 -33 176 98 0 -74 136 -42 187 -119 -39
5719 -39 35 37 21 134 -32 -37 -28 10 137 -38 75 -93 187 47 -46 33 -76 -65 -50 36 -1 -10 -10 -160 -26 -69 -96
5746 -96 -139 -69 -3 176 154 -105 -74 -67 64 13 81 -90 36 105 113 -94 40 103 -86 -205 91 -168 14 150 -39
5771 -39 -13 7 96 142 119 88 233 44 -12 173 -154 142 -9 217 -6 25 -49 34 -23 -227 49 -260 134 -16
5795 -16 -175 -347 -82 118 234 169 192 183 122 134 -29 -5 113 144 76 152 -175 -52 244 -107 -104 5 -2 -29 138
5820 138 120 24 -144 -43 -330 82 -273 78 89 205 174 95 -113 58 70 184 168 -124 268 -311 115 -42
5842d2Q0Q9k41J26O2q5K77l07R3On5j57K58k05j14J87J73k26J29J25j60K20p9
5865A54n7Q0p7l52K26K56j13n2k32K83M3j7j01m7j22L9R9j53K03r5j00L11j51
5888B5q2J26r1j9p9J65j1K3j41p7L34l40J38Q9q2m8L5L14m25L12l26J23R2M1j41
5913d5p8J88q1MP2mJ07j90J50k79L1J61m1O9m9m8r1J97j1J8k10K96r4l31M38l21
5939a42K85l27o9J60p4M3L2J20k03J56j34J24J67j67k3ML61m08J83k6J14k44j49
5962b17J41l2j17L23Q2j13q1j51K16k73K52k55K39Q5P1j56J33L0k89P4J06k13
5984a45N3L60j56j81J34j2j33jM9n1Q7J36m5J3j17p9K5J36l3R6k96J89P5OK6r2
6010D4k29J78J11q1l60L42J15j27O4j07o5k1K88j83J16l0l19M26l79L57J06k77
$$ plain form
5842 -42 38 127 -114 12 74 -11 266 -41 52 58 3 -154 104 -101 -215 -28 145 -81 48 173 13 233 154
5865 154 97 177 100 -252 -26 230 117 65 -167 116 159 142 41 -6 -128 -89 10 -143 60 -35 -135 176 25
5888 25 -57 69 -22 -41 -120 45 34 57 -84 -161 173 -167 -29 60 -22 -70 -35 279 -146 166 -160 -37 55 96 -45
5913 -45 -123 65 -16 -12 60 56 163 -27 123 -156 -125 36 -5 64 15 -33 -124 73 62 80 -130 166 72 -259 179 -142
5939 -142 143 -184 -253 -93 -167 -124 -92 28 -175 -19 -153 -29 138 -29 -52 -48 313 -95 88 62 176 -68 -217
5962 -217 -76 -108 -225 98 180 67 -14 -165 51 -222 30 -225 14 99 170 14 147 177 -112 -38 68 -145
5984 -145 -92 268 112 -69 65 53 -80 -81 -32 -83 4 140 95 108 -9 -88 -63 73 40 136 -160 29 104 110 136 44
6010 44 -185 -7 104 23 -337 5 120 -7 57 -50 -115 -136 152 -31 85 55 -264 162 -217 140 246 -31
6032c1kJ04n0m4Q7k3R3n0J01p0j71Q5J8m4n6J63k6j88J68j16J60k62N1J5P8j96
6058b06J24o6J38L03l91L53k06j56n5L12k72j33N67m75N3J27j62J07M7j58L73
6079B24l39L40j36k5P1l12J36J06l12l4L65k00K03n0O1J2j92K1k5J79M6j91M7
6102eP4r8O7P9r8j40L18k75J53J6J0j88L0l25K59K2K37l3j98J24k14O8L98l85
6126a04Q2j74L47j23L4j07Q3L6r5k45N31k88M7m2k07J70J30j51l9K05K4j60m9
6149i5K43j68Q7o2J52Kj49q7p6M4K1K27k69j62L59l58M96k67J54m7m5Nk61M16
6173A60o8r4Q3J3k10K46L0k83J73N5n0p5q2J37J92k85M6q0J5n5K13j34j35k0K41
6198C3m2J4j76J21K58k74J92J2j84k71M00k40J46J15j46o7%J5N1j4L28m62L5P0
$$ plain form
6032 -31 -33 71 21 -23 64 41 134 84 185 115 -56 29 47 3 -53 110 84 -104 64 -52 108 -154 -103 -88 -10 -206
6058 -206 -82 -148 -10 293 -98 255 49 -107 -162 150 -122 -255 312 -163 -110 17 -145 -38 9 -149 224
6079 224 -115 225 89 64 135 -177 -41 65 -247 -281 84 -116 87 37 98 110 -82 -61 -86 93 139 -52 -5
6102 -5 69 -29 38 117 19 -121 197 -78 75 91 101 -87 -57 -382 -123 -101 136 103 -95 29 -185 -117 281 -104
6126 -104 -22 -196 151 28 62 -45 38 74 -21 -266 265 -23 24 -18 -225 -55 75 -76 -115 90 114 -46 -95
6149 -95 148 -20 67 5 157 159 10 -77 -153 -109 -88 139 -130 -292 67 -291 205 -62 92 45 0 5 -256 160
6173 160 92 -2 81 94 -116 130 160 -123 50 105 55 -20 -102 35 227 -58 -12 -92 -77 -132 81 -53 -188 -208 33
6198 33 -9 5 -171 -50 208 -66 126 138 -46 -317 83 -157 -11 104 -42 -109 -109 -94 -43 -57 271 -191 -156 -86
6222h6M4jNq4L40k14Q7j17P5j22P1Nj95J45J96N7j53J9R1m46oL31J3K58k71k99
6248b57M64k73n4J51j10j10Q9P6o1M1%n9J35o8MJ10m9m6M0J7M9lR4j4l49R6R3
6275FP1n7j22m4Q0R8J20k52J22j10P4j61K95M4j51O9j37Q5K64n88K17J0N1r7K
6300a11J21o6M2J20J28M4k12K38k98k69J47L74j11l91J23J04j76L79j01j76K22
6321A31k07L1j48K28j55j47J88K68l34K21k2O1j67j39l9K40RL0J97l98J45j69
6343a76L51m66N2N91j87j03J17j59k6k68M42Q0j79R3k86K92j23o8K7Q8R3k89P3
6366c1%KJ57n6K82l67r5J68k20J97n0L2K0mMk00K37k6N3j91J83l3J98m00L83l25
6392h2K49j3j12J39j66M0j50J26N4j72J41o9J28k67J31J80m1j94j34J58qJ73q5
$$ plain form
6222 -86 -42 -43 -38 -122 218 4 91 -26 49 -73 -2 3 -192 -47 149 206 53 72 163 -283 -289 42 55 313 42 -257
6248 -257 207 -66 -120 31 -79 -189 -100 -24 -85 -44 -44 -103 32 -36 -32 78 29 -17 23 40 89 86 180 166 -183 -87 6
6275 6 77 20 -102 -146 -66 32 152 -100 22 -88 -14 -175 120 164 13 82 -55 30 294 -294 -77 -67 -16 -113 -111
6300 -111 10 -56 -14 106 234 278 66 304 6 -263 -116 258 147 -244 -121 -17 -193 186 85 -91 131
6321 131 -76 -45 -193 35 -120 -267 -79 189 -145 76 54 115 -52 -191 -230 10 19 49 246 -152 -7 -176
6343 -176 175 -291 -239 352 165 62 179 20 -6 -274 168 248 69 162 -124 168 45 -23 4 92 185 -104 -31
6366 -31 -31 -29 128 72 354 -13 -108 60 -160 37 -13 19 39 35 39 -161 76 50 103 -88 95 62 260 -140 243 -82
6392 -82 167 154 42 181 15 55 -95 31 85 -87 54 -15 113 -154 -23 157 116 -78 -212 -54 -62 111 26
6415B6j0l00L99n4k48J49J04J22l88K93j63k2L0L73l26j39K59l61J08J57M0k07
6437a58j4K46L9O4k68J48K7k10J87O6k61J40o9j3J56j32l9l6o7M23j18k87J45
6460c1j54m1K17J96l8j00j53j87L38j17J27j37J8k10J88J09O9L3m0r7k1n1J49
6483F7j42p2J48j15Q8j96L60j77K16J0j14R4r6l2j67j0L5J90J46j92r3L8j03J45
6507B8J37k05o3K95j77K09M9l8j93jk41J51J04O9j40lK53k35J78k98J75j99K92
6530A47k80K34m5JJ2k48J42j36L53j48q4R0r1k74K32nj11M45k0j12J33n01K61
6553eqq0j6o3K37ok14L44l54R7O6P1r7J20j25L03l83K5m0oJ65j68N1J56j9O4j35
6580b0R1j39j61L92L2j40k00L9M0K3K9J09J05j34k0j19K03k47o7K32J1K8k70L09
$$ plain form
6415 26 16 -284 115 61 -187 -38 66 188 -200 93 -70 -92 -62 311 -15 -154 105 -256 -148 9 49 -158
6437 -158 -172 74 113 177 -91 57 84 -126 61 127 -134 6 -63 -76 80 -52 -91 -127 -194 229 111 -176 -31
6460 -31 -185 -226 -9 187 149 49 -104 -291 47 -70 57 -80 -62 -272 -84 25 94 127 87 -10 -31 -82 67
6483 67 -75 -147 1 -114 -26 -222 138 -39 177 187 73 167 71 39 -128 -138 -103 87 233 41 -52 -14 -117 28
6507 28 165 -40 -103 192 15 224 273 235 42 41 -200 -49 55 124 -16 -19 234 -1 177 -121 54 -145 147
6530 147 -133 101 56 57 69 -179 -37 -173 180 32 -52 38 -53 -327 -95 -100 -211 234 214 102 235 -266 -5
6553 -5 -13 -93 -109 -172 65 59 -155 189 -165 -68 -2 69 -28 92 -33 270 -113 -88 -128 -134 31 -137 -86 70 51 115 -20
6580 -20 71 -68 -229 163 195 55 -145 -106 -66 -43 -14 95 200 66 46 -73 130 -117 -184 48 59 87 -183 126
6604A26j77k40K10l3J37j37O4Q4j88J58R6j9j62J19j2k85L20k74J45m6R6J07L7
6627A26j22J24JJ07l73O2n5K8K0qJ56J19j99k53J89j4Q8J03Qj02P6k02K86p9J4
6652A00n7j39P6M5j78J97j09J63j6J3m0k25J10p2M2n3K52k19J69j78p5r0M28l53
6676b09K25Kjk73K54P9k36K27r3l1M1K97l84m4k4P0J74lj08J19j70J52J0m46M15
6701D3j5O5l82L74k13K67m0l6j26j05L79l98K44j77J72J32j66Q0l5k01J87oq3
6724d0J67m36L77n2J81k91J57l2j51J70p0J47o2j23L02l29l4J35r1j26J65L0J50
6747A44j84K42k14J55j9k19K38m8l52J41K69k14PJ25R1k33O4J23k15J25l1J64
6769A59n0l18K88j09J5p0k8j30L53k39J03J59k29J50n9O1O4j50j7Q6L5%K8r8O5
$$ plain form
6604 126 -51 -291 -81 -114 23 -114 -50 34 -154 4 100 81 -81 38 26 -259 61 -213 -68 -114 -18 89 126
6627 126 4 128 129 236 -137 -75 -130 -102 -82 -90 66 185 -14 -267 -78 -92 -4 99 107 5 81 -121 165 86 100
6652 100 43 -96 -20 25 -153 44 -65 98 82 95 55 -170 -60 -132 -90 -143 109 -110 59 -119 -194 -284 144 -209
6676 -209 16 18 17 -256 -2 77 -159 68 -25 -56 -15 282 -102 -146 -170 -100 74 71 -37 82 -88 64 74 -372 43
6701 43 28 93 -289 85 -128 139 99 63 -63 -168 211 -187 57 -120 52 184 18 98 63 -138 49 43 -40
6724 -40 127 -309 68 16 197 -94 63 31 -120 50 -20 127 65 -58 244 -85 -119 16 -75 -201 -36 -6 144
6747 144 -40 202 -12 143 124 -95 143 95 -257 -116 153 -61 -54 71 162 -71 -7 116 -99 26 -5 159
6769 159 109 -209 79 -30 -15 -85 -113 -243 110 -129 -26 133 -96 54 -5 56 120 -30 -47 39 74 74 102 4 69
6794F9L8q9j1J73k01M1J4K2j9j9n1M1N7J66m47K94j47J45J5l02R8l4J91J24l6
6819A32j37Rj34Q3oJ36j37o6j66R5L22k01j13J37J81k71K71m54L09o7J52Rk35
6842a51M1J47m4k9Q2j30O3J44k72M40l97J7J25j18k1M56l03l8N1j45m7J33K2J8
6866D4r5R6j9k16L30l03K06J99l87P1L24k98k9J84q5k0P2n7p3l2J11J79j19Q4
6890A67k04k37M00j76J1p9K74j89m6J85p4k95M4J76j7K22L6m70K93j36m7J70J61
6913A69k97N9k6P6O1M5p7l1q3O00n32j01K7J02Kj30O8Q1Pk79R3P6K26l83K34q3
6939i6j6p6K48j08K68j86R2r6l20L06k24L67j82L3P7k14K8J76j82k85O64k5k10
6962C9m3j98J39Q6p1R9k36J36o0K90j44Kp2J88l19L31j34On3J74l34K16o6O9m07
$$ plain form
6794 69 107 18 7 180 -21 20 34 56 37 18 -33 8 65 231 -216 78 -69 76 91 -211 -113 -147 44 168 132
6819 132 -5 4 -130 -47 -53 83 -54 -120 -286 -191 131 -70 -183 -46 135 -136 135 -319 -10 -77 75 84 -151
6842 -151 -110 37 -7 -36 46 -84 -21 123 -149 291 -106 -89 36 -82 -103 353 50 12 63 -82 -129 4 26 44
6866 44 -51 45 26 -190 140 -163 43 242 -145 -74 250 -48 -77 107 22 2 74 17 -56 -88 23 202 83 167
6890 167 -37 -274 126 -50 -39 -118 156 -33 -79 106 32 -263 -219 -43 -60 162 198 -272 21 -115 -162 8 169
6913 169 -128 -69 -95 -19 42 87 10 -21 -104 496 -36 -137 -110 -8 -6 -136 -68 13 20 -259 -166 -90 136 -247 -13 -96
6939 -96 -112 -188 60 -48 220 34 126 30 -290 16 -208 159 -23 10 87 -127 -99 77 -105 -390 274 249 39
6962 39 -4 -202 -63 23 -48 51 -185 -49 -109 181 37 39 -33 155 -164 167 33 39 -14 160 -174 42 -24 45 -362
6987c62M51k64K31j50L93k33k18K88j25K43m04J69N0l8K07j26J00l85kL95l48
7008a28K2J95K18k78k63J38J21M1l0r1J10n1nJ38m1l38K19K60k2j72j41K21o3
7031F0j13K33J04m23J16K4O3j07p2L96n85K0J0J15j9K32k77K00j6J29k0k5j57
7054a12KP8r5K33k05JL4M04n15L72l53J74j69J09J59l12P6M8L4Q1p5nJ22j89M5
7079e8J64O6j76j1L5N5j18J83n5q4J02l8L22l33K0j24O5l1K4j27R7M5k93K01O1
7104hR2j74J57M7j07rK39j44p0J62k21O9p1L5O6k64J76J02k13K3J50j11l0K53
7128A49k49o8l9J58J30j23m7J59r3J74j35j36K89n7j16r1J15J03p8m4j65J54%
7151a0M4rj42L2J10k45M08j16j53K66l42K50j65J93k20J49J1K5k24M3N7R7k3o6
$$ plain form
6987 -362 89 -175 56 -94 299 66 -152 136 11 254 -150 19 69 31 238 112 212 -173 -175 220 -128
7008 -128 -106 89 307 29 -234 -96 25 66 36 -55 55 4 -1 137 96 -242 -23 237 215 43 -98 123 60
7031 60 -53 180 284 -139 -23 1 64 -43 -115 281 -304 -284 -274 -159 -178 54 -223 -23 -39 90 70 45 -112
7054 -112 -110 -32 -127 106 -99 -98 -64 340 -175 197 -156 18 -151 -42 117 -195 -119 -71 -37 44 -31 -36 86 -103 -58
7079 -58 106 172 -4 -15 20 75 -43 140 85 1 103 65 387 54 74 -50 15 -16 8 -119 -22 23 -270 -69 -8
7104 -8 84 -90 67 114 7 -2 237 93 23 185 -36 33 -38 -3 63 -201 -25 77 -136 -113 37 -74 -104 149
7128 149 -100 -168 -207 -49 81 -42 -89 70 -23 151 16 -120 169 112 -4 -95 20 123 45 1 -164 -10 -10
7151 -10 34 25 -117 -85 25 -220 188 72 -81 185 -157 93 -72 121 -99 50 61 86 -138 -95 -38 59 36 -30
7175c0K28J51l55Q4j26K00l02J74N9q6J6J87k97L6O3J34k57L2J21k17J56R5j4
7198E2M1r8R6N0p4J23J37j01k99j5J41j04K01k08l38M39l60L31J48j33l0L5j08
7221g4R8r4J17j40kk57L92j39J61J49j59j63N7J46l02J15k9K42k7l0Mj39l0J15
7245A1J10n2m9l9JQ6Rk36K81j54Q3J52p2q3j32J97k86L40k75Q1k2J49j35J46K4
7270A35k24J11Q2j79J30R1j81m7K30j32Kk3Q7o8j61L43j9l11k12J01K67Q7p0k21
7294a82N9K89p9j08J29l08L8Q2L2J82Mj33K0M2j37R7k46P2M9P3j57J60o5j4j28
7319b29M43l48M69k55k76J87l5l8J76j25N2J92j05j44J6J08Oj6k26J65j33l5J64
7342A3m8j4J28j39J1K14q0R4j13q1P7j1j58J89Q1l09Q4k38M67J84m18j29K35P2
$$ plain form
7175 -30 198 349 -6 78 -48 152 -150 24 83 -3 13 200 -97 -61 2 136 -121 -89 32 -185 -29 66 52
7198 52 93 -5 91 141 67 190 327 226 -73 -88 53 -51 150 -58 -396 43 -317 14 162 29 -1 34 -74
7221 -74 24 -70 47 -93 -95 -352 40 -99 62 211 52 -111 -54 92 -210 -95 -124 118 91 61 65 -74 -104 11
7245 11 121 69 20 -19 -18 68 77 -159 122 -32 51 203 131 48 -84 113 -173 167 -108 -27 -49 100 -35 111 135
7270 135 -89 22 104 -75 55 146 -35 -82 148 16 18 -5 82 14 -147 196 177 -134 -346 -245 22 109 39 -182
7294 -182 -123 166 87 -21 108 -200 -162 -80 -48 134 138 5 25 67 -70 27 -219 -147 -98 -25 -182 -22 -87 -101 -229
7319 -229 214 -134 335 80 -196 -9 -44 -82 94 -31 21 213 108 -36 -20 88 94 78 -148 17 -116 -151 13
7342 13 -35 -49 79 -60 -49 165 85 179 66 -15 62 51 -107 82 163 -146 -62 -300 167 351 -67 -196 39 111
7366A11j20j32J94l8r2J49r2J5R1j56J67o0k21L37j23M7P8j05k82J87J74k17j3
7389a01n3J23K7k89L10K75m30K00j14oL14m14L10n5j3J86l85p6K31l09L87j23
7411eK45k68R4l8j95L9P6q8j13L11Q3l12J2M91j29j89q7m8O2K68j97J5O0k4RK1
7437I3rk01J25l44M35K73k13k00Q7L6j82kJ25J6J95q6n40L41O1j05j5N6J47o3
7461C0l5q5J45j33J61k36Mj35K93r0J38O8j61M3j24K25j49K2j7j61K44M6q5o0
7485e2O9O6k72K70j53M5R1q0L9J29O6k41J08J79m85L83j56p2O9j63M97j91j53
7508gn9N6J56J10j42M1q3k13L0l1K10k72J07J87j25mP3N2o5j54J80L31j99q8j00
7533ik76K60jn9J64mj69K46r5j08p4J56J23k17L44k26m3Q2k8j5n1M7K7Mj60j10
$$ plain form
7366 111 -9 -141 53 15 -77 72 -20 -5 86 -70 97 37 -184 153 30 77 155 50 -232 -45 129 -88 -101
7389 -101 -154 -31 -4 -293 17 292 -138 62 -52 -58 256 -158 152 97 84 270 -115 -191 40 -269 118 -5
7411 -5 240 -28 66 28 -167 -128 -52 -140 -253 58 141 -171 -159 332 203 14 -73 -121 -59 209 12 27 87 63 72 93
7437 93 84 -117 8 -336 99 372 159 -41 46 82 -100 -102 23 39 234 148 -392 -51 10 -95 -110 -54 93 30
7461 30 -5 -90 55 -78 83 -153 -149 -284 9 -81 57 125 -36 7 -117 108 -41 -19 -36 -197 47 93 8 -52
7485 -52 17 83 -189 81 -72 -27 64 -16 23 152 218 -23 85 264 -221 162 6 -66 3 -160 337 146 -7
7508 -7 -66 -10 146 256 114 155 72 -141 -111 -142 68 -204 -97 90 -35 -39 34 86 21 -133 47 378 179 91 -9
7533 -9 -285 -25 -26 -85 79 75 -94 152 57 -51 -125 31 154 -63 281 55 12 94 66 51 0 47 74 78 -82 -192
7559a92M49j98j26K8M0j23J69q2n6K84k41K62l70J19J14j79J65k32J63N0Kk74
7581b28K17J36m6j8K4N3j58J30K90k18p3r9K8j43R7o0j3J41j92K99l20N71l05
7604A13j36o7K85j40n0k8j85K37L3k71K76L01m87J68J7r9J52nl0k54O1J14J13
7627A18j41j55J46J51j28J7J55o0k5r6K6K2%j19K13p8p7L8m8P5oM0J99k30j00
7652f3M1Q3J18k52K88j79Jl74K61J36n2J19m2k73K68l88K41l2J41j53o3J54l0
7675e0L4r8L49l74J87j37J71j75L4J72K6l32L82k54J5J91j09K12k09k4J41K2j04
7698G0pn5j13j32R3J09O2k78K11J7j71J38J41O1j14j54k4Q9LJ27k09K30m5r2j84
7723b27O4K47q3P0l45OL55K2j19p3J88l99M11k64jlo6L53p5L8q3p7K49j05j52
$$ plain form
7559 -192 257 59 -67 -39 1 -122 47 -35 -91 193 -48 214 -156 -37 77 -102 63 -169 -6 44 46 -228
7581 -228 -11 125 79 61 85 138 -20 110 400 182 109 10 38 -105 -8 -68 -81 60 -132 167 -153 418 113
7604 113 -23 -90 195 55 5 -23 -208 29 62 -209 67 368 -119 49 66 -33 119 114 84 -170 -109 5 118
7627 118 -23 -178 -32 119 -9 8 163 103 78 -18 8 30 30 -89 124 46 -31 7 -41 34 28 68 267 37 -63
7652 -63 -22 61 179 -73 215 36 37 -337 -76 60 8 127 85 -188 80 -308 -67 -99 42 -111 -174 -20 -50
7675 -50 -16 -114 235 -139 48 -89 82 -93 -59 113 139 -193 189 -65 -50 141 32 244 35 11 152 174 70
7698 70 63 8 -105 -237 -144 -35 27 -251 -40 -23 -194 -56 85 146 32 -122 -146 -57 -54 73 -136 94 49 -43 -227
7723 -227 -163 84 1 71 -274 -268 87 109 -10 -83 105 -294 117 -147 -148 -151 -217 136 61 99 16 -61 188 83 -69
7748f9q3M3J47m7M1J56j33J00k8l22K38qr4J12k4p5R3r3L3O3j59K62p4k45J24
7773d2j10Q6l9J43k06J13r5K94k50R1j23P9j06L08j81P3j71J4L02j44j29K07k3
7796I1j27%j2p7K01o1mj36Q2J04k41L28m81L36N7oJ04j07k2J5j8o1j80J28Q0j85
7822a92J10J96m60N31l14j49K67J61j02o5J02k15J06M2N1k81K7L19j54lK45k96
7844g4R6j49N8L13l37Q1j9J85k62r4J31n7Q8k0J85j23q1o2m2J26J43j14q6M0p
7869h1MN2k61J34J88k6J33r7L5J67j98j76j68L65j68j60K58oj22J22L5j65J40
7892Ek39L03r8J72k01j88J07K58O1kj98l1ok3J66n7n2j5m9J52j3j8P5J2l43J06
7918a16L00k62K0Q2K6k65J45o0p7J53J14k5Q5r9k25M01k48p6m1O2M11l97K5K6
$$ plain form
7748 -69 -152 -109 38 -9 32 188 55 155 127 -195 43 35 -59 53 29 -46 47 -46 -13 50 -109 153 79 -166 -42
7773 -42 -152 -66 -105 38 -168 -55 -150 144 -106 -15 -138 -59 -165 143 -38 35 -136 -122 180 36 -93 114 91
7796 91 -36 -36 -48 -125 76 15 11 -125 -43 61 -180 148 -333 3 60 54 158 51 29 44 26 -35 -215 -87 -7 -192
7822 -192 -82 114 -346 185 -129 -278 -11 150 48 -17 85 -130 -24 18 69 -212 -185 134 -20 -23 222 -74
7844 -74 22 -127 -69 244 -93 -12 -31 154 -108 -202 -71 -128 -40 -60 125 2 -79 -141 -183 -57 86 -28 -114 -74 -81
7869 -81 -77 -25 -286 -152 36 10 143 46 81 248 50 -126 -294 71 -97 -257 1 -5 -127 -5 30 -135 5
7892 5 -234 69 -29 143 -58 -246 -139 119 180 178 -20 -51 -57 -80 86 29 -23 -38 -87 65 52 34 109 121 -222 -116
7918 -116 184 -78 -58 24 50 -215 -70 -130 -207 -54 60 35 120 21 -204 197 -51 -127 -168 -106 305 -92 -67 -41
7942d1n6O4r6%L03k20O1q8M6J03k80L14L3K9j37j05J17j67L28k44r9Q7o0q3J77
7967a4R3rj19k7O7kj00K69K3l10L34j10k99N5o8K97j65J40n2M7l1L9K19l77q4
7992a84O0J61j30j30M36j52R4l6j74N0n8N7m7J93J42m63J78P8n9l6P9J4K6p7j5
8017GL1j01n7J52k51L67j20j95pL21j78k1j0J83k07J10k49M01j99j7Q4j13J28
8040E9k06J1J35j36L34r6r7J75q5j18P5k74K93q8J37R5j23K7j73J35j97L81l71
8063a07K51j92J08j48o8K63R1m17K00P0k08J45J09j10L3j94K34j64K4J22j10K31
8085A63k03J06J37j67l05J85J54J0j17KK9qP2K01k91L05m39M76m10R8kj38R8K23
8109A79j95j18K86k55n4J42o5K07j28k34M48k50L1J32M9j99J06j29M8J65n5k07
$$ plain form
7942 -41 -97 -33 -129 -129 174 -46 15 -73 -27 76 -204 110 143 172 35 -70 47 -120 208 -36 -135 -48 -108 -191 -14
7967 -14 79 70 -49 -76 -9 -11 -111 158 181 -129 205 95 -204 -149 -217 80 -85 55 3 50 19 58 277 -100 -184
7992 -184 -124 37 -93 -223 213 61 155 119 -55 -5 -63 -6 -53 140 282 -181 -3 75 16 -20 59 73 99 22 7
8017 7 38 -63 -120 32 -219 148 28 -167 -174 147 -31 -52 -62 121 -86 24 -225 176 -23 -40 44 -69 59
8040 59 -147 -136 -1 -137 197 101 4 179 94 -24 51 -223 70 -18 119 214 91 118 -55 80 -117 264 -107
8063 -107 144 -48 60 -88 -156 107 198 -219 -19 51 -157 -12 97 -13 20 -174 60 -104 -80 42 -68 163
8085 163 -40 66 203 36 -269 -84 70 80 -37 -35 -6 -14 58 259 -32 273 -166 310 -100 -2 -4 -142 -44 179
8109 179 -16 -134 152 -103 -157 -15 -80 127 -1 -235 213 -37 -6 126 175 -24 82 -47 1 166 111 -96
8131i6j28R4R6j77J64j0%rJ81j1j70R1R4q9M6j5j9k0o0J62P3j96m0K67Mj05j54
8158b7M1J97j28J2j26J08l17L39J90m21J26K0l9j13K20n5k21J70k72J45K95J4
8180A58Q3n80M84j29R2l9P1k32L56k01r6
$$ plain form
8131 -96 -224 -130 -34 -211 -47 -57 -57 -66 115 104 -66 25 119 30 76 61 42 22 -38 124 197 1 -39 228 232 127 -27
8158 -27 14 211 83 95 -31 77 -240 99 289 -132 -6 14 -25 -138 82 27 -194 -24 -296 -151 144 158
8180 158 241 -339 145 16 108 69 140 -92 264 63 -33
8191c3
$$ Imaginary data points
##PAGE= N=2
##DATA TABLE= (X++(I..I)), XYDATA
0@%%%%%%%%nJ3j6J6k4L2m0N3o3Q2j04J20j44J76k12K52k98L51m10M79n56O40p37
31c95Q45r63J096j242J405j583J778j996K233k492K776l084L423l795M199m640
47b435N123n650O224o855P550q315R161j0102J1151j2327J3661j5184J6940j8994
61a0052K1433k4384K8038l2696L8866m7481O0484q3213J87944o17556O22590O6119
73B10092p02753Q96615m89188l5988L90912m82868K75882r494k47296L57540k29636
84f6182O7057J20546k20104R5542K3906j02637R9051M7313r2419J9093P9020j67543
96i7357Q8971M3349j12242J64953j05351j0715J11187k07429J71904l1469j18806
107a03005K34761k05412P7059J10561k98729K76245o4942j92272L53493k21190
$$ plain form
0 0 0 0 0 0 0 0 0 0 -5 8 -8 8 -16 16 -24 29 -34 48 -56 64 -80 96 -116 136 -162 189 -221 258 -298 342 -395
31 -395 450 -513 583 -659 746 -837 941 -1055 1178 -1314 1462 -1622 1801 -1994 2205 -2435
47 -2435 2688 -2962 3262 -3593 3957 -4358 4803 -5299 5852 -6475 7186 -7998 8942 -10052
61 -10052 11381 -13003 15035 -17661 21205 -26276 34208 -49005 138939 -478617 143973 210092
73 210092 -492661 403954 -85234 -121222 269690 -213178 62704 53210 -194086 163454 -66182
84 -66182 875 121421 -98683 -3141 20765 -81872 17179 64492 -27927 -8834 70186 -97357
96 -97357 -8386 34963 -77279 87674 -17677 -28392 82795 -124634 47270 15801 -103005
107 -103005 131756 -73656 3403 113964 -184765 91480 26538 -165734 187759 -33431
117c3431n8587K40427k56362Q6478J03567j70810J42072k1155p9301J02567q9101
128c3636P939O7000q7933Q0192J6012j13065J13627l6379j05359J63121o5100
139F419o1670J43951j11291k982O3846q9215Q1821l1895j8723R0800j24244O2890
151I707K7350j21300J43869n6200n4342J36702j30922K1255Q0826j19092P3753
162A1606J6262o1771O3518l2736j6483L0980l1139J8687J5480k5800J5656j66
174D094k2461K7723j5270j4949M8552m6310Q612M9850q0238L8412K8459o6371
186c9897O0389j3568k6529M1413m2052K6896L50l4767N7706m1337p22M9426o9256
199c1948L4659K2774o2500N7069m817m0239M9376k5377j1371K5339k3257J9499
$$ plain form
117 -33431 -92018 148409 -107953 -21475 82092 -88718 53354 32199 -47102 55465 -33636
128 -33636 -25697 41303 -46630 33562 49574 -63491 50136 13757 -91602 71519 6419
139 6419 -55251 88700 -22591 -25573 38273 -50942 30879 -1016 -19739 71061 -53183 9707
151 9707 37057 -84243 59626 3426 -50916 85786 -45136 -23881 56945 -62147 11606
162 11606 27868 -33903 29615 -3121 -19604 11376 -19763 -1076 14404 -11396 4260 4094
174 4094 -18367 9356 -5914 -20863 27689 -18621 -10009 39841 -40397 -1985 26474 -39897
186 -39897 20492 6924 -19605 21808 -20244 6652 7002 -27765 29941 -11396 -12118 37308 -31948
199 -31948 2711 25485 -37015 20054 15237 -25002 24374 -1003 -12374 12965 -10292 9207
211I207l007j3763K6512k9406N248K5250l7251K3031R977l3796L4555j0879k5290
224a9612L7238k3238l908L1905l2046R044R704k4089K5467j3599l992K3084l1864
237a5906K1116M835l2657L6800j8345j0118L4107l3166J0999J2765k6442K1301
249E289q051m121J3997j5711J4308n658j3621K2462j4085l416K0699j8163j004
262g075J8682j8721M47J7165k2667J1273J5116k6923K0367n397j7317K9440k1539
275g149O637J5267l1466L0259j1390j9206L9035l4359R589K4758l9722K7849l396
288F706k2592L2098k2008L366J7718k6993K1329n390j8928L0530k2252O10K6958
301B1152l5379J4858J4267l5050K9251m47k6328L2780j4901j2257K6411k4216
$$ plain form
211 9207 6200 -7563 18949 -10457 -5209 20041 -17210 5821 15798 -17998 16557 5678 -19612
224 -19612 17626 -5612 -9520 22385 -9661 -617 9087 -15002 10465 -3134 -7126 15958 -15906
237 -15906 5210 10045 -22612 14188 -4157 -14275 19832 -13334 -2335 10430 -16012 5289
249 5289 -2762 -6883 7114 -8597 5711 53 -13568 8894 -5191 -8607 12092 -6071 -7075
262 -7075 11607 -7114 -6667 10498 -12169 -896 14220 -12703 7664 2267 -15050 14390 -7149
275 -7149 -512 14755 -16711 13548 2158 -17048 21987 -12372 -2783 21975 -17747 10102 6706
288 6706 -15886 16212 -5796 -2430 15288 -11705 9624 4234 -14694 15836 -6416 -5806 21152
301 21152 -14227 631 14898 -20152 9099 8652 -17676 15104 203 -12054 14357 -9859
313i859M323J6365k2323J7680p51j8942K2452j4962l233K3189k5915J2575J0171
326A0770k9254K7072q228j6548L0952k2932L964J8117k9766K0255j499j8271K9656
339A4288j9461j220K2092l0204J5149R194k8265K9395n115k0627L1313k1353p155
352a1969K9173k8894J2269J4556l0630K6759q173j6928L0439k5815Q078J8946
364A7811l2998K5580n230k2668L4858k1893j420K4623l1025J4886O606k3324K3625
377I431q439q019K0370j9534M354J0833k1858J7628J807j8998K4773j3187j1239
390a2078K5024k2115L468J9247k5361J5097L028j9763K0364j0397l705J6775j7169
403g585R068L686j6601J6227n745p483J7764j3508N04J1863j8075R950M939j5606
$$ plain form
313 -9859 -5536 10829 -11494 6186 5435 -13507 8945 -6017 -9250 13939 -11976 599 10770
326 10770 -18484 8588 360 -16188 14764 -8168 -4204 13913 -15853 4402 2903 -15368 14288
339 14288 -5173 -6393 15699 -14505 644 9838 -18427 10968 5853 -14774 16539 -4814 -11969
352 -11969 17204 -11690 579 15135 -15495 11264 3091 -13837 16602 -9213 -1135 17811
364 17811 -15187 10393 5163 -17505 17353 -4540 -5960 18663 -12362 2524 9130 -14194 9431
377 9431 992 -7027 13343 -6191 -1837 8996 -12862 4766 6573 -12425 12348 -839 -12078
390 -12078 12946 -9169 -5701 13546 -11815 3282 6310 -13453 6911 -3486 -7191 9584 -7585
403 -7585 1483 5169 -11432 4795 -950 -8433 9331 -4177 -3673 8190 -9885 65 5004 -10602
417a0602J8563o579r846J8571j7399L615J3788k0683J6059Q8j6541K1453j3685
430c198l735J8872k0273J0968P633k1863J9242n473j2730K2443j4228p00J3950
443A0908j8127R848J280j1110J6138j1343O85J1892j8848J0778L438j4854J6412
456G097n190q172J4085j0694r26R347j1113O312M145j0833R681l585q105J5428
470G477j0911j561J5223j8803P782P701j8696J6586m102q313J7151j5995M576
483a885P563j7009J6677m341p611J4588j3092L778M976j1327J2360m465m175J1055
497G092j1412K679O247j0902Q411K432r642Q857j190q333R932l908l166R415q661
512b149L105L074j0859J1581l622o569J4740j1597J64R309j2772P189J508p080
$$ plain form
417 -10602 7961 1382 -8464 10107 -7292 -3677 10111 -10572 5487 5575 -10966 10487 -3198
430 -3198 -6933 11939 -8334 2634 10267 -11596 7646 2173 -10557 11886 -2342 -3042 10908
443 10908 -7219 2629 3909 -7201 8937 -2406 -1721 10171 -8677 2101 5539 -9315 7097
456 7097 1907 -6265 7820 -2874 -3800 5547 -5566 746 4891 -5942 3739 154 -7951 7477
470 7477 -3434 -4995 10228 -8575 -793 6908 -11788 4798 696 -7617 9534 -6461 -1885
483 -1885 5678 -11331 5346 1005 -6606 7982 -5110 -1332 3644 -7683 4677 212 -3963 7092
497 7092 -4320 -1641 4606 -6296 2115 4547 -5095 3762 2572 -5761 4171 263 -2903 6512 -2149
512 -2149 956 4030 -6829 4752 1130 -5439 9301 -2296 -2132 7177 -5595 1594 3102 -3978
526c978R785o508n85N392r023O617N9n317Q854o318j706O786q691L259M733o728
542c369N530r41n251O424n211m15Q017q629L224N345j0679O210J024p149R562
557C692m847p35O613j0935O654J930q816J1314n580k313Q405j0222M498K019o594
572d917R457m388k034N586p608M489J573o144P369j919m096P007n035k676O335
587B999l559J199K808n142L153n1m518O622l167k673P837o389j48M094p276O114
603A903N74m902P209o164r26O411q373N394J070o607R960o631k680Q251j0171
618e682N891L691q617Q185m357k839P741q960M827L065p380P441k844l817M930
633A275l641J845K428l908K311L01k829K164P00l252L888k09k854L945m601Q77
$$ plain form
526 -3978 5807 -701 -1286 4106 -4917 1700 1759 -3558 5296 -1022 -2728 4058 -4633 -1374 3359 -3369
542 -3369 2161 1220 -4031 2393 -2818 -3233 4784 -3845 -621 4724 -5955 255 1279 -5870 3692
557 3692 -1155 -1890 4723 -6212 442 2372 -6444 4870 -710 -3023 5382 -4840 -342 1677 -4917
572 -4917 4540 152 -1882 3704 -3904 585 2158 -3986 3383 1464 -2632 4375 -660 -3336 2999
587 2999 -560 639 3447 -1695 1458 1407 -3111 3511 344 -2329 5508 -881 -1029 3065 -4211 1903
603 1903 2477 -2425 4784 -1380 -2306 4105 -4268 1126 2196 -4411 5549 -1082 -3762 4489 -5682
618 -5682 209 3900 -4717 3468 -889 -3728 4013 -4947 -120 2945 -4435 3006 162 -3655 1275
633 1275 -2366 -521 1907 -2001 310 611 -2218 -54 646 -2606 1282 1073 -1781 2164 -2437 -1560
649a560M481o793O591j369n048Q758q174J939N557r990R997k222o826J0752q715
664b622J267N675p983O412r33l910N896m995J13M013m159J608K171l890K131Q31
680A625l801L678m89l095N614m233j291M832n581L632P46n242O950n099K3N599
696C868q669N118J813o859Q645m854k866P787p842L240L614p556N655Km220N412
712B288m164k08M356m546K752Q89m746N066j406k781M618l221j70M542n223J898
728e6J847m802M887r86k789M882m123R34K967n826N243r27l923P109n772K48M923
745C836p121M840Q47n445O218k822j890M552m344R96J948k354J860k63j905J982
761I35j059q45K544k271J02L092m398J692J628n020N453j167l297N495m850P08
$$ plain form
649 -1560 2921 -3872 2719 1350 -3698 5060 -3114 -1175 4382 -5608 4389 2167 -4659 6093 -2622
664 -2622 -1355 4320 -3663 2749 1816 -2094 3802 -1193 -1080 2933 -1226 382 2553 -1337 794 1625
680 1625 -2176 1502 1013 -2082 3532 -701 -1992 2840 -2741 891 1637 -3605 3345 -1754 -1731 3868
696 3868 -4801 317 2130 -4729 3916 -938 -3804 3983 -3859 -619 2995 -4561 1094 1096 -3124 2288
712 2288 -1876 -2084 2272 -2274 478 1367 -3379 1687 281 -2500 2118 -1103 -1273 3269 -1954 -56
728 -56 1791 -3011 1876 890 -1899 2983 -1140 -206 2761 -3065 2178 1251 -2672 4437 -1335 -1087 3836
745 3836 -3285 1555 2402 -3043 3175 353 -1537 3015 -1329 -333 1615 -739 1121 858 -1047 935
761 935 -124 -969 1575 -696 -594 2498 -1900 -208 1420 -3600 1853 686 -2611 2884 -1966 -1258
777a258L103n475M856j036k878N725n570J272L318o329O092o38m432O169m134
792a215j150M849n232K559K016m144M023j602k115L558l445K379J574l691L672
807B036k170j643M051l254K79L119l152J303Q59l122K302J39j244K464j633n76
823b42J628k704J814N95k475L565j609j310K890l764J026K446k859J871O32k926
839a422K105n69j446K023q16L07Q07j978J064n88j190K982j717j10K512m355J699
856f92K248m920M427k23l120M620l917K47K417l724L787p88j600L518m383J571
872e32J992l923L694l42k414L617k906k94K039j909J509N11j141R85p27j077J580
889F62q58P32Q92j715J377n91j981K621j219o71L117k480k02J946l107J339J590
$$ plain form
777 -1258 1845 -3630 1226 190 -2688 3037 -2533 -1261 2057 -4272 1820 1182 -3250 2919 -1215
792 -1215 -2365 2484 -2748 -189 1827 -2317 1706 104 -2011 1547 -1898 481 2055 -1636 2036
807 2036 -134 -1777 2274 -980 -701 2418 -734 569 1428 -1694 608 747 -497 1967 334 -242
823 -242 1386 -1318 496 1091 -1384 2181 572 -738 2152 -1612 -586 1860 -999 872 1504 -1422
839 -1422 683 114 -1332 691 -125 182 989 -989 75 -513 -1703 1279 -438 -548 1964 -2391 -692
856 -692 1556 -3364 1063 840 -2280 2340 -1577 -1330 1087 -2637 1150 362 -1238 2280 -2103 -532
872 -532 1460 -2463 1231 889 -1525 2092 -814 -1108 931 -978 531 1042 -99 886 159 -918 662
889 662 -196 536 1428 -287 1090 499 -1482 1139 -80 -751 2366 -114 -316 1630 -1477 -138 1452
906A452k169J614m84r61J404j969J260Q17k026K483j059k225L478l009L78L134
922B118l271J454M10k108J659q20k37J487j315J075m16j720K262j084n89K283
938A188j789k94J838k303P70J324k529K428P4k114K496k007k45K307k218J815
954G41k30j330K326k247J40J949k930K690o1k433K524j268n88K008j084j34N55
971F28p57K00L54l10N69q29K84J056j549O80M54j894J837M89k237K207j298r35
989a051K236j787M55J181j822J372o62j017J799j222L33J486k491J366K53k208
1005a779L046j735o81K760k897R54J000k618K476m78r03J875j767L7J053j476
1021a133J532m11o60J645j429k84J645j873O94J742k309J004P43k041J669k72
$$ plain form
906 1452 -717 897 413 -548 856 -1113 147 964 -1062 1421 362 -1863 1615 -1394 -1016 2118
922 2118 -1153 301 711 -1397 262 -558 -795 692 -623 452 36 -1684 578 -506 -1095 1188
938 1188 -601 -895 943 -1360 -590 734 -1795 633 707 -1407 1089 -918 -1163 1144 -1074 741
954 741 511 -819 1507 -740 -600 1349 -1581 1109 1048 -1385 1139 -129 -717 1291 207 73 628
971 628 -129 71 425 115 684 -145 139 1195 -354 326 780 -1114 723 1212 -1025 1182 -116 -1051
989 -1051 1185 -602 -147 1034 -788 584 -78 -1095 704 -518 -185 1301 -1190 176 429 -1779
1005 -1779 1267 -468 -1149 1611 -1286 -332 668 -1950 526 48 -855 1020 -747 -710 343 -1133
1021 -1133 399 -12 -672 973 -456 -740 905 -968 -274 1468 -841 163 906 -1135 534 262
1037B62p50J710j617Q23O4j520K002q91o21K256k184N20J212k066J273K84j251
1054d94J577o63o62P03p90K8J077q36O72j2j123J256q72p73J981j821P18R74k326
1073a386K156j076j158K816j903p7J431j911Q99J43p25J428j085M04O57j512P37
1090a62o8r17J396q4j304J902j123p10J920j561M97J187j874J443n92q08J949
1107A091j891J141N29j876J829o85j089K408k000P64Q27j620J097k12q76R92r1
1124C38J69P0o06J48ok83M00L02o59Q57l63r49J303q68j85J336j506N86Q59j872
1144i29J439n51p17J480j304N96K49j591J850o28q05J940j837N58R58j717J353
1161C44m01o70J257j121J90N96j040J018k78k78O13m17l21N87n41mP04o46N23
$$ plain form
1037 262 -488 1222 -395 428 492 -1028 974 83 -538 1718 -466 54 1266 -800 473 757 -494
1054 -494 1083 420 -242 461 -329 -301 776 -60 612 600 -523 733 -139 -912 1069 -752 -34 940 -1386
1073 -1386 770 -306 -1464 1352 -551 -628 803 -1108 -209 -66 -791 637 -448 -44 613 -899 -162
1090 -162 -230 -1147 249 165 -1139 763 -360 -1070 850 -711 -214 973 -901 542 -50 -858 1091
1107 1091 -800 341 870 -1006 823 138 -951 1457 -543 221 1048 -572 525 313 -563 429 338
1124 338 507 577 -29 119 113 -170 230 532 -127 730 367 -582 721 -147 -332 1004 -502 84 943 -929
1144 -929 510 -41 -758 722 -582 14 263 -1328 522 -106 -911 1029 -808 -250 708 -1009 344
1161 344 -57 -727 530 -591 -401 195 -845 173 -105 -383 230 -187 -508 79 -462 -466 238 -408 115
1180A15L72j373Q56J72o26J108r37K43O04j215J206l03p97J621j223J65O84j316
1198f44J060k4o20R91n23mP4l99L5K05L9J41J70m88K42q4m26Q71r15K57M25q89
1220e06Q62j14j028J554q58n9P43j356M57M35p52J054n72l48J157j310K64M70
1238I3q77J295l03r52J078q21o4P30q26R19j70o16R78j122J28O24n24Q71j62p40
1258d61N26k88j28N01m27L23M60o48j3L54n80K32O19k54J58j70l79O32p11M59
1278B05K45p09R56n39l68P58q96L34Q90r01L11m4q03R21m70o3O67l66K23j95p65
1299f09Q73l18l78J480j616M34L03j098P54J89m06Q96o25m8K84o42R9L30jN80
1319D81o70n5P37j203O17K04m42O66l32l41M12l39R5K33k78L22R0n37N21l65p8
$$ plain form
1180 115 487 -886 -30 142 -484 624 -313 -70 534 -681 525 222 -575 1046 -177 -12 672 -644
1198 -644 416 392 -228 763 240 236 310 -89 -54 151 190 331 501 13 255 171 -255 616 -299 -42 383 -506
1220 -506 356 242 -786 768 -90 -149 594 -762 -305 130 -622 432 -140 -488 669 -641 -377 93
1238 93 -784 511 208 -744 334 -487 -551 179 -647 272 102 -514 464 -658 -530 94 -430 441 279 -461
1258 -461 65 -223 -351 150 -277 46 506 -142 -155 199 -381 -149 470 216 374 204 -175 457 -254 205
1278 205 450 -259 697 158 -210 548 -348 -14 876 -25 286 242 -561 360 -110 -173 494 128 351 156 -609
1299 -609 264 -54 -432 1048 -568 -134 169 -929 -175 14 -392 504 -121 -169 115 -527 -428 -98 -99 481
1319 481 -189 -244 493 -710 -93 111 -331 335 3 -338 74 -265 -170 63 -215 107 197 -340 181 -184 -262
1340b62M69J11m8J91r14M71Rl77R83p66l2O48o62J59M39l63L08Rn12L51k87K09
1362A34N2l93O69l30k86L57m19l37Q39m48L45K56o55J03m4k88P29l84k35N95o02
1383c42L62K35r17J018l71l82P02q82M84N9n40O83J2m41P18o58l6K68l73M09R8
1404A06Kp9n5j24L5k86L74K88l40K67J11o24K32L58o54P28j05q28Q33o44K42L79
1426B16m22P09j08o65Q42r30N76M88q67Q58n52o62R07m28K45K20p77Q71k28l65
1446g2K63j01J02M2m92L05O5n25M92l15j21O01k50l21N68l99k46O88n97J92L81
1467B60p18N61l28j35L35l91O34j16p05Q74o82K56M63r12P15K86q14O59m13P5
1487i6K04k03K95o9l34L34k59K82j14PJ50J90k68p4L03m25Q3L60n65K54J51n68
$$ plain form
1340 -262 207 318 270 461 -453 18 27 -350 633 -133 -165 483 -179 -20 419 56 364 373 -139 212 -75 134
1362 134 186 -207 462 132 -154 203 -216 -553 286 -162 183 439 -216 -113 -157 -445 284 -100 -335 260 -342
1383 -342 20 255 -662 356 -15 -397 305 -577 -93 -34 -574 109 121 -320 398 -260 -296 -28 -401 8 106
1404 106 108 29 -26 -150 -115 -401 -27 261 -79 188 299 -325 -93 265 -389 339 234 -594 239 -405 -163 216
1426 216 -206 503 395 -270 572 -358 218 706 -161 697 145 -517 390 -38 207 427 -350 521 293 -72
1446 -72 191 90 192 234 -258 47 112 -413 79 -236 -357 244 -6 -327 241 -158 -404 284 -313 -121 260
1467 260 -458 103 -225 -360 -25 -416 218 102 -603 271 -411 -155 308 -604 111 397 -417 242 -171 -96
1487 -96 108 -95 200 131 -203 131 -128 154 40 47 197 387 119 45 348 -77 6 366 -199 55 206 -362
1509c62P52m01j11M74n41K89j55j57P18p23J81N25q57N44j49j71K61k18J64M00
1529D63n92L86j54l85L94j67k7J88k81J78qk90M59m04O9K37r6l98K44J9n9K70
1551D6j2pJ01m50N09m91J04K58l91M50j6m39M93k87O3O79n39k3J91k41J02Q9m41
1574b52N71l28J74J48l89l5K55J08l4j31n7mQ6LJ02k83R7K23k09J03rn05N49l37
1598a54M3N04o69M01j07k17N53n80L93K73r57O35k08N4L38l78M6K98n73j20J64
1619b61J98N0J6j75n3J16m9L24l30R5r4o2M2j22p0M72L4j4K64l63j50J69n26N77
1643H8l23M19L4k30J22K8k71K72k20R2J43j42r2qm0Q5J09o9L31l21MJ13p2k7L21
1668C46l74K45L8k57N7k58M9K24K9j0J06k65k2J22k48M97k94j56J42O9l75N31
$$ plain form
1509 -362 390 -11 -122 352 -189 100 -55 -212 506 -217 -36 489 -368 176 27 -144 117 -101 63 463
1529 463 -129 257 103 -282 112 -55 -82 106 -175 3 -5 -295 164 -240 -171 66 -30 -428 -184 -165 -224 46
1551 46 34 27 128 -322 187 -304 -200 58 -333 117 101 -338 155 -132 -69 610 71 48 239 -2 100 189 -252
1574 -252 319 -9 165 313 -76 -111 144 252 218 87 30 26 112 115 217 -66 31 254 45 148 139 -366 183 -154
1598 -154 -111 393 -276 125 18 -199 354 -226 167 440 -517 118 -90 -36 302 -76 -30 268 -305 -425 -261
1619 -261 -63 -13 3 -172 -225 -109 -158 166 -164 -69 -163 -225 -183 -305 -375 97 131 117 381 18 -132 37 -489 88
1643 88 -235 184 218 -12 110 138 -133 139 -81 11 154 12 -80 -88 -128 -43 66 -3 328 7 11 124 52 25 346
1668 346 -28 217 255 -2 55 -203 -154 70 99 89 195 -70 -92 30 -218 279 -15 -171 -29 40 -335 196
1690A96m02L82k98j31L03k66J17L89l98L41K7n13K89K8L7J9k17Q1p7Q1N2j03k
1713f5j21J45J45n5m52M00j9p6N76o51K28J02k13L6L72n77M40kj43L3j70K22l3
1736A22j33K09j64k8k0J35j66K45j08R2j89j23J41O8m0J83j80n2J85k37o1j03
1758b24J30J62j23J44j36J65l63M51m38K31Kqj95K03k28L51q2j20L42n31M36m73
1780c04K67j32J53P2L07m43k74M62k82J83M6J03j67J54p9K00n59K82L51l48L45
1801C37m87K49M0r9J30j51p3J43k85J65J61k56K60n9J05j00J01m64M95l23L44
1822B33q9l11J79M57p13J75M6j45M11j67j45r3J46l1K11j24M6j70j27K93l59Q
1844b69L57k34L86k63r0L3j74O2J78j67K84Q7q0j11k18K01J35J28r5l80K37q0
$$ plain form
1690 196 -206 176 -122 -253 50 -216 -99 290 -108 233 260 -253 36 64 101 120 -97 -16 -93 -12 40 -63 -65
1713 -65 -186 -41 104 49 -403 -3 -22 -98 478 -173 55 157 -56 -20 352 -225 215 213 70 103 -67 155 122
1736 122 -11 198 34 6 -14 121 -45 200 92 184 -5 -128 13 81 41 224 44 -8 177 -60 -121 -224
1758 -224 -94 68 -55 89 -47 118 -245 206 -232 -1 1 -7 -202 1 -227 124 42 -78 264 -267 169 -304
1780 -304 -37 -169 -16 56 363 -80 -354 108 -174 9 55 158 -9 145 66 266 -293 -11 340 -8 337
1801 337 -150 99 139 40 170 19 -54 89 -196 -31 130 -126 134 75 180 80 181 -283 212 -111 233
1822 233 144 -167 12 469 -244 -69 -23 -168 243 76 -69 -162 -16 -47 164 40 86 -84 -211 82 -277 -269
1844 -269 88 -146 240 -23 -113 -80 -254 -192 -14 -181 103 190 110 -1 -219 -18 117 245 150 -230 7 -73
1866g3K12J51l05q5K94l49M06k67j37J55L49k87q4K81l47K02J68l02l1J57J75
1887B83j82k19PN5O3j97L92k89K88j8l87L85m18J84j9M1K29r9k59N72m18J3L6
1910D3r3J37k60J26k2j9J99Lm7p8R7l4m9K19m22M33m35j07L45j10O1K73k26j39
1934a05J11j68J24j63j80L87l3l7J3J61j8r1pOo7j6p2j2J38m2J18J1O4P9k2k41
1960f2K37k33j40J31J42o9J41n65O09j42O7k22J72j64O0o0J42J78j50J49k78J88
1982A31j58j28j47J52J89J27o8k08M1J00L2k32M2J59k65M43k11o9Q0K29k75m40
2004d76K59K97k29k08L02m6J14j07K5K72k56K05j34O2j5p6P3j46J25j89L16l74
2026b06L52l6l9j22l8J6K35k80K55j72M5j1k07K99L2j25J59j85j15K94k73J02
$$ plain form
1866 -73 139 290 -15 -100 194 -155 251 -16 -153 2 351 64 -20 261 -86 116 284 -18 -49 108 283
1887 283 101 -118 -111 -56 7 -190 202 -87 201 183 -204 181 -237 -53 -72 -31 198 99 -160 412 -6 7 43
1910 43 -50 87 -173 -47 -69 -88 111 114 67 -11 86 52 3 222 -200 233 -202 -309 36 -74 -13 260 34 -105
1934 -105 6 -162 -38 -201 -381 6 -27 -64 -51 110 92 1 -6 0 -67 -83 -155 -167 -29 -71 47 58 122 201 179 -62
1960 -62 175 -58 -198 -67 75 6 147 -418 191 49 116 -106 66 -98 -38 -98 44 222 72 221 -57 131
1982 131 -27 -155 -302 -150 39 166 98 -110 -69 31 63 -169 -127 32 -233 210 -1 -70 10 239 -36 -476
2004 -476 -217 80 -149 -357 -55 -101 13 -94 -69 203 -53 152 18 80 65 -11 62 -84 41 -148 168 -206
2026 -206 146 110 71 -51 -89 -73 162 -118 137 -35 10 -1 -208 91 123 -2 157 -28 -143 151 -122 -20
2048b0J18q2p4j17L23l96K17J81M1r9n6j2j56K51j15r5J88j78j18K56q0M2O3m63
2072c81M59L5q1j61Q2j33J73m5M4L3j22J00j7J90j74k28J44J16j28j19M08j74
2094B1J08q4k6J28m08K00R3k25Q0K63j51L8l07K62J8l6J57j80K3P9r1j19M64m09
2118a02K37k5j42j72O9K83j18O2N2J9j10ll23K56m2M16m46N6k47J36P3J78j54
2141d7K17j79n6N0K9J42k00O7l9J59k94J59j51Q0j13K81J22k94O5K6q8J7o9K35
2165A19l81J75K80l51J84j20N5J74j60J53r4J32k27J74R5j88J17m14J82J25K0
2186E0q1O3p4J51P8k66J11l16J75M64l90P8j3j27R8j77K07j05L12k57J37k77l7
2209a96J14J5K57o3j55M2K9P1l05M70j41j98k3P3o1J0o6M7mK26L6j53j10j08J83
$$ plain form
2048 -20 98 16 -58 -175 148 -248 -31 150 191 92 36 24 -132 119 4 -91 97 -81 -199 57 -23 19 82 -381
2072 -381 78 113 32 -129 -47 -180 -7 -52 -8 25 -97 3 -14 176 2 -226 -82 34 -94 -213 195 21
2094 21 129 45 19 147 -261 -61 32 -193 -113 150 -1 37 -270 -8 10 -26 131 -49 -26 53 -38 -157 307 -102
2118 -102 135 110 -32 -204 -135 148 30 92 144 163 53 50 -273 -17 -59 357 -89 -33 -280 -144 -71 107 -47
2141 -47 170 -9 -65 -15 14 156 -44 23 -16 143 -151 8 -143 -63 -176 105 227 -67 -2 24 -64 -47 -116 119
2165 119 -262 -87 193 -158 26 -94 -39 135 -25 128 34 166 -61 113 208 20 137 -277 -95 30 50
2186 50 -31 32 -42 109 187 -79 32 -284 -109 355 -35 43 30 -97 1 -176 31 -74 238 -19 118 -159 -196
2209 -196 -82 -67 190 127 -28 14 43 114 -191 279 138 -60 -83 -10 -71 -61 -127 -80 -84 142 178 25 -85 -193 -10
2234a0O5r3J01j55o1J21J08J58k84j3pJ75p8O2j67o0Q1J93k17Q7j76M4L36n6J02
2259B56m5j46j02Q4P5Kj51M2q8L12l09j56J91N2Q4M5k31J64om29L12l4M3J68k16
2284h3P1n9j5J85q2J51l31K75qk34k6J23m3o9L7Pk6J60k87J64K07P9r3k3K9m01
2310b92K46qO1k75K96J04l98M10k38J61j59J84k84J35K2j57K72j35O1j73J57j04
2332a14P2J98j07j52J3P8m6O2o8p3j8J31r0J57Q8j28J63j48K61k03J42k84L77
2355C11q6m05N5J08j03j1J42j23J31L3J12j68j33L8J63n4K2J83j87j78J11J6j90
2378b13J53o0J21m9J4ko3k6L7J21k43O1K6J50j99K44k2K2j32J1n7K90j36M5L9
2403A32l17K11M0j2K31k46k91M63m6n5n8p2Lj51J95k0k9m9j59Q8R3NL41n20J90
$$ plain form
2234 -10 55 -38 63 -92 -153 -32 76 234 -50 -63 -70 105 27 89 -78 -138 -57 136 -81 6 -170 -126 210 154 256
2259 256 211 65 -37 47 122 124 -27 15 -73 239 -70 -226 -35 17 101 146 -85 79 73 -356 -44 -78 -35 133 -83
2284 -83 -12 -71 -86 99 17 168 -163 112 104 -130 -156 -33 -76 -145 -108 -101 -127 33 -254 -90 117 196 103 80 109 -292
2310 -292 -46 -54 7 -268 28 132 -266 144 -94 67 -92 92 -192 -57 -35 -192 80 -55 6 -167 -10 -114
2332 -114 -42 156 49 -103 -90 -12 -58 4 -64 -137 -155 -24 -114 43 131 3 166 18 279 76 218 -66 311
2355 311 225 -180 -125 -17 -120 -131 11 -112 19 52 164 -4 -137 -99 64 10 32 215 28 -150 -39 -23 -213
2378 -213 -60 -120 1 -48 -34 -36 -99 -125 -88 33 -210 -149 -123 27 -172 72 50 72 -60 -49 -106 184 48 93 132
2403 132 -185 26 66 54 285 39 -252 211 165 110 52 -20 -17 -168 27 7 -22 -71 -230 -142 -49 -44 297 -223 -33
2428c3J19j47j2O3j99M4K79j43J18k74n1M08j07j68J66J34k45L5J45q5j28J24
2450D3J25k81L7k0K00l27L14j41J03K5j32j7j25J47o7J03j64J95p6j71K68J38
2472A77j39J8j29M59m93J69J20p8q4j35P1j40P5J25k28J49K7lL3m3N4rR4m12L74
2497E2k0P0j54M4q2R6J1J72k71m0J18JJ66k34r8P5k5K78nR0l40j09L75j3k15L4
2523b4M4J48n9J36m30J77J93r5j30k8o0L02L4m58K52k43L68J57j99M4j46oJ45
2546A22k23Nr6J63k67M39o3j00J35j93oK20m96K09K13R6o6j20jq9R0j1p7K47k6
2571A05k35J39J59k96j18K79l4J14q6J29j47J77l00J67k18K23j6J5J00k26n8J18
2593iJ17j86J3Q4K1k96J30K71K2q3l03L79j87O4J93l65L18j70j9R2o6k33J97J05
$$ plain form
2428 -33 86 -61 -73 -10 -209 -165 114 -29 89 -185 -236 172 65 -103 63 197 -48 -13 132 47 -81 43
2450 43 168 -113 -76 -96 104 -223 91 -50 53 78 -54 -71 -196 -49 -116 -13 -177 18 -58 -229 39 177
2472 177 38 56 -73 386 -107 62 182 104 20 -115 -44 -184 -109 16 -212 -63 -36 -39 -6 -49 5 -4 90 -322 52
2497 52 32 102 -52 -8 -90 6 17 189 -82 -122 -4 -3 163 -71 -169 -94 -119 159 154 244 -96 -205 170 157 -58 -24
2523 -24 20 168 109 245 -185 -8 185 90 -40 -68 -128 174 208 -250 2 -241 127 284 85 129 -17 -23 122
2546 122 -101 -96 -192 -29 -296 143 80 -20 115 -78 -84 136 -360 -151 62 158 92 -28 -29 -118 -28 -39 -116 131 105
2571 105 -130 9 168 -128 -246 33 -1 113 27 156 9 186 -114 53 -165 58 42 57 157 -69 -127 -9
2593 -9 108 -78 -65 19 40 -256 -126 145 167 84 -219 160 -27 37 230 -135 183 13 -6 86 20 -213 -16 89
2617H9l04J00p2M87l96J94j14J66j62k26J97j21J5R9J52q8R0j40Q5P0j78L47j23
2640A67l45K79j88j9nK81j59j02L62k90NKJ59j84N4K98k99J27p0k00K4K04j9k9
2664E3j13J59j92L30k22O9Q2PJ27k93o1L10k66K36k04J00Q0l04K27k47Q1K08j55
2687A2j38J81k53M1L00J10k72P7k03J57QNk57R0P8O7M5j0J9J17k57J72p6K57l53
2712h3J21o3O%j4Nj9J07k12J66n8q8J79J33l10M0p1m2K63O7JJ60l70pP0J84k65
2739a00J21N5j26K1M4M4m7j3J4j36J27k6lN2J0q2m7lJ69k39L48j25kq7L42m27
2765a16l6N5K47j80P8k30J67P4k53K84j7k11J26L8l9J12m24L55k36K28M4j6L2
2788H2K87m13r3m0N1P7j17K43o9p0lJ40j45J7M4N3j79J60Jk6J99k64j1P6p5J04
$$ plain form
2617 89 -215 -115 -187 300 -96 98 -16 150 -12 -238 -41 -162 -147 -48 104 16 106 -34 51 121 -57 290 167
2640 167 -178 101 -87 -106 -111 170 11 -91 271 -19 -14 -12 147 -37 17 315 16 143 73 -127 -103 101 82 53
2664 53 -60 99 -93 237 15 84 166 173 300 7 -54 256 -10 226 22 122 202 -102 125 -122 -41 167 12
2687 12 -126 55 -198 -157 143 253 -19 58 -145 12 20 25 -232 -142 -64 3 48 38 57 174 -83 89 13 270 -83
2712 -83 38 -25 -19 -19 -33 -28 -47 60 -152 14 -44 -132 47 180 -130 -90 -161 -203 60 127 128 288 -82 -89 -19 165 -100
2739 -100 21 76 -50 -29 15 59 12 -1 13 -123 4 -22 -25 27 37 -45 -92 -95 74 -165 183 58 56 -31 311 -116
2765 -116 -152 -97 150 -30 48 -182 -15 59 -194 90 73 -138 -12 26 -13 99 -325 30 -206 22 66 50 82
2788 82 369 -44 -137 -177 -126 -49 -166 77 8 -62 -65 75 -70 -53 -9 44 -135 25 26 0 199 -65 -76 0 -75 29
2814B9J19k32N0K89l37Q2L84n43Q1L16k10J58m64M53Q7l93R3l0J42j53NJ23j68
2837a19L5j11L14K7j81j60K00l11L18j81J9K58k99N60m11p9K5l2P6L9k21K11J19
2860I6k35P0L80o8k81Q2j14J22r3J76k75JK11k4m2j50K70O8j90M4j0Q2K3j83K23
2885A83k89K12j01j24K15j38J67mj57Ok5J80j37J43l25j75J38M36l28J49N7p7
2907FnqJ09K6p5M3j74K80m04O5R1O8R1j54N3j26R0J4J2k7NK6r7J1m4Q9n2J47R
2936F9jl60R1J37%M1M4j90K0K36l8j5j13O6j23J35OJ00l10L0K26N7j2k2o5O8j29
2963e2K98k35k53N27m02J11o9j38J62J20J4j88L8p9J39j04L4L9m4K42k43j4J41
2986D4R5k11L6R1r9m7n7K6J06O4j23j91N51j63k26K41JK6n9k79J55K55l69M9J88
$$ plain form
2814 29 148 -84 -34 255 -82 0 384 -159 -78 238 28 186 -278 175 262 -131 -38 -68 74 -79 -74 49 -119
2837 -119 -84 -195 119 146 -35 -195 5 -306 12 -169 -150 108 -191 369 -42 -121 -96 -128 -52 -13 -234 -23 96
2860 96 -139 -69 311 243 -38 44 -70 52 -41 135 -140 -139 72 48 6 -144 126 194 4 48 38 120 143 -40 183
2885 183 -106 106 5 -119 96 -42 125 121 -36 -30 -55 125 -12 131 -194 -369 -231 205 -123 26 83 6
2907 6 1 -7 102 128 53 96 -78 202 -202 -137 -46 22 113 -41 12 -114 -24 -10 2 -25 -20 6 -91 -80 -124 -35 -87 60 69
2936 69 68 -292 -201 -64 -64 -23 21 -169 -149 87 49 34 -79 -13 -136 -1 5 105 -205 -175 51 108 96 74 9 77 -52
2963 -52 246 11 -242 285 -117 -6 -75 -213 -51 69 83 -105 -67 -146 -7 -111 -77 -38 -82 160 -83 -97 44
2986 44 139 -72 -36 55 -44 -91 -148 -122 -16 48 -75 -266 285 122 -104 137 138 164 105 -174 -19 236 -133 -84 104
3011A04k26K15j75k8J10r1k04K75N5P9l60K94kq7j48K46j82R7J23j59K80l69J02
3034e1J69P4k65L4J37j48Jq4J7j41K24J63l15J26M1J12r5j61J56N2j00r1L02k24
3058f7K00J17j10o1k60k1J10J37j8p9L2K7J7J3J20k06K05j52K52m14K83l56K15
3081a6p5j33K73k06J38J09p1k38O0L11l15j95M72j60k44J08L81ok48QJ29l87K18
3104h7J91j3p7k1K04m96J61K66l0j67K9J05j74K25j95j4K91j22m6j96K58l33K26
3127a5L9j3J04k42O1P9k20K02J66l29K36j19r1J09P4N9j0n9r5J8qL4m4j1P5r9
3153i9J95k30L26k16J43r3j52K81k72J64j76J42p2O7M8j76J72j42Q4J24k12M0
3175e4R5M9m0k41J45k97J39j99M26J02j71l9L0N4j8K07n8j89L19l70O5j54Q2P1
$$ plain form
3011 104 -122 93 -82 -110 0 -91 -295 -20 35 114 -246 48 46 -41 -189 57 -125 -28 95 -64 216 -153 -51
3034 -51 118 192 -73 -39 98 -50 -49 -133 -116 -257 -33 130 -185 -59 -18 94 -1 -162 -6 46 -54 -145 157 -67
3058 -67 133 250 140 79 -181 -202 -92 45 27 -52 -20 7 24 37 157 -49 156 4 256 -158 125 -231 -16
3081 -16 -91 -224 49 -157 -19 90 19 -219 -159 152 -163 -358 114 -46 -290 -182 199 193 -55 -47 82 -305 -87
3104 -87 104 91 14 -7 197 -299 -138 128 98 -69 -40 65 -109 116 -79 -93 198 76 30 -166 92 -241 -15
3127 -15 24 11 115 -127 -66 13 -207 -5 161 -168 68 -51 -142 -33 41 100 90 31 -64 -46 -54 -20 -64 -75 0 -99
3153 -99 96 -134 192 -24 119 26 -126 155 -117 47 -129 13 -59 8 56 -120 52 -90 -6 118 -94 -54
3175 -54 41 90 50 -191 -46 -343 -204 -403 23 125 -46 -85 -55 -1 -19 188 130 -59 260 -110 -45 -199 -117 -46
3199d6j3N0k43Q9L38k40qJ02k19L80k17J94k21l7J95j64N9q9K49k14M3j09L1p0
3223a60j0kL02j69%j12J8L14j89M9m0Oj27K10l11J77J1J63j59j40K52j66J26J06
3247A49k24K17k94L09j44l9p2J34lj45J83j11p2J3M9j0m5L3P4k19L30r5P2l93
3271c03J80K22J05j71k86M05l98K82n7j59K2K14l2J3N4k09J48Jj35J18o1J08M3
3294A04M1l5j98L81j13m09K00J41l27M31j60l8P0l8k39K34J77k01K07m55J93P0
3316C6mJ5L3J94l27k01K61K58k24J83N9k93R5l04J73R5OL9j81J78l1j17QJ32j15
3341c2k19J30k7J40K7p2K75j77J05k02p5J81N6j97j37O3M7J66j11j76L40q4p2
3364e1J19j18k08L09n7j95K98j15J83k34K18k64kO5J64J33l52jJ04j17J76N2J47
$$ plain form
3199 -46 -59 -9 -252 -163 175 -65 -73 29 -190 190 -27 167 -54 -91 104 -60 -1 -90 159 -55 -12 -121 -90 -160
3223 -160 -170 -172 130 -39 -39 -151 -133 181 -8 41 1 7 -120 90 -221 -44 -33 130 -29 -169 83 -83 43 149
3247 149 -75 142 -152 157 13 -26 -98 36 33 -112 71 -40 -112 -99 -50 -60 -105 -72 2 -217 113 18 90 -303
3271 -303 -123 99 204 33 -253 152 -246 36 -21 -180 -158 56 24 37 91 -118 30 31 -104 14 -47 61 104
3294 104 145 110 -88 293 180 -229 -29 112 -215 216 56 18 88 50 -189 45 222 21 228 -227 -34 36
3316 36 32 47 80 274 -53 -254 7 265 41 224 283 -10 85 -219 -46 49 55 94 -87 91 60 -57 -49 83 -32
3341 -32 -251 -121 -148 -8 19 -53 222 45 150 -52 -127 54 110 -87 -224 -161 -114 52 -59 -235 105 21 -51
3364 -51 68 -50 -258 51 -6 -201 97 -18 165 -69 149 -115 -117 -52 112 245 -107 -108 -4 -121 55 107 254
3387B54l56K52O3L3j10j5q9K65k88k55J06J23n3M9p3M3r2K20J16j8l09K58L9L04
3411D67m00j34Q2J07j88P0j16J98R9J73k33j5k60J23J95j5J62l23n9J74j27J37
3433A17L1j0k43Oj0J65lpj14N3j11K75j78P0J39j72J84l35j12N1K76j14K56j33
3457H1J08p1J55l34L0J35k81K45m1J23nl79J83j07K77j85L2K02j64r9q0p1J56
3480i0Q4J30Q0k22k2O5n4j12K20q5J21m29L24K2o4L9J76l38M8K69k00P8K05p4
3504A71l8R5l6q3l14L36r8j23K39K5k06n5K62k70J95r7p9J47q0J00j52p2K45J18
3528B30k33J18r9j08J07j77J17n6j5K16r8l8j88K67J6l6K06j97l71N16k27R5k5
3551B0l5P9j9k44K2J24L2J4N8Ll4l5j6K6j7J7j68O5P9j3PQ7l53K15J50k92o3P4
$$ plain form
3387 254 -102 150 213 246 136 121 32 297 9 -246 -140 -17 -70 -21 -94 -51 -143 77 193 175 -134 124 163 467
3411 467 67 -67 15 122 -66 4 -112 86 185 358 125 110 -150 -27 168 153 315 -8 -67 107 -20 117
3433 117 148 138 -105 -99 -109 56 53 46 -68 -15 -126 149 -29 41 180 8 192 -143 -255 -204 72 -42 214 81
3457 81 189 118 273 -61 -31 104 -177 68 27 150 145 -234 -51 -158 119 -66 -34 168 4 -95 -175 -246 -90
3480 -90 -6 124 204 -18 -40 25 -29 -141 79 -6 115 -314 10 32 -32 7 183 -155 -107 162 -38 40 245 171
3504 171 133 228 192 109 -205 131 33 -90 149 174 -32 -87 175 -95 100 3 -76 71 -9 91 -61 -133 112 230
3528 230 -3 115 16 -92 15 -162 -45 -101 -116 100 2 -36 -224 43 59 23 229 32 -339 177 -50 45 20
3551 20 -15 64 45 -199 -177 -53 -21 -7 51 54 20 -15 -31 -5 -22 -5 -173 -108 -29 -42 -35 52 -301 -86 64 -228 -291 -217
3579b17L6L29j47K74j28J5k48J45J04k51J34j35k27K43P9j60L66j62P1k66R5j07
3601a57L3O6p3N0J51n1j01J73l3j80J35n6J80j94j33J99j76K0P5L3J28j65K58
3624A82J52l90q7JJ35J39j45j53K56J08j57R3J53k70j24M0P6j85M08J9n57K33
3646g3O5m3J96l01J06oK2O4J75j30j37M9o1J66o2j25K39k21J82R7j78R9k19L15
3670B19n22N17j53m1j50K15J4Q3k66j32P2J0l2J70j82J55j35r1K71J30J0k06J31
3693H7j28q8K09k15n3L51n9P2kl57K70r9K33j99j89L70k68q2K52j14j26K89k51
$$ plain form
3579 -217 -181 148 1 275 147 162 -86 59 163 -88 46 -89 -316 -73 6 -154 212 50 121 -145 -50 -157
3601 -157 -124 -58 -131 -81 70 19 -82 91 58 -122 13 -43 137 -57 -190 9 -167 -147 -72 -39 89 -76 182
3624 182 334 -56 -143 -142 -7 132 -13 -166 90 198 41 134 287 17 -107 -67 9 -176 232 251 -306 -73
3646 -73 -8 -51 145 -156 -50 -56 -34 30 205 75 -62 -13 -74 92 30 -95 144 -77 105 202 24 123 -96 219
3670 219 -303 214 61 20 -130 85 99 182 -84 -216 -144 -134 -166 4 -178 -23 -158 -249 22 152 162 -44 87
3693 87 -41 -129 80 -135 -188 163 104 176 174 -183 87 -12 221 22 -167 203 -65 -147 105 -9 -135 154 -97
$$ [...]
8191a12
##END NTUPLES=NMR FID
##END=
