##TITLE=1H_Chycory2-ACNpart
 CDCl3, 8 sc, 
 27.04.2021
##JCAMPDX= 6.0         $$ Bruker NMR JCAMP-DX V2.0
##DATA TYPE= NMR FID
##DATA CLASS= NTUPLES
##ORIGIN= UXNMR, Bruker Analytische Messtechnik GmbH
##OWNER= root
$$ XWIN-NMR		Version 3.5
$$ Tue Apr 27 14:20:31 2021 Russian Standard Time (UT+4h)  she@DPX200
##.OBSERVE FREQUENCY= 200.131506
##.OBSERVE NUCLEUS= ^1H
##.DELAY= (6, 6)
##.ACQUISITION MODE= SIMULTANEOUS
##.ACQUISITION SCHEME= undefined
##.AVERAGES= 8
##.DIGITISER RES= 18
##SPECTROMETER/DATA SYSTEM= spect
##.PULSE SEQUENCE= zg30
##.SOLVENT NAME= CD3CN
##.SHIFT REFERENCE= (INTERNAL, CD3CN, 0, 15.7039)
##AUDIT TRAIL= $$ (NUMBER, WHEN, WHO, WHERE, WHAT)
$$ ##TITLE= Audit trail, XWIN-NMR		Version 3.5
$$ ##JCAMPDX= 5.01
$$ ##ORIGIN= Bruker BioSpin GmbH
$$ ##OWNER= she
$$ F:/spectra/data/she/nmr/H-F/1/audita.txt
$$ ##AUDIT TRAIL=  $$ (NUMBER, WHEN, WHO, WHERE, WHAT)
(   1,<2021-04-27 14:19:04.00 +0400>,<she>,<DPX200>,
      <created by zg, POWCHK disabled, PULCHK disabled
       configuration hash MD5:
       00 E9 B6 7A A2 85 ED C7 34 08 36 98 17 FE 4E 26
       data hash MD5: 16K
       A6 9E 4E 9A 6C 92 9F 20 00 DD 51 B3 1B 13 6D 8E>)
$$ ##END=
$$ 
$$ hash MD5
$$ 68 2A 93 9C 77 DA 37 87 D1 DC C9 29 88 06 4F 9E
##$RELAX= 
##$RELAX= 
##$RELAX= 
##$RELAX= 
##$RELAX= 
##$RELAX= 
$$ Bruker specific parameters
$$ --------------------------
##$DU= <F:/spectra>
##$EXPNO= 1
##$NAME= <H-F>
##$PROCNO= 1
##$TYPE= <nmr>
##$USER= <she>
##$AMP= (0..31)
100 100 100 100 100 100 100 100 100 100 100 100 100 100 100 100 100 100 
100 100 100 100 100 100 100 100 100 100 100 100 100 100 
##$AQSEQ= 0
##$AQ_mod= 1
##$AUNM= <au_zg>
##$AUTOPOS= <>
##$BF1= 200.13
##$BF2= 200.13
##$BF3= 200.13
##$BF4= 200.13
##$BF5= 200.13
##$BF6= 200.13
##$BF7= 200.13
##$BF8= 200.13
##$BYTORDA= 1
##$CFDGTYP= 0
##$CFRGTYP= 5
##$CHEMSTR= <none>
##$CNST= (0..31)
1 1 145 1 1 1 1 1 1 1 1 1 1 1 1 1 1 1 1 1 1 1 1 1 1 1 1 1 1 1 1 1 
##$CPDPRG= <>
##$CPDPRG1= <>
##$CPDPRG2= <>
##$CPDPRG3= <>
##$CPDPRG4= <mlev>
##$CPDPRG5= <mlev>
##$CPDPRG6= <mlev>
##$CPDPRG7= <mlev>
##$CPDPRG8= <mlev>
##$CPDPRGB= <>
##$CPDPRGT= <>
##$D= (0..31)
0 1.2 0 0 0 0 0 0 0 0.06 0 0.03 0 0 0 0 0.0002 0 0 0 0 0 0 0 0 0 0 0 0 
0 0 0 
##$DATE= 1619518743
##$DBL= (0..7)
120 120 120 120 120 120 120 120 
##$DBP= (0..7)
150 150 150 150 150 150 150 150 
##$DBP07= 0
##$DBPNAM0= <>
##$DBPNAM1= <>
##$DBPNAM2= <>
##$DBPNAM3= <>
##$DBPNAM4= <>
##$DBPNAM5= <>
##$DBPNAM6= <>
##$DBPNAM7= <>
##$DBPOAL= (0..7)
0.5 0.5 0.5 0.5 0.5 0.5 0.5 0.5 
##$DBPOFFS= (0..7)
0 0 0 0 0 0 0 0 
##$DE= 6
##$DECBNUC= <off>
##$DECIM= 32
##$DECNUC= <off>
##$DECSTAT= 4
##$DIGMOD= 1
##$DIGTYP= 9
##$DL= (0..7)
0 120 120 120 120 120 120 120 
##$DP= (0..7)
150 150 150 150 150 150 150 150 
##$DP07= 0
##$DPNAME0= <>
##$DPNAME1= <>
##$DPNAME2= <>
##$DPNAME3= <>
##$DPNAME4= <>
##$DPNAME5= <>
##$DPNAME6= <>
##$DPNAME7= <>
##$DPOAL= (0..7)
0.5 0.5 0.5 0.5 0.5 0.5 0.5 0.5 
##$DPOFFS= (0..7)
0 0 0 0 0 0 0 0 
##$DQDMODE= 0
##$DR= 18
##$DS= 0
$$ [...]
##$SUBNAM2= <"">
##$SUBNAM3= <"">
##$SUBNAM4= <"">
##$SUBNAM5= <"">
##$SUBNAM6= <"">
##$SUBNAM7= <"">
##$SUBNAM8= <"">
##$SUBNAM9= <"">
##$SW= 16.9725357007746
##$SWIBOX= (0..15)
0 0 2 0 0 0 0 0 0 0 0 0 0 0 0 0 
##$SW_h= 3396.73913043478
##$TD= 16384
##$TD0= 1
##$TE= 0
##$TE2= 300
##$TE3= 300
##$TEG= 300
##$TL= (0..7)
0 120 120 120 120 120 120 120 
##$TP= (0..7)
150 150 150 150 150 150 150 150 
##$TP07= 0
##$TPNAME0= <>
##$TPNAME1= <>
##$TPNAME2= <>
##$TPNAME3= <>
##$TPNAME4= <>
##$TPNAME5= <>
##$TPNAME6= <>
##$TPNAME7= <>
##$TPOAL= (0..7)
0.5 0.5 0.5 0.5 0.5 0.5 0.5 0.5 
##$TPOFFS= (0..7)
0 0 0 0 0 0 0 0 
##$TUNHIN= 0
##$TUNHOUT= 0
##$TUNXOUT= 0
##$USERA1= <user>
##$USERA2= <user>
##$USERA3= <user>
##$USERA4= <user>
##$USERA5= <user>
##$V9= 5
##$VALIST= <valist>
##$VCLIST= <CCCCCCCCCCCCCCC>
##$VD= 0
##$VDLIST= <DDDDDDDDDDDDDDD>
##$VPLIST= <PPPPPPPPPPPPPPP>
##$VTLIST= <TTTTTTTTTTTTTTT>
##$WBST= 1024
##$WBSW= 4
##$XGAIN= (0..3)
0 0 0 0 
##$XL= 0
##$YL= 0
##$YMAX_a= 348106
##$YMIN_a= -374942
##$ZGOPTNS= <>
##$ZL1= 120
##$ZL2= 120
##$ZL3= 120
##$ZL4= 120
##$ABSF1= 10
##$ABSF2= 0
##$ABSG= 5
##$ABSL= 3
##$ALPHA= 0
##$AQORDER= 0
##$ASSFAC= 0
##$ASSFACI= 0
##$ASSFACX= 0
##$ASSWID= 0
##$AUNMP= <proc_1d>
##$AZFE= 0.1
##$AZFW= 0.1
##$BCFW= 1
##$BC_mod= 2
##$BYTORDP= 1
##$COROFFS= 0
##$CY= 11.3945322036743
##$DATMOD= 1
##$DC= 2
##$DFILT= <>
##$DTYPP= 0
##$F1P= 15.9154993809931
##$F2P= -4.1035820241983
##$FCOR= 0.5
##$FTSIZE= 0
##$FT_mod= 4
##$GAMMA= 1
##$GB= 0.15
##$INTBC= 1
##$INTSCL= 1
##$ISEN= 128
##$LB= 0.24
##$LEV0= 0
##$LPBIN= 0
##$MAXI= 10000
##$MC2= 0
##$MEAN= 0
##$ME_mod= 0
##$MI= 1.114404
##$NCOEF= 0
##$NC_proc= 0
##$NLEV= 6
##$NOISF1= 3.799351
##$NOISF2= 2.8
##$NSP= 1
##$NTH_PI= 0
##$NZP= 0
##$OFFSET= 15.70392
##$PC= 1
##$PHC0= -11123.21
##$PHC1= 15.60096
##$PH_mod= 1
##$PKNL= yes
##$PPARMOD= 0
##$PSCAL= 0
##$PSIGN= 0
##$REVERSE= no
##$SF= 200.130013532006
##$SI= 16384
##$SIGF1= 3
##$SIGF2= 2
##$SINO= 400
##$SIOLD= 16384
##$SREGLST= <1H.CDCl3>
##$SSB= 0
##$STSI= 0
##$STSR= 0
##$SW_p= 3612.71676300578
##$SYMM= 0
##$S_DEV= 0
##$TDeff= 0
##$TDoff= 0
##$TI= <>
##$TILT= no
##$TM1= 0
##$TM2= 0
##$TOPLEV= 0
##$USERP1= <user>
##$USERP2= <user>
##$USERP3= <user>
##$USERP4= <user>
##$USERP5= <user>
##$WDW= 1
##$XDIM= 8192
##$YMAX_p= 0
##$YMIN_p= 0
$$ End of Bruker specific parameters
$$ ---------------------------------
##NTUPLES= NMR FID
##VAR_NAME=  TIME,          FID/REAL,        FID/IMAG
##SYMBOL=    X,             R,               I
##VAR_TYPE=  INDEPENDENT,   DEPENDENT,       DEPENDENT
##VAR_FORM=  AFFN,          ASDF,            ASDF
##VAR_DIM=   8192,          8192,            8192
##UNITS=     SECONDS,       ARBITRARY UNITS, ARBITRARY UNITS
##FACTOR=    0.0002944,     1,               1
##FIRST=     0,             0,               0
##LAST=      2.4114304,     0,               0
##MIN=       0,             -374942,         0
##MAX=       2.4114304,     348106,          0
$$ Real data points
##PAGE= N=1
##DATA TABLE= (X++(R..R)), XYDATA
0 0 0 0 0 0 0 0 0 0 -8 8 -8 8 -16 16 -24 24 -32 40 -48 56 -72 80 -96 112 -135 154 -179 207 -238 272 -309
31 -309 351 -398 450 -507 571 -639 715 -798 887 -984 1094 -1210 1339 -1479 1633 -1800 1983
48 1983 -2183 2403 -2647 2916 -3216 3550 -3929 4355 -4842 5408 -6070 6860 -7815 9002
62 9002 -10517 12526 -15314 19445 -26149 38752 -70101 295514 348106 -374942 252597 -80580
74 -80580 -183681 258066 -95951 -35449 93854 -62104 100941 -87440 -32896 93287 -97385
85 -97385 49445 76582 -100221 53035 31286 -94119 47640 43282 -91265 55290 47199
96 47199 -59873 38708 -25311 -24606 44197 -40858 50419 -12289 -46612 75733 -86762 16981
108 16981 74030 -131165 92009 27538 -116516 120652 -67128 -81293 129551 -67297 -16265
119 -16265 53388 -61892 39308 -13035 -41247 53019 -36873 15719 43563 -68381 32404
130 32404 16292 -78531 50014 16715 -52958 55754 -7264 -43837 42558 -20664 -17089 32703
142 32703 -6206 5930 -19640 678 31331 -49407 21434 37609 -46494 47036 772 -52505
154 -52505 56229 -13201 -22340 42997 -18847 11036 7589 -27303 21200 -9113 1788 22452
166 22452 -25481 22938 11673 -43201 23868 13924 -23941 22480 1327 -14434 15694 -13700
178 -13700 -10948 11802 -6009 8079 -418 -9119 12512 -18642 -7279 15156 -13914 10111 -2701
191 -2701 -21644 24456 -10082 -24376 12587 -7799 5629 6003 -18053 4178 -1549 -3593 -222
204 -222 -10938 15103 182 -13915 13050 -11267 -8402 14351 -9712 3323 12447 -12946 -4390
217 -4390 9432 3040 -7167 -3236 12665 4506 -3011 4738 -6957 -3418 14480 -2811 -4676 15729
231 15729 -3365 -6310 8494 -2248 3699 3410 -2505 12614 2020 -4522 -3101 -5703 15593 188
245 188 -10893 12201 -4402 1606 7930 -18334 7890 10648 -11638 7850 -2262 -6892 4726
258 4726 -9173 4731 4132 -11436 6037 -5849 -3050 12817 -21211 -3020 20872 -15410 258
271 258 4798 -18692 11101 957 -14381 11337 -4141 -2940 2115 -12219 9199 -4516 -11523
284 -11523 15679 -8344 -1716 8916 -19514 12049 9710 -19621 12849 555 -7463 14033 -13151
297 -13151 -440 14646 -10055 7229 2418 -4967 14017 -11424 133 17092 -14111 7821
309 7821 7926 -14441 18322 -2529 -15967 21142 -2092 -5731 10706 -9018 8095 5252 -12532
322 -12532 10525 -848 -1406 9330 -14820 6628 9240 -16832 10494 1842 -9619 14210 -10487
335 -10487 -4848 14518 -15453 -1857 8112 -7956 6829 -7012 -9313 12645 -8120 -2948 4396
348 4396 -12551 13206 -397 -20744 14738 -3816 -10600 14724 -12675 -809 11445 -16600
360 -16600 4691 3591 -8532 6829 -8277 4227 8914 -16203 7695 3338 -9354 15367 -8710
373 -8710 -7060 19577 -10087 -3105 11185 -9407 7293 4478 -8362 11507 -2183 -3732 9744
386 9744 -5092 8835 2088 -12896 16000 -444 -9293 12880 -10311 2170 15232 -15751 3198
399 3198 9789 -8635 5131 -1795 -1693 6492 -7312 3425 1377 -6735 8352 -7656 -4550 15462
413 15462 -10845 -6071 10086 -9343 1549 2190 -10901 5791 -347 -7200 1755 -4599 4213 -322
427 -322 -11133 8846 -1325 -9173 8023 -7212 -663 9838 -12874 832 7916 -8460 2900
440 2900 -718 -2903 7041 -5617 -712 3287 -3223 4910 -5067 -857 11761 -7954 -127 7944
454 7944 -6212 6223 2071 -9343 9688 3555 -7208 5546 2777 352 2461 -1830 4506 1431
468 1431 -2228 5069 -5106 3199 9632 -14373 2616 12226 -11320 4372 2757 -6881 10140 -3486
482 -3486 -4110 4290 -3752 4710 -5302 -2718 11166 -10900 -1612 7686 -10291 4435 468 -10097
496 -10097 7616 -261 -6647 -735 -2107 3350 -2586 -6136 4210 -1989 -3873 2687 -5300 597
510 597 4607 -8058 1776 4235 -7163 2990 -857 -2948 8937 -6019 -4203 7006 -3546 1904
524 1904 -668 -3066 8260 -2875 -792 4181 -4394 6811 -1008 -4747 12120 -3173 -4465 8393
538 8393 -3811 1778 4356 -5781 4169 4512 -1130 -277 -2314 5458 1616 -6287 5025 1638 -3936
553 -3936 4509 -3275 -1373 7074 -5533 -1687 5857 -3513 493 -1513 -3615 6031 -3000 -3572 2986
568 2986 -4053 2560 -1158 -8115 6382 -630 -5428 3539 -4468 468 488 -7945 4887 1934 -6630
583 -6630 2516 -1518 -1034 2802 -5869 -718 3402 -360 403 -4434 269 5474 -6084 -842 5754
598 5754 -3637 2544 2198 -5777 5387 1681 -5922 5825 3082 -1180 -47 -1876 5168 197 -1783
613 -1783 5304 -4012 4209 6336 -10836 4839 6805 -6377 5214 404 -2023 4614 -4573 1179
627 1179 3733 -1023 2151 -2636 1949 3692 -6685 461 2674 -1930 3508 -1772 -4504 4567 -609
642 -609 -6397 2044 1384 -1843 71 -2893 -548 57 -3759 -264 -1582 1802 1250 -8015 3157 1727
658 1727 -8099 4358 -407 -4216 6207 -4098 -4504 3893 -1395 -1909 -1279 2772 3029 -5274 176
673 176 1887 -2973 3866 -104 -4451 7071 1201 -7353 3957 1975 -2202 4801 313 -929 3210
688 3210 -1304 -916 807 3886 1561 -4689 5672 3116 -6700 4302 164 -2741 8806 -3066
702 -3066 -4388 6751 -2018 -2747 1888 -22 2056 -1169 -308 584 -3133 2536 -2084 -3964 7659
717 7659 -1424 -7604 4030 -1172 -3227 2802 -3013 -850 3348 -2504 -2868 -655 554 -774 -3451
732 -3451 2710 464 -5012 2096 -2079 -2884 6041 -4232 -3641 6969 -3081 -3800 1985 -1659 1850
747 1850 1161 -1330 703 -32 1563 -2219 -1954 6341 -1197 -3048 5476 -1349 -913 3398 -3782 1351
763 1351 5761 -2387 -889 2813 577 -150 -731 1714 2035 -186 1817 -811 -725 4107 -3574 -1325
779 -1325 6543 -2023 -1252 2415 -2945 1726 897 -3764 2511 1447 -1213 -1246 -2144 2541 -865 -3301
795 -3301 2999 -1422 -537 1782 -5861 877 3539 -4962 110 1369 -2167 -164 -2584 -1137 1289
810 1289 -1451 -100 -1355 -254 2066 -4699 -1364 4136 -2491 -765 1412 -2828 2576 642 -4223
825 -4223 2524 2140 -743 426 -1358 2130 828 -2254 2402 264 916 2248 -2866 2513 3142 -3754
841 -3754 2035 2283 -783 2812 -1624 -761 3998 -481 -459 1327 802 2104 -1816 -754 2960 -1508
857 -1508 362 889 -1952 3371 -648 -4292 3415 259 -1870 939 -2104 1077 888 -3153 -695 -38
873 -38 1020 -197 -3275 2032 448 -4023 669 -376 -1949 1456 -2122 -2280 2881 -1637 -2776 801
889 801 1008 -8 -1636 -1086 1013 -1323 156 -517 -1850 3347 -69 -4052 3415 490 -2357 2347
905 2347 -865 1157 2403 -2392 199 1612 553 731 -1439 2719 2304 -2173 1685 -49 -396 3931
921 3931 -2319 -73 4501 -2250 -194 2203 -971 1470 75 -892 1810 491 -443 -1547 356 3455
937 3455 -2664 -1666 3522 -2045 -872 2166 -3838 506 2909 -4474 -787 2388 -1549 -1717 -502 832
953 832 -768 -1565 648 -2513 -396 2229 -4758 -278 4169 -3810 -1011 2269 -2179 455 37 -2587
969 -2587 774 890 -889 -1439 295 2331 -1748 -1209 2751 -1641 585 1734 -3070 2634 2066 -4003
985 -4003 1609 2714 -1328 660 394 114 1806 524 -542 -111 2464 846 -2747 1735 2443 -2129
1001 -2129 1678 1203 -2359 2960 691 -3444 2702 1337 -2949 679 1463 -800 -1185 10 384 -920
1017 -920 1143 -588 -3707 2527 1054 -5012 1730 1670 -3408 1327 -194 -2688 1512 -374 -2591 247
1033 247 699 -1209 -2620 630 1229 -3208 388 417 -2201 2666 -587 -3617 2455 313 -2433 725
1049 725 212 -255 235 -202 -103 547 711 -1006 -905 2586 124 -2392 2228 1203 -1106 1956 -385
1066 -385 -821 3625 40 -2138 2305 1400 -812 369 1323 857 -27 973 11 -440 2628 -744 -2240
1083 -2240 3735 145 -2567 2104 217 -1226 1221 -968 -897 1400 172 -1518 -738 1502 -451 -2854
1099 -2854 1150 491 -1781 1230 -1399 -1709 2363 -1440 -2649 1674 264 -1496 -472 -129 -285 -744
1115 -744 -51 -865 -261 1736 -1718 -2013 2698 36 -2213 1292 80 -437 1476 -1550 -944 2511 -72
1132 -72 -1293 880 1369 -206 -703 909 888 -163 1810 -575 -622 3656 -1494 -1843 3403 -76 -236
1149 -236 1442 -790 1134 904 -578 -131 921 1504 -1319 -629 2630 -958 -1232 1502 -1287 654
1165 654 1406 -2421 59 2239 -1336 -1495 243 253 -386 -1146 -624 -267 224 38 -2019 81 1336 -2352
1183 -2352 -1126 1625 -1424 -421 211 -1893 1234 802 -2330 -622 919 16 -1331 -500 819 -456
1199 -456 -303 324 -1197 1433 749 -2302 1155 1686 -1513 128 1043 84 1113 -186 -666 1324 1123
1216 1123 -403 -450 1538 1719 -1184 185 1102 -480 1070 187 -958 2742 746 -2102 1259 1197 -239
1233 -239 266 -176 733 668 -253 -732 -490 1590 -196 -2156 1754 765 -1648 412 -1169 -920 1308 -1432
1251 -1432 -1411 1468 -96 -1408 -643 232 -275 -1274 -284 -541 -467 308 -1880 -1414 2177 -519 -2057 1293
1269 1293 90 -1143 363 -1437 -288 1371 -808 -966 421 1200 -544 -1215 1368 496 -798 1270
1285 1270 -654 65 2228 -1892 -658 2670 137 -399 728 664 642 25 202 76 743 1410 -1268 -341
1303 -341 2355 -426 -961 1838 170 104 599 -932 257 1266 -918 -1207 1133 973 -939 -1001 404
1320 404 219 -75 430 -903 82 1364 -1892 -1038 1663 -1008 -1029 717 -1032 -116 -405 -1426 -255
1337 -255 913 -102 -1757 -283 1317 -1370 -920 945 -1024 261 640 -2643 412 1931 -1906 -822
1353 -822 1227 63 -454 50 299 -142 655 571 -1209 1218 1794 -2289 229 2571 -738 150 1402
1370 1402 -441 1162 1036 -1067 163 1676 138 -1113 845 1549 -1001 -91 838 -537 1000 299
1386 299 -1966 1458 1338 -1824 -208 502 -53 286 -253 -692 158 330 -977 -1052 1341 -96 -1948 356
1404 356 571 -1064 104 -698 -1407 1301 -180 -2580 508 1017 -1572 -445 144 -210 276 -51 -946
1421 -946 -700 1581 -752 -2147 1829 292 -1925 939 281 -694 1153 -294 -909 1203 579 -1162
1437 -1162 55 1953 -117 -723 1107 56 254 985 -566 -146 1973 221 -1205 1315 1246 -851
1453 -851 309 326 -42 1051 -104 -624 992 743 -677 -631 950 307 -824 685 -463 -221 1098
1470 1098 -1543 -574 1628 -694 -1153 533 195 -610 -585 -291 -589 252 213 -2193 -93 1329 -1726 -1077
1488 -1077 655 -458 -583 -67 -627 -349 808 -629 -1314 1144 364 -1382 -63 540 -155 -257 121
1505 121 -318 373 802 -1047 -274 1843 -324 -766 913 53 272 154 -460 227 996 339 -767 452
1523 452 1347 -776 -96 1223 240 566 371 -475 699 1234 -790 -450 1316 263 -502 156 55 366
1541 366 330 -292 -359 786 262 -1373 -190 1134 -890 -745 396 -513 -63 38 -1281 -75 404 -1179
1559 -1179 -900 216 270 -816 -758 485 -271 -63 -200 -1412 424 745 -1676 -203 719 -584 -299 57
1577 57 -543 201 248 -633 -99 844 -264 -1057 751 1188 -661 -100 663 -157 999 293 -952 1224 1074
1596 1074 -825 208 784 603 288 195 377 230 800 170 -817 1431 706 -1167 949 628 -256 175
1614 175 47 -307 714 185 -903 185 948 -616 -775 672 80 -474 78 -834 -509 776 -432 -1328
1632 -1328 778 178 -1607 25 -54 -589 29 -756 -700 390 -68 -821 -771 1072 -88 -1457 878 -32
1650 -32 -351 576 -969 -237 1159 -918 -1068 1082 484 -526 -125 309 244 315 335 -397 708 1235 -1217
1669 -1217 -349 1412 282 -292 969 189 465 625 -351 -121 1512 475 -802 743 816 -442 -267
1686 -267 471 47 125 526 -547 295 1329 -1020 -772 1299 42 -355 28 -379 40 257 -653 -718 387
1705 387 577 -1492 -504 1113 -857 -492 -159 -867 568 82 -1286 -227 450 -524 -972 218 240 -386
1723 -386 -110 -410 -260 550 -141 -798 791 784 -1066 -341 851 -190 117 169 -515 830 789 -701 -184
1742 -184 1086 373 -597 528 904 -196 151 167 -190 1032 305 -895 718 1313 -456 -262 633 440
1760 440 188 290 -277 52 806 -599 -655 777 638 -488 -255 322 -308 8 -175 -670 597 -15 -1057
1779 -1057 -127 606 -212 -904 94 470 -301 -295 -688 -770 818 -249 -1403 621 331 -772 -237 -402 59
1798 59 164 -679 -383 185 482 -803 -792 822 341 -706 223 166 140 687 -826 -146 1239 395 -762
1817 -762 415 1034 -66 205 4 110 878 442 -577 514 1333 -250 -941 1184 739 -454 778
1834 778 30 22 995 -470 -757 1196 710 -628 -41 472 -181 -373 248 -453 137 680 -1216 -288 1080
1853 1080 -669 -821 208 -26 -180 -204 -549 -441 377 -377 -1295 518 310 -900 -413 254 -72 -255 -90
1872 -90 -866 51 472 -1227 -717 1157 -368 -692 424 -44 -71 386 -809 -119 1135 -24 -1005 328
1890 328 896 -733 -61 763 -183 595 532 -603 861 1200 -552 -389 975 612 -437 277 440 60
1908 60 622 292 -396 1081 815 -1181 -18 922 -538 -264 561 -439 465 424 -1080 -82 724 -213 -899
1927 -899 359 362 -492 -223 -39 -245 761 -480 -1219 611 336 -1240 -334 195 -235 -178 -431 -480 115 56
1947 56 -1006 -593 629 80 -804 172 217 -425 28 -55 -359 965 298 -951 614 1067 -698 -290 468
1966 468 213 205 33 -138 397 753 84 -770 1037 696 -813 147 474 -31 440 -150 -208 812 432 -655
1986 -655 26 856 182 -405 197 463 -13 -39 -333 -79 707 -53 -1084 687 518 -723 -52 -88 -203 359
2006 359 -411 -658 491 -25 -560 -882 564 10 -822 -63 -180 -411 477 -884 -602 758 -414 -1066
2024 -1066 -249 235 0 -592 -5 17 -159 194 -823 -158 1201 -416 -718 903 138 -287 241 38 12
2043 12 615 -213 -612 854 632 -648 -36 835 157 -114 488 37 498 897 -1018 42 1538 -163
2061 -163 -454 687 205 -95 45 -185 -102 661 132 -825 401 1055 -1046 -579 702 -351 -299 163 -670
2080 -670 407 605 -1177 -617 803 82 -959 249 57 -385 -106 -331 -754 326 225 -1204 118
2097 118 764 -1105 -593 461 -350 90 -44 -724 208 704 -461 -794 613 494 -492 -20 548 -163 437
2116 437 -15 -502 1006 516 -862 16 918 -129 -189 202 33 78 384 -402 257 1445 181 -807 570
2135 570 757 -310 170 40 5 471 83 -529 565 632 -823 -121 607 4 -531 192 -80 -157 397 -397
2155 -397 -863 857 124 -1213 -30 585 -354 -219 -300 -397 126 -163 -982 -365 474 -599 -878 116 -213
2174 -213 -565 -317 -213 -214 200 -507 -776 550 148 -594 -248 416 185 -261 38 -223 505 334 -393 -10
2194 -10 699 389 -363 377 535 48 146 -156 3 542 -92 -629 542 767 -95 -414 630 606 -32 325
2214 325 -361 270 602 -350 -342 743 170 -703 92 300 174 -276 -70 -338 229 294 -939 -70 439 -261
2234 -261 -733 212 -29 -280 35 -476 -143 375 -564 -985 462 49 -494 -485 28 -40 -118 -340 -577 152 290
2255 290 -859 -290 631 -152 -281 -123 -208 504 -38 -385 -74 479 269 -354 180 721 -76 88 57 -5 582
2276 582 -1 -802 755 805 -254 -10 386 161 9 -73 -76 484 448 -138 -188 791 148 -724 123 527 47
2297 47 93 -78 5 532 72 -744 409 607 -426 -257 294 -148 -150 -115 -512 -54 170 -462 -642 333 186
2318 186 -865 -319 285 -383 270 -428 -560 635 22 -852 -39 384 -167 -260 -64 -61 416 279 -553 -164
2338 -164 930 -223 -694 662 235 -320 301 -26 221 776 30 -253 717 578 -387 -103 821 186 -145
2357 -145 239 -8 529 447 -568 -93 836 331 -640 536 523 -470 451 -111 -292 640 178 -556 360 544
2377 544 -646 -102 271 -206 -510 -19 -397 -135 430 -836 -500 435 -147 -607 22 -185 -198 -216 -207 -289 305
2398 305 121 -950 -48 581 -752 -594 303 -251 139 214 -589 -7 416 -411 -478 945 165 -754 256
2417 256 157 221 197 90 -270 724 719 -966 -24 1057 -219 -175 313 2 345 184 -499 301 675 198 -619
2438 -619 313 706 -253 -15 249 -15 247 236 -537 325 583 -461 -398 627 62 -659 381 -48 -74 193
2458 193 -379 -720 668 232 -1170 -260 661 -346 -303 96 -558 213 -211 -919 -189 438 -310 -947 192
2477 192 402 -764 -246 165 -543 527 -15 -891 626 586 -876 -223 710 -29 -334 -61 -16 111 472
2496 472 -351 -539 1011 169 -589 493 583 -412 485 341 -268 465 259 -857 267 1050 -677 -479 957
2515 957 444 -194 635 -156 -305 1154 -301 -739 785 320 -625 -16 271 -409 82 61 -303 181 349
2534 349 -923 -522 968 -387 -761 617 187 -516 -11 -535 -704 717 -342 -826 592 395 -866
2551 -866 -261 502 -180 -354 292 -550 118 561 -1040 -455 1240 -205 -698 431 43 -183 392 -143 -527
2570 -527 791 318 -852 284 786 -272 -183 476 -89 513 437 -705 276 1152 -90 -302 580 284 -386
2589 -386 179 374 203 608 -44 -535 407 705 -663 6 319 -365 -186 312 -155 93 256 -770 -282
2608 -282 438 -299 -787 255 298 -436 -191 -325 -168 383 -323 -804 -18 657 -856 -690 125 -443 -242 -342
2628 -342 -426 92 248 -440 -577 644 50 -675 115 352 -118 -91 -130 -267 515 147 -525 68 673 -370
2648 -370 -454 477 339 -239 10 29 112 561 -5 -378 607 528 -236 168 612 -61 389 231 -207 806 489
2669 489 -404 -10 703 -52 -291 114 171 -27 170 -284 -441 467 120 -635 262 493 -679 -301 -184 -428
2689 -428 -39 -236 -576 -2 684 -450 -506 484 -85 -657 95 167 -360 32 -531 -571 286 149 -613 204 715
2710 715 -390 -198 3 -246 125 256 -508 -19 546 -204 -626 337 390 -447 305 103 -152 474 -89 -611
2730 -611 625 633 -433 -12 558 84 237 438 -227 389 636 -212 -222 861 5 -435 355 425 -304 339
2750 339 111 -232 428 20 -556 173 592 -508 -181 264 -238 -233 161 -338 -210 442 -899 -692 405 -363
2770 -363 -792 28 45 -437 62 -127 -605 209 251 -625 -82 481 -398 -630 388 -141 -127 -58 -437 64 684
2791 684 -279 -852 784 363 -260 14 239 76 171 36 -163 517 556 -399 -56 731 47 -282 350 280 -12
2812 -12 18 -316 155 623 159 -352 188 510 -279 -44 207 -90 415 162 -314 165 549 -689 -340 355
2832 355 -153 -10 250 -24 82 124 -496 -303 153 23 -706 -135 -16 -184 -242 -332 -297 -91 18 -595 -262
2853 -262 404 -412 -721 144 69 -170 -417 -125 -102 440 123 -320 135 485 -371 -244 341 118 -38 -229 -85
2874 -85 313 273 -334 -186 287 425 -237 136 385 -6 257 -106 -114 529 283 -420 381 432 -59 -86 219 264
2896 264 95 -99 -134 285 386 -206 -536 571 188 -440 25 192 -144 5 -32 -279 341 206 -863 -119
2916 -119 342 -22 -537 -61 -53 -339 50 -370 -43 229 -160 -577 70 253 -441 -157 -332 -111 245 -205 -269
2937 -269 -6 216 -313 -202 514 77 -294 192 -115 95 287 -514 -1 677 0 -473 421 342 -276 -84
2957 -84 452 -12 214 277 -317 54 632 -302 -98 567 210 214 61 -200 282 306 -293 -160 487 20 -249 -74
2979 -74 337 -44 206 149 -38 227 257 -530 125 462 -318 -543 24 -21 25 35 -414 -188 185 -366 -416 412
3001 412 -34 -589 43 22 -78 125 -122 -526 372 147 -542 -311 215 -146 -189 -210 -80 2 2 -212 -258 349
3023 349 47 -487 651 262 -343 103 21 246 474 -38 -345 568 487 -182 -292 467 58 32 225 78 365
3044 365 299 6 -272 539 124 -288 102 269 -268 -109 -55 322 272 -98 -411 -15 270 -203 -348 274 -315
3065 -315 46 -77 -203 -80 171 -323 -434 144 -88 -249 -165 -251 -324 -360 -464 -187 520 -31 -760 -33 410
3086 410 -402 -528 52 41 -234 50 -250 -42 433 34 -420 345 478 -19 -8 327 149 -18 -16 -129 408
3107 408 627 -51 -127 619 382 -242 183 82 35 134 -119 40 390 413 -270 294 474 -135 22 99 102 35 150
3130 150 -290 75 410 -140 -620 317 277 -225 132 38 -13 22 -63 -188 4 58 -298 -409 246 46 -287 -23
3152 -23 -12 -56 110 -625 -130 424 -188 -833 137 -15 -126 -119 -43 -232 163 -202 -512 299 497 -87 -122 349
3174 349 82 229 -79 -266 117 301 -314 -430 306 318 -205 204 496 -74 3 337 16 518 93 -344 206
3195 206 369 -347 -46 353 -39 47 -188 -187 305 581 100 -367 259 166 -334 134 -12 -423 54 -30 99 309
3217 309 308 -508 -58 337 -221 -234 -133 105 -199 136 -309 -312 352 -138 -545 114 313 -550 -142 16 -286 31
3239 31 -55 -312 100 129 -290 -250 519 37 83 113 -60 197 387 -458 -110 450 152 -372 295 169 -82 37
3261 37 45 73 548 386 -146 395 571 -196 -27 186 -8 -135 207 65 4 410 33 -49 354 60 -442 171
3283 171 242 -19 122 -31 -192 238 125 -286 34 404 -361 -493 401 -120 -1 -131 -103 -295 35 35 -446
3304 -446 -145 -109 -506 -190 150 189 10 -148 -584 135 122 -564 -130 531 164 -212 -144 -60 112 127 89 -286
3326 -286 90 -35 -42 203 347 -76 -113 216 29 154 166 -335 230 392 -35 -274 292 353 -51 204 276 -89
3348 -89 412 247 -255 312 297 -396 126 450 111 -241 257 6 71 117 -256 -403 444 -48 -560 297 118
3369 118 -218 114 -213 -120 216 209 -306 237 106 -501 -94 168 -230 -63 64 -135 -245 210 -217 -581 379
3390 379 29 -671 358 160 -421 39 53 7 318 1 -310 -162 494 -72 -395 478 229 -214 146 -210
3410 -210 -37 486 54 -349 238 -53 -485 38 321 165 178 253 -294 156 339 -289 294 515 -152 -304 454
3431 454 114 -51 93 20 -215 361 -161 -370 15 241 -405 -60 -94 -349 155 364 -537 185 616 -476
3451 -476 -335 14 86 -491 -106 -129 -348 156 -144 -389 236 99 -561 101 155 -226 52 148 -313 140 123 -210
3473 -210 -29 522 -46 -238 122 264 -116 87 39 -75 421 -3 -208 326 321 -285 277 430 -117 -238 164
3494 164 -237 170 398 -143 -57 408 94 -406 406 204 -247 181 208 93 225 26 -460 280 131 -163 -293
3515 -293 55 -287 -394 16 20 87 48 -266 -462 144 -172 -550 -78 -211 -355 -55 -83 -357 138 328 -243 -193
3537 -193 47 -233 -419 44 94 -58 122 -309 -283 291 187 -308 287 175 -569 84 50 -130 196 115 -51
3558 -51 84 346 -434 -54 270 2 105 189 193 89 262 50 -111 269 259 -174 309 587 -173 50 270 14
3580 14 59 3 14 33 245 -370 -218 -46 -50 -250 148 45 -38 125 87 -126 157 180 -601 -194 136 -566 -36
3603 -36 -71 -57 -46 14 -231 -255 266 -51 -318 -116 165 -219 -210 -62 -6 295 -76 -341 173 139 -394 -249 -79
3626 -79 173 -26 437 -13 -9 253 -4 27 669 313 -14 256 572 -59 62 40 -230 210 -160 -347 119 468
3648 468 -59 -225 56 316 -27 56 -176 -37 7 -258 17 277 154 -236 53 -127 -186 -26 -309 -14 235
3669 235 50 -478 50 239 -267 -278 225 100 -230 180 -235 65 351 -76 -546 158 -27 -382 -220 -358
3689 -358 -244 -136 -46 -218 -139 243 -305 -60 236 -88 -197 5 -38 508 200 -203 206 391 128 -181 165
3710 165 297 169 -155 112 195 332 75 -116 137 161 51 26 102 302 -54 168 23 294 353 -141 -327 256
3732 256 157 -112 -144 156 3 -108 -8 -193 366 1 -259 -279 144 -417 -335 -202 -269 -174 -215 -211 -71 33 -211
3755 -211 -431 -37 202 19 -183 267 -255 -86 47 -310 25 10 -362 36 169 -44 -176 123 27 -77 56
3776 56 -172 40 462 164 -240 185 195 -255 -348 -31 203 206 -59 -299 97 284 136 -111 374 238 41 73
3798 73 70 85 211 -203 -102 260 49 -259 -19 161 -169 -39 -192 75 177 -32 -80 32 397 -188 -314 108
3820 108 444 -13 -297 186 -242 -81 -130 -290 -97 297 -228 -240 -6 116 -387 148 -195 196 8 -267 -113
3841 -113 409 -85 -223 -44 126 -19 -223 -150 -56 235 381 -347 -44 297 -102 -24 289 7 -155 -74 -148 -9
3863 -9 205 -54 -236 423 324 -211 40 491 -123 63 263 87 257 343 -305 191 296 40 -210 187 229 -1
3885 -1 245 -344 226 53 -247 -390 334 143 -108 -92 176 -116 258 -342 -149 86 250 -123 -265 169 -453
3906 -453 -154 -145 -132 -198 -124 -147 -264 198 98 -194 -79 248 65 1 153 33 74 55 -272 -151 344 -225 -205
3929 -205 186 339 -115 -80 -20 19 59 -174 -36 173 86 -313 36 188 -26 -100 27 -73 328 74 -189 -54
3951 -54 191 68 -187 39 53 -77 31 187 -235 288 121 -308 343 62 -342 -154 -122 -203 134 -142 -235 142
3973 142 123 -260 -139 48 82 -386 -203 -42 -334 -234 -227 -67 167 132 -258 -3 54 -89 41 -171 74 -107
3995 -107 68 -114 239 29 -168 0 102 -152 -248 129 141 54 159 -91 -162 139 69 -240 48 190 42 47
4017 47 44 163 94 4 85 62 305 -61 161 165 26 -49 4 -49 57 172 -205 -5 212 365 -321 0 399 205
4041 205 -144 -16 -142 135 232 -14 81 428 -62 -321 14 259 -351 -149 -220 -32 -54 -59 -188 155 409 -144
4063 -144 -482 28 69 -264 43 -22 -143 239 -165 -107 162 120 -324 94 201 127 -103 -63 -258 -120 -43 -317
4085 -317 198 548 33 -218 181 55 213 129 226 -191 253 -258 -258 480 297 -164 268 310 -10 30 177 133
4107 133 67 114 -86 -50 487 -90 -376 80 54 97 227 -67 -280 247 -130 -265 -50 82 -349 45 -55 -262
4129 -262 -84 -79 -161 -7 100 -503 -320 17 -278 -368 -353 -176 -202 100 -299 -42 102 132 -418 29 319 -190
4151 -190 -137 51 179 45 11 -183 147 241 -13 25 -68 195 -165 -180 4 -293 97 33 -96 91 335 -204
4173 -204 70 284 21 -40 154 -9 233 79 -132 78 233 -135 -403 191 166 -214 20 166 84 299 2
4194 2 -235 120 72 -130 -244 118 -2 -224 -121 -255 -263 43 -158 -261 223 -37 73 -44 82 53 -144 -48
4216 -48 -156 140 -69 -281 155 48 -254 -117 82 -87 -24 108 -212 -22 181 -36 -237 324 357 39 110
4237 110 78 98 40 -210 -272 195 368 -222 -165 364 -2 181 168 -66 57 -15 45 -13 130 53 -151 42 240
4260 240 161 -136 -16 -89 -293 76 -40 -164 -5 -72 -84 135 80 -155 70 -166 12 176 -151 -148 91 -48
4282 -48 -170 22 -30 -189 -436 -78 -65 -109 85 -200 -257 242 -28 -97 261 -16 -85 -36 112 -31 30 60 -149
4305 -149 84 252 -213 116 -4 -101 17 42 -160 -55 10 32 -184 201 86 -5 128 186 10 -67 107 150 441
4328 441 147 -193 -42 255 129 -50 70 -84 -234 -153 -32 207 135 -35 -13 131 26 -245 -180 150 -266
4349 -266 374 3 -223 -78 78 -404 -114 71 -101 -220 110 -46 -232 -195 -265 11 240 -68 -218 141 -57
4370 -57 -285 -53 39 -68 103 -299 -353 239 81 -186 -125 281 -97 44 -29 -68 101 262 -82 -235 362 63
4392 63 -140 368 99 2 224 53 39 80 118 7 30 95 161 -158 190 -131 -95 65 164 -77 299 42 -70
4415 -70 141 -72 -105 156 307 -98 -183 -94 109 289 -267 -180 -257 129 -168 -83 164 16 -38 141 -48 198 137
4438 137 -80 -108 -5 51 -95 -187 275 48 -67 -52 132 67 150 -232 11 226 -23 -240 -82 -197 -50 72
4460 72 21 -32 98 211 -215 215 95 180 96 -45 176 163 238 -29 159 416 68 -86 264 272 -81 -160 188
4483 188 78 -201 24 94 260 180 -216 -376 368 -152 17 -24 142 28 162 44 120 153 -106 -371 -37 186
4505 186 -265 -320 -303 -22 461 40 -198 74 -190 -332 -353 237 -8 -222 -117 -109 -96 -154 -146 -168 117 -87 -218
4528 -218 84 151 -261 -26 -74 -259 405 166 -199 1 221 -99 -42 -37 -47 -39 238 62 50 310 7 -263 -1
4551 -1 75 185 75 327 124 80 182 -181 296 126 -245 -26 384 59 -236 153 87 40 31 -217 30 319 -151
4574 -151 62 279 -21 -377 -337 268 -23 140 -122 -92 100 10 -377 -111 250 136 -134 -39 -9 -110 -63 -35
4596 -35 -49 286 26 -166 -15 139 -254 3 52 66 203 -70 -141 -186 73 -22 69 305 47 -76 303 -69 15
4619 15 95 -175 -87 127 89 -89 106 164 -115 112 -36 -166 -11 116 -191 -216 162 147 -77 240 -56 207
4641 207 -92 -44 54 95 -163 -70 9 107 -144 -119 184 40 -81 -54 -80 -22 -188 -126 -109 52 30 -192 -154 290 -199
4666 -199 88 -141 -146 -124 54 -286 -230 174 -142 -9 -85 112 -254 121 0 70 265 -156 -195 -23 183 -256
4688 -256 127 -182 -20 118 1 226 241 180 -82 -68 89 106 -12 -16 59 98 -76 -23 -191 -17 -89 -127 314 183
4712 183 205 -108 -37 101 233 -139 -139 315 -25 16 -223 195 56 -224 -126 32 -22 59 -284 -105 37 -100 -60
4735 -60 -71 -59 -99 -62 -209 -108 69 -100 -288 -114 197 22 -58 -62 -139 34 -180 -104 110 268 -227 -29 231
4758 231 27 -208 389 319 -130 157 56 -112 198 125 141 -51 74 183 -364 134 48 58 65 -104 -148 28 -142
4781 -142 -162 350 -68 -312 -57 392 357 -67 70 60 350 227 -147 -100 173 127 34 -134 155 -459 135 -162
4803 -162 -166 152 -62 -218 268 160 -159 -151 60 -272 11 55 69 28 -72 -344 -344 268 109 -230 154 -34 -261
4826 -261 -27 -14 50 347 124 -114 122 156 13 44 15 -155 168 -21 -265 78 356 5 -167 207 74 107
4848 107 -42 117 -187 91 74 -80 333 189 118 327 481 122 104 126 37 -16 -26 29 -171 218 -67 -212 218
4871 218 49 11 32 -148 -71 49 339 -181 199 51 46 81 102 -142 -15 71 -97 -268 -13 -132 -330 -120 -39
4894 -39 -217 -5 -38 151 69 119 -117 226 5 -276 155 311 -148 -248 258 222 59 205 -87 -45 185 71
4916 71 -212 278 21 -58 1 76 -6 115 103 11 -2 119 96 -66 332 258 -179 -2 392 61 46 15 -99 143
4940 143 226 -188 337 -48 -157 93 -41 -1 117 -121 -158 182 -1 -14 -519 186 35 -201 295 -53 65
4961 65 4 -155 -188 -23 -234 -222 -153 193 81 -236 87 -246 87 -63 -81 -93 -29 -168 -265 1 -89 -215 152
4984 152 -240 -118 207 -155 -325 174 47 -128 5 214 -137 -114 7 -133 -55 186 -35 -231 304 -25 -431
5005 -431 156 1 -347 173 90 32 92 -137 -115 155 332 -150 70 5 73 262 20 -222 -45 -19 -101 -202 156
5028 156 177 5 78 54 128 17 -144 -290 123 -63 -233 83 278 -62 9 108 -94 54 196 49 -32 0 -109
5051 -109 -84 -42 -92 -271 32 -26 245 113 -154 -100 104 185 56 -86 106 13 -66 -30 -199 -13 277 -28 6
5074 6 180 -59 -241 36 24 -20 271 -257 -85 107 -5 -59 324 206 -190 108 89 34 -110 205 -290 118
5096 118 60 43 14 164 205 -88 -275 96 51 83 -126 -212 224 24 -192 -107 95 -110 -27 -46 -66 -129 -137 -79 -40
5121 -40 184 -266 -75 26 293 -219 -23 -68 -100 -25 129 18 244 41 -213 -153 143 -158 150 127 -1 138
5143 138 181 -218 -120 77 99 -253 -16 56 -249 -41 -57 -85 106 174 44 34 161 79 -201 133 448 -164 102
5166 102 96 160 226 -4 37 -3 231 -51 -132 218 -74 -34 119 -101 84 13 -161 -235 61 -98 -238 176 112 -154
5190 -154 -129 -226 -301 41 -132 -100 -228 187 -29 -421 194 -104 -123 25 -81 -235 36 -278 70 431 -192 -295
5212 -295 57 29 -100 107 10 -51 150 63 -236 123 96 4 -105 174 -102 -2 184 83 107 158 33 39 169
5235 169 68 205 157 133 196 -38 -66 -152 62 241 -193 160 300 -315 -203 -114 139 114 201 -181 43 368 89
5258 89 -120 12 31 -227 -180 16 17 58 43 -242 119 -75 -189 -68 238 -291 -223 -78 83 -48 -163 -164 -336
5281 -336 124 -226 -183 57 60 -28 -100 124 -27 311 -72 -41 115 105 -47 34 79 290 86 200 14 -37 258
5304 258 -12 45 164 200 -205 -31 185 12 63 285 -35 220 96 -329 180 403 191 -119 133 151 -84
5325 -84 -31 -120 22 -19 -86 -86 58 247 -283 -72 -17 -150 -28 -1 -45 88 -7 -374 -75 97 77 -100 -60 -55 189
5350 189 -30 -5 -172 57 52 -37 -225 226 102 -76 -74 -200 -81 -152 59 74 -12 39 -48 255 323 -33 -51 331
5374 331 -146 38 33 -67 231 164 -135 -202 91 177 192 -100 152 410 4 -94 -108 -34 136 -201 -216 103 45 -113
5398 -113 142 -84 104 26 -59 -43 92 -231 -41 4 240 -106 -98 -82 -30 259 -9 -170 2 144 -430 80 -49
5421 -49 -168 29 -126 -31 -39 -19 -154 -161 -36 -223 -34 -146 -37 -166 267 11 121 109 12 -20 151 339 70
5444 70 -115 126 227 161 138 -45 112 -134 24 -21 523 -39 -88 271 61 23 189 22 58 136 199 166 115 310
5468 310 110 -129 20 -106 -149 275 -128 57 98 -207 41 145 -90 -47 36 -156 123 44 -282 109 147 -10
5490 -10 -219 -116 131 -368 -77 -201 -68 55 96 -80 -108 85 -124 -193 290 -105 -149 23 57 -253 92 -306
5512 -306 -52 234 0 -310 -43 166 -200 -49 49 -48 25 129 -228 167 91 -148 -5 30 -188 15 107 -78
5534 -78 122 259 -101 -130 243 165 -46 -98 302 48 106 -59 65 -112 182 50 3 -15 -124 -138 -32 268 -168
5557 -168 -81 -58 -108 126 -91 -245 -106 -53 -15 -289 -82 82 -45 213 -46 304 58 56 -12 147 -6 -1 75 259
5581 259 -4 -125 69 -41 96 1 -248 -38 -84 -82 -220 -139 38 -5 11 -13 85 165 -23 -281 59 119 41 -160
5605 -160 35 152 131 35 -105 220 18 135 46 267 -46 -35 46 158 137 375 -66 76 87 234 15 -160
5627 -160 234 -226 -99 68 -25 50 -74 -89 45 -2 175 -182 -61 -10 63 -64 108 36 207 126 -128 -85 -92 -215
5651 -215 -36 29 -128 -16 -150 117 33 44 -110 -23 243 119 -194 23 112 78 -12 254 -171 271 75 -71
5673 -71 92 26 -296 -23 195 -8 -257 -135 73 -12 358 77 -84 257 201 -20 -37 102 -134 101 113 35
5695 35 251 -30 49 145 189 4 -139 8 178 145 58 -339 5 26 -30 -78 84 -10 -127 38 -144 -115 184 13
5719 13 -229 186 297 -386 -55 162 -63 -12 -164 -138 -89 -129 -186 22 67 -12 -321 225 -87 -28 -22 -134 7 -34
5743 -34 168 -305 90 97 63 38 41 33 170 159 79 129 -110 47 164 134 123 -303 -35 232 -178 -85 -122 235 214 -12
5769 -12 -240 9 126 -64 -166 214 56 40 -58 -89 -121 24 -231 110 209 47 -70 -85 -175 81 -186 -106 -76
5792 -76 174 57 19 -109 145 207 -111 -70 129 146 -145 -67 -54 207 -38 -89 93 34 150 -23 -151 -162 227
5815 227 60 -263 218 204 57 -21 198 164 110 -132 122 100 -60 72 17 47 416 38 95 -48 97 91 -20
5838 -20 -76 145 150 -109 34 61 111 13 66 -81 51 -58 -100 -29 163 -66 -229 156 143 2 50 130 -107 93
5862 93 -27 129 149 329 21 24 18 -18 -133 155 95 -87 -80 44 49 207 -229 -166 -73 48 -55 -36 120 90 25 -8
5888 -8 29 -136 234 -58 -119 -244 230 -146 -68 88 -70 -174 159 -166 187 16 -159 90 74 -233 -91 447
5910 447 106 128 54 3 -147 261 137 -103 27 69 -123 -16 78 43 -182 2 -124 -119 52 -165 -71 58 -20
5933 -20 -116 -151 -53 93 189 -63 -43 48 -75 -229 -161 -98 -105 -252 21 -55 -100 10 -154 -133 138 -237 47 158 -309
5958 -309 -208 36 -234 1 32 -177 -46 -78 -120 -404 -143 -186 -220 -42 -76 -155 95 81 -157 112 240 -162 -242
5981 -242 10 143 81 41 69 -265 122 -295 52 -51 110 59 18 154 94 6 115 -136 -87 276 -73 -8 172
6004 172 -207 -217 89 -154 99 -138 -77 64 47 244 -60 133 -57 85 -79 63 -14 -200 -74 -143 150 -14
6026 -14 215 -470 -140 -68 -118 156 -56 126 89 -78 -311 -231 54 -82 99 90 135 141 109 206 172 268 154 137 17
6051 17 -30 -106 73 35 -10 -130 -372 139 25 -207 -147 172 -36 -100 -28 363 117 19 -241 -98 109 -103 -35
6074 -35 -128 164 -60 -45 88 160 -213 -152 66 -102 116 -25 -148 -155 23 -23 -51 -44 0 73 41 -23 -395 -71 -40
6099 -40 -272 176 73 -86 -132 110 136 143 -55 141 -21 -18 14 -283 270 55 -423 67 58 -172 -133 -181 -188 44 168
6124 168 -123 161 78 -44 92 7 -325 205 147 39 -2 216 79 -237 113 88 -60 230 249 67 -11 -162
6146 -162 54 18 -187 32 83 115 -69 -165 4 93 12 -124 -56 -23 240 141 -142 114 264 -183 -84 -162 -87 -61
6170 -61 -9 -55 27 145 -193 -127 49 3 -71 -37 -246 142 10 72 -12 -107 57 -226 56 -29 -141 -31 -48 -100 14
6195 14 19 -205 -6 158 -24 -232 59 94 176 -139 -165 -35 65 160 143 107 7 -199 -157 129 131 93 27 -192 106
6220 106 72 -39 5 93 -107 -44 -2 20 53 -91 112 -121 209 -172 -80 295 221 -356 268 2 85 18 -147 93
6244 93 -53 114 -10 -9 -62 4 -99 -121 -34 -86 -231 -84 -73 -158 246 -132 -63 64 -125 64 9 144 146 -15 -36
6269 -36 146 211 -55 44 -134 -102 -114 94 79 -43 97 -42 -129 205 -212 52 254 67 -79 45 109 -186 117
6292 117 120 149 12 160 187 -150 192 86 6 56 11 106 11 34 3 156 59 -3 264 6 20 -71 -48 -148 148
6317 148 1 -28 -19 82 96 -235 180 208 -61 -35 87 -232 67 -64 -41 123 81 -113 -121 -116 -121 -103 -117 23 85 -100
6343 -100 -116 -60 35 69 -299 336 244 -214 -60 -63 -56 4 280 -17 139 103 -16 -95 -49 281 121 138 87 -173 266
6368 266 -26 44 61 184 -135 -126 -47 -12 215 167 -21 126 64 50 -136 44 -117 -106 -66 -13 -189 96 136 -142
6392 -142 -11 -135 143 157 83 132 -214 -241 31 246 -232 67 110 32 -101 76 -131 38 2 105 -207 34
6414 34 365 51 -76 25 -129 24 -107 -171 36 -63 1 4 182 190 101 -170 191 -67 -175 16 -8 50 -36 -46
6438 -46 -100 127 -410 -131 194 -94 -27 -10 -73 -19 -29 64 -79 216 139 23 -151 38 33 134 267 107 98 109 -155
6463 -155 6 56 124 75 101 -160 -61 69 -32 -56 -45 -66 -225 92 -141 -268 -289 149 314 -196 -198 -48 -26 -254
6487 -254 24 -116 65 -146 143 -140 89 -8 -324 171 -143 177 -231 -171 111 173 -37 -264 131 75 141 -270
6509 -270 -86 164 219 -132 -51 0 58 142 157 101 73 19 -289 -124 -43 -43 -37 366 238 -222 -11 -65 -4 -66 -66 97
6535 97 -192 -10 -83 171 118 0 27 94 -38 -210 -16 -13 -363 -67 -7 -88 -81 280 2 119 211 -59 120 41
6559 41 -106 -192 61 -385 -57 -135 87 132 -245 194 -248 11 -23 227 -35 -49 266 -317 45 212 -39 186
6581 186 -31 -41 173 -240 35 -15 223 22 186 99 -102 -308 75 -82 106 42 17 58 381 -85 -69 75
6603 75 87 10 10 232 87 136 19 -47 -74 -26 -291 -17 -5 19 63 56 -4 228 -244 -195 84 23 -110 -257 -113 175
6629 175 -94 109 -21 53 -185 -191 -68 124 110 -290 98 167 -132 84 10 -27 -174 -26 -115 -25 -17 87 -53 -223
6653 -223 -97 246 -31 -47 268 -40 -14 -74 213 213 -158 67 -76 16 130 100 193 -38 130 19 153 -26 233
6676 233 54 -222 -43 -223 -55 -118 -9 173 92 -133 53 9 206 -272 -79 -56 15 -52 -214 -33 122 -6
6698 -6 -8 130 63 97 -121 96 21 -113 151 -9 35 20 -212 -66 195 128 -206 -13 247 -94 74 65 46 10 -228
6723 -228 -222 -65 4 355 -196 80 -70 107 -39 -124 -37 124 -54 -12 64 -25 41 106 -25 191 -12 -92 -11 -34
6747 -34 214 57 36 299 150 212 199 71 34 -100 -7 130 22 -80 50 -137 134 15 172 17 205 92
6769 92 34 58 -98 248 -180 -2 -69 -17 -73 -267 -4 -256 -1 -202 -166 203 44 21 -188 62 190 171 -201
6792 -201 -253 -120 158 -507 35 -11 64 -101 -116 115 -41 183 -5 18 188 -6 -300 86 45 241 60 35
6814 35 87 -4 -76 -282 -14 76 -28 -96 135 81 184 221 -25 -103 224 -47 3 348 -15 -56 127 244 113 -89
6838 -89 -134 0 56 64 -17 -23 182 -228 -214 84 32 -70 231 -142 -344 8 -67 43 -5 -72 -24 -49 175 -252 -88
6863 -88 -246 -415 -13 132 -180 -46 -37 -26 -274 -190 21 -6 43 160 -219 -142 -200 -151 2 86 58 -65 113 -110
6887 -110 101 56 186 233 188 -215 167 120 219 255 -128 83 77 9 -7 -59 272 -4 30 74 151 184 -48 -69 112
6912 112 32 -133 176 -52 298 137 -240 154 65 -88 85 55 -269 50 -50 -81 -249 74 -29 -248 -177 210
6934 210 -80 -327 224 134 13 -222 52 29 -182 -182 53 182 -311 21 -30 -230 -76 -95 -52 -125 -48 46 29 1
6958 1 -31 107 -132 5 -157 218 79 26 -61 225 -120 1 87 459 -89 -164 -150 -14 -41 -22 -43 -17 106 -96
6982 -96 56 -185 171 43 -70 -103 7 126 -29 37 151 -251 115 -75 -59 -89 115 -218 -137 -112 -49 -101 87
7005 87 112 3 -180 48 -100 271 145 -85 116 159 -118 -9 -101 -12 113 100 260 -175 -156 300 146 64 -85
7028 -85 48 -146 -13 -13 -168 -65 77 -229 198 21 52 120 22 -71 19 -127 36 21 171 -203 20 -42 -13 3
7052 3 -267 -330 -42 26 -271 144 -84 -30 18 -118 -204 9 -111 -157 -66 206 -230 -23 154 56 -150 84 -185
7075 -185 -115 112 -118 62 150 -66 155 -11 27 -4 -147 -122 94 -48 -107 134 49 304 -18 99 46 -138 76
7098 76 -113 -26 -67 -57 63 134 -161 -76 70 28 -83 64 171 -66 -139 92 -206 97 118 -115 30 13 -80 -25
7122 -25 -90 171 -166 46 59 129 162 -78 -159 129 135 -46 0 180 97 181 -106 132 29 -45 90 88 -11 -175 -132
7147 -132 10 30 -91 -79 -180 164 44 -71 -76 83 -29 228 -69 -282 82 8 -14 81 215 -105 102 275
7169 275 -162 142 90 -74 13 0 130 -92 -34 -86 100 -157 -57 329 -122 -156 42 104 65 1 206 36 236
7192 236 50 229 -57 258 18 -88 209 156 -192 99 310 -72 -136 5 -107 14 80 -352 -81 35 104
7213 104 -34 168 266 -172 41 -81 -72 -168 -95 -136 113 30 -316 -163 -229 -109 81 42 134 37 37 185 -94 132
7237 132 -189 -276 -117 -163 -175 36 20 91 -129 -184 -3 -189 133 -163 70 142 -82 -173 -75 -139 49 188 92 -161
7261 -161 34 9 4 76 25 -107 226 -125 19 282 -147 255 -136 -45 -45 238 215 -172 202 5 -74 19 342 112
7285 112 -84 -72 -17 100 134 -13 3 -12 68 36 -103 -233 -25 -73 -183 -23 -29 -56 148 99 -80 -177 -111 -251 -48
7310 -48 -44 214 -183 -238 6 215 67 -135 -125 -54 -7 93 13 -144 -214 -166 102 -168 -410 117 26 -164 -86 251
7334 251 -54 43 89 4 -112 131 241 105 44 -3 -160 -274 101 -162 11 -90 -30 133 -119 -83 4 156 -92
7357 -92 117 44 -167 103 -127 -37 70 26 181 -157 177 -118 -128 54 -77 -365 -111 -143 -275 -37 4 -64 14
7380 14 124 9 101 -97 -88 -135 -20 -176 -45 92 -20 87 -15 96 -16 -35 36 45 227 -6 -221 -1 -34
7403 -34 -85 101 283 -189 -98 34 -28 63 -254 -28 199 -248 381 -271 -93 -147 -22 311 -260 56 51 -224 132
7426 132 -13 -166 -173 -23 -12 -118 -147 -79 63 -115 187 45 213 33 -173 -22 71 -92 157 -26 -8 224
7448 224 146 47 -78 60 24 381 10 -138 85 -65 -127 19 -219 -80 -24 -177 -118 -19 -23 -249 28 -209 -36
7471 -36 185 -80 -191 -32 -126 -363 94 -127 -177 -65 119 -168 -72 -81 -203 106 -44 -46 -29 118 0 -24 74 -6
7495 -6 -91 -94 97 -265 -52 157 -105 -178 -67 -75 191 138 52 -8 358 100 -267 190 4 252 -243 -65 -77 8
7519 8 7 12 73 118 -192 -11 57 21 -88 -230 -19 -23 34 214 -40 -62 -187 -173 91 -2 -191 115 24 -107 -99 -143 -110
7546 -110 229 112 -181 126 73 128 -71 -132 126 255 78 226 -102 132 -109 42 -226 -76 -96 -128 19 -150
7568 -150 -88 173 24 -173 27 -69 273 -81 32 -125 92 -180 1 68 -158 -60 -35 -314 145 16 -254 -72
7590 -72 -117 -30 2 -33 149 170 -15 -102 -107 90 -144 -25 -42 -56 -78 -139 -62 81 -169 -38 72 22 86 25 -300 53
7616 53 -1 -14 -87 -102 -228 270 -10 52 -91 33 102 -147 -72 142 -192 82 86 -103 -100 24 114 -344 -76 235
7640 235 68 158 130 -122 -190 37 -46 219 -67 115 223 126 -43 167 81 25 191 112 1 -71 31 117 23 43
7664 43 -89 127 91 -109 78 -86 95 23 137 97 122 -181 -119 -36 -62 -67 -252 233 -176 -28 -4 87 -30 -121
7688 -121 19 -318 9 18 153 -59 154 25 6 -22 -66 -103 -76 141 126 -101 56 -59 10 -263 -241 85 -56
7711 -56 -60 -57 30 -151 -63 275 -178 -76 -155 56 -31 50 99 -371 -81 77 303 -10 -161 -29 38 -103 -158 -179 248
7736 248 -55 -49 59 186 -153 -100 -130 117 84 3 18 130 23 -16 226 -186 -127 -78 -94 -64 -47 40 54 254 -197
7761 -197 59 -88 -50 -157 88 -94 157 -115 -28 -122 -185 -31 -12 1 -29 101 139 101 -65 -149 -28 -21 -14 -148 7
7786 7 113 -221 -126 17 -141 -8 -32 133 168 92 224 3 159 -175 -188 -45 74 -215 -132 10 139 -72 12
7809 12 -48 -42 233 -113 -318 -207 103 42 -53 17 73 88 -234 -94 218 201 26 -48 -54 181 -6 157 -174 -117 186
7834 186 62 84 159 -239 -227 -261 58 -17 -80 222 -137 26 194 49 11 14 -52 -70 307 -113 117 -41 -45 -15 -139
7859 -139 -136 -43 -208 -31 188 -42 121 -54 -270 66 -18 1 -12 -35 -268 105 18 -2 163 -83 -19 -110 -226 204
7883 204 -170 -155 -101 12 74 50 -62 76 135 0 3 -370 -54 -160 -191 -82 148 -167 48 42 16 -37 23 -68 -136
7908 -136 67 -71 -94 53 231 -117 -57 -234 -142 -65 181 -165 -197 -22 -99 13 -222 81 -26 -178 119 19
7930 19 252 77 -16 -284 -95 -96 82 182 -6 26 -9 -199 -64 -223 -292 36 -28 65 -253 -57 38 100 -15 -237
7954 -237 -45 -9 11 87 -26 -97 48 -18 7 -113 211 -129 29 152 -127 126 228 95 5 -146 -68 55 -41
7977 -41 3 -51 60 79 -38 -136 98 -132 -45 1 -19 42 -61 184 -97 116 191 -91 246 41 -226 106 -149
8000 -149 -88 -35 -32 91 -91 -45 -144 -226 -10 27 -158 -59 -230 200 12 146 -40 86 215 13 -64 -57 158 75
8024 75 14 -112 -165 95 283 -13 118 -206 -56 -121 -36 101 -64 -207 29 -115 -116 -140 135 0 2 77 -62 26
8048 26 95 8 -38 -48 -60 -144 -128 -28 120 -183 130 64 121 103 76 38 172 132 76 27 49 -92 -272 84 -26 66
8074 66 -41 -90 36 -136 -15 -59 147 104 108 6 -78 92 -107 99 -129 45 -197 -24 -37 62 -57 -215 87
8097 87 -225 32 12 146 -42 128 178 -35 -131 129 -8 -38 -54 143 66 68 -126 27 146 125 129 -127 -82 -34 240
8122 240 12 112 -75 104 -138 136 137 89 147 119 95 -43 -53 -241 19 1 89 5 -54 65 -44 -188 112 -137
8146 -137 52 178 97 -146 -155 -171 -233 351 24 -195 -17 -235 91 157 109 34 -64 279 44 -84 -18 118 152 133
8170 133 63 262 39 36 7 93 -135 -27 -129 -67 59 0 -194 -26 89 -77 -244 -60 -101 16 119
8191A19
$$ Imaginary data points
##PAGE= N=2
##DATA TABLE= (X++(I..I)), XYDATA
0 0 0 0 0 0 0 0 0 0 0 8 -8 8 -8 16 -16 24 -32 40 -48 56 -72 84 -101 120 -141 165 -192 223 -259 298 -340
31 -340 388 -442 504 -569 641 -721 810 -907 1013 -1130 1256 -1394 1547 -1713 1893 -2090
47 -2090 2307 -2543 2799 -3084 3397 -3742 4126 -4552 5029 -5570 6185 -6893 7717 -8690
61 -8690 9862 -11303 13123 -15509 18782 -23594 31444 -47281 151514 -367452 -51388 191674
73 191674 -322029 253726 11921 -155402 133156 -48199 8850 -772 -107212 125813 -50943
84 -50943 -19830 105310 -91995 -14964 74513 -92138 11646 75430 -76174 5400 82134
95 82134 -77443 -16 17433 -49105 50418 -16373 -2641 28884 -75641 56087 -22179 -50668
107 -50668 108991 -93523 4718 103700 -140512 59107 30453 -129640 127086 -195 -84097
118 -84097 84256 -42180 -2867 36194 -55518 49788 3636 -25715 56187 -53034 -9166
129 -9166 53468 -66052 23413 59608 -60005 28168 27944 -60010 34943 13108 -33176 38833
141 38833 1953 -11320 -382 -9950 35886 -23304 -6859 59056 -41179 6678 33261 -62851
153 -62851 36529 23141 -48092 39977 -3817 -19858 19961 -28830 10509 11131 -15617 23546
165 23546 -18348 -3433 23059 -41293 6401 31655 -30549 5852 11772 -26433 7159 -2807
177 -2807 -18267 15489 -574 -3586 4183 -15124 6062 -6123 -14972 20779 -6360 -4189 8849
190 8849 -22312 14587 6623 -30101 16541 8068 -4575 11647 -15218 683 9768 -5830 5501
203 5501 -4221 9003 9779 -17073 9227 2767 -12245 18540 340 -4555 15019 -8837 -6522
216 -6522 13478 4543 -5063 -1415 11988 6516 -8127 960 -980 -4418 13202 2315 -10197 11098
230 11098 792 -12728 7862 1290 -2629 5033 -4950 4522 1167 -12223 -2348 -3161 8583 4348
244 4348 -17093 6693 1767 -9866 7799 -13488 -2104 16275 -14482 -2164 3503 -12664 4284
257 4284 -3109 -2193 8318 -11856 528 3241 -8295 10943 -9860 -10873 24371 -8805 -12594
270 -12594 13075 -13210 3931 12757 -16050 8327 5663 -9368 6759 -6458 4559 7920 -12694
283 -12694 14226 3363 -10501 14211 -9902 2177 20165 -18148 4240 13233 -13276 11232
295 11232 -1815 -8160 19640 -5924 -2587 9589 -8704 8965 -2068 -9699 18621 -8645 -6042
308 -6042 15067 -14895 5923 8109 -21549 14561 6709 -16916 9516 -4383 -3184 9104 -14426
321 -14426 2896 6115 -10218 6611 -9180 -4400 14064 -15876 155 10548 -15217 7305
333 7305 -1177 -13807 14627 -8138 -10163 13989 -6496 -516 1467 -11656 11567 -141 -9926
346 -9926 9539 -6873 3721 9065 -21187 9245 10959 -15656 13564 -915 -9532 17116 -9784
359 -9784 -2568 13740 -8768 5343 1679 -2504 13166 -11343 323 14120 -10577 9253 2840
372 2840 -13596 18352 -997 -12340 14684 -4229 -1378 10221 -10059 5379 4445 -9760 8618
385 8618 -1746 -1969 5849 -14135 6965 7350 -16897 8870 -1256 -8476 15788 -11986 -7576 14820
399 14820 -9892 -2107 3334 -7238 5204 -5140 -3409 4992 -8211 3348 -488 -9957 12796
412 12796 -4633 -13591 12107 -4067 -5295 7045 -8806 2337 5998 -8812 2639 700 600
425 600 4446 -8992 5291 6862 -10629 7153 1646 -5777 12108 -6366 -4582 13730 -5652
438 -5652 -1276 5869 -4049 6629 -604 -3765 7404 -1760 2134 1170 -3385 11267 -3192 -6408
452 -6408 10780 -3833 -284 6324 -9619 4816 7733 -9642 2007 5618 -3493 674 -2033 342
466 342 2250 -5268 1982 -1763 -3368 8485 -10188 -5873 15236 -9836 -4628 8309 -9168 4316
480 4316 922 -10131 5077 -2622 -966 -428 -7048 9172 -5717 -8855 11358 -7108 -2618 6510
494 6510 -9977 4453 4613 -8697 1017 1273 1832 1021 -5794 3931 2496 -4508 3652 -261 -880 6875
510 6875 -3918 -1101 8206 -4889 411 5260 -3541 7146 2 -7160 9183 173 -1625 4160
524 4160 -3187 6637 1108 -5184 6235 -2554 1910 3792 -7299 8292 1168 -10049 7770 -275
538 -275 -3979 5562 -5391 -107 5401 -4112 -1964 -1386 1955 2485 -7667 633 4222 -6570 965
553 965 -227 -5073 5471 -2890 -6251 6191 -2874 -4088 1348 -4128 3725 -85 -6551 3774 -1723
568 -1723 -1176 2434 -7042 3998 4245 -7355 3451 79 -2754 4074 -4840 2857 6457 -6691 1558
583 1558 3039 -2212 3934 -2036 -1308 6283 66 -401 -1168 -368 6649 -2408 -2772 7771 -1237 -957
599 -957 4780 -4475 2791 5199 -6059 3628 5348 -3984 -440 -485 3018 2499 -4268 3804 -994 -1832
615 -1832 6450 -8707 -1572 10080 -7462 -102 3332 -5740 2859 -2620 -2604 4551 -2925 -951 -1446
630 -1446 -2058 3057 -5916 -2522 4668 -2734 -155 -249 -5893 2455 1523 -7034 1242 3336 -2899 -612
646 -612 -1335 -1337 1838 -2071 142 1447 291 2220 -5318 566 6462 -6516 2143 5296 -5171 4987
662 4987 458 -5543 5772 1472 -2027 1294 2420 3336 -3740 -1026 5329 -1424 1923 3320 -4099
677 -4099 4427 4022 -7513 2412 5826 -3534 2543 1594 -3149 2063 -509 -2147 1530 1715 1423 -4701
693 -4701 1146 4636 -7608 168 4285 -5071 4813 -618 -8393 5407 100 -5704 2243 -132 -21
708 -21 -1112 -2764 696 -2622 88 936 -4793 4553 1256 -9361 2714 2679 -4692 2909 -371 -2562
724 -2562 3764 -1601 -3647 1372 1381 595 -1695 1534 2750 -4537 971 2442 -2794 5379 197 -5377
740 -5377 7128 350 -5333 4264 982 874 2959 -1392 1005 942 514 185 -1801 5118 1127 -5203
756 -5203 4482 997 -3616 3592 -1526 -1084 5834 -2527 -3399 3183 -12 -1146 -392 449 1724 -1839
772 -1839 -514 -312 -2513 2696 -1750 -3957 5184 -911 -5330 2443 -1815 -1084 2070 -4155 378 2531
788 2531 -3187 -1587 -1629 1394 718 -4264 1916 825 -3252 1692 -3216 -1277 5603 -3663 -1900 3740
804 3740 -1918 -236 -88 -919 2752 -75 -55 608 -285 2538 -1527 -1650 5605 -63 -2049 3351 -708
821 -708 995 2836 -3347 1834 3971 -1628 274 160 1240 1880 -2030 1529 1814 -886 1577 -1854
837 -1854 118 3987 -3616 -414 3341 -1915 453 -702 -2229 3081 15 -2847 790 -184 -96 -1738
853 -1738 -2594 2152 -1174 -2015 1203 -2141 485 372 -5028 1992 2103 -3999 292 -1037 -787 1359
869 1359 -2818 -957 1486 -80 263 -2449 831 2119 -3500 171 2203 -1603 1491 69 -2231
884 -2231 2970 679 -2925 1818 2167 -25 -620 -353 1856 496 240 1554 -776 2649 2064 -3688
900 -3688 2579 2948 -3180 2120 1330 -665 2472 -1601 -685 2710 41 279 -936 1208 2738 -2900
916 -2900 -205 1437 -1725 2286 -1141 -2654 3898 -1429 -2857 2427 -1192 -860 364 -1964 528
931 528 287 -1378 -1032 -577 2195 -1767 -3534 2973 -849 -3355 2031 -2250 -1621 3817 -3291 -2432 3488
948 3488 -911 -2047 624 752 -188 -1476 944 -147 -774 2995 -2205 -1847 5376 -1611 -2916 3808
964 3808 -460 -369 1757 -1596 1065 2270 -497 -412 895 2473 -498 -1449 3069 -306 -1036 2559 -1794
981 -1794 796 3522 -3184 116 3866 -1893 -461 1429 -172 1022 69 -1317 -207 1486 572 -2984
997 -2984 38 2886 -2784 -436 1586 -2839 186 1380 -4131 600 2101 -3684 -637 1594 -1274
1012 -1274 -1589 -3 344 -1006 -190 35 -3040 929 2258 -4532 -87 3391 -3198 -406 1470 -2509
1028 -2509 959 1030 -2203 689 1258 -662 -1392 602 2324 -1779 -98 2465 -1757 1691 1561 -3336
1044 -3336 2610 2589 -2580 983 1866 181 283 475 535 885 475 -281 -517 2136 1257 -2631 1163 2341
1062 2341 -1691 433 697 -1631 2214 468 -3240 1396 1804 -1899 -546 820 266 -778 -174 -314
1078 -314 -1513 1033 -294 -3312 2147 989 -3872 727 1104 -2003 97 -339 -1903 773 107 -1881
1094 -1881 -829 1163 -44 -2918 513 1822 -2118 328 263 -2040 1880 -55 -3070 1849 1450 -1331
1110 -1331 -54 584 602 -30 212 283 94 1587 -362 -1983 2519 1459 -1973 1323 1630 -586 1455
1127 1455 -119 -864 2653 694 -1751 1021 1311 -186 -879 802 1325 -485 761 278 -1427 2567
1143 2567 -333 -2796 2896 710 -1850 868 -550 -81 804 -1324 -603 262 425 -1089 -2072 1638
1159 1638 -324 -2544 1112 -532 -1024 1238 -2183 -1003 2288 -1355 -2002 767 16 -400 -702 -307
1175 -307 78 151 -104 -812 -147 1852 -1424 -1959 2449 -219 -811 1148 -831 711 1547 -1645 -260
1192 -260 1864 528 -526 114 1509 453 -706 1037 21 907 1487 -1580 571 2544 -1240 -392
1208 -392 1628 -64 524 219 -852 980 1428 -742 -732 1125 1207 -1256 -617 1313 -189 83 695 -1408
1226 -1408 1308 1101 -2932 128 1179 -1337 -512 -263 -125 471 -1149 -1031 -636 412 -6 -2479 524
1243 524 1104 -2405 -576 -172 -1347 1360 -660 -1536 1491 316 -1566 -677 411 252 -835 81 206
1260 206 -322 303 -456 -705 2257 855 -2097 1330 1441 -1198 524 100 -100 2036 129 -560 1013
1277 1013 1329 67 -1080 1341 1376 -1224 1044 360 -713 1937 -804 -1278 2655 500 -1250 485
1293 485 489 -107 -622 -166 310 134 952 -988 -1079 1763 -472 -2253 1292 304 -1396 212 -871 -587
1311 -587 1185 -884 -1762 814 877 -1243 -1344 161 413 -654 -350 -601 -600 1208 -1343 -1646 1974 -167
1329 -167 -1594 745 -323 -390 452 -1058 43 1330 -112 -1246 -8 1624 -368 -1227 1537 249
1345 249 -274 1374 -1406 -189 3044 -743 -912 2112 781 -397 336 643 538 331 901 -752 682
1362 682 2079 -1471 -840 2790 -421 -1049 1257 -517 139 996 -1294 -201 1286 -54 -1434 -1
1378 -1 1303 -1052 -1216 894 -550 -375 532 -2009 72 1203 -2079 -907 941 -418 -603 -520 -745
1395 -745 -5 99 -980 -1153 866 673 -1741 -269 933 -870 -191 375 -996 936 423 -1895 594
1412 594 1788 -1163 -732 1223 174 113 525 -333 -184 1337 506 -1642 1609 1670 -1881 254 1584
1429 1584 -607 1131 485 -822 1230 1223 -815 -590 1894 461 -1173 917 759 -499 708 -124 -738
1446 -738 1390 -67 -1715 533 1209 -1147 -546 774 -525 233 -152 -1097 231 531 -747 -1198 559
1463 559 137 -1371 -354 108 -944 518 -900 -1365 1224 -673 -1698 599 187 -604 -360 51 -259
1480 -259 -45 298 -1376 -315 1719 -985 -1129 1405 430 -530 367 124 74 1142 -126 -1408 986
1497 986 1211 -1131 389 1151 110 -119 298 477 434 893 -427 -514 2072 483 -1286 1058 963 -170
1515 -170 164 -248 260 948 -26 -764 -13 842 -479 -763 1049 236 -429 65 -642 -144 771 -1029 -782
1534 -782 1159 -89 -1222 -524 -32 -266 -282 -573 -755 462 -96 -1453 -531 916 -468 -1415 679 -221
1552 -221 -535 255 -1061 -418 881 -882 -695 535 621 -493 -455 664 418 -271 468 -642 375 1356
1570 1356 -1004 -284 1489 103 -674 541 254 323 499 -316 -7 935 288 -607 574 1567 -274 -523
1588 -523 1047 227 -9 636 -1093 433 1490 -1139 -436 942 249 -158 -541 199 53 -46 -114 -1221
1606 -1221 545 828 -1538 -177 1078 -1049 -432 -37 -503 67 183 -1056 -430 771 -713 -1178 571
1623 571 70 -641 -215 -192 -394 204 -384 -1184 608 806 -1565 -109 931 -442 284 -33 -514 811
1641 811 478 -543 -272 966 168 -1115 532 1053 -618 698 -3 -312 1593 -43 -1025 1083 956
1658 956 -775 -138 537 214 128 380 -434 167 1206 -602 -671 1511 163 -745 898 246 -368 345 -378
1677 -378 -429 964 503 -1379 271 765 -791 -613 203 -76 -135 22 -620 -522 1127 -854 -1380 993 201
1696 201 -854 -40 -475 -266 -141 -684 -651 96 626 -1259 -771 1164 -470 -825 393 -512 361 558 -1189
1715 -1189 310 1236 -97 -652 320 622 -389 -62 664 152 650 282 -538 778 1063 -604 -290 1035
1733 1035 421 -118 625 -37 492 807 -558 -160 1141 598 -667 -15 752 -334 -448 374 -113 529
1751 529 479 -1154 -147 1215 -588 -963 346 187 -482 -230 -475 -216 187 -453 -948 282 401 -1087
1769 -1087 -886 640 -549 -579 9 -649 262 344 -1141 -570 780 -219 -646 -150 360 -199 -433 -304 -163
1788 -163 476 518 -1289 504 1121 -829 -120 407 449 495 25 -230 638 834 -105 -769 1041 640 -261 710
1808 710 479 -119 493 -86 -138 1356 443 -921 349 1113 -109 -270 381 -107 492 444 -711 -328 1096
1827 1096 -300 -840 658 758 -877 -79 -65 -459 539 -459 -994 586 413 -1025 -477 237 -197 -986
1845 -986 32 80 -305 279 -1082 -583 1186 -507 -1192 404 237 -237 -465 -129 -208 242 -180 -1147 504
1864 504 861 -615 -215 945 194 116 284 -260 129 821 -412 -368 1634 411 -823 478 324 -270
1882 -270 434 -184 36 1223 475 -824 -15 1292 -113 -518 1061 79 -11 654 -652 117 1081 -562
1900 -562 -692 575 434 -677 -160 333 -290 412 -27 -689 285 505 -1257 -537 880 -560 -707 413
1918 413 -198 -294 5 -873 -398 743 -582 -832 -8 521 -643 -437 -16 -69 162 -158 -943 484 686
1937 686 -967 -722 826 -128 -423 8 -138 490 210 -498 -263 998 412 -636 360 909 -192 -263 245
1956 245 147 798 493 -803 408 1125 -378 -448 972 442 69 -37 -247 242 677 -58 -614 789 971
1975 971 -738 -131 734 -371 -106 -102 -417 492 83 -855 -191 712 4 -814 -437 99 -295 -537 -458 -375 203
1996 203 -72 -1059 360 472 -888 -565 198 -190 316 -279 -804 235 -93 -395 -812 289 564 -719
2014 -719 -76 491 -314 366 -190 -228 1030 142 -961 304 685 90 -265 446 724 138 552 -89 -112 1216
2034 1216 3 -635 871 709 -242 305 63 145 687 76 -262 694 367 -776 -65 921 141 -392 221
2053 221 137 4 526 -609 -401 1114 -225 -980 521 48 -686 -555 -39 -30 110 23 -946 -215 744 -1069
2073 -1069 -1370 733 -293 -337 163 -576 10 630 -707 -599 773 -25 -986 35 363 -377 -114 -15 -254
2092 -254 329 609 -1116 12 1228 -360 -723 765 -203 68 563 -113 212 940 -164 -522 747 710
2110 710 -605 -129 742 -128 131 586 -281 788 871 -872 37 911 94 -374 351 320 -111 -296 -126 -211
2130 -211 825 154 -1194 394 1006 -636 -270 4 -49 119 -120 -780 21 579 -1043 -998 438 -142 -824
2149 -824 -221 -14 -243 79 -512 -624 316 303 -1187 -152 726 -407 -43 -21 -66 316 -131 -255 -109 859
2169 859 -29 -477 403 603 -453 -10 22 157 488 87 -134 748 688 -270 5 1010 418 -66 255 107
2189 107 414 432 134 145 678 333 -595 334 705 -171 -305 -25 -64 661 122 -701 310 584 -320 -649 236
2210 236 308 -252 -204 -344 1 87 -507 -668 581 -93 -760 -396 191 -241 -429 -537 -443 314 -297 -935 -186
2231 -186 493 -326 -592 -61 277 -172 -372 -266 -214 411 -291 -824 305 492 -247 -240 -60 337 44 47 27 447
2253 447 811 -401 -179 973 160 -187 310 207 371 260 -264 173 866 133 -246 196 932 0 -288
2272 -288 349 2 225 125 -376 106 511 -564 -496 341 146 -328 -228 -67 57 267 -452 -648 556 -96
2292 -96 -833 -236 492 -329 -318 19 -331 -32 -81 -854 0 586 -349 -414 266 -99 -221 -110 -175 -101 180 -264
2314 -264 -540 332 679 -610 -75 797 188 -43 90 -464 758 223 -690 -18 815 -24 -505 220 346
2333 346 262 442 -383 -228 887 233 -872 667 370 -250 142 199 169 284 239 -615 480 488 -610 -113
2353 -113 646 -48 -630 179 77 48 220 -419 -407 637 -121 -1210 58 387 -774 -345 -208 -224 311 -91
2373 -91 -819 42 420 -673 -564 259 172 -605 -200 -227 -416 378 -357 -730 712 156 -1089 -14 226 -46
2393 -46 -225 -40 163 520 280 -326 -125 1127 -460 -355 749 436 150 313 -258 -35 856 64 -349
2412 -349 645 577 -370 218 664 325 163 7 103 400 691 -605 -203 1189 25 -250 425 92 -317 394
2432 394 -273 -19 470 139 -690 7 529 -570 -574 335 -263 -397 -52 -790 -9 562 -692 -682 388 26
2452 26 -845 -157 117 -241 -155 -175 -446 172 368 -994 -296 1045 -556 -426 358 123 138 190 -650 -110 727
2473 727 -306 -869 353 682 -478 -227 539 -29 294 346 -510 494 1099 -438 -291 821 45 -131
2491 -131 178 305 59 332 -89 -482 904 761 -937 549 937 -812 -14 318 -273 420 305 -871
2509 -871 -314 625 -500 -929 447 -2 -586 126 -193 -537 542 -287 -1135 757 381 -887 -157 448
2527 448 -555 -375 31 -479 203 309 -1018 -594 952 21 -1037 356 422 -606 117 -179 -365 738
2545 738 310 -800 314 729 -511 -352 682 78 -130 789 10 123 1108 -302 -737 1383 349 -677
2563 -677 302 302 -213 67 345 -331 778 582 -616 -5 957 -121 -499 578 209 7 532 -473 -86
2582 -86 710 -129 -711 597 382 -513 -2 163 -300 86 -451 -652 273 505 -808 -360 960 -253 -478
2601 -478 193 -148 -221 285 -592 -509 522 -213 -898 241 391 -410 -269 62 -226 158 -127 -445 135 748
2621 748 -551 -386 525 82 -5 -60 72 -141 378 -242 -175 637 325 -664 231 439 28 -13 422 84 400
2642 400 724 -636 126 872 -16 -393 365 495 -218 183 216 57 421 -171 -535 242 577 -462 -200 485
2662 485 25 -66 -12 -184 388 326 -775 -518 363 -317 -603 88 146 -405 -255 -219 -413 472 254 -1092 -10
2683 -10 641 -517 -511 286 -83 -10 -17 -129 -76 398 -227 -473 648 261 -418 136 148 -291 151 -233 -61 648
2705 648 368 -374 71 759 -80 -527 728 32 -16 65 60 -162 763 262 -460 615 573 -503 -98 416 -79
2726 -79 90 71 -568 518 253 -402 -129 698 -142 -331 295 -107 -81 505 -412 -542 604 329 -1263 244
2746 244 101 -465 13 -180 -395 80 100 -691 -251 434 -688 -777 539 24 -503 264 -286 -352 565 -459
2766 -459 -648 598 74 -833 -164 508 -207 -95 187 -431 148 272 -202 -107 964 -184 -569 556 231
2785 231 -308 317 25 -71 651 -91 -364 545 529 -155 54 123 -190 -28 185 -225 145 417 -297 -428 724
2806 724 155 -392 282 79 -131 121 -250 60 424 -70 -448 -133 355 -349 -274 221 -41 -183 68 -553
2826 -553 -56 386 -613 -665 348 -130 -464 -202 -285 -52 253 -447 -231 498 193 -677 -198 264 -206 -65
2846 -65 -99 -73 52 103 -420 24 674 -186 -316 315 461 137 100 226 192 178 56 -456 352 661 -354 -156
2868 -156 516 84 -98 184 28 223 187 3 -103 472 505 -307 370 293 117 -153 273 -118 500 217 -429
2889 -429 207 483 -230 -190 -18 -218 -91 -186 -29 -12 366 -137 -402 -64 90 -713 -262 36 -154 -121 -12
2910 -12 -595 -212 -15 -671 -181 176 -33 -371 82 335 32 -84 -78 -252 570 109 -782 279 318 -265 -19
2931 -19 191 295 80 13 -334 459 569 -438 37 413 350 -50 206 217 4 206 57 81 518 314 -363
2952 -363 120 471 -127 -6 -124 71 171 241 49 35 485 -616 -264 505 -7 -430 -12 -106 5 224 -479
2973 -479 -515 115 256 -466 35 214 -310 -194 -128 -99 39 -58 -445 -262 441 -325 -641 20 166 74 -40 -123
2995 -123 -236 198 -164 -352 631 385 -215 -143 197 -119 92 55 -200 275 430 -442 67 664 -73 -165 267
3016 267 282 225 265 -212 185 316 306 -422 545 587 -338 71 240 98 59 255 -280 354 274 -310 -305 556 179
3039 179 -576 -9 -193 -342 106 -200 -274 206 -46 -360 -87 71 -349 -124 -3 -196 -18 -152 -536 319
3059 319 408 -56 -510 128 -127 -434 13 -206 -115 306 -88 -303 361 390 -301 -243 290 108 -90 101 -96
3080 -96 221 73 -335 -34 621 164 -83 250 0 195 -82 353 -259 413 227 -411 567 470 -206 -313 208
3101 208 205 111 217 -158 122 325 -139 -142 441 17 -404 183 -63 255 71 -55 -213 258 -159 -540 -264 438
3123 438 -226 -160 64 73 -30 -191 -398 -333 87 -93 -492 40 292 -435 -236 251 -6 107 -194 -64 197
3144 197 119 -210 -308 384 129 -472 -79 300 -48 85 -420 -151 428 184 -293 55 492 -22 -108 385 80
3165 80 -94 -29 -340 55 489 -135 -156 525 263 -82 367 -15 -212 454 -116 -468 438 128 -441 164 385
3186 385 -103 -332 225 -72 -148 247 -180 -119 563 -402 -463 305 204 -247 -202 -192 -71 317 -298 -598 83 213
3208 213 -728 -350 300 -194 -43 -71 -144 -34 238 -266 -214 436 -94 -459 319 28 41 16 -340 107 442 156
3230 156 -446 267 272 -314 -156 146 -65 212 222 -403 36 528 -137 -298 441 218 -252 199 44 -137 197
3251 197 3 226 358 18 -525 -138 444 32 31 103 124 126 96 -296 80 212 -2 -373 223 79 -338 -417 -4
3274 -4 -101 254 -79 -677 214 112 -451 -137 6 -266 -415 -165 -341 -82 115 -483 -301 300 135 -582 -71
3295 -71 -141 -290 -69 78 -224 244 75 -315 224 237 -367 -124 118 -3 73 209 -381 298 475 -15 -245
3316 -245 450 118 -201 179 189 46 152 -12 -101 17 373 -256 28 552 -208 -189 302 128 161 223 -424 -69
3338 -69 526 -317 -260 372 227 -302 -100 -22 -184 -46 -206 -323 -29 110 -592 -247 307 -7 -383 95 -19
3359 -19 -155 36 -308 -333 173 95 -528 -39 317 -407 -368 66 -311 -145 198 -454 -156 179 -306 -474 345
3380 345 100 -140 -74 4 -115 285 -90 -165 282 295 -310 -63 594 -106 -142 434 -10 251 387 -160 15 405
3402 405 173 -387 467 367 -78 243 99 -46 360 -257 -343 446 575 -470 -314 286 -112 -17 6 -196 170
3423 170 209 -199 -575 400 -195 -530 120 -141 -281 4 -93 -291 49 -186 -688 -36 358 -219 -461 439 70
3444 70 -253 322 -448 -150 317 -427 -338 217 -33 -553 154 153 -100 -4 -193 -372 257 369 -288 -36 654 96
3466 96 -98 363 250 270 224 -176 94 274 -49 -35 294 377 -119 175 57 95 397 43 -116 194 160 -353
3488 -353 -32 488 -193 -327 -49 -254 51 219 -212 -44 335 -53 -453 307 145 -388 -251 134 37 -43 114
3509 114 -449 -183 319 -326 -488 172 15 -99 -186 -58 -341 -160 -274 -404 373 54 -466 74 126 -171 -88
3530 -88 291 -256 97 287 -352 -43 373 51 -304 155 300 -83 54 64 1 274 162 -251 285 147 -187
3551 -187 -145 444 287 71 423 156 176 445 -302 -204 207 -34 -329 129 301 1 -53 -47 -157 94 275 -252
3573 -252 38 147 -263 -440 175 -100 -330 -17 -98 -392 269 -356 -263 157 242 -297 -30 17 -14 -124 -336 -260
3595 -260 209 104 -577 -290 113 -270 -153 64 97 -213 148 -12 -211 185 148 -180 61 216 40 221 285
3616 285 -217 42 -61 -133 173 326 -149 -102 93 114 -214 33 159 279 269 -253 -118 398 219 -373 215
3637 215 185 6 -205 127 -61 100 1 -334 -155 62 -127 -511 91 79 -291 -285 -45 48 271 -64 -343 144
3659 144 300 -369 -105 215 -267 -325 -339 -308 183 94 -406 63 244 -36 -332 -78 -141 -278 146 -312 -337 263
3681 263 -15 -272 275 231 -281 20 113 -161 159 15 -79 152 275 -76 23 490 182 -27 259 327 113 15
3703 15 -95 -116 302 -1 57 126 364 -81 -20 60 66 15 197 -355 26 275 -22 -142 307 293 -22 -243 113
3726 113 -151 132 -209 -421 39 -51 -298 -109 8 -336 -199 -59 -52 -90 -31 -476 -81 312 -244 -253 92 6 -168
3749 -168 -233 -217 -183 186 -123 74 -70 185 -50 -116 339 183 -200 127 24 124 81 -115 -28 233 159 -315
3771 -315 87 193 114 -39 -38 107 254 104 -356 277 410 -103 -428 299 37 23 41 -227 176 166 -234 -196
3793 -196 176 124 -434 -92 92 -355 -8 27 -422 -40 243 -131 -150 367 -337 -220 165 8 -110 -297 -99
3814 -99 -164 56 -281 -502 -195 262 -56 -80 108 -68 86 -115 -170 64 165 -304 -267 588 295 3 -26 6
3836 6 266 1 -114 -154 61 127 -168 20 303 -141 1 102 -138 -61 215 39 175 248 -169 -49 292 88
3858 88 10 164 33 44 89 -65 -9 179 414 -211 -48 217 -33 111 101 -37 -40 120 -186 -293 107 -267 -284
3881 -284 202 78 -468 29 4 -99 15 -82 -320 -54 67 -235 -57 14 -266 -252 109 -293 113 237 -319
3902 -319 -272 229 247 -291 -75 70 -1 42 -235 118 199 75 -91 84 329 -127 -125 70 196 171 -248 -247 -44
3925 -44 79 -264 -199 277 242 -289 -73 56 14 26 119 -27 323 256 -213 176 348 -5 -58 37 10 224 -231
3948 -231 -166 -169 255 -229 -195 124 166 -41 -235 -31 -56 -152 -219 -410 -22 273 -326 37 -31 -124 -350 -201 -104 -53
3972 -53 244 -70 120 315 -44 -192 -67 -40 78 -209 22 -170 65 -166 -200 213 231 -166 -177 258 -26 98
3994 98 103 -62 114 460 38 -61 440 313 14 -113 150 -68 153 -110 40 290 -48 -88 94 179 101 -158
4016 -158 -332 87 -80 -192 -136 -190 60 -204 -142 -5 197 -275 -205 5 111 75 -44 -302 25 172 -109 -453
4038 -453 159 77 -387 -269 -269 7 -76 -297 -131 -154 -67 -214 9 200 -154 -146 66 96 -223 107 104 -121 242 16
4062 16 -594 259 -4 -236 369 -210 -14 96 -134 -57 160 286 -332 -161 222 136 163 299 -4 228 -3
4083 -3 55 181 540 -272 -209 105 426 -21 -181 -227 64 263 -166 -46 77 -43 -385 -33 151 -107 -275 261
4105 261 -160 131 130 -40 -316 111 -152 -197 -136 -143 10 -211 -253 -251 74 -58 -391 -178 195 -351 -181 -40 -171
4128 -171 3 -27 -151 -1 176 -339 -375 192 429 -191 263 95 33 162 21 -182 333 154 -45 -93 325
4149 325 61 -149 86 11 102 190 -54 8 413 -239 -113 258 206 -220 38 -36 211 -92 -93 78 161 379 -87
4172 -87 -291 389 -46 -305 -15 -256 107 -78 -160 4 -13 22 -476 20 129 -312 -238 79 2 -205 -111 -216
4194 -216 140 7 -307 -173 323 -72 -283 -131 -244 48 121 -127 -275 221 167 -281 -147 -114 -178 13 128
4215 128 -290 -11 -269 -23 -73 161 -62 -343 127 -131 -132 148 89 189 444 156 -119 305 221 -60 -32 103
4237 103 265 89 47 -49 198 165 -283 -124 132 -91 -34 -103 217 43 -68 122 -217 80 14 3 131 -45
4259 -45 -232 -147 148 -44 -105 -3 -242 -154 10 -568 -240 183 126 -10 -62 -99 157 48 -68 -292 -77 16 -59
4282 -59 -291 236 -9 30 19 163 166 54 -128 326 343 -188 -221 146 163 -66 31 101 -61 -25 158 -273 261 250
4306 250 -32 -74 447 -61 -55 295 121 -26 64 -163 22 556 -80 -255 171 31 30 -39 -92 -168 185 265 -422
4329 -422 180 350 -139 -108 63 -6 -196 -34 -247 -121 153 -132 -74 105 51 11 -77 164 -146 -88 124 81 -42
4352 -42 97 -333 -310 78 -11 -173 -4 128 -36 100 -188 -33 86 49 -181 306 202 -139 -339 85 9 35
4374 35 74 -288 -33 85 -144 223 168 -158 -198 145 -93 98 151 178 119 255 -119 -250 275 82 -151 -41
4396 -41 200 -109 340 -171 -42 113 126 -153 -53 105 183 -260 84 151 15 -82 -19 -86 -126 127 -190 -41 27
4419 27 -161 -188 -2 -137 6 -28 -338 6 188 -231 1 185 59 -26 41 -3 170 194 -148 -166 71 132 38
4442 38 -158 243 127 -10 -65 -140 6 320 -24 49 196 -91 -179 140 315 160 -5 -157 98 179 119 94 -156
4465 -156 187 -56 -22 164 156 48 70 -135 102 168 -17 -212 42 14 -252 -102 20 264 75 -7 -191 109
4487 109 204 -395 59 235 -112 66 -31 -407 -120 -201 21 -357 -40 -321 -23 -149 91 -76 -44 61 -280
4508 -280 -60 38 -65 80 214 -250 -122 198 80 -70 8 44 161 74 -124 -193 338 228 -411 -73 88 61
4530 61 125 80 11 142 224 80 -37 75 7 36 97 121 -267 50 35 18 67 -54 -321 -121 264 -253 -132 188
4554 188 -31 90 -162 -87 -53 195 -128 17 -68 -276 -356 130 -125 113 39 -148 -191 -148 -151 -183 77 -35 -353
4577 -353 -132 8 -63 -62 82 -76 -76 282 -188 61 146 -8 -136 -74 241 202 -25 -65 -204 -192 131 84 110 102 -78
4602 -78 222 418 174 -79 56 58 68 357 -114 -85 284 164 -126 16 -151 -66 -74 -237 -21 197 -164 -370 43
4625 43 23 -175 134 -218 2 17 45 36 -84 326 -251 -113 137 -110 -19 -41 6 -143 -343 -236 -282 -121 -127 -177
4649 -177 -196 39 26 -66 -93 -63 231 -5 -61 -35 63 155 -32 73 441 -37 -119 -29 -2 30 -81 94 -241 137
4673 137 -52 59 200 -52 307 50 128 110 164 -21 25 407 227 145 -1 271 123 36 109 100 139 141 -284 16
4697 16 29 -62 -192 120 -7 -20 -271 70 53 -11 4 -177 -153 49 -159 -84 -182 -112 -23 -172 -68 -80 0 -347 14
4722 14 183 -8 42 -17 -119 -171 -107 -388 -408 294 -136 -107 57 -33 -220 -203 -19 -199 -118 -111 -260 23 65 26 -9
4747 -9 81 344 -4 41 169 -53 212 -105 -274 196 63 -446 -136 -37 82 65 392 -121 179 -63 -65 20 189
4770 189 16 -129 142 -192 -108 -108 116 -246 22 74 -246 178 80 -337 -87 32 -20 -164 -94 -171 132 303 94
4793 94 -107 270 -303 -377 -126 160 -118 -96 -180 183 352 -2 -347 83 248 -167 -243 -211 -152 193 -16 -85 -149
4816 -149 21 -380 -321 104 385 -313 12 36 -10 -26 111 130 108 19 -134 96 311 16 41 134 80 122 -37 -80
4840 -80 -51 177 -110 -190 90 -130 -340 230 279 106 40 -400 -241 142 254 -134 -31 118 104 66 85 -239 -20
4863 -20 227 -488 -105 135 -148 -344 91 37 36 -68 83 -89 -16 -17 -242 -74 10 21 10 103 164 -86 103 77
4887 77 78 34 -159 -21 76 252 -238 239 -54 -24 -122 220 -210 25 74 -213 -26 312 -66 3 105 123 26 -32
4911 -32 24 -50 198 37 -71 252 378 79 -104 3 -42 110 163 -22 -34 140 -267 -150 355 -19 -91 80
4933 80 10 -166 139 151 -29 -125 58 -185 12 104 -27 -140 206 -87 -140 43 -297 -6 85 -326 -203 158
4955 158 334 28 -207 -264 -34 26 -29 -89 144 320 -174 -84 -39 5 -199 112 -113 0 380 -149 44 347
4977 347 -62 -52 275 152 -28 44 68 -12 107 -115 19 -20 384 -47 -156 -74 64 41 27 -11 141 -20 -35
5000 -35 89 304 47 -315 -62 15 -80 -80 -106 -186 -19 30 -108 -134 172 -191 -313 -51 203 -54 1 -159 -9
5023 -9 72 -270 -267 334 -6 -257 150 -289 -23 103 -92 -229 -22 189 -171 -181 142 -31 -238 -1 86 -7 343
5046 343 -5 -121 277 -96 38 130 137 -224 -156 88 42 91 -34 43 66 70 -117 -80 194 290 -93 187 9 10 111
5071 111 -49 -267 287 238 -58 31 74 7 25 192 7 180 116 -163 -65 455 14 -227 -4 59 -91 -29 -36 -121
5095 -121 7 -73 105 -69 242 -244 -242 -30 -41 -8 -116 103 55 113 -153 -247 322 -71 -245 -36 53 -57 -49 -281
5119 -281 -13 136 -5 6 -51 95 -88 118 -28 -54 216 33 -139 123 102 -17 154 229 157 -222 85 165
5141 165 16 -69 69 -237 255 154 -292 -189 227 91 91 -284 -120 90 -274 -34 6 148 -375 -260 49
5162 49 -114 -151 -158 32 -19 -108 -93 -147 41 242 -115 -55 229 74 -216 -281 -25 82 17 -217 26 3 -132 -166
5186 -166 -164 296 -316 -397 -78 110 54 -78 -136 -9 235 -54 -312 38 330 96 4 -85 -91 -31 40 -13 78 368
5210 368 -113 12 209 -158 85 386 142 144 -87 -173 384 128 -186 8 254 208 -40 203 67 -394 6
5231 6 -20 -191 137 102 -130 -102 151 77 1 -221 -146 88 129 166 -197 69 -24 -274 -7 101 -167 -75 -369 -144
5255 -144 181 -155 -182 -13 144 -163 -30 220 8 -122 -92 70 99 424 -142 -94 103 231 8 -34 -94 -59
5277 -59 162 -41 242 289 66 -36 35 384 61 -9 90 219 -16 105 -10 -23 396 -1 132 125 119 -274 181
5300 181 -71 -60 -10 -75 -8 -74 -12 -356 74 296 105 -162 -4 48 139 -66 -254 -240 350 -205 -70 301 -168
5323 -168 -81 31 30 132 113 65 -139 310 115 -368 -45 -199 -263 -210 7 -241 -232 98 -148 1 94 -67 -232
5346 -232 -253 224 -128 -149 -159 81 5 26 -172 11 309 160 70 152 136 130 52 62 28 293 72 189 -19 11 86
5371 86 -24 189 -35 40 280 -169 169 81 -326 -17 91 -25 -153 4 160 157 -41 74 -146 -23 7 -100
5393 -100 2 246 -156 -78 -231 -158 -1 -35 -182 259 74 -167 -235 58 121 -204 49 -155 120 47 -23 -76 186
5416 186 -50 -163 112 38 -367 7 17 -38 78 121 -170 125 -83 -138 -82 226 63 -141 -4 24 132 109 -148
5439 -148 15 166 196 31 -143 219 53 122 -66 -288 26 117 12 -175 289 70 -137 157 109 30 -57 123
5461 123 -221 -182 163 -121 76 38 -178 -466 -183 -11 -194 -244 -87 -100 128 -182 -240 -68 -34 -100 -122 50 -49
5484 -49 124 5 -137 29 51 -41 73 -51 -164 -110 -128 -111 113 137 -107 -27 18 -190 -257 -91 -66 134 -264 8
5508 8 -7 129 69 -106 246 268 -233 8 120 173 91 217 93 -4 91 236 -186 -50 132 -108 -61 371 -136
5531 -136 236 -50 -126 241 -37 -103 67 62 -126 77 38 153 -81 6 23 -209 -22 -276 -219 -27 80 -346 -172
5554 -172 95 93 -40 -27 -208 -107 -65 -453 -248 190 -67 -37 206 207 137 -47 -110 33 196 177 -142 99 -67
5577 -67 -126 -171 138 22 229 -176 100 170 90 83 -88 122 81 -39 -284 168 89 -90 -14 89 -33 70 -38
5600 -38 -21 73 -162 -100 164 3 -47 120 9 -31 18 -293 -2 84 -42 -42 28 137 43 -7 13 -41 -51 99 -135
5625 -135 -56 157 49 -108 76 -103 -180 -85 -167 -70 364 44 -287 8 165 -262 98 -34 10 -50 -114 -156 8
5648 8 150 -135 96 101 102 -163 241 -62 24 21 -409 -221 281 240 6 171 370 37 -97 121 -156 60 -86
5671 -86 -30 20 237 46 -145 74 84 86 24 -205 115 54 129 -136 170 -55 -19 -64 88 35 94 -148 -222 355 -38
5696 -38 -100 -45 185 -210 -84 258 169 -18 37 -230 92 -51 -152 -364 169 272 -115 7 -380 -155 -141 -12
5718 -12 -184 -146 54 -255 103 164 260 -203 97 -213 104 -85 -248 228 26 280 23 160 -114 -152 207 122
5740 122 144 55 7 -179 171 223 145 143 165 196 176 69 26 -56 -197 48 -90 -105 46 -130 -176 -78 33 -43 203
5765 203 -309 41 19 -88 94 8 -84 12 49 247 -60 -9 -290 -43 165 -112 -170 8 27 -138 -327 127 228
5788 228 -160 -302 -212 15 -188 -29 -36 116 48 -343 220 67 3 192 26 -67 148 67 -34 68 141 24 202
5811 202 195 -5 16 -10 -88 39 370 -61 110 146 308 -139 158 -206 264 31 -112 -57 -94 109 -235 -30 168
5834 168 21 -288 60 -69 171 9 -145 -223 124 -118 -51 207 58 -81 98 56 44 -3 122 -152 182 124
5856 124 -233 -93 137 271 -323 -80 -78 -63 -196 -1 -72 324 106 -365 -133 33 -215 -32 3 -153 145 117
5878 117 -373 42 18 -88 -186 156 -385 81 131 334 101 14 179 58 64 315 -138 184 128 128 227 93 130 256
5902 256 -1 -142 -151 65 39 -288 -195 254 63 84 89 -116 159 -7 39 126 264 41 78 445 9 51 63 -278
5926 -278 86 179 -31 -157 -256 -36 -122 -189 3 53 279 -55 -76 108 2 -271 -83 191 -101 -250 46 -18
5948 -18 40 12 -48 234 170 -42 -330 -83 -93 -192 53 71 -117 -45 -20 -276 149 66 -180 -77 -136 225 -10 -40
5972 -40 170 30 294 -197 6 163 133 136 3 -36 7 -155 111 -293 -17 -112 -40 7 251 -264 -306 -159 -16
5995 -16 -321 -56 127 -222 123 -45 -333 -18 -94 -251 -432 -198 -156 -49 128 -37 -11 -84 -92 -208 62 -42
6017 -42 -140 -9 187 -37 -95 -127 99 -56 -35 -96 -89 -35 -124 -52 141 79 -45 87 152 371 -91 -26 -263 137 156
6042 156 -93 262 160 104 79 -250 -15 31 97 -57 -103 147 -252 75 -118 118 -23 305 -222 -36 -53 -62 125
6065 125 -42 281 -196 91 -76 117 -21 -78 -232 -94 -96 -236 113 -19 -54 5 112 -58 -193 28 -207 7
6087 7 290 -400 -66 98 118 -151 25 -148 -183 54 104 -247 109 -60 -145 233 -41 -133 -364 66 337 -128
6109 -128 0 -33 -246 51 -99 -176 159 146 109 429 141 53 200 118 -76 12 209 -70 -153 26 -143 -35 33
6132 33 -36 31 243 -98 98 18 -5 111 -160 110 -123 54 -93 -46 158 40 -144 110 179 -41 -235 -61
6154 -61 87 -75 68 -294 -84 152 -40 -350 -88 -115 -281 86 -230 -281 152 45 -177 326 69 -86 59
6175 59 256 118 -126 50 108 -77 42 18 -90 -18 2 -48 69 -49 -110 96 -21 -186 -8 68 -51 259 -56
6198 -56 -101 119 224 119 -253 20 -31 -84 97 188 -251 224 170 -213 -109 272 121 -273 -139 -98 84 167 -116
6221 -116 138 142 59 118 141 -61 -43 -44 -39 -324 -12 -431 -56 -129 -107 -234 -92 -35 53 -96 -76 85 -144 -54 -162
6246 -162 -141 88 -146 -62 -186 266 -101 46 -99 117 395 -119 -82 -47 -152 -183 -146 40 63 -35 -206 -26 -75
6269 -75 303 63 -17 381 79 -155 -18 24 -16 117 -99 -90 23 -59 -289 -2 165 149 67 76 -245 -48 23 -105
6293 -105 8 202 220 101 -197 71 -119 -114 -37 19 -155 -230 -189 -145 60 -270 -21 26 -198 -252 118 -61 -84 -108
6317 -108 -310 -211 -101 241 -25 153 66 -117 -192 23 -163 -50 0 -99 -45 144 -147 -109 -61 -47 93 77 -97
6340 -97 35 220 -220 -313 16 128 -100 -39 275 65 144 -12 -155 -39 17 -203 -62 58 -263 -2 341 -12
6362 -12 124 149 165 362 -44 218 -192 156 73 -220 -78 -7 -172 88 194 -41 184 -86 63 -73 -18 -25 -7
6385 -7 -44 144 -147 41 -201 -96 96 -95 -395 -23 -75 -127 -167 -108 -134 80 -228 -326 144 120 11 -199 134
6408 134 112 -13 -62 1 87 247 126 -210 -99 29 -173 -81 -3 -74 113 280 9 119 164 -59 210 61 68
6431 68 75 -3 -169 -23 200 -32 -91 295 -39 83 239 40 51 77 -251 60 43 -68 -13 8 169 87 -81 -53
6455 -53 83 -253 6 -68 -23 50 6 34 -44 101 -224 132 -220 -131 -185 68 138 -92 99 -203 130 -134 98
6478 98 -167 -82 -70 -101 70 -120 225 85 -39 -127 -113 138 12 214 83 139 -12 53 -77 8 -198 -152 126
6501 126 90 -111 -97 190 67 115 -147 -4 26 148 -31 94 -5 197 -35 -8 308 255 71 -144 166 221 22
6524 22 -188 -99 34 109 -122 -215 105 -222 -96 146 260 -55 -124 -48 -95 -91 26 -352 122 140 100 -7 -207 171
6548 171 172 145 -74 131 -142 -225 20 -141 -111 67 -26 -99 74 -109 100 98 54 80 8 280 -87 -174 65 -265
6572 -265 7 -43 -130 -9 -106 123 67 -100 101 -191 64 -61 38 191 84 -298 89 134 -228 14 198 -50
6594 -50 -9 -85 -162 -39 234 36 -282 -71 192 -199 -40 -13 -247 -174 -61 -419 26 109 38 50 138 -16 -302
6617 -302 174 7 -215 163 -61 94 232 -226 3 17 61 -178 -123 -128 136 -254 -57 9 71 86 6 -99 207
6640 207 31 163 -173 -142 -116 -47 -46 -284 224 234 -155 278 -77 10 223 17 -94 108 -146 -221 171 -118 3
6663 3 -159 194 7 273 -144 35 -64 -166 -5 -122 54 -98 -8 -9 13 -249 81 133 -67 30 81 76 -174 84
6687 84 41 -56 -331 -92 -142 22 -227 -95 152 23 -218 7 333 60 -131 -171 62 29 90 -6 155 -113 -22
6710 -22 -188 -212 61 -48 75 -355 67 28 57 -86 116 -106 -177 -83 -24 362 -235 -76 -143 149 119 249 37
6733 37 140 -42 67 98 318 65 -56 -40 48 -73 48 -30 -5 127 -30 -96 109 -17 -257 24 -94 -32 95
6756 95 -118 -114 -35 245 -87 -129 142 -65 -12 101 271 24 243 -10 27 72 -87 -250 99 -83 -107 68 64 241
6780 241 17 80 150 -63 278 -281 115 27 -384 -135 -286 -36 -107 27 -61 -33 103 -24 98 -104 50 248
6802 248 -52 40 270 30 8 -340 112 63 94 10 -25 137 -12 -16 92 46 -26 16 27 59 41 -110 -28 184 56
6827 56 52 212 62 -155 -13 -176 46 148 -50 -156 -1 -233 -214 -60 -259 122 -91 -37 -338 -126 -83 -14
6849 -14 157 -145 -182 -181 95 -113 -92 171 48 -196 242 -85 -133 56 -13 73 11 -265 -10 197 271 -83 93
6872 93 -13 -132 -91 65 -31 173 -22 -78 29 -6 -97 -185 56 136 324 -25 109 -134 67 -40 -8 101 -145
6895 -145 -74 246 40 115 65 -165 -35 -39 129 182 218 -69 242 -114 30 306 83 47 -147 -61 18 20 -231 -61
6919 -61 26 -353 -218 19 -19 163 -395 -132 -344 -30 88 -173 155 142 -121 -40 217 -63 -38 58 55 203 136
6942 136 -101 -46 261 -85 -77 120 170 288 -238 8 31 187 152 -11 68 111 -215 125 319 -65 -9 92 -208
6965 -208 186 90 11 -224 -62 -10 -48 13 15 27 -176 10 22 56 224 -320 114 194 -86 53 131 290 13 -231
6989 -231 43 -2 155 -239 -15 77 -74 23 221 -142 -214 60 -84 -207 -128 217 -56 -63 70 103 -102 195 -216
7012 -216 74 143 -140 -80 -131 -94 -59 -32 47 70 110 125 -114 -89 -183 -8 34 -86 -94 0 446 99 6 -64 -64 -21 134
7039 134 -124 -59 138 -44 5 -197 89 -84 -37 -394 129 -23 -164 -40 -175 63 -228 -40 17 89 -210 -248
7061 -248 -78 -33 83 -153 -25 187 -140 -281 -24 77 -184 -67 81 77 159 -79 71 14 89 185 -145 -48 -61
7084 -61 -104 -6 52 -19 145 21 -52 -104 -131 -323 -26 -111 154 -34 -117 46 -37 23 3 -157 132 -187 -12 -144
7108 -144 -108 27 172 -32 59 221 52 12 -36 91 -149 -155 22 -96 -82 -11 -202 -241 73 183 -40 -42 -137 -121
7132 -121 66 31 -38 -122 18 -46 106 -6 -256 3 43 -112 -25 67 -81 62 25 -267 -230 -70 -23 -77 -153 51
7156 51 -210 -124 -26 -53 34 131 84 -12 -72 72 42 129 -37 63 62 -273 -138 -58 -174 -51 -13 -140 158 -266 310
7181 310 -50 -212 112 65 243 200 258 -48 86 -143 36 17 -11 -129 -46 -254 -21 240 25 -4 -107 -161 -154
7204 -154 36 -38 65 36 195 -65 103 18 -307 -45 12 -158 -30 -136 20 93 -167 -89 -21 -325 81 -154
7226 -154 -78 -232 20 89 16 -96 -57 143 -164 261 119 16 182 -55 2 -48 -112 108 -243 -169 15 -131 171
7249 171 73 -74 187 86 87 13 -22 174 403 -45 -178 -4 3 127 -130 -52 90 118 53 -145 88 120 28 -220
7273 -220 -107 14 151 15 -45 -337 -103 43 -83 206 -244 -54 -52 191 66 -76 -267 155 -178 23 -168
7294 -168 -39 -54 -19 118 68 157 151 6 163 -37 317 -169 21 426 -49 -54 64 85 -84 91 167 -70 44
7317 44 -32 -19 27 -78 -161 -154 65 6 -79 -156 125 206 -117 98 173 30 -160 -97 -165 -17 127 153 -77 -86 122 22
7343 22 205 118 98 74 -53 87 183 68 70 139 29 -69 35 -213 -91 5 83 -150 -233 -283 5 31 -53 409 -9
7368 -9 -310 -28 -102 -239 -255 -27 -63 132 -188 -219 -69 -244 -136 -19 -197 92 -124 171 97 129 190 162 -33
7391 -33 305 351 -524 -245 -138 73 164 -43 134 -111 26 168 95 -13 -14 118 10 -274 51 51 34 -74 -77 32
7415 32 -39 80 -51 108 -59 127 90 -55 -99 -11 241 260 326 76 306 -12 -184 -275 -102 9 -126 73 -210
7438 -210 -56 101 147 72 -124 36 -120 -200 -43 -112 19 73 103 -80 105 100 -164 117 112 -52 9 337 -256 -80
7462 -80 -102 -75 200 -118 -186 324 36 -41 -246 81 112 -137 -18 -162 164 -245 -70 97 -123 -305 -60 -77
7484 -77 49 3 144 -136 -28 -219 192 16 -40 22 -65 -225 -50 16 -52 -95 45 3 337 128 10 -79 -219
7507 -219 222 143 -19 -165 157 -263 -161 -83 7 -98 -185 -141 37 -28 -285 -85 -22 44 -73 36 73 114 -119
7530 -119 -279 16 34 -56 3 -184 -130 9 -16 25 -144 -9 159 271 -47 108 152 -167 -438 15 -130 -177 189
7553 189 8 30 53 -168 231 33 133 -7 -90 180 -117 -12 166 247 -112 50 -66 -150 150 -188 167 -74
7575 -74 11 258 65 181 -36 -126 13 -180 57 -85 -161 -12 -1 -357 210 27 31 22 42 106 -34 -41 -160 83
7599 83 15 -138 64 16 23 -21 -180 178 67 -83 -118 80 234 272 -108 -99 14 -124 -30 331 -4 -101 -71 -21 -190
7624 -190 302 148 -66 74 180 -152 -24 -73 -242 -150 49 188 76 -26 192 239 14 -77 -191 -10 -56 69
7646 69 281 119 -96 -71 26 38 85 60 -231 -69 -94 -34 -32 4 -15 -50 240 -239 23 -108 14 -48 51 28 240
7671 240 -10 -128 -69 -62 105 -144 20 -100 13 -79 -124 -163 91 -91 63 -38 264 -124 -193 -104 312 -197 100
7694 100 -27 -145 -28 -111 -161 -148 56 -243 -49 61 207 -154 -209 -176 -48 93 170 182 -96 24 -18 -81 -151
7717 -151 -165 -244 -150 1 80 250 36 93 -74 -23 -251 99 86 -65 101 -3 -109 -221 -106 -89 11 -122 -189
7740 -189 -26 -43 -52 155 63 -104 -210 269 -258 -150 -36 -200 -41 34 145 -25 -89 -169 141 190 97 103 -96 155
7764 155 21 64 60 -184 -22 -145 -101 133 15 -90 86 130 303 27 128 -50 -3 46 -210 3 27 68 2
7787 2 49 209 -79 41 -179 -23 -18 12 -46 7 -22 102 66 -39 248 -71 1 138 53 -155 95 132 236 173 -122
7812 -122 -83 -103 -174 218 -45 179 -54 18 17 129 31 -125 139 -276 -100 -160 -136 12 -71 61 77 -102 -66 180
7836 180 39 5 -232 100 -90 137 169 -49 -147 27 -113 -63 -173 -263 -28 191 338 28 -11 53 -95 -43 -290
7859 -290 -53 -164 11 -20 92 14 14 -12 235 20 141 32 143 81 120 -211 -143 70 44 -235 5 -92 -97 107
7883 107 -346 -96 166 294 -157 -162 -14 17 125 104 -30 140 -5 -209 -85 -74 125 17 -201 -177 164 -240
7905 -240 111 -102 74 -198 -70 112 27 178 45 -113 38 222 13 -137 22 218 -183 -55 -111 75 -71
7926 -71 166 -83 -135 51 52 185 -52 -104 -3 -171 -123 -24 74 -135 98 -29 61 17 218 72 -156 -11 -282
7949 -282 6 -154 227 -28 20 -8 19 70 219 -124 31 -173 98 318 -48 -72 -209 -1 -64 -175 -275 322
7971 322 -228 -31 -148 23 12 -44 0 -222 109 102 -203 -286 108 -82 -57 283 73 -80 -77 -239 70 -139 2
7994 2 -203 30 -22 109 170 71 219 -125 -140 -268 -340 11 -29 90 90 48 -66 156 87 -154 -95 -257 156 -112
8018 -112 -2 -115 -59 26 -6 -45 -132 68 -176 -67 86 11 308 -71 62 5 -7 -113 -168 -64 -254 30 266
8041 266 -72 -271 -159 -129 -47 -81 102 55 76 -24 -39 -250 -366 -53 313 143 36 -170 21 -4 -78 -159 99
8064 99 111 -124 50 105 -257 43 -198 36 122 -140 -16 -174 -43 -81 -152 -259 -146 195 208 -35 139 -30
8086 -30 191 -19 -56 94 -96 -77 143 -133 -270 218 98 -94 120 143 -129 124 141 50 -60 168 143 -3
8108 -3 -80 -38 -53 4 -79 -190 37 215 80 15 4 -77 153 120 -144 212 6 252 8 -113 -59 69 -166 -54
8132 -54 134 -52 -297 -108 314 -96 -271 -140 99 -41 168 -97 72 0 18 50 91 105 84 -187 53 -82
8154 -82 -14 146 -26 28 -56 -162 186 89 174 197 -16 180 17 251 -98 80 -56 -142 -159 -429 227 -255 -40
8177 -40 -35 -6 -59 -96 -92 -9 232 -19 -161 -156 -22 -33 -18 -55
8191e5
##END NTUPLES=NMR FID
##END=
