##TITLE=1H_CamPhor
 CDCl3
 8 sc, 
 26.10.2023
##JCAMPDX= 6.0         $$ Bruker NMR JCAMP-DX V2.0
##DATA TYPE= NMR FID
##DATA CLASS= NTUPLES
##ORIGIN= UXNMR, Bruker Analytische Messtechnik GmbH
##OWNER= root
$$ XWIN-NMR		Version 3.5
$$ Thu Oct 26 14:45:23 2023 Russian Standard Time (UT+4h)  she@DPX200
##.OBSERVE FREQUENCY= 200.13135
##.OBSERVE NUCLEUS= ^1H
##.DELAY= (6, 6)
##.ACQUISITION MODE= SIMULTANEOUS
##.ACQUISITION SCHEME= undefined
##.AVERAGES= 8
##.DIGITISER RES= 18
##SPECTROMETER/DATA SYSTEM= spect
##.PULSE SEQUENCE= zg30
##.SOLVENT NAME= CDCl3
##.SHIFT REFERENCE= (INTERNAL, CDCl3, 0, 15.7039)
##AUDIT TRAIL= $$ (NUMBER, WHEN, WHO, WHERE, WHAT)
$$ ##TITLE= Audit trail, XWIN-NMR		Version 3.5
$$ ##JCAMPDX= 5.01
$$ ##ORIGIN= Bruker BioSpin GmbH
$$ ##OWNER= she
$$ F:/spectra/data/she/nmr/H-F/1/audita.txt
$$ ##AUDIT TRAIL=  $$ (NUMBER, WHEN, WHO, WHERE, WHAT)
(   1,<2023-10-26 14:44:28.50 +0400>,<she>,<DPX200>,
      <created by zg, POWCHK disabled, PULCHK disabled
       configuration hash MD5:
       00 E9 B6 7A A2 85 ED C7 34 08 36 98 17 FE 4E 26
       data hash MD5: 16K
       4A D7 CF C7 04 7D 5E 2A 32 FC B1 64 77 58 C3 99>)
$$ ##END=
$$ 
$$ hash MD5
$$ 28 CE C5 FE D9 3D C2 0B 51 E3 6E 85 82 23 0E 20
##$RELAX= 
##$RELAX= 
##$RELAX= 
##$RELAX= 
##$RELAX= 
##$RELAX= 
$$ Bruker specific parameters
$$ --------------------------
##$DU= <F:/spectra>
##$EXPNO= 1
##$NAME= <H-F>
##$PROCNO= 1
##$TYPE= <nmr>
##$USER= <she>
##$AMP= (0..31)
100 100 100 100 100 100 100 100 100 100 100 100 100 100 100 100 100 100 
100 100 100 100 100 100 100 100 100 100 100 100 100 100 
##$AQSEQ= 0
##$AQ_mod= 1
##$AUNM= <au_zg>
##$AUTOPOS= <>
##$BF1= 200.13
##$BF2= 200.13
##$BF3= 200.13
##$BF4= 200.13
##$BF5= 200.13
##$BF6= 200.13
##$BF7= 200.13
##$BF8= 200.13
##$BYTORDA= 1
##$CFDGTYP= 0
##$CFRGTYP= 5
##$CHEMSTR= <none>
##$CNST= (0..31)
1 1 145 1 1 1 1 1 1 1 1 1 1 1 1 1 1 1 1 1 1 1 1 1 1 1 1 1 1 1 1 1 
##$CPDPRG= <>
##$CPDPRG1= <>
##$CPDPRG2= <>
##$CPDPRG3= <>
##$CPDPRG4= <mlev>
##$CPDPRG5= <mlev>
##$CPDPRG6= <mlev>
##$CPDPRG7= <mlev>
##$CPDPRG8= <mlev>
##$CPDPRGB= <>
##$CPDPRGT= <>
##$D= (0..31)
0 1.2 0 0 0 0 0 0 0 0.06 0 0.03 0 0 0 0 0.0002 0 0 0 0 0 0 0 0 0 0 0 0 
0 0 0 
##$DATE= 1698317067
##$DBL= (0..7)
120 120 120 120 120 120 120 120 
##$DBP= (0..7)
150 150 150 150 150 150 150 150 
##$DBP07= 0
##$DBPNAM0= <>
##$DBPNAM1= <>
##$DBPNAM2= <>
##$DBPNAM3= <>
##$DBPNAM4= <>
##$DBPNAM5= <>
##$DBPNAM6= <>
##$DBPNAM7= <>
##$DBPOAL= (0..7)
0.5 0.5 0.5 0.5 0.5 0.5 0.5 0.5 
##$DBPOFFS= (0..7)
0 0 0 0 0 0 0 0 
##$DE= 6
##$DECBNUC= <off>
##$DECIM= 32
##$DECNUC= <off>
##$DECSTAT= 4
##$DIGMOD= 1
##$DIGTYP= 9
##$DL= (0..7)
0 120 120 120 120 120 120 120 
##$DP= (0..7)
150 150 150 150 150 150 150 150 
##$DP07= 0
##$DPNAME0= <>
##$DPNAME1= <>
##$DPNAME2= <>
##$DPNAME3= <>
##$DPNAME4= <>
##$DPNAME5= <>
##$DPNAME6= <>
##$DPNAME7= <>
##$DPOAL= (0..7)
0.5 0.5 0.5 0.5 0.5 0.5 0.5 0.5 
##$DPOFFS= (0..7)
0 0 0 0 0 0 0 0 
##$DQDMODE= 0
##$DR= 18
##$DS= 0
##$DSLIST= <SSSSSSSSSSSSSSS>
$$ [...]
##$SUBNAM2= <"">
##$SUBNAM3= <"">
##$SUBNAM4= <"">
##$SUBNAM5= <"">
##$SUBNAM6= <"">
##$SUBNAM7= <"">
##$SUBNAM8= <"">
##$SUBNAM9= <"">
##$SW= 18.05172834244
##$SWIBOX= (0..15)
0 0 2 0 0 0 0 0 0 0 0 0 0 0 0 0 
##$SW_h= 3612.71676300578
##$TD= 16384
##$TD0= 1
##$TE= 0
##$TE2= 300
##$TE3= 300
##$TEG= 300
##$TL= (0..7)
0 120 120 120 120 120 120 120 
##$TP= (0..7)
150 150 150 150 150 150 150 150 
##$TP07= 0
##$TPNAME0= <>
##$TPNAME1= <>
##$TPNAME2= <>
##$TPNAME3= <>
##$TPNAME4= <>
##$TPNAME5= <>
##$TPNAME6= <>
##$TPNAME7= <>
##$TPOAL= (0..7)
0.5 0.5 0.5 0.5 0.5 0.5 0.5 0.5 
##$TPOFFS= (0..7)
0 0 0 0 0 0 0 0 
##$TUNHIN= 0
##$TUNHOUT= 0
##$TUNXOUT= 0
##$USERA1= <user>
##$USERA2= <user>
##$USERA3= <user>
##$USERA4= <user>
##$USERA5= <user>
##$V9= 5
##$VALIST= <valist>
##$VCLIST= <CCCCCCCCCCCCCCC>
##$VD= 0
##$VDLIST= <DDDDDDDDDDDDDDD>
##$VPLIST= <PPPPPPPPPPPPPPP>
##$VTLIST= <TTTTTTTTTTTTTTT>
##$WBST= 1024
##$WBSW= 4
##$XGAIN= (0..3)
0 0 0 0 
##$XL= 0
##$YL= 0
##$YMAX_a= 105849
##$YMIN_a= -123591
##$ZGOPTNS= <>
##$ZL1= 120
##$ZL2= 120
##$ZL3= 120
##$ZL4= 120
##$ABSF1= 10
##$ABSF2= 0
##$ABSG= 5
##$ABSL= 3
##$ALPHA= 0
##$AQORDER= 0
##$ASSFAC= 0
##$ASSFACI= 0
##$ASSFACX= 0
##$ASSWID= 0
##$AUNMP= <proc_1d>
##$AZFE= 0.1
##$AZFW= 0.1
##$BCFW= 1
##$BC_mod= 2
##$BYTORDP= 1
##$COROFFS= 0
##$CY= 11.3945322036743
##$DATMOD= 1
##$DC= 2
##$DFILT= <>
##$DTYPP= 0
##$F1P= 15.7292609196834
##$F2P= 12.9074282941183
##$FCOR= 0.5
##$FTSIZE= 0
##$FT_mod= 4
##$GAMMA= 1
##$GB= 0.15
##$INTBC= 1
##$INTSCL= 1
##$ISEN= 128
##$LB= 0.24
##$LEV0= 0
##$LPBIN= 0
##$MAXI= 10000
##$MC2= 0
##$MEAN= 0
##$ME_mod= 0
##$MI= 1.114404
##$NCOEF= 0
##$NC_proc= 0
##$NLEV= 6
##$NOISF1= 3.799351
##$NOISF2= 2.8
##$NSP= 1
##$NTH_PI= 0
##$NZP= 0
##$OFFSET= 15.70392
##$PC= 1
##$PHC0= -23512.23
##$PHC1= 15.65272
##$PH_mod= 1
##$PKNL= yes
##$PPARMOD= 0
##$PSCAL= 0
##$PSIGN= 0
##$REVERSE= no
##$SF= 200.130013532006
##$SI= 16384
##$SIGF1= 3
##$SIGF2= 2
##$SINO= 400
##$SIOLD= 16384
##$SREGLST= <1H.CDCl3>
##$SSB= 0
##$STSI= 0
##$STSR= 0
##$SW_p= 3612.71676300578
##$SYMM= 0
##$S_DEV= 0
##$TDeff= 0
##$TDoff= 0
##$TI= <>
##$TILT= no
##$TM1= 0
##$TM2= 0
##$TOPLEV= 0
##$USERP1= <user>
##$USERP2= <user>
##$USERP3= <user>
##$USERP4= <user>
##$USERP5= <user>
##$WDW= 1
##$XDIM= 8192
##$YMAX_p= 0
##$YMIN_p= 0
$$ End of Bruker specific parameters
$$ ---------------------------------
##NTUPLES= NMR FID
##VAR_NAME=  TIME,          FID/REAL,        FID/IMAG
##SYMBOL=    X,             R,               I
##VAR_TYPE=  INDEPENDENT,   DEPENDENT,       DEPENDENT
##VAR_FORM=  AFFN,          ASDF,            ASDF
##VAR_DIM=   8192,          8192,            8192
##UNITS=     SECONDS,       ARBITRARY UNITS, ARBITRARY UNITS
##FACTOR=    0.0002768,     1,               1
##FIRST=     0,             0,               0
##LAST=      2.2672688,     0,               0
##MIN=       0,             -123591,         0
##MAX=       2.2672688,     105849,          0
$$ Real data points
##PAGE= N=1
##DATA TABLE= (X++(R..R)), XYDATA
0@%%%%%%%%%%%%%%%%%%%%Kj0J6j6J6j6J6j7K3l0L2l3L9m6M9n5O2o9P6q5R4j03
$$ 0 0 0 0 0 0 0 0 0 0 0 0 0 0 0 0 0 0 0 0 0 2 -8 8 -8 8 -8 8 -9 14 -16 16 -17 22 -24 25 -30 32 -37 39 -46 48 -55
42e5J15j25J37j51J67j84K02k24K47k71K99l30L66m10M59n15N84o68P71r03J078
$$ -55 60 -65 72 -79 88 -96 106 -118 129 -142 157 -173 193 -217 242 -273 311 -357 414 -489 589
63E89j320J671k219L160n048J0055m3452q7027K06630j9380j65539J19248N0561
$$ 589 -731 940 -1279 1881 -3167 6888 -36564 -123591 83039 63659 -101880 17368 67929
76F7929j17721N4484L3216p7988O2350J5974r5826P1395M3438j12834M4546P1633
$$ 67929 -49792 4692 37908 -40080 22270 38244 -57582 13813 57251 -55583 -11037 60596
88F0596j01894J6694P9313q7559L70Q5062p6689j6105R0093o3983l1301R4683
$$ 60596 -41298 -24604 54709 -32850 -32480 52582 -24107 -40212 49881 -14102 -45403 49280
100D9280n3279m8973J02848l5065p8082J00664J892r7937P3524L4615r2860M4017
$$ 49280 -3999 -52972 49876 14811 -63271 37393 39285 -58652 14872 49487 -43373 644
112F44M6530q2389K7570N7367p8903M567P3301o0083k5565O8456k7758l4721M6085
$$ 644 47174 -35215 -7645 49722 -29181 -24614 48687 -11396 -36961 31495 3737 -30984 15101
125A5101j3620k3774L7317j5982k3435M0703j0086l1238L5643K18k9218K8721
$$ 15101 1481 -22293 15024 -958 -24393 16310 6224 -25014 10629 10847 -18371 10350
137A0350O26l0851L2885O641m4204K7463K9261m7407j070M4446k4015k5659L1215
$$ 10350 10976 -19875 13010 19651 -24553 2910 32171 -15236 -16306 28140 4125 -21534 9681
150I681J090k2248R296O764j1853P116J510j3249J2030P407j8776K164K0034j0815
$$ 9681 10771 -11477 -2181 4583 -7270 -154 1356 -11893 137 7544 -11232 -9068 10966 151
164A51j4743J8429O602j8367L953J3533q334l246O434m299L762M467j4420N396
$$ 151 -14592 3837 10439 -7928 -3975 9558 1224 -2022 4412 113 3875 8342 -6078 -682
178f82J6759k0170p671K6677j0618k0584K2335J387k1157J5531L156j8549J6481
$$ -682 16077 -4093 -11764 14913 4295 -16289 6046 7433 -13724 1807 4963 -13586 2895
191B895L466k4062J9521J0884l1227J5655K1899l4166O783L1344l1039o142L7022
$$ 2895 6361 -17701 1820 12704 -18523 -2868 19031 -15135 -8352 22992 -8047 -14189 22833
204B2833k2985j6272L5625j3660k1345L1220q556k3865L0651m159l0041K9271
$$ 22833 -152 -16424 19201 5541 -15804 15416 6860 -17005 13646 9487 -20554 8717
216H717M658l3829K2232J2039l1876J7104J4630l2606J5884K1093l5589P526L0955
$$ 8717 13375 -20454 1778 13817 -18059 -955 13675 -18931 -3047 18046 -17543 -10017 20938
229B0938l0006l987K9587k0417m500K4858k3866j791L4249k9026j7798M7110j3810
$$ 20938 -9068 -13055 16532 -3885 -8385 16473 -7393 -9184 25065 -3961 -21759 25351 11541
242A1541l8013L6118R803l4914J3896J2006j8545J1130K78j7923K1333K504l0030
$$ 11541 -26472 9646 19449 -15465 -1569 10437 -8108 3022 3300 -14623 6710 9214 -20816
255b0816K0926J5740l1815Q108K2840k3523j30K0669j6567j600J6899j3945o16
$$ -20816 110 15850 -15965 -7857 14983 -8540 -8670 11999 -4568 -6168 10731 -3214 -3830
268c830J5084j5244Q10J7542j8861k953K4446j6976j3344K5595o735j7861J7353
$$ -3830 11254 -3990 -3180 14362 -4499 -7452 16994 18 -13326 12269 5534 -12327 5026
281E026j436j2046J2984n266r581J7646o314j5884K0169L99j8477J4673M067j5700
$$ 5026 3590 -8456 4528 -738 -10319 7327 1013 -14871 5298 5697 -12780 1893 5960 -9740
295i740J3194K180j5675J5598K961j9564J5958O936k3233J5040J0519k6613J3048
$$ -9740 3454 5634 -10041 5557 8518 -11046 4912 11848 -11385 3655 14174 -12439 609
308F09J7889l1013N724K6728k7132o414K8631j6936j0541K1531j2939n826K1188
$$ 609 18498 -12515 -6791 19937 -7195 -13609 15022 -1914 -12455 9076 -3863 -9689 11499
321A1499j8570o505L0652j9537j8135L6777q749k9575L1977L395l0803K3008Q712
$$ 11499 -7071 -13576 17076 -2461 -20596 16181 7432 -22143 9834 13229 -17574 5434 14146
334A4146k8262J9186R109k8994J9633J2411l4620J7913K1417l9350R457L2733
$$ 14146 -14116 5070 14179 -14815 4818 17229 -17391 522 21939 -17411 -7954 24779
346B4779l7233m204L9071k7905j4929L8272j7940k0834L4768j0779k3139L2348
$$ 24779 -12454 -16658 22413 -5492 -20421 17851 -89 -20923 13845 3066 -20073 12275
358A2275n981k6064K9943J45k9121K6579O061l1070K2417J1532l3069J8274J7622
$$ 12275 6294 -19770 10173 10318 -18803 7776 13837 -17233 5184 16716 -16353 1921 19543
371A9543l4542J1741K5215l4337K487L1600k9531p654L4497k1348j6473L3012
$$ 19543 -14999 -3258 21957 -12380 -9893 21707 -7824 -15478 19019 -2329 -18802 14210
383A4210j2302k1035K9195m888k3624K5194K306k6397K1105Q953k7145J3849J5629
$$ 14210 1908 -19127 10068 5180 -18444 6750 9056 -17341 3764 12717 -14428 -579 15050
396A5050k4553N700J8059j8846j55J6384j3467k428J4126j2450j925J4465j3359
$$ 15050 -9503 -3803 14256 -4590 -4745 11639 -1828 -4256 9870 -2580 -4505 9960 -3399
409c399m776J9625j2903j2407K3326m591k2101K0024Q502k5210Q410J8048j8595
$$ -3399 -8175 11450 -1453 -13860 9466 4875 -17226 2798 11300 -13910 -5500 12548 -6047
422f047l484J8614q718q711J4206k984r227J1726r51j1011J1085K987j4806Q395
$$ -6047 -9531 9083 365 -8346 5860 2876 -6351 5375 4424 -6587 4498 7485 -7321 1074
436A074R680j6177J066J4652j1772o742J5060n068j0313J1390j269q609Q950j222
$$ 1074 10754 -5423 -4357 10295 -1477 -8219 6841 1773 -8540 2850 1581 -7028 1922 700
450G00q442J1730k697j2306J6351J610k0552J5998J1069k5879Q889K1019k5183
$$ 700 -7742 3988 1291 -11015 5336 6946 -13606 2392 13461 -12418 -3529 17490 -7693
463g693j136K6814k0364r737K8604j4996j6363K9375r352k3653L0201j700l1177
$$ -7693 -8829 17985 -2379 -12116 16488 1492 -14871 14504 5152 -18501 11700 10000 -21177
476b1177K6232J0092l4440J6608J9695l1156O673K2543k4910J980K1562k2046
$$ -21177 5055 15147 -19293 -2685 17010 -14146 -7473 15070 -9840 -7860 13702 -8344
488h344J055K2615k3489q26K8483k4862r108L6033k0664k1019L8941j0132l0455
$$ -8344 -7289 15326 -8163 -8989 19494 -5368 -14476 21557 893 -20126 18815 8683 -21772
501b1772L3726J600l3838K6128R164l3863K1212J3600l5609J8218K1101l8555
$$ -21772 11954 13554 -20284 5844 15008 -18855 2357 15957 -19652 -1434 19667 -18888
513a8888J0391L1119l6171j784L7605k8022j2937L7311j7645j9343L3088j0002
$$ -18888 -8497 22622 -13549 -15333 22272 -5750 -18687 18624 979 -18364 14724 4722
525D722k1348K9232n213k3339K7251j640k5989K5469L129k9698K2848R923l2616
$$ 4722 -16626 12606 7393 -15946 11305 9665 -16324 9145 12274 -17424 5424 15347 -17269
538a7269J7366J6938l2573J0376K3024l0762K892K8084k6998m897L0545j9946
$$ -17269 97 17035 -15538 -5162 17862 -12900 -10008 18076 -8922 -13819 16726 -3220
550c220j3175L0505j1407j8770K6880m174k0910K1475J344k0540J7078M512j9918
$$ -3220 -16395 14110 2703 -16067 10813 6639 -14271 7204 8548 -11992 5086 9598 -10320
563a0320J3337P152j9319R958R577j8876O711J2068j7495K986J3664j5307k08
$$ -10320 3017 10169 -9150 808 10385 -8491 -1780 10288 -7207 -4221 9443 -5864 -6072
576f072J4620j3141k908J5385j1054n511J6221p695r021J5611k952j2229J2703
$$ -6072 8548 -4593 -7501 7884 -3170 -8681 7540 -155 -9176 6435 3483 -8746 3957
589C957K267j2709P424O023r655J897N919n787L60L517l856O74K388l749L77K575
$$ 3957 6224 -6485 939 6962 -2693 -796 5123 -664 -304 3213 -643 31 2419 -1330 -953 1622
605A622k218j432J348J7n7j265l02L565j898l562M771J913n555J239M988k510
$$ 1622 -596 -2028 -680 -663 -720 -1985 -2287 1278 -620 -4182 589 2502 -3053 -1814 3174 664
621F64k316K519J802j360k547K206L697m902k088O821k231o518O142J945p852
$$ 664 -1652 867 2669 1309 -1238 968 4665 -237 -2325 4496 2265 -4253 1889 3834 -4018
636d018L617L429o755K565L719o718K573N007q383K357P967r054j197J0837o240
$$ -4018 -401 3028 -3727 -1162 2557 -4161 -1588 3419 -4964 -2607 5360 -3694 -4891 5946 -294
651b94n617J1041k634p776Q440N95p171N398J281n388M363l18m425N879j535o783
$$ -294 -5911 5130 2496 -5280 3160 3755 -3416 1982 3263 -2125 2238 1920 -2505 3374 1839 -4944
667d944P890O53j0443O875N243j0835K249Q256q139r93P392n267n02N426n605
$$ -4944 2946 3599 -6844 31 5274 -5561 -3312 4944 -3195 -4188 3204 -2063 -2565 2861 -2744
682b744N85P605p345k398J0427m499o959Q999J284q276L772L099l475L55k80k30
$$ -2744 -2159 5446 -1899 -4297 6130 1631 -5328 3671 4955 -3321 451 3550 75 430 150 -80
698h0K710l608k310O440k302n757N557J557o377L137K205l720K471J16k835M314
$$ -80 2630 -978 -3288 3152 850 -4907 650 2207 -4170 -1033 1172 -2548 -77 39 -2796 1518
714A518r2n165M650K542o320L076L838n140J284L184m450J642K650n004K712K082
$$ 1518 1426 -3739 911 3453 -2867 209 4047 -1093 191 3375 -1075 567 3217 -1787 925 3007
730C007n974L258L133p458K958N634r617K084Q715j0065j064J1905q586n288J3171
$$ 3007 -2967 291 3424 -4034 -1076 4558 -5059 -2975 5740 -4325 -5389 6516 -2070 -7358 5813
745E813n194p790J2011k809q482J1146j667r795J2042l17j2703J1796L571j5170
$$ 5813 619 -7171 4840 2031 -6451 4695 3028 -6767 5275 4958 -7745 4051 7622 -7548
759g548Q739O958j4364N483Q139j3421M454R028j4555L715J2869j6354j13J7594
$$ -7548 1191 8149 -6215 -732 7407 -6014 -1560 7468 -7087 -3372 9497 -6857 -6970 10624
773A0624j4458o135J9148r232r790J7144n454j1300J6708l887j3896J8263j106
$$ 10624 -3834 -9969 9179 -53 -9843 7301 1847 -9453 7255 3368 -10528 7735 6629
786F629j8426J6532O409k2120J1185J2047j9889M402J3645j5814J969J2412j5311
$$ 6629 -11797 4735 11144 -10976 209 12256 -7633 -3231 10414 -5400 -3431 8981 -6330
799f330J399J5447j6702k698K0462j3801j0045K1175o848j3573J7136j720j3395
$$ -6330 -4931 10516 -6186 -8884 11578 -2223 -12268 8907 2059 -11514 5622 3902 -9493
812i493J4703j106j3770J5759Q05j7657J4273O932k0247R686J2103j9227L973
$$ -9493 5210 4104 -9666 6093 6898 -10759 3514 10446 -9801 -115 11988 -7239 -3266
825c266J5052j7001m02J6289j3631n081J6855r460q532J5981n951j0488J4751
$$ -3266 11786 -5215 -5617 10672 -2959 -8040 8815 -645 -9177 6804 853 -9635 5116
838E116k598j2168J3402R69j3772J0661N129j3606O284P918j1957L093Q451r721
$$ 5116 2518 -9650 3752 4721 -9051 1610 6739 -6867 -583 7335 -4622 -1529 6922 -2799
852b799R85Q251q523o1Q210q056j574J0359q219m745J3055n511j0583J2424K176
$$ -2799 -1814 6437 -2086 -2147 6063 -1993 -3567 6792 -1427 -6172 6883 1372 -9211 3213 5389
867E389j3354N996P773r598J79O515m883N88M227n826J191P859p671l334J0792
$$ 5389 -7965 -1969 5804 -3794 -3615 2900 -1983 -1395 2832 -2994 -1803 6056 -1615 -4949 5843
882E843k709r057P911L761q534J617N195m585J52K885m262J649K984n759J124
$$ 5843 3134 -5923 1988 5749 -2785 -1168 4027 -558 -406 2479 -1783 -134 2850 -2909 -1785
897a785N886o421j874Q241m922m942R492k312q357R487J697j0754O630O280j0987
$$ -1785 4101 -2320 -4194 4047 -875 -5817 3675 1363 -6994 2493 4190 -6564 66 6346 -4641
912d641K805Q522r081l57R217p532k560J0174o531m657J0437n174o626J0889k965
$$ -4641 -1836 6686 -2395 -2752 6465 -1067 -3627 6547 16 -4641 5796 622 -6004 4885 1920
927A920r355J0824O35j1867Q786M294j2005N708N857j0560M869O085j1411M835
$$ 1920 -7435 3389 4024 -7843 943 5237 -6768 -1060 4797 -5763 -894 5191 -6220 -1385
941a385R313j3681J498J4525j2668m934J6451p533r384J4343k794j0910J1874
$$ -1385 7928 -5753 -4255 10270 -2398 -7332 9119 1586 -7798 6545 3751 -7159 4715
954D715p74j1395J0986J383j2831R698M509j3629O007P837j2124K760Q123r852
$$ 4715 3941 -7454 3532 4915 -7916 1782 6291 -7338 -1331 6506 -5618 -2858 5265 -4587
968d587K077P983j0473K184J0332j1793r46J4293j0242o512J5708n348j0223J2939
$$ -4587 -2510 5473 -5000 -2816 7516 -4277 -5223 9070 -1172 -7684 8024 2676 -7547 5392
982E392j267j0828J0424Q72j0785Q822K689j1595O958M921j2306M956P908j0967
$$ 5392 4125 -6703 3721 4593 -6192 2630 5319 -6276 682 5603 -6703 -1747 6161 -4806
996d806J598Q830r135q38R015o581j937P988n406j814P084n066j985Q271n494
$$ -4806 -3208 5622 -3513 -4351 4664 -1917 -3854 4134 -1272 -3086 3998 -1068 -3053 5218 -276
1011b76m368J0259l378p462Q840M81q840O104K394p314M165K684o693L355K814
$$ -276 -4644 5615 2237 -5225 3615 4096 -4744 1360 3754 -3560 605 3289 -3404 -49 2765
1026B765o240K437L971o247J181N291n481n78N526l157k279M358j150j037J568
$$ 2765 -3475 -1038 2933 -3314 -2133 3158 -2323 -2901 2625 -532 -2811 1547 397 -640 928
1041I28j797J620K115n123J340N922n331l362P036p22n768L691J734l176N38L2
$$ 928 -869 751 2866 -2257 -917 5005 -326 -3688 3348 2626 -3142 549 2283 -893 -355 -323
1057c23o39K487k452k001M351n97m591L568K025m575J716K337k356Q19J036j431
$$ -323 -962 1525 -927 -2928 1423 826 -3765 -197 1828 -2747 -1031 1306 -1050 -231 805 -626
1073f26J672k73k286L614M6m610L493K565n719J008N228m481j791M437j956k000
$$ -626 1046 773 -1513 2101 2147 -2463 1030 3595 -2124 -1116 4112 -369 -2160 2277 321 -1679
1089a679K881j541j300L096k474j433L884j665l022M188J47l907L177J085l222
$$ -1679 1202 -339 -1639 1457 -1017 -2450 1434 -231 -3253 935 1082 -2825 352 1437 -1785
1104a785K026J079k654K211Q60k923K172J108l269J860J883l851Q79L194l536
$$ -1785 241 1320 -1334 877 1737 -1186 986 2094 -1175 685 2568 -1283 -404 2790 -746
1119g46j205L999k161j964K979n72k318K026j70j259J693m51j680K005P82k602
$$ -746 -1951 2048 -113 -2077 902 330 -1988 38 -132 -1391 302 -149 -1829 176 958 -1644
1135a644J332J914k042m10K292p09j044Q27O11j055J25L70l79K38q7k55J85J54
$$ -1644 -312 1602 -440 -850 1442 733 -311 516 1127 72 197 567 188 426 339 84 269 423
1153D23q79l56J526r56j385K021n16j637J658Q39k359J218J827k683N29K970l011
$$ 423 -456 -812 714 -242 -1627 394 -122 -1759 -101 738 -1621 -403 1424 -1259 -730 2240 -771
1170g71P0L321l079l72L161j873j861L988j830k968M608j139m340M553N57n436
$$ -771 -701 2620 -459 -831 2330 457 -1404 2584 754 -2214 2394 1255 -3085 1468 2025 -3411
1186c411L998J799o091L461L468o896K210N426o819L25O503n666j785P209l493
$$ -3411 587 2386 -3705 -244 3224 -3672 -1462 3964 -2855 -2530 3973 -1693 -3478 3731 238
1201B38l810O838k547l856O382k363m316O799j403o328P500J56q265O580K799
$$ 238 -3572 3266 719 -3137 3245 882 -3434 3365 1962 -4366 3134 3290 -4975 1605 4404
1216D404r322M693M990q815K379N971p961J258P194q372J72R093q250k710J1465
$$ 4404 -4918 -225 4765 -4050 -1671 4300 -3661 -2403 4791 -3581 -3409 5684 -2566 -5276 6189
1231F189o271o133J1364k617r098R602J479r572O444L255q534M827L185q048M628
$$ 6189 -82 -6215 5149 2532 -6566 3036 4515 -5057 1387 4642 -3892 935 4120 -3928 700
1246G00M057r215M066O020r937J582Q662q941j245R568o475l894R540n083m788
$$ 700 4757 -4458 -392 5628 -4309 -2727 5935 -3006 -4251 5317 -1158 -5052 4488 -595 -5383
1261e383R392l402n711R037j964p750R136O57r975Q006L745j0984M884O803r649
$$ -5383 4009 607 -5104 3933 1969 -5781 3355 4012 -5963 2043 5788 -5196 -312 6491 -3158
1276c158O25P761o818j003O591n345j014O464n633k013P706m862m218Q124k443
$$ -3158 -2533 5228 -1590 -2593 3998 -1347 -2361 4103 -1530 -3543 4163 -699 -4917 3207 764
1291G64n878P506j90o607N547J739o424L895K940o184L093L679n687J143M964
$$ 764 -5114 2392 2202 -4405 1142 2881 -3543 352 3292 -2892 201 3880 -1807 -664 4300
1306D300n860k3N790m914k023N853k229m183N283r47l867L619N3l577L474N04
$$ 4300 -1560 -1583 4207 -707 -2730 3123 894 -3289 1994 1047 -2820 799 852 -2725 749 1253
1322A253m275K931K131m378J532L353m011K91L641k849j103L693j617k096L499
$$ 1253 -3022 -91 2040 -2338 -806 2547 -1464 -1173 2468 -381 -1484 2209 592 -1504 1995
1337A995r28k781L210J12l049J914J171l160J435J874l143K58K753k684j077L637
$$ 1995 1067 -1714 1496 1608 -1441 473 1644 -1516 -81 1793 -1350 -1092 1661 -1023 -2100 1537
1353A537j850k121L292o98k309K896j2k675K587P76l327K241J799l468J278K448
$$ 1537 -313 -2434 858 160 -2149 747 735 -1940 647 1423 -1904 337 2136 -1332 -54 2394
1369B394l194J25L177k888p81L575k459j659L877j962k909M559j049l941L787
$$ 2394 -800 -675 2502 -386 -1167 2408 -51 -1710 2167 205 -2704 1855 806 -3135 652
1384F52Q40m676K939K201m487K008K580m140J110L533m152P15L706l815k19L992
$$ 652 1492 -3184 -245 1956 -2531 -523 2057 -2083 -973 2560 -1592 -877 2829 -986 -1205 2787
1400B787l089j471M834k918k602N353j711l900M280P1m249L288N12l474L006M53
$$ 2787 -302 -1773 3061 143 -2459 2894 1183 -2717 1563 1634 -2615 673 1185 -2289 717 1170
1416A170l784K793J778n019K207L570m777K53M313l437o56L861k527j272L787
$$ 1170 -2614 179 1957 -3062 -855 2715 -2062 -1809 2504 -933 -1589 2272 -255 -1527 2260
1431B260k287j433M052k188k202L879j301k827M071q45l624L562N77m031K185
$$ 2260 -27 -1460 2592 404 -1798 2081 780 -2047 2024 1179 -2445 1117 1694 -2337 -152
1446a52J741l545J248J689k671J543J168l221J730K477l909P12L760l269p43L376
$$ -152 1589 -1956 -708 981 -1690 -147 1021 -2200 -470 2007 -1902 -1190 2570 -699 -1442 1934
1462A934j831j168K846j608j035K603j480j508K922j430j603K980j532j911K841
$$ 1934 103 -1065 1781 173 -862 1741 261 -1247 1675 245 -1358 1622 90 -1821 1020
1477A020k46k964K662P04k792J197J280k260J221M88j851K104O35l316K130K106
$$ 1020 774 -2190 472 1176 -1616 -419 861 -1399 -178 310 -1541 563 1198 -2118 12 2118
1493B118l708R77L009k540p53K700j996l84K157j835m59K624k506o29K873k039
$$ 2118 -1590 -613 2396 -144 -897 1803 -193 -577 1580 -255 -714 1910 -596 -1225 1648 -391
1509c91j403L182j217k388L247l55l008K705M96k792J993Q95k549K076R50l039
$$ -391 -1794 1388 171 -2217 1030 675 -2333 372 868 -1924 69 964 -1585 491 1441 -1598
1525a598J936J653l153R47K320k846L0L070k785m65K705k215j050K994j496j715
$$ -1598 338 1991 -1162 -215 2105 -741 -711 2359 -426 -891 1814 -401 -1451 1543 47 -1668
1541a668K985j034k286K942n70k453K445J92k906K513J100k804J400J708k583
$$ -1668 1317 283 -2003 939 369 -2084 361 553 -2353 160 1260 -1544 -144 1564 -1019
1556a019O53K150k704O32K305k292k45K256j791j092L008j516j742K812q55j996
$$ -1019 -366 1784 -920 -288 2017 -275 -520 1736 -55 -1147 1861 345 -1397 1415 560 -1436
1572a436K242j16k252J902K80k264J412J405k815J080J620k001k59K408j339j086
$$ -1436 806 690 -1562 340 620 -1644 -232 1173 -1642 -562 1058 -943 -1202 1206 -133 -1219
1588a219K106n86p52J243l62j135J863m55j797K106L62k711J464J466k576J55
$$ -1219 887 301 -451 792 430 -705 1158 703 -1094 1012 1374 -1337 127 1593 -983 -828
1604h28K404k029p47K149j091j100J893q55j181K052p56j570K297J15k726K236
$$ -828 1576 -453 -1200 949 -142 -1242 651 -204 -1385 667 -89 -1659 638 753 -1973 263
1620B63J296l184J313K377k720k52K987j956r12K264j440q10K285j591j177L156
$$ 263 1559 -1625 -312 2065 -655 -907 2080 124 -788 1476 36 -774 1511 -80 -1257 1899
1636A899j345k632K890J48l536K791J448m114K112K324l610R58K762l295L3L393
$$ 1899 554 -2078 812 960 -2576 215 1663 -2451 -339 1985 -1625 -667 2095 -1200 -1167 2226
1652B226k910m61L387k719j476M641k807k183M861k090l420L949Q55l417K518
$$ 2226 -684 -1145 2242 -477 -1953 2688 -119 -2302 2559 469 -2951 998 1853 -1564 954
1667I54R54m158K574J340m254K595K094m672J389L865m661K23M554l931j400M798
$$ 954 1908 -2250 324 1664 -2590 5 2099 -2573 -1184 2681 -1980 -1757 2797 -1134 -2534 2264
1683B264k291k497M611j326k876L877p29l294L967j65l860L541Q18m790K860K471
$$ 2264 -27 -2524 2087 761 -2115 1762 1033 -2261 1706 1541 -2319 1222 2040 -2750 110 2581
1699B581m667K138K509m398J098L166m165o3M198l641p80M195k824j905M631j908
$$ 2581 -2086 52 2561 -1837 -739 2427 -1738 -1801 2397 -1244 -2024 2171 -653 -2558 2073 165
1715A65k681M003n24l586L969N07m060L083J289m166K119K205m045J457K622l370
$$ 165 -2516 1487 963 -2623 1346 1853 -2207 876 2165 -2001 118 2323 -1722 -265 2357 -1013
1731a013L05K915l489K01L061k908q11L483k306j606L522j143k282L159m58k627
$$ -1013 -708 2207 -1282 -1081 1980 -928 -1739 1744 -562 -2168 1354 211 -2071 1088 630 -1997
1747a997K767p2l012K889R77l023J690J677k558M40K075k438j38K539k320j90
$$ -1997 770 698 -2314 575 1552 -1471 219 1896 -662 -222 1853 -585 -723 1816 -504 -694
1763f94J928j610m75K112j193j548K276o31j735J937q2j725J622R4j459J391M52
$$ -694 1234 -376 -851 1261 68 -1480 796 165 -1570 367 285 -1440 182 276 -1183 208 660
1780F60j542R39J130k051O88J460j533l98K190j390q62J730l60j315J028j04q96
$$ 660 -882 57 1187 -864 -176 1284 -249 -647 1543 153 -709 1021 661 -654 374 270 -626
1797f26Q50J2p43O71K70j206O19O68j046K53L79N18q80O81l26n53J937q07j093
$$ -626 224 236 -507 164 434 -772 -153 515 -531 -278 101 619 -261 420 94 -459 1478 671 -422
1816d22Q67N8p10O54N88j519P57K32j148N77N70r65J56J115r21n82J358o46j106
$$ -422 445 503 -207 447 1035 -484 273 505 -643 -66 504 -461 -305 810 -111 -693 665 19 -1087
1835a087J099K51q33M21J36m78N79L6p88O63N35q01L11J178j509J38J353j285
$$ -1087 12 263 -570 -149 -13 -491 88 124 -664 -1 534 -267 44 1222 -287 -149 1204 -81
1853h1j43R26o09j13N16o62j6P74o34o18J184p34r27J320P9j329Q40Q42j607Q65
$$ -81 -224 702 93 -20 496 -166 -182 592 -42 -660 524 -210 -1137 183 262 -1067 -227 615 -992 -127
1873a27K73o27N21K50r63Q44O33j421Q63M57j154K48J390j411n6Q51n57j80Q68
$$ -127 146 -481 40 290 -673 171 804 -617 246 703 -451 -203 1187 -224 -280 571 14 -166 702
1892G02p83l19Q95o63n57J060p95r57J589m25j331J879L51j681J585J2j463R62
$$ 702 -81 -400 495 -168 -725 335 -460 -1417 172 -253 -1584 295 646 -1035 550 562 -901 61
1910F1N72j318R40N45j190R43N69j785P44J311k109N72J381j867K45J502j462
$$ 61 633 -685 255 800 -390 553 1122 -663 81 1392 -717 -145 1236 -631 -386 1116 -346
1927c46k93J318j009p99J750q76o06J295m73j449K003k22j669J777K08j563J219
$$ -346 -639 679 -330 -1129 621 -255 -861 434 -39 -1488 515 293 -1376 401 609 -954 265
1944B65M74j596J228P86j920Q39J124j866O32J605k321N10J516j407m79J833j276
$$ 265 739 -857 371 1157 -763 76 1200 -666 -34 1571 -750 -240 1276 -131 -610 1223 -53
1961e3j033J839o20j081J584p12j262J570r0j648J748M59k012J351J073k107J080
$$ -53 -1086 753 133 -948 636 -76 -1338 232 142 -1506 242 701 -1311 40 1113 -994 86
1978H6Q14j532M87J526j882L73J624k209J69K008j958n26K376j593j218K327n60
$$ 86 900 -632 -145 1381 -501 -128 1496 -713 -544 1464 -494 -1020 1356 -237 -1455 872 312
1995C12j977K115J87k225J766L92j762J295O27j610Q24Q22j679L69J939j680k90
$$ 312 -1665 450 637 -1588 178 570 -1192 103 730 -880 -56 766 -913 -544 1395 -285 -575
2012e75J724j131k55R22o55o02J801j070j308K162j227n69J947j252k278K565
$$ -575 1149 18 -237 685 30 -572 1229 159 -1149 1013 -214 -783 1164 -88 -2366 199
2028A99J40j684J359R48j821K83J231j273L43J116j237l79J700j052m75J358m79
$$ 199 339 -1345 14 962 -859 -576 655 -618 -275 841 -396 -775 925 -127 -602 756 277
2045B77j080J575m11m35K93J292j798M7J096j379N43L99o62L01L89q98K84O97
$$ 277 -803 772 361 -74 219 1511 -287 -240 856 -523 20 419 -243 58 447 -451 -167 530
2063E30j078n10K267j759n12J445k27j375J822J99j484O64J260j521O38K93r12
$$ 530 -548 -1058 1209 -550 -1062 383 156 -1219 603 802 -682 -18 1242 -279 359 652 -260
2080b60m1J190n58l89J657k157j101L225j600j947K346N70k227J227K2j058O97
$$ -260 -301 889 331 -58 1599 -558 -1659 1566 -34 -1981 365 935 -1292 -65 -43 -1101 -404
2097d04K12p81O44P94j772J563M51j350K30J941k818R87K018j449p55J754j280
$$ -404 -192 -973 -329 465 -1307 256 707 -643 -413 1528 -1290 -303 1715 266 -489 1265 -15
2114a5OJ860j786k20R41q75l98M37Q39j500J602K50k115N33O61j367J754K08j705
$$ -15 -9 1851 65 -155 786 -89 -487 -50 789 -711 891 1141 -974 -441 220 -1147 607 815 -890
2133h90M09J547j170j21J593j411j94J090j136m27K214j476m20J266k64j361M45
$$ -890 -481 1066 -104 -225 1368 -43 -237 853 -283 -710 1504 28 -392 874 610 -751 -306
2150c06J343j985Q34J536k181N18Q79j875K40K270r72j355J033l81M23O85q02
$$ -306 1037 -948 -114 1422 -759 -241 638 -1237 -997 1273 301 -1054 -21 -402 21 706 -96
2167i6K21J438r53k66M49M85j321O55o97r50J997r35m17L1R9k80N19N38j192l41
$$ -96 125 1563 610 344 793 1278 -43 612 -85 -1035 962 27 -390 -359 -260 -540 -21 517 -675 -1016
2187a016J190l38Q17L3J21j864J854j505N07J608j181j513J108R04j064L62M69
$$ -1016 174 -164 653 686 807 -1057 797 -708 -201 1407 226 -1287 -179 725 -339 23 492
2204D92j010J410j019n35Q62J25r19Q31L92j101L64J277r85j323J662j87p54J406
$$ 492 -518 892 -127 -662 200 325 -594 237 629 -472 -108 1169 184 -1139 523 336 -418 988
2222I88m87j228J559n92m23m6O78j697J606j60q54P17M73n83j18M52q91P78kj60
$$ 988 501 -727 832 240 -183 -229 449 -1248 358 198 -656 61 534 -49 -167 285 -606 172 170 10
2242A0O8k11R1K72M96r82j1Q59l97j151J218o17r3O1L26l43M41Lp69M08J48l13
$$ 10 78 -133 -42 230 726 -256 -267 592 195 -956 262 -355 -448 -387 -61 -404 37 40 -729 -321 -173 -486
2264d86l4P60p62M83P23j299O94K77k66K5N29K55q32O98n26j62P92j032l58O36
$$ -486 -520 240 -522 -39 684 -615 79 356 90 115 644 899 67 765 239 77 869 -163 -521 115
2284A15p04k76J668n97m01p7l15L19J82L21r36O73kp5J23P21q86K58o60N86m87
$$ 115 -589 -865 803 206 -195 -272 -587 -268 -86 235 -701 -28 -30 -105 18 739 -147 111 -549 37 -450
2305d50J595j608k74R16n69M43j33N66p92m5O44j167Q31N46r33k90Q99l02O32
$$ -450 1145 -463 -737 179 -390 53 -80 486 -306 -351 293 -874 -43 503 -430 -720 179 -123 509
2324E09n76m05P85j4m10l30J001j22O9L48l41p17O2J96j45P6M40n41K65M35p73
$$ 509 -67 -472 313 299 -111 -441 560 438 507 855 514 -203 -141 55 -90 -14 426 -115 150 585 -188
2345a88N74K11j064N87P0p5l38K00q29k28Q25j4q0m1M67p61J250j011K74Q46L41
$$ -188 386 597 -467 120 190 115 -223 -23 -852 -1080 -255 -269 -349 -390 77 -684 566 -445 -171 675 1016
2366A016j043M83L66j132K53J133j512M2J463j285K39J27j64m8N14r79L20O64
$$ 1016 -27 456 822 -310 -57 1076 -436 -394 1069 -216 23 150 -14 -62 452 -527 -207 457
2384D57n14k83O14n34o56J470o52l23R22o85o61J248J02j274Q83M38j088N37M32
$$ 457 -57 -340 274 -260 -916 554 -98 -421 501 -184 -845 403 505 -769 114 552 -536 1 433
2403D33m34J33L07o41N8O40p33p5J017j072l07J408o28n88R23o33o65J549k79
$$ 433 -1 132 439 -202 -144 496 -237 -312 705 -367 -674 734 106 -482 441 -192 -857 692 413
2422D13j209R43K36j024J077k60q38N63N58r26M55P78j040K02Q12j030q8J234
$$ 413 -796 147 383 -641 436 176 -662 -99 459 -467 -12 766 -274 -72 740 -290 -378 856
2440H56q92k98J014o45m57P83m24m76P42k51p58R30J3r84Q44M44j166P09N57r04
$$ 856 -36 -334 680 35 -422 361 -63 -539 203 -48 -806 124 137 -847 -3 441 -725 -16 541 -363
2460c63L23N53p03n0Q36p63M0Q83r81m3R56n23n27R79n03q14R32J57q20L79L99
$$ -363 -40 513 -190 -240 596 -167 -127 756 -225 -268 688 165 -362 617 114 -700 232 389 -431 -52 347
2481C47o75O1N07q00M01J51p08K23O24m24j41Q52m35j70P54n53k48N58k83n23
$$ 347 -328 -267 240 -560 -159 -8 -716 -493 131 -293 -434 418 -17 -187 567 14 -234 324 41 -482
2501d82P76Jn51P09j68n00L12j82k76M08N17r31J89K04n97K51O56o43k02R46m54
$$ -482 294 295 -256 453 285 -215 97 -85 -361 47 564 -367 -178 26 -571 -320 336 -307 -509 437 -17
2522a7l20O77k98n01N14K0m07N46O5p63N99K48m23L37Q6m06n6R15q32l78J000
$$ -17 -337 340 42 -459 55 75 -332 214 279 -484 115 363 -60 277 363 -43 -99 816 -16 -394 606
2543F06p43k74J3M52l17N92m20r21J014k93m72P04j16J77N4Q5j35k16M48p35O81
$$ 606 -137 -411 -398 54 -263 329 -91 -1012 2 -291 -763 -59 -175 2 56 141 6 -210 238 -497 184
2564A84L64k45n28R54p04p86R35r4M3M11k98n13J032j046o0J006o58n10O06K06
$$ 184 548 303 -225 729 25 -761 174 80 123 534 236 -277 755 -291 -351 655 -3 -513 93 299
2584B99o95K50M09l85j44O28n64J50P00p80j5O22n26k18O41o03j46P94k38m96
$$ 299 -396 -146 263 -122 -266 362 -202 -52 648 -132 -147 475 -51 -269 372 -231 -377 417 179 -317
2604c17M84m9m69O02k08l94K00M37m85K43J86n82K93N02n98l08Q75q72K04Q06
$$ -317 167 118 -351 251 43 -351 -151 286 -199 44 230 -352 -59 443 -155 -463 412 -460 -256 550
2624E50m11m25L43K46m30M88k73o8J53K8o06O76Q0o10L27N9l02J58L45o42K5N26
$$ 550 139 -286 57 303 -127 361 88 20 173 201 -405 271 351 -259 68 127 -175 -17 328 -314 -289 237
2646B37p91M28L11n66J76L48k89o7L56k54l0L08m3n12P40n3n53J31L72n21N20
$$ 237 -554 -126 185 -381 -205 143 -146 -213 143 -111 -141 167 124 -388 352 299 -254 -123 249 -272 248
2667B48K5l52K73j01j91j82M40m29P8M61n85k05O59n37K62K22p8m9K60Qn78R09
$$ 248 273 -79 194 93 -98 -280 160 -269 -191 270 -315 -520 139 -398 -136 86 8 -41 219 227 -351 558
2689E58n30l1M69k70n13N73K5m45M26Pn18K47Lk72L22J36m02J84J17k37m0K82
$$ 558 28 -3 466 196 -317 256 281 -164 262 269 -249 -2 1 -271 51 187 -215 -31 86 -151 -191 91
2711I1l91L32Pj80R3J81l7l88N63J00m24K22j59j65J89L56l84j12K73l17l1M83
$$ 91 -300 32 39 -141 -48 133 96 -292 271 371 -53 169 10 -155 34 390 6 -106 167 -150 -181 302
2733C02n44J77L51l50l63N96k1m33K51m6l17M13J78l52J29J75k86K47k22J7J98
$$ 302 -242 -65 286 -64 -427 169 148 -285 -34 -80 -397 16 194 -158 -29 146 -140 107 -115 -98 100
2754A00K21l44K81P7l72J23J44l2n08N29p4r7O5p5l00L61Pl56L49J62n18J02K5
$$ 100 321 -23 258 335 -37 86 230 198 -310 219 145 48 113 38 -262 99 106 -250 99 261 -257 -155 -130
2777a30k36L00J42j76K05L07n39J74K57k39k92O36k66k12M44k63l54O18l41m31
$$ -130 -366 -66 76 -100 105 412 -127 47 304 65 -227 409 143 -69 375 112 -242 376 35 -396
2797c96P19k58l77L09J40k26j11K00m4p9N1k32L75J40k48l25O91l66j63N30m04
$$ -396 323 65 -312 -3 137 -89 -200 0 -44 -123 -72 -304 71 211 -37 -362 329 -37 -200 330 -74
2818g4m4N42n56q7M79k83o2M33k60l53L47J27l86N70j09n34K17J84n02M84J71
$$ -74 -118 424 -132 -219 260 -23 -85 348 88 -265 82 209 -177 393 284 -250 -33 151 -351 133 304
2839C04m39l10N74l77m6K85j37j19O02pn34K21K85o52N85j45j53L10Nm12J85L20
$$ 304 -135 -445 129 -248 -294 -9 -146 -265 337 330 -204 17 302 -350 235 90 -63 247 252 -160 25 345
2861C45n53K19J56r0k70M46l96M4K28l09R5J90l36m8P35n28n6Q4R3m86N20M2l99
$$ 345 -208 11 167 77 -193 253 -143 -99 129 -180 -85 105 -231 -279 456 -72 -128 -44 49 -437 83 125 -274
2884b74K43L87o76K75M33o67J69K80l51Q5L97l89M8J34j76Q3J14j71j97J01K68
$$ -274 -31 356 -320 -45 388 -279 -110 170 -181 -96 301 -88 -40 94 -82 1 115 -56 -253 -152 116
2905A16l64K36j93J84L66l57l60N01O9k07M9J25n38L50L12m75Q1L96k41j29K02
$$ 116 -248 -12 -205 -21 345 -12 -372 129 198 -9 40 165 -373 -23 289 -186 -105 291 50 -79 123
2926A23k74j34O17l62K03j37j12k94L94j02k36K50K61m05Q1L01j80K18n6m17M14
$$ 123 -151 -285 332 -30 173 36 -76 -370 24 -78 -314 -64 197 -208 -127 174 -6 212 156 -261 153
2947A53m6m36K00M41l60n4L32k3l29J40Lk0r2L33m52K64o8k06K08j7k83K87K98
$$ 153 107 -329 -129 312 -48 -102 230 207 -122 18 21 1 -91 242 -210 54 -14 -220 -12 -29 -312 -25 273
2970B73m38J3L44j80k20K54n2L4k5R5J81j14n6l28K62J21l12M35j13l51K65Q8
$$ 273 -165 -152 192 12 -208 46 -6 28 3 98 279 165 109 -219 43 164 -148 287 174 -177 88 176
2992A76j28k79N74l44m1K1k60K11R3m22K27J72q8j74M59k05m4K10p5j54nK01l13
$$ 176 48 -231 343 -1 -42 -21 -281 -70 23 -399 -172 0 -88 -262 197 -8 -52 158 83 -71 -76 125 -188
3015a88J08J25Q6o1P2k7l17L58k80KR7m9N1K18l71j7K38k6k83K42K6k0J41k68
$$ -188 -80 45 131 70 142 115 -202 156 -124 -122 -25 -74 -23 195 -176 -193 45 19 -264 -22 4 -16 125 -143
3039a43n4L16K1k06j6J24p2L2J09k71K54K66m03j03K16j27J5L24l62p3K79j42
$$ -143 -197 119 140 -66 -82 42 -30 2 111 -160 94 360 -43 -146 70 -57 -42 282 -80 -153 126 -16
3061a6L2j42m5l19M32M2j52L25J04l90J92k1l12L28J12j30m8j44R5R3koj56L58
$$ -16 16 -126 -171 -490 -58 -16 -168 157 261 -129 63 42 -270 58 170 40 -8 -152 -57 36 34 28 -128 230
3085B30j22ro7p6j81L90k26K1K09k79j39K86m4j41n1K14j40K7K43n47L21L34l08
$$ 230 108 99 32 -44 -225 165 -61 -40 169 -110 -249 37 -7 -148 -199 15 -125 -98 145 -402 -81 253 -55
3108e5K24Lj92k4K34k17n8L49k19j11K24j20j79L87j15m87K56M5O5j70J11l67
$$ -55 169 172 -20 -44 190 -27 -85 264 45 -66 158 38 -141 246 131 -356 -100 -55 10 -160 -49 -416
3130d16L82K6j44m2K63k37K41L0j18J38R0k73m8O06m85jR7k73M4J41J69l54J69
$$ -416 -34 -8 -152 -194 69 -168 73 103 -15 123 213 -60 -108 498 13 12 109 -164 -120 21 190 -164 5
3153Ej22j54L90r2j97J12J34k88L10j6j78J22k17P6m5M05m30R6K73m80J78L59
$$ 5 -117 -271 119 27 -170 -58 76 -212 98 82 -96 26 -191 -115 -160 245 -185 -89 184 -296 -118 241
3175B41j31j79P2j7k02K47m8j38J31J17p1j55K05k11l0K24k1k06J57k9j90N98
$$ 241 110 -69 3 -14 -216 31 -17 -155 -24 93 22 -133 72 -139 -169 55 34 -172 -15 -44 -234 364
3197C64m34K35l4j62j3K86k97k98O74r2k61K30K9m23M67n1l65k6L45j18j63J84
$$ 364 -70 165 131 -31 -44 242 -55 -353 321 229 -32 198 227 -196 271 220 -145 -171 174 56 -107 77
3219G7j38k7L06k33j10q5K01m2J50J52m10nM23l02K9J58k13J57L7j19K37q7j55
$$ 77 -61 -88 218 -15 -125 -210 -9 -51 99 251 -159 -164 259 -43 -14 144 -69 88 125 6 243 156 1
3242AJ51j49q3J5J13k8j4L4n5k60M03k51QK15p6j44J61l1k05K86J16k55j92M31
$$ 1 152 3 -80 -65 48 20 6 40 -15 -275 128 -123 -115 100 24 -120 41 10 -195 91 207 -48 -240 191
3266A91j02k0J36j94Kj2k13K77L08k49n0K14k53l8p0J00l81L27k0q7M04l76J64
$$ 191 89 69 205 11 13 1 -212 65 373 124 74 288 35 -3 -73 27 -354 -27 -47 -134 270 -106 58
3289E8pj33J53j82J1j23P1K97j62p1J78j74q7K44J81k99K48k56J43J81j83l06
$$ 58 51 -82 71 -111 -100 -223 -152 145 -17 -88 90 -84 -171 73 254 -45 203 -53 90 271 88 -218
3311b18L71Nl28J77K30l11K08j66j61M5J34k54K93P9k19q7M23o4l24L99j76k30
$$ -218 153 158 -170 7 237 -74 134 -32 -193 -148 -14 -268 25 104 -115 -202 221 157 -167 232 56 -174
3333a74L35r4r7J47Ql5n2K45l13M7J47k62J31r0j21K22j32J20j28J61j87P5l5
$$ -174 161 67 -30 117 125 90 38 283 -30 17 164 -98 33 -57 -178 44 -88 32 -96 65 -122 -47 -82
3356h2m7Q8K45l50J48k10K35q7K4K14l58L19K02l38J72j22J52k19N8k46L0K06
$$ -82 -129 -41 204 -146 2 -208 27 -60 -36 178 -180 139 341 3 175 53 205 -14 44 -202 -172 34
3378C4l11K37K66m8l81K42j32r9J56K3l73L69p0K02j54J01k10L17L5l22O9L54
$$ 34 -277 -40 226 178 -203 39 -93 -192 -36 -13 -386 -17 -87 115 -39 62 -148 169 204 -118 -49 305
3400C05l83J36K4k8j1Nj99n6K58j87k1J84k09K40P4j91O4L8k18l1K77J21m9j21
$$ 305 -78 58 82 54 43 48 -151 -207 51 -136 -157 27 -182 58 132 -59 5 43 -175 -206 71 192 143 22
3424B2J81m24J46P7q9M1N6K38k40J1Qj25m0P7M3L00l54J10n9J4k69M89k9k72L85
$$ 22 203 -221 -75 2 -87 -46 10 248 8 19 27 -98 -138 -61 -18 282 -72 38 -21 -7 -276 213 184 -88 297
3449B97l77R1q1J50j62J17kN8k57K08L4oN7j39j82K71j0J50k58n0J13k00J39J29
$$ 297 -80 11 -70 80 -82 35 33 91 -166 42 76 70 127 -12 -194 77 67 217 -41 -91 22 -178 -39 90
3473I0j52J78j78O5j57P1j15M0m8L58j79k13J92J17Q2k49M2J38J2N1l16O3J76
$$ 90 -62 116 -62 3 -154 -83 -198 -158 -206 152 -27 -240 -48 69 151 -98 -56 82 94 145 -171 -108 68
3496F8k49J77m9K51l27K52p0L8J47k17J5J51k22k15K13n9J78l17M55k09Q0k5%
$$ 68 -181 -4 -53 198 -129 123 53 91 238 21 36 187 -35 -250 -37 -96 82 -235 220 11 91 66 66
3519F6k28K64j42j36K4J93k13K78q3q9J66n7j21L01k91Q6R1l6p3N3J04m8M6l3
$$ 66 -162 102 -40 -176 -152 41 -172 106 23 -66 100 43 -78 223 -68 18 109 73 0 53 157 109 155 122
3543A22j98rK29m05R1J53q6k7J54R0J7j72j36K22q4K69k93M2K59m40NK07M2NO7
$$ 122 -76 -85 144 -261 -170 -17 -103 -130 24 114 131 -41 -177 45 -39 230 -63 -21 238 -202 -197 10 52 57 124
3568A24m31K40J48Kj93J71j10j49L32n8j68nJ05k84J97J80j98q7L35l89L16p5
$$ 124 -307 -67 81 83 -110 61 -49 -198 134 76 -92 -97 8 -276 -79 101 -97 -184 151 -238 78 3
3590Co9M0J63k16K43k83K21p0j6m5J27q5%j22J07j20J71n2p9j07O0M5q4J82k75
$$ 3 -66 -26 137 -79 164 -119 102 32 16 -29 98 13 13 -109 -2 -122 49 -3 -82 -189 -129 -84 -168 14 -261
3615b61J52P2J4k43L40k35q8k5M76j08j85J40k0K4j31J14m1j19Q2n8L03j81pn
$$ -261 -109 -37 -23 -266 74 -161 -249 -274 202 94 -91 49 29 53 -78 36 -5 -124 -42 -100 203 22 15 10
3639A0K5j85K75l12J16J12J34j55j07K08k26J06K61m18l6J27J72j41jJ67k83O0
$$ 10 35 -150 125 -187 -71 41 175 20 -87 121 -105 1 262 -156 -192 -65 107 -34 -35 132 -151 -91
3661i1J99j60L5P0j14pK23J0j1l90K39n7L17l50Q9o6j23K76qk9L4m6k68K20Q9
$$ -91 108 -52 -17 53 -61 -68 155 165 154 -236 3 -54 263 -87 2 -64 -187 89 81 52 86 40 -228 -8 81
3686H1r3Q3p3l02M28k35J94Q0k26J18j6O5l5j60m2J56j82J2M6Mq2K01k97J31j5
$$ 81 -12 71 -2 -304 124 -111 83 163 -63 55 39 104 69 -91 -133 23 -159 -147 -101 -97 -179 22 -275 -144 -159
3711a59L07j33J85n04K05K49o5M3j86M2l75L63J48j02J1K7n3p6j27L37j8j43k
$$ -159 148 15 200 -304 -99 150 85 128 -58 -16 -391 -28 120 18 29 56 3 -73 -200 137 119 -24 -26
3734b6j09L99j17j68J2m4N1k31J42j79R5K86q3j25Q3k10K35J16k46O6J18k02J63
$$ -26 -135 264 147 -21 -9 -53 -2 -233 -91 -270 -175 111 28 -97 -14 -224 11 127 -119 -53 65 -137 26
3757B6K73m24J62q9J78j38J7o6P7J33J1l51K39P9l8J0j93l0n6j55R4L21o3K1P1
$$ 26 299 -125 37 -52 126 -12 5 -61 16 149 160 -191 48 127 89 99 -94 -124 -180 -335 -241 80 17 38 109
3782A09q2j9r3L46j37k67K4l8L33j28J68k45l1J58m5O2r6N3p2j38k24M13j17R0
$$ 109 27 8 -85 261 124 -143 -119 -157 176 48 216 -29 -60 98 53 115 19 72 0 -138 -362 51 -66 24
3806B4n8J14j1m30K19n1j2J31O0J02K6l7j44R1l20L02k8N8k7J09j52J53k17J31
$$ 24 -34 80 69 -361 -142 -193 -205 -74 -14 88 114 77 -67 24 -296 6 -22 36 9 118 -34 119 -98 33
3830C3R1q3qj14R0nL1L6P8j85K73r3m6p8n4n4J81M7Q7k19K24m38J55N5L8j84J63
$$ 33 124 41 33 -81 9 4 35 71 149 -36 237 144 98 20 -34 -88 93 140 227 8 232 -206 -51 4 42 -142 21
3857B1n3j8K52k27J89j77J05l68M59j73J7j42J39j01j92J10j21n9M14q8Q6Mm19
$$ 21 -32 -50 202 -25 164 -13 92 -276 183 10 27 -115 24 -77 -269 -159 -280 -339 75 -13 73 77 -342
3880c42K67N3J60O2k48R1r4P6j33L6K70j63N%j45O6r0k6O8L23j27k54L20k5l67
$$ -342 -75 -22 138 200 -48 43 -51 25 -108 -72 198 35 40 40 -105 -39 -129 -155 -87 236 109 -145 175 150 -217
3905b17L9J13l0j04L26k96K0J99j44j39M20j24M1k46K78n9j64K86k11p5J65j92
$$ -217 -178 -65 -95 -199 127 -169 -149 50 -94 -233 187 63 104 -142 136 77 -87 199 -12 -87 78 -114
3927a14K72O8l51R8L5j79K46J11O5o3n02M14q21J131o25m4J47N18m39j35J77O5
$$ -114 158 226 -125 -27 8 -171 75 186 251 188 -314 100 -721 410 -215 -259 -112 406 -33 -168 9 74
3949G4%J25j86N0J16r6j47J33P1j26R7mn3o0M5l5l2M9o7O8O7k26J79l3K1p2K16
$$ 74 74 199 13 63 179 83 -64 69 140 14 111 107 54 -6 39 4 -28 21 -46 22 89 -137 42 9 30 -42 174
3976A74j35j62R0J8j30k30M17J63m6L4k75L38k00n3j89J12jJ07n2J88j23j34J46
$$ 174 39 -123 -33 -15 -145 -375 42 205 159 193 -82 256 56 3 -186 -74 -75 32 -20 168 45 -89 57
3999E7j63j2J86q4Q4J2j07J40j7j29N5N2j06J82Kk02K31k32K17k43J47j45q8J91
$$ 57 -106 -118 68 -16 68 80 -27 113 96 -33 22 74 -32 150 152 -50 181 -51 166 -77 70 -75 -163 28
4023B8J74k62J98k45j9L1%j76R7J20J15j86O6R0j11M06j03l05K47m5j97R3O3k89
$$ 28 202 -60 138 -107 -126 -95 -95 -271 -174 -54 61 -125 -59 31 -80 326 223 -82 165 120 -77 16 79 -210
4047b10L65N9j10j26j49m8L76j30J3N6k03L44l06j6j63K56M0k15M8nj63L27L6
$$ -210 155 214 104 -22 -171 -219 157 27 40 96 -107 237 -69 -85 -248 8 48 -167 -119 -124 -287 40 76
4070G6k3q9N8m0j07J64k49M51n08j42M60k62J95P9J15j91k82L08j21l3J38R9k41
$$ 76 53 -36 22 -18 -125 39 -210 241 -267 -409 51 -211 -16 63 178 -13 -295 13 -108 -141 -3 96 -145
4093a45K08l9k13J57J25k62K87l32K78j28K17q5m5P1K3q6n8K2J1K3j0N6K46k71
$$ -145 63 24 -189 -32 93 -169 118 -214 64 -64 153 68 23 94 117 31 -27 -5 6 29 19 75 321 50
4117E0k31J30j3L7n4j08K77Q8k27j36J18p0l3K18l04L17p9Q1L2j47J00L06k87
$$ 50 -181 -51 -64 -27 -81 -189 88 176 -51 -187 -69 -139 -172 46 -258 59 -20 61 93 -54 46 352 65
4140F5Q2k71J66J05j31N5r0L06l39P1m9j50J92n2r8R6L7J89k68J78j90R4O2j90
$$ 65 147 -124 42 147 16 71 -19 287 -52 19 -30 -180 12 -40 -138 -42 -5 184 -84 94 -96 -2 60 -130
4164a30j16K92r3J90j81O0j4k0k40J89J37j47J45j37O6q0J69j37J65k07j46L39
$$ -130 -246 46 -47 143 -38 22 8 -12 -252 -63 74 -73 72 -65 1 -79 90 -47 118 -89 -235 104
4186A04J26l13L5R4l5Mj55K92j52N6Rm7k57J53J19P6q6j5J52m28J99j97L95J8
$$ 104 230 -83 -48 46 11 15 -140 152 0 56 65 18 -239 -86 33 109 23 8 160 -268 -69 -266 129 147
4210A47k70K02j42J54l15M32m02J74J23N6k17Q3j58K83l9q7q8J5r6J66J92l82
$$ 147 -123 79 -63 91 -224 208 -194 -20 103 159 -58 25 -133 150 111 24 -64 -49 -145 21 213 -169
4232a69K26r8J47j29R8j20Mj14K02j3O7k6k13J44M9o7L6j57N9J47o6j36J04K23
$$ -169 57 -41 106 -23 75 -45 -41 -155 47 34 101 75 -138 6 55 -12 24 -133 -74 73 7 -129 -25 198
4256A98k13lJ07j40k8K39l95K85N2j16j03J26O4k05J41M1L0j15M1j74K60k67M
$$ 198 -15 -18 89 -51 -79 160 -235 50 102 -14 -117 9 73 -132 9 50 80 -35 6 -168 92 -175 -171
4279a71K33J44k06M2m9l4R1j4K49o02N09j45J45l75L32j60m5R9j85J20J00j06
$$ -171 62 206 0 42 -7 -41 50 36 285 -317 192 47 192 -183 149 -11 -56 43 -142 -22 78 -28
4301b8k54K56k8J03J03Kj40k0j80J41j2J38J36k84j10K86J4j01p5L45j70r3J18
$$ -28 -282 -26 -54 49 152 154 14 -6 -186 -45 -57 81 217 -67 -177 109 123 22 -53 292 122 29 147
4324A47k17k1k14L29o2J37l8J45R0k17J56j3K4j45m67M18J09j26n4K04m31M07
$$ 147 -70 -91 -305 24 -38 99 61 206 296 79 235 222 246 101 -366 52 161 35 -19 185 -246 161
4346A61j51oJ81J79l73O3p6L6l4j9N9lL8j41J4K5M1j62K57k74O7J43P5j16j22
$$ 161 10 4 185 364 -9 54 -22 14 -20 -39 20 17 55 -86 -72 -47 -6 -168 89 -185 -118 25 100 -16 -138
4371a38K93k14J90j82q9K03n2J06r8O0l0L1p9J38q9l7j0pQ1J54k23J2J55r7j75
$$ -138 155 -59 131 -51 -140 63 11 117 19 79 49 80 1 139 50 13 3 -4 77 231 8 20 175 78 -97
4396i7P8KJ62M1k83Q6L1J8K70m36O2K21Q7k05L3Q3k54J76j76J98k33K41k09j76
$$ -97 -19 -17 145 186 -97 -11 20 38 308 -128 -66 155 242 37 70 153 -101 75 -101 97 -136 105 -104 -280
4420b80K34j13J00j63J07k0K29j70R1L3j4Q2r4q6N9R7j97rK52l79J72J28n8K1
$$ -280 -46 -159 -59 -222 -115 -135 94 -76 15 48 34 116 22 -64 -5 92 -105 -114 138 -241 -69 59 1 22
4444B2p6r3K59k77J34QJ30j50j90K14P4P4mN9j35j55J33J68k63K92j27J11k92
$$ 22 -54 -147 112 -165 -31 -23 107 -43 -233 -19 55 129 125 184 49 -106 27 195 -68 224 97 208 -84
4467h4J7l08M51kq9k1K23j93J81j59k75K10j15J6Q7N1R5J08l21J37Q5p3R4j94
$$ -84 -67 -375 76 74 -15 -36 187 -6 175 16 -259 -49 -164 -148 -61 -10 85 193 -128 9 94 21 115 -79
4491g9K16j46j23P2N0P0m3J73l82J15l6m3M4J60J13k07J15p7n8k1j20Q0K13lN2
$$ -79 137 -9 -132 -60 -10 60 17 190 -192 -77 -113 -156 -112 48 161 -46 69 -8 -66 -87 -207 -127 86 83 135
4516A35j59K29l16L84k85j09J70M9O7KL1j31r8j16L35j83l3J02Rl1j1p3n6J95
$$ 135 -24 205 -111 273 -12 -121 49 98 165 167 198 67 -31 -147 188 5 -28 74 83 52 41 -32 -88 107
4540A07j23J55mk16j9K53j21J27j21O1N5j55j0K46j59k71L15k00k02M32k1L6q4
$$ 107 -16 139 135 -81 -100 153 32 159 38 99 154 -1 -11 235 76 -195 120 -80 -282 150 129 165 81
4563H1K0j07N5q3j09LJ42j7j68J73O1j42N6M6M9r3J0J35l07L11j78j2J31K3j81
$$ 81 101 -6 49 -34 -143 -140 2 -15 -183 -10 51 -91 -35 11 60 -33 -23 112 -195 116 -62 -74 57 80 -101
4588a01J25j27J16Nk87N2J27N8K1j59K43k08K8K28k66K75q9J43k56K48l96N9M07
$$ -101 24 -103 13 18 -269 -217 -90 -32 -11 -170 73 -135 -107 121 -145 130 41 184 -72 176 -220 -161 246
4611B46n37K11J76k12L97k92j2O1j46K70l5j21Pm4p5N4J82j16L2j62Q6j05o2K22
$$ 246 -291 -80 96 -116 281 -11 -23 38 -108 162 127 6 13 -31 -106 -52 130 14 46 -116 -30 -135 -197 25
4635B5J14k18J32J35k41n6J94j33jJ15j01j56M20l05K71l43Q7j03J45J6m1R9q5
$$ 25 139 -79 53 188 -53 -109 85 -48 -49 66 -35 -191 229 -76 195 -148 -61 -164 -19 -3 -44 55 -30
4658c0K12l75J60j21L09j08j81Q2oK12k96L8j15K94m1k20K30J66k5l07J44Q3J56
$$ -30 182 -193 -33 -154 155 47 -134 -52 -58 154 -142 -104 -219 75 34 -186 44 210 185 -122 22 105 261
4681B61l43P2l22L92R8k42J76o6q0N1K75m29K2L62m72L1K00r7Q3L1J17n2r2K79
$$ 261 -82 -10 -332 60 158 -84 92 26 -54 -3 272 -157 -135 227 -245 -214 -14 -111 -28 3 120 68 -24 255
4705B55k54k45L55o9n5j39N0N56m84J79j72J9j00J99k84n6J11j07K58j69P0j00
$$ 255 1 -244 111 42 -13 -152 -102 454 -30 149 -23 -4 -104 95 -189 -245 -134 -241 17 -152 -82 -182
4727a82O1K90r3J34k70j56L8nJ49K33l55K92j18k23P6r5K49j48K47j49j44LP5
$$ -182 -121 169 76 210 -60 -216 -178 -183 -34 199 -156 136 18 -205 -129 -224 25 -123 124 -25 -169 -166 -91
4750i1J52L5q3K2k3J01J1j01j21l9k0j0K93j47Jj91L72k09J47k19J06j41L1M7
$$ -91 61 96 13 35 12 113 124 23 -98 -137 -157 -167 126 -21 -20 -211 161 -48 99 -120 -14 -155 -124 -77
4774g7O2K02k73L33k41Q5j25J22j32J19M1j10n4j53j7K42k95K50K19k71o3KJ69
$$ -77 -15 187 -86 247 6 91 -34 88 -44 75 116 6 -48 -201 -218 24 -271 -21 198 -73 -136 -134 35
4797C5J29j70P8j35J26J28m22J43J48R9k29K61j39j32J02k83K19j65K70R9k71
$$ 35 164 -6 72 -63 63 191 -231 -88 60 159 -70 191 52 -80 22 -261 -42 -207 63 162 -109
4818a09j83L15n9J23k8r0o9Q1J92k11j59J84l5L5k24L94J17m44J76J4R3K8lJ52
$$ -109 -292 23 -36 87 59 -31 -100 -19 173 -38 -197 -13 -48 -13 -237 157 274 -170 6 20 113 141 138 290
4842B90m17J81M0l03J81o9J79j12j48J05L13r6k7M5l50J35J37J81l17J70l68L18
$$ 290 -127 54 94 -209 -28 -97 82 -30 -178 -73 240 144 117 162 -188 -53 84 265 -52 118 -250 68
4864F8j35K93j26n2M4k54J14o3N8J25j06N1J02k31K01poj35N3l4L4k51K37Kl1
$$ 68 -67 226 100 48 92 -162 -48 -111 -53 72 -34 17 119 -112 89 82 76 -59 -6 -40 -6 -257 -20 -18 -49
4889d9O2r3J40k3N8k53K92n7m9R4k05q4J22O9M6M2j32J54l50J19J72J43o7k42
$$ -49 13 -80 60 37 95 -158 134 77 28 122 -83 -167 -45 24 70 112 -20 134 -216 -97 75 218 151 -91
4913i1R3J9l83J92P6j43M74l85L00j42O3k57mK59J08m9j08r0R9Q8k25O8k8J5N0
$$ -91 2 21 -362 -170 -94 -237 237 -148 152 10 73 -184 -188 71 179 130 22 -68 31 119 -106 -38 -66 -51 -1
4938aN7j89J72r8j07p9M82l36J04R1j93J47mM6K8j91K98k54r0K14j13M7q7MO0
$$ -1 56 -133 39 -59 -166 -245 237 -99 5 96 -97 50 46 92 120 -71 227 -27 -117 97 -16 31 -56 -52 8
4963Hl0J46k7o1N6r8J26j53N7j47l4J01J4J95k11J29l01J85M9J97k07j05K86k55
$$ 8 -22 124 97 36 92 -6 120 -33 24 -123 -157 -56 -42 153 -58 71 -230 -45 4 201 -6 -111 175 -80
4987h0J75j81%n5J98k2q0J75k21j01J45m7J17kj07J11MQ5j83Q1j19J5K71l04Q1
$$ -80 95 -86 -86 -141 57 35 -45 130 -91 -192 -47 -94 23 21 -86 25 29 114 -69 12 -107 -92 179 -125 -44
5012d4J10m9nk83L77l56L10k93J27J1J50L3r1k09J08L26k80o5J92r4j03O7q6K58
$$ -44 66 17 12 -271 106 -250 60 -233 -106 -95 55 88 -3 -212 -104 222 -58 -123 69 -25 -128 -61 -147 111
5036A11k48J79J66m44K57r6J87l1k23J68j30K43j04j65M12l63J74p6O2m7J2k32
$$ 111 -137 42 208 -236 21 -75 112 81 -142 26 -104 139 35 -130 282 -81 93 17 79 32 44 -188
5058a88K07qk11L63j66m1J50r1L3N6j20K7j01J07p7J26j08L86n93N20l36qn4K97
$$ -188 19 11 -200 163 -3 -44 106 15 48 104 -16 11 -90 17 -60 66 -42 344 -249 271 -65 -73 -127 170
5082A70k33K56l92K03Q5m1J20j26J38j39J6Mj5j21N5j30mJ05J13K46l57n2K05
$$ 170 -63 193 -199 4 89 48 168 42 180 41 57 61 46 -75 -20 -150 -154 -49 64 310 -47 -99 106
5105A06j33J97j11J1p3k2K11k04L1J12L1k25K31k17p2K90k23K9J38l23L38j49
$$ 106 -27 170 59 70 -3 -25 186 -18 13 125 156 -69 162 -55 -127 163 -60 -31 107 -216 122 -27
5127b7K01l03k6J02j13K69J60k14k84N57m19J86k89L34k93N7L22j31j91K54j33
$$ -27 174 -129 -155 -53 -166 103 263 49 -235 322 -97 89 -200 134 -159 -102 220 89 -102 152 19
5148A9j17m3J38k91M00k75m0L30r9n9j31J3J94r3J21k29L3J26r4k64M99q7n6J48
$$ 19 -98 -141 -3 -294 106 -169 -209 121 22 -37 -168 -155 39 -54 67 -162 -129 -3 -97 -361 138 51 -5 143
5172A43l33L25pJ69m24L83k69k04J23j54L63j11K5k34K38J83k68M9n8j9L5J34
$$ 143 -190 135 128 297 -127 256 -13 -217 -94 -248 115 4 29 -205 33 216 -52 -3 -61 -80 -45 89
5194H9m0j8j38K9P6J76n6k13K87O7l7k14J29k75L35j33o9l8K75j82k13L00j17
$$ 89 49 31 -107 -78 -2 174 118 -95 192 259 222 8 137 -138 197 64 -5 -43 232 50 -163 137 20
5217B0Rk42M07k87n3J92pj49k99L77Q3rQ2l7j05P7n4R0o9O7j73k6J97K3P7j76
$$ 20 29 -213 194 -93 -146 46 39 -110 -409 -32 51 42 124 87 -18 59 5 95 26 93 -80 -106 91 114 191 15
5243A5l3m0N7K6J30l37K72p7k27l5L59P2J17l57J53l1n8j54nM4P3l6Q1m0J89n0
$$ 15 -18 -58 -1 25 155 -182 90 13 -214 -249 110 182 299 -58 95 64 6 -148 -153 -109 -36 -72 9 -31 158 108
5269A08j81J03Q5J69l38Q2j42j05L57L2j93P8l26R7M2p1O0M07l88k4Q3L74l44
$$ 108 -73 30 115 284 -54 28 -114 -219 138 170 -23 55 -271 -174 -132 -203 -143 264 -124 -148 -65 309 -35
5292c5PK20k20n2L55k79q4J87k46K06rj00O8K89j72L1k5l07RJ27k7N0L7k06K72
$$ -35 -28 192 -28 -80 275 -4 -88 99 -147 59 50 -50 18 307 135 166 141 -166 -157 -30 -57 -7 30 -176 96
5317I6K8q9J00k1j6k08L9K11m0k70j6J89m9K22j16Lm9p7M6k81L56k7j62K92j92
$$ 96 124 35 135 114 98 -110 -71 140 100 -170 -186 3 -46 176 60 63 14 -63 -17 -298 58 31 -131 161 -31
5342c1N6j95K24Q5r8J25j69M1o0M0J24j71rj37Q9K11j05j84Q2J86N7j03j82J17
$$ -31 25 -170 54 139 41 166 -3 38 -22 18 142 -29 -38 -175 -86 125 20 -164 -82 104 161 58 -124 -7
5366gj62J62J50k54k02K83j14J29j09K57j71K5k7J8j42L16k09k35J79l9L07j56
$$ -7 -169 -7 143 -111 -313 -30 -144 -15 -124 133 -38 -13 -40 -22 -164 152 -57 -292 -113 -152 155 -1
5388aJ47p7L0j67m4R3O8l48M36j56j44K29j58M8J0j21L1j7L88n33J75J30K04j36
$$ -1 146 69 99 -68 -112 -19 49 -299 137 -19 -163 66 -92 -44 -34 -155 -124 -141 247 -286 -111 19 223 87
5412H7r8j13O5L52m41K63j33J34J60l75L5J03q8R6l4J40k73N9LJ25K62l60l16
$$ 87 -11 -124 -59 293 -148 115 -18 116 276 -99 -64 39 -49 47 13 153 -120 -61 -58 67 329 -31 -347
5435c47L04J07Nj25J81l7j96O9K48k33K3M6j59M46j97k99R9J28J04J4j8n6l01
$$ -347 -43 64 69 -56 125 88 -108 -39 209 -24 -1 45 -114 332 135 -164 -65 63 167 181 163 107 -194
5458a94Q2J03j72M9L8J11o5M5k29L49j32j90J77J15j62j3J2k02p2J09K76j09j97
$$ -194 -112 -9 -181 -132 -94 17 -48 -3 -232 117 -15 -205 -28 87 -75 -88 -76 -278 -350 -241 35 -74 -271
5481b71K52j02K79k18R5k1j67R7N2J94j13Q0l40J91j84L54l11K41k42N1m1J00
$$ -271 -19 -121 158 -60 35 14 -153 -56 -4 190 77 157 -183 8 -176 178 -133 108 -134 -83 -124 -24
5503b4o0J57o1j35o7J81j01K52J35m08n9L3J83K04L9l31K56k41j02M02j93K0L4
$$ -24 -84 73 12 -123 -190 -9 -110 142 277 -131 -190 -157 26 230 269 -62 194 -47 -149 253 60 80 114
5526A14M2j79k2n3K96p0k03p1K22M5n4j93K3K41k40J85l31N9M17l07L9o3J94j52
$$ 114 156 -23 -45 -98 198 128 -75 -146 76 121 67 -126 -103 138 -102 83 -248 -189 228 -79 -40 -103 91 -61
5550f1m3K51j55J93j1p4r8p6K7jqJ07Q7k64o6L09j24L2lj11J58l2k6nn9l1J20
$$ -61 -104 147 -8 185 174 100 2 -74 -47 -48 -56 51 138 -126 -192 117 -7 25 22 -89 69 37 11 6 -53 -84 36
5577C6L1j63Q9lo1R4L3O0j2k21J70l4J6j17K00k09J73j77J8p6J26q0L7P1mr1K53
$$ 36 67 -96 -7 -10 -71 23 56 116 104 -117 53 19 35 -82 118 -91 82 -95 -77 -153 -27 -107 -70 1 -3 -94 159
5604A59k34L4J08k5L2j58k9K05j08J71k11OK00l26K4J73L2q5P5l09J91j55j3L6
$$ 159 -75 -41 67 42 74 -84 -113 92 -16 155 -56 -50 150 -176 -152 21 53 -32 43 -266 -75 -230 -243 -207
5628b07K44j5j09k7P9K74k89R1%Q8j16j14N7K99k21R3r2J70k12n9O9m1R4p8J20
$$ -207 37 22 -87 -114 -35 239 -50 41 41 129 13 -101 -44 255 34 127 35 205 -7 -66 3 -38 56 -22 98
5653I8k2j12j8L7J04N2k71L67k71J1J5q0K4J87j50O8n6k5j66J96m9P4j1r1Q4j35
$$ 98 76 -36 -54 -17 87 139 -132 235 -36 -25 -10 -90 -66 121 -29 39 -17 -42 -208 -12 -61 13 2 -89 -5 -140
5679a40K06J38k75O9J56j88Q4j44pJ36j26nJ02p0J57j89K77l53R4k26J03M9L11
$$ -140 66 204 -71 -2 154 -34 50 -94 -101 35 -91 -96 6 -64 93 -96 181 -172 -78 -304 -201 -152 159
5702A59l06K03J31Jl45m3M00k8j22k50M37j24j18J10J5j58j9p5K57Q6m21K00M3
$$ 159 -147 56 187 188 -157 -200 200 172 50 -200 237 113 -5 105 120 -38 -57 -132 125 211 -210 -10 33
5725C3j48J33N4n27L08j22K78L25k81N2j76J21K54k66j94L86k03j28k12K87M15
$$ 33 -115 18 72 -455 -147 -269 9 334 53 105 -71 50 304 38 -156 230 27 -101 -313 -26 389
5746C89l65J04L6q4k38j9Q8M0P9k7m6j4n8J69k45J56L3j73K64j1p2j75K79k73
$$ 389 24 128 164 80 -158 -177 -89 -49 30 3 -43 -57 -115 54 -191 -35 -2 -175 89 78 6 -169 110 -163
5770a63P3J88k01j11K29j16J21n8J11k23J39q6j01M18p9Qk44J63k35J04L24j05
$$ -163 -90 98 -103 -214 15 -101 20 -38 73 -150 -11 -97 -198 220 141 149 -95 68 -167 -63 261 156
5792A56j70o1R4M7q8R7j3m5k12K35m9m0j73J74J27j2lK8k63J0J23K5k52J30K57
$$ 156 -14 -75 19 66 -22 75 62 17 -195 40 -9 -49 -222 -48 79 67 64 92 -171 -161 -38 -13 -265 -135 122
5817A22L9j48MlQ9J46l13QQj17K67o7j31J68K3k04Q1j86N09l25O%k63M58k91J21
$$ 122 161 13 17 14 103 249 -64 -56 -48 -165 102 35 -96 72 95 -109 -28 -214 295 -30 -24 -24 -287 171 -120 1
5843AL8J84j17n4k9o7J43ol6j39J91r1j42J15J66j40k71K99m45J72K23j43K65
$$ 1 39 223 106 52 23 -44 99 93 57 -82 109 18 -124 -9 157 17 -254 45 -400 -228 -5 -148 117
5866A17j50q2j28Q2J2J30l95M12R8j26K34l63M5J75j77P3m0o2mK10j7n2Rm0p1
$$ 117 -33 -115 -243 -161 -149 -19 -414 -2 96 -30 204 -159 -114 61 -116 -43 -83 -145 -149 61 44 -8 1 -39 -110
5891a10R2j63k6J40K43j5o9m4l7J05j64J05J76j88J29k00j04oK97r6j34J40o6
$$ -110 -18 -181 -207 -67 176 161 92 48 11 116 -48 57 233 45 174 -26 -130 -136 161 65 -69 71 5
5914EK01q0k7r0M2o3J57j35P4l65N23j07k78K2J68o2R1j02m8K04q1O1R0o8L4q0
$$ 5 206 126 99 9 51 -12 145 10 84 -281 242 135 -143 -121 47 -15 76 -26 -74 130 49 110 200 132 166 86
5940H6l13N03j72j43M2N0K15j81J01j66j91J24j80K85k93K82k64LK56l76K73N2
$$ 86 -227 276 104 -39 3 53 268 87 188 22 -169 -45 -225 60 -233 49 -215 -212 44 -332 -59 -7
5962gJ11j57R7k74K41j38K19j27l5Q0N7J84j60l56L39P7j2j87L9j16J33k05j49
$$ -7 104 -53 44 -230 11 -127 92 -35 -70 10 67 251 91 -265 74 151 139 -48 -9 -125 8 -197 -346
5985c46N86l41J3o2K04k1R6K4j40k01M12k36J3M8k12J81j30L73j93j8k6Q0j3n8
$$ -346 240 -101 -88 -150 54 33 129 153 13 -188 224 -12 1 49 -163 18 -112 261 68 50 24 104 91 33
6009C3l2j63J65J8j16J59j28k13L58r0p5qm5r6M39m06N7J72j58O2QM2q3L76j55
$$ 33 1 -162 3 21 -95 64 -64 -277 81 -9 -84 -92 -137 -233 206 -200 -143 29 -129 -67 -59 -17 -100 276 121
6034A21jk80%K47k66K41m5O8k91R8P1J78l59K11M29n11K26j70pK43r9k26K9K4
$$ 121 120 -160 -160 87 -179 62 17 85 -206 -108 -37 141 -218 -7 422 -89 137 -33 -40 203 104 -122 -93 -69
6058f9Q2m3J19l1L6n8Q3k52L41m7j01j71M02k94k5r4J13P5l7k47l7L35j20K64
$$ -69 13 -30 89 58 94 36 119 -133 208 161 60 -111 291 -3 -28 -122 -9 66 29 -218 -255 80 -40 224
6082B24J60l38k83K35N2k14Q1j07K01N6j15M3j12J16o7qO4l02M01k82j02K22o5
$$ 224 384 46 -237 -2 50 -164 -83 -190 11 67 -48 -5 -117 -1 -68 -76 -12 -314 87 -195 -297 -75 -140
6105a40M5J17K06j48o8L1j10K7N2J00L4j59o2J79J36m44L19P1k85J36L7l6k1j18
$$ -140 -95 22 228 80 12 43 -67 -40 12 112 146 -13 -75 104 240 -204 115 186 -99 37 74 38 17 -101
6129a01m9R2k7J51j26j17k2O4N08Opp37L10j92k4K69l12k32N38M57m82j23J53
$$ -101 -150 -58 -85 66 -60 -177 -199 -135 373 379 372 -365 -55 -247 -271 -2 -314 -546 -8 449 -33 -156 -3
6152cK78j57j92Qp2K23k19J45o9J23m5N8J34k38r4j7P1N8lj67K46k49J71K46j71
$$ -3 275 118 -74 -66 -138 85 -134 11 -58 65 20 78 212 -26 -120 -137 -66 -8 -11 -178 68 -181 -10 236 65
6177F5l3o9J66k69J58J41k12o1K54j52L1J0J44j39N4k2q4N2j52J71K8r7j54J97
$$ 65 32 -37 129 -140 18 159 -53 -114 140 -12 19 29 173 34 88 66 -18 34 -118 53 81 -16 -170 27
6201B7j15r2J50k94J98J10J65r3J24k05N7k92M15Ql03K24j7j38o9J82p4J72j40
$$ 27 -88 -180 -30 -324 -126 -16 149 56 180 -25 32 -260 155 163 -140 84 67 -71 -140 42 -32 140 0
6224@j03O9K84l65Q1L5O5k82K40K06q0m3q8R6j02r9JJ50M3m6j85L12k65Q0Pk59
$$ 0 -103 -34 250 -115 -34 1 66 -216 24 230 150 107 19 115 13 -86 -85 65 108 62 -123 189 -76 4 11 -248
6250b48J78qR5K0r5J8n6j06K26J58k84L9lP8m1M9Mp0j23L5L95k21o3R2J73k97
$$ -248 -70 -78 17 37 -58 -40 -96 -202 24 182 -102 -63 -66 12 -29 20 24 -46 -169 -134 261 40 -23 69 242 -55
6276e5M3K4j09N6q5K1K17k32J06k73L31L1n3M0k36K33J3o9mk1R0J0n5R4j52q0
$$ -55 -12 12 -97 -41 -126 -105 112 -120 -14 -287 44 75 22 62 -174 59 72 3 -1 -22 68 78 23 117 -35 -115
6302a15J61j67o3R5J55j45J07j01J42kL0k08J80l36K22O6KL9K4O6l73K42MqL0
$$ -115 46 -121 -184 -89 66 -79 28 -73 69 67 97 -111 69 -267 -45 21 23 62 86 152 -221 21 25 17 47
6327D7j25J58JRJ19j33J28K4k31P0q4R4N7k25L8J94j59j59J52l9J31j88L4k01
$$ 47 -78 80 81 90 209 76 204 228 -3 67 -17 77 134 -91 -53 141 -18 -177 -25 -64 67 -121 -87 -288
6351b88J90n4K44j93K07M6N0k73N8J30K4j77o7N5R1J4nn6J46P5k00l7Q2L7oj89
$$ -288 -98 -152 92 -101 106 152 202 -71 -13 117 141 -36 -103 -48 43 57 52 -4 142 217 17 -20 62 99 93 -96
6377i6R4j55K11J35l44J46J39j86m2L8L5l1K19q5Jp1j08Q6Pm9k02K26m4J94l90
$$ -96 -2 -157 54 189 -155 -9 130 -56 -98 -60 -25 -56 163 78 79 8 -100 -14 -7 -56 -258 -32 -76 118 -272
6402b72L55k81k0J57K58j93M0k3k56L08k34K1K35o2j84O9O2J33j4j00J99j93K1
$$ -272 83 -198 -218 -61 197 4 44 21 -235 73 -161 -140 95 33 -151 -82 -20 113 99 -1 198 5 26
6425B6n6j04Q9J01R7l48J98O3P7q9J35k28J6k14K37J16k20J33j73J47n4j1J06
$$ 26 -30 -134 -45 56 153 -195 3 66 143 54 189 -39 -23 -237 0 116 -104 29 -144 3 -51 -62 44
6448D4j58M16l70K80l24L10j91j13P8l2J66k5k19J76r7m1M64l09j03k7orJ57j3
$$ 44 -114 302 -68 212 -112 198 7 -106 -28 -60 106 81 -138 38 -59 -100 364 55 -48 -75 -81 -90 67 54
6472E4m4J93j66j2r2O6j11R2J29r2J42k58L5O4J00j49K52j46M5j66P4j2J18o4
$$ 54 10 203 37 25 -67 -1 -112 -20 109 17 159 -99 -64 0 100 -49 203 57 102 -64 10 -2 116 52
6496E2L4J2n3M7o2Kr6Q9j36L59j25%k31K12J40k85JJ12M6j22j08N6OQ8o7k2J85
$$ 52 86 98 45 92 30 32 -64 25 -111 248 123 123 -108 104 244 -41 -40 72 118 -4 -112 -56 -50 38 -29 -51 134
6523A34j95j9J31l1o0N3r5J96k6l6m4N3k47L26k33o6K24k14J59j6LJ14k78L5J15
$$ 134 -61 -80 51 20 -40 13 -82 114 88 52 8 61 -186 140 -93 -159 65 -149 10 -6 -3 111 -167 -132 -17
6548a7O1L4k10K68m37L78j30J00l09O1K49k82L33l1J5J08k61K22l28J31j15K41
$$ -17 44 78 -132 136 -301 77 -53 47 -262 -201 48 -234 99 68 83 191 -70 152 -176 -45 -160 81
6570H1K9r7pQ8k24K58J22m26Q2J66j95q2L89k6j25n6j1J38k2N8J35p0j62K35m7
$$ 81 110 13 6 94 -130 128 250 -176 -94 72 -123 -205 184 158 33 -23 -34 104 82 140 275 205 43 278 231
6595B31k07m4J77q2k6O0m2j58NK18l86J78K3J14j0o4m7J09lj70J76orj23J99R
$$ 231 24 -20 157 75 49 109 67 -91 -86 132 -254 -76 -53 61 51 -13 -60 49 46 -124 52 46 37 -86 113 122
6621A22k58N2N5K04l11K99j00M0m5j42j92K97k44K65j8o8J80Q2l28j72K75j60
$$ 122 -136 -84 -29 175 -136 163 63 103 58 -84 -276 21 -223 42 24 -44 136 218 -110 -282 -7 -167
6643a67K13j62j40J17K53j54o9J75j30J12o2K46r3m28L55j15j00l7L63k84L91
$$ -167 46 -116 -256 -139 114 -40 -109 66 -64 48 -14 232 139 -289 66 -49 -149 -186 177 -107 284
6664B84j97j9P6j88N3k02N4J30j1J14q1J70M7k62Ok19L44n9j44N8k7KO0J37j67
$$ 284 87 68 144 -44 9 -193 -139 -9 -20 94 13 183 230 -32 -26 -245 99 40 -104 -46 -73 -71 -11 126 -41
6689d1r7j26L95j32J52L3R9k63p5J07j75n6M8J07q7k2pK42j60j51k3R5K39j92
$$ -41 -138 -264 131 -1 151 184 283 20 -55 52 -123 -179 -131 -24 -111 -133 -140 102 -58 -209 -232 -137 102 -90
6713i0K00r8M8j56R0j92R2j00J76r4M6j15J61K87r4K5k76R1J73m05J31J3k4P8
$$ -90 110 12 60 -96 -6 -198 -106 -206 -30 -124 -78 -193 -32 255 161 186 -90 1 174 -231 -100 -87 -111 -33
6737c3j3j4N3o2Q3j78J15J78r8J06ok41R1J4k49L69k44K74j11k3M0j2K01m47K68
$$ -33 -46 -60 -7 -69 14 -164 -49 129 31 137 131 -110 -19 -5 -254 115 -129 145 34 11 51 39 240 -207 61
6762F1j9k82l6J56K58l57K21O8k88J60J74q6J71k12l5K08j31k29J81J92m29L52
$$ 61 42 -240 -276 -120 138 -219 2 70 -218 -58 116 30 201 -11 -46 162 31 -198 -17 175 -254 98
6784I8m14M25l15J67k9J8J09M6l57K88L0l4k9N1k75J66O4J52j81kl1J72J59l53
$$ 98 -316 109 -206 -39 -68 -50 59 105 -252 36 66 32 3 54 -221 -55 9 161 -20 -22 -53 119 278 -75
6808g5K16k34L09l99K06j75J31O1R6Kj50r2j42K02r0K08K65k77J6j22P6J4M5O
$$ -75 141 -93 216 -183 23 -152 -21 40 136 138 -12 -104 -246 -44 -134 74 339 62 78 -44 32 46 91 97
6832I7k53r5L70j65J71l6k11J24k1O0r6K05p5j65J79Q4j81j48P7J40j1J29k64
$$ 97 -156 -251 119 -46 125 89 -122 2 -19 41 -55 150 75 -90 89 173 -8 -156 -79 61 50 179 -85
6855h5M4J42oj00l2J46J5l09J37m6P1k28K74o4j03K62L9o7L8l8R7l02K04j73R4
$$ -85 -41 101 95 -5 -37 109 124 -185 -48 -94 -23 -251 23 -41 -144 118 157 90 128 90 187 -115 89 -84 10
6880A0L2k85L33J16j60k55K38j85Q6K04j26J36m9P4j89l75L54P0N8k89M6J43j2
$$ 10 42 -243 90 206 46 -209 29 -156 -70 134 8 144 95 169 -20 -395 -41 29 87 -202 -156 -13 -25
6903b5k1j35K30ko1r5O4o2j41K10Nk8q2K19k57K45j12N4J5k37L78j35L35l08o8
$$ -25 -46 -181 49 47 -14 -109 -45 -107 -248 -38 -33 -61 -143 76 -181 64 -48 6 21 -216 162 27 362 54 -14
6928a4J50r0K15r5Jk16J96O9j20k9o6r2K3J02J19J6j84M6m4r7K90j28J22p0o5
$$ -14 136 46 261 166 167 -49 147 216 96 67 1 -91 -68 34 153 169 -15 31 -13 -110 180 52 174 104 39
6953C9r4J99k56J63n6l7k0K55k72L11k39j07K00L0ll5J9r1j04kK23j58R7J07J31
$$ 39 -55 144 -112 51 -5 -42 -62 193 -79 232 -7 -114 86 116 113 78 97 6 -98 -100 123 -35 62 169 300
6978C00n9k40j8j73R0K2J47j42K5lL07l79J70n8j33L2r7N3J47J59k50K1P7O4l62
$$ 300 241 1 -17 -190 -100 -78 69 -73 -48 -51 256 -123 47 -11 -144 -112 -209 -156 -9 150 -100 -79 -2 62 -300
7003c00K84K68l06l2J75N7k92R5n2N8L47r9l18m6K93l14K95j90k72M63j89J4N6
$$ -300 -16 252 -54 -86 89 146 -146 -51 -103 -45 302 203 -115 -161 132 -182 113 -77 -349 114 -75 -61 -5
7026en5J19k91K56K6k23J80j25K67q2j10L10l14Q6o5N4J36j51j63J79K77n10J80
$$ -5 -60 59 -232 24 50 -173 7 -118 149 67 -43 267 -47 39 -26 28 164 13 -150 29 306 -204 -24
7049b4l9J26j26Q7j62K26L6j38J06k66K12m4r5N7L8j06K00l00L32K3j75K65k29
$$ -24 -63 63 -63 24 -138 88 124 -14 92 -174 38 -6 -101 -44 -6 -112 88 -212 120 143 -32 233 4
7072Dk82O6J88p7K40j12j65K18ok1j09Q9M9j58OJ50j85K28r5R1l9JJ4J90m24J43
$$ 4 -278 -212 -24 -101 139 27 -138 80 74 53 -56 33 82 -76 -70 80 -105 123 28 119 80 81 95 285 -139 4
7098Dj96K48O9n61M02J03k8K4j5j91L44l51M4OK0m0K35j54O3L7j2k2R6m7R9j94
$$ 4 -192 56 125 -436 -34 69 41 65 50 -141 203 -148 -104 -98 -78 -118 117 -37 26 63 51 29 125 78 177 -17
7124a7j45L1L9K18k2R3k31J7Q8j47mp5L05J72n87K77J61r4j75n0J04p4R3K48l40
$$ -17 -162 -131 -92 126 104 197 -34 -17 71 -76 -80 -155 150 322 -265 12 173 79 -96 -146 -42 -116 -23 225 -115
7149a15j57L54q6j03J55k23R2J07k38J83L5j3j31Q8K07j83J42k2j89J07K68m17
$$ -115 -272 82 -4 -107 48 -175 -83 24 -214 -31 4 -9 -140 -52 155 -28 114 92 -97 10 278 -139
7171a39M71j97k5m48J39L51o4P1j18l6j0n1m0K00k17J04J4n2n4j35M78m16j03
$$ -139 332 135 110 -338 -199 152 88 159 41 5 -5 -56 -96 104 -113 -9 5 -47 -101 -236 242 -174 -277
7194b77O38k07j80J42j40j32J86j00p4K23l30K74J2M9Q6M1j77l4M5r1k10K72L
$$ -277 361 154 -26 116 -24 -156 30 -70 -144 79 -251 23 35 84 170 211 34 0 45 -46 -256 16 19
7217A9Kk35O19m73Q3r1L61l93J41K6j44O3O5N3Q8j29j07M6m9m2p4NN0K19j6m6
$$ 19 21 -214 405 -68 15 -76 285 -108 33 59 -85 -22 43 96 184 55 -52 -6 -55 -97 -171 -166 -116 103 87 41
7243D1J05p8K57k71Qk15R4K3l4K07q4L0o5l08p5J74%J07J50M1p3K91l62J92j31
$$ 41 146 68 325 54 62 -153 -59 -36 -70 137 53 83 18 -290 -365 -191 -191 -84 66 107 34 325 -37 155 24
7268B4r9L01r5r7J14n9pl59J80K10J51l65l9M9K84j58m5L14l09n5j07J2L24lj38
$$ 24 -75 226 131 34 148 89 82 -277 -97 113 264 -101 -140 -91 193 35 -10 304 -5 -60 -167 -155 169 166 28
7293B8J4m9O7M9L8j65qj10L9J6Q4j12K83k53M86k76m47M36n35M03p6J75q9J60
$$ 28 42 -7 60 109 147 -18 -26 -136 -97 -81 3 -109 174 -79 407 131 -316 120 -415 -12 -88 87 -2 158
7317A58j94q6M1L66N1o84O15p2m06O65l26l97L58m02N25o14M04J07m69K05J28
$$ 158 -36 -122 -81 285 336 -348 267 195 -211 454 128 -269 89 -313 212 -402 2 109 -360 -155 -27
7338b7J22j57%M7p5K95m91J88M28m34N4j34l6J92rL60l59OJ04n4N7J70k41K8k09
$$ -27 95 -62 -62 -15 -90 205 -286 -98 330 -104 -50 -184 -220 -28 -37 323 -36 -30 74 20 77 247 6 34 -175
7363a75RP8J28J37l82J27k9O8KO6m2j92j55K43n2K16k16R1J98k64j44J86Q0K33
$$ -175 -166 -88 40 177 -205 -78 -107 -39 -37 29 -13 -205 -360 -117 -169 47 -169 -78 120 -144 -288 -102 -22 211
7387B11k14j29J91l1N5N6k54K4J50m5N5j53j16K51Q8o1j82O1m5j85K69j00K98
$$ 211 -3 -132 59 28 83 139 -115 -91 59 14 69 -84 -200 51 139 78 -104 -43 -88 -273 -4 -104 194
7410A94j51q4j6J9M5p0J0K5mJ14j44l22J29J94n2K2N6n5K30j13M20k31l36O0J01
$$ 194 43 -41 -57 -38 7 -63 -53 -28 -32 82 -62 -384 -255 -61 -113 -91 -35 -90 140 27 447 216 -120 -60 41
7435D1m2p1Q0m7J94l32N0J28Rk28K18j95J19p4K3L13k70Q8J4r2J50k47j12L28
$$ 41 -1 -72 8 -39 155 -177 -127 1 10 -218 0 -195 -76 -150 -127 186 -84 4 18 -74 76 -171 -283 45
7459D5o7q8p7J94NN7j27kk1J78L5k64J10J26J61k36p6pq3J2Q1J23nok19J02o6
$$ 45 -22 -110 -187 7 12 69 -58 -60 -81 97 132 -132 -22 104 265 29 -47 -54 -137 -125 -44 79 74 68 -151 -49 -115
7486a15K70k40L32j57j1r8K9NJ11k20J16j96K22L0P1o9k49J99J8r8j34J04J38
$$ -115 155 -85 247 90 79 -19 10 15 126 -94 22 -174 48 78 149 80 -169 30 48 -50 -184 -80 58
7509E8J7r2P6j09K6m6K30N1k85L8oL1Q6j61K40j08O9J12m37K13k26J41J33j95
$$ 58 75 -17 59 -50 -24 -70 160 211 -74 -36 -42 -11 75 -86 154 46 115 227 -210 3 -223 -82 51 -144
7533a44L53k51M6k06K60J8j38L0P3k4Q9j88J9J74k44K47k03j76K49j97M19j90
$$ -144 209 -42 4 -202 58 76 -62 -32 41 17 106 -82 -63 111 -133 114 -89 -265 -16 -213 206 16
7555A6K52k65P2P3j47r0K75L4l27L8o2R9k5Q7rj14r6K8J05O3Rk59J56P4J90m25
$$ 16 268 3 75 148 1 -89 186 220 -107 -69 -131 -32 -57 30 21 -93 -189 -161 -56 7 16 -243 -87 -13 177 -248
7581b48J17K11Mp6N7j89L71j08k53l7J56p1qj28J89k0J13j6Kk87L01l56L23oj1
$$ -248 -131 80 84 8 65 -124 247 139 -114 -151 5 -66 -74 -202 -13 -33 80 64 66 -221 80 -276 47 41 30
7606C0P7k41K28j24j77L93j98J86p9j06J08k47RQ5p6K04Kj14J69k40q8j55L35
$$ 30 107 -134 94 -30 -207 186 -12 174 95 -11 97 -150 -141 -56 -132 72 74 -40 129 -111 -199 -354 -19
7629a9M3j30o8J1K30J3j53N0K17k89J19on1m3n5J27m5m01M71j75m2K47k29j47
$$ -19 24 -106 -174 -163 67 80 -73 -23 194 -95 24 18 -33 -76 -131 -4 -49 -450 21 -154 -196 51 -178 -325
7653c25q9N06J60m06J10k3p2k4J06m9R3O8K2j55k5j95J54L9kl5L11l22J48j8K6
$$ -325 -414 92 252 -154 -44 -67 -139 -163 -57 -106 -13 55 77 -78 -103 -298 -144 -105 -107 -142 169 -153 -5 -23 3
7678Co4K9P9MO5j22J1J8l1O7r9n5J77r3n0O0Q0j53K96l52J69R6l94K70j55%R6
$$ 3 -61 -32 47 51 116 -6 5 23 -8 59 -40 -95 82 -11 -61 -1 79 -74 222 -130 39 135 -259 11 -144 -144 -48
7705d8M1J98j27%K6k16J95p1O6R0j22j8L6j13k5K69j20j96J76k36J18N5Q1j93
$$ -48 -7 191 64 64 90 -126 69 -2 64 154 32 14 50 -63 -88 181 61 -135 41 -195 -77 -22 59 -134
7729a34J59lj7PJ42o9P0k04J5R5m1l30L72j71q8J0M4N9p5J70O7j84K72j85J5j00
$$ -134 25 22 5 12 154 85 155 -49 -34 61 20 -310 62 -109 -197 -187 -143 -84 -159 11 78 -106 166 -19 -4 -104
7755a04k7J20J19P8j21J4k8K0k26L01k63J05K8k6k06J08K51j41R4rq3J07N4j86
$$ -104 -131 -11 108 186 65 79 51 71 -155 146 -117 -12 16 -10 -216 -108 143 2 96 87 4 111 165 -21
7779b1l6k38K07J20J37j86j95n4K24n3L47k44j4J56k09r4K12N2j92J6j01J24r1
$$ -21 -57 -295 -88 32 169 -17 -212 -266 -42 -95 252 8 -6 150 -59 -153 59 111 -81 -65 -166 -42 -133
7802a33K17j76j01p2K70O3m9n7J01J90l05k0m9K33O5k64J13K58k62j49L71k18
$$ -133 84 -92 -193 -265 5 68 19 -38 63 253 -52 -72 -121 112 177 -87 26 284 22 -127 244 26
7824B6J17j89P7K3o8l5K10k05m6J0J65j02J29r2M4j93J09j24P8L1L1J65l51M58
$$ 26 143 -46 31 54 -14 -49 161 -44 -90 -80 85 -17 112 20 64 -129 -20 -144 -66 -35 -4 161 -190 268
7848B68l81J37r4J86K5J9l00R6j64K87nR6j40j11N1J03J30k74q1J65P8M8n0k11
$$ 268 -113 24 -70 116 141 160 -140 -44 -208 79 74 170 30 -81 -30 73 203 -71 -152 13 91 139 89 -122
7872a22K04jM7j31M4ml75K15K59J02j90j23J60oj37M0K05j51K8R8j64k04L78l35
$$ -122 82 81 128 -3 41 37 -338 -123 136 238 48 -75 85 79 -58 -18 187 36 64 162 -2 -206 172 -163
7896a63L06j32m0J89k80q7O7J91k10K54Rnj58j44R4J33o8J9J24j34J51r5k34L49
$$ -163 143 11 -29 160 -120 -207 -140 51 -159 95 104 99 -59 -203 -109 24 -44 -25 99 -35 116 21 -213 136
7920A36M4j76l1qj5o6m3Q4j19J72o6R4O5k88K24j67J74j47l0ON5J23P2K6j04j80
$$ 136 180 4 -27 -35 -50 -116 -159 -75 -194 -22 -88 6 71 -217 7 -160 14 -133 -163 -157 -102 21 93 119 15 -165
7946a65K07k03M27l30j22K83j79L9n4N9L05n03K14j39P4r8J81m1J92k12M2o6J05
$$ -165 42 -161 266 -64 -186 97 -82 -43 -97 -38 267 -236 -22 -161 -87 -185 -4 -45 147 -65 -23 -89 16
7969A6j34L8N3P4O5l6J2J52j27j38J33k31L43m10K58Q9j98j2K37n2l45q9M35k05
$$ 16 -118 -80 -27 47 112 76 88 240 113 -25 108 -123 220 -190 68 157 -41 -53 184 132 -213 -302 133 -72
7993g2J58k63J67j42j06M85k50p8J64j21K16j96J84k5nm1m6q4P0l9j53M42j45
$$ -72 86 -177 -10 -152 -258 227 -23 -101 63 -58 158 -38 146 121 116 75 29 -55 15 -24 -177 265 120
8016A20o8j75J46m9RKK23j27j73J20j3o5K08R5n75J88l0K28Q0j05R4j27PJ3j87
$$ 120 52 -123 23 -26 -17 -15 208 81 -92 28 15 -50 158 253 -322 -134 -164 64 144 39 133 6 13 26 -161
8041a61K17M5k29M69n74L08j96P9K39k24J4J3p5J34J7J33l28J21o0j23N6j37J96
$$ -161 56 101 -128 341 -233 75 -121 -42 197 -27 -13 0 -75 59 76 209 -119 2 -58 -181 -125 -262 -66
8064f6pQ4j03J37j66m1J69k3J35j3j50j02J68k52L72l76P5K78j30J25j47J34k11
$$ -66 -73 11 -92 45 -121 -162 7 -16 119 106 -44 -146 22 -230 142 -234 -159 119 -11 114 -33 101 -110
8087a10J24kKj25k67L32K28k66K5lj61J15O7j3O6l1N3j72K61J24l37J59p7J44
$$ -110 14 12 14 -111 -378 -46 182 -84 -59 -62 -223 -108 -41 -54 12 -19 34 -138 123 247 -90 69 -8 136
8111A36l15K69P2Q8l05j42K65j7J32l48J16k02pJ30J56j85L5Ro7M68k97nk0QJ64
$$ 136 -179 90 162 250 -55 -197 68 51 183 -165 -49 -251 -258 -128 28 -157 -122 -113 -180 288 -9 -14 -34 -26 138
8136A38k13l6K7J7J34j23J03j79P9J41k52L08l1n8j40J86o4r0k3Q7k22K73j0j08
$$ 138 -75 -111 -84 -67 67 -56 47 -132 -53 88 -164 144 113 55 -85 101 37 -53 -76 11 -211 62 52 -56
8160e6M2l3O9n9Q2P8j30K14l75L52n2p7P2Q0k86k01J32J28M3J55l57J80n0L1j96
$$ -56 -14 -47 22 -37 45 123 -7 207 -168 184 132 55 127 207 -79 -280 -148 -20 23 178 -179 1 -49 -18 -214
8185b14L98j22J29l02LK7
$$ -214 184 62 191 -111 -108 -81
8191h1
$$ Imaginary data points
##PAGE= N=2
##DATA TABLE= (X++(I..I)), XYDATA
0@%%%%%%%%%%%%%qJ6j6J6j6K4l2L6m4N2o0P2q8J02j17J35j53J75j99K26k58K91
$$ 0 0 0 0 0 0 0 0 0 0 0 0 0 0 -8 8 -8 8 -8 16 -16 20 -24 28 -32 40 -48 54 -63 72 -81 94 -105 121 -137 154
35A54l28L70m15M64n17N76o43P14p90Q73r66J068j178J299j429J572j733J912
$$ 154 -174 196 -219 245 -272 304 -339 375 -415 458 -508 560 -618 681 -748 824 -909 1003
53A003k108K327k574K850l167L537l966M474n091N857o834Q130r945J2688j7345
$$ 1003 -1105 1222 -1352 1498 -1669 1868 -2098 2376 -2715 3142 -3692 4438 -5507 7181 -10164
68a0164K7288q7597R9103P7219k18431R3918J02169j22877K796Q9250q2898K4084
$$ -10164 17124 -70473 28630 105849 -112582 -18664 83505 -39372 -36576 52674 -30224 -6140
80f140N1838q5779K6845Q2166j04029L012R9426p9619l1591J01656o0859m2359
$$ -6140 45698 -40081 -13236 68930 -35099 -32087 67339 -12280 -43871 57785 -3074 -45433
92d5433R4520m3460n7824R3034k8302o8197Q7709j1805q1003Q6200P911r9161
$$ -45433 49087 5627 -52197 40837 12535 -55662 32047 20242 -60761 25439 33350 -65811
104f5811P4149M4433j08397M0939P1963r0535O964P7538p0037r179P7822n8745
$$ -65811 8338 52771 -55626 -14687 57276 -33259 -26295 51243 -18794 -27973 49849 -8896
116h896k8647Q3806l6449n2502P0369l803n6002M2198Q867m0160K9228L410l5239
$$ -8896 -37543 46263 9814 -42688 27681 23878 -32124 10074 18941 -21219 8009 11419 -23820
129b3820L1489P188m0628K5312J7082l6978J6359J7378l3161J7906K1967m1545
$$ -23820 7669 14857 -25771 -459 16623 -20355 -3996 13382 -19779 -1873 20094 -21451
141b1451J1308M0588l8994j5929M9677j2189l7047L1202J2865k9150O917J3682
$$ -21451 -10143 30445 -8549 -24478 25199 13010 -24037 7165 20030 -9120 -2203 11479
153A1479j2672J577O658j1835M728J0074j6106l764J9907p530j8191J4874J0790
$$ 11479 -1193 384 7042 -4793 -65 10009 -6097 -9861 10046 2516 -15675 -801 9989
166I989j9279j145J6833o835p865Q843q60j758O610q908l6J7684j2525j3505K5321
$$ 9989 -9290 -10435 6398 -437 -8302 541 -319 -2077 4533 -4375 -4411 13273 748 -12757 12564
181A2564o81k5962J8013J1626k4290Q195J2679j9917P281J2117k2890P480J9443
$$ 12564 11883 -14079 3934 15560 -8730 -535 12144 -7773 -492 11625 -11265 -3785 15658
194A5658k8353J624K9126k6884q946L5798k0327k0497L7957r508k8653L2896J890
$$ 15658 -12695 -11071 18055 -8829 -17775 18023 -2304 -22801 15156 5648 -23005 9891 11781
207A1781l1250K5665P633l0409K2174J1463l3467J8495J9411l5208R772K5250
$$ 11781 -19469 6196 13829 -16580 5594 17057 -16410 2085 21496 -13712 -3940 21310
219B1310l0852K620K5696k8150k29K9622k8833q352L6297k1117j8957L3150r784
$$ 21310 -9542 -6922 18774 -9376 -9605 20017 -8816 -17168 19129 -1988 -20945 12205 2421
232B421j9194K6233j0480j5712L2816j3251k8968M1494K962m5275K7488K5508
$$ 2421 -16773 9460 -1020 -16732 16084 2833 -26135 15359 18321 -26954 534 26042
244B6042l8513M292K5138j9505P72J1230j7275J0932J2029k8790Q962K4828k8941
$$ 26042 -12471 -8179 16959 -2546 -1774 9456 -7819 3113 15142 -13648 -4686 20142 -8799
257h799m813K9629j8296j2728K4798j0231j2332J9511p333r730J6705p409q381
$$ -8799 -13612 16017 -2279 -15007 9791 -440 -12772 6739 -594 -10324 6381 -1028 -9409
270i409J8966j0110j1572K4541p079k0335K3785L052k3333J4137Q413j6763Q196
$$ -9409 9557 -553 -12125 12416 5337 -14998 8787 11839 -11494 2643 11056 -5707 2489
283B489M002j3994J2702K202j9346J3880Q603k1793Q289J1987j7816N498J0197
$$ 2489 6491 -7503 5199 7401 -11945 1935 10538 -11255 -2966 9021 -8795 -3297 6900
296F900j6764P316J1565k0061P116J5668k1269M435J9697k2756J102K5414k3708
$$ 6900 -9864 -2548 9017 -11044 -3928 11740 -9529 -5094 14603 -8153 -7051 18363 -5345
309e345o711L1977j8114j7807L0374o421k1204K1565k737j5931J9429p145j6664
$$ -5345 -12056 19921 1807 -16000 14374 7953 -13251 8314 5577 -10354 9075 1930 -14734
322a4734K6721o664k7514L0358N477l6519K2246J8022l4515J1372K2084k8654
$$ -14734 11987 5323 -22191 8167 13644 -22875 -629 17393 -17122 -5750 16334 -12320
334a2320O370K1626k6940N999K3875k9576K685L1553l0710p054L9641k5740k0039
$$ -12320 -5950 15676 -11264 -5265 18610 -10966 -8281 23272 -7438 -14492 25149 -591 -20630
347b0630M1532j3524k9924L6501k795l2846K9688M346l2867K4623R300l3105J9898
$$ -20630 20902 7378 -22546 13955 11160 -21686 8002 12348 -20519 4104 13404 -19701 197
360A97J4816l2991J4724K0037l2141R352K4160l0650L910K8890k9123l036L3480
$$ 197 15013 -17978 -3254 16783 -15358 -6006 18154 -12496 -8586 20304 -8819 -11855 21625
373B1625k5298j2149L6662j7898k1493L5017p798k7884K9654J642k9906K2387
$$ 21625 -3673 -15822 20840 2942 -18551 16466 8668 -19216 10438 12080 -17826 4561
385D561Q670k9795J6639J3765k8663J0424J9263k6568K492K3167k0814m760K3650
$$ 4561 13231 -16564 75 13840 -14823 -4399 14864 -11704 -9212 13955 -6859 -11619 12031
398A2031j3697r464K0135p581r720J5896n202r264J5499o262j0809J8164m309
$$ 12031 -1666 -11130 9005 1424 -8296 7600 2398 -6866 8633 2371 -8438 9726 5417
411E417j7618J9256M102k4480J2911J5874k4495j55K2583j5133j1068J9637l753
$$ 5417 -12201 7055 11157 -13323 -412 15462 -9033 -9188 13395 -1738 -12806 6831 3078
424C078j4148J2604K667j2647Q295M775j1883O908P704j3557K948J3286j2405
$$ 3078 -11070 1534 4201 -8446 -151 4624 -7259 -351 7353 -6204 -3256 10030 -2375
437b375m562J6890o688j1441J4359O94j3489Q796M639j1734N713L727j0135O979
$$ -2375 -6937 9953 3265 -8176 6183 6877 -6612 2184 6823 -4911 802 4529 -5606 1373
451A373L285j3696R524P913j9990P273J7646k2872j506K6200j8671j1929K8821
$$ 1373 4658 -9038 486 8399 -11591 -4318 13328 -9544 -11050 15150 -3521 -15450 13371
464A3371j0146j9591K6610k066k4301K4446L921k8924K1633J2316l3287J4627
$$ 13371 3225 -16366 10244 8178 -16123 8323 12244 -16680 4953 17269 -16018 -1391
476a391K2508l3578L568K9437k6666p142K9517j8390j1438K5932j3929j1815K5457
$$ -1391 21117 -12461 -8893 20544 -6122 -13264 16253 -2137 -13575 12357 -1572 -13387 12070
489A2070j3993j3618K9301j3051k0622L3628n836l0992L2628O529l7927K4266
$$ 12070 -1923 -15541 13760 709 -19913 13715 7879 -23113 9515 16044 -21883 2383
501B383J8179l7125J3802K3844l3440O928K6366l1624J785L1500l1439o450L8200
$$ 2383 20562 -16563 -2761 21083 -12357 -5429 20937 -10687 -8902 22598 -8841 -15291 22909
514B2909k5653j8684M0271j4687k7957L5886l005l1099K8420M930l0446K2501
$$ 22909 -2744 -21428 18843 4156 -23801 12085 9080 -22019 6401 11331 -19115 3386
526C386Q802k9078J8416J2560k9644J5543J6774l0538J1125K2185l0572M110K7402
$$ 3386 12188 -16890 1526 14086 -15558 -15 16759 -13779 -2654 19531 -11041 -6931 20471
539B0471k7776l659L0793k3081j1485L2361j6871j8508L1639q623k4485K7943
$$ 20471 -7305 -10964 19829 -3252 -14737 17624 753 -17755 13884 5261 -19224 8719
551H719J74k6999K1186P895k6228J4618J2350k3528R280J3611k0028N497J5207
$$ 8719 8893 -18106 3080 10975 -15253 -635 11715 -11813 -2533 11078 -8950 -3453 11754
564A1754j8203K355J6083j6076j177J6961j3446m724J6754j0139p625J6349p465
$$ 11754 -6449 -4094 11989 -4087 -5264 11697 -1749 -6473 10281 142 -7483 8866 1401
577A401r801J5544n152j1555J4570j287j4201J3073K863j5260Q682Q037j3716
$$ 1401 -8400 7144 1992 -9563 5007 3720 -10481 2592 5455 -9805 -1123 6914 -6802
590f802K958J0176r283j174Q605m583k551N543k442p29L345k550j141L626k002
$$ -6802 -3844 6332 -2951 -4125 4480 -103 -2654 2889 447 -282 3063 513 -628 2998 996
605I96j596J953J0r20o43r02K545q36m320L408K996n884k25N471k351l607K948
$$ 996 -600 1353 1363 443 -200 -1102 1443 607 -3713 -305 2691 -3193 -3418 2053 -298 -3905 -957
622i57J986j557k000J729L571k920l116O284O39p217M403M486p298Q70O160o095
$$ -957 1029 -528 -2528 -799 2772 -148 -3264 3020 3659 -3558 845 5331 -1967 -1097 5063 -1032
638a032k67N675n543p19O581o611j972Q775o069n297J0705k876r216R775J201
$$ -1032 -1299 4376 -1167 -1886 4695 -1916 -3888 4887 -1182 -6479 4226 1350 -7866 1909 3110
653C110j0063O302M746q553L276M668n821K418K826n163L685K440p376N118M336
$$ 3110 -6953 -651 4095 -4458 -1182 3486 -2335 83 2909 -2254 1431 3871 -3505 1613 5949
668E949r796K903Q726j0172j593J0343o389m625Q148l062m479O194l131l229P763
$$ 5949 -3847 -944 7782 -2390 -3983 6360 -29 -4654 3494 432 -4047 2147 -984 -4213 3550
683C550m237n686R644j003r100P418M512r386J742O513l926q78K231r24K036j662
$$ 3550 -687 -6373 3271 2268 -6832 586 5098 -4288 -2546 3967 41 -837 1394 470 2506 844
699H44l075N568O2p052M569L569o421O19M238m104K88J923l552K242J692n413
$$ 844 -2231 3337 3399 -3653 916 4485 -1936 -1317 2921 -1183 -895 1028 -2524 -282 1410 -4003
715d003K587M152n964M20N729m383j290N243l367l52M014l723M41M126m473J67
$$ -4003 -1416 2736 -3228 -2808 2921 -1462 -2752 2491 -876 -1228 2786 -937 -496 3630 -843 -676
731f76N422n699o52P408p097k273R973o675n976J2082m118r815J1581J08j1769
$$ -676 4746 -953 -1605 5803 -1294 -3567 6406 -269 -6245 5837 1719 -8096 3485 3593 -8176
746h176R448K796j1340P860M016j2017P886N426j3169O283R753j4673L142J2251
$$ -8176 1272 4068 -7272 588 4604 -7413 473 5899 -7270 -987 8766 -5907 -2765 9486
760I486j2943n85J2727j0616j993J2815j0877l299J5110j1052p452J8134p597
$$ 9486 -3457 -4042 8685 -1931 -3924 8891 -1986 -5285 9825 -1227 -8679 9455 1858
773A858j3383J8274k099j5998J4521K529j6146J2597L973j7298J2431P570k0176
$$ 1858 -11525 6749 4650 -11348 3173 5702 -10444 2153 6126 -11172 1259 8829 -11347
786a1347R824J4139k1244K891J8809j6802m183J8955j1432o459J5992r500o418
$$ -11347 -1523 12616 -8628 -5737 13072 -3730 -7913 11042 -390 -6849 9143 -357 -6775
799f775J6881r951j0387K0202o313j6745J9374J263j9272J3046O453j7026Q987
$$ -6775 10106 155 -10232 9970 3657 -13088 6286 7549 -11723 1323 7776 -9250 -263
812b63P183j6241R200Q561j8031P083J3869j9111J757J8058j5443m625J9295j1567
$$ -263 6920 -9321 -121 8440 -9591 -2508 11361 -7750 -5993 12065 -3378 -8003 11292 -275
826b75q221J8400p582j1654J7182k918j4444J4568J013j4668J0904M284j5065
$$ -275 -8496 9904 2322 -9332 7850 4932 -9512 5056 6069 -8599 2305 6589 -8476
839h476Q817P174j5402N452J0135j3454N85J2143j0093k555J1378o877m203J0485
$$ -8476 341 7515 -7887 -2435 7700 -5754 -5169 6974 -3119 -5674 5704 -1173 -5376 5109
853E109n096m606R520m227n278J0223l655q323J1745l94j2452R035O856j3992
$$ 5109 13 -4593 4927 700 -4578 5645 1990 -6333 5412 5018 -7434 1601 8457 -5535
867e535K228J0752q636m105Q588l232l379N274l554j905P661m854o006J0015L87
$$ -5535 -3307 7445 -1191 -5296 3292 60 -3319 1955 -1599 -3504 4157 -697 -6703 3312 3699
882C699j0483N781O948q338p33P234l777k332M593k457p08L819l561j597O219
$$ 3699 -6784 -1003 5945 -2393 -3126 4108 331 -2001 2592 135 -573 3246 -315 -1912 4307
897D307l615m710P958j861p724P928J634j0266O036N849j1127K349R359r384j971
$$ 4307 692 -4018 3940 2079 -5645 2283 3917 -6349 -313 5536 -5591 -3242 6117 -3267 -5238
912e238J0544o190m827J0436l925o564R921k146p792R621j90r461R058K072j1411
$$ -5238 5306 -884 -5711 4725 800 -5764 4157 2011 -5781 3840 3650 -5811 3247 5319 -6092
927f092P495N492j2314M475Q290j1095N84R460r224p10R347q966j182J1208r909
$$ -6092 1403 6895 -5419 -944 7346 -3749 -3165 6295 -2929 -3639 5708 -3258 -4440 6768 -3141
942c141m356J5393p592j0367J5935j552j4026J2485L569j3817Q493N700j2745
$$ -3141 -7497 7896 304 -10063 5872 4320 -9706 2779 6348 -7469 1024 6724 -6021
955f021O504P294j3565M633R940j2979O23J1975j0216k857J1132p418l977J0328
$$ -6021 483 7777 -5788 -1155 8785 -4194 -3571 8404 -1812 -4669 6463 -955 -4932 5396
969E396p154l535J1336p223o793J4347m976j1115J4003P12j4048J0386M931j2926
$$ 5396 -1758 -5293 6043 -1180 -7973 6374 1398 -9717 4286 4998 -9050 1336 6267 -6659
983f659O768O361j1943N221P051j0924K719R079j1183N5J0698q870k961J0709
$$ -6659 109 6470 -5473 -252 6799 -4125 -1406 7673 -3510 -3455 7243 -1627 -4588 6121
997F121o077n511R944l561o327Q230j739n790O954j955n261P737j583p412Q914
$$ 6121 44 -5467 4477 916 -5411 2819 1080 -4710 2244 289 -4972 2765 1182 -6230 2684
1012B684P52r509O692M905r704L008O385p536J306N420n907P08N248n872m07O041
$$ 2684 3436 -6073 619 5524 -4180 -1172 5213 -2323 -1017 4403 -1504 -796 4452 -1420 -1827 4214
1028D214n063j749O350l917l450N856j363m383L904M46l036J841l10j74K246l053
$$ 4214 -849 -2598 3752 -165 -3615 2241 878 -3505 399 845 -2191 -350 -660 -834 1412 -1641
1044a641r74O296l493m474O665J095o242K488L851l575l04J519j139J581q70k859
$$ -1641 -2615 3681 188 -4286 2379 3474 -2768 -280 3571 -4 -308 1211 72 1653 783 -2076
1060b076L979K16m994K355L458m878RL439k466p90K202j085K41N28k042K002J546
$$ -2076 1903 2119 -2875 -520 2938 -1940 -1931 1508 -958 -1748 454 -631 -390 138 -1904 98 1644
1077A644l750J247M192m684p07N916l341l306N385n94l777K896L72k781K801m68
$$ 1644 -2106 -859 3333 -1351 -2058 3858 517 -2789 2596 2002 -1775 1121 1493 -1288 1513 1045
1093A045k853L249r9m168L017J493m063J337K500l352N75K485k576K31K457k719
$$ 1045 -1808 1441 1342 -2826 191 1684 -2379 -1042 1458 -1894 -1319 1166 -1410 -1179 1278 -1441
1109a441O48K422k963N36L331l155p05M184k327k313M098o49l358K732J007l194
$$ -1441 -793 1629 -1334 -798 2533 -622 -1327 2857 530 -1783 2315 1666 -1692 1040 2047 -1147
1125a147J336J023k053Q58Q03k334J058J354k367N8K449j920q07K212m53j333
$$ -1147 189 1212 -841 17 820 -1514 -456 898 -1469 -1411 1038 -882 -1689 523 70 -1263
1141a263Q14R00q22r1R68p0n7K10k73K05L32l20n79J218k76j382J212K48k346
$$ -1263 -449 451 -371 -462 506 436 379 589 316 521 853 533 -46 1172 896 -486 726 974 -1372
1160a372J205J350k285PK582k460q53K953k077j342K882j075j503L135o68k999
$$ -1372 -167 1183 -1102 -1095 1487 -973 -1826 1127 -950 -2292 590 -485 -1988 1147 479 -2520
1176b520L940M5l982L948R73m874L433K315n375K172L620n667R21N147n869o95
$$ -2520 1420 1465 -2517 1431 2404 -2470 963 3278 -2097 75 3695 -1972 -1051 4096 -1773 -2468
1192b468O599n204k863P810l475n053O967r15o049O084N00o013N317R63o050N208
$$ -2468 4131 -1073 -3936 3874 399 -4654 2313 1398 -4651 1433 1933 -4080 1237 2200 -3850 1358
1208A358J674p232M751M056q492L315O380q774J162P906p829j207Q171o086k869
$$ 1358 3032 -4200 551 4607 -3885 -570 5810 -2964 -1802 6104 -1725 -2932 5239 -847 -3716
1223c716Q758n662m100R513m634o590J0461j825r552R747J781j1276P075N538
$$ -3716 5042 -620 -4720 4793 159 -6431 4030 2205 -7347 2400 4181 -7095 -20 5518
1237E518j0501L083P183q300J311O542p195R79O707p570N2Q255p588k605J0181
$$ 5518 -4983 -1900 5283 -3017 -1706 4836 -2359 -1380 5327 -2243 -2191 6064 -1524 -4129 6052
1252F052o080n343J0247l039p593Q866p20q144P807Q21q657P261J993r132N779
$$ 6052 -28 -5371 4876 1837 -5756 3110 2390 -5754 2053 2874 -5783 1478 3471 -5661 118
1267A18M628j0333M079P577r795J94R952p651l059R254m125m492P405k590m337
$$ 118 4746 -5587 -1508 6069 -3726 -3532 6420 -1231 -4290 4964 839 -3653 3752 1162 -3175
1282c175O693k258n152P275j397o619O712Q48p664N238L107p594L109M134o393
$$ -3175 3518 1260 -3892 3383 1986 -4633 2079 2927 -4737 501 3608 -3986 -877 3257 -3136
1297c136J477M882n558k40O017m911j113N884m007k449O705k452m687O259k17
$$ -3136 -1659 3223 -2335 -2575 3442 -1469 -2582 3302 -705 -3154 3551 1099 -3588 2671 2454
1312B454n466M176J686n045K542K181m086J278K466l937J370K920m101m91M009
$$ 2454 -3012 1164 2850 -2195 347 2528 -1558 -280 2186 -1751 -381 2539 -1562 -2053 1956
1327A956k838j818M450j867k675L661j43l226L170O43l157K117J758l180R27K491
$$ 1956 -882 -2700 1750 -117 -2792 869 726 -2500 670 1313 -1844 273 2031 -1149 -222 2269
1343B269k967J38L025k595r88L242j504k368L327n36k966K524M59l115K024J284
$$ 2269 -698 -560 2465 -130 -1118 2124 620 -1748 1579 1043 -1923 601 1060 -2055 -31 1253
1359A253l122J140K328l353N59K876l016J1L356k580j277M084j918k006L671j080
$$ 1253 -1869 -729 1599 -1754 -1195 1681 -1335 -1324 2032 -548 -1825 2259 341 -1665 2006 926
1375I26k909L834m21l615L611P37m393K548K594n146J244L705m200Q6L645l321
$$ 926 -1983 1851 1430 -2185 1426 2163 -2230 318 2912 -2234 -990 2715 -1485 -1399 2246 -1075
1391a075q36L846k984j549M220k375j851M665j847l019M523n67m218M598Q01m959
$$ -1075 -1911 1935 -1049 -2598 1622 -753 -2604 2061 214 -2805 1718 1151 -3067 1531 2332 -2627
1407b627L184K302m196J179K701l682J076K459l844J084L403n090K87M827m022
$$ -2627 557 2859 -1337 -158 2543 -1139 -63 2396 -1448 -364 3039 -2051 -1764 3063 -959
1422i59j924N020k281k688M075j031k813L900j005k709L734k93l193L386N95l919
$$ -959 -2883 2137 -144 -2832 1243 212 -2601 1299 294 -2415 1319 1026 -2167 1219 1814 -2105
1438b105K963J476m314K446K327m371J150L103l375m7K553k301j81K306k943K32
$$ -2105 858 2334 -1980 466 2793 -1578 -428 2675 -700 -747 1806 -495 -676 1630 -1313 -1081
1454a081L230l138j344M345k100k669L808o73k517K539l6j935K466m29j812K482
$$ -1081 2149 -989 -2333 2012 -88 -2757 1051 378 -2139 400 364 -1571 895 466 -1346 1136
1470A136K9k564K618K24k683K337R31l398J577K080l218K76K226k198J28J155
$$ 1136 1165 -1399 1219 1443 -1240 1097 2028 -1370 207 2287 -931 -655 1571 -627 -499 656
1486F56j764O57J456k749N28L062l195n33L666k009k028L504j134j336K132m84
$$ 656 -1108 -451 1005 -1744 -1216 1846 -1349 -1882 1784 -225 -2253 1251 117 -1219 913 429
1502D29j426K416j015j724K973p59k661K937M60l499K727P07l192J634J790l392
$$ 429 -997 1419 404 -1320 1653 894 -1767 1170 1630 -1869 858 1565 -1627 7 1797 -1595
1518a595R04K009k859O58K287l070P43K710l036o6L280k490j249L429j742j484
$$ -1595 -691 1318 -1541 -883 1404 -1666 -923 1787 -1249 -1315 1965 -525 -1774 1655 -87 -1571
1534a571L105q83k041L039n69k443K447L77l064K277R17k876J361J367l215J075
$$ -1571 1534 651 -1390 1649 1080 -1363 1084 1461 -1603 674 1591 -1285 76 1443 -1772 -697
1550f97K297l124K77K652k353m65K971k232r04K855j327j481L053j092k056K979
$$ -697 1600 -1524 -1247 1405 -948 -1413 1558 -674 -1578 1277 -50 -1531 1522 430 -1626 1353
1566A353m79k426K420O83k664J651J015k421J031J414k377M35J733k132j09K199
$$ 1353 874 -1552 868 1551 -1113 538 1553 -868 163 1577 -800 -365 1368 -764 -873 1326
1582A326j743j196K649p10j910J865K01j628J076L43j278J030N16j649J333J358
$$ 1326 -417 -1613 1036 326 -1584 281 482 -1146 -70 273 -1005 25 541 -1108 225 1583
1598A583k383L35K240j673j155K614q27j769J881pj605J397R8j661J627p7k191
$$ 1583 -800 -465 1775 102 -1053 1561 734 -1035 846 839 -766 631 729 -932 695 618 -1573
1615a573J826O77k626J001K459l046q4L155k342j301L109q30k143K661k71k194
$$ -1573 253 930 -1696 -695 1764 -1282 -1366 1789 -553 -1854 1255 425 -1718 943 672 -1522
1631a522K585j90k396K668L52l346K573J325l790J571K508l721L35L224k951j069
$$ -1522 1063 873 -1523 1145 1497 -1849 724 2049 -1741 -170 2338 -1383 -1048 2176 -775 -1844
1647a844L668k199j868L688j516k010L459j335k392L763n04l616L846O65n143
$$ -1844 1824 -375 -2243 1445 -71 -2081 1378 43 -2349 1414 910 -2706 1140 1805 -3338
1662c338L392K619m646K036K456l433M74L014l696M80L624m004o01M533l358k195
$$ -3338 54 2673 -1973 63 2519 -914 -440 2574 -1122 -642 2982 -1022 -1623 2910 -448 -2643
1678b643N359k456l476M758n88m067L927N38l958L196R42m044K818J716m393K306
$$ -2643 2716 260 -3216 1542 954 -3113 814 1352 -2606 590 1532 -2512 306 2022 -2371 -65
1694f5K907m921J345L739m194r6M328l816q40M346k930j881M576k199k776M418
$$ -65 2842 -2079 -734 3005 -1189 -1285 3043 -773 -1613 2733 -197 -2078 2498 299 -2477 1941
1710A941r80l792M123j13m203L729J007m651L010K033m397J700L052l947N50L305
$$ 1941 961 -2831 1292 1179 -3024 705 1712 -2939 71 2104 -2293 -593 2459 -1488 -938 2367
1726B367l198k12L445k794p88L460k430j186L390j984j547L312j018k938L326
$$ 2367 -831 -1043 2402 -392 -1180 2280 -150 -1336 2054 70 -1477 1835 817 -2121 1205
1741A205K3l303K406R17l199J674J798l008R78K221l535N25K988k274o09K743
$$ 1205 1228 -2075 331 1248 -1951 -277 1521 -1487 -509 1712 -1823 -1298 1690 -584 -1193 1550
1757A550j788j046K692q97j530K345j099j211J972l97j654J856J27k067J567M34
$$ 1550 -238 -1284 1408 511 -1019 1326 227 -984 988 591 -1063 793 920 -1147 420 854
1773H54j789Q88Q87j701M75J160j590MJ861j753l04J832q14j177J792m34r63J237
$$ 854 -935 -47 840 -861 -386 774 -816 -812 1049 -704 -1008 824 10 -1167 625 191 -772 465
1791D65L30j561Q75Q25j122p2J105j026L88K14m04n28R35q49k32R95m48p21J860
$$ 465 795 -766 109 934 -188 -260 845 -181 207 421 17 -511 424 -425 -657 338 -110 -831 1029
1810A029p04n56N22o86k3k20J260j051M67O60j152P11j7n55J0J251j185r0J421
$$ 1029 325 -231 291 -395 -418 -638 622 -429 38 698 -454 257 240 -315 -305 946 -239 -329 1092
1829A092q87n91J039l5q17N68L08r97L66L45n69J42J69r74N78P88j698Q61Q81
$$ 1092 205 -386 653 618 -199 369 677 -320 46 391 -178 -36 133 -841 -263 525 -1173 -312 569
1848E69j055n22J757n24j019R90M9m88O77q3n10P99l63n95J112m29j196J358K77
$$ 569 -486 -1008 749 225 -794 196 245 -243 434 351 -159 640 277 -318 794 365 -831 527 804
1867H04j495P66N45j311L66Q12p74j38P29p83q8Q91j008Q0J333j260o6J322r59
$$ 804 -691 75 620 -691 -325 487 -287 -425 304 -479 -567 324 -684 -604 729 -531 -597 725 -234
1886b34m68J320k97r48J408m08q18Q55l8q07J338l03j005O84J83j683J328M17
$$ -234 -702 618 321 -627 781 373 -445 410 372 -435 903 600 -405 279 462 -1221 107 524
1904E24j364L89J083j473M21P55r78l5J010r60L46Q93j461K75J634j167o39J858
$$ 524 -840 -451 632 -841 -420 335 -643 -678 332 -628 -282 611 -850 -575 1059 -108 -747 1111
1922A111j034p52J696o77r04J430l99j023J307l86j125J261L9j593J228O14j719
$$ 1111 77 -675 1021 344 -560 870 471 -552 755 369 -756 505 544 -1049 179 793 -926
1939i26R38O66j809M62J670j768K14J339j548m2J951j427m76J688j109n69K187
$$ -926 12 678 -1131 -669 1001 -767 -553 786 -762 -804 1147 -280 -756 932 -177 -746 1441
1956A441j483o15J910n12j619J740K37k082J572L35j894R94J418k493Q51J274
$$ 1441 -42 -657 1253 741 -878 862 1099 -983 589 924 -970 24 1442 -1051 -200 1074
1972A074k009L45J747j935n5J687j697l5J839j494m36J857q97q69K126j238j297
$$ 1074 -935 -590 1157 -778 -833 854 -843 -878 961 -533 -969 888 -9 -878 1248 10 -1287
1989a287K378l15j855J766N05k387J527P25j640O42J031j844K43J411j822L31
$$ -1287 1091 776 -1079 687 1192 -1195 332 1057 -583 59 1090 -754 -511 900 -922 -591
2005e91J829k004j86J867j366n47J532l00j076J545o30q09J156M46j314R26m4
$$ -591 1238 -766 -952 915 -451 -998 534 234 -842 703 73 -736 420 866 -448 478 434
2022D34j139J218m6j472J192J075j734K4J591j387m11J532j101j001J621m44p33
$$ 434 -705 513 467 -1005 187 1262 -472 -448 1143 -244 -655 877 -224 -1225 396 -48 -781
2039g81J152j99j250J448r4j338J258O13j589O22J341j277k13P89o41j87J119
$$ -781 371 172 -1078 370 276 -1062 196 809 -780 -158 1183 -94 -307 482 -159 -346 773
2056G73q99l2P69p42k72Q99k10r82J152k49n04N89j73j306J374Q18k603J501J071
$$ 773 -126 -158 611 -131 -403 496 286 -696 456 207 -297 292 119 -1187 187 1005 -1598 -97 974
2075I74j031k49J491k150l09K501n62j026J622n72j116J613l69j365M83O28j591
$$ 974 -57 -306 1185 -965 -1274 1227 665 -361 1261 689 -427 1186 817 -548 -65 563 -1028
2092a028Q56J074k003J167M58j216R23M28k348P45J499j087o72J652j819k44K094
$$ -1028 -172 902 -1101 66 524 -692 231 659 -1689 -944 555 -532 -1204 448 -1371 -1615 479
2109D79N6j299O90P38k246J482M70m67J222m72k174J437R89j067Q75m26M18n75
$$ 479 535 -764 -74 664 -1582 -100 370 -97 1125 653 -1521 -84 905 -162 713 287 705 130
2127A30M36j216K05L44J47p85K886j586j542R29nq83J433m63j964J878N37j421
$$ 130 566 -650 -445 -101 46 -739 2147 561 -981 -52 -57 -940 493 30 -1934 -56 481 -940
2145i40J619O86k852J063J271j854O64J410j366k80J773j947J75K290k140l36
$$ -940 679 1365 -1487 -424 847 -1007 -343 1067 -299 -579 1194 -753 -578 1712 -428 -764
2161g64J59K48j53K485k344o42P90m1k13J416k73q04N56P7j793J693Q08j564m44
$$ -764 -605 -357 -510 1975 -369 -1011 -221 -262 -475 941 668 -136 420 497 -1296 397 1205 -359 -803
2180h03J937n30k12k39m11k75N57j187O94K090j312j395J096n71j25Q24o49n31
$$ -803 1134 604 392 153 -258 -533 24 -1163 -469 1621 309 -1086 10 -561 -686 138 -511 -1042
2198a042Q09O28j585P84P86m81r20K056k207K41J109j026Q6J433l85o90R47j91
$$ -1042 -233 395 -1190 -406 380 -101 -1021 1035 -1172 -931 178 -848 -762 671 286 -404 543 352
2216C52n2M19J36q87P8P15j343Q15O73q83L40Mn40P9L15p82K72K53P9L04K38j274
$$ 352 300 719 855 -32 46 761 -582 233 906 23 363 367 -173 -94 221 -561 -289 -36 43 347 585 -689
2238f89L64Q62q47n13Q69o33O95R7p5l85Q84p45p15J552k30q40N97r2r02R92J12
$$ -689 -325 537 -310 -823 46 -587 108 205 130 -255 629 -116 -831 721 491 -349 248 156 -746 246 358
2259C58q93j23R89l83m73O78o14O79jl05j17M87j13r17J297n42m57J92M74o26
$$ 358 -535 -658 331 -52 -525 153 -461 218 217 -88 -205 282 169 -748 549 7 -450 -258 216 -410
2279d10L36K8L24m16K34l21L66M70q11R2J150q39k28k47J42m97M25K21q82R09
$$ -410 -74 -46 278 -138 96 -225 141 611 -200 -108 1042 203 -25 -272 -130 -627 -202 19 -863 46
2299D6l1m07P94m24J35m69M34l85O73n55K92Mk94k77N22L70j062J152k6j83o37
$$ 46 15 -392 402 -22 113 -356 78 -307 366 -189 103 107 -187 -464 58 428 -634 518 492 309 -328
2320c28R25q42J31K33j58l36L44m93J57J96j26O2r8q4j4j78N32J1m9M45m40r4
$$ -328 597 -245 -114 119 -39 -375 -31 -524 -367 -171 -297 -235 -333 -417 -431 -609 -77 -66 -115 330 -110 -204
2342b04N96l69k66L89l55k35J81N37p25O72n34k87R61r2l67K65k84n93Q68n17
$$ -204 392 23 -243 146 -209 -444 -263 274 -451 221 -313 -600 361 269 -98 167 -117 -710 158 -359
2362c59l74K72J152q16L08L77r94K02Q01j112K68N09r21R15r6n67j38J155m81
$$ -359 -733 -461 691 -125 183 560 -434 -232 569 -543 -275 234 -687 228 132 -435 -573 582 101
2381A01O5L94q98m14J357p62r58J409K1j099J347k84p28N23K24q00N08M00j099
$$ 101 166 560 -338 -752 605 -157 -1115 294 315 -784 563 279 -449 74 298 -502 6 406 -693
2400f93N85N15p25r6Q79m23m10Q80n55o2O10l08m99Q73n51o53J240j32j117R79
$$ -693 -108 407 -318 -414 465 42 -368 512 -43 -105 505 197 -302 571 20 -633 607 475 -642 337
2420C37o0q64P64L8n85J72N67q29n6Q69p40O1P62m59l74Q39m27n24R90j38p42
$$ 337 277 -587 177 215 -370 -198 369 -460 -516 353 -387 -326 436 -23 -397 442 15 -509 481 343 -399
2441c99J019o5q28N21L6o72O14K9p45O00L00p69K24M86q78j0R89n34j15N21m77
$$ -399 620 555 -273 248 284 -388 226 255 -490 110 410 -359 -135 351 -527 -537 452 -82 -197 324 -153
2462a53m52J109n86o72J340l31o63Q69j86o20O91J69j040O14N15p98K87O36p63
$$ -153 -605 504 -82 -754 586 255 -408 461 275 -345 346 515 -525 89 604 -194 93 729 -34
2481c4j28N94n76J2L10k31o85J052k73o77R18n03j23P17k32p82P62R3n79N90K37
$$ -34 -162 432 -144 -132 178 -53 -738 314 41 -636 282 -221 -344 373 141 -641 121 214 -365 225 462
2502D62o55l0Q54q03J64P66j052K89N23n86k51P54l74m75R87m24n44M29L68j181
$$ 462 -193 -223 631 -172 -8 758 -294 -5 518 -68 -319 435 61 -414 573 149 -395 34 402 -779
2522g79P85O6m71K23O3l57L43M80l67k18O05m11l92R38n42M2O52k63r38Q76O12
$$ -779 6 72 -399 -176 -113 -470 -127 353 -14 -232 373 -38 -430 508 -34 8 660 397 -541 335 947
2543I47r08J45j80n02P17K51o05K30M55j099l98J189j88n21P23n65Kk9p17Q14
$$ 947 39 184 4 -498 219 470 -135 95 550 -549 -947 242 54 -467 256 -309 -307 -336 -1053 -239
2563b39Q11j011j28J204m60J93o00R01j270N29P1n2j88M36k16K26N23j331N55
$$ -239 572 -439 -567 637 177 370 -230 671 -599 -70 1 -51 -239 197 -19 207 730 -601 -46
2582d6Kn9n31J096q44o0M17k44q4M32k62m9J95p5rM32o8n24L13L55o44M38K97
$$ -46 -44 -103 -634 462 -382 -442 -25 -269 -353 79 -183 -232 -37 -112 -121 311 243 -281 32 387 -257 181 478
2605D78n51K45O50r50J20K84l60J10O13j031J88N22m08m29R00n77k47O48m4p41
$$ 478 -73 172 822 -128 -8 276 -84 26 639 -392 -204 318 -90 -519 381 -196 -443 205 161 -580
2625e80M36L58n96P24k79j19K84P1m36M28L4m03L50K31o97J6M98m55k4L18Rl41
$$ -580 -144 214 -382 342 63 -56 228 299 -137 291 325 -78 272 503 -194 -178 320 -135 -159 159 168 -173
2647a73L58k03l96M02n8M6J35j4m89M51J79o69M62J87m65J12M37m35l9N15o31
$$ -173 185 -18 -414 -12 -70 -24 111 97 -392 59 238 -431 31 218 -247 -135 302 -133 -172 343 -288
2668b88Q1L46m9J26n8l08O1O76m82l82N21k88j34J86r8l34L36K86n47N28p5n66
$$ -288 -207 139 90 216 158 -150 -89 587 105 -277 244 -44 -178 8 -90 -424 -88 198 -349 179 104 -462
2690d62N08J67l11J47j4k68K25K44k87R5jk4n8q9j26L61L62n41k55N03k4n26M59
$$ -462 46 213 -98 49 35 -233 -8 236 -51 44 43 19 -39 -128 -254 107 469 -72 -327 176 152 -374 85
2713H5Q3m14K51j4m34L96J52l62J06J43l76K34L56k81j32K43p0j25M30j19j87
$$ 85 168 -246 5 -9 -443 -47 105 -257 -151 -8 -384 -150 206 -75 -207 36 -34 -159 271 152 -35
2734c5L25p5l99M44j0m44L88Kn18N30j48k98J46J48m61N59J72o46K12J76j63J90
$$ -35 290 215 -184 260 250 -194 194 196 -322 208 60 -238 -92 56 -405 154 326 -320 -108 68 -95 95
2756I5K23n34K61K71l58k94O35l5l30J50P5j61M69k03l07K25L34o08L13j19l90
$$ 95 318 -216 45 316 -42 -336 299 264 -66 84 159 -2 467 264 -43 182 516 -92 221 102 -288
2777b88Q5L98m09K07J31k85j40J00L6j0K41K0k81M86j26n20N10L5n27M33J05l61
$$ -288 -203 195 -214 -7 124 -161 -301 -201 -165 -175 66 86 -195 291 165 -355 155 190 -337 96 201 -160
2799a60l9M84k95O0K00m03R3L11k76m07O62k94j74K30Lk69K41J24k71J89K04k78
$$ -160 -199 285 -10 50 250 -153 -60 251 -25 -432 230 -64 -238 -8 -5 -274 -33 91 -180 9 213 -65
$$ [...]
8191B
##END NTUPLES=NMR FID
##END=
