##TITLE=1H_Artemisic-Ac(xAQA)
 CDCl3, 8 sc, 
 11.6.2020
##JCAMPDX= 6.0         $$ Bruker NMR JCAMP-DX V2.0
##DATA TYPE= NMR FID
##DATA CLASS= NTUPLES
##ORIGIN= UXNMR, Bruker Analytische Messtechnik GmbH
##OWNER= root
$$ XWIN-NMR		Version 3.5
$$ Thu Jun 11 10:28:15 2020 Russian Standard Time (UT+4h)  she@DPX200
##.OBSERVE FREQUENCY= 200.1315
##.OBSERVE NUCLEUS= ^1H
##.DELAY= (6, 6)
##.ACQUISITION MODE= SIMULTANEOUS
##.ACQUISITION SCHEME= undefined
##.AVERAGES= 8
##.DIGITISER RES= 18
##SPECTROMETER/DATA SYSTEM= spect
##.PULSE SEQUENCE= zg30
##.SOLVENT NAME= D2O
##.SHIFT REFERENCE= (INTERNAL, D2O, 0, 15.7039)
##AUDIT TRAIL= $$ (NUMBER, WHEN, WHO, WHERE, WHAT)
$$ ##TITLE= Audit trail, XWIN-NMR		Version 3.5
$$ ##JCAMPDX= 5.01
$$ ##ORIGIN= Bruker BioSpin GmbH
$$ ##OWNER= she
$$ F:/spectra/data/she/nmr/H-F/1/audita.txt
$$ ##AUDIT TRAIL=  $$ (NUMBER, WHEN, WHO, WHERE, WHAT)
(   1,<2020-06-11 10:27:18.31 +0400>,<she>,<DPX200>,
      <created by zg, POWCHK disabled, PULCHK disabled
       configuration hash MD5:
       00 E9 B6 7A A2 85 ED C7 34 08 36 98 17 FE 4E 26
       data hash MD5: 16K
       54 E4 F0 6E 35 A3 BE F5 39 A7 92 05 51 6E CF B4>)
$$ ##END=
$$ 
$$ hash MD5
$$ B7 7D 72 8F 09 E6 BE 42 E1 64 6B 45 C9 D0 39 1D
##$RELAX= 
##$RELAX= 
##$RELAX= 
##$RELAX= 
##$RELAX= 
##$RELAX= 
$$ Bruker specific parameters
$$ --------------------------
##$DU= <F:/spectra>
##$EXPNO= 1
##$NAME= <H-F>
##$PROCNO= 1
##$TYPE= <nmr>
##$USER= <she>
##$AMP= (0..31)
100 100 100 100 100 100 100 100 100 100 100 100 100 100 100 100 100 100 
100 100 100 100 100 100 100 100 100 100 100 100 100 100 
##$AQSEQ= 0
##$AQ_mod= 1
##$AUNM= <au_zg>
##$AUTOPOS= <>
##$BF1= 200.13
##$BF2= 200.13
##$BF3= 200.13
##$BF4= 200.13
##$BF5= 200.13
##$BF6= 200.13
##$BF7= 200.13
##$BF8= 200.13
##$BYTORDA= 1
##$CFDGTYP= 0
##$CFRGTYP= 5
##$CHEMSTR= <none>
##$CNST= (0..31)
1 1 145 1 1 1 1 1 1 1 1 1 1 1 1 1 1 1 1 1 1 1 1 1 1 1 1 1 1 1 1 1 
##$CPDPRG= <>
##$CPDPRG1= <>
##$CPDPRG2= <>
##$CPDPRG3= <>
##$CPDPRG4= <mlev>
##$CPDPRG5= <mlev>
##$CPDPRG6= <mlev>
##$CPDPRG7= <mlev>
##$CPDPRG8= <mlev>
##$CPDPRGB= <>
##$CPDPRGT= <>
##$D= (0..31)
0 1.2 0 0 0 0 0 0 0 0.06 0 0.03 0 0 0 0 0.0002 0 0 0 0 0 0 0 0 0 0 0 0 
0 0 0 
##$DATE= 1591856837
##$DBL= (0..7)
120 120 120 120 120 120 120 120 
##$DBP= (0..7)
150 150 150 150 150 150 150 150 
##$DBP07= 0
##$DBPNAM0= <>
##$DBPNAM1= <>
##$DBPNAM2= <>
##$DBPNAM3= <>
##$DBPNAM4= <>
##$DBPNAM5= <>
##$DBPNAM6= <>
##$DBPNAM7= <>
##$DBPOAL= (0..7)
0.5 0.5 0.5 0.5 0.5 0.5 0.5 0.5 
##$DBPOFFS= (0..7)
0 0 0 0 0 0 0 0 
##$DE= 6
##$DECBNUC= <off>
##$DECIM= 24
##$DECNUC= <off>
##$DECSTAT= 4
##$DIGMOD= 1
##$DIGTYP= 9
##$DL= (0..7)
0 120 120 120 120 120 120 120 
##$DP= (0..7)
150 150 150 150 150 150 150 150 
##$DP07= 0
##$DPNAME0= <>
##$DPNAME1= <>
##$DPNAME2= <>
##$DPNAME3= <>
##$DPNAME4= <>
##$DPNAME5= <>
##$DPNAME6= <>
##$DPNAME7= <>
##$DPOAL= (0..7)
0.5 0.5 0.5 0.5 0.5 0.5 0.5 0.5 
##$DPOFFS= (0..7)
0 0 0 0 0 0 0 0 
##$DQDMODE= 0
##$DR= 18
##$DS= 0
##$DSLIST= <SSSSSSSSSSSSSSS>
$$ [...]
##$SUBNAM2= <"">
##$SUBNAM3= <"">
##$SUBNAM4= <"">
##$SUBNAM5= <"">
##$SUBNAM6= <"">
##$SUBNAM7= <"">
##$SUBNAM8= <"">
##$SUBNAM9= <"">
##$SW= 24.9337058887773
##$SWIBOX= (0..15)
0 0 2 0 0 0 0 0 0 0 0 0 0 0 0 0 
##$SW_h= 4990.01996007984
##$TD= 16384
##$TD0= 1
##$TE= 0
##$TE2= 300
##$TE3= 300
##$TEG= 300
##$TL= (0..7)
0 120 120 120 120 120 120 120 
##$TP= (0..7)
150 150 150 150 150 150 150 150 
##$TP07= 0
##$TPNAME0= <>
##$TPNAME1= <>
##$TPNAME2= <>
##$TPNAME3= <>
##$TPNAME4= <>
##$TPNAME5= <>
##$TPNAME6= <>
##$TPNAME7= <>
##$TPOAL= (0..7)
0.5 0.5 0.5 0.5 0.5 0.5 0.5 0.5 
##$TPOFFS= (0..7)
0 0 0 0 0 0 0 0 
##$TUNHIN= 0
##$TUNHOUT= 0
##$TUNXOUT= 0
##$USERA1= <user>
##$USERA2= <user>
##$USERA3= <user>
##$USERA4= <user>
##$USERA5= <user>
##$V9= 5
##$VALIST= <valist>
##$VCLIST= <CCCCCCCCCCCCCCC>
##$VD= 0
##$VDLIST= <DDDDDDDDDDDDDDD>
##$VPLIST= <PPPPPPPPPPPPPPP>
##$VTLIST= <TTTTTTTTTTTTTTT>
##$WBST= 1024
##$WBSW= 4
##$XGAIN= (0..3)
0 0 0 0 
##$XL= 0
##$YL= 0
##$YMAX_a= 211888
##$YMIN_a= -185126
##$ZGOPTNS= <>
##$ZL1= 120
##$ZL2= 120
##$ZL3= 120
##$ZL4= 120
##$ABSF1= 10
##$ABSF2= 0
##$ABSG= 5
##$ABSL= 3
##$ALPHA= 0
##$AQORDER= 0
##$ASSFAC= 0
##$ASSFACI= 0
##$ASSFACX= 0
##$ASSWID= 0
##$AUNMP= <proc_1d>
##$AZFE= 0.1
##$AZFW= 0.1
##$BCFW= 1
##$BC_mod= 2
##$BYTORDP= 1
##$COROFFS= 0
##$CY= 11.3945322036743
##$DATMOD= 1
##$DC= 2
##$DFILT= <>
##$DTYPP= 0
##$F1P= 16.9975609425685
##$F2P= -3.02152046262296
##$FCOR= 0.5
##$FTSIZE= 0
##$FT_mod= 4
##$GAMMA= 1
##$GB= 0.15
##$INTBC= 1
##$INTSCL= 1
##$ISEN= 128
##$LB= 0.24
##$LEV0= 0
##$LPBIN= 0
##$MAXI= 10000
##$MC2= 0
##$MEAN= 0
##$ME_mod= 0
##$MI= 1.114404
##$NCOEF= 0
##$NC_proc= 0
##$NLEV= 6
##$NOISF1= 3.799351
##$NOISF2= 2.8
##$NSP= 1
##$NTH_PI= 0
##$NZP= 0
##$OFFSET= 15.70392
##$PC= 1
##$PHC0= -9789.739
##$PHC1= 11.60088
##$PH_mod= 1
##$PKNL= yes
##$PPARMOD= 0
##$PSCAL= 0
##$PSIGN= 0
##$REVERSE= no
##$SF= 200.130013532006
##$SI= 16384
##$SIGF1= 3
##$SIGF2= 2
##$SINO= 400
##$SIOLD= 16384
##$SREGLST= <1H.CDCl3>
##$SSB= 0
##$STSI= 0
##$STSR= 0
##$SW_p= 3612.71676300578
##$SYMM= 0
##$S_DEV= 0
##$TDeff= 0
##$TDoff= 0
##$TI= <>
##$TILT= no
##$TM1= 0
##$TM2= 0
##$TOPLEV= 0
##$USERP1= <user>
##$USERP2= <user>
##$USERP3= <user>
##$USERP4= <user>
##$USERP5= <user>
##$WDW= 1
##$XDIM= 8192
##$YMAX_p= 0
##$YMIN_p= 0
$$ End of Bruker specific parameters
$$ ---------------------------------
##NTUPLES= NMR FID
##VAR_NAME=  TIME,          FID/REAL,        FID/IMAG
##SYMBOL=    X,             R,               I
##VAR_TYPE=  INDEPENDENT,   DEPENDENT,       DEPENDENT
##VAR_FORM=  AFFN,          ASDF,            ASDF
##VAR_DIM=   8192,          8192,            8192
##UNITS=     SECONDS,       ARBITRARY UNITS, ARBITRARY UNITS
##FACTOR=    0.0002004,     1,               1
##FIRST=     0,             0,               0
##LAST=      1.6414764,     0,               0
##MIN=       0,             -185126,         0
##MAX=       1.6414764,     211888,          0
$$ Real data points
##PAGE= N=1
##DATA TABLE= (X++(R..R)), XYDATA
0@%%%%%%%%qJ6j6J6k4L2l2M0n0N8p2Q4r6J13j33J54j78K04k32K65l03L44l88M36
32B30m92N53o18O89p66Q54r48J050j164J290j428J582j751J940k152K390k664
49a405K976l337L764m275M901n690O718q120J0157j3412J9609n1368K20659J5160
63A96337l64048j520L04792M7767k84280m3198K33143M7936k20604n0057J73715
74C9983N2802j37665k6994J06188J3372q2423K1603Q0009k8958q2130K4102O1406
86D1295k7649m9206K9087K6720m2343j9019N9052L0631m5592k7788L6953K2704
98C4845k0777j0646O506j2715j0762J4380k33k3146J3925M0329k0882n4069L0977
111a2268Q3086j6366r2350r63Q2926J228p9084k700O4363j2819o8144K3859P9586
$$ y = [0, 0, 0, 0, 0, 0, 0, 0, 0, -8, 8, -8, 8, -16, 16, -16, 24, -26, 32, -40, 44, -52, 61, -72, 82, -96, 108, -124, 141, -162, 182, -206, 230, -262, 291, -327, 362, -404, 450, -498, 552, -612, 678, -750, 832, -919, 1021, -1131, 1259, -1405, 1571, -1766, 1998, -2277, 2624, -3066, 3652, -4468, 5689, -7723, 11886, -39482, 181177, 196337, -167711, -169231, 135561, 183328, -100952, -144150, 88993, 136929, -83675, -133732, 39983, 92785, -44880, -71874, 34314, 47686, -34737, -13134, 66875, 37917, -44213, -20111, 41295, 13646, -35560, -6473, 20247, -22096, -41115, 17937, 48568, 2976, -24812, 12141, 34845, 14068, 3422, 9928, -2787, -13549, 831, 598, -22548, -8623, 31706, 10824, -43245, -12268, 70818, 54452, -37898, -38861, 44065, 45293, -33791, -36491, 27872, 15053, -53091, -29232, 50354]
124E0354j7418p5152K1484P8408j9794p6782J9566P5686k4841r1861L946Q8840
136C2436J6096p7533l2908O0397M8926k9609m2986J7071M3395q916n0381q026
148c2038M9626J6910n9937l8870N5757N3162m5043n2464N0129N9662m9240o1168
160e3514N7726O8886o5748q6947N4977Q6457n5363q6479N4798Q5608n6065p9811
172g5475P0601R2977o9000r8190O4741R7896o4406j02247N5265R3699n8845r4846
184h7830N7518J00056m3255r1666L8424Q8443k5231p3356K0467N6168k6905n3647
196d0814K1706M3453k1177l6791J7943L1607q512j4077J5059J0718j4015o489
208a389J0355J97j1610j367L02j0851J551J9358K991j9806J919K7110K659k2681
$$ y = [50354, 32936, -42216, -20732, 57676, 37882, -38900, -19334, 56352, 31511, -60350, -56404, 32436, 48532, -29001, -61909, -1512, 47414, 17805, -25181, -8110, 35285, 26369, -24012, -32038, 17588, 34498, -25439, -64309, -8552, 44610, -433, -52897, -2768, 56894, 7654, -53514, 4212, 73098, 7350, -79597, -24620, 61837, 6474, -80005, -25207, 60401, 4336, -75475, -4874, 88103, 19103, -79087, -14346, 83550, 19144, -83103, -27838, 65861, 7016, -87830, -30312, 69744, 26489, -65177, -26753, 61690, 36459, -36897, -16430, 39738, 12833, -40814, -19108, 24345, 3168, -33623, -15680, 15927, 7415, -6662, 8397, 19115, 5100, -1389, 8966, 9163, -2447, -3814, -3512, -14363, -12812, 6546, 9537, -10269, -8350, 18760, 21419, -1262]
222a262K212K3162r340l1189M492K7946q719l0635P402K9245n551k1235J5321
235A849K7105j3731k6161J3869K5358j5671l0023P206K1909j0544k1780R313K3872
248A2571k746j8828L576K2350O203j7199j2033R100J0989j0881k0619M080K0924
261G487l282k5961K893L7122O721l6911p267M4002J1568m9671j8821M9874J6465
274C4219o1188k5975O2743L1713o3640l4251O9058M5213o3192m5816O3084M9700
286F1668o2823n7089N2679N3653n1861n6486M2178N4521l2771m4975L2697M4097
298C5488k3248l4819K0946K7248k0942k5278J2843J4023j5160j0817J3655P172
310A111q824J726J2298k06n672O088L691j1832m178R967k223j7823O75J8590k313
$$ y = [-1262, 950, 24112, 14772, -16417, -11925, 16021, 7302, -23333, -15931, 13314, 7763, -13472, 1849, 28954, 15223, -10938, 2931, 28289, 12618, -17405, -10199, 11710, 1166, -20614, -11301, 12571, 9825, -9003, -5427, 16923, 23126, 5927, -6106, 2994, 13983, 3102, -17517, -13437, 7487, 4205, -21756, -18863, 18259, 24980, -11931, -19198, 24804, 36372, -13299, -32120, 17754, 34219, -26969, -52944, 9799, 41512, -22128, -56379, 12679, 57892, -5300, -51116, 11968, 61668, -1155, -58244, -5565, 48088, -3773, -60259, -18081, 36440, 3669, -41306, -8609, 35488, 12240, -22579, -1633, 25615, 4673, -20605, -7762, 6261, -8899, -19716, -6061, 1111, -7713, -5987, 6311, 6105, 433, 6521, 10212, -1620, -5798, 4169, 1946, -15877, -15202, 3388, 1075]
325A075j8508Q839K5990o408k2500J1643K6285j3163l0598J0167K6948j5318l2001
338b7549J2724L0843j0642k6620J4597K9069r153k1732J3012J9067j6288j9652
350a2324J4678J3540k2341j7399K2414J8812k1124j7815K4360K5293j5681k3929
362a1516J2510K3981q712k6238k545J8218L856j6654j0290J2819J6239m997j4194
375g523O235K0509o82k2567k543K2423R80l1615q203L1170R102l5233j2378M0877
389A0552K1238l7463k1398M0258K7759l9107l2975L3122L0545l5593l6375K9259
401a0178L5527k6314l4385K6914L9581j8590l6281J7047L6928j1910l8908J934
413a8635L0876J48l0349q598K3216J3641j3068j2635J0992J7425j187j4026l241
$$ y = [1075, -17433, -8594, 17396, 10988, -11512, 131, 26416, 13253, -17345, -7178, 19770, 4452, -27549, -14825, 16018, 5376, -21244, -6647, 22422, 13269, -8463, 4549, 23616, 7328, -12324, 2354, 15894, -6447, -23846, -1432, 17380, -3744, -21559, 2801, 28094, 12413, -11516, 994, 24975, 16263, -9975, -12520, 5698, 9554, -7100, -17390, -4571, 11668, 6671, -7523, -1288, 19221, 18539, -4028, -6571, 15852, 16832, -14783, -22986, 8184, 17286, -17947, -30325, 10552, 31790, -5673, -27071, 13187, 40946, 1839, -31136, 1986, 32531, -3062, -39437, -10178, 25349, -965, -35350, -8436, 31145, 12555, -23726, -6679, 30249, 18339, -20569, -18635, 12241, 12389, -17960, -26558, -3342, 10299, -2769, -15404, -4412, 13013, 11826, -2200, -5441]
426e441J0853K545j3074q003P978M798j0662m135J4533P654j3372m177K0084R945
440A9526k1328j2573K0438J2498k4339j9732K0326J7806j9383j7592K0979K0243
452A6869j5443j4137J9122J5509j9005j5678J7845J1653k2834j5971J9763J4850
464A2543j9800j3642K1464J8244j5530j3831J6800J6167j5374j6888J0666J2486
476A3305j2865j6830Q078J5882m246j4047L764J8040M972j2975p631J1312J2334
489A9093r714k0137N44J9235J966k3632p942K4469J5978k0344j6358K3092K2792
502B9042j9674k5187J6993K3968j9159l0630J4730K9219j5857l1719J6262L7697
514B5685j1150l6100J2052M1172q217m3371K320M1288k763m5971m675M2838P570
$$ y = [-5441, 5412, 7957, -5117, -13120, -5142, -344, -11006, -15141, -608, 7046, -6326, -10503, 9581, 19526, -1802, -14375, 6063, 18561, -5778, -25510, -5184, 12622, -6761, -24353, -3374, 16869, 1426, -12711, 6411, 21920, 2915, -12763, 5082, 16735, -6099, -22070, -2307, 12543, -7257, -20899, 565, 18809, 3279, -10552, 6248, 22415, 7041, -9847, 819, 13305, 440, -16390, -8312, 7570, 3324, -10723, -6959, 11081, 16053, 3078, -4553, 6759, 19093, 9379, -10758, -10214, 9021, 10987, -12645, -20587, 3882, 19860, -484, -16842, 6250, 29042, 9368, -15819, 1174, 25142, 5983, -24647, -9917, 19302, 3445, -28274, -12012, 25685, 14535, -21565, -9513, 31659, 23442, -19929, -17609, 23679, 20916, -25055, -29730, 13108, 20678]
527B0678m1278q780M3000J5645l7339j5732L7442J8609l6355k3283K9883K0905
539B3395l0822k5234K5311K5999k0735k2709K0259K6264j4055k2667J3538K0575
551A9119j3359k1482Q044J6376j0968j7640R303J6821o830j2660J0208J5673o228
564F377j3368P118J2109q214j5046L404J1071n409j2489M065J2716k45q253K947
578c217J1930J171r271l289P475K464r092p413L411O527k671p665J972J2462M117
593H911r011m360J2371Q722j2199j3644P679J4240j0408j9566O166K1907l220
606G588k2822M184K8880L204k8051n219K9723Q547l2772j5518K9207J5771l1617
619h895k1786L1573K7418k7598k8281K7814L6472k2840l7335J9231L7110j8659
$$ y = [20678, -20600, -29380, 13620, 29265, -8074, -23806, 13636, 32245, -4110, -27393, 2490, 23395, -7427, -32661, -7350, 18649, -2086, -24795, -4536, 21728, 7673, -14994, -1456, 19119, 5760, -15722, -7678, 8698, -2270, -19910, -10607, 6214, -616, -13276, -3068, 12605, 6377, -6991, 127, 12236, 4022, -11024, -7620, 3451, -1958, -14447, -10382, 2334, 2089, -6164, -3217, 8713, 9884, 613, -2676, 4799, 7263, -1829, -9242, -5831, 696, -1975, -9640, -7668, 4794, 8911, -100, -4460, 7911, 16633, 4434, -9210, -1531, 12709, 2301, -17265, -11099, 10808, 7588, -15234, -11050, 17830, 21034, -7017, -12236, 17487, 26034, -6738, -22256, 6951, 22722, -8895, -30681, 892, 28310, 712, -27569, 245, 36717, 13877, -23458, -4227, 32883, 14224]
631A4224m2484J2391M0573j1310m2960Q000M4372j850l9724L094M1039O1l9509
644a4083k042L7165P4l9801n512L5116N161l3686l930L3282N650k8309j966L0287
658A7406L328k9807n455K6036K405k7386n257K2984K761k1947j249K3915N028
671A2762j8828l084J8384L306j4958l916J0073j810j3009L74J0665o2r573J573
685h103J0068J824m464J677M243j734m761q07P50j213n96j735m632M21R436M856
701E230p444m804J0385Q408q983q536Q477P338j3965j2689J2386J4285j1871j6834
715a8617J1557K1378o933j8835R052K2566p306k7043L454K7795j413l2444o156
728b2945L0215R698k7249r611K9742J4392k7516j5090L0403J8916l1066k5298
$$ y = [14224, -28260, -15869, 24704, 13394, -29566, -21566, 22806, 20956, -18768, -15674, 25365, 25426, -14083, -16125, 21040, 21114, -18687, -24199, 10917, 16078, -17608, -21538, 11744, 17394, -10915, -12881, 17406, 20734, -9073, -14528, 11508, 13913, -13473, -18730, 4254, 7015, -14932, -16181, 7734, 12762, -6066, -9150, 9234, 12540, -2418, -6334, 3739, 1929, -11080, -10706, -41, -103, -9676, -8103, 1965, 3789, -675, 1002, 5245, 3511, -1250, -2057, -1307, -2520, -3116, -4851, -9483, -9062, 374, 5230, -2214, -7018, 3367, 11775, 2792, -5744, 2733, 10071, -3894, -16583, -4197, 10088, -1783, -18617, -7060, 14318, 7385, -11450, -2398, 20168, 12862, -14181, -10727, 17068, 15655, -16789, -22945, 7270, 16968, -10281, -19892, 9850, 24242, -3274, -18364, 12039, 30955, -111, -25409]
740b5409K5987K5031k6633k8313K4849L0090k3223l0665K5055L7654j8875l7762
752b2214J4534L6487j2874l5638Q668K9492j1543l0500J1743L1269r513k7511
764a7600J0781K7572p885k2946R235K0211j3227k3367J0652K0770j1131k0400
776a7335Q817J7512o669j0717J1702J1292j2641j0126J2181R429j3640j1177R206
789b166N532j0382m272J1598N551j0130k225J0107M629o061j244K792n025n068
803f364M985M352q599o301P971N782o795n55J2271J965j3779j894J6686K258j9851
818g868n956J7186L343k0177m854K3396Q390k2422j0085K4537J6856k0021j8586
831a6261J5641J7757j5439k0219J1718J9193j0935k2407Q517K6584k310k3140
$$ y = [-25409, 578, 25609, -1024, -29337, -4488, 25602, 2379, -28286, -3231, 34423, 15548, -22214, -7680, 28807, 15933, -19705, -11037, 18455, 6912, -23588, -11845, 19424, 9911, -17600, -6819, 20753, 12868, -10078, -843, 19368, 6141, -17226, -6574, 14196, 3065, -17335, -8518, 8994, 2325, -8392, 3310, 14602, 1961, -8165, 4016, 13445, -195, -11372, -2166, 3366, -7016, -11288, 310, 5861, -4269, -6494, 3613, 8242, 2181, 937, 3729, -1296, -6364, -1379, 2973, -5626, -11927, -3956, 1826, -4969, -5524, 6747, 8712, -5067, -6961, 9725, 11983, -7868, -13824, 3362, 6705, -13472, -18326, 5070, 13460, -8962, -19047, 5490, 22346, 2325, -16261, -620, 17137, 1698, -18521, -6803, 12390, 1455, -20952, -12435, 14149, 11839, -11301]
843a1301Q26K4380L336k3891n291K2686N028k6744j1423K5453J5204k3844j7085
856b2666K3370K0578j7830j8291J9222J9599j9755k2203J6845K1295j7933k3356
868b1125J4329K1160j2624j7697J5640J9421j4282j6548J5007J7388j4939j7448
880a1718J1268J2245j4549j1136J4441J0177j4709q258J6698J0684j3486p407
892e750J3116N524j4905n169J2462K136j4562l774J2346L025q503M46R221n89
906E024o499M104O198n958o372M695J566r235j320J0268P5j2873J937J6662R79
921I251j5966J648J7793k826k0076J512J9874m385k3805J472K3643k74k2513J343
935a3309K5029J369k3020r66K3564K671k4591o809K0699O693k0606q606J7884
$$ y = [-11301, -10475, 13905, 17241, -6650, -11941, 10745, 15773, -10971, -22394, 3059, 18263, -5581, -22666, 704, 21282, 3452, -14839, 4383, 23982, 4227, -17976, -1131, 20164, 2231, -21125, -6796, 14364, 1740, -15957, -317, 19104, 4822, -11726, 3281, 20669, 5730, -11718, -450, 11795, -2754, -13890, 551, 10728, -3981, -12239, 4459, 15143, 1657, -5750, 7366, 12890, -2015, -7184, 5278, 7414, -7148, -10922, 1424, 4449, -4054, -3608, 5613, 5024, -1475, 2629, 8827, 2869, -3503, 1192, 2758, -6477, -7797, 2471, 2546, -10327, -8390, 8272, 9251, -6715, -5067, 12726, 9900, -10176, -8664, 11210, 6825, -16980, -15508, 8135, 7861, -14652, -13309, 11720, 13089, -9931, -10897, 12667, 15338, -9253, -16062, 4637, 11330, -9276, -17882, 2]
948BR248j4567q138J5811J1500j2009j1576R505J2514r044j5378M218J4455l753
962B788j6514J824J8318K942j6354m134J8682Q865j6582j1523J4343J1296j5142
975a191j4715J2415J3809j1987j3981J2164J6082p741j3590R016J3845p906j3244
988g024N826J0492p638j1611N470R403m717p288N826Q111l847l840N131M062n701
1003B655l323L321O75m985j946K921N08k048J720K684o91O90L441m71m214R63
1019A900M616l793q249K609P106m615q128N452J0111m273q379P188J0659p243
1033D961j1518P302J0601j0462j3299R027J2522j0559j3586J1457J6424r387j5820
1046a2337J0981J7716q900j9293O546J7461o780j9104K187J7296j64j6077p80
$$ y = [2, 9250, -5317, -13455, 2356, 13856, 1847, -9729, -224, 12290, 3246, -12132, -7914, 6541, 2788, -13726, -11902, 6416, 9358, -6996, -11130, 7552, 16417, -165, -11688, 2655, 13951, -1191, -15906, -3491, 10318, -1669, -15650, -3486, 12596, 4855, -8735, 281, 14126, 6220, -7024, -1198, 9294, 1656, -9955, -4485, 4918, 201, -7087, -1261, 6850, 3003, -837, 4294, 8356, 2655, -668, 2653, 3328, -1657, -3603, -682, -174, -2222, -502, 2182, 1491, 2181, 5622, 5151, 937, 1900, 6516, 2723, -5526, -2917, 4189, -426, -8554, -3102, 7009, 2736, -5643, 1545, 12204, 4961, -6557, 745, 11346, 884, -12415, -3388, 9134, -1425, -15011, -3554, 12870, 3483, -12337, -1356, 16360, 7460, -11833, -5287, 12174, 5394, -13710, -11523, 5773, 5609, -10468, -11248]
1059a1248J6007M763j1657n032J0558O567q876q899M393P907m327j0410J856J0338
1073A940J848j0209j599J2546N915j1460p150J1580P809j2670j1745J0296J1432
1086H533j1422j2625J1268J4311q429j3107J0113J4936q381j4463P147J3602p766
1099C717j5781N284J3586m884j3097M017J3566r77j0045K242J0054m19q459m13
1113a609N533j880n751M21M063j728l412K627N053l75l583J483N271R59n885l334
1129b147L721K892m407o708K688P655j213o975J630R334J363q309j297R268P15
1144H210j0911k751R712J346j2117k678J2538M446j1842l439J3465O483j2167
1157B95o600J1120O304j1855q784Q879P155q501p948P595Q742m910o930N058Q555
$$ y = [-11248, 4759, 9522, -2135, -7167, 3391, 9958, 1082, -7817, -3424, 4483, 156, -10254, -8398, 1940, 3788, -6421, -8020, 4526, 10441, -1019, -8169, 3411, 11220, -1450, -13195, -2899, 8533, -2889, -15514, -4246, 10065, 1636, -11471, -1358, 13578, 5197, -9266, -2119, 11483, 3717, -12064, -6780, 6806, 1922, -11175, -7158, 6408, 5431, -4614, -2372, 7682, 7263, -1196, -1609, 3924, 2044, -3707, -3286, 777, -951, -4363, -1736, 3317, 2942, -641, 842, 6113, 7072, 1187, -2147, 1574, 4466, 59, -6649, -3961, 3694, 2481, -4494, -2864, 6470, 7833, -476, -1773, 7495, 8210, -2701, -5452, 4260, 5606, -6511, -9189, 3349, 7795, -4047, -7486, 5979, 12462, 295, -6305, 4815, 11119, -736, -9520, -641, 6514, -1987, -9935, -2340, 6402, 1492, -5438, -380, 8175]
1172H175k415q802k34P344J470q623o394O026Q095l563j0634K415J3627K376j3284
1187d421l767J4693O417j5823j0020J3520J0121j4353j2698J3005J2954j1333
1199a705j2334J3099J4334j1475j3646J1191J4302j1277j6067Q447J4119r109
1211a21j4528Q331J4640o787j2421Q386J2735n554j1378N579R729o765j0393N575
1225b972Q779p119r341O708R887m725q086N858R989m740q815L778Q949m636j0442
1240f928J601Q837j144q531L20R211J668o805r82Q040L302p730m995O205M499
1255F568n974p595L584P153k302o507K683Q277j1o737n68P435J845p235m654M801
1271G63L359m632m741L499M195j536l846K945N872r4n526j445M984K178o475m818
$$ y = [8175, 5760, -3042, -3276, 4068, 5538, -3085, -9479, -3453, 4642, 1079, -9555, -7140, 6487, 8863, -4421, -8188, 6505, 12922, -2901, -12921, 599, 10720, -3633, -16331, -3326, 9628, -1705, -14039, -940, 13394, 1919, -11727, -536, 13766, 2489, -13578, -5131, 8988, -121, -14649, -6318, 8322, 1535, -10886, -2500, 10235, 4681, -6697, -1118, 8611, 1846, -8547, -2972, 5807, -1312, -10653, -3945, 5942, 1217, -6869, -1011, 8978, 4238, -4577, -799, 8150, 3514, -6928, -5327, 3510, 2366, -6165, -5845, 3366, 5034, -1771, -2753, 5287, 8589, 859, -4136, 2069, 6568, 594, -7001, -3417, 3736, 1434, -5073, -2390, 5887, 5876, -861, -1429, 6006, 7851, 616, -4038, 763, 4122, -510, -5251, -1752, 2443, 907, -2939, 6, 5878, 5784, 258, -1187, 3797, 5975, -500, -5318]
1287e318M526M891n747o720N950R841l858j0879M137J3465j547j4254m68J3009
1301G028J88j5452k334J5096K902j5505m281J6914O981j5025o202J5623O573j5753
1315c247p837J4339P700j5872j0730J4168J1315j2722j0407J3088J1233j0641
1327C87r808J1077J0071j1119j1494R247R338r968r881Q981R289q378p913R730
1341d41J0190q342r261P949R188p600r257N264P379o903q127O937Q637n772p308
1356g467N996R213l860p984L773P102m108q085J606P442k293p198Q43O286J247
1371B513l191J80K947Q45j408o06K05j68m80j483k071M62L186L94m042K40O388
1388C911J772n702j569P664J664r639m145R597M291j1599o778J1354Q853j0261
$$ y = [-5318, -792, 4099, -1648, -8368, -2418, 7423, 3565, -7314, -3177, 10288, 8741, -5513, -5981, 7028, 7216, -8236, -10570, 4526, 7428, -8077, -12358, 4556, 11537, -3488, -9690, 5933, 12506, -3247, -11084, 3255, 10955, -4917, -15647, -1479, 9836, -2886, -13293, -205, 11028, 387, -9421, 1656, 11727, 608, -10886, -1639, 7699, -2269, -12150, -3169, 6120, -2258, -10171, -441, 9749, 1407, -7854, 95, 9283, 1683, -7574, -2310, 5069, -1834, -9961, -3024, 5613, -159, -7467, -1471, 7742, 3882, -4102, -329, 6773, 2665, -5420, -3814, 3628, 1335, -5863, -5020, 1266, 2513, -678, -498, 2449, 3294, 1886, 1280, 1485, 1317, 837, -646, -2717, -2255, 931, 1325, -2717, -2477, 3911, 5683, -19, -1588, 6076, 7740, -1899, -6044, 3553, 7844, -3755, -10533, 821, 9674, -587]
1402e87q946J1381J1499j0490j2006R855J3419r997j6038P094J5480p050j5869
1415a2255N617J6516l714j5016L845J6519j937j6204O60J4663n45j5517p83J2874
1429D723L75j3175n24J3904J644j1910j192J2511K582j1947l355J0572K163j1716
1443e345l574J0080L274r747l376J0230M451p952l177Q287L811q544l878O911
1457A451L323q798l817O808L713o510k941P514M122o133k757O288L826o802m348
1472e061N440L392o084m467M471M347l239l530L692M044j180k204O25J338P9o21
1488A042j988k363J100L082j088m490J506O754J31o674Q42Q374K21r795j101R972
1504E525O10j2204k311J2511K902j3160k864J4920N237j3952n446J4852O590j4789
$$ y = [-587, -9533, 1848, 13347, 2857, -9149, 706, 14125, 4128, -11910, -4816, 10664, 3614, -12255, -6638, 9878, 6164, -8852, -5007, 11512, 9575, -6629, -5969, 8694, 8149, -7368, -8151, 4723, 5098, -8077, -8601, 5303, 6947, -4963, -6155, 6356, 8938, -3009, -6364, 4208, 6371, -5345, -8919, 1161, 4435, -5312, -8688, 1542, 5993, -1959, -5136, 3151, 6962, -1582, -5460, 1451, 4774, -4024, -7841, -1033, 2680, -3830, -6771, 743, 4865, -1268, -4025, 2263, 6089, -713, -5061, 379, 3771, -2313, -6780, -2309, 2038, -1201, -4731, -1039, 3005, 1825, -379, 246, 1584, 1663, 1042, -946, -3309, -2209, 873, -215, -4705, -3199, 3555, 3686, -2988, -2146, 6228, 6449, -3346, -4447, 5525, 6135, -6069, -8380, 4131, 7033, -6127, -8991, 5929, 11166, -2786, -8232, 6620, 13210, -1579]
1518a579q390J2900Q234j3358r743J2096J0114j1003r750J1360J1075q759j0594
1531g397Q093J0644p520j1486N577R445n978r801N053R339k998q479L582Q927
1545G001j902p466J638O801k316p902P65O721j423p367M40P709N98o080j60P078
1561D135J365o605k069N796J926o266l756M494K960m155k844L815L592k472k187
1576b271L254K716l146k477K104J240k977j800J372J093j749q62K832J646q47
1591A28m47O85M93r8l27q43j437M88R40j810k138K787L275k512l380M450N475
1608E729m160o211M289O703n138r002M381R497n146j0805N001J2623l114j2856
1622h209M200J4040k349j4542J405J3844j316j4862o45J4122J271j3585j699J3553
$$ y = [-1579, -9969, 2931, 11165, -2193, -11936, 160, 10274, -729, -10479, 881, 11956, 3197, -7397, 696, 11340, 3820, -7666, -2089, 7356, 1378, -8423, -3370, 5969, 2971, -5508, -1926, 7001, 5099, -2367, -729, 6072, 3756, -4146, -3381, 3340, 1917, -5450, -5010, 2699, 3297, -2783, -2943, 4135, 5500, -1105, -3174, 2622, 4548, -1718, -5474, -980, 1980, -2175, -5019, -1204, 2388, -84, -2271, 983, 3699, 553, -1924, 180, 1420, -1557, -3357, -1985, -892, -2641, -3503, -671, 975, 128, -319, 366, 859, 761, 434, -409, -1846, -1358, -418, -2228, -4366, -1579, 1696, -816, -4196, 254, 5729, 1569, -4642, -353, 6350, 1212, -7790, -3409, 6088, 942, -9863, -4862, 7761, 4647, -8209, -4009, 10031, 7682, -6860, -5455, 8389, 7073, -7789, -8434, 5688, 6959, -6626, -8325, 5228]
1636E228L441j1860k759J1913L398j0720m413Q669M118q694n253O713M781m664
1650a02m768M841N276k527m073K375L446j377l968o4K395m30k690n93K104J292
1666A137j765n03L393J442k451j780K608J765l552l029K322K476l084l349L256
1681a114L993k520l236L243M325k653m132K336L774l342m983K204M223k449m773
1696e104K686M936j291m071J682N004j170m237r8L140q6l702j635K559K162k141
1712a366k463K107L736o54l066J10M383R75o022k444N475K672o522n065O748O191
1728D795n760o546O696Q629n836q905N625R102n338j0206L429R802l628j0261
1742h402K991J0611j472r300J499R970m13q567n64Q204J27p864j696O068J744
$$ y = [5228, 8669, -3191, -5950, 5963, 9361, -1359, -5772, 2897, 7015, -1679, -6932, -219, 4562, -102, -4870, -29, 5247, 2720, -1353, 1022, 4468, 3091, -877, -941, 1454, 1024, -1666, -2259, -155, 1137, -628, -1131, 2262, 3704, 1253, -527, 2081, 3846, 294, -2735, -413, 2063, -1021, -4370, -1114, 2879, 359, -2877, 366, 4691, 2038, -2094, 242, 4016, 674, -4309, -2105, 2118, -331, -5104, -2418, 2518, 1227, -2844, -1162, 3842, 2672, -1565, -1663, 1477, 1391, -2311, -3946, -1387, 775, -1366, -3829, -1722, 2014, 1360, -1706, -1596, 2787, 3762, -2260, -4704, 771, 3443, -3079, -8144, -1396, 4795, -965, -7511, -815, 7814, 1978, -6927, -1302, 7800, 2462, -7744, -4315, 5487, 1859, -8402, -5411, 5200, 3728, -5572, -4073, 5897, 5484, -3083, -3647, 4557, 4684, -3180, -4876, 1192, 2936]
1757B936n703j611N166K529k959j859L105K576k099k847P75J965q11k779n69K266
1773H1J241k265j242L017L040k323k356K501L045l029m165K568L352l416m217
1788d168L322M091k822m139M365N222l897m809M504M736m891n514L849N067n366
1803d50n389M786N944m173n649M648O641l828o371L335O501l515p439J925O390
1818C356j896o146K46O379Q03m696r13M850K220l965k442K363K473k455l713M98
1834c038L859j3m582J49M986J587m452j494M516L017m827m344M102L981m479n262
1850f294L907N352l066n386L377O209j796n654J621N714j118o195R4M681K21n437
1866c770j194N337K352m000k155L797L964k760l934J695M003j730n048J60N109
$$ y = [2936, -2767, -4378, 788, 3317, 358, -1501, 1604, 4180, 2081, -766, 9, 1974, 1163, -1616, -2185, 81, 1322, -943, -2185, 832, 3872, 1549, -807, 1694, 4739, 1710, -2455, 113, 3465, 49, -4168, -846, 3245, 423, -3716, 649, 5871, 1974, -2835, 1669, 6405, 1514, -4000, -151, 4916, -450, -5839, -1053, 4891, 718, -4931, -283, 6358, 2530, -3841, -506, 5995, 2480, -4959, -3034, 3356, 1460, -4686, -4440, 1939, 2742, -1954, -2867, 1983, 4203, 238, -2204, 159, 2632, 177, -3536, -3038, 821, 808, -3774, -3625, 1361, 2948, -1504, -2998, 1518, 4535, -292, -4636, -534, 3447, -1032, -6294, -2387, 2965, -101, -5487, -2110, 4099, 2303, -3351, -1730, 3984, 2866, -3329, -3235, 1446, 1667, -3770, -4964, 373, 2725, -1275, -3430, 367, 4331, 1571, -2363, -668, 3335, 1605, -3443, -3283, 1826]
1881A826Ln179m63N563J906m686j434N427K315n864k748N898K153o968k977O283
1897A055L192o428l083O965M520o913l135P051L908p186m704O867L949p683m108
1912e733O543M167o711l895P593N131p087m388O713M554o563m778N387M180n914
1927h01n158N443N265m860m232M358M542k780l755K584L591k413l932J027K818
1942A697q81l269n91K752J725r00j880P35K724L82l034j080K991J436l867l670
1958d730K876M552k936m412K112N488p19n307J643N285q38o037o06N840N46n923
1974c166k360N721K736n401j929N109L808m776m165M758M468l727o112K665N473
1989C102k953n180K014N840j920n190K080O604j050o283N45O174j096o847J091
$$ y = [1826, 1829, -3350, -3813, 1750, 3656, -1030, -2464, 2963, 5278, -586, -3334, 2564, 4717, -2251, -5228, 1055, 4247, -2181, -5264, 1701, 6221, -692, -3827, 3224, 7132, -54, -4758, 2109, 6058, -1625, -5733, 810, 4977, -1734, -5629, 1964, 7095, 8, -4380, 2333, 6887, 324, -4454, 933, 5113, -801, -5959, -516, 4749, -111, -4343, 15, 4557, 1777, -1978, 606, 4197, 1784, -2148, -1121, 1697, 816, -2453, -3044, -292, 1433, 533, -1347, -612, 2112, 2494, -540, -1620, 1371, 2807, -1060, -4730, -1854, 2698, -238, -4650, -2538, 2950, 2231, -3076, -1433, 3852, 3014, -3023, -3629, 2211, 2757, -3166, -5526, 195, 2931, -2470, -4399, 710, 4518, -258, -4423, 335, 4803, 1076, -5036, -2371, 3102, 149, -5031, -3017, 2823, 903, -4287, -2207, 4397, 3347, -2936, -2391, 3783, 2687, -4160, -3069]
2004c069O218j433o920J076P950r5p358M16P249P02p242K98O390o00q015M98P486
2021C551l67p798L17Q154P4o937M15Q101j62q241m12Q006K84p873j848O474K092
2038C830o503q39O201J473n299j354N665J519m004k019K363J248k732j247J498
2053b00J159j678k52J167O57R16K35j411j460J768K173j942l474O12L138j514
2069a06l229K058M223j588m704J847O012r67o088N52N143q32o470M64O917o32
2085B600p847k9Q343J966p540k190P189K530o891k628O447K249o962l913O562
2100a14M513n909m478N485N111m782l959N172M336n618n293M589N174m319n610
2115e702L480M813l015m355M260M941l621n258L942N361l377n729K855M653l625
$$ y = [-3069, 3149, 1716, -5204, -4128, 3822, 3727, -3631, -3215, 4034, 4736, -2506, -2208, 4182, 3582, -4433, -3935, 3551, 3184, -4614, -4297, 3857, 3931, -3006, -2591, 5510, 5348, -2893, -3305, 4701, 4985, -2888, -4736, 1738, 3830, -2673, -3512, 2689, 4162, -1137, -2491, 3174, 4693, 689, -1330, 1033, 2281, -451, -1698, -200, 959, -719, -971, 196, 853, 1769, 2004, 593, -867, 901, 3074, 1132, -2342, -1730, 1408, -106, -3335, -1277, 2946, 1358, -3346, -1499, 4513, 3546, -2542, -1990, 3153, 2321, -4149, -3685, 3232, 2600, -5247, -5276, 3067, 5033, -2507, -4697, 2492, 5022, -1869, -4497, 1950, 4199, -2763, -6676, -114, 4399, -1510, -5988, -503, 4608, -174, -4133, 1039, 5375, -243, -5536, -947, 4227, -92, -5702, -2222, 2591, -424, -4779, -519, 4422, 801, -4457, -515, 4846, 1469, -4260, -1405, 3248, -377]
2130c77m446L256N048k767n231L026N841j743m803J231M263j844m284J604L984
2145B758k086m606J518M886n44l641J232L302n10l404J270K536m28l441o66K282
2161D58L86r84q63N87Q47K44L20l64P05O19m68j960l49K585M61l978j313L472
2179D05K532l341k593M055L553m007l723M215M127l927n573K765N752k559o582
2194d901K313O578j714o497K404P127j457p882J092P352j10q209l06O643M25o708
2210c850p12P054J300o456j310O505K002o166j892N450R44n697j272N323J406
2225B629n758j271N491J959m562j649M829J880m984j849M451J672n246j959M279
2240h8K406m295j727L963K272l337k047L854K166l077l005J998K715k209k370
$$ y = [-377, -4823, -1567, 3481, 714, -4517, -1491, 4350, 2607, -2196, -965, 3298, 1454, -2830, -1226, 2758, 672, -3934, -2416, 2470, 1926, -1715, -483, 2819, 2309, -1095, 175, 2711, 2283, -1158, -1824, 458, 844, -140, -1003, -416, 431, 675, 995, 631, 1336, 1955, 1487, -473, -822, 1763, 2224, -1754, -3067, 405, 2937, -404, -2997, 1058, 4611, 604, -3119, 1096, 5223, 1296, -4277, -1512, 4240, 1681, -4901, -2588, 3990, 2276, -4221, -1817, 5310, 3853, -4029, -2937, 4415, 4305, -3904, -4210, 2433, 2858, -3850, -4562, 2492, 3792, -2664, -3974, 2531, 4533, -1633, -3525, 1925, 2869, -2828, -4100, 1223, 2629, -3129, -4400, 1091, 3050, -1512, -3161, 1668, 3548, -1436, -3285, 1166, 2838, -2408, -4367, -88, 2318, -1977, -3704, 259, 2531, -806, -2853, 1001, 3167, 90, -2915, -917, 1798, -411, -2781]
2255b781J567J944r00j644J105J938k0j571L1J161K34j184m43R3N43n83o58K61
2273i07J502J76j143j80J828J591k242j690J406K315k289k815J464L396j499l790
2289b877J602M061j06m205K49M386Q94m989j346M347J282m857k481M864K732m291
2305g35l360M756M542m255m481L913M941l444o055L326N052k533n808J995N558
2320C412j299n056J395M955l52n102M86M887j080m671k8M834r64m455L06M385
2336A653j05l493K01M100k03l320l68L150r2l292j53K707l06k596Q7L085j53k349
2354a447K72K337N18k331o36J715L68j817j171J176J453p50j552L46J566O94j075
2371c34m64J321Q17j139j544J222Q47j531j981J383K619j275k402J199L719m25
$$ y = [-2781, -1214, 730, -170, -1814, -709, 1229, 1209, -362, -331, 830, 1064, -120, -563, -470, 73, -510, -1168, -907, 595, 771, -372, -552, 1276, 2867, 625, -1065, 341, 2656, 367, -2448, -984, 2412, 913, -2877, -1275, 2786, 2680, -1525, -1276, 3110, 4004, -985, -2331, 2016, 3298, -1559, -4040, 824, 3556, -735, -4095, 661, 5203, 948, -3533, 380, 5321, 1877, -4178, -852, 4200, 1667, -4141, -2146, 3412, 2113, -2943, -1548, 3407, 3055, -2047, -1561, 3326, 2246, -2425, -2453, 2381, 1417, -3038, -2732, 1653, 1548, -1945, -1744, 2356, 2153, -1167, -1535, 1615, 1523, -1769, -1922, 785, 479, -2117, -2030, 1055, 902, -1447, -1175, 1162, 1680, -651, -1287, 428, 796, -1021, -2192, -1016, 437, -313, -1865, -1519, 47, 741, -334, -798, 523, 1340, 201, -1343, -121, 726, -805, -2786, -1403, 1216, -59, -2461, -1262, 2457, 2032]
2387B032m018M73L919k5m269r41L912J424m311j303L264K357k751j991K803K850
2403C425k613k730K132K647k079l292J136L403p57l829N86M030O56l536r30L840
2419B089J387l505j931K896J976k834k781K281K920k207k750K120L505j831l204
2434a869K174L001j353l688Q63L504j175l669M42L270L17l282J50K847M77j964
2450D5n18K183n86j771j12J225r7j939L63J621J78j635j20J979O26j492n69J098
2468D79Q21j318j372N94J142o90j717P50K248K03k611L87K757N2k876o47K752
2485I54R21l264j776L019K001l078k046L285K685k799l412L620L021k736l682
2500c287K337L567k604l681K178L574j591l498J513L974j170l159O15L286l39
$$ y = [2032, -1986, -1513, 2406, 2381, -1888, -2829, 1083, 2507, -1804, -3107, 157, 2514, -237, -2228, 575, 3425, 812, -1918, 214, 2861, 782, -2510, -1374, 2029, 1272, -2557, -1971, 2059, 2715, -821, -1751, 2089, 3476, -29, -1960, 936, 2912, 78, -2703, -422, 2498, 291, -2459, -339, 3166, 1335, -1869, 305, 3306, 1953, -1735, -872, 2632, 1457, -2212, -1770, 1500, 1817, -1465, -1315, 1532, 2009, 45, -473, 1710, 1124, -647, -759, 466, 369, -1570, -1207, 414, 592, -1043, -1163, 816, 1442, -50, -619, 479, 1300, -18, -1390, -796, 346, -344, -2061, -1311, 937, 1140, -1471, -1084, 1673, 1725, -1151, -1798, 954, 1875, -1389, -3165, -146, 1855, -1223, -3269, 16, 2701, -98, -3510, 110, 3131, 395, -3287, -950, 2617, 13, -3668, -1490, 2084, 493, -3005, -1492, 2482, 1312, -1847, -1232, 2054, 1715]
2515A715l211n89K572L41j748j156J641J506p79j009O11J408J80j487n40J084
2531E39Q56j445j502J210J381j003j869J113K415o16k464R45K917n33k712k15
2547i83K748j77k947k51K983j17k777K07K780N12k515j24K730P87l759n46K741
2564A292O17k599r96K226Q61j835p32K047J255j854q54J644R47k080j296J619
2580B62J304k011j799J725K176j380k572J898K854j457k732J436K790j414l236
2595b156M61L355n37l833M03L846K82l926P9M099N76m467r68M370R87m355j455
2612c239L342J935l615j511L258J792k478j887K308K177k045j536J361J121j664
2627f81j068J195P14r33o27O88N27M94l82J74m62N45Q09r70j410O42J606j177
$$ y = [1715, -1496, -2085, 487, 828, -920, -2076, -435, 1071, 292, -717, -106, 1302, 1482, -5, -545, 539, 1395, -50, -1552, -342, 1039, 36, -1833, -720, 1695, 1079, -1385, -440, 2477, 1944, -768, -983, 1765, 1588, -1359, -1610, 1373, 1256, -1521, -1314, 1466, 1978, -537, -661, 2069, 2856, -903, -1449, 1292, 1909, -690, -1686, 540, 1401, -434, -1166, 881, 2136, 282, -572, 1072, 2019, -61, -1357, 262, 1566, -445, -2244, -519, 1657, 277, -2295, -397, 2457, 1000, -1732, -296, 2494, 1080, -2156, -1695, 1660, 1123, -2710, -2307, 1539, 1821, -2105, -2026, 2073, 2649, -1818, -2786, 1584, 2571, -1784, -3239, 103, 2038, -1577, -3088, 170, 1962, -516, -2403, -95, 2082, 37, -1499, -138, 983, -681, -1749, -554, 160, -773, -1400, -712, -185, 309, -73, 101, -361, 184, 993, 23, -1387, -745, 861, -316]
2645c16k107J541K621q22k793J016L002n86k895M03K921q28l302M25L434n53l602
2662b441O43L935nl575J11L989l93l685j1L334J36l596n55L384J31l111R9L264
2680A654K14k912J22L352J67l527k89K824M85l291q53L113J037l138j011L335
2696A282J287k951j354K818J803k664k286K427K157k843k239K554K262k022k904
2711b673K590K958j669k703J148K938j307l522J346K825j111k934L55L067k30
2726A078k665K95L008n63k080M84J723j98k189n96J864J45j474Q6Q01J60o9J60
2744c0k3p4L44J51r73o83J402J007j451j906J235K289j688j934K102K277k052
2761gk300K018L224k714l178K195K982k098l219J859L542k037l548K400M010j649
$$ y = [-316, -2423, -882, 1739, 917, -1876, -860, 2142, 1556, -1339, -936, 1985, 1157, -2145, -1720, 1714, 1161, -2441, -1798, 2137, 2132, -1443, -1332, 2657, 2264, -1421, -1432, 1902, 2038, -1558, -2113, 1271, 1402, -1709, -1610, 1654, 1868, -1044, -922, 2430, 2597, -930, -1219, 1605, 2090, -1201, -2054, 1059, 2096, -1042, -2053, 1282, 2569, -382, -1736, 1082, 2885, 221, -2065, 362, 2519, -324, -2563, -9, 2253, 231, -2673, -83, 2875, 1206, -1497, -349, 2589, 1282, -2240, -894, 1931, 820, -2114, -1759, 1308, 1078, -1587, -1292, 1716, 1153, -927, -443, 1280, 1082, -1107, -1703, 161, 306, -1168, -1082, -281, -121, -190, -30, -53, -127, 217, 368, -605, -1288, 114, 1121, -330, -2236, -1001, 1288, -400, -2334, -232, 2045, -7, -2307, -289, 2935, 221, -2957, -762, 2220, 122, -3097, -1238, 2304, 267, -3281, -881, 3129, 1480]
2777A480l779J171L827j317l871J289L035j509l055J484L560j087l318J136L374
2792B420q09l134J137K859j315l228J009L186j097l323Q94L233k41l000Q98K966
2808B455p24l131N45L336j00l612n80L132N33k775q67L252P25k597j212L243J312
2825B935k345k390K151J598j978j811J571J927j633j362J096J761m08j596M88
2840DJ539o32j094J35J53Q8m93l91L27L79J55j12m92L89J113l27j285l96J401
2859D61K18k159J21J800L04k278l57K688J169k997j166K829J851l283j574L034
2875F61J490l731j456L225K008k996k543L337K393k563k247K815K115k850k327
2890b669K477K415k707k571K281K297j973j657J929K455k132k394K397K196k219
$$ y = [1480, -2299, -1128, 2699, 1382, -2489, -1200, 1835, 326, -2729, -1245, 2315, 1228, -2090, -954, 2420, 1611, -1523, -386, 2473, 1158, -2070, -1061, 2125, 1028, -2295, -1401, 1832, 1591, -1409, -511, 2455, 1731, -1400, -855, 2481, 2381, -1231, -1811, 1321, 1854, -921, -1788, 1464, 2189, -408, -1620, 1623, 2935, 590, -1800, 351, 1949, -29, -1840, -269, 1658, 25, -1337, -241, 1520, 1112, -484, 4, 1543, 911, -183, -48, 105, 193, -300, -691, -364, 15, 170, 58, -434, -45, 1068, 741, -544, -940, 461, 679, -1480, -1359, 441, 745, -1533, -1890, 798, 1967, -1030, -2196, 633, 2484, -799, -2373, 661, 2151, -1580, -3036, 189, 2197, -799, -3342, -5, 2388, -175, -2422, 393, 2508, -342, -2669, -192, 2223, -484, -3055, -774, 1523, -450, -2107, -178, 2277, 145, -2249, 148, 2344, 125]
2905A25k469K339J479j730k107K005J834j560k391K263K678j621k273J040K410
2920B022j213k317Q01K272q13k637J008K585o07k080K43K189j50j773l7J909p5
2937A327j847n07J711L74j045j051R58R91n63m78L35R19m60p76K01O13J68q52
2955A8q54M18M47O21r94OJ354K73j180p58J845O70j914j335J320J400j317j568
2973a548J241J672q70j986J125K157r12k376N98K516m71k762N0K362k5k573J49
2990a653K942j28k617J55K692J3k367m88K158M19k340n78K062O08k214m59J894
3007I9J190j855m55J467Q82j656r38J479N61j668q56J569O56j148j011J774R36
3024A026j487o89J479P94j614p32J299P28j247j316J345J287r29j360J048J632
$$ y = [125, -2344, -5, 1474, -256, -2363, -358, 1476, -84, -2475, -212, 2466, 845, -1428, -388, 2022, 809, -1508, -707, 1565, 752, -1885, -877, 1708, 1101, -979, -736, 1453, 1303, -470, -507, 1402, 1327, -520, -1027, 684, 1058, 13, -1038, -80, 911, 348, -130, 205, 1124, 664, -112, 89, 702, 870, 18, -836, -418, 29, 650, -344, -338, 1016, 1289, 109, -649, 1196, 1866, -48, -1383, -63, 1337, 20, -1548, -307, 1365, 495, -1491, -366, 1791, 879, -1497, -899, 1617, 1146, -1616, -1566, 796, 771, -1802, -1653, 1289, 1161, -1456, -1301, 1391, 1404, -963, -1451, 707, 1126, -1214, -1792, 270, 878, -1336, -1795, 99, 1289, -566, -1021, 446, 1328, -328, -1266, 213, 774, -894, -1750, -181, 475, -673, -1684, 90, 1026, -461, -1150, 329, 1123, -491, -1223, 76, 804, -443, -1759, -414, 873, -56, -1416, -368, 1264]
3040A264o68j439L69J818l29j781j78J051R37j716l39J116L42l51j026R92J027
3057A089k00j247K16J019Mj204k01J087J00p60o84J075Q22p90r08P43J497q82
3075G76j420M33J559m37j676j73J835L15j907r5J706N44j610p26J349J322j697
3092I8j381J442Q64r30j490J020J720j120j405J041J166k80j491L89J324k69j185
3109d87r9J007k10q96J7P04M68q04P9O17q0p39R1N51M58j431l38R94L92q06l83
3130h95P44P17q71n21L55J060m68r74K30J335q54j259O36J007k28j148N33J235
3148F34k82j313N00J315p4j691M0J187J49j463l72J740K13j251n00J421Q43j363
3166b67n21J199J073j134j619R75J398n53k176Q18J615p6j458Q7J639O12j837
$$ y = [1264, 596, -843, -474, 1344, 1015, -766, -944, 107, 1044, -672, -1011, 105, 447, 96, -930, 62, 1089, 889, -358, -142, 877, 881, -323, -524, 563, 663, -97, -781, 294, 1116, 326, -582, 161, 1658, 776, -644, -211, 1348, 911, -765, -938, 897, 1212, -695, -790, 916, 1460, -150, -876, 473, 1795, 98, -1283, 159, 1023, 93, -1397, -377, 1343, 223, -1182, -141, 1025, 745, -746, -357, 967, 698, -487, -586, 421, 211, -685, -668, 36, 504, -300, -221, 396, 316, -423, -332, 219, 677, -754, -1092, -98, 294, -512, -895, -151, 566, -305, -826, -471, 589, 121, -853, -623, 712, -142, -1401, -765, 242, 14, -1134, -601, 634, 352, -961, -461, 854, 780, -911, -871, 316, 465, -998, -1370, 370, 583, -668, -1168, 253, 1096, -267, -788, 411, 1484, 350, -1269, -294, 1104, 551, -1625, -807, 808, 732, -726, -639, 1000, 1612, -225]
3183b25n24J274P31j227j220J129J429j218j463J441J100n98j418P55J592p95
3199G63j147K81R47K99j471l67J215K21q23l58R20N11j037R9K42N51j87m46l1
3218A82P3R8n96j7N14J28l76m23P85L95m54n93K39Q62o06j019N57O49l20p99L0
3239f91J055j85p34J46J011j93j508O02J188n54j373P83R90n45j715O22J866k87
3257D78k041R77J650l16j895L03J951l54k157k46K388J69k322j74K323J57k159
3274a268K6J923O15j860q30J669O12j251j388J510J126j240j312J302J634j386
3290a18q15R62J149p81j449N38J085k36j260J48J291K40j471r7J317K87q15k93
3308c18P14K4j28o52M81M24o08j46k41R75K53r63O08j37N13j29o57l95Q02J05
$$ y = [-225, -749, 525, 1256, 29, -1191, -62, 1367, 149, -1314, 127, 1227, 629, -789, -34, 1558, 763, -384, -103, 844, 1143, -328, -695, 520, 741, -82, -440, 480, 991, -46, 53, 295, 846, 659, 213, 182, 255, 353, -243, -260, 254, 382, 6, -417, 368, 763, 309, -284, -45, 817, 211, -808, -251, 398, 78, -721, -691, 364, 179, -555, -409, 602, 409, -1099, -497, 691, 137, -1236, -453, 537, -8, -1723, -1101, 765, 478, -1563, -586, 1064, 748, -1147, -844, 1107, 753, -1404, -1650, 738, 907, -1415, -1589, 734, 891, -1268, -1242, 681, 1296, -564, -1394, 275, 887, -364, -1752, -242, 884, -356, -1668, -366, 1268, -118, -933, 29, 1178, 397, -1052, -514, 571, 335, -925, -777, 514, 754, -717, -814, 503, 790, -25, -318, 396, 420, 292, -360, 121, 545, -63, -209, -450, 525, 778, -185, 423, 286, 799, 670, 13, -382, 420, 525]
3328E25o07n03O17P28o32n32O28J091o93r41K72J486p05j249M21J158q40q80P04
3347D8R45p78j051P90P74j88j376J195J196j294j455J119J175j236j109P49J894
3364A398j532j484J614J509j217j727J386K104j776k151J288K029j333j923J070
3379g45K231j193k116R82K654j195k408Q67K092m47k415O42J843k70j996Q9J768
3396C83N26j622k90J335N59j182n35P76N38q89m93P27K64k58m42K03N58m55k14
3415e11J17N95l8k31P7O1Q7n29KJ34J51L5N6k27L39K84j94m74L02M98k56o09R4
3438b37P42k26j021j8J318L75j086j87R63L61j352l01J363M53j390m10R45R81
3456A273j524q28J426J312j503j233J539J273j821j067J670R47j608q89J471M27
$$ y = [525, -82, -585, 32, 760, 128, -404, 224, 1315, 622, -319, -47, 1439, 734, -515, -94, 1064, 224, -656, 48, 993, 215, -836, -46, 728, 540, -836, 359, 1555, 261, -1194, -75, 1100, -136, -1245, -496, 1398, -134, -1618, -4, 1505, 288, -1439, -53, 2051, 275, -1876, -588, 1441, 108, -1815, -745, 1486, 293, -1823, -841, 1813, 618, -1790, -923, 1169, 722, -1693, -1051, 792, 522, -1474, -1385, 383, 909, -713, -1003, 332, 891, -291, -826, -50, 488, -401, -894, -167, 97, -161, -603, -400, 158, -297, -511, -394, 201, 163, -68, 9, 70, 157, -372, -370, -236, -85, -50, 6, -221, 118, 402, 208, -266, 36, 534, 278, -331, -237, 505, 279, -742, -760, 558, 933, -153, -340, 623, 984, -368, -669, 694, 1147, -243, -653, 292, 1273, -251, -1079, 347, 1659, 156, -1077, 462, 1735, -86, -1153, 517, 1464, -144, -1033, 438, 865]
3472H65j308o80J851O34j723o80J948R57j932j252J949J133k227j343K234J335
3488A761k161j191K080J187j652j382J590J269j638j223J373J133j455j424J409
3503c24J430q70j430P71J705j048q18m2J629p99q81j13J083j15q97K05K98K77
3521F1j44p6J1L24l4q8n51J53K74K9o26K2O72k1l19j83O59L45p23n16P78M22m94
3544b5r48N37R02m81p92L39J338n97q30K24R12k66o83J19R44p5j058J3J021k08
3564C86j053K09R36l5q47l96J566K06j450J39J105J01j484j24J934n80j104j55
3582f46J317L65j834K83J656l25j352Q4J547j2j871L8J595Lj825j59J964K75j534
3601d31m44J754N85j454r48J449P20j565p58J556J71j006m19J025P21q71q95J001
$$ y = [865, -443, -1123, 728, 1362, -361, -1041, 907, 1864, -68, -1320, 629, 1762, -465, -1808, 426, 1761, -400, -1591, 489, 1676, 24, -1358, 232, 1501, -137, -1360, 13, 1146, -309, -1733, -324, 1106, 236, -1194, -423, 1282, 234, -584, -626, 1003, 204, -677, -790, 293, 178, -719, -514, -216, 61, -83, -159, -148, 176, 142, 54, -497, -344, -70, -41, -667, -645, 27, 6, -313, -496, 163, 508, -215, -731, 47, 469, -25, -973, -436, 466, -15, -807, -468, 870, 273, -557, -333, 579, 313, -370, -251, 693, 618, -440, -427, 594, 386, -667, -458, 478, 443, -404, -800, 766, 972, -478, -339, 766, 867, -617, -741, 1193, 613, -491, -646, 671, 1036, -798, -515, 1141, 816, -536, -452, 1095, 1083, -788, -750, 845, 848, -977, -1136, 828, 1103, -431, -875, 879, 1464, 10, -938, 511, 1231, -334, -1092, 464, 635, -371, -790, 235, 956, 85, -810, 191]
3619A91M90m08r17N22K53j75l30r8Q50l27k24j4j95P03O5n90k46L98K80l29m84
3640e85K72K70k1m38m3J408n12j100L36R52o0r00q9P80j49p58l59J055N9o18l04
3661h04Q32K55j03j190J005O40p26n03K76P67o41o31P27O86p03o88M46P34j50
3680B29j082N82R54n87r88N75J136p54q56P28P88m22j288O33J159p49p77O80J072
3699A033m62j112L95J004m73j200M16J595m80j146L19Q60p8r55j46J358J9j414
3717d67m2J055J67r74k28R06K55n74l25N75L09n20l20J21O20m21m26j51J079k46
3737C93o95j01N49N64o17l18L44O25n09o72N05L09k49n19k80Q22J42p33k43R99
3757C16M22q91n56O71M38o08p06O05P63m48n76K06P69k0j014K85O70k33m21l7
$$ y = [191, 681, 273, -644, -122, 131, -44, -374, -472, 378, 51, -173, -187, -382, 321, 386, -204, -450, -52, 228, -101, -585, -313, -43, -64, -502, -545, 863, 351, -749, -413, 539, 479, -421, -510, 270, 121, -637, -996, 59, 118, -500, -804, 28, 283, 180, -1010, -5, 635, -91, -594, -318, 449, -192, -823, -96, 590, -113, -801, -355, 379, 229, -853, -271, 683, 96, -892, -317, 819, 65, -791, -63, 725, 303, -985, -352, 807, 58, -719, -39, 1033, 571, -541, -146, 858, 385, -815, -399, 1196, 716, -430, -111, 749, 671, -284, -430, 928, 947, -467, -509, 546, 713, -261, -489, 417, 672, 98, -227, 348, 657, 137, -183, -62, 558, 137, -289, -440, 639, 393, -302, -403, 146, 710, 93, -225, 119, 744, 235, -437, 68, 377, 128, -391, -671, 151, 293, -440, -683, 316, 738, -153, -709, -38, 400, -208, -914, -309, 454, 6, -570, -364, 405, 385, -629, -344, 326, 93, -328, -365]
3777c65M88k36m23j20N21K24k43m66M77k7o0k48M52N43p89L6j89L79l50j16L44
3798a68J06k52p0L17K39j88l11m7Q26l32n90K53O96l34r78N24P87n28l59J79Q53
3819F23j94o86J19O01Ln72k48O55K67q77k11O23M42m82m99P99O8k26p54N24R55
3840I30p60o33L81N00J13j114J79R22O7o71k3N07N41q58o51Q10M61o86n75P28
3860A68M10q60k17M27Q17l64n83K18J77L01p85J39N46j81l92j09L16J3k71M3M51
3881B64Q0k40j95J73M10l51l40N6M75n33k89K09L72M8l59j23J92J59k5k80J42
3902a55K69q4j89Q8k00J53o4m1J80j43R7J1l9K28l35K2J73j13j6k2M51k43m92
3925d64J5K21O08q37O4O05m1m11N0K08N51r32j72P69M17o76p12R46N82q79k97
$$ y = [-365, 123, -113, -536, -656, -135, 89, -154, -620, -143, -170, -230, -478, -26, 517, -272, -236, -425, -46, -396, -512, -168, -62, -314, -384, -67, 172, -16, -327, -374, 452, 120, -470, -217, 479, 145, -833, -309, 478, -50, -409, -230, 623, 429, -257, -138, 463, 466, -106, -354, 301, 568, -309, -520, 103, 545, 63, -436, 363, 431, 205, -549, -25, 930, 170, -463, -82, 418, 531, -583, -404, 518, 585, -86, -109, 398, 939, 81, -570, 240, 701, 15, -560, 168, 578, -282, -499, -72, 745, 381, -202, 16, 193, 494, -291, -152, 394, 213, -179, -288, 28, 41, -230, -187, 264, 344, 104, -91, 82, 492, 141, -199, -143, 332, -201, -490, -281, 91, 139, -220, -343, -151, 8, -17, -297, -155, 114, 30, -159, -71, -271, -118, -182, -223, -43, -186, -89, -78, -117, 111, -224, -202, -29, -142, -158, -180, 271, 28, -464, -449, -228, 380, -457, -393, 212, 171, -240, -190, 18, 569, -363, -535, 234, 651, -25, -737, 209, 791, -88, -385]
3946c85Q35N80r23j003P64J025q69o45L78R40L8j337L78R27j36r85J09R89k12
3965D68j047L2R90J44j030nJ185l90n66j82P19J83n62l92O30K55l61l85M58K17
3985C61k0l75k65M50l01J79P9K22J46k19k43J1j0K0j14K8j79N63j03l92Q7M73
4007C98l24j71Q1o5J92m10K2J26L8n8j19J73N4j29j72M96M0l86Q2M29k57n46Q6
4030d20M25K21n25o5M16j16n76M17N96j29n54k56R03n25n35n0J115j46j054L10
4050e48J010J59r75o89J311J77j106k48J074O47j163r16J455N22o42p89Q07O43
4068G29p55j010J110Q91r75r59R12O93n59o46M50M16k30n79M82P41m73l47JN72
4088D64m03m08M90mj56l28L05K07j34K79j12J54l05r0M60j33k11j24M70j95p66
$$ y = [-385, 450, 1030, 107, -896, -132, 893, 24, -621, -243, 697, 735, -602, -224, 703, 567, -418, -309, 680, 468, -579, -547, 443, 587, -443, -448, 737, 347, -219, -401, 318, 501, -61, -453, 177, 432, 71, -314, 144, 361, 341, -34, -299, 151, -150, 29, 108, 330, 476, 257, 14, 25, 15, 35, -79, -51, -230, 333, 230, -162, -75, 398, 74, -97, -16, -81, 111, -299, -277, -151, -113, -171, -290, -117, -63, -192, -364, 132, 172, -214, -132, 297, 40, -506, -420, 5, 226, -299, -364, 52, -64, -640, -223, 373, 244, -310, -566, 337, -188, -723, -773, 342, 196, -858, -548, 462, 621, -354, -1043, 268, 445, -661, -909, 165, 812, -351, -1267, 188, 710, 68, -721, 86, 729, -26, -1036, 74, 965, -10, -969, -57, 636, 77, -569, -119, 297, 67, -512, -30, 711, 238, -109, -108, 464, 61, -347, 143, 139, -17, -345, -40, 167, 33, 312, 200, 354, 49, -41, 419, 286, 75, -49, 421, 226, -540]
4109e40N70K30k75k58M65L03l26k06L44K99k86m02N2Q12o60l93K65N20n48l28
4129c62L22M61l00l36J12M84n00o0j04P32p58k08L17L88p6n37L42K93m5o54L79
4150a10N10o93j30K35M49l64m06K83M83J50j256N52R01k17j130L95P60j49j071
4169h08M25R85l69j148P8J283J49j346k8J220K49j008k74P71M05r24m08R35L22
4188E09r06n76J009N63r66J76J01L19l46j01M62O7l62j77K99l8k77M12j26r4J07
4209E5L91l24j26j14R7L86m53j00K69K48n19k3M81J19l03o30P59L7j19n83P17
4230B65M81r71k07Q85k54j70l76N90K54m70p9M56K92p47J02L05O1l5p62Q54j06
4251C68o38j88P75P6j67o00P11l1n49j24Q45J7o41p1L15N42p21o75R18M58p49
$$ y = [-540, 30, 260, -15, -273, 192, 495, 169, -37, 307, 606, 320, -82, -30, 782, 122, -271, -6, 514, -34, -362, -40, 421, 121, -215, -103, 381, -119, -179, -283, 449, -309, -517, -200, 188, 112, -425, -83, 210, 165, -489, -110, 400, -293, -423, -188, 261, -103, -509, -226, 257, 407, -849, -297, 604, 387, -743, -348, 412, 263, -808, -383, 602, 233, -915, -837, 446, 595, -751, -779, 441, 690, -318, -592, 179, 584, -340, -748, 187, 509, -397, -973, 36, 599, -367, -191, -90, 229, -117, -218, 244, 311, -51, -228, 71, 33, -244, 168, 42, -52, 55, 446, 122, -4, -118, -21, 365, -88, -188, 81, 329, -190, -213, 268, 387, 84, -546, 213, 250, 131, -452, 265, 746, -225, -432, 453, 199, 29, -347, 243, 497, 27, -52, 404, 696, -51, 51, 356, 417, 382, -380, 474, 368, -270, -458, 317, 393, 226, -374, 337, 306, -243, -367, 478, 495, -146, -217, 98, 640, -81, -756, 162, 620, -129]
4272a29k68N15N63q21l26J28R66n57o91L26Q23m27r04M42P99k45r90K33J007l1
4292D13j033N79L10k83o40K32P64j32o57k5O70j83j28J03QO4J6r4J10k51k11L30
4314c8l71L86L4K18l34k78K34K52qo04M94K28J6j80k68M21k17j25J74M02l90m67
4336d21Q5O30J51o94K49K28R0j76o9K55j62m11j48P01j95j02j39K33L28m97K12
4357A48J31q1j54J01K51L6n22J14M31k45l74O5L85q5m47K30M43l93k47P3K40M29
4379E29p62K93qK22l52j44K21N97n43m00O13J93m08l40J83M13l88Q0j05K85j11
4400F8m26L56J19J9m57r2M58k76K96l8j38K60r1m57M71K52n43J27J06j0J83j79
4422Hj18L33m69K28k00L31j07J4n09N07K83k23k23p7K65j6l02O2K51m0l5j93J62
$$ y = [-129, -397, 118, 681, -140, -466, -338, 628, 71, -620, -294, 529, 102, -802, -360, 439, 194, -796, -563, 444, 413, -620, -41, 269, -14, -654, -422, 342, 210, -447, -472, 198, 15, -113, -10, -2, 62, 78, -16, 94, -157, -368, -38, -409, -23, 11, 229, -105, -383, -149, 103, 95, -509, -15, 213, 229, 49, -219, 202, -15, -140, 34, 436, 46, -421, -336, 294, 445, -249, 0, 228, 318, 142, 73, 328, 166, -245, -393, 308, 113, 11, -128, 105, 433, -64, 148, 279, 198, 44, 145, 396, 432, -90, 24, 455, 210, -164, -99, 286, 201, -246, -16, 427, 34, -213, -140, 100, 529, -233, 60, 52, 274, -78, -222, -1, 596, 53, -347, 266, 459, 51, -289, -106, 307, -81, -1, -106, 179, 68, -358, -2, 117, 136, -321, -413, 45, -231, 65, 27, -111, 149, 58, -399, 72, 324, -219, -92, 14, 4, 187, 8, -110, 223, -246, -18, -218, 113, 6, 20, -489, 18, 301, 78, -145, -222, 43, 27, -275, -213, 38, -2, -37, -230, -68]
4445f8L56j93m85J41L25l22R3J47K5p1k24L09K36k24k59J27J86P1l90K27J21j25
4467Cq8J05Qj08L5R8L76o01K48oN7n5j14K62J39k66j8K02k00j86O5O2M15q9k82
4492F2k52M81j82j11J05j25N37o78L7K25J1j74j52L47J41j13o74O86J45n1o09
4513c44O9M32P3m19J09M78k48j58l50N36P2n91J82j8J76J45n08M12Q3J7l45n9
4535b56M08o8o79L28K18J49p3j35M20l02k24j30k0O60k49m37J02K34m9k90Q1L62
4557E0l34Q9%N7Q7m30K07L23J99m16K30l08K36n4N0L14k56k31L53m66K15k24O10
4580C01k66R0j90p6R9M9R7p6j34k43M18K8J05j98J13k56K20j70j7j58M09L5o1
4603A19j01q3M15k42j85k83N22K4k06q6K65K74l68k71L06L32m26J06k62K15K52
$$ y = [-68, 288, 95, -390, -249, 76, -246, -153, -6, 19, -52, -276, 33, 269, 45, -214, -87, 99, 170, -220, 7, 128, 3, -85, 20, 28, -80, -45, 53, 429, -172, 76, 70, 127, 72, -42, 220, 359, 93, 75, 277, 77, -109, -44, 18, 433, 344, 62, -190, 291, 109, -2, 103, -22, 515, -163, -126, 99, 110, -64, -216, 131, 272, 159, -515, 171, 316, 265, -344, -275, 157, 230, -189, -80, 398, 150, -8, -358, 178, 250, -341, -159, -177, -1, 144, -364, 48, 131, 148, -197, -256, 152, 84, -595, -267, -49, 100, 27, -108, 312, 10, -214, -344, -364, 296, 47, -390, -288, -54, -103, -393, -312, 50, -284, -195, -195, -138, -51, -481, -274, 49, 248, -168, 62, -246, -10, -64, -14, 300, 44, -187, 166, -300, -85, -309, 301, 35, 125, -65, -141, -42, 7, 104, 28, -106, -349, 69, 97, 202, 4, 117, -139, 81, -89, -106, -264, 145, 180, 119, 18, -65, 350, 108, -77, -360, 162, 186, -20, -106, 159, 433, 65, -206, 100, 432, 6, 112, -150, 65, 317]
4624C17n61J71O32l88k26l6M04j59k26J54L68n9o31J59M84l13q0m33L70M61k46
4645A62m82L39L62k28k14J90L38r85M34n9M27l74m5J80J36l51j03Q9M35m24L21
4666A48n8j39k28j16K72M6J3j84J41j06M7M5L02j78m02K96P4l21J80k29M29l7
4688ej19j47n3L19l17M92M3k74k82N3L81m22K68j70L10qk84J29L79k46j12j27
4710a92J24k34O6M10K70n55r9L12J3l26k01M18M09k94j76L3K90l30o4L14k5o8
4732I5o95O00M87m71n93L94K97K8k98K30N28m37m29L26L94l73n80K35M04J82l64
4753d0N2K39L45j082L26J64R2k13q5N32k25j82RJ61P9j3l83J86L42l49pK41l8
4776A51j18j33P3M5j27L33k20M0Mj60K57k55J59k4K77n28O5M44O7m57J98k8K27
$$ y = [317, -244, -73, 559, 171, -55, -91, 313, 154, -72, 82, 450, 391, -240, -81, 403, 90, 10, -423, -53, 408, 162, -320, 19, 381, 153, -61, 129, 467, -518, -84, -143, 284, -90, -135, 45, 181, -170, -273, -184, 251, -173, 148, 90, -49, -277, -393, -121, -75, -62, -246, -105, -211, -164, -119, 183, 5, -397, -101, -27, -348, -168, -397, 32, -5, -124, -271, -324, -5, -322, 170, 213, -61, -343, -290, 91, -331, -63, -233, 77, 69, -215, -86, 293, 47, -65, -192, -68, -302, -236, 174, 444, -111, -210, 102, 115, -211, -412, 6, 415, 121, -55, -22, 268, -62, -126, 188, 163, 95, -600, 0, 487, 16, -577, -183, 114, 142, -156, 74, 602, 165, -264, 62, 456, 83, -497, -262, 142, 324, -40, 12, 251, 596, -486, -160, 4, 96, -117, -202, 330, 105, -77, -68, 93, 172, 159, -224, -38, 304, -45, -52, 189, 151, 33, -100, -27, 18, -109, 224, 4, 44, 48, -112, 145, -110, 49, 25, 302, -226, -161, 283, 350, -107, 91, 63, 290]
4799B90n78Q3L80k5j29k77J69J74R4n99N07j04l56L76j09j97J47K71j75J31l5
4820C8j58K74j28l14j30M62k17N6j10M49j30m15j4M41J4l29r3L81J74m48j49N95
4842B49r4k82k59O30L2k19l83L35J60k33k13J21L31j27k69M12K56o06l7M47J96
4863D47l60m36J10N37m0j53o8L84l90m17M02L10j95l54k5N00L4k38M4J02J12k47
4885E9k5n5J35l02L25K41k44l6J6K22m38O3J63M52q12N2K49j20k7j79M32j77o0
4908f6j05M15R6o46M47j91O5l26K84J12j95k2J80K57k76k34k0M28l88J25k12O87
4930D15o38J57N6L65l83n13N20J56l96j77L69J67On60J38N11p0n72K75K29r6l60
4952d01J11N91j86n88J35L12%l10n4L60j30j6K0K31J18m29k1K94J6l36L58J2K25
$$ y = [290, -288, -205, 175, 150, 21, -256, -87, 87, 181, -418, 89, -15, -371, 5, -104, -301, -154, 117, -58, 73, 38, -120, 154, 26, -288, -418, 44, -173, -117, -227, 222, 92, -323, -337, 104, 118, -211, -304, 77, 251, -197, -346, 249, 155, -127, -386, 244, 276, 57, -326, 9, 169, -64, -277, -156, 175, 48, -221, 191, 447, -159, -196, 251, 447, 87, -349, -239, 298, 258, 105, 37, 421, 31, -386, 16, 326, 131, -223, -248, 252, 286, 48, 92, 194, 306, 59, 34, -21, 114, -188, 137, 378, 134, 98, 114, 336, -102, -39, 124, 576, -236, -184, 65, -55, -82, -261, 171, -6, -66, -171, 244, 340, -306, 141, -50, 15, -311, -27, 85, -110, -132, 48, 305, 29, -205, -225, 203, -185, -60, -272, 415, -223, -66, -10, 355, -28, -541, -21, 135, -261, -438, -69, 98, 104, -456, -318, 193, 123, -449, -174, 55, -41, -401, -290, 301, 115, -473, -338, -26, -26, -336, -390, -30, -160, -176, -156, 75, 193, -236, -257, 37, 53, -283, 75, 87, 312]
4975C12k50l3L45l57j43J99j21J1j95J95J68N2l11L13r4J84Pk83L19l93o6L5K73
4998A67j59r9L14K87l67j80L12k13j22P6J34j27k4k49M38m02K14j01J28j26J94
5019I5m7q6K2k13J24LJ94j88k63L48n2L22l91L50np0j83j09m6J58l03O12l26J68
5043A14k31oK47R3J01m35L1j21K48j71J59j52R4n0J44k66L3J72J74j03k02j41
5065b68K37J8j69J52J78m98J46K21K3j88J98mk1o9Rj99K75Q4k89K04m6K83m31
5088a54K25J34k34M1k85J45M35n54K17M2J95m03K82n3j97J72j56J88l5j67K40
5109G8k24K56J91l28J76l0j79K44n17R3M77j41k70J97J06p8j26O3N6j28L19o4
5131A71j19N6J1o0j7k9J61k44r2J80j36J01O8M0j6N7l19K21L56l02P4k7J08m38
$$ y = [312, 62, 29, 374, 17, -126, 73, -48, -37, -232, -37, 131, 183, -128, 185, 91, 275, 282, -1, 318, -75, -141, -106, 167, 8, -91, 223, 510, 143, -37, 275, 62, -60, 16, 150, 23, -1, -250, 188, -214, 0, -101, 27, -99, 95, 48, -38, -16, -229, -105, -102, 92, -96, -359, -11, -63, 259, -132, 218, 213, 143, -40, -149, -195, -37, -340, 272, -54, 114, -117, -123, 124, 217, 318, -117, -86, -207, 41, -130, 29, -123, -29, -79, 65, -201, -168, 4, 178, 75, -127, -268, -31, -13, -182, -30, 148, -350, -204, 17, 40, -148, 50, 46, 25, -44, -35, -234, 41, 125, -164, 40, -6, 277, -154, 71, 205, -29, 12, -273, -128, 307, -247, -30, 12, 207, -196, 86, 33, -164, 8, -148, 40, 5, -162, 78, -146, 110, 301, -27, 149, 119, -60, 184, -333, -240, 237, 96, -174, 23, 129, 51, -75, -12, 44, -84, 235, 171, 52, 108, 119, 59, 42, 13, 174, -70, -162, 18, -118, -17, 51, 91, 75, 132, -187, 34, 390, 88, 162, 135, 243, -195]
5155a95K07J1L47o87L52r1J15k44K89j49o0K46k06J29O0m20J10L59k20M7j91L79
5177A88r3j30R2NM75l98k76J62K12j85m66O77k44J9J65m23J97j71K20k95L77Q
5199A16O6n33M22l9j46nj06L92l30M2L0K16k39J3r3L80m5l10J56J47m2K06l86
5222h8R6J07j18j65K01Mj54M2j5K86k1k14K60K6j86J2O1Mj22j07L47l42K95j34
5246G5j60J89l39M23j91k68L57l42K59K62l95K46j07n2Q5k53j5L0M39j9j3m7M
5269A68l1j9N8j01J32q1o0J86o81L50J08J75j69M1l03L28j55K9q4J19J48R6k08
5292D6j51R6j61K00m7Mk44J10o8K24j3j8j17N3L71k16l31O2O17l23m00J31L79
5315B04R0m52L62o6J6n58J10L00k22L3J19K76n52K44m2O7K92k08q3R0k4M5l90
$$ y = [-195, 12, 23, 370, -317, 35, -56, 59, -185, 104, -45, -105, 141, -65, 64, 124, -296, -186, 173, -47, 0, -191, 188, 95, -35, 57, 62, 537, 139, -137, 25, 237, 52, -414, 263, 19, 38, 203, -220, -23, -194, 26, -269, 108, 116, 182, -351, 71, 32, -114, -119, -225, 167, -163, -121, -91, 125, -114, -101, -194, 186, 141, -169, -13, 134, 92, 298, -88, 8, 115, -3, -168, 33, 37, -117, -75, -90, 196, 175, -39, 221, 247, 61, 73, 134, 138, 16, -91, 256, -86, 209, 75, -85, 104, -235, 188, -3, -271, 86, -256, 3, 265, -130, 116, 9, -43, 42, -211, -226, -196, 243, 224, 211, 164, 168, 137, 118, 176, 75, 207, 126, 66, 252, -429, -79, 29, 204, 35, 76, -227, 101, -54, -25, -109, 10, 158, 254, 46, -105, -9, -170, 30, -17, -13, -257, -147, -215, 9, -4, -22, -139, -86, 285, 69, -262, -200, 417, 94, -306, -175, 204, 294, -158, 204, 138, 154, -404, -294, 6, -216, -183, -64, 212, -340, -96, -138, -71, 221, 13, -70, 20, -4, 41, -349]
5338c49K85n7J71j99QJ37O7N3Q0N4l75L59q1L7j94J64k47L30m87R8L18J4m29J48
5362i5J48L23m09O3K04l57k28Q82m79j97j2M01Q7n66N67l71m1M4J73k02L54j83
5384A06J04j51N6l41L30o6q2n4lL77m9o01L89K01l60k36M48K34l04k5K97l24L54
5407C00k31l56L56K12j96k73N00L7n32m6M29Ok61n2J27K08l36j18L61m9o1j26
5429a01K61J38k24k63K20j64k48J26J24Q9Q2l4J29J29m93M28k91J26k20l7M0Q2
5451a01J65k19J27J95l01J63q6R7j6k23L74k23j08K43m8P5m92J19O0M7j27J24
5473a55J95O1l16J97J2J9K04j40k79K62l71J48K9J41pj32M52k87l2K53j96j11
5495e3J36m0J00J85m36J82j9R5j88J48q7j37j54M85k21J56k13L11J12k29q6j18
$$ y = [-349, -64, -121, 50, -149, -141, -4, 63, 116, 196, 250, -125, 234, 153, 190, -4, 160, -87, 243, -244, -146, 172, 186, -243, -95, 53, 376, -33, 30, 234, -123, -351, 531, 52, -145, -157, 244, 331, -235, 332, -39, -80, -36, 137, -65, 289, 106, 210, 59, 115, -226, 104, 38, -44, -98, -101, 276, 227, -374, 15, 216, -144, -380, 68, 302, -2, -27, 270, -54, 300, 69, -287, 69, 281, 85, -188, 312, 349, -183, -229, 200, 206, -55, -107, 20, 228, -108, -226, 135, 86, 25, -101, 160, 298, 74, -189, 31, -133, -381, -255, -131, -42, 40, 6, 135, 264, -229, 199, -92, 34, -186, -223, -183, -101, 64, -155, -28, 167, -134, 29, -57, 40, 24, -199, 175, -48, -156, 87, 39, 114, -378, -259, -199, -152, -279, -155, 40, 101, -215, -18, -6, 13, 217, 77, -202, 60, -311, -163, -134, 7, 0, -132, 320, 33, 1, 254, 58, -53, 83, 43, 143, 328, -108, 74, 55, 150, -38, 110, 23, -114, -268, 217, -4, 152, -61, 250, 362, 133, 47, -71]
5517g1K71R0j82j84K60K94o82M01j47M4j8k51K38O5l9j68J17K27m75M49J9k34
5539B4n9n4J93k26j11lL28R8k44J76m2l73M44k11M5J20Kj7L0k84J16J83k35J64
5563F4j38J9J69j1Q6k15k29O0Q2p4j02L91r2j17J58l34P3K63j79K03J18r7mk84
5587a90L70j76p3R5k74M48p5K32n05L5l22L75l25M52j54Q2k69M9L27m21K52R1
5609B4j39J11J30j7K14m19J65K18j12j80j00M36m00r9J06J99j68j15L5N8L16k32
5631C1k70O96l48q0k15K93J01Pn25M08K32m34J7l8L68l59J5M00j14j27J10k11
5653d3K00K23k89R3M7Q6l98O7J51p2K69m30L99l41j49L22k56JJ73j19r7K81j38
5676b0j5L44o47L42K03l25Q6j85K97j86j14M17l8R3n06K64Q3o1r1j67K42k07J40
$$ y = [-71, 200, 290, 108, -76, 184, 478, -204, 197, 50, 94, 76, -175, 63, 128, 89, -79, 38, 265, -210, 239, 258, 24, -35, -89, 104, -122, -233, -236, 92, 190, -54, 122, 80, -293, 151, -60, -15, 105, 107, 90, 120, -164, -48, 135, -100, 64, -74, -55, 114, 103, 189, -26, -255, -195, -113, -187, -289, 102, 10, -107, 51, -283, -210, 53, -126, 77, 195, 98, 94, -190, 180, 4, -69, 26, -248, 200, 125, 357, -148, -113, -435, -60, -385, 67, -87, -5, -274, -225, 102, -319, -67, 24, -115, -4, 126, 109, 323, -96, 69, 287, 175, -5, -105, 331, -69, -168, -62, 137, -31, -146, -111, -53, 263, 31, -239, 457, 109, 29, -186, 107, 208, 215, -310, 98, 330, -104, -87, -125, 243, -116, -101, 299, 185, 58, 168, -43, 157, 380, 91, 184, 231, 317, -81, -14, 137, 65, 334, -96, 303, -38, -187, 135, -121, -120, 53, -66, -163, 118, -20, -35, 309, -338, 4, 207, -118, -32, -217, 80, -106, -220, 197, 159, 252, -254, 10, 93, 32, -59, -226, 16, -191, -51]
5699e1k69K20PN2K5p0j1J09R0r3j52K26m1J68l28K34L4r3o7m50K98L73l79LN11
5724C46l80PL4k19K46Pl54J51M24m36j20K65M1N5j28o9K49k31j38L79q6k66L38
5747A15O2O5j82jM7J30j71Q8n15L58L61m04l7R5j27K95j33J86l5J00n7k68n5J10
5771B7J30j65J15R9J21m34L05k61R8j3j31J56o1J35j13J50M9n11K31N2L1m3l46
5794c79L33K22jj73j13R2r6L57k84K5p8J5k69K10K29o8j74oK67k77J68l63N50
5817A87j53k06M74k54Q3k8J07k33k7J94j73J57m07N3J54N7l7Q1q5j3J47J58J37
5840C73o01K83p2j40K8K93k88j08n0J01J16q5K20J75l64o4L07k5j83K01k14P2
5862b5J20k37L95l05j75J08J32k07l9L78k63J46J6l8j25L49k62J41M5j11O9j30
$$ y = [-51, -320, -100, -93, -41, -16, -86, -97, 12, 102, 9, -143, 83, 42, 210, -118, 116, 150, 57, -10, -460, -162, 211, -168, -165, 346, -34, -27, 7, -212, 34, 41, -313, -162, 262, -174, -294, -29, 12, 67, -61, -130, 119, -112, -250, 129, 43, -223, 115, 177, 242, 60, 59, 106, 236, 65, 153, -362, -4, 357, -47, -84, 11, -116, 179, 46, 232, 197, 297, 240, -28, -83, 27, 157, -8, 107, 206, 327, -107, 198, -63, 35, 22, -109, 47, -14, 121, 8, 158, 207, -304, -73, -21, 10, -33, -379, -46, 176, 175, 2, -111, -19, -115, 242, -42, -17, -95, -80, -349, -139, 90, 22, -152, -158, 109, -168, 0, -363, 187, 34, -172, 302, 48, 131, 103, 210, -23, -50, 144, -29, 128, -279, -226, -72, -15, -52, 29, -56, -69, 78, 236, 373, -228, 55, -17, -157, -129, 164, -124, -232, -282, -181, -65, -150, 70, 245, -119, -183, 124, 99, -84, 117, -97, -25, 95, -142, 253, -52, -227, -119, 13, -194, -233, 145, -118, 28, 44, 6, -119, 230, -32, 109, 154, 43, 112, -18]
5884a8j02R2J83j00L0k3J44J38l27j03K11m9k44P2J42J68l26N9K7O8L24k36k10
5907h0o7Q3l7L78l79L12j86j13J76k60K56j2R6l42L02j64K61k06o4j39Kj10L23
5930C0N8k67K00l3r3K89j85N2k01J26J05k25K43j54j33L08j87k10M48k82J73p7
5952a5q6M9M1j9j57J06Q1k54J08q2J07Q5k6M4j36m6K32Mn2QL77l34k03P2L2k45
5978c09K14K40j04R2jo8j9Nj25J47j48j85J68O4N3J08j62l7L9N2m7l0L6K45j25
6003A03N8l00R1J70j56P6k94M00k26L96j41j46K38k21J27l27K02j89P1m6k3j99
6025c36M10j36J7J70q5J66j81K75m5m36J41J3K40j30k64M34k96J69MJ9L6j27l57
6048b99K23L15j42k37L27R1r7J39l70n2L46k22J14j94OK3O7p1R5J41l06Q9r4J33
$$ y = [-18, -120, -28, 155, 55, 85, 62, 206, 344, 17, -86, 125, 76, -168, -96, 46, 214, -112, -53, -26, 42, 366, 130, -80, -147, -64, -101, 277, -102, 210, 24, -89, 87, -173, 83, 71, 167, -175, 127, -37, 224, 18, -46, -185, -183, -293, 30, 88, -179, 21, -12, -105, 184, -1, 51, -150, -24, 81, -144, 99, -55, -188, 120, -67, -277, 171, -111, 62, -15, -101, -52, -11, -30, -187, -81, 0, -254, -146, -228, -121, -36, -62, -18, -154, -200, 32, 36, -16, -8, 369, 35, -168, -96, -64, -309, -95, 145, 41, 133, 132, 64, 45, 50, -75, 72, -76, -261, -93, -29, 24, 132, -30, -67, -28, 24, -23, -53, -17, 228, 103, 161, -139, -48, 122, -34, 42, -252, 148, -78, 318, 177, 31, 269, 48, 175, -152, 50, -139, -68, -114, -137, -336, 74, -62, -45, 125, 40, 206, 25, 300, 255, -181, -40, -27, 213, 83, -181, 253, -43, 126, 130, 149, 185, 58, -299, -76, 239, 97, -140, 187, 278, 181, 320, -50, -102, 244, 22, 136, -58, -52, -29, 38, -33, 62, 203, -103, -14, -108, 25]
6072B5R9M5k53j28K74po3o7K6P3L2k07K25j06l42M21l36K42Q6l48K34J63l0j15
6096e7L1Q5j45j22K91J82r8k89J47p9k09O5n8L94k35j29J64R1O7m9m2K5p0Q5K61
6121C06m2m06r1L56J12l87M0J41J19k65k0J24K9K68l30LK16J65j18l1K8k70K10
6144A57m01M14L5k92L6J81r4j44O1K43j47j42Q0J65q1j41J40J02k23o2L15j71
6166C1L33j05j50j96N3K62k38N2k39L59q8j13r5K51q0j8r6L3K65k04l09K72K9
6189IL3j96o6M30R1l02j52P2K74j88j03L89k72j10R8J46j35J58m31K12m3j46J64
6212f8J39lr8k43K30L72m32M00n25J78L31l86J96k7L7j17q1j42J97K3K07j20P5
6235A43m03M68j0k43K68m65L23m01K47j50K25J21k8j18J67m26K20L25o9j5l13
$$ y = [25, 124, 169, -84, -212, 62, 55, -8, -75, -49, 24, 56, -151, 74, -32, -374, 47, -289, -47, 39, -309, -75, 88, 58, -57, -26, 59, -86, -208, 83, 265, 167, -122, 25, -54, -263, -198, -256, 138, -97, -226, -62, 29, 96, 47, 5, 30, -40, 45, 306, 264, -142, -233, 123, 235, -152, -112, 29, 148, -117, -137, -13, 16, 284, -46, -43, 173, 338, 220, 189, 217, -53, 157, -244, 170, 205, -87, -51, 130, 36, -108, -47, 196, 49, -93, -13, 152, 71, -70, 70, 172, -51, -113, 202, 31, 364, 259, 109, -87, -34, 228, -10, 42, -197, 162, 74, -39, -134, 117, 37, 19, -77, -44, 221, 17, -292, -20, 9, 42, -154, -220, 210, 301, -1, -153, -81, 193, 5, -98, 291, 19, -91, 7, 153, 18, 176, -255, -43, -86, -232, -68, 71, 68, -30, -273, -43, 329, -103, 297, -228, -50, 281, -105, 91, 64, 101, -16, -97, -239, -42, -19, 188, 68, 143, -260, 208, 198, -45, 223, -242, 81, -320, -73, -223, 2, 123, 95, -23, 144, -282, -62, 263, 194, 179, -134]
6256a34J40q2J65j0l68M79k72k20M97l46J6L36j8p8o6r1K62j62j73K56J50o27
6278c46L24L03L46n58j72J58L4j75M4J71j1J27j51J77k28R4m5j79QJ58j9k5J84
6301B19k97k81N75j35j13J26J60l88L2N7K52q3j21Q9j77J01J07k15k2K26q2Pj77
6324a40J94j68q9K00N3J47m61J62Q1N9q5j51m8j1j1K70O2j81J04K5J04m33K59
6347e8J51L7j69K7J17j79j32J28J28J24l50N4N4K53q5l94J93J90l26K73K32l66
6369i8J25m16M17K0J96j40n5J10Qj05J55k58J12l81K49l5J28j4m2j7l6J34j23
6392f6N9n2L5j2P8r0J38j19L02m62NP1J80j34j02M70k79J85j34M3k36K75j74P9
6416F0N0k28K34m39K90L4L8q0J00K91m07q0M08l45j26J05K71m71K55qK3j23p4
$$ y = [-134, 6, -76, 89, 79, -289, 190, -82, -302, 195, -151, -135, 201, 183, 105, 39, -52, 210, 48, -125, 131, 281, -346, -22, 281, 627, 69, -103, 55, 89, -86, -42, 129, 118, 245, 94, 271, 43, 137, 92, -87, -79, 79, 60, 35, 219, -78, -359, 216, 81, -32, 94, 254, -134, -102, -45, 207, 124, 3, 92, -85, 16, 123, -92, -114, 112, 30, 37, -140, 54, -114, -203, -3, 50, 197, -264, -102, -21, 38, -47, -198, -246, -257, -268, 2, 64, -117, -13, 12, 116, -317, -58, 93, 130, -39, -12, 105, -74, -206, -78, 50, 174, -176, -122, -68, 185, 100, -294, -101, 89, -237, 36, 268, -98, 27, -389, 28, 48, 244, 104, 49, 159, 167, 62, 217, -41, 71, -310, -61, -96, 32, 18, -24, -41, -77, 57, -66, -7, -59, -24, -36, 42, -48, 90, -29, 273, -189, -184, -113, 67, -67, -169, 301, 22, 207, 73, 116, -120, 155, -19, 60, 110, -118, 116, -323, -33, 1, 39, -41, 59, 350, -57, -137, 271, -74, -200, -95, 176, -295, -40, -48, -25, -148, -222]
6439b22K23k17L53l03P0N4M40l48j28p8N6p0J8L51K44o86K97o2J28j64K62j14
6461A04m42K04K12j08P9L32m43K91j36K24k14k35n0J04J63M8k85L57k20k9L54
6482C10n40N7J42N8N4j18j42K12j15K26O3l13J67Q3j18j32J52m58L24L34j73M8
6504A21q1J70j91J6Q5l44m5M80j37k10M51k14K4j26p9J77k17l02M87J45p2l61
6526b23L25K25j17l75L3R5L24k00J0J40k71K91m55K27k6j62M9l5j6J95J32j89
6548b3q0j44K70k5J8M5N0k28M02l93K02j46K57K24l34k87L11j95J26Lj0j04j25
6571a86M45l04l4j03j0L95J46n82R0J17K86l83N9J52m60K89J39j12K4j37K79L6
6593A46Q5k36k9N3j58Q0j5K37j98J45J69k89K00k18p0j8Q0j93J70j80N7M34l02
$$ y = [-222, 1, -216, 137, -166, -96, -42, 398, 50, -78, -156, -100, -170, -152, 199, 443, -243, 54, -8, 120, -44, 218, 104, -338, -134, 78, -30, 49, 381, -62, 229, 93, 317, 103, -132, -182, -78, 85, 133, -152, 205, -15, -44, 310, -230, -173, -31, 27, 81, -37, -179, 33, -82, 144, 207, -106, 61, 144, 26, -106, 46, -412, -88, 246, 73, 121, 40, 210, 19, 35, 120, -224, -269, 211, 74, -136, 315, 101, 125, -1, -80, 97, -120, -422, 65, 210, 138, -223, 102, 327, 210, -165, -132, -37, 287, 87, 97, 237, -34, 257, -198, 29, 3, -159, -110, -145, -161, 34, 166, -23, -103, -247, 23, -2, 16, 61, 111, -117, 285, -108, 94, -52, 205, 429, 95, -192, 119, -76, 50, 53, 43, -61, -186, 259, -45, -79, -182, -192, 203, 349, -233, -143, -26, 260, -123, -64, 88, -372, -83, 56, -56, -32, -169, 110, 146, 231, -5, -34, 19, -139, -59, -74, 163, -35, 110, 279, -10, 190, -28, -98, -116, -36, -229, -59, -239, -182, 252, -50]
6616e0l6J39M8L6j95J08j38K79l2J3k02J74k75M9J66j26j46J50K73j37J58m76
6638b20M06j57j79J85K5l63N06l3o5k87M64k28P9j27J00j16l3J85q9r0m9l1L13
6661A96l23L5J76p2P8k12L99j34r3j52K52K2j82K55k12K31k27R2m48N19k00j36
6683a36r8O69k66j31Q0J12k14k53J99j1L09m84L23l93K07n0N9J44k26K67m3j88
6705a24K50k98K54J55k41K8j83K24j15K44k81Q7l64L99P5J88o26M12r1j56J36
6726b7q1J85K1m5j91K33k25O2K2J67k55K37k43L8q6J83j86M2k1Q8K29j09p6K01
6750A63r8k61JJ98Q1p1N4k11K03pj62Q9P3r8K5j97K74l94Q70n00n9K04j4l05j32
6775b74L25m2j37j78J64K96j83O0K6r9K96r0j0rq1J05k00Q2j22L5j82J83l08K97
$$ y = [-50, -86, 53, 101, 137, -58, 50, -88, 191, 159, 172, -30, 144, -131, -82, 84, -42, -188, -38, 235, 98, 256, -220, 186, 29, -150, 35, 60, -303, 203, 170, 105, -182, 282, 54, 133, 6, 106, -10, -43, 142, 53, -37, -86, -117, 196, -127, -92, 84, 12, 90, -122, 277, 143, 50, -102, 150, 172, -10, 245, 33, 264, 37, 129, -319, 200, 0, -136, -234, 435, 169, 38, 118, 230, 16, -237, -38, -49, 260, -224, 99, -294, -87, -137, -78, 66, -160, 107, 64, -124, 126, -172, 82, 237, -4, 24, -159, 65, -50, 194, -87, 0, -364, 35, 110, 298, -328, 84, -7, -163, -27, -108, 77, 98, 53, -138, 95, -130, -68, -46, 121, -134, 103, -140, -102, -188, -5, -191, -149, -170, -82, 147, 38, -38, 163, 65, -196, -195, 3, 84, 13, 67, -144, 59, 52, -110, -21, 52, -46, -21, -218, 56, -338, 532, 32, -27, 177, 163, -142, -274, 51, 9, -128, -306, -142, 154, -29, 31, 57, -42, 254, 164, 154, 145, 64, 169, -31, 51, -71, -36, -218, -35, -343, -46]
6799d6rN0l6k08K96P8k86J15j98J49K05r1J67j78j50M3J43K32m4k37l10J75K72
6822A32j10j77L92k62R9L6j85J19n4n3P1J42l12K23Q2k18j06K27j3m08L40JJ31
6845I7j52N1K36k58P0l3Q2j42j66k0O4K34J53P1j78k37PJ42p6l5m0RK30k06L2
6870f5n6J37K7l97q9N16j48r5L84m81L47p8J7J97r9k90J30K44j29J8j9p0O1k0
6894D2%j20K46k34l5L20j60K70m75Q9M37m74kM17k38p2Q0j73K75k77K53n83M75
6917F1J6j82M57m50j91M01K0k07J12k79L77j21k22J80j49N22n20K84j88J53j36
6938f2R7j98L69j24j36K7j43L48j50r0N3R0j48J36l9k02K26L46n53n3J39M0J93
6961A66k21n2l7K42j10j88K83J45l87K11k50K98O9k39J37N0j68RJ50L5j39q7J58
$$ y = [-46, -55, -5, -41, -249, 47, 125, -161, -46, -244, -95, 110, 19, 186, 8, -142, -99, 44, 276, 232, -5, -315, -140, 132, 22, -155, 237, -25, 74, 110, -75, 44, -10, -63, 8, 150, -162, 61, 143, -75, -181, 46, 33, -375, -35, -34, 97, -55, -4, 232, -26, 44, 11, 93, -49, -215, -235, -171, 63, 216, 287, 109, -128, -121, 21, -55, -90, -130, -121, 109, -97, -65, -121, 16, 43, -354, -443, 73, -75, -170, 214, -267, 80, 2, 19, 216, 117, -173, -43, 201, 72, 90, 71, 1, 62, 42, 42, -78, 168, -66, -101, 219, 59, 329, -146, -57, 380, -94, -96, 321, 83, 11, 91, -82, 193, -84, 169, -414, 61, 77, -105, 352, -98, -289, 112, 132, -75, 37, -242, 135, 14, -208, -28, -177, 345, -175, 109, -79, 74, -62, 35, -163, 206, 82, -54, -27, -170, 178, 28, -62, -9, 81, -67, 69, 30, -172, 54, 400, -153, -206, -67, -27, 166, -55, -107, -144, 98, -12, -200, 83, 228, -159, 52, -198, 100, 169, -70, 67, 117, -51, -42, 108, 143, 4, -83, 75]
6984G5J78l67OK49k16K00j24j99J57P4rK55m39K64J71l71L14l98O05m63K07l12
7006a43l9L58L8l03j0K16r9l14N38k55o1J62j16K61k42j6p2J98L39m91k8J22j82
7029a39N37l72k03j04J89P9J4J16qk9k56L05J05j54l75K71l2j0J64n4q9j17M07
7052B45k55L83l21kJ25k76K18J21j34j57K69l42Q2L42j06k73J81j47N4j05M8l8
7074h8m02M90j71J02N8k31J61J8K1O9M0j93K69l84J36l2J59J86m44J28o8J51j0
7097c5j53K58j78N6J14J01k8k22m16N54J5J20m99K47L1J57J69k47j22K55l74K1
7119a76L92j52l47R2L27J59o41O5J77O8L6J10m89M67M7r1p5r7L08r4J57k86j46
7142a89L63l82N9J27j40Q6K41J3k59K25k53N16l91j43K91l81N98m32M7j04KK42
$$ y = [75, 253, -114, -108, 141, -75, 125, 1, -198, -41, 33, 24, 279, -160, 104, 275, -96, 218, -180, 425, -38, 169, -143, -182, 176, 214, -89, -99, 117, 18, -296, 242, -13, -74, 88, -28, 233, -9, -25, -97, 101, 440, -51, -79, 43, -139, 398, 26, -177, -281, -92, -13, 1, 117, 109, 80, -176, 129, 234, 80, -295, -24, -56, -66, 98, 44, -45, -162, 245, -10, 373, 52, 50, 175, -101, 117, 238, 104, -53, 216, -126, -44, 298, 192, -81, 100, -47, 7, -98, -50, -88, -490, 0, -171, -69, -11, -242, -81, -63, -42, 27, 67, -126, 143, -241, -105, -137, 22, 208, -236, -108, -176, -25, -35, -188, 70, -108, -52, 62, 163, 135, -87, -503, 51, 66, 186, -313, -66, -35, 122, 291, 44, -78, 177, -197, -176, 216, 64, -283, -191, 136, 295, -346, -281, -104, -36, 0, 110, -379, 88, 135, 44, -31, -128, 180, 86, 243, -43, -189, 174, -208, -149, -22, -162, -76, 165, 178, -81, 144, -109, 407, 16, -127, 164, -217, 381, -51, -4, -108, -106, 136]
7164A36j75K10j35j51K72l02J54P4j33O4K6J14j64k33K81R0O5k0l01J2J33N3k16
7187a46N8K3K5J23O6k41J36j1j91J73K27k41q0J68M7m6K69l78O3l55M11M6j04
7210D2P6j51j13j70K56l69K13R6p5L00P2k58K45j53m5j69K23M4j83J68k40K82
7232I1l63K63O6k24K80k90L33j54J55j65k4j15n7K06j18J49J7m1k38K97P2k07
7254f7K37j50k58J13M10j67k2k38L57l03p6K98p1l46L7K65NJ48j6o09K66L99j44
7277F8J21j03k45K74k31O9M37n46J94J28l33L71k39K33j66p5m9J33L6l85L99j68
7299g7Q0j90M05j15J80l28J83j15p2J98q9J1j14j76L30q7J0m3J0P5o0qj02lJ53
7324E6j35L74l19K8J19J32m7k72k03M35j40J24p7j14p5J61k68M9j18J84K52j67
$$ y = [136, -39, 171, 36, -115, 157, -145, 9, 83, -50, 14, 40, 154, -10, -243, 38, 128, 193, 173, -128, -116, 17, 70, -146, -88, -65, -40, 83, 149, -92, 44, 33, -158, 15, 242, 1, -79, 89, 136, 90, 359, -19, 44, -311, 100, 146, 42, 118, -33, -146, -316, -60, -429, -216, -120, -195, 105, 177, -81, 164, 11, -34, -203, 20, 64, -119, 49, -191, 91, -272, -9, 57, -167, 113, -177, 156, 2, 157, -8, -32, -147, -204, 2, -116, 33, 50, 9, -229, 68, 140, -67, 170, 20, -238, -125, 285, 118, 96, -142, 215, -88, -164, 134, 63, -283, -246, 19, 24, 172, 156, -453, -187, 212, 68, 189, 86, -159, 115, -116, -47, 390, -156, 38, 166, -167, 204, -35, 198, 32, -43, -92, 41, 77, -308, 91, -77, 3, -187, 218, 103, 283, -45, 138, 23, -49, 149, 60, 71, -43, -219, 111, 24, 34, -9, 1, 76, 16, 8, -94, -97, 56, -79, 295, -24, 4, 123, 255, 208, -64, -267, 168, 28, 152, 75, -39, -114, 47, -221, -172, -290, -106, 146, -21]
7346b1J71k83M33m58L22l15K04Q9j89j2K64j6k36J39k63J56k09J96k9Nl2l3K2
7369i5J95j03J2J66l83J21M9P2kk4M0j16J39j31K27k32jk2J02K59l39p6J8K45
7393A21m07J48J02O2P9J78k94l91K63K1J43p7r2K43j22j70L66k50n7L94j76M3
7415A27l4j6r4j70OO5J08j29P5J23Jj47J24j94k8J57O1o3j12M4J43k77Q8J16L36
7440C10o03N47m51J25J82j84J92J9j11mK1l23L02J96m89M49J29m47l3K91Kk7k20
7463a27M25n52j12N39j76j39K74j91J00J25Ll88N14m08om7K28p5l88J86P0L23
7485A78l18J39R7l6o6K55k88NM6r7j1K42k13j26M28q9m3k81l1K68m06K63J04j20
7509a00j69J64M72n01K61j45R5R7l95n9J80O4N6J26oj0o4JR9m47Q1J58k6J07j64
$$ y = [-21, 150, -133, 300, -158, 164, -151, 53, 142, -47, -59, 205, 189, -47, 92, -171, -15, -224, -28, -57, -52, -84, -117, -95, 100, -3, 9, 175, -208, -87, -38, 34, 32, 8, 48, -68, 71, -60, 167, -65, -66, -88, 14, 273, -66, -142, -124, 121, -286, -138, -36, 26, 105, 283, -11, -402, -139, -118, 25, -52, -144, 99, -23, -193, 173, -77, -134, 260, 84, 127, 93, 77, -17, -187, -181, -116, -8, -137, -62, 61, 62, -85, 39, -155, -183, -26, 35, -28, -140, -96, 47, -230, -142, -26, 310, -293, 254, -197, -72, 110, -74, 118, 137, 26, 22, 43, -280, 22, 218, -271, 178, 307, -140, -173, 118, 120, 93, -127, 298, -254, -366, 173, -3, -142, 132, -59, 41, 166, 169, -219, 295, -113, -119, -166, 62, -13, -401, -215, -145, 178, -140, -1, 96, 60, -6, 249, -39, -34, 12, -85, -96, 146, -67, -193, 235, 146, 103, -178, -209, 59, -347, -84, 20, -100, -269, -105, 367, -134, 127, -18, 77, 174, -221, -280, -100, -36, 20, 146, 140, 130, 66, 67, 166, -281, -200, -42, -68, 39, -125]
7534a25M80l39k7J97l60L01l2j36J13J14j48o8J57K35l86m2N3k21M79l89OJ09
7556b9rJ74J9l6n11L54J71o9k41K10r6P6J24J56k26M1J86j82O1N5q0k99J00j1
7580f2J00j14LK60p7p7M2n6M0N3j92K4K47k59K89n27K44J15K01l12K39j31k75
7603b25R6j4L6j27O32n97K03l31K31J43k76L02L8k15K95j95q4O7L3r2N0p2j72
7626b74K91L2j0J5l7l5L5k76J95L3j16M0M8L9J24J94p9k22k23P7K55J9l22L43
7650A46l60P6J93p3J56O5m5l19K38J24j1k40L64o41M90m51J75K07M5j08K09j7
7672B23m14Q2oM05l98J96N0q0K9l08L3L97j79P2j77L33O3k14j68j01J18J80r5
7695D1K0j20N3Q2N8m03L82k4k85K04J60N4l36R1q1N7Q3k8P5o3l68L45N0J04j22
$$ y = [-125, 355, 16, -11, 186, -174, 127, 95, -41, 72, 186, 38, -30, 127, 362, -24, -66, -13, -234, 245, -144, -138, -29, -38, 136, 155, 119, -392, -38, 133, 64, -177, 33, -63, 13, 137, 293, 67, 108, 294, 112, 173, 228, 148, -151, -51, -62, 38, -76, -73, 187, 110, 33, 75, 19, 59, 112, -80, -56, 191, -68, 221, -306, -62, 53, 254, -58, 181, 50, -225, -129, -143, -107, -234, 398, -199, 4, -327, -96, 47, -229, 73, 111, -104, 191, -4, -88, -21, 12, -80, -30, -102, -274, 17, 49, 39, 54, 17, -18, 17, -259, -64, -31, -147, -107, -59, -20, 104, 298, 219, -3, -226, -149, 106, 125, -197, 146, -214, -138, 55, -18, 138, 203, 158, -161, 77, 201, 190, -50, 314, -327, 163, -288, -113, 94, 139, 31, 240, 223, -191, -109, -115, 290, -108, 88, 138, 58, 87, -221, -188, 209, 30, 102, -75, 258, 321, 107, -61, -162, -44, 136, 41, 61, -59, -6, 76, 134, -269, 113, 89, -196, 8, 168, 222, -114, -23, -104, -47, 36, 8, 83, 20, -348, -3, 47, 151, 29]
7720B9k6n9KL39l12K73n79L12j83L66j64j46K64l76K46K7j57j2J74M2O3p6q7p
7744d7K4P9j25j81M41m03J22k8L35k87rO0k1K7PK8j87K17R3jl38J20L12j02l39
7769b03N9J76j57j23K41Q2k0mm81K75J18k06J19O7Q2R0k28n1O9mK56l32K6K05
7793E6k89K24k23L2N02m64L32j19r7J91j69pM2n0j3k47L49J09k11j36N2QR6L56
7817C24j21l34j18K02l9L2J29j03k60J95Q0L8kNR8k30J10n49P00j18Q1k11l2q2
7841b05o5J08l5O5J13M4L38k85r3J08L0o5l02L04j32Q9Mj8j7J21r9P3l01K14j27
7866a33M2J57q9p9j31J89J29j67j61Q7M1m3J9J99j01j15J98p6J23k29N8j25M00
7889A93l40K28p1j62LL8j33K98r1J1j34L32j84k91N25m59M42m56M63k51P7J1Q4
$$ y = [29, 3, -56, -54, 285, -27, 246, -333, -21, -204, 162, -2, -148, 116, -260, -14, 13, -144, -156, 18, 60, 123, 47, -40, -47, -23, 56, -69, -250, 191, -212, -90, -118, 217, -70, -79, -19, -40, -13, -6, 22, -165, 52, 145, 144, -194, -74, 238, 136, -203, -144, 32, -125, -248, -7, 75, 55, 51, -430, -155, -37, -243, -124, -57, 25, 115, -113, -164, -95, -99, 157, -175, -149, 56, -233, -9, -232, -200, 302, -162, 170, 51, -46, 145, -24, -31, 11, -39, -52, -299, 50, 159, -52, -188, -136, -128, -32, 324, 203, -131, -249, -47, -86, -54, 75, -28, -288, -93, -13, 25, 23, 28, 126, -104, 6, -543, 157, 39, 120, -91, -123, -205, -270, -162, -197, -132, -19, 25, 363, 78, -15, 93, 123, 58, -244, 60, -72, 17, 21, 3, -14, 107, 8, 81, -220, -6, -133, -91, 66, -23, -102, -233, -44, 85, -82, -243, -156, -115, -158, -139, 60, -41, -156, 42, -34, 89, -140, -82, -207, 193, -147, 81, 10, -152, -149, -111, -244, 54, -37, -26, -160, 172, -12, -303, 222, -237, 205, -251, 212, -39, 38, 49, 133]
7912A33l5L42n11K56k24J41J7j32j86K21j68K5J92l13L61p3j53n9k9L24j49L06
7934B86k17l52M18R3k30R0j68Q4k8n2J92l6j84J84k42K73k76J44J12j56L01k43
7956gj80J62j59ML37j7k11R2J86k21K24m59K88J39j20j58K40O0j49K56k23j13
7978b9M8J06k95J62m2j83L61j14K21m69L52k49K3M97n39J52j85K30k41J30j83
7999b47L13N2j5Qk16K31L1k24k06N8K25j77L9J98q2k10K75k7r4J8J62j77L3j48
8023a80J29K90l11K36r7L5k17J63P9j89kK9O8k87N95o75O30l81k23M08K28k62
8045F6r7J91k93J62j99K46Kk51J23L04L2l93m8J89k92L60l02M24k57J72m2k40
8067a43J84j9k14J9K44k10L1P4o9j3r7L68j92n0N5j06P2J26J19l13jK41m04J63
$$ y = [133, 98, 440, -71, 185, -39, 102, 119, -13, -199, 22, -146, -121, 71, -242, 119, 46, -107, -166, -195, 129, -20, 286, 69, -283, 135, 228, -2, 88, -80, 4, -24, -76, 116, 80, -104, 80, -162, 111, -165, -21, 91, -65, 236, -7, -187, -25, -184, -180, 157, 140, -71, 21, 207, -14, 210, -249, 39, 178, 58, -100, 140, 200, 51, 307, 84, -29, 19, 125, -170, -8, -50, -233, 128, 14, 235, -234, 118, -131, -108, 389, -150, 2, -183, 47, -194, -64, -247, 66, 118, 103, 111, -105, 126, 157, -67, -273, -215, 10, -167, -128, 70, -12, -222, 53, 26, -68, -50, 112, -65, -32, -180, -51, 239, -72, 164, 67, 102, -115, 48, 127, -62, -64, -35, 33, -254, 341, -334, 296, -85, -308, 100, 328, 66, -31, 160, -133, 29, -170, 76, 78, -173, -50, 254, 286, -107, -155, 34, -258, 102, -200, 224, -33, 139, 97, -143, 41, 22, -192, -173, 71, -139, -108, -34, -103, -116, -213, 155, -37, -87, -32, -138, -66, 60, 179, -134, -135, 106, -298, -135]
8091a35K64k31K70m06K60J19k25J18J3k37K13Q6QJ4j05K7n1j66J81j37o5L69j78
8114FK29l25K70k27j96K78l54M14M3k78L73m24K06J83o02O32k19m3J36l46%J22
8136a22L89j54l56M56j36l71J95K39k1q8q8J22k00J57O9J83j81J00n3j61r4p4
8158a89J46L11k73mo7L7J63r4J26m16J69l7J49N9n8m2J91j5k1k40J21K5L3L8j27
8183a5J3P5k40L81r4l27J89j30
$$ y = [-135, 129, -102, 168, -238, 22, 141, -84, 34, 47, -190, 23, 109, 117, 131, 26, 53, 2, -164, 17, -120, -185, 184, 6, 235, -90, 180, -47, -243, 35, -319, 95, 138, -140, 233, -191, 15, 198, -404, 228, 9, -34, 102, -244, -244, -122, 267, 113, -243, 213, 77, -294, -99, 140, 119, 31, -57, 65, -135, 22, 91, 274, 93, 193, 140, -21, -115, -189, -43, 268, -5, -9, -76, -39, 124, 30, 156, -260, -91, -128, 21, 80, 22, -20, 171, 156, 135, -105, 16, 41, 74, 112, -15, -2, 73, -167, 214, 120, -207, -18, -148]
8191a48
$$ Imaginary data points
##PAGE= N=2
##DATA TABLE= (X++(I..I)), XYDATA
0@%%%%%%%qJ6j6K4l2M0m8N6p2Q8j04J20j38J62j90K20k55K95l36L82m35M94n59
30b96O31p11P96q90R95j109J235j374J523j687J870k070K292k540K814l119L464
47A824l856M304m822N434o165P053q170R615j1561J4355j8725K6563m4869J58991
61A29971Q1917l97014K0921L12093M0664l08785l9533K47294N2372k32847m2099
72a35046J95190O0218j57443l5635J18416K4303r5079N669P5302k7880q6328K6976
84c1337P0274k4152n6246K9647L8315l2308j9129N4631K4619n4196l1816M0679
96H981K3354l0275k0204J0890l230q287J5685Q134j6312R158L2492j6711m6177
109c2502K6937O7763k7234r2185M697Q6997J396q1725k775P2070k870o2974K1872
$$ y = [0, 0, 0, 0, 0, 0, 0, 0, -8, 8, -8, 16, -16, 24, -24, 32, -40, 48, -56, 64, -74, 88, -102, 118, -137, 158, -178, 204, -231, 263, -296, 335, -376, 420, -470, 525, -584, 651, -723, 800, -887, 983, -1087, 1205, -1335, 1479, -1640, 1824, -2032, 2272, -2550, 2884, -3281, 3772, -4398, 5217, -6344, 8011, -10714, 15849, -29020, 129971, 211888, -185126, -164205, 147888, 188552, -120233, -159766, 87528, 139900, -92947, -135046, 60144, 120362, -37081, -72716, 45700, 70003, -25076, -19407, 55895, 28015, -58313, -31337, 38937, 14785, -41461, -11814, 26501, -5807, -24936, 29695, 54314, 118, -31698, 8981, 32335, 2060, -18144, -7254, -10484, -18771, -3086, 5048, -11264, -2106, 30386, 13675, -32502, -5565, 62198, 34964, -57221, -52524, 34473, 35869, -45856, -48631, 23439, 20569, -42405, -20533]
122b0533P5506k0303p7898J8275P5433k2821p9115J7350P3565k4382q3308J6693
134e1538R3577P454q2110k3440P1405M3624m5277m8101K0822M0277j5022m7610
146c5939l13M9563J2470n4579k5916O1411M8935m8084n2065M6963N5023n0245
158G224o1498N1604O2367o4040p9498O1363Q8497n3210q4972N6557Q8497n3303
170A9588q1134O3716Q5358p2469r7679O5208R6943o6138j00470N9718R8280n4515
182A6406r1394O0538R9650m9618r6748M1404Q9748l3534q3093J9891O2588k4186
194A1652n4479K5165M9456j9746l8213K1883L6210j2076k3150J0821J0561j6821
206A263j0379J0954J968j2252p14O391l234L024J7720J720j8833l0K3073R3k7022
$$ y = [-20533, 54973, 34670, -43228, -24953, 50480, 27659, -51456, -34106, 39459, 15077, -68231, -51538, 42039, 49493, -32617, -56057, 15348, 58972, 13695, -34406, -13584, 26693, 11671, -35939, -36252, 13311, 25781, -28798, -54714, 6697, 55632, 7548, -44517, 2446, 57469, 7224, -54274, -2670, 59697, -4343, -83841, -22478, 66019, 12809, -72163, -15606, 72891, 19588, -61546, 2170, 87528, 15059, -82620, -17412, 79531, 13393, -87077, -27359, 70921, 16406, -74988, -14450, 85200, 35582, -61166, -19762, 69986, 36452, -46641, -26750, 35838, 11652, -42827, -17662, 31794, 12048, -26165, -4282, 31928, 19852, -3298, 7523, 18084, 1263, -9116, 1838, 3806, -8446, -9160, -2769, -6003, -2979, 14741, 16461, -2372, -2402, 20671, 20764, -6258]
221f258k533K0525p508k8613O714L0675o083k7894R704L1899m629k4325J0499
234B173K3198j6179k8566J2002K4179j6668k8944J1344K6819p517k0281J1853
246f587K5014n468k0672K871J9942l34k1659j1169J1347J0505j0790j5164P819
259a4345K2082j446k1481M482L2847K214l7493q048L8722P772m8581j6629M8733
272H829J7175n4705j9997O3988L0791o1737l1469O7244L9939o6947m6654O1839
284H296M5850o4923n4525N7623N5450n1071n4019M8551N8267l5875m8847L3115
296b108M4728k8816m0945K0437K9485k2106k7438J7063J9878j3346j0361J6546
308C017J0088r303j926J0765j406r735J450K944j0183n527J0350J005j3500K666
$$ y = [-6258, -8791, 11734, 4226, -24387, -17673, 13002, 6919, -20975, -11271, 20628, 15999, -8326, 2173, 25371, 9192, -19374, -7372, 16807, 139, -28805, -17461, 9358, 1841, -18440, -6587, 18427, 12959, -7713, -4842, 15100, 14766, -6893, -18062, -6715, 3790, -7000, -22164, -14345, 7737, 6291, -15190, -10708, 22139, 24353, -13140, -21188, 17534, 25306, -23275, -39904, 8829, 26004, -28701, -48698, 15290, 46081, -15656, -47125, 20119, 60058, -6889, -53543, 8296, 54146, -10777, -65302, -7679, 47771, -3300, -57319, -8768, 49499, 13624, -35223, -2108, 42620, 13804, -27141, -6704, 22781, 675, -26763, -9700, 10178, -3168, -13529, 3017, 13105, 3802, 1876, 12641, 11235, 1500, 2950, 5894, -4289, -9816, 534, 1539, -11961, -9295]
322i295K0596m41j6713O881K2511p337k5352P916K3056j4494l0031J0800K8353
335A6450j2672k8662J5314L2895r676k6995J3199K8384j2455k6741R493J8642
347A7176j6065k0934J4667J5909j7937j4667K4245K0037k0863j7241K3811K1435
359B9573k1205k6069J2820K2137j2034k6565K501K2028M579j6618o057J7040J3835
372A5965p631j4608M822J6333m526k3376k640K1035O79k7270l894L2185J0137
385A7211l1591r291L9233J7078l8732k1970L7424K3589m1172l2102L5054L0955
397B5686l4015l2987L3584L7569k6231l3538K7762L7617k2971l8583J6381L5327
409B5601j5959l8958N971L4671l26l0218l050K8437J3320j7338j2440J2406J4620
$$ y = [-9295, 11301, 10860, -5853, 1028, 23539, 16202, -9150, -1234, 21822, 7328, -22703, -11903, 16450, 3778, -24884, -9570, 23325, 13649, -13346, -147, 28237, 15782, -10959, -1466, 17176, 1111, -19823, -5156, 10753, -7184, -21851, 2394, 22431, 1568, -15673, 8138, 29573, 8368, -17701, -4881, 17256, 5222, -21343, -18842, 3186, 7765, -8853, -14910, 2130, 15965, 8334, -6274, -1452, 14881, 10355, -13021, -15661, 5374, 6053, -21217, -25111, 7074, 17211, -14380, -23671, 15562, 32640, -6092, -28062, 9362, 32951, -8221, -40323, -5269, 25686, -8329, -41316, -7732, 29837, 3606, -29932, -2170, 35447, 12476, -26107, -9726, 25601, 9642, -29316, -23345, 11326, 11000, -19218, -22268, 6169, 19489, 2151, -10289, 2117, 16737]
422A6737o501j6811k843J0952K103j2187n627J0961P687p765k827J3970O997j3206
436A640n735J6214N929k2162j2666J9659J1975k3493j5912K3532K0079j8551j6076
449a5567K1242J9796j7338j7654J6253J3461k0139j6987J7151J2443k0324j2726
461b0389K2020J6627j8388j3039K1927J6649j8494j6786J5018J3719j7760j7664
473a6560J1751J4088j1487j4165J1139J7768m937j3464M968J6589j16j6784o856
486h066J1031Q085j1851j7178M435K0333J416k0212m050K5544J3075k1860j6077
499a5375K1215J8169k2629k4961J5911K4367j9021k7079J7408L0714j4148k9066
511b4495J7085L5659j2916l7220J1083L7373j1321m3960M371M1563l099m3476
$$ y = [16737, 10236, -6575, -9418, 1534, 3637, -8550, -14177, -3216, 4471, -3294, -6121, 7849, 14846, 1640, -4095, 12119, 18048, -4114, -16780, 2879, 14854, -8639, -24551, -1019, 19060, 509, -15567, 5675, 25471, 8133, -9521, 6732, 20193, 54, -16933, 218, 12661, -7663, -20389, 1631, 18258, -130, -13169, 8758, 25407, 6913, -9873, 5145, 18864, 1104, -16560, -4809, 9279, -2208, -16373, -5234, 12534, 7597, -5867, -899, 15690, 15574, -1210, -8066, 2965, 11050, -801, -17979, -13544, 6789, 8205, -12007, -16057, 9487, 22562, 702, -15375, 5840, 24009, 1380, -23581, -7670, 16697, -2324, -29403, -11995, 18719, 4571, -24495, -7410, 28249, 15333, -21887, -10804, 26569, 15248, -28712, -24341, 17222, 14123, -29353]
523b9353m58M5646P845m1247p219M3483J2678m0516j6648L5999J5922l8183k1750
536c3801L2250K2189k9451k2353K9144K6689k1692k3383K1364K4941j7971k5014
548a7088J2576K0006j4072k2402J0689J9384r387j5338J1259J8194o475j3674
560f328Q747J4393r300j5376N471J1435q487j4249N588J3385l742j0268O019J3829
574A1117q04j0481K122R600j190j2126l232P016J824q628m915O812Q193k159n894
589b745L624J0733J019j0404m374R324N236j3685j2195Q970J3797q592j6475R200
603f567K1927l883k1298M411K5924j108k9076n238K7519N623l1933j2743L0395
616C953J6601k9859j7996L3130K5154k8642k7889K8153L1806k6385l7891J9202
$$ y = [-29353, -29811, 15835, 23680, -17567, -24786, 18697, 31375, -9141, -25789, 10210, 26132, -12051, -33801, -1551, 20638, -8813, -31166, -2022, 24667, 2975, -20408, 956, 25897, 7926, -17088, -4512, 15494, 1422, -20980, -10291, 9093, -294, -15632, -4373, 13821, 7346, -6328, 2419, 16812, 7512, -7864, -2393, 9042, 555, -13694, -8106, 5279, 1537, -8731, -2712, 11117, 10313, -168, 1954, 11554, 10364, -1762, -4994, 2022, 3846, -4782, -9697, -2885, 5308, 3149, -2745, 879, 11612, 12631, 2227, -2147, 7177, 12413, -1272, -13467, -4497, 9300, 708, -15767, -6567, 15360, 11477, -9821, -5410, 20514, 19406, -9670, -14908, 12611, 18234, -13699, -26442, 3953, 20554, -9305, -27301, 5829, 30983, 2341, -25548, 2605, 34411, 8026, -29865, -10663]
628a0663L6660j9916m0666J5451M2419j0966m0746J1060M4286m095m2076K259
640a6993L9768k325m1672j744L7087K90l8557k588L8404N854l2856l277L3978
653A5369M991l0306m039K8409J664l1447n352K7251L471k6358l657K5954N281
666A1231k1412j164K4149L390k1282n116J7903K498j7739m590J1811R04j1116
679a0533J636J3485L96r186K206J0430N63p634q25L509l049n371kJ826M11r09
695c047M00m81K294Q102L516q220n314Q940N915j1112r342P836P206j1465r867
710a4639J3600J4694j1132j4653J2688J9953q984k0410P644J9434r341k5904M823
723a2227K6977k696l0435j579L2090R751k7798r066K8965J1534k8822j5418K8352
$$ y = [-10663, 25997, 6081, -34585, -19134, 23285, 12319, -28427, -17367, 26919, 22824, -19252, -16993, 22775, 20450, -21222, -22966, 14121, 14411, -24146, -26734, 11670, 17524, -15332, -18609, 15369, 20360, -9946, -13985, 14424, 16088, -15359, -20711, 6540, 10011, -16347, -20004, 5950, 11231, -10181, -11345, 12804, 16194, -5088, -10204, 7699, 10197, -7542, -12132, -321, 583, -10533, -8897, 4588, 4984, -4202, -1996, 8434, 8997, 1363, 538, 4047, 998, -4373, -4375, -2549, -2138, -3047, -2647, -3128, -834, 7268, 10784, 2564, -2750, 6190, 12105, 993, -8349, -513, 6693, -4772, -14639, -1039, 13655, 2523, -12130, 558, 20511, 11527, -8883, -1239, 18195, 8854, -17050, -12227, 14750, 12054, -18381, -19960, 12130, 21881, -5917, -14983, 13982, 25516, -3306, -18724, 9628]
736I628J5424l1585k3582K8353K5242k5499k5942K6236L0217k3370k9315K4717
748E24L4021k3277l8974J6088L6318j4616l6742R972L2918r380k9232J2794L1484
761B1898r556k9142J0038K6913r712k6026P524K0799j2524k2421J2139K2656j0287
774B299j9990J0726J9836o590j3266Q587R923j2520j1415J1598R058j4213j0464
787a6431J1483R134q952l797J2311N272j0647l449J0070L133r178l738L315k619
801d093m331N164N272n897m842Q993P178o150k526R288N92j3875k143J4404J107
816H141j8907m537J8656M894j7156l431K2793P119k2100q757K3522J3689k3664
829B62j8966J6800J7865j5595j9386J3530K0481j0643j9710J0973K4974m917k4942
$$ y = [9628, 25052, -6533, -30115, -1762, 23480, -2019, -27961, -1725, 28492, 5122, -24193, 524, 34545, 11268, -27706, -11618, 24700, 10084, -26658, -16686, 16232, 6852, -22380, -9586, 21898, 12342, -16800, -6762, 20151, 10439, -15587, -8063, 12736, 212, -22209, -10070, 12586, 2299, -17691, -6965, 12871, 6281, -6985, 1602, 11525, -995, -12410, -812, 8246, -5967, -16431, -4948, 4186, -4766, -8563, 3748, 9020, -1627, -5076, 4994, 8127, -1051, -4789, -1474, -4093, -8424, -3260, 2012, -3885, -8727, 266, 7444, 1294, -1232, 8056, 8648, -5227, -7370, 7034, 8141, -10766, -15303, 3353, 8247, -8909, -12340, 10453, 17572, -4528, -13285, 10237, 23926, 262, -18704, -1904, 15961, 366, -19020, -5490, 14991, 4348, -15362, -4389, 20585, 15668, -9274]
842i274Q33K3462P35k4865n350K2555M403k4171q241K7108J4181k3765j5715K3999
856E895J9668k0561k0068J7791J7795k0568k1652J8191K1291j6965k2135J6193
868e125K3173j2026j8750J4547J8117j5011j8402J3756J6290j6225j7832J2169
880e319J4503j1984j1228J4850J1284j3622q758J6530R112j5401r769J2479N312
893G989j4542n974J3197L399j3314j945J4217M428r666j156R430r79q426K148
907a194N241n797p082M744L791o269j459J0748R79j0422J475J5529o2j7404J57
922g025J5773k502j9748J521J9726k885k1751L573K5016M5k2719J273K4465K8
936A4790k4401k034K3001O76k5043n346K3084O495j9717o626J9716R701j5275
$$ y = [-9274, -8441, 15021, 15756, -9109, -14459, 8096, 12499, -11672, -19913, 7195, 21376, -2389, -18104, 5895, 25563, 5002, -15066, 2725, 20520, -48, -21700, -3509, 17782, 817, -21318, -5125, 18048, 6022, -12728, 1819, 19936, 4925, -13477, 279, 16569, 344, -17488, -5319, 9184, -2800, -14028, 822, 12106, -1516, -10274, 6256, 15368, -33, -9802, 2677, 7989, -6553, -12527, 670, 4069, -9245, -11190, 3027, 7455, -2211, -3367, 6063, 5084, -3342, -1194, 4047, -1750, -8832, -4088, -297, -6566, -8025, 2723, 3702, -6720, -5245, 10284, 10222, -7182, -7025, 8748, 6246, -13502, -11981, 7745, 4860, -16891, -13318, 11698, 11743, -10976, -9703, 14762, 14790, -9611, -11645, 11356, 12032, -13011, -18357, 4727, 11222, -8495, -15121, 4595, 14296, -979]
949i79q029J5192R513j4147j2192J0101J1549j0269j4019O410J4789l175j4367
962i623L684J7816J351j6813l778J7526N741j8422j0981J4801J0871j4950j2717
975a5494J4011J4826j1034j3180J2115J5789r813j4859P963J2750r077j4042O084
988c961J1020o886j0789O955J1444m168q148O143P450m508n900L493L231o016
1002f40m691L871J791m058j405M600K035j898J440K755r05j130J352j253m624
1017b760L69L400l189o271L322P926k702p098N311J0047m652r443N971R165p800
1032A596j1889O322J0045r178j1568J0063J3023r031j2314J1795J5626j0257j6067
1045a1834R889J6459j1063j9351P451J7774o556j8588M809J9364r11j5936L22
$$ y = [-979, -9008, 6184, 15697, 1550, -10642, -541, 11008, 739, -13280, -6870, 7919, 4744, -9623, -5939, 11877, 13228, -3585, -7363, 10163, 15904, -2518, -13499, 1302, 12173, -2777, -15494, -1483, 13343, 2309, -10871, 1244, 17033, 7220, -7639, 324, 13074, 3997, -10045, -3961, 7059, 173, -10616, -3661, 7783, 3615, -4533, 1610, 9060, 4552, -1348, 2145, 5376, -640, -5331, -1460, 331, -3727, -5132, -532, 1503, -395, 1045, 3800, 2895, 1765, 3117, 1864, -2760, -2391, 1009, -2180, -8451, -5129, 2797, 95, -7003, -1692, 8355, 3703, -5740, 231, 9396, 1596, -10293, -3971, 6074, -3104, -14672, -4609, 8414, -617, -12931, -1136, 14490, 4233, -11834, -1945, 14514, 3451, -15900, -8449, 9325, 2769, -15819, -11010, 8354, 7443, -8493, -8171]
1058h171J6725K617j3909m946J0531M877j0212q368O337Q167l871q414L595J1358
1072F316P46j0121j082J1555L250j2508o983J1075O593j2442j0002J1324J2181
1085I902j0154j1324J2366J3848r334j3632R020J4312j0004j5778P214J3604p762
1098B278j4754O469J5392m495j2845N060J4535k619j1951J177J0075k006r738
1111c422o98O276q98n730J442N458q31k833K753M409j180m385O65L589r87o059
1127b431k561M062L082l612m864L895P517q03o583R25Q286k15r379j757Q216K65
1143D043j0520k157R910K405j0525j248J2976L780j1766l724J2885M378j3234
1156b797p098J0513O542j2164p753J0446P918q197o617Q621Q927n852p831M513
$$ y = [-8171, 8554, 11171, -2738, -7684, 2847, 7724, -2488, -10856, -4519, 3648, -223, -8637, -5042, 6316, 7062, -3059, -4141, 7414, 10664, -1844, -8827, 2248, 8841, -3601, -13603, -2279, 9902, -252, -11576, 790, 14638, 5304, -8328, 692, 15004, 5000, -10778, -3564, 10040, 2278, -12476, -6007, 9385, 4890, -7955, -2895, 11640, 9021, -2930, -1753, 8322, 6316, -3422, -4120, 2156, 1258, -4472, -3030, 2428, 1597, -1236, 1517, 5926, 4746, 361, 1026, 4615, 3628, -2431, -4992, -930, 2152, -1460, -6324, -2429, 5088, 4285, -2298, -1373, 6913, 6698, -2681, -4438, 3778, 4043, -6477, -8634, 1276, 3681, -6844, -8092, 4884, 8664, -3102, -6826, 6059, 10437, -2797, -9895, 618, 7160, -5004, -12757, -2311, 5607, -2590, -9207, -586, 8341, 2489, -5342, -829]
1170h29P832m189r680M49P784N60q244l802P555Q349m265q678L577J2556j14j4323
1186e462l009J3540M402j5477q877J4717R747j3271j0775J3943J3520j1355j2259
1199a0616J2124J3349j2113j4813J0722J3517j1608j5235R610J5121q401j3686
1211a2029R477J5109o909j3168P213J3099p308j3191N369R967o604j0315O012
1224c278R822n933q070P476J0083n275r079N771Q501n757r912L666Q238m683r546
1239g976L018R842m92q618J526R566O78p906j585P186J934q933m596O143N073
1254D860n902o544M867Q144k455o606L002P839j503p867p28O994N57q113l476
1269f931N515L941m347l271M027N321k232m019K239N056j724o172j564M847J687
$$ y = [-829, 7003, 2814, -6866, -6417, 1367, 1927, -6317, -10119, -2564, 5785, 1520, -7158, -3581, 8975, 8861, -5462, -8471, 5069, 9471, -6006, -14883, -166, 9581, -3690, -14465, -522, 12998, 1643, -10616, 1508, 14857, 2744, -12069, -1347, 12170, 562, -14673, -5063, 10058, 1657, -12029, -2552, 12557, 5648, -7520, -307, 12792, 5484, -7707, -2338, 7629, 1025, -9290, -3278, 6544, 611, -7459, 17, 10100, 4825, -4254, 1517, 10018, 4261, -5651, -1985, 6253, 1570, -7976, -4958, 4884, 4392, -4226, -2700, 6866, 7544, -362, -1947, 5239, 7173, -1760, -6356, -213, 4860, -1042, -7586, -2719, 5425, 2970, -3636, -634, 7205, 5702, -2165, -2893, 4101, 4658, -3455, -6931, -1416, 2525, -1822, -5093, -1066, 4255, 2023, -1996, 243, 5299, 3575, -2597, -4161, 686, 2373]
1284B373o377l647N706N020m698m991O138Q776n054j0347M052J1702l326j4200
1298h873k37J3383J93j4469j279J5724L662j5184k817J6335O095j6085o623J4406
1312D231O167j6068p647J4896P586j5485q718J5940J1407j2839j0459J2730J1316
1325A3057j1699j1030J0642R462j1865j0906R928J0344r145r278R597J0090p630
1338A567q329R470Q706r103j0179P829Q904q050r962O326Q547n739p629P580R180
1353I118o102q061O519Q170n272r123L792O784m427p993L087P760j858o337J660
1368b283P354O51m594n97K662Q9k701q65O3m21o24k49o87J356K771M36k949J42
1386d46N255R27o479j996O208P64q630l380R560M086j0351n213J1801Q733j0666
$$ y = [2373, -4004, -7651, -1945, 3075, -1623, -6614, -476, 8300, 3246, -7101, -3049, 8653, 5327, -8873, -9110, 4273, 4466, -10003, -11282, 4442, 8104, -7080, -9897, 6438, 12533, -3552, -10175, 4231, 10398, -5670, -13317, 1579, 9165, -6320, -15038, 902, 12309, -530, -10989, 1741, 13057, 1358, -9672, 970, 10432, -1433, -12339, -2411, 7933, -1212, -10490, -893, 9197, 1567, -6762, 2708, 11414, 2311, -7868, -39, 8865, 815, -9147, -2821, 5726, -13, -7642, -62, 9118, 3016, -5045, 1474, 9644, 4372, -4751, -959, 5825, 1398, -6595, -3508, 4252, 2394, -3943, -2283, 5071, 5722, 1128, 531, 3193, 3282, 581, -284, -221, -642, -1266, -1515, -2202, -846, 1925, 2361, -588, -446, 4809, 5736, -743, -2739, 3469, 4233, -4397, -7777, 1783, 5869, -4482, -9695, 2106, 10839, 173]
1401A73q603J0911R789j1370j2359J0212J1865j0477j4789Q374J6165o797j5501
1414a2407O567J6849m394j5634L790J5843l416j6575M57J5066q88j5437l5J4510
1428D296J056j2539K83J3870J386j3118j742J2131J869j2751l704J0979K454j1071
1442f601k807J1265M170r739k754J0009M348r053l713P657L287q986m181P526
1456D28L353p351l921Q204M723o509k943P254L689p129l482O254K590o776m283
1471e899N662L904n714l463N851M768l834l242L962L626k538l452j27K031q72
1486F63j082j326n14J487K901p81l372K009O065p89o680L8P501j086r727p09R774
1503D372P03j1226r69J2490K696j2126k138J3667L670j4031n449J3723O139j5465
$$ y = [173, -8430, 2481, 12270, 900, -11459, -1247, 10618, 141, -14648, -6274, 9891, 3094, -12407, -5840, 11009, 6615, -9019, -5229, 10614, 7198, -9377, -8920, 6146, 5258, -10179, -10214, 4296, 5352, -7187, -6904, 6966, 8352, -4766, -6508, 5623, 7492, -5259, -8963, 2016, 4470, -6601, -9408, 1857, 6027, -3712, -6466, 3543, 7891, -1162, -4875, 2782, 6069, -2917, -7098, 428, 3781, -3570, -7491, 713, 5436, -1073, -4016, 3238, 6927, -202, -3684, 2570, 5160, -1616, -5899, -237, 3667, -2047, -5510, 341, 5109, 1275, -1967, 1995, 5621, 3083, -369, -496, 1535, 663, -419, -1745, -2259, -772, 2129, 1348, -2024, -15, 6050, 5261, -1419, -1381, 6120, 5034, -4693, -5402, 4372, 5075, -6151, -7120, 5370, 8066, -4060, -6198, 7469, 11139, -2892, -8341, 5382, 11521, -3944]
1517c944q046J3447Q314j2768q946J3082J0171j1236r263J1255J0130j0353j0992
1530i149P840J0072q274j0852O536J0348n504r766N785J0304m230q489L312Q692
1544F625k839q591J439O337k132p564J808P278r57o838J584P641J12o375q54O974
1560C648M57p174k108N784J926o239l179N849L905m225k302M241L444l130k803
1575a906L027J977l644k886K217J693k682j348K327J969j319n57K703J265j761
1590A075q14R87J18j518r46l61n54J174R04j018p31K828K878k562l254L959L977
1607F142m721n981L729O126m850p942M901R254m371r751N873J1781l976j2718
1621f504L635J3217l278j4738J510J3884j932j4154M56J4884J014j3526j010J4041
$$ y = [-3944, -11990, 1457, 9771, -2997, -11943, 1139, 11310, 74, -9189, 2066, 12196, 1843, -9149, -1309, 8763, 489, -10363, -3827, 6521, 1017, -8749, -2964, 7340, 3110, -5379, -2067, 6625, 3786, -4805, -3366, 2971, 839, -6725, -4917, 2361, 1404, -5434, -3850, 3791, 3903, -2472, -3326, 3648, 4105, -3069, -5177, 607, 2533, -3706, -6885, -1036, 2869, -1356, -3658, 583, 4027, 897, -1906, 1121, 3098, -546, -3432, -1215, 478, -2204, -3552, -1225, 744, -575, -1132, 1571, 2836, 1075, 261, 1248, 1366, -152, -1098, -1459, -2013, -839, 65, -953, -1684, 1144, 4022, 1460, -1794, 2165, 6142, 1421, -4560, -831, 5295, 445, -7497, -2596, 6658, 2287, -7464, -1591, 10190, 6214, -6504, -2869, 10348, 7070, -7668, -6158, 7726, 5794, -8360, -7904, 6980, 7994, -5532, -6542, 7499]
1635G499K449j2965l071J1708K676j1606m691J0100L955q905m612Q087N187n345
1649D66m373N043M709l504m862J891L634k433l986J74K979J84k261K82K768J095
1665A806j728n96K414P80l073k192K366J453l473k795L260L164k949k517L610
1680d70M032k823l476K766L947l589m425K669K917k918m308K942M686k233l785
1695d068K938N252k031m329J206L999j314m985M83L487k85l648n65L644J860j477
1711A67k039K299L163j032m123O5M020k99n331j929N587K805n805l261O889N700
1727F876o045o033O678P318o366q776M856Q897n765r845M663R796l395r402L479
1742c064J0621j881r571J675Q952r57j0018K79Q172m9q255p48P318J370n425r64
$$ y = [7499, 9948, -3017, -6088, 5620, 8296, -3310, -8001, 2099, 6054, -2851, -7463, 624, 5811, 466, -3907, 1136, 5845, 2341, -2521, -630, 3004, 571, -3415, -3241, -262, -78, -2339, -2057, 711, 1806, 78, -518, 1896, 2676, -397, -2589, -223, 1230, -2243, -5038, -1778, 1386, -1563, -4080, -470, 3562, 739, -2737, 29, 3976, 387, -4038, -1369, 1548, -1370, -5678, -2736, 1950, -283, -4068, -1130, 4122, 2091, -2238, -1032, 2967, 1653, -3332, -2849, 638, 353, -3295, -3860, -216, 1644, 167, -1872, 427, 3590, 2558, -1565, -1500, 2520, 2221, -3110, -5039, 548, 3353, -2452, -5713, 1176, 6876, 831, -5202, 1476, 8794, 2428, -6348, -1492, 7405, 1640, -8205, -3542, 6254, 2859, -6543, -3064, 7557, 5676, -3895, -2220, 6732, 5775, -4243, -3964, 4208, 4159, -4096, -4844, 2474, 3844, -1581, -2545]
1758b545N608J935l972k244L068J530k599k967J510J632n29k634O9L248J236k288
1774E8r36K939K046k782k953J918K591l348l781K896L547k942l820M098M446l104
1790H73m117L815M668m111n211L504M283m611n142M105N336m281m941M972N943
1805E085m201n653N075N251m144o639L456N899l917p020K635P169j966n999J740
1820c229O192N39n408q69M833J430m936k591K857K710k500l297J690M195l07l417
1836b108J9M888Q19m460j867M283K270n610l370M386L976m266m106M227N906l073
1852A914n616L585N876k852n882J035N974j913o009M31N722j72m446o86N769J865
1868D595m171k501L910L033l279m783K455L673j623m757Q55N058M75m905k71N940
$$ y = [-2545, 3063, 4998, 1026, -1218, 1850, 3380, 781, -2186, -676, 956, 427, -2207, -2138, 1110, 2346, 58, -878, 2061, 4107, 1325, -1628, 290, 2881, -467, -4248, -1352, 2195, -747, -4567, -469, 3977, 873, -3244, 571, 5239, 1128, -4083, -579, 3704, -907, -6049, -1944, 3392, -889, -5830, -858, 5085, 884, -4769, 306, 5557, 1413, -5226, -1770, 4129, 212, -6808, -4173, 2996, 1030, -4969, -3229, 2963, 3502, -1906, -2775, 2058, 3488, -1448, -4039, -1182, 1528, -972, -4269, -2579, 1616, 1309, -2108, -2089, 2799, 3618, -842, -2709, 1574, 3844, -1766, -5136, -750, 3226, -1040, -5146, -919, 4987, 1914, -3702, -117, 5759, 2907, -2975, -1940, 4034, 2121, -3888, -3457, 2265, 2093, -2353, -3039, 2730, 4595, 424, -2077, 1833, 4866, 1587, -3196, -741, 2932, 1309, -3448, -2593, 2465, 2940, -1965, -2236, 3704]
1884C704J151m895j631M553J512n733k502N076K325o027k689O832L177n825k961
$$ y = [3704, 4855, -40, -1671, 2882, 4394, -1339, -3841, 1235, 3560, -2467, -5156, 1676, 4853, -972, -3933]
$$ [...]
8191H6
##END NTUPLES=NMR FID
##END=
