##TITLE=1H_Art-H2SO4(B)BaOH2-f10-crsst
 CDCl3
 8 sc, 
 4.8.2023
##JCAMPDX= 6.0         $$ Bruker NMR JCAMP-DX V2.0
##DATA TYPE= NMR FID
##DATA CLASS= NTUPLES
##ORIGIN= UXNMR, Bruker Analytische Messtechnik GmbH
##OWNER= root
$$ XWIN-NMR		Version 3.5
$$ Fri Aug  4 15:55:08 2023 Russian Standard Time (UT+4h)  she@DPX200
##.OBSERVE FREQUENCY= 200.13135
##.OBSERVE NUCLEUS= ^1H
##.DELAY= (6, 6)
##.ACQUISITION MODE= SIMULTANEOUS
##.ACQUISITION SCHEME= undefined
##.AVERAGES= 8
##.DIGITISER RES= 18
##SPECTROMETER/DATA SYSTEM= spect
##.PULSE SEQUENCE= zg30
##.SOLVENT NAME= CDCl3
##.SHIFT REFERENCE= (INTERNAL, CDCl3, 0, 15.7039)
##AUDIT TRAIL= $$ (NUMBER, WHEN, WHO, WHERE, WHAT)
$$ ##TITLE= Audit trail, XWIN-NMR		Version 3.5
$$ ##JCAMPDX= 5.01
$$ ##ORIGIN= Bruker BioSpin GmbH
$$ ##OWNER= she
$$ F:/spectra/data/she/nmr/H-F/1/audita.txt
$$ ##AUDIT TRAIL=  $$ (NUMBER, WHEN, WHO, WHERE, WHAT)
(   1,<2023-08-04 15:54:05.37 +0400>,<she>,<DPX200>,
      <created by zg, POWCHK disabled, PULCHK disabled
       configuration hash MD5:
       00 E9 B6 7A A2 85 ED C7 34 08 36 98 17 FE 4E 26
       data hash MD5: 16K
       F6 CD B3 A4 65 E8 76 9E 5B 9A A6 C3 89 A8 23 27>)
$$ ##END=
$$ 
$$ hash MD5
$$ 6B 3E E6 66 0E 99 4A 36 AC 06 87 C8 7B 25 33 99
##$RELAX= 
##$RELAX= 
##$RELAX= 
##$RELAX= 
##$RELAX= 
##$RELAX= 
$$ Bruker specific parameters
$$ --------------------------
##$DU= <F:/spectra>
##$EXPNO= 1
##$NAME= <H-F>
##$PROCNO= 1
##$TYPE= <nmr>
##$USER= <she>
##$AMP= (0..31)
100 100 100 100 100 100 100 100 100 100 100 100 100 100 100 100 100 100 
100 100 100 100 100 100 100 100 100 100 100 100 100 100 
##$AQSEQ= 0
##$AQ_mod= 1
##$AUNM= <au_zg>
##$AUTOPOS= <>
##$BF1= 200.13
##$BF2= 200.13
##$BF3= 200.13
##$BF4= 200.13
##$BF5= 200.13
##$BF6= 200.13
##$BF7= 200.13
##$BF8= 200.13
##$BYTORDA= 1
##$CFDGTYP= 0
##$CFRGTYP= 5
##$CHEMSTR= <none>
##$CNST= (0..31)
1 1 145 1 1 1 1 1 1 1 1 1 1 1 1 1 1 1 1 1 1 1 1 1 1 1 1 1 1 1 1 1 
##$CPDPRG= <>
##$CPDPRG1= <>
##$CPDPRG2= <>
##$CPDPRG3= <>
##$CPDPRG4= <mlev>
##$CPDPRG5= <mlev>
##$CPDPRG6= <mlev>
##$CPDPRG7= <mlev>
##$CPDPRG8= <mlev>
##$CPDPRGB= <>
##$CPDPRGT= <>
##$D= (0..31)
0 1.2 0 0 0 0 0 0 0 0.06 0 0.03 0 0 0 0 0.0002 0 0 0 0 0 0 0 0 0 0 0 0 
0 0 0 
##$DATE= 1691150044
##$DBL= (0..7)
120 120 120 120 120 120 120 120 
##$DBP= (0..7)
150 150 150 150 150 150 150 150 
##$DBP07= 0
##$DBPNAM0= <>
##$DBPNAM1= <>
##$DBPNAM2= <>
##$DBPNAM3= <>
##$DBPNAM4= <>
##$DBPNAM5= <>
##$DBPNAM6= <>
##$DBPNAM7= <>
##$DBPOAL= (0..7)
0.5 0.5 0.5 0.5 0.5 0.5 0.5 0.5 
##$DBPOFFS= (0..7)
0 0 0 0 0 0 0 0 
##$DE= 6
##$DECBNUC= <off>
##$DECIM= 32
##$DECNUC= <off>
##$DECSTAT= 4
##$DIGMOD= 1
##$DIGTYP= 9
##$DL= (0..7)
0 120 120 120 120 120 120 120 
##$DP= (0..7)
150 150 150 150 150 150 150 150 
##$DP07= 0
##$DPNAME0= <>
##$DPNAME1= <>
##$DPNAME2= <>
##$DPNAME3= <>
##$DPNAME4= <>
##$DPNAME5= <>
##$DPNAME6= <>
##$DPNAME7= <>
##$DPOAL= (0..7)
0.5 0.5 0.5 0.5 0.5 0.5 0.5 0.5 
##$DPOFFS= (0..7)
0 0 0 0 0 0 0 0 
##$DQDMODE= 0
##$DR= 18
##$DS= 0
$$ [...]
##$SUBNAM2= <"">
##$SUBNAM3= <"">
##$SUBNAM4= <"">
##$SUBNAM5= <"">
##$SUBNAM6= <"">
##$SUBNAM7= <"">
##$SUBNAM8= <"">
##$SUBNAM9= <"">
##$SW= 18.05172834244
##$SWIBOX= (0..15)
0 0 2 0 0 0 0 0 0 0 0 0 0 0 0 0 
##$SW_h= 3612.71676300578
##$TD= 16384
##$TD0= 1
##$TE= 0
##$TE2= 300
##$TE3= 300
##$TEG= 300
##$TL= (0..7)
0 120 120 120 120 120 120 120 
##$TP= (0..7)
150 150 150 150 150 150 150 150 
##$TP07= 0
##$TPNAME0= <>
##$TPNAME1= <>
##$TPNAME2= <>
##$TPNAME3= <>
##$TPNAME4= <>
##$TPNAME5= <>
##$TPNAME6= <>
##$TPNAME7= <>
##$TPOAL= (0..7)
0.5 0.5 0.5 0.5 0.5 0.5 0.5 0.5 
##$TPOFFS= (0..7)
0 0 0 0 0 0 0 0 
##$TUNHIN= 0
##$TUNHOUT= 0
##$TUNXOUT= 0
##$USERA1= <user>
##$USERA2= <user>
##$USERA3= <user>
##$USERA4= <user>
##$USERA5= <user>
##$V9= 5
##$VALIST= <valist>
##$VCLIST= <CCCCCCCCCCCCCCC>
##$VD= 0
##$VDLIST= <DDDDDDDDDDDDDDD>
##$VPLIST= <PPPPPPPPPPPPPPP>
##$VTLIST= <TTTTTTTTTTTTTTT>
##$WBST= 1024
##$WBSW= 4
##$XGAIN= (0..3)
0 0 0 0 
##$XL= 0
##$YL= 0
##$YMAX_a= 294136
##$YMIN_a= -261262
##$ZGOPTNS= <>
##$ZL1= 120
##$ZL2= 120
##$ZL3= 120
##$ZL4= 120
##$ABSF1= 10
##$ABSF2= 0
##$ABSG= 5
##$ABSL= 3
##$ALPHA= 0
##$AQORDER= 0
##$ASSFAC= 0
##$ASSFACI= 0
##$ASSFACX= 0
##$ASSWID= 0
##$AUNMP= <proc_1d>
##$AZFE= 0.1
##$AZFW= 0.1
##$BCFW= 1
##$BC_mod= 2
##$BYTORDP= 1
##$COROFFS= 0
##$CY= 11.3945322036743
##$DATMOD= 1
##$DC= 2
##$DFILT= <>
##$DTYPP= 0
##$F1P= 15.7292609196834
##$F2P= 12.9074282941183
##$FCOR= 0.5
##$FTSIZE= 0
##$FT_mod= 4
##$GAMMA= 1
##$GB= 0.15
##$INTBC= 1
##$INTSCL= 1
##$ISEN= 128
##$LB= 0.24
##$LEV0= 0
##$LPBIN= 0
##$MAXI= 10000
##$MC2= 0
##$MEAN= 0
##$ME_mod= 0
##$MI= 1.114404
##$NCOEF= 0
##$NC_proc= 0
##$NLEV= 6
##$NOISF1= 3.799351
##$NOISF2= 2.8
##$NSP= 1
##$NTH_PI= 0
##$NZP= 0
##$OFFSET= 15.70392
##$PC= 1
##$PHC0= -21044.88
##$PHC1= 10.85272
##$PH_mod= 1
##$PKNL= yes
##$PPARMOD= 0
##$PSCAL= 0
##$PSIGN= 0
##$REVERSE= no
##$SF= 200.130013532006
##$SI= 16384
##$SIGF1= 3
##$SIGF2= 2
##$SINO= 400
##$SIOLD= 16384
##$SREGLST= <1H.CDCl3>
##$SSB= 0
##$STSI= 0
##$STSR= 0
##$SW_p= 3612.71676300578
##$SYMM= 0
##$S_DEV= 0
##$TDeff= 0
##$TDoff= 0
##$TI= <>
##$TILT= no
##$TM1= 0
##$TM2= 0
##$TOPLEV= 0
##$USERP1= <user>
##$USERP2= <user>
##$USERP3= <user>
##$USERP4= <user>
##$USERP5= <user>
##$WDW= 1
##$XDIM= 8192
##$YMAX_p= 0
##$YMIN_p= 0
$$ End of Bruker specific parameters
$$ ---------------------------------
##NTUPLES= NMR FID
##VAR_NAME=  TIME,          FID/REAL,        FID/IMAG
##SYMBOL=    X,             R,               I
##VAR_TYPE=  INDEPENDENT,   DEPENDENT,       DEPENDENT
##VAR_FORM=  AFFN,          ASDF,            ASDF
##VAR_DIM=   8192,          8192,            8192
##UNITS=     SECONDS,       ARBITRARY UNITS, ARBITRARY UNITS
##FACTOR=    0.0002768,     1,               1
##FIRST=     0,             0,               0
##LAST=      2.2672688,     0,               0
##MIN=       0,             -261262,         0
##MAX=       2.2672688,     294136,          0
$$ Real data points
##PAGE= N=1
##DATA TABLE= (X++(R..R)), XYDATA
0@%%%%%%%%%%%qJ6j6J6k4L2m0M8n6P2q8J04j20J36j60J84k08K45k85L27l74M23
33B24m79N42o08O80p63Q55r54J063j180J309j451J605j775J959k159K381k622
50a373K887l182L505l866M272m729N244n835O523p330Q294r467J0935j2834J5395
65H439j9047K4711l4717N7395j95580K7665M25270l16174j71025K62238J4902
76H4077j69781J24427j3467j01400J19625K5074j53151R1860O9925j31980L3058
87b1733J02796j15938n445J02898q1586k3309J16406r6185p0314J72671k1462
98E8799j81316J13015J13106j49979j6976J24327n8844n0976P8087j6421m2115
109b9293M7962j5644k4639N6673k6695n4163P5591J0730q8409M6929N8990r0802
$$ plain form
0 0 0 0 0 0 0 0 0 0 0 0 0 -8 8 -8 8 -16 16 -24 24 -32 40 -48 56 -64 72 -88 96 -112 133 -152 175 -199 224
33 224 -255 287 -321 359 -404 451 -503 560 -620 689 -762 843 -932 1027 -1132 1249 -1373
50 -1373 1514 -1668 1837 -2029 2243 -2486 2758 -3077 3446 -3884 4410 -5057 5878 -6956 8439
65 8439 -10608 14103 -20614 36781 -158799 -131134 294136 -22038 -193063 69175 84077
76 84077 -85704 38723 25256 -76144 43481 68555 -84596 7264 77189 -54791 -21733
87 -21733 81063 -34875 -40320 62578 -19008 -42317 74089 -22096 -92410 80261 58799
98 58799 -122517 -9502 103604 -46375 -63351 60976 2132 -48844 29243 12822 -29293
109 -29293 18669 3025 -21614 35059 8364 -45799 29792 40522 -47887 -958 58032 -32770
121c2770m775R7826m8031p4497P2100L3412o6393J621L6559k3314l072K8927k1341
134c748k7236L4097K3932l5201j7657L2890R574k4263P112J2566k3930N600L6523
147C0259k1279l7607K7244K9228j7506k1240o561K1036L0249l7120m0476N7248
159A3475K3648o9550J0661N7373m7424k0981O2933k6272m4716O1472K02o2584
171d1763N0692L0490p7367K1093O9215o0838k7968O7706j8146l7373M3879j1580
183H040l4192M8933n453n2617M6498J7999o5690L3239M4824p2990K850P3962n2353
196f950l7779P5120j7527n8262O1552J2808o8744L5531M1609n7616N443M5269
208C0454m1664l337M8225l8396k3782N8430j4310m5962M0844Q544l9638K8799
$$ plain form
121 -32770 -37545 60281 12250 -62247 9853 43265 -23128 -21507 15052 -8262 -11334 17593 -3748
134 -3748 -30984 3113 27045 -8156 -25813 7077 16651 -7612 -500 12066 -11864 -6264 30259
147 30259 8980 -28627 -1383 27845 10339 -10901 -17462 3574 33823 -3297 -43773 13475
159 13475 37123 -32427 -21766 35607 -11817 -32798 30135 3863 -40853 20619 20821 -41763
171 -41763 8929 39419 -37948 -16855 52360 -8478 -36446 31260 13114 -24259 19620 8040
183 8040 -26152 22781 17328 -35289 11209 29208 -36482 -3243 41581 -31409 -28559 45403 -6950
196 -6950 -44729 30391 12864 -45398 16154 28962 -39782 -4251 37358 -20258 -14815 30454
208 30454 -11210 -14547 33678 -4718 -28500 29930 15620 -30342 10502 19046 -20592 8207
220H207Q393m5950L1239L2383o0267p13O1519l2542l6852M4983J519l2343K5707
233E283L281l0363K6204J7224l8420N848L0599j8241r184J6073j0351O04J8176
246A6733j9686j0256K8145n123k4208J6638Q958j9728N091J1648j3175j270R773
259C540p228o98Q591r493l865J4090J243j3494k640J2646J1200j2925j9499J8368
273a64K5501k2713k3918K3712J7751j6471j2269L644R731R834j3783j9162J7987
286c20J9357k0586j5008J5614Q178o724n716l056Q438O860j3488k235J6496p055
300G55j2436J8029M313k1860O271J9402j0399r812O539J428M226K910j7289k314
314a0237K6336l101k9541O435K4340o424j7797M30J0919O378q736j1909Q903J3006
$$ plain form
220 8207 16600 -29350 1889 34272 -25995 -26708 34811 2269 -34583 10400 11919 -20424 5283
233 5283 8564 -21799 4405 21629 -16791 -10943 19656 1415 -7769 8304 -2047 -1443 16733
246 16733 -2953 -13209 14936 9813 -14395 2243 11201 -8527 -3436 8212 -4963 -6233 3540
259 3540 -3688 -4386 4205 -5288 -9153 4937 6180 -7314 -9954 2692 13892 967 -18532 -164
273 -164 25337 2624 -21294 2418 20169 3698 -8571 -4927 4804 14638 855 -18307 -320
286 -320 19037 -1549 -16557 -943 7235 511 -5205 -8261 177 7037 -6451 -8686 7810 755
300 755 -11681 6348 10661 -11199 -4928 14474 4075 -5737 802 2230 6456 9366 -7923 -10237
314 -10237 16099 12998 -16543 -10108 14232 7808 -9989 -9559 1360 7738 -998 -12907 -4004 9002
328I002r904r108R633N179p125j11N044p37l912J735N898j538p292J989Q769k746
344D776o962J186J623L618L107j3332o689K1945N347k9394j593K9768k834k5859
358a5293M846J7960l122r887n90N687L818k890l124L259m73J55O506n168r437
373g753J2929P540j8985m79J9850j0009j4735J8323K516k1697R416J6903j9190
386e371q105K0568k794j4823R176N077j0094M977N558j0037K594R414p215k545
400c620P475m252j052R474p627q070J5950J510j8874P218J4242j4227m339J3316
414G124p507o709J4229n804j3868J5851M921j9615N903J4000j3705j585J3528
427F763j0476l036J5961j0614r078K1388n602j9602K1791P060k8904J2971K2557
$$ plain form
328 9002 -902 -10010 -377 4802 -2323 -2434 2610 1873 -2039 -304 5594 4056 -3236 -1247 7522 4776
344 4776 -2186 -1000 623 4241 7348 -5984 -12673 9272 14619 -14775 -16368 13400 10566 -15293
358 -15293 -10447 7513 4391 -5496 -6086 -399 3419 529 -2595 664 191 346 6852 1684 -7753
373 -7753 5176 12716 -6269 -6748 13102 3093 -11642 6681 9197 -12500 -3084 13819 -5371
386 -5371 -13476 7092 4298 -10525 -1349 3728 -6366 -1389 4169 -5868 -3274 6140 -1075 -3620
400 -3620 3855 -397 -1449 8025 398 -7672 8278 9788 -9086 -1868 12374 -1853 -6192 7124
414 7124 -383 -7092 7137 1333 -12535 3316 8237 -11378 -5475 8525 -5180 -6765 6763
427 6763 -3713 -6749 9212 -1402 -10480 10908 5306 -14296 7495 14555 -14349 -1378 21179
440B1179k9016m450L2537j7366k2426L1661O01l1160J7846J5338k6368N518J8367
453A2261k1662RK2996j8327r492K4999r571j4664K3568n573k2363K6378P737l3021
467a6725J3852K2817k7706P77K6524k5068j0156L7030j2911l2314K8609J3574
479A8303k9895O661J4478j9091P756J4850k5453R3K8164j6474j5981K4276k926
492D761j8598J8591L989k1327J3431J1764k1534N879J8739k0119n970K5156q049
505F713j9864J6471P660j6368L834P081r571K485P188j0099r38J1144o503q502
519i269J0279M185j0191j833Q381K176m298l860P53O720N386r567r747J2968J3779
534A5862j6165j2620J7381O672j4273K198O072j0824M942J2422j5935o387J7766
$$ plain form
440 21179 -7837 -12287 20250 2884 -19542 12119 12720 -18440 -594 14744 -11624 -6106 12261
453 12261 -9401 -9392 13604 -4723 -14215 10784 1213 -13451 10117 4544 -17819 8559 16296 -16725
467 -16725 -2873 19944 -7762 -6985 19539 -5529 -15685 21345 8434 -23880 4729 18303
479 18303 -11592 -4931 9547 -9544 -1788 13062 -12391 -12298 15866 -608 -16589 7687 4761
492 4761 -13837 4754 8743 -12584 847 12611 -8923 -3044 15695 -4424 -10394 14762 6713
505 6713 -13151 3320 10980 -5388 -1554 5527 -4044 -1559 5629 -4470 -5408 5736 -767 -9269
519 -9269 1010 5195 -4996 -6829 1552 3728 -570 -4430 -3677 3043 8429 -1138 -10885 2083 15862
534 15862 -303 -12923 4458 11130 -3143 -945 5127 -5697 -755 11667 -4268 -10655 7111
547G111n677r915J5781p566j8127K5229J0350l3693L068K8300j3510q600J2690
560E441j2799K072K6417k1661k3219L7260N683l7097J6781J9378k9240O309K3918
573A9243k7363l580L0219k2352j3826L7312j4910l3753L7834J2794m3324J2662
585i044K6101k6579K915K1788k8106R17L5743k5873k0738M0389o485l3128K9910
598G810J0496l5482J5947J9387k9229Q503K2107l3122l8M1928k6152l2309L9435
611I281R454l3316R858J1306j6777J3307P753k7721R871K4002k2793o255K5100
624A3070j5098j1985K8021n455k5366J9400J1564k1016O526J0209j7551N368J7409
637A5096j7131r797J8542p60j0782M688r42k832P837k909q735P364K587o976M951
$$ plain form
547 7111 1434 -8481 7300 -266 -18393 6836 17186 -16507 -13439 14861 1351 -7249 5441
560 5441 -7358 -5286 21131 -530 -23749 13511 19194 -17903 -1122 18256 -10984 -4675 19243
573 19243 -8120 -11700 18519 -3833 -17659 19653 4743 -29010 8824 21618 -21706 -9044
585 -9044 17057 -9522 -6607 15181 -12925 -12008 23735 -2138 -22876 17513 11028 -22100 7810
598 7810 18306 -17176 -1229 18158 -11071 -2568 19539 -13583 -13621 28307 2155 -30154 9281
611 9281 18735 -14581 -4723 6583 -10194 3113 10866 -16855 -6984 17018 -5775 -12030 13070
624 13070 -2028 -14013 14008 8553 -16813 2587 14151 -6865 -339 9870 -7681 -2313 15096
637 15096 -2035 -11832 6710 5950 -4832 -144 -1086 -3918 3919 1010 -7725 -361 2226 -4750 201
652B01K619q883K552R168m316o059L788M343n26m351Q74M575l233l752R145j020
668E125j3261P322J1974j2104o199J0080j069l664M202o100j476J1435o488r504
682i727J3194k53j3307J2448N813j8413O819J5467j5734k766J6175j1570m924
695f778J9387j0611j4991K2665L40k2834J4905J0029k2606P912J6438k1988o20
708h752K1720j6539q965K3587j0086j7345K3719J501k4661J5736J2684k2639N569
721d471J6600j7717o81J7610j3388n047J8336j1491r933K2585o239k1146K0015
734E033Q362k3872P265J4257j7150J939J3603j6009j525J9182j2907j0626K0565
747H117m199j7157J6303N699j8960P464J2230j3407K95J0056q874O26J0202j0286
$$ plain form
652 201 2820 -6063 -3511 5657 1341 -4718 -930 3413 2887 -1464 -590 3985 752 -3000 6145 5125
668 5125 -8136 -814 11160 -944 -7143 2937 1868 -1796 2406 -3694 -5170 6265 -223 -9727
682 -9727 3467 3214 -10093 2355 8168 -10245 -3426 12041 -3693 -6459 9716 -1854 -6778
695 -6778 12609 1998 -12993 9672 10012 -12822 2083 12112 -10494 -2582 13856 -8132 -8752
708 -8752 12968 -3571 -12536 11051 965 -16380 7339 8840 -15821 -85 12599 -10040 -4471
721 -4471 12129 -5588 -6269 11341 -2047 -7094 11242 -249 -10182 12403 6164 -14982 5033
734 5033 13395 -10477 -3212 11045 -6105 -4166 9437 -6572 -8097 11085 -1822 -12448 8117
747 8117 3918 -13239 3064 8763 -10197 -2733 9497 -3910 -3615 6441 -2433 -1807 8395 -1891
761a891l788J3860m995r101R076l95o152P623k759r347J1316L303j4895M090J0856
776F801q671l598O999l410k85N427p228n61J0468n223p394R460J770p770L641
791D26K615m647M358N55p468O353M880j1259J083J0055o082n692O152n43j796
806a010K680n995o5J1394o741j1756J3443O491j5361J153J1307n592k533M845
820B260l959M56P630p181m389J1298j051j0233O148M145o476J601J838m386M029
835A730J720q972M141P918j0140l795J1718j952r302O427L817o530K025K568l920
850b547K686L179n589O74N424k430l026K783O01k55M8k620J312L615l939k872
866b956M937Q3m864J938K014k976O17J250k069J257Q37k438J558J557k349J067
$$ plain form
761 -1891 -5679 8181 3186 -5915 3161 2766 -3386 4237 1478 -7869 3447 6750 -8145 -4055 6801
776 6801 -1870 -5468 1531 -1879 -2164 3263 -3965 -4526 5942 719 -6675 2785 4555 -3215 426
791 426 3041 -1606 2752 3307 -4161 2192 7072 -4187 -3104 6951 869 -4823 1329 786 -1010
806 -1010 1670 -4325 -4390 7004 263 -11493 1950 8441 -6920 -5767 5540 -52 -2585 2260
820 2260 -1699 -1243 6387 -794 -5183 6115 5064 -5169 979 5124 -1352 249 2087 -2299 1730
835 1730 3450 -5522 -1381 6537 -3603 -7398 4320 2368 -6934 -507 3310 -3220 -1195 1373 -2547
850 -2547 139 3318 -2271 -1597 3827 1397 -1629 1154 1755 1500 1548 -1072 240 3855 -84 -2956
866 -2956 1981 2064 -2800 -862 1152 -1824 -1207 43 -2026 -769 68 -2370 -812 745 -1604 -537
882e37J875k811J295K938l837K2N286l818k696O097j374n271M934J406o373L078
898B14L425n736O42M439m728p68M909m361j642O819m278m832Q547K62j0077O807
914c58O741j0393P28R410n938m401Q840k419o340P524Q33q582N134M923q085K25
930b158O361m884j483N027m580j755P080m442n697R363R04j0847M853Q418r322
945c162j314R021m901l372P822k833o012Q861P32j0440O070P085j0114j064R517
960E896n311m610Q200l754n929R869q41j1808P668Q147j2566j292J1992n658o225
975f222Q808j703o358Q432p2r610Q388N088j1915K220J1475q712n383J0912j839
990C509p170O408n31o280Q103L3j1922O862R099j1667k635J0706m682m688Q072
$$ plain form
882 -537 1338 -1473 -178 2760 -1077 -1055 4231 413 -2283 3814 2440 -2831 2103 3509 -2864 214
898 214 3639 -2097 -1455 2984 -1744 -2512 2397 -1964 -3606 3213 -1065 -5897 2650 2912 -7165 -358
914 -358 6383 -4010 -3282 6128 190 -4211 4629 2210 -4130 3394 4227 -4355 779 5702 -2383 -2158
930 -2158 4203 -681 -2164 2863 -1717 -3472 3608 -834 -6531 2832 3736 -7111 -2258 6160 -3162
945 -3162 -4476 4545 -356 -3728 4094 1261 -4751 4110 4842 -5598 472 7557 -2557 -3621 5896
960 5896 585 -4025 4175 421 -5508 4361 3520 -8288 -620 7527 -5039 -6331 5661 3 -6222
975 -6222 2586 883 -5475 2957 2885 -6725 1663 6751 -5164 -2944 8531 -181 -5564 5348 3509
990 3509 -3661 2747 2216 -4064 4039 4072 -7850 -988 8111 -3556 -6191 4515 -167 -4855 3217
1005C217m529n392J1556j867j2701J0813Q510j6335P99J5643q290r224J1738J114
1019E052q791N384J320o981O925K959j1446K419J1583q153p374R604Q50o722K218
1034a153J948l061K200L61m471M419L809q424k51J0059k615q583M899N146l178
1049A105j045k96j728N662K041r562l18J1544l401j1337P705O586j0327q26R427
1064E230n392n548P250N4n495N323j324o945R196M597j4291J347J4564o319q948
1079f701Q919M46n793P762j690j0020J0098N656j4421L099J1610j1183l849J3743
1093G676o049r950J1389P54r895P436J571j1232R101P020j5641K065J4699j1087
1107b143n246J4900p172r555J6720j223j6738J1810Q791j6314L909J2521j4537
$$ plain form
1005 3217 -1312 -6704 4852 2985 -9716 1097 9607 -6728 -5929 9714 1424 -7800 3938 5052
1019 5052 -3739 1645 2965 -4016 2909 5868 -5578 -3159 8424 271 -7103 2501 3351 -3371 -1153
1034 -1153 795 -2266 -66 295 -4176 243 4052 -4372 -4623 5436 2821 -5762 -863 4283 1105
1049 1105 60 -236 -1964 3698 5739 -3823 -4141 7403 4002 -7335 370 6956 -3371 -4197 5230
1064 5230 -162 -5710 1540 1594 -3901 1422 98 -6847 2349 6946 -7345 -5998 8566 2247 -6701
1079 -6701 2218 2664 -3129 4633 2943 -7077 3021 8677 -5744 -2645 8965 -2218 -6067 7676
1093 7676 1627 -8323 3066 3820 -6075 1361 2932 -8300 801 7821 -7820 -5755 8944 -2143
1107 -2143 -7389 7511 339 -9216 7504 6281 -10457 1353 10144 -6170 -2261 10260 -4277
1120d277j628J6370q936j0956J3932j00j0773Q831J166j1838Q426O939j3222J749
1134d317R717r041l9J0211r562m588J4978m018j2082J1354L655j2120O204P128
1148G480j2087J028J2022p177o275P665j000m068M919j675m805N525J070o116
1162c494K863K287m926K352M201o057j107N715q82l147K494n85j275L700L8m504
1178b327J342M210j290k899M81K290l62j869O45J008k098J57L028k341k500K525
1194@L75j017P93k164j188O079r47p841M621N796o554l16N406m087j399P365m799
1211A23m447Q639j088q082P082L258r855L606O799q429q48Q080o049k808Q121
1226D102m498n378Q879j411p920P169K140q430N473M230r413L673Q022j0751l02
$$ plain form
1120 -4277 -5905 10465 1529 -9427 4505 4405 -6368 2463 3629 -8209 217 7156 -6066 -4317
1134 -4317 5400 -3641 -3680 6531 -3031 -7619 7359 3341 -8741 2613 6268 -5852 352 7480
1148 7480 -4607 -3579 8443 1266 -5009 2656 1656 -2412 2507 832 -3973 1552 2622 -3494
1162 -3494 -631 1656 -3270 -918 3283 -2774 -3881 1834 952 -2195 299 -286 -1561 2139 2177 -2327
1178 -2327 -985 3225 1935 -964 -483 1807 1445 -424 221 1229 -869 -712 2316 -25 -2525 0
1194 0 375 -642 151 -2013 -3201 2878 1931 -5910 -1289 4507 -2047 -2363 3043 -1044 -2443 4922 123
1211 123 -4324 4315 3227 -4855 2227 5485 -4370 -764 6035 -2394 -3242 4838 -1211 -4019 4102
1226 4102 -396 -5774 3105 1694 -6226 943 3083 -5347 126 4356 -5057 -1384 6638 -4113 -4415
1241d415J2643p677q314J3206P3j1445O739M100q221M712L701j0663L666J0362
1255H467j0851m566J1590k098p267N199o04l198O418k880o912Q994K591j1301
1269f418M366Q829r291k576J0234l065n927N735K53l191L349k100k871O539p19
1284C147p900M926M358o227k58L828l649R52L480n516o15P304l604n842O223K159
1300B766n324J901J989k180J556J46j965K436P02l796K711K566n261P35M818m075
1316b75j720M785k989k001M949k269n207O551J134o949K036M588m297J47K469
1331I52l291J730L771n183j275P039k534m332M656Q27l794L190J22l726L345J171
1347B668n266K221M355n422p47N251l028l175M156m91l128L178p85k500L368L02
$$ plain form
1241 -4415 8228 551 -7763 5443 5516 -5929 810 4910 -3311 1401 5102 -5561 -1895 8467
1255 8467 -2384 -6950 4640 2542 -4725 474 -130 -3328 3090 210 -6702 2292 4883 -6418
1269 -6418 -2052 6777 -2514 -5090 5144 2079 -3848 1887 2140 -1051 2298 198 -2673 3866 3147
1284 3147 -4753 173 4531 -1696 -1954 1874 -1775 -823 2657 -2859 -3474 3830 226 -5616 607 2766
1300 2766 -2558 -657 1332 -848 708 854 -1111 1325 2027 -1769 942 3508 -1753 -1018 3800 -275
1316 -275 -1995 2790 -199 -2200 2749 480 -4727 1824 2958 -3991 -1955 2633 -1664 -1517 952
1331 952 -2339 -609 3162 -2021 -3296 3743 1209 -3123 1533 2360 -1434 1756 1878 -1848 1497 2668
1347 2668 -2598 -377 3978 -1444 -2191 3060 32 -3143 1013 522 -2606 572 -213 -2713 655 957
1363I57m493L297L071n093N39M194k688j203L569j562j947L306k56l289K728P15
1379A845k042L04P71j063P36k53j287R88M78j977J034P64k034J468J522l488Q34
1396a400L702l095j301L587p18j942K034l29r68K516j010k818L352J101m338J225
1412d02L269l595O86J864l602O07M368m123k979O234o58o018M663J596n121K557
1428f54L189n222R51M706m150q96N575l430l273O398r87n373M479K214n400K694
1444H21K220n570K043M988o711j280P568l339n371N648R58n534L234K170n379
1459c534K953M037n831k94O023l645k855N596j158m107M842O26n141K973K864
1474C349n009R20M440n127o71O579m014n188O181J895o370J036L927l265M86K391
$$ plain form
1363 957 -3536 -239 2832 -2261 -1722 2472 -216 -1419 2150 588 -1359 1947 1691 -1598 1130 1845
1379 1845 -197 107 878 -185 551 298 -989 -1 477 -1500 -466 298 -1736 -268 1254 -2234 -1400
1396 -1400 2302 -793 -2094 1493 775 -1167 867 538 -430 2086 1076 -1742 1610 2711 -1627 -402
1412 -402 2867 -728 -42 1822 -1780 -1173 3195 -928 -3907 2327 1669 -4349 314 1910 -3211 -654
1428 -654 2535 -2687 -1736 2970 -1180 -2076 3499 69 -3204 3194 2207 -3166 1313 3527 -1873 821
1444 821 3041 -2529 -486 4502 -2209 -3489 4079 740 -4631 1017 1975 -3559 -325 1845 -3534
1459 -3534 -581 3456 -2375 -2669 3354 -291 -3146 2450 1292 -2815 2027 2653 -2488 485 3349
1474 3349 -1660 -740 3700 -1427 -2098 4481 467 -4721 1460 3355 -3015 -1979 1948 -1317 -831 1560
1490A560m168M70N694l811m386N777K175n332J046K692k687J772J954n094J610
1505g28N538m167m765O539J295o486J992L737m410J20L213k941j031L866k418
1520f46k766N538r26o029M669L831n869n74N282k138j747L030k457n68N484k877
1536A237n757O224L517p429j61N611k527k357L301k025j931N013j687n560M983
1551D52K774o620J214N376m710j644N386j596l679L426J047k884K581N51m314
1566b640L323L511o124l34O223k771m084M520O42m181K765J244m633K014L601
1581C076n546n98O038k378n065M969J963n096J491K530l059J349K436m132M49
1596a573N515l602l453O022q20n195M393L010o776R96N664m617j942N269k886
$$ plain form
1490 1560 -2608 -2138 3556 -255 -4641 1136 3311 -2021 -975 1717 -970 802 2756 -2338 -728
1505 -728 4810 643 -4122 2417 3712 -2774 -782 2955 -1455 -1335 1878 -1063 -2094 1772 -646
1520 -646 -3412 2126 1200 -4829 -160 3671 -2198 -2772 2510 372 -1375 1655 -802 -1370 4114 1237
1536 1237 -4520 1704 5221 -2208 -2369 3242 715 -1642 1659 -366 -2297 2716 1029 -4531 452
1551 452 3226 -3394 -2180 3196 -1514 -3158 2228 632 -3047 379 1426 -1458 1123 1674 -2640
1566 -2640 683 4194 -1930 -2264 3959 1188 -2896 1624 2266 -1915 850 2094 -2539 -525 3076
1581 3076 -2470 -3068 2970 592 -4473 496 2459 -2637 -1146 1384 -1675 -326 2110 -2022 -1573
1596 -1573 3942 340 -3113 2909 2089 -3106 1287 4297 -2479 -1483 4181 -436 -2378 2891 5
1611El196N791j397n771N022K808o389J043M625m609M27M702m956j363O841k201
1627A382n653O159J164o669M218L812o951J174O108n181j985O203l213m050O210
1642B728r47o079M823K385o478K844L706o319Q90O802n670l152O706o36m717M368
1658A254j61m108M599J856o690K360N228m906j457M984k654k536N018j332m156
1673b701L618Q70m160K347J837m196J277L992m181j365L698l88k411K239o02j869
1689a995L388K60l698J645K705j925j440J831m5p71J213q80r39J419L07j502j47
1706e74J467n08j218L31N11o4n09l80K9O43O55j307o92K254L08k406N83K430j520
1725C3j045K471r75j513K108M92k549J478P66j948J658Q30m041J541M199m082
$$ plain form
1611 5 -3191 2600 1203 -4568 454 3262 -3127 -2084 2541 -2068 -1641 3061 -1895 -3258 3583 1382
1627 1382 -4271 1888 3052 -3617 601 4413 -2538 -1364 4744 -437 -2422 3781 568 -3482 2728
1642 2728 1781 -4298 525 2910 -3568 -724 2982 -3337 -2447 4355 -1315 -4467 2239 1603 -3114 1254
1658 1254 1093 -3015 1584 3440 -3250 -890 4338 -568 -2025 2959 305 -2231 2787 1455 -2701
1673 -2701 917 1787 -2373 -26 1811 -2385 -1108 2884 -1297 -2662 1036 648 -1763 476 -126 -1995
1689 -1995 1393 1653 -2045 -400 2305 380 -1060 771 726 -45 1168 288 -651 768 1075 -427 -574
1706 -574 893 385 -833 -502 9 -55 -564 -944 -915 -272 383 -924 -1616 638 946 -1460 -877 1553 33
1725 33 -1012 1459 484 -1029 1079 1571 -978 500 1266 -682 976 1806 -2235 -694 3505 -577
1741e77k650M513k1l726K751L36k908K772J342n160K140M370m093j489M634j639
1757E95k734M010n28l287L161O26l394K519J404m455J821L896n065r15N239k719
1773A74k693M014j090k757L756n89m625L888K795n253M07M118k547r55K544j663
1789d76o40L655k431k461M182K3l657K233J438k609R68J300k907J107K265k711
1805g21o08K674j801j355K806p38k202J873O28j730R11N89j619J609N82k913J750
1822b65K626k935o49K676o38j204J250p90j52J510j129j505K310k32j937J571
1838E07J6j877J202J245k475N23J990k317K44K495k175j172L304q03k750K968
1854I25P36k897J322J388j919M75J353j462j54J490j263m88J753j236j267K291
$$ plain form
1741 -577 -3227 1286 1265 -2461 290 626 -2282 490 1832 -3328 -1188 3182 -911 -2400 2234 595
1757 595 -2139 1871 1343 -1944 1217 1843 -1551 968 2372 -2083 -262 3634 -1431 -2346 2893 174
1773 174 -2519 1495 405 -2352 1404 815 -3810 78 2873 -2380 -1973 2145 -402 -1357 1187 -476
1789 -476 -1116 2539 108 -2353 1829 1852 -1805 428 1866 -743 225 1525 -1382 -275 1990 -721
1805 -721 -1329 1345 -456 -1811 995 257 -1945 -72 556 -1174 -263 326 -1293 316 898 -2015 -265
1822 -265 2361 -574 -1223 1453 815 -389 861 71 -81 1429 300 -1205 1105 873 -1064 507
1838 507 523 -1354 -152 1093 -1382 -859 1131 -1186 -942 1553 -622 -1794 1510 707 -2043 925
1854 925 1661 -1236 86 1474 -445 30 1383 -79 -233 1257 -6 -494 1259 23 -1244 1047
1870A047q07j910K325l48j985J403J066k164P28J443j668j32J685j298k69K156
1886A272j069r04J698k32j396J059M88j165N41N76j125N76K42r17jQ91q88k55
1904f09R12j120L37N42k40n85O76o23QJ207r96k91J630m86j130J346L04j616J235
1923E01P07j832N96J626j470k44J071j249J12J785j549j883K621o3k226J153N24
1940A80j586J586J54k344J700K406l489l37L823j602k082K726l71k178K654J3
1956A253k925K240K008l683L04L246k425r66K562k196q85L482j888k845L651N94
1972A527l905J786K108k868M11K715k688o84L519k135j331L200p96l152L299J460
1988B466m129J352K546k312m83K178k170l30K772j916k272L307L68l347J600J738
$$ plain form
1870 1047 240 -1670 655 307 -1678 -275 791 -1373 -645 798 -870 -1002 683 -615 -884 1272
1886 1272 203 -701 997 765 -631 428 916 -249 292 868 -257 319 561 -356 -357 534 -354 -609
1904 -609 303 -817 -480 62 -178 -763 -87 -710 -702 505 -491 -782 848 362 -768 578 882 -734 501
1923 501 1208 -624 -28 1598 128 -116 955 -294 -182 1603 54 -1829 792 729 -1497 -344 180
1940 180 -1406 180 334 -2010 -310 2096 -1393 -1730 2093 491 -1591 1135 764 -1414 1240 1253
1956 1253 -1672 568 2576 -1107 -803 2443 18 -948 1614 -582 -1467 2015 127 -2718 933 1527
1972 1527 -2378 -592 1516 -1352 -941 1774 -914 -1598 1921 -214 -1545 1655 859 -2293 1006 2466
1988 2466 -1663 -311 2235 -77 -560 1618 -552 -882 1890 -26 -2298 1009 1377 -1970 -370 1368
2004A368k857L64K274j943r37K652n18k048J812O22k033J903N97k376J150J985
2020B015k346p04K481l06j698R28L55j124P89K30j641R97J366k398l87K386m23
2037E20k184J123J168j442N63Q43j355m1K021j365q09K106l98j923J843O71k161
2054h20R17J494j890l22K276j426j428K525o39k452K038J157k735K13K091j701
2070g02l72K058j708q08K434k43k570K261J365k907R89J576j539j87J592j594
2086c55l30K596j411k090K839K62l102J359J945k858P3K377j624j415K789j009
2102D6j902K476n2k482J917J449k723K55K730k065j060K797q07j888K453K87k235
2119h04J659O96k379R65J763k796l86L027j519k519L073K48k549J203J109k426
$$ plain form
2004 1368 -1489 -1125 1149 -794 -1731 921 403 -1645 167 789 -1244 659 1256 -1120 30 2015
2020 2015 -331 -1035 1446 1140 -558 370 725 -399 390 620 -1021 -24 1342 -1056 -1443 943 520
2037 520 -1664 -541 627 -815 -252 591 -764 -805 1216 -149 -958 1148 750 -1173 670 1341 -820
2054 -820 97 1591 -299 -621 1655 229 -1199 1326 687 -1765 273 1430 -1305 -1092 999 -702
2070 -702 -1074 984 -724 -1532 902 659 -1911 350 1715 -1192 -203 1373 -166 -353 1239 -355
2086 -355 -685 1911 500 -1590 1249 1511 -1591 -232 1713 -1145 -1072 1305 -319 -1734 1055 46
2102 46 -1856 620 568 -1914 3 1452 -1271 -1016 1714 -351 -1411 1386 579 -1309 1144 1431 -804
2119 -804 855 1551 -828 137 1900 -896 -1282 1745 226 -2293 780 1028 -1521 -318 791 -1635
2135a635J082J802k563O2K782j844j574L558o54l103K463J351k816P86K206k221
2151c18p5K390k149q24K748j126k348K003J194k759R58J633k618M74K303k272
2167g86o33K522j016j651K173K8k540K283Q41k382Q63K079k166q0K111j571j401
2184a326K590n22j800J670N49k429J112J548k314J28J919j214q50J262j71j419
2200a267J454M19j852Q90J011j210L38P19p75l27J297m91q13J535K3j421M17J051
2218I98j102j8R09n73r05J001K39p85j5K17m17N01K18j202J01J545p69r50N44
2237d63R48j175N69O67q70J88J027n60q14J377n1j438J043P50j796L86J268j086
2255c0m86J389r57r86J790p22j363J447L56j704R87R74j311k11J868j566k68J852
$$ plain form
2135 -1635 -553 1249 -1314 -1252 1530 -314 -1888 1670 1016 -2087 376 1727 -1089 -303 1903 -318
2151 -318 -393 1997 -152 -976 1772 646 -1702 301 1495 -1264 -306 1327 -1291 -817 1486 -786
2167 -786 -1419 1103 87 -1564 609 637 -1903 380 1221 -1161 -298 1781 -385 -465 1646 75 -1326
2184 -1326 1264 742 -1058 612 1161 -1268 -156 1392 -922 -794 1125 -89 -939 323 152 -1267
2200 -1267 187 606 -1246 -356 655 -555 -217 502 -273 -600 697 206 -607 928 951 -470 -53 998
2218 998 -104 -122 787 214 -691 310 549 -236 -251 -34 -451 50 268 -934 -833 712 -57 -1007 -463
2237 -463 485 -690 -121 546 -324 -136 891 331 -483 894 843 -595 448 1198 -598 -212 1056 -30
2255 -30 -516 873 -84 -1070 720 -2 -1365 82 438 -1266 -279 695 -616 -827 1041 -525 -793 1059
2273A059j199j324K338K86k279J407J113j994L73J619k081N54J541j811n03K105
2289A204p84j992J657O81k319J115R87j506P22J082j515r6J530j012o69J941p60
2306B66j151J621K30j870J364O43j497N20P90j119Q1R47j007k29J323p60j022
2323h70J095J65j051N54K48p22N56L63j044M61L07n24j63J173n17m51P98k31k23
2342g6P33o22l09R93o54l44O88M33j226M21N25r42N68J6r88N93Q00j406N1J410
2362F64q99p09J322l96p57J102j27q34R17L98j309P72P39j021k15J556r45m88
2380b30R84p67n38J218k28j170R78J63j473R87N67j048M3N70l99j75R28m68n96
2399f54J094l09q98J172K44j090O19Q22j267J83P20n74q3P34m17n47N49j93n49
$$ plain form
2273 1059 -140 -1464 874 1160 -1119 288 1401 -593 -220 1399 -682 -128 1413 -398 -901 1204
2289 1204 420 -1572 85 766 -1553 -438 549 -957 -235 847 -668 -764 766 -246 -915 1026 266
2306 266 -885 736 966 -904 460 1103 -394 126 916 -203 -122 825 -182 -411 912 152 -870
2323 -870 225 390 -661 -107 141 -581 -25 338 -706 -245 62 -462 -625 548 31 -420 378 147 -76
2342 -76 657 35 -274 719 65 -279 409 842 -384 37 562 -380 188 204 -784 -191 609 -797 -746 664
2362 664 -235 -944 378 -18 -775 327 200 -634 283 681 -628 144 883 -138 -353 1203 258 -230
2380 -230 754 -13 -551 667 439 -731 247 410 -1063 -76 491 -557 -514 56 -343 -518 410 -58 -654
2399 -654 440 131 -767 405 649 -441 178 1000 -267 -84 636 62 -21 713 296 -251 298 105 -444
2418d44O35J08o61L59Rj58m33N32j45k91M56l48K25K08m71M56J12j91j57N5J12
2439c2N49k64k89L51L03p38o1O86m06j79L22k93n62J300n98r07R46L13j090K85
2459c64O84r82L51J022j000l91J362n90o37J209n8j597J491N04j562L79J485j825
2477e19M23R93j274k17J636p58j749K013J06k001J340P98j963Q66J236j794oJ737
2495H67j191p66K232o52j811K106K75j856J225Q34k047P05J536j663l49J855j276
2512B4q73J618l26j511J533j8j629R38J298k020K8J749j277n12J631m21j478J320
2530G4N80j344O62P75j043J28J204j106k26J224n75r40J064L69j421N96Q62j279
2548c96j9P86o06k96J006p91m73J097j46j103O35J314j203n21J356o65m17J019
$$ plain form
2418 -444 191 299 -362 -3 6 -152 -585 -53 -198 -489 -33 -381 -156 52 -419 37 149 -42 -199 -144 -32
2439 -32 517 253 -36 315 618 -120 -181 505 99 -80 242 -51 -613 687 89 -818 128 441 -649 -364
2459 -364 320 -662 -311 711 -289 -680 682 92 -545 664 606 -991 500 1004 -558 -179 1306 -519
2477 -519 -96 897 -377 -594 1042 284 -1465 548 654 -1347 -7 791 -1172 -306 930 -864 -870 867
2495 867 -324 -1090 1142 490 -1321 785 1060 -796 429 1263 -784 -79 1457 -206 -555 1300 24
2512 24 -849 769 443 -1068 465 447 -1182 -244 1054 -966 -938 811 -466 -978 653 232 -1246 74
2530 74 654 -690 -28 747 -296 -168 1036 -70 -296 928 353 -587 477 846 -575 21 883 -396
2548 -396 -415 371 -235 -531 475 -316 -789 308 162 -941 -306 1008 -195 -716 640 -25 -442 577
2566E77k19q24P35M95j083L14J052r66n76J139p93p60J138M18j303M17N71q56
2584e24J60Q97j350j39J741p10j224J640j38j110Q35O70j189J38J072r15j13J364
2602A105r87p33J628k58j652J107J168k029L82J422j575m67J494q64j042J823
2618E22j25j609J463L70j800R21J024j402R8J464j170n47J567l53j028J380K9
2635H04j502Q37J194j923QJ509r60p79J674o61j289J574J16j442R95M73j351L52
2653c71J182j337l44J464o40j009J808k16j388J149K34j041N04Q26j073j56J243
2670H35o56p23R89k30q83Q98L66j284O03M74j013J10J294r46l77O75m9q36P30
2689b3M04r51O49P84j286K12O96j86m65M96o2o74P71K78j192O84N04q79J56N47
$$ plain form
2566 577 358 -466 269 764 -319 -5 1047 81 -495 644 -149 -909 229 647 -656 -239 332 -524
2584 -524 -364 533 -817 -956 785 75 -1149 491 353 -757 78 748 -441 -303 769 -146 -259 1105
2602 1105 118 -615 1013 755 -897 210 1378 -651 -269 1153 -422 -889 605 -259 -1301 522
2618 522 397 -1212 251 621 -1179 -258 766 -636 -538 926 -244 -791 776 423 -605 775 804
2635 804 -698 139 1333 -590 -582 927 -33 -812 862 201 -1088 486 602 -840 155 628 -723 -371
2653 -371 811 -526 -870 594 -46 -1055 753 537 -851 298 532 -509 -5 821 -252 -408 835
2670 835 179 -544 445 215 -668 230 596 -688 -85 389 -624 -514 780 -166 -543 132 83 -753 -23
2689 -23 381 -570 79 863 -423 -211 485 299 -166 330 268 -406 365 643 -549 135 639 -240 -84 463
2709D63o64j53J014q83n43R31K28j032O69L85j077M28O32n57k15P99l05l24L79
2728A75N1p46O69K88m12K8N92p52J39N18n12k34K75M00q41M99J06m58j82O11l90
2749a76k91M65nm35N56J45n52mP22j14N1NP0o20L25J89m54M25j7n39N05L32n61
2772B2k6K65l47m53P29R1j001N41M92o12k83Q95n60q0N15l07j84N00j58m74R23
2793D88%q59N83R6m74M46K63o56k25Q62m40n92N44L25q30M83L23r38L60O38o57
2814b60k02O78l70j76N96k32m86O79P6p10N82L54n07O6N04n11jK87j32o01P58
2835C92k56m06L42L12n33kP2r8K79j3k30m6L37l70J22L39l78J23K50k22k13M83
2857B84l04r3M22J4m48M16j22k51J07M06n77L1M77q97N14J48k42p2L01k80l55
$$ plain form
2709 463 -201 -354 660 -223 -766 165 393 -639 30 415 -662 -234 398 -159 -374 425 120 -204 175
2728 175 226 -520 149 437 25 53 645 -107 32 550 38 -196 79 479 -362 137 243 -215 -397 214 -176
2749 -176 -467 -2 -7 -442 114 259 -293 -297 425 311 362 367 437 -183 142 331 -123 302 285 -254 251 583 22
2772 22 -4 261 -86 -539 190 281 -720 -179 313 -299 -582 313 -247 -327 188 -119 -303 197 39 -435 488
2793 488 488 -371 212 308 -166 280 543 -113 -338 524 84 -508 36 361 -469 14 337 -601 -241 397 -260
2814 -260 -462 216 -154 -330 266 34 -452 227 303 -407 175 529 22 88 592 81 80 367 235 -366 392
2835 392 136 -270 72 384 -149 -151 -79 -177 102 89 -141 -187 150 -220 -98 241 -137 -14 236 14 -199 284
2857 284 -20 -113 309 323 -125 291 169 -82 25 431 -146 -115 362 -535 -21 127 -115 -187 114 -166 -521
2878e21P40n11k64J021o82j60M76L1l53P0N60o31j13M92Q3k39L90l2o81M73J03
2899B52o96P11o6k51j81M71m62o8O50n11m44O73j85l20O40j55l64K16L98n67L32
2920G3J93k96N9K55j20k33L48l0l46N55n14k23L91J8j60J27L7p4o10N28n6m6P1
2943e3O0l08oL06m3p0qJ6K59j62j01N0J50p6J84M0n08O48k18k86L10n6k75K28
2967H1k34j55L59k11l35M58L03p13J10N14n33o0N11p8l05M41Mo04P39L79r16L48
2989A03M13o16Q8L75m74j21Q05n95n05P95jp16L20M50p51J01P07o71j55Q34m84
3010i8m85J087m40o03P64K46r86M97M57n68MP57r09K56N65o34k37N95K24j034
3030e42R16J16j127M95M56p78K10N42o79j57R40l33q51Q00J25o41P39K97j014
$$ plain form
2878 -521 219 -292 -556 465 -217 -377 99 130 -223 -153 407 -224 -337 155 238 -1 389 357 -324 149 252
2899 252 -444 267 201 -50 -231 240 -222 -290 360 -151 -595 78 -107 -427 213 58 -306 -90 308 -259 73
2920 73 266 -30 29 284 164 -69 279 249 -97 458 -56 -279 112 130 -30 97 134 60 -550 -22 -78 -124 -53
2943 -53 7 -301 -307 -1 -44 -114 -122 -106 153 -9 -110 -60 90 14 198 238 -270 378 160 -126 184 128 -147 81
2967 81 -153 -308 51 -160 -495 -37 266 -447 -337 177 -356 -416 95 17 -288 153 157 -447 292 671 -245 103
2989 103 516 -100 -12 363 -111 -232 573 -22 -527 268 267 -449 -129 321 -430 -329 378 -293 -448 386 -98
3010 -98 -583 504 64 -539 225 471 -515 -18 439 -129 -125 632 -277 -21 544 -90 -327 268 492 -542
3030 -542 374 490 -637 -142 314 -464 -254 288 -391 -548 392 59 -792 8 133 -508 231 528 -486
3049d86N27N66k70p81R96n51k74O24J6p35M25M16n44k61P10n10k15N94j40p56
3069f49R20j97n81N39K70n94O1N22p07J11N74K9o70M78J83n21K87L87l85j67N05
3090C95l14j62L03j86j29L38Lo46J31N36l06k33K41J30o18N25J53o53M62L91p34
3111c73L80M18m74m3O01o83m45P85K47q02M42M21o20LL66m60P2N55o56m56Q85
3132A63j64m77P28o8o80L97L55n05JO87n14j49O08l32m82M69M30r52O22M17n33
3153B1j86M74l08r7M92k35o99R36k39p49O65O9o71L82P09j045R7R54o14m70Q91
3174C77j36p34N93M78q99L57L48l45n2L16j48k71N45k44n24O04k17p8O6P9l29
3195b14NL67l60n0L96k28j7K41j86m58M62J21l89K12M21k08k6J22pk35L55r0k18
$$ plain form
3049 -486 41 607 337 -444 552 1 -273 351 367 -368 57 473 -71 -332 378 -132 -347 247 107 -649
3069 -649 271 74 -507 32 302 -292 -231 291 -416 -305 269 298 -372 106 289 -232 55 442 57 -110 395
3090 395 81 -81 222 36 -93 245 248 -398 -267 269 -37 -270 -29 101 -517 8 161 -492 -30 361 -373
3111 -373 7 425 -49 -92 509 -174 -619 166 413 -389 53 474 -146 -143 223 -237 -165 390 -266 -722 163
3132 163 -1 -478 250 182 -498 -101 254 -251 -250 437 -77 -226 382 50 -432 37 467 -485 137 554 21
3153 21 -165 309 1 -96 396 161 -538 398 159 -590 75 144 -527 -145 564 -481 -384 570 -44 -514 377
3174 377 241 -493 100 578 -321 36 384 39 -13 303 155 -116 429 185 -339 265 48 -30 36 115 -214
3195 -214 -209 158 -202 -252 144 -84 -101 140 -46 -504 -42 79 -310 -98 323 115 89 211 204 -31 324 234 16
3218A6K62j8m76L55N8m20j05N04k47l51N51j22l32L81j15k09M5K56r9p0J39J17
3240A20l32L94j05q2L5P9l5j92N14n85K62M5J01m31M67k03k81J20K05l2k02L95
3262B57l09l86Q2M39k36O6K06l75J88K53n85K11L88o7r2J69J6k26j6nj7M63j95
3285B29k32M6K38m55J86L13k82j65m7L7j38K76K28n62K11L25j17l71L80j4j29
3306d3L58k90j37K40N6n28M15M33p7p03N50jk65l7kj92L7J23j81P3K20j86k78
3329d15K72m1j32L94j80RK43j93r9K26M4j02j12L99l09j22Q1K24j30m0k41K49
3351B5r9q7K0J74j46j07J13J26J48l25O5k11j25J51M33l57rL06k45K90j53l7L36
3374B86j2l19L08j00k35p4L07k86J85J10j65R6l4j75R8N5rj58J08k7p0K37k44
$$ plain form
3218 16 278 260 -216 139 197 -223 -328 176 -71 -422 129 7 -325 56 -59 -268 -223 33 -66 -136 3 120
3240 120 -212 182 77 -5 30 109 74 -118 396 -189 73 118 219 -212 255 52 -229 -109 96 64 -138 257
3262 257 -52 -438 -356 83 -153 -87 119 -256 -68 185 -400 -189 199 132 40 209 225 -1 -17 -22 -39 424 229
3285 229 -3 43 281 -174 12 325 43 -122 -169 -132 -270 6 234 -328 -117 208 91 -280 100 86 -43
3306 -43 315 25 -112 128 184 -344 71 504 427 -276 274 273 8 -29 -31 -223 -186 -63 -244 -171 49 -137 -415
3329 -415 -143 -184 -316 78 -102 -93 150 -43 -142 84 128 26 -86 313 4 -118 -37 187 57 17 -224 25
3351 25 -74 -161 -141 33 -113 -220 -107 19 167 -158 -93 -304 -429 -278 155 -202 -211 95 -150 140 -13 -50 286
3374 286 274 -45 263 163 -72 -146 161 -125 60 170 5 101 67 -108 -10 45 36 -122 -14 -41 -111 126 -118
3397a18J31n9Q4l16N72j40k77L21P7l79R6K82l86J2K02R6l16J67J39k04p4K92
3419B02m15K08N4k15k55N23O0m09J46R0k15K27N8j00K03k54J64j55L80j58j7K93
3441D15k96k42J51J12j11p7J24j86J58K69l09K0R9J19k57J58m27R8j5o5K59J25
3463A22j98K25n0J89j5m86N35j36k07j03N4K77j24k22O20m27j89J90m5j04J25
3484C1J42l37Q8K4k16J41RJ8l91P03j73k32M25k91nJ9L54l83J36K52m68O6M42
3507C54l43k60M72k20j28M96q6p79L31J16l95M71L10m52m1M47n48j43N27P6m18
3528b13L51M3n84M20J47k30p5O92o94j9L84k75j65K86K92m76K30L03m52j72L43
3549A36l11M8M64o41j16N56R9q51Q65j09n42N69J41m85K24K21m01J06Q1q6o2L27
$$ plain form
3397 -118 13 -46 38 -278 294 154 -123 198 275 -104 -8 274 -112 -100 102 198 -118 49 188 -16 -90 202
3419 202 -213 -5 49 -166 -421 102 162 -247 -101 -11 -226 1 59 -41 162 -92 72 -83 297 139 122 415
3441 415 119 -123 28 140 29 -48 76 -110 48 317 8 28 127 246 -11 147 -280 -182 -197 -262 -3 122
3463 122 -76 149 99 288 273 -213 322 186 -21 -124 -70 207 83 -139 481 54 -135 55 10 -94 31
3484 31 173 -164 -76 -52 -268 -127 -118 -100 -491 212 39 -193 232 -59 -64 -45 309 -74 62 314 -154 -88 354
3507 354 11 -249 223 3 -125 371 285 -494 -163 -47 -442 29 339 -113 -154 293 -255 -398 129 205 -213
3528 -213 138 181 -403 17 164 -66 -141 551 -143 -162 222 -53 -218 68 360 -116 114 417 -35 -207 136
3549 136 -175 -127 337 -304 -420 136 235 -616 249 140 -402 167 308 -177 47 268 -133 -27 54 -32 -94 233
3571B33r9k46J63L51n24Q9J36kp6M70n48O6j12J29l81O8M58n60K91K83m07k17
3593d35N87k43P8J91l40N8J10J21j61j53N08l17j28R3M00m77J30o3jpL41o12r1
3616d11O70l36q7K07k27K22q2K98j89l77N10%l02K60j47l21N56Mk14l7J67j05
3638E9j16R2j17m6M70m78Q0L95l42j92L06j95j19L9L2k18N2L80m09K40L39O9n29
3661b08L45Q4m48L59J52j84L0j14J47n5M15m62j39K8K41m64K63Q4j21k71L16j62
3683a64J16K89l40K1M66l30J3p0J84k20q7L78k25J80k26J22k84M53K0l63M32l15
3705E0j76K49J51l94k2N8m1o2J82j14J0J14l41K94p2J56Kk9j3m2K05j15J26k57
3729h1J83j62k04K38J67k97L14m2k46J33Jj36k8M6j10J80J05M3q5mk09L27o2l5
$$ plain form
3571 233 134 -112 51 402 -122 -33 103 101 25 495 -53 13 -99 30 -351 -283 175 -385 -94 189 -218 -435
3593 -435 152 -91 -13 178 -162 -104 6 127 -34 -187 321 4 -124 -31 369 -108 22 -41 -42 -49 292 -320 -411
3616 -411 259 -77 -164 43 -184 38 -44 254 65 -312 198 198 -104 156 9 -312 244 248 34 -3 164 59
3638 59 -57 35 -82 -128 342 -136 -56 339 -3 -195 111 -84 -203 -164 -132 -350 -298 82 -327 -87 252 321 -208
3661 -208 137 221 -227 132 284 100 130 16 163 108 523 61 -78 -50 191 -273 -10 74 -47 -318 -2 -164
3683 -164 -48 241 -99 -78 388 58 71 1 185 -35 -122 256 31 211 -15 107 -177 276 296 -67 365 50
3705 50 -126 123 274 -120 -142 -84 -125 -187 -5 -119 -109 5 -336 -42 -114 42 44 15 2 -40 165 50 176 -81
3729 -81 102 -60 -264 -26 141 -156 158 116 -130 3 4 -132 -160 -114 -224 -44 61 104 19 15 -194 133 71 36
3753C6n3n4L18j69L3J28l35p1K28K38k17k99M70l56j05K30J54n07N69j18j13K1
3775B8m8r1j57L23r0Pj94K2R6j0M57k74k50J7k08P00k1q6l94J75j58J95j38k9
3799a28pj13P23n76k57M00k12K27k63M81m78J96l2m6J20j00O2r5M02j76l06M72
3821B94k80j51J47J96m84L52K69l55J19r6M2j70J07N7m0j8ok80J02L50m03O0J79
3844iK43m20K2J02k02J23J20L4J58k69Q6J3M3j95P7Q6L09j46k53pJ43K6l07K00
3868b3m03K46R0K7q9j31L42j26J14J9r5o8oJ05m0J71j0J5l41J81K02m80M18N0
3892A68M3o1K1k66L26k40R3j63K51O8Q5l68m8P7J3k15K54j93O3K5J56J58l54K13
3916A06oj06j3m3M4m6R6k55J26J06P3rn0J09k71L8M27k28j44p4K67j82N0j42J5
$$ plain form
3753 36 -17 -71 247 78 111 239 -96 -167 61 299 82 -217 253 -103 -208 22 176 -331 238 120 7 28
3775 28 -20 -111 -268 55 -35 -28 -222 -200 -104 -114 343 69 -181 -164 -372 328 307 221 -173 2 -156 39 -99 -128
3799 -128 -135 -248 475 -101 -358 42 -170 57 -206 275 -203 -7 -39 -85 35 -65 -3 -98 304 128 -178 294
3821 294 14 -137 10 206 -278 74 343 -12 107 11 53 -117 -10 47 7 -11 -17 -297 -195 155 -248 -188 -9
3844 -9 234 -186 -164 -62 -264 -141 -21 13 171 -98 -12 1 44 -151 -74 12 321 175 -78 -85 58 84 -223 -23
3868 -23 -426 -180 -90 -63 -152 -283 59 -67 47 66 -29 -97 -103 2 -38 133 123 138 -203 -22 180 -300 118 168
3892 168 211 150 171 -95 231 -9 84 -79 172 240 325 -43 -91 -14 -1 -216 38 -155 -92 -67 89 247 -107 106
3916 106 100 -6 -19 -62 -18 -64 32 -223 -97 9 82 73 23 132 -139 -101 326 98 -46 -120 147 -35 15 -127 -112
3941a12M5K66k64j6K99k30k68O04k66q9J38R8k36K8O0K5P1M08m63p8j30K22j07
3964Ek1pP1j71P4R8k03J00j24Q6N9N1M0l03K38j36J84M5o1J79K9m86J34J80K5
3989H6O4J89l42j38J94Q8j26J29K2l43K41R3m8J4j43m3J41J14l70K32k1M8l4j54
4013a07J96M6k50J88q3j15K03L2j52J69j01J50l29K68r9j19k7J89J88k86j50J89
4035@k1K28k3l05K03r1j3k68K0J49L32j8k79j55M84j14l07L60k99P5j29L03j15
4058A7J35k80M9L1J4%J21M0k9k38J24P2R3j57J50k98j38M12j50K9K68k35q4J99
4082A45j75o7k7L52k10L54k92j61J82j46O7k55L00N4l00qR2j8P9j26p5PR0l0K59
4107I1j81K33j59J27r3j60K56J08j40k9O2k3k7J82k51k8M5N7P7l8k04LJ88k6j32
$$ plain form
3941 -112 -67 199 -65 -81 218 -12 -280 324 58 -31 107 205 -31 -3 57 82 153 561 98 20 -110 112 5
3964 5 -16 -23 48 -123 -49 49 -154 -54 -178 -92 -33 18 58 -245 -7 -143 41 86 25 204 233 -253 -119 61 86
3989 86 150 339 -3 -141 53 141 15 144 166 -177 64 157 109 123 -20 -63 78 192 -178 54 33 81 47 -107
4013 -107 89 135 -115 73 -10 -125 78 110 -42 127 26 176 -153 115 16 -103 -130 59 247 -39 -189 0
4035 0 -21 207 184 -121 82 -9 -22 -290 -270 -121 211 193 -86 -241 243 129 -178 182 -117 -42 -171 132 17
4058 17 152 -128 -79 -48 -34 -34 87 127 98 -140 -16 56 149 -8 142 -156 -294 118 -32 -3 265 30 -54 145
4082 145 -30 -97 -124 228 18 372 80 -81 101 -45 22 -233 67 121 -179 -187 -95 -113 -34 -160 -235 -228 -138 -168 91
4107 91 -90 143 -16 111 18 -142 114 222 82 53 115 92 65 247 -4 -32 13 70 147 109 -95 -92 96 70 -62
4132f2j78J09J86l02J88O5O8j69K92k98nnL07k10j56K43Q1j83J89k1k20R2j45
4155a34K92l46K32k14N37k64j63m0K48m03M5J60k67M22k5r1n0p9K09j09L8K42
4177B40l84L80O2k05Q9k12K1j83L02j59l18L26J82m7m7j23j9j08M16k63L9J50
4199A39k96k2K59K2j07o6J76m9J9K53l09O5K64k28k08L99o0m81K51m9L2M61n20
4222e5L4o8q1O5L7k3J62m20N92k11k0Q1N8J47k19J15k64K2K31k64J03J24k87J98
4246E7J03O9l69J14k8J65j66R7o9j7k0N2j01K64m49K3J84O2l9m8j01m5Q9J14J12
4271E3q3n2Q7j02L7L7K20q4N1O1j72J31P6o7p4j64K07k09J51P1j26k5n4r5K59
4296A34k24k8K0J10m5j69Q3j14K66J19O2k34J18J0k36l7L20l44L32J11l07L1L14
$$ plain form
4132 -62 -240 -131 55 -247 -59 6 74 -95 197 -101 -106 -111 196 -14 -170 73 154 -29 160 139 -81 11 -134
4155 -134 158 -188 44 -170 367 103 -60 -100 148 -255 -210 -50 -317 105 80 -11 -61 -140 69 -40 -2 240
4177 240 -144 236 298 93 182 -30 -9 -192 110 -49 -367 -41 141 94 47 -76 -95 -203 213 -50 -11 139
4199 139 -157 -179 80 102 -5 -71 105 56 75 328 19 84 348 120 -88 311 251 -230 21 -28 4 465 -55
4222 -55 -21 -89 -170 -105 -68 -91 71 -349 243 32 12 93 151 298 79 194 -70 -48 183 -81 22 146 -141 57
4246 57 160 229 -140 -26 -54 111 -55 42 -27 -44 -64 -12 -113 151 -298 -275 -91 -29 -68 -116 -217 -262 -173 -59 53
4271 53 -30 -82 5 -97 -60 -23 197 113 164 225 53 184 260 193 119 -45 162 -47 104 175 49 24 -30 -125 134
4296 134 -90 -118 -98 12 -33 -202 -119 -233 33 152 214 -20 98 108 -128 -165 155 -189 143 254 -53 -22 292
4319B92k47p8j56K14om6Q2q5k16L00j85J27j36J41j23l2J90j46M98l57j96M41
4341B76k99p2K33M8k41K40K00l09J52m38L4K63M5J51m74J16k26K45j71K36k21
4362b12k46L71J87k2n8j1k5L21%m70R8k4K31l1j78K26k85J92J21k36J23n9k66
4385b53K06K72m35K07m3j29j57J23M93k85P5L5j23KJ0R3kn1J92j60J17k55J29
4408F1R0j69p1K10lK6m2j87K53P1l14J46j51J20P1k06j54K00m4J34k4m9m9J60
4432G9k13J75M8j65J33m8j99N8K32j56N2J25j49J39j68L54l12r6K06k61O4o5J01
4455f6j18J02L8J70j27m0J17Q6m82M11J90j95L4K9q2K7O6k73M6k53K37J11l1j05
4479a08K71l2p1k05L47r1k10J90j98r9N0q9J17K56k73J49P6q0L3l9J63k18J26
$$ plain form
4319 292 45 -33 -189 25 19 -27 55 -30 -246 54 -131 -4 -140 1 -122 -154 36 -110 388 31 -165 276
4341 276 -23 -95 138 186 -55 185 385 76 228 -210 -176 87 132 283 -191 -75 -301 -56 -227 9 -212
4362 -212 -458 -87 100 78 20 9 -16 305 305 -165 -67 -91 140 109 -69 157 -128 64 185 -51 72 13 -253
4385 -253 -47 225 -210 -3 -46 -175 -332 -209 284 -1 74 109 -14 -12 -2 91 89 38 230 70 187 -68 61
4408 61 151 -18 -89 121 118 144 102 -85 168 239 -75 71 -80 40 111 -95 -249 -49 -93 41 17 -32 -81 79
4432 79 -134 41 89 -76 57 9 -190 -132 100 -56 -4 121 -28 111 -57 297 -15 -111 95 -166 -102 -167 -66
4455 -66 -184 -82 -44 126 -1 -41 76 162 -320 91 281 86 120 149 67 94 160 -113 -67 -320 -83 28 -3 -108
4479 -108 163 131 60 -145 202 111 -99 91 -107 -206 -156 -245 -128 128 -145 4 80 0 33 -6 157 -61 65
4502F5r2J85q1j09J12k96J92o2r8K93L4j40r8Q7k36J59K73m95M9o6N92m00O7%
4526f5J40k43L22r2l65L44k99N23j40l6j07L5K17l47q2J9q6L28j9q6N0K9J35k88
4550a13J2M8k39K98j70k49K46L44j08l3J10j94J2K44M7p3k00l6o3K82J27l75K12
4573A29o8m62N78j20j9k23K29o7N0k1q2%n2o1j20M5L38k22K54O6l09J13L75k90
4597F1r3K40j57n3j85Q0q9K89jk02m0K03j75j08M19j04L5k58K70l12J98j16K1
4620g7Ol3OJ0M3O4j10J11K83j32k90K22j51M3j97L30j50p4K63j95j74O8N8M4J90
4645A58j71j81J08J63k30J55L0l29K21o7J16L7p5K67o7K55m02K43r3k0jJ00j15
4668A02P4k57K3L3j9J57j19J6p2k54N0J63P2j75J25N6j11N0N9O2p8J05n3k84L99
$$ plain form
4502 65 -27 158 77 -32 80 -216 -24 -86 -184 109 143 3 -95 -8 -244 -85 188 -307 -258 -324 268 -132 -65 -65
4526 -65 75 -168 154 62 -303 41 -258 265 125 89 -18 17 234 -113 -195 -176 -262 66 47 -39 11 40 175 -113
4550 -113 -101 -53 -292 6 -164 -413 -167 177 69 36 146 -48 -36 208 255 182 -18 -54 -117 165 292 -83 129
4573 129 61 -401 177 57 38 -185 44 -23 27 6 -76 -76 -128 -189 -309 -264 74 -148 106 172 -137 -24 351 61
4597 61 -32 208 51 -2 -187 -107 -196 93 92 -110 -150 53 -122 -230 189 85 120 -138 132 -180 18 -98 -77
4620 -77 -71 -104 -98 -88 -45 19 -91 20 303 171 -119 103 -48 -5 -202 128 -22 -96 167 -28 -202 -134 -76 -32 158
4645 158 -13 -194 -86 77 -153 2 32 -297 -76 -143 -27 10 -65 202 135 390 -12 231 138 118 117 217 102
4668 102 176 -81 -58 -25 -44 113 -6 10 -62 -316 -266 -103 -31 -206 -81 -25 -136 -86 -27 35 -43 62 9 -275 124
4693A24R4k36Q4K63m05k32L15L5J48j62k5M2q4rp3QJ50j19o6L28j13J58j78o1
4717a4k2J50j21Ll6J67Kn30N27l83M5J15K06J10j01J42k78j83J61m3j12L43n2
4740I6r2j75k3K34k86L77j80J69r5J15k33j4k59L84r0N2p3J80nL3j07J61r0m96
4764d17M72j16K00nj60j99J29L74r3r5l35L32LJ39m40L52k95R2O5K55j97l8o0
4787c7R6l12J32J67k9k1m8K91j0k83L60j51k42L17l28j15O6R7k1l0Q9k88L05j26
4811a21J66K6l84L46j01J09j15N02l37j03R0PJ64j82L4m2r4J95N8q8j81J18lj07
4835d3J24k44J48k30K78k03j17L14J8J38j01j20J27J38k09n4j75Q0N04n00K17
4856I0k33j30M48k34R0n4l5K47j04J26j53q3N8Q5k16r2K70L9J40l36J97k31q2
$$ plain form
4693 124 218 -18 66 329 -76 -308 7 42 190 28 3 45 -39 -48 -121 -113 37 -82 -148 180 67 225 47 -14
4717 -14 -36 114 -7 -4 -40 127 129 -401 126 -257 -212 -97 109 219 118 260 -18 -201 -40 -83 -195 148 96
4740 96 4 -171 -194 40 -246 131 -49 120 25 140 -93 -107 -366 18 -72 -20 -93 87 82 115 8 169 79 -417
4764 -417 55 -61 139 134 -26 -225 -96 278 185 90 -245 87 90 229 -211 141 -154 -62 3 258 61 23 -37
4787 -37 59 -253 -121 46 17 -4 -52 239 229 -54 306 155 -87 230 -98 -213 -147 -50 -71 -101 -12 -300 5 -121
4811 -121 45 71 -313 33 -68 41 -74 428 91 -12 78 85 249 67 101 59 -35 160 218 130 -51 67 64 -43
4835 -43 81 -163 -15 -245 33 -170 -287 27 45 183 82 -38 89 227 18 -36 -211 -131 373 -127 90
4856 90 -143 -273 175 -59 31 -23 -58 189 85 211 58 -25 33 118 -98 -190 80 119 259 -77 120 -111 -193
4879a93R5K36m3O3m51M58j21J2j76K35k65M50l05P7J14K32k47l58K50q7n1j9K36
4902A42m66K33lL24m86P4K83j25L3j80J62K20k31j7K56k62K05k39L61j80j77K31
4924A58R3j3o8k99J29L3J32l8l18L98n1k07R1J16j16j32R4J37l89K38j27m8O1
4947a26k3K41j31Q6K96j03l08P0L7j15K51k16j30L10n6q2K08q9k4L7J33j82l02
4970b18L15N0k18j10J01n8K82k47n0o2R3K89j67j44O9q4J59J05P3j92L7J08r8
4993C3K4m60M88j62J73j92P9J68j89K01M3j01m3o5j69J85J49j69Mp3L9J82j48
5016cJ23O2q2k06J29O3k97J45Q8k26M2J96j46r5K23k45M3O9k35M33l47K30J21
5039H5p5R2Kk23J19J9Q8pJ74k51J14K04k68O5k53l7K17o8k5K91n2k22J16n2k4
$$ plain form
4879 -193 -98 138 95 158 -293 165 44 56 -120 115 -150 300 -5 72 186 418 171 -187 63 -24 -75 -94 142
4902 142 -324 -91 -94 230 -256 -182 101 -24 9 -171 -9 211 -20 -37 219 -43 162 -77 284 104 -73 158
4924 158 251 238 170 -129 0 33 165 127 -191 207 156 -51 40 156 40 -92 2 139 -250 -12 -139 -187 -126
4947 -126 -149 92 -39 47 343 240 -68 2 39 -76 175 -41 -171 139 83 1 209 120 96 133 266 84 -218
4970 -218 97 147 -71 -181 -80 -138 144 -103 -153 -215 -122 167 0 -144 -75 -159 0 105 178 -14 23 131 33
4993 33 57 -403 85 -77 96 -96 -17 151 -38 163 206 105 62 -3 -172 13 162 -7 -3 -76 -37 145 -3
5016 -3 120 182 100 -106 23 86 -211 -66 22 -204 -162 34 -112 -207 16 -229 -186 -117 -352 81 -266 -36 85
5039 85 10 102 104 -119 0 19 107 100 274 23 137 341 73 138 -115 -152 65 -3 -28 263 211 -11 105 53 29
5064B9n3j54O6J85l33K34j10K46l03N1K07j27pK67k0k24j51J20lJ48q5m2N4k6
5088c1l4j81M29n5j66r0p0J66k09J44p2J42R8j32M3r8k1n0K83k56j9R6K8J33j93
5113a15L64k24o7J2J54O0P6j42o8J42l14J33J97j67j90l1K24m03J71K18R0l02
5135a82J95P8k64M5k3L9M05o1j6k16J91k00j86L60k2j62M4j33R2L6k7r0J07K07
5159B17k63q3J38k26J61j88M67k66l7J72p9q5L49j9k17J3O0j57J00k3j4r7J16
5182C9k63N14j64j66N01j58m68O0J42l2R4k79J77j34K4J92m7J07j37j03j34N93
5204C58l12j40R0K08j16J66m28M21k06J08n3n8J07j56J6K2l2k01L77l26J65j36
5226a26K57Q3q8j35l0j17R9k6k6N8J39j0j7Q7j17k82M29j20j5R3k75K47R0k27
$$ plain form
5064 29 -24 -178 -112 73 -260 -26 -136 110 -193 -142 65 -62 -69 198 178 -46 -197 -77 -80 68 -17 -59 -5 -31
5088 -31 -65 -246 183 128 -38 -128 -198 -32 -241 -97 -169 -27 71 -61 -18 -116 -137 -187 96 -160 -179 -83 -55 78 -115
5113 -115 249 25 -42 -30 124 184 260 118 50 192 -122 11 208 41 -149 -180 44 -359 -188 30 120 -182
5135 -182 13 91 -173 -128 -151 -112 293 232 216 0 191 -9 -195 165 143 -19 25 -108 -16 20 -7 -97 10 217
5159 217 -46 -129 9 -217 -56 -244 223 -43 -80 92 13 -72 277 258 41 54 114 -43 57 34 20 -77 39
5182 39 -224 290 126 -40 461 303 -165 -105 37 5 99 -180 -3 -137 -113 79 32 139 2 -101 -235 358
5204 358 46 -94 -4 204 88 254 -174 247 41 149 96 38 145 -11 5 27 -5 -206 171 -155 10 -126
5226 -126 131 214 126 -9 -39 -156 -57 -83 -109 -51 88 78 61 148 31 -251 178 58 43 136 -139 108 198 -29
5250b9l1K12k70J40Mk09J84j93l8L18j68N4J67j75n2J31J25k44J21j22n1k4L51
5273B01Jj26J00K04k16j39j7j9%KK24k93R2k88K07L0O2j16J20k39M1J22N4k15
5297b08L28m66K93j04M2K39j96P0K2J10n38M16j70L30K8j18J62k21o9L02j46j29
5319b3l7M2R8j42r2K39l9j16K17k26J06k98L40q0r0P9J88j89j74L71m9j43K9N4
5343F5j48J26K3j58L14l41K76k34q4L50k99R1L1J52j70L6k22J21J43j04K21l58
5365a69L75j9j22j92J26K04j95j81K45l61J26M09k16k03L43j14L4j59j29J86r
5386b1j29K9N2J35j41K13j96j85J84m9O7j89K05m4o5J07M3R8j42o1J1L52m00J1
5410a15K10j75p6n7J15j42J92K25k04K45l04O8k55M27l35Q5J34N5lM0j6J10p3
$$ plain form
5250 -29 -60 152 -118 22 26 -183 1 -192 -230 88 -80 -26 141 -34 -86 45 170 -74 47 -75 -126 -150 201
5273 201 202 76 176 380 164 25 8 -11 -11 -9 215 -78 14 -274 -67 -37 25 -91 29 -210 -169 -47 7 -208
5297 -208 120 -346 -53 -157 -115 124 -72 -2 20 130 -408 8 -162 168 196 78 240 19 -50 252 106 -23
5319 -23 -60 -18 80 -62 -154 85 46 -70 147 -79 27 -271 69 -11 -101 -22 166 -23 -197 174 125 -18 11 65
5343 65 -83 43 66 -92 222 -119 157 -77 -161 189 -110 -19 12 164 -6 30 -192 -71 72 -32 189 -169
5365 -169 206 187 65 -127 -1 203 8 -173 72 -289 -163 246 30 -173 170 56 90 -69 -198 -12 -21
5386 -21 -150 -121 -69 66 -75 138 -58 -243 -59 -108 -41 -230 -25 -69 -134 -27 16 114 -28 -89 -78 274 -126 -115
5410 -115 95 -80 -156 -213 -98 -240 -48 177 -27 218 -86 -18 -273 154 -181 -96 38 93 90 130 114 224 151
5433A51J95l40q1jJ75K4J57l03J68o7j1L6n9J8j77L67n18L23K1k02J34l16J07
5456a99K09M4rl23J84Q3Q9l55M07q8l24J42J2K32k3L58n86N58j85k26M1m4q1K8
5480e6K33J17j68k75K31K3j46M3m4n9P7K12l75j31Q9J79MO5j01L22j41p7J37n0
5504A09r3j29O1K64l65L19q9o4K44k34k23K03j16K17j33K75q9j56j09j87K41J49
5526I5K8R5K5j91j92J74kq4L7L48j75j39K8j69Q0j04J95J01l75k0L46j55K44j07
5550H3k56R3K4K43j64J20o7K0j19K42l58K1l4J24R5r4PK21n5J69l52j27R5lP1
5575aJ5P9l64L49l20K50J87j63j96R3j29K36J62k49j05J98J97j11L2k01P0n2Q
5598a5P7J85r8l0k9n9r3J50L6j00J7j83J46J3j08j89M9J42j32R9P0j23P1K15j52
$$ plain form
5433 151 346 6 -75 -76 99 123 280 -23 145 78 67 103 44 62 -115 252 -266 57 78 -124 10 -306 -199
5456 -199 10 54 45 -278 -94 -11 78 -277 130 42 -282 -140 -128 104 81 439 -147 411 226 0 41 -3 -84 -56
5480 -56 177 294 126 -149 82 105 -41 2 -42 -101 -24 188 -187 -318 -229 -50 -46 19 -82 240 99 22 159 109
5504 109 16 -113 -52 212 -153 166 77 13 257 23 -200 3 -113 104 -29 246 157 1 -108 -295 -54 95
5526 95 123 218 243 52 -140 34 32 -52 -15 333 158 19 47 -122 -42 -146 49 150 -225 -245 101 -54 190 83
5550 83 -173 -80 -56 187 23 143 76 96 -23 219 -139 -118 -152 -28 67 -27 -20 201 146 315 -37 -164 -69 -72 -1
5575 -1 14 93 -271 78 -242 8 195 32 -164 -71 -200 36 198 -51 -156 42 239 128 160 -41 29 -23 -15
5598 -15 62 247 149 119 90 31 -62 88 124 24 41 -142 4 17 -91 -280 -231 -89 -221 -122 -52 -175 -104 111 -41
5623d1JnK43J8k0j20j00N9N4J71k74K7m0p8J88J90k22j55n7J65l2j05o1K69j08
5648c3r2L65k25r8L28k62J31p0j83J4J17J30k28K77m07L83l02L67Qk20J03l2M7
5671A18k30J97K1N1o3l12N2o2J70N6j71K44J64j98k71J54J34q0j18L03j71J7j96
5694a91L39K25l24L6j83j6J40j09J43Jq9K34n65J32L13j76j5moJ99j07J08j73
5717h8L09p6j43j32J60j78L4l4K30O4k82M3K29J0j7k22K98k4k17J13k56K58q2
5740cNl1%J60J66n68O01m23Q2O8n8l07L32k53J46l1J67L7j9M5n5k04L12k52L48
5765B65l44j21K30L4rj64K01j97K53j38k02L4L22j62P6o2J19k22J22j18J75k20
5787a28j56M13k42j5J74L2K4k18J36J31k22j73R5K02m38K59M90m48K31k42L72
$$ plain form
5623 -41 -40 -45 198 216 196 76 -24 35 89 260 -14 13 -27 -105 83 273 51 -104 -161 4 -28 -133 -194 75 -33
5648 -33 -125 240 15 -83 245 -17 114 44 -139 -125 -8 122 -106 171 -236 147 -155 212 220 0 103 71 118
5671 118 -112 85 106 157 94 -218 -166 -228 -58 -2 -173 71 235 37 -234 -80 54 -26 -144 159 -12 5 -191
5694 -191 148 373 49 85 -98 -114 26 -83 60 61 -28 206 -359 -227 86 -90 -105 -109 -115 84 -23 85 -88
5717 -88 221 145 2 -130 30 -148 -114 -148 82 146 -136 -93 136 146 129 -93 205 181 -36 77 -179 79 -3
5740 -3 2 -29 -29 131 297 -271 330 -93 -11 57 -1 -308 24 -229 -83 -114 53 90 71 116 61 -143 169 -83 265
5765 265 -79 -200 30 64 55 -109 92 -105 148 10 -192 -158 164 2 78 16 135 -87 35 -83 92 -128
5787 -128 -284 129 -113 -128 46 78 102 -116 20 151 -71 -244 -149 53 -385 -126 364 -84 147 -95 277
5808B77k01j73Q9j15J24J02J3k78L47o6j3j34J05N1ok14q2L81k15K16l8q6k92
5831b08j38M78q3L66m93m0L0J39q3K8J25j29o6m0K25l8k42J31l4N3q5jJ85k16
5855a36L88l17j72L92q8Q2m8k0mn0j26P6m3K7O3m4J57k41K92k01n6K29k75K30
5879A15l40J68j52L38j0j54L1R4k14Q8J86o5r5J29j14j75L28m0l05K51k45K08
5901B7j09P9l1L8J76r9J40j34k7l40K61J30j94Q9m10P7K90J57l1%K6L7R4k04k58
5926b16K54m9K08L4j13j30r2K12j65N0k96J20N1N5J16k74J66R9l6P6m12M03j33
5949g2j62K31J07P2j39k39J28J38j5l3R4m6m9l8j27J9J01n4J69k09Q2Q4j85R2
5973e1J79k87L11l20K56L2Jj06j07L4n3J12K15j99nJ17k00Q9n4r7P1K59l50J20
$$ plain form
5808 277 76 -97 -8 -123 1 103 116 -162 185 119 106 -28 77 128 122 -92 -174 207 -8 208 170 84 -208
5831 -208 -346 132 49 415 -78 -118 -88 51 -32 -4 121 -8 -74 -114 111 73 -169 -38 -72 -19 -104 -105 80 -136
5855 -136 252 -65 -237 155 67 149 101 81 77 27 -99 -23 -66 -39 24 -20 137 -104 188 -13 -69 160 -115 115
5879 115 -225 -57 -209 129 119 -35 -4 90 -124 -36 150 85 -10 119 5 -170 158 118 -187 64 -181 27
5901 27 -82 -3 -34 4 180 81 221 87 60 -280 -19 111 -83 6 -404 -327 -37 120 89 89 115 152 246 42 -216
5926 -216 38 -11 197 231 118 -12 -104 108 -57 -7 -303 -183 -132 -77 39 -235 -69 30 -6 70 -342 61 -72
5949 -72 -234 -3 104 176 37 -202 -74 64 49 16 110 64 15 -23 -150 -131 -30 -84 85 -124 -42 42 -143 -51
5973 -51 128 -159 152 -168 88 120 121 15 -92 -58 -111 1 216 17 12 129 -71 18 -36 -133 -62 197 -153 -33
5997c3k6J10J03M5j85K38j23k70J45l29J07Q9J63o9N6k9k2J40R3k91p3JJ75R4
6021A09k65L06op2J0P0r4j86K49j59q7k0J79k5J12r8j44K07k33J72k8L3M1lk57
6046a89R8J96J2k11J90o2j08K48k9j43k7J04L2K26k74P4q7J7j5j75J55P9l26M04
6070A89j85m4p2K0O6pm4R4L3Q4M0k03n9J82J4j09J12o3q8p9Q6j72K84p6J30l58
6096b25K62r2l8M4l12Q2L78m7m8o9k5L79m90L24j19M5J14J7N4j03m9O4K0P2j87
6121E1m23L69P7J01l26K07n7l52L14K29k85M0ML77l63j39R6J76n0o3Pj52J58J15
6145A11j4m3K0M1J53l40j11L46k01j01K88l25J43n9K31N8q5j88K1Rj45K02J12
6168A23l32L36j92K88j22pl01K63j23Q6l03M48j31L42l39PL4k40K30J06k64N2
$$ plain form
5997 -33 -59 51 154 199 14 252 129 -141 4 -325 -218 -129 34 -35 21 -8 -30 110 203 -88 -161 -160 15 109
6021 109 -156 150 144 72 82 152 58 -128 121 -38 -125 -145 34 9 121 23 -121 86 -147 25 -3 30 71 68 -189
6046 -189 -91 105 117 -94 96 34 -74 174 145 2 -25 79 111 337 63 137 50 67 52 -123 32 111 -215 189
6070 189 4 -40 -112 -92 -26 -33 -77 17 50 134 174 -29 -88 94 108 -1 111 48 -40 -119 -33 -205 79 3 133 -225
6096 -225 37 -55 -93 -49 -361 -279 99 52 4 -65 -90 289 -201 123 4 49 163 180 234 131 82 146 166 238 51
6121 51 -372 -3 74 175 -151 56 -1 -353 -39 190 -95 -55 -51 326 -37 -176 -80 96 46 -17 -10 -162 -4 111
6145 111 97 54 74 115 268 -72 -183 163 -38 -139 149 -176 -33 -92 139 197 112 -76 -55 -46 -191 11 123
6168 123 -209 127 -65 223 101 94 -207 56 -67 19 -284 164 33 375 36 43 77 -163 67 173 -91 -39
6190c9j8J04j16J00j77K7K63l81K27Q5o0Q2o9l37L65KJ93l27KK13J36k72m0J20
6214H3Q7j30j85O8n4L31j07j21j30K59j77p1L07l58L14j11j04L0l5K68k40J5J13
6237E2J1J3K11l47K91m41M66k13k20J20n9K48L2j29K81k90m3J06j10N4k77L19
6259G5j06k61K43l4j93K09J57l7k75K76k19K17M7k54K57k69J96Q4j13j38J63r6
6281g1O8J31J14l89j9K20J62l99L00j39N6j38pk17K22L60l80j6J43j02L3p4J84
6304D2J5K27m83L09o3k7Q3j41L1l28M25q6j35J43K9m61L77J04k57K75j79Q8r2
6327a04O0k0R0l8k5J02l68K4M84k13J30J06J3j12k66K48k46J55J84k06r2L52k37
6350B1j4R9m4J28k12L7j05j61L44j41P9p6N4N9l1L4j66K34j46K68j96o6l8K69
$$ plain form
6190 -39 -57 47 -69 31 -146 -119 144 -237 -10 75 15 97 28 -309 56 58 251 -76 -74 139 275 3 -37 83
6214 83 170 40 -145 -77 -131 200 93 -28 -158 101 -76 -147 160 -198 116 5 -99 -69 -104 164 -76 -61 52
6237 52 63 76 287 -60 231 -210 256 43 -177 -57 -116 132 164 35 316 26 -17 89 -21 33 -244 75
6259 75 -31 -292 -49 -83 -276 -67 90 53 -222 54 -165 52 99 -155 102 -167 29 113 0 -138 25 -71
6281 -71 -3 128 242 -147 -166 54 216 -183 117 -22 34 -104 -111 -328 -106 254 -126 -142 1 -101 -68 -142 42
6304 42 57 284 -199 110 47 20 103 -38 -7 -335 90 4 -131 12 41 -420 -43 61 -196 79 -100 -12 -104
6327 -104 -44 -64 26 -12 -37 65 -303 -279 205 -8 122 228 241 129 -137 111 -135 20 204 -2 -94 258 21
6350 21 7 106 62 190 -22 15 -90 -251 93 -48 31 -45 9 68 37 71 -95 139 -7 261 65 -1 -39 230
6374B30j42N4M4j09j54J43k21J79J22l60K04j54J7K26l71L60J77k79J61j87K29
6395A69k73O2K8r1j0K70j10P6l6r6L8J7K80j45l75M25j05k46K28m9n6o8J96r8
6419C1J31j69O4j65J89j39j01R1K72k27K4m9J29j40pL0Q4Lj7n4R2P5k7o3k40N0
6445a33j19L0N61k88P4q4J20k51nK11l41L22j13mr1p5K75j67J8l3L18k36K28j15
6469A02j66k1K77k54J12N3J27q1q6k39L31q1j00m1J2K26J7j11Q6j73j56J57l9
6492d8N5p7J81Mk52L02j16J88j10j30L32j90j51KJ61k13J0K5J7q4l9J1j63K84
6516ak03K98r8j81K14R5l53Q9j23j30N15j99L08j75P9J7k51m0L46k48j39M94j12
6539B02l60J53N5O1m7j72j50L01j28J4J12N1k6j92M4J63q9p3j5k62L44o8M03l61
$$ plain form
6374 230 88 142 186 77 -77 66 -155 24 146 -214 -10 -164 -147 79 -292 68 245 -34 127 -60 169
6395 169 -104 -42 -14 -105 -115 155 45 121 85 -11 27 44 324 179 -196 229 124 -122 106 57 1 -67 129 31
6419 31 162 -7 57 -108 81 -58 -159 -68 204 -23 1 -48 81 -59 -66 -36 48 51 34 -20 72 147 120 57 -183 -133
6445 -133 -252 -222 339 51 125 41 161 -90 -95 116 -225 97 -16 -20 -111 -186 89 -78 -60 -93 225 -11 217 102
6469 102 -64 -85 192 -62 50 103 230 149 63 -176 155 74 -26 -67 -55 171 188 77 163 -10 -166 -9 -48
6492 -48 7 -70 111 115 -137 165 49 237 127 -3 329 139 -12 -10 151 -62 -52 -27 -10 -94 -133 -122 -285 -1
6516 -1 -204 94 -4 -185 29 124 -229 -140 -263 -393 122 -77 231 56 135 152 -99 -139 207 -41 -180 314 202
6539 202 -158 -5 50 111 64 -108 -258 43 -85 -71 41 92 66 -126 -82 81 -8 -81 -96 -358 -14 -82 321 -40
6563d0K04J37m52J92O7j10k7K14j08J09k63P8K7m3Q3QJ52k98Q1j54J89o0k09K53
6587C0P9j86N2M9J8J41o4k44K92O4j85p8O6M5N9l79J1K63k14m0M72k30o2Q7L1
6612G7k18q2K04K8j65J54K7kJ01j06K6mj19J74q2k2K48l26N7n7K38j01j70K14
6636I4j18J90l26L15p9P1k44J32j74k4kJ79m3j36J73n8o7J81J35l19M4K80k66
6659f2K01N6l93M1M17k15J40j46JQ4j53j13J55p1o7L5j93N03k35M0r0J55n1j94
6683a55K9P9R4j46N9q5L49k60L3m4K0q6K74k88K93p4k9J01j42O5m24L94lQ6ro0
6709G1J23O6n49J24K43j29j76J94m7J87j38R1N7j26j35K25q9L2k95Q6J80r6K79
6732A78j7p7j28J29j09J87J11m61K03j47K51k03k8J0K6K3j88K49Kj26J04k4o1
$$ plain form
6563 -40 164 301 -151 41 108 -2 -29 185 77 186 -77 1 28 -15 68 76 228 -70 11 -143 46 -14 -223 30
6587 30 109 -77 -25 24 42 183 119 -125 167 231 46 -32 34 79 138 -241 -230 33 -181 -221 251 21 -41 46 77
6612 77 -141 -223 -19 9 -156 -2 25 23 124 18 44 40 -79 95 13 -9 239 -87 -30 -87 151 50 -120 94
6636 94 -24 166 -160 155 76 147 -97 35 -139 -163 -165 14 -29 -165 8 -50 -117 64 199 -120 -76 204 -62
6659 -62 139 195 -198 -157 260 45 185 39 40 124 -29 -142 13 -58 -125 -90 -283 220 -15 25 -65 90 39 -155
6683 -155 -126 -47 47 -99 -40 -125 224 -36 -3 -47 -27 -113 161 -127 166 92 63 164 22 87 -337 57 54 140 131 71
6709 71 194 260 -289 -165 78 -51 -227 -33 -80 107 -31 60 117 -9 -144 81 -8 24 -271 -185 -5 -101 178
6732 178 161 84 -44 85 -24 163 274 -187 16 -131 120 -83 -111 -101 -75 -52 -240 9 11 -115 -11 -35 -96
6755i6J13j49OL74k41o7K02m36N71k92J39Pj88J63n5l27R6r6K83K02l84k0M3K08
6779E6j41Q1k6j01J27l4J18J40lj52J04l96n0N57k15j21P4M0j28m1q9L00R0j32
6803E8J13l63Q3K59l1m8r5N1j82k56N83l15Q3j72Q2L16k70J51j77M8J00j6J41
6826A43k07P3M5J09k62pK29J6o5l0J83k82Or3K8JL30k30p5q0R1j2L6k5K46j17
6852E1O2J5k35M30m34L93j19m28L20L04l00oJ94j81rk38J02Pj34O6K05l20K85
6875C0N8k09J38j07Mj11K18k21rL26p1N5k08nR8O3k49K87j76M5Kk8K20jk11R5
6901C3j90O7K4J51k06K22q2K06j57k87m3L99j36rQ3l67M21j75N8J73k13J46L7
6924A55k62q5N05l86QJ45k59L55k11J34J81k51Kj06O9O7j12j45K13j05M0M9l9
$$ plain form
6755 -96 17 -132 -126 248 7 -60 142 -294 277 -15 124 131 -57 106 51 -276 -180 -276 7 209 -175 -195 -152 56
6779 56 -85 -4 -30 -131 -4 -38 80 220 217 65 169 -227 -277 280 65 -56 18 58 -70 -111 -200 100 190 58
6803 58 171 -192 -109 150 119 71 -24 27 -155 -411 172 -143 -60 -232 -150 166 -104 47 -130 -82 18 2 143
6826 143 -64 9 54 163 -99 -106 123 139 74 44 227 -55 -49 -142 -114 -113 217 -13 -88 -168 -77 -89 -53 -78 168 51
6852 51 113 128 -107 323 -111 282 163 -265 55 359 59 53 247 66 57 -181 -79 -72 -206 -140 65 -255 30
6875 30 88 -121 17 -90 -86 -197 21 -200 -209 117 46 101 -107 -112 -14 49 -200 87 -89 -44 -42 -70 150 149 -62 33
6901 33 -157 -90 -66 85 -121 101 19 225 68 -219 -262 137 1 -8 75 -292 129 -46 12 185 -28 118 155
6924 155 -107 -192 313 -73 -65 80 -179 176 -35 99 280 29 31 -75 -6 61 -51 -196 17 -88 -48 1 -38
6947c8N9j8P1%k7L3j73K19j53J41j90j28n6L94j54p5lj15L16k38J92J04l72P9
6971a32J96j03Q2o0k35M57m74K34k8R2N0j19l4p1L16r3k96K92j2l05L19j16O8
6994B8k92K86M4m1l39K60J57j30j03o3l0K60o6J03J41k04j11N5j42J29N7K81l58
7017g8J53j01O2m48M37K4M4Nk62L52m04P7K00j77J11n5J3L5j0o8J68j11j67J5
7041a85M17n3j18j04R5j00P2O3N9k88K94K25Q2n22N8N7n3j00k8NK09M1k38J45
7065C3j8L13l57p6K49j59j35J22K1m5M3K54n15J92K62k09j07L76j73P9j04k16
7087a70K53j11N1L1j74J19LJ42k49L32p2N5Q6m92M7R1J0p3K19r7J49k63J25J73
7111A85j17J98j98K2j22j70R6J54J85j88m7j26K76j44o6j5M10m09J6K12j9o9P0
$$ plain form
6947 -38 21 3 74 74 47 80 -93 126 -27 114 -76 -204 -260 134 -20 -95 -98 -213 103 -135 57 161 -211 -132
6971 -132 64 -39 43 -17 -252 205 -269 -35 -63 29 79 -40 -74 -145 171 78 -218 74 62 -243 76 -40 28
6994 28 -264 22 66 25 -314 -54 103 -27 -130 -193 -223 37 -29 74 215 11 -100 -45 -187 -58 -1 280 -78
7017 -78 75 -26 36 -412 25 49 93 98 -164 188 -216 -139 61 -116 -5 -60 -47 -12 -22 -90 78 -33 -200 -185
7041 -185 232 179 61 -43 52 -48 24 87 146 -142 152 377 459 -63 -5 52 -1 -101 -129 -124 85 126 -112 33
7065 33 15 328 -29 -105 144 -15 -150 -28 -7 -52 -9 245 -270 -78 184 -25 -132 244 71 150 46 -170
7087 -170 83 -28 23 54 -120 -1 2 144 -105 227 155 210 296 -196 -149 -58 -48 -121 98 1 150 -113 12 185
7111 185 68 266 68 90 -32 -202 -106 48 233 45 -2 -128 148 4 -62 -77 333 -76 -60 152 133 64 134
7134A34m8n0J34l46O7j9k5J35K30j32Q9j76J15j16j51K38N0LNl21K78j17O3j29
7158h9J39J7l35J85M48l24j82K52j78k52N56k77j54J4P0J90q8k7J72k05J81k79
7180a66M44j01m48J77J87j88j38L8L40j84j5j5j13K3K42Q2o8k64O7J22J11l01
7202a68J88j94J98M8J5j33p1L97l74J87k19L5l5M1J48R1j32J72l03J13q3J88j40
7225c1j79J47L0M0k29L16q7R1l32L84k78j14K09J51l7j82J48l02L43j15K42M7
7247B62j09k39J15M5Pk8p4k11K16N8Q1J6j50J30m02J05J02n7R8m7K80l16L59k55
7271a4p3K65k38n9J19k83K17K8m5J87j30K14m43J33k2K41o3o9Q2j22j08J4P1m6
7295a44L6K95l83J42j19J83J50j08j21J04rj09j08K96j83M06m10Q2N0J11j04Q2
$$ plain form
7134 134 86 36 170 -176 -109 -128 -153 -18 212 80 169 -7 108 -8 -159 79 129 132 137 -184 94 -23 40 -89
7158 -89 50 67 -268 -83 365 41 -141 111 -67 -319 237 -40 -194 -180 -110 80 -8 -35 137 -68 113 -166
7180 -166 278 177 -271 -94 93 -95 -233 -195 145 -39 -54 -69 -182 -159 83 165 97 -167 -100 22 133 -168
7202 -168 20 -174 24 72 87 -46 -117 280 -94 93 -126 -91 -126 -85 63 154 22 194 -109 4 -79 109 -31
7225 -31 -210 -63 -33 7 -222 94 7 98 -234 150 -128 -242 -33 118 81 -101 47 -255 88 -27 215 262
7247 262 153 -86 29 74 81 53 -21 -232 -16 42 123 139 -11 119 -283 -178 -76 -133 -35 -82 198 -118 241 -14
7271 -14 -87 178 -60 -119 0 -283 -66 -38 -83 104 -26 188 -255 -122 -144 97 34 -35 47 -75 -183 -169 -98 -144
7295 -144 -108 187 -196 -54 -173 10 160 52 -69 35 26 -83 -191 105 -78 328 -82 0 50 161 57 139
7317A39pK6r2j28Qj16pK25L8P3l24J41R6k28J91m6K53j53k33L24k58J19l77O33
7341B97k74k11K45J26k58L05k67J76j95k1K31j48j32l4J14J19N2j55j89J88P3
7362D2r8j5k47M27q1r4R2J27m9j61j0J91j54j54K66m8k35L50k27p6J53J38j28
7385Ij42K40j28O6l99M34k61K34J10M5q6j21l16J28J39m1L62l83M4K57k70K55
7407A76k4l33M81n70K45J55j7m23K04j6J37j72K21j54k09M56m11N49l31O3k0j59
7429a52L53L19m54k65M02j66p9l8J17k20L41n3q1P3P4n5k50K90j03l5j0j48K35
7452I5j68L18k09k73K81k36J54j6l5R5j77O9J50p8j32K14k20N6N8K65l01O9j90
7475b11J6J08M9N5j53L05k15K15j94J26L7k84L56k49N2j49J20k06J21j98K64q6
$$ plain form
7317 139 132 158 66 -62 -54 -170 -177 48 86 159 -165 -24 72 -156 35 -11 242 89 -144 180 -78 41 -336 297
7341 297 23 -188 57 183 -75 230 -37 139 -56 -77 154 6 -126 -160 -46 73 125 -30 -219 -31 42
7362 42 -56 -71 -318 109 28 -66 26 153 104 -57 -67 124 -30 -184 82 34 -201 149 -78 -154 -1 137 9
7385 9 -133 107 -21 45 -354 80 -181 53 163 208 122 1 -315 -187 -48 -89 273 -110 -66 191 -79 176
7407 176 152 -181 300 -270 -25 130 113 -310 -106 -122 15 -157 64 -90 -299 157 -254 295 -36 27 7 -152
7429 -152 201 520 66 -199 203 37 -42 -80 37 -183 158 105 24 97 171 116 -134 156 53 18 8 -140 95
7452 95 -73 245 36 -237 44 -192 -38 -54 -89 6 -171 -102 48 -30 -162 52 -168 -112 -54 211 -90 -21 -211
7475 -211 -195 -87 -38 17 -136 169 -46 169 -25 101 138 -146 210 -39 13 -136 -16 -222 -101 -299 -35 -121
7497a21K37j22K40k76N0R0r3Q7r8L3j25J81m0j91J11M10j92j12j54J99k07R6j90
7520a87J11P0ok89K29M2j6K91j94k37L32j53J09j0j05O6r6o8K78r8j86J05J37
7543A25j54j02J37K00k90k64J28K03j9j53K52q3n6K60qk50O6K35n8k19l5K06j59
7566c8J63P2k10K79m96L70n1r5k9J50j26j49J27j1P9q4K4q3j40L04j68j24K26
7589a0j20Q7P4j68K16M9j35J03l5R0l62nK98Nj27J72o2O0L18o49L51L7l64J71
7613fJ7j21p0m7J14N7J34j15k07K46q3J30j3j66L96l43J70J04o0r8J02j19l1K49
7637B40l96L7l5L38j8k44J77j47m3J86k73K3K05j16n3M5nK21j19M4r8L02l37j74
7661b40O3J32J7J06j67J93J02l84N71m44Q7j14J06k09j3J27K74N4m72R7J28k48
$$ plain form
7497 -121 116 -6 234 -42 8 98 5 92 -6 27 -98 83 43 -148 -37 373 181 69 -85 114 -93 3 -187
7520 -187 -76 -6 -12 -301 -72 -30 -46 245 51 -186 146 -7 102 92 -13 53 -43 -111 167 69 -117 -12 125
7543 125 -29 -131 6 206 -84 -348 -220 -17 -36 -189 63 -20 -76 184 176 -74 -8 227 169 -50 -85 121 -38
7566 -38 125 197 -13 266 -230 140 89 -6 -35 115 -11 -160 -33 -44 35 -49 -25 -108 -248 56 -112 -236 -10
7589 -10 -130 -43 31 -137 79 128 -7 96 61 151 -211 -216 82 87 -40 132 70 130 448 -201 150 187 -177 -6
7613 -6 11 -110 -180 -227 -113 -56 78 -37 -244 2 -81 49 36 -130 266 -77 93 197 137 39 141 22 -9 240
7637 240 -156 -119 -154 184 166 -78 99 -48 -91 95 -178 -155 50 -66 -119 -74 -79 142 23 67 -31 271 -66 -240
7661 -240 -177 -45 -28 78 -89 104 206 -178 393 -51 36 -78 28 -181 -194 -67 207 261 -211 -114 14 -234
7683b34K00Q3n5k76L04N5j20L05m19K32r6k53K98%Mk26N31m56om3K61j80n6m7
7707a94M11l67J03L70j25l3k92K29O3k38K3N3K2K5j01p2J28J0K7j53n3K93j83
7730e4J16o2Q3R7j40J03n1p9O3M6j58r6q6J53j20l8K03j8k07O64m94L3k8J15q1
7755c6O5k00M6J32J14K21n22M58j70J49j23j73K36m03K57j08n3j10J14K43j53
7776a6J69Kj86J11q5L6n7J54j47J86k11L39l30Qp7L55k39Q0l1N6j46o2K01k61
7800a51K19k51J59L2RqO4k35K03k00J05K78k72J46j90K07l34j04N29j15l7M3J45
7823B42l85K57q2N0n5j14J38rj99K30k78J01R5P4k40J17M8l5J03p6M6k20K54l02
7847b40p0K83N1r0j05M15m20r0L68j39K36l20j95M21k3j15J60j3k6M9j60O0k74
$$ plain form
7683 -234 -34 49 -6 -282 22 77 -43 262 -157 75 -21 -274 24 24 28 -198 333 -123 -129 -172 89 -91 -147 -194
7707 -194 217 -150 -47 323 198 165 -127 102 165 -73 -50 3 25 50 -51 -123 5 15 42 -111 -164 129 -54
7730 -54 62 0 83 180 40 143 92 13 76 122 -36 -132 -218 -65 -185 -223 -20 -38 -245 419 -75 -42 -70 45 -36
7755 -36 29 -171 -125 7 121 342 -180 278 108 257 134 -39 197 -206 51 -57 -110 -220 -106 137 -16
7776 -16 153 155 -31 80 -5 31 -26 128 -19 167 -44 295 -35 -27 -104 251 12 92 61 117 -29 -91 110 -151
7800 -151 68 -183 -24 8 17 9 73 -162 41 -159 -54 224 -48 98 -92 115 -219 -323 206 91 54 97 242
7823 242 -143 114 32 82 27 -87 51 42 -157 73 -205 -104 -9 65 -175 -58 -10 -45 58 -18 28 -192 62 -240
7847 -240 -310 -27 24 -66 -171 244 -176 -266 102 -37 199 -121 -316 105 82 -33 127 114 88 137 -23 37 -237
7870b37K70J35j87j4j37NJ18L1p9J94k57l9J09L57k18j68J18j56K46m21K75J90
7892A35m2kJ47l02m4P2J79j03l9j0N2K4j01m5RK00q1n0K7l7j18K06q6K28l12k3
7918a16K69n9L2j29P9p7K13j62J06o2j4q0Q3J64r6n1o6j16j41O76l77j57K31j35
7942A5J69k74o2L29m25L68k23J22J30j77J23o8K02k10j48p9J58P1k16PJ06J18
7964C6J66j53Q4R9l89J93k18L05k16J60j76RK2J9l8M0l8k7K36r6kK14l18M00k44
7989F8L6j99N5j50R0J96j18k41M01j98O0n3P8p7Q7o9j02P8j00Q5J8J18r8j43J05
8014g3J15n3j01J24j33Rr6L70j0j14k6Q6J77l15Q0K09m07J24M9j09j8L39k71R8
8038E4j16J57j56R8j64m0O9R1j85L40j99N1m3P1O2p1n0j8K00l74L72k17K1m0K9
$$ plain form
7870 -237 33 168 -19 -33 -170 -165 -47 -16 -95 99 -158 -197 -88 269 51 -117 1 -155 91 -330 -55 135
7892 135 93 91 238 -64 -108 -36 143 40 1 -9 43 67 -34 -79 -70 130 49 -1 26 -11 -129 77 -9 219 -93 -116
7918 -116 153 94 126 -3 76 -1 212 50 156 94 80 0 83 247 151 100 34 -82 -223 453 76 -81 150 15
7942 15 184 -90 -152 177 -248 120 -103 19 149 -28 95 27 229 19 -129 -208 -50 21 -195 -188 -82 36
7964 36 202 49 133 232 -157 36 -182 123 -93 67 -109 -100 -78 -59 -97 -57 -95 -122 114 18 16 230 -88 312 68
7989 68 104 -95 -40 -190 -100 96 -22 -263 138 -60 0 -53 25 -52 35 -34 -136 -58 -158 -73 -55 63 -35 -178 -73
8014 -73 42 -11 -112 12 -121 -112 -208 162 152 38 12 98 275 -40 40 249 -158 -34 15 -94 -112 227 -44 54
8038 54 -62 95 -61 37 -127 -167 -98 -7 -192 148 -51 0 -43 28 90 19 -31 -49 151 -223 149 -68 -47 -87 -58
8063e8M6p1j46M3J50j15J94p5rM0j71Q7J19m2l3j19J0Q9K30j35j25rj14M68k10
8088D4l84M87k65M1K49J3k04o2L02j20k56K5Pn6J57L23n09L90j08J0K39k96J57
8111A84k87K69j86J44j64J97o03K73J89j03k5jp7O3J60l4K3n9k6k6K18l83K57
8134CO3r7j10p8J21j3K48k88j69L33k6J06K01k36k3K2k90J96j94K59k28K40k20
8157a80J73n1R0o3n5J37j63q7K32J43j47L9j21N0K21j59k37J22n3K6l1JK53l1
8181A09J14p3l75P4K59K69k47j63j7J21
$$ plain form
8063 -58 -12 -83 -229 -186 -36 -151 43 -32 -41 -1 -172 -85 34 -8 -41 -160 -150 -61 169 34 -91 -100 -214 254 44
8088 44 -340 147 -118 -77 172 185 -19 -81 221 101 -155 -130 -123 -179 -22 301 -208 182 74 84 323 27 184
8111 184 -103 166 -20 124 -40 157 -446 -173 16 -87 -112 -113 -190 -127 33 -1 22 -37 -63 -89 129 -254 3
8134 3 66 -31 -141 -219 -98 -111 137 -151 -320 13 -13 93 294 58 35 57 -233 -37 -231 28 -200 40 -180
8157 -180 -7 -58 32 -31 -86 51 -112 -199 33 176 29 68 -53 -3 218 59 -178 -56 -109 -83 -114 -113 140 109
8181 109 223 150 -225 -151 108 377 130 -33 -50 71
8191G1
$$ Imaginary data points
##PAGE= N=2
##DATA TABLE= (X++(I..I)), XYDATA
0@%%%%%%%%%%%%%%Qj6J6j6J6k4L2l2M0m8N6o9Q0r1J04j23J43j63J87k14K43k74
36a45L08l47L88m34M85n40O02o67P39q18R04r97J099j215J340j475J623j789J974
55A035k178K408k667K962l302L700m171M737n435O314p461R010j1183J4207k2049
70a4073K75594k06401l16382L13677P9754k19814O3277Q2513j30415Q1011O7416
81G6157j46454L4860J24154j23021j5979J26692q0597n9327J22687m3534o9300
92e3662J07629l6372j03712J42438K6428j87626O9937J54171j41421o5719J43683
103E5774k7078r1151P6374J3623o5236L8555J3704m1946M1392J165o0709N4883
115I350L6981q6250J8761P9049p1623l3088R9491k3768q9180O4105N4468p3201
$$ plain form
0 0 0 0 0 0 0 0 0 0 0 0 0 0 0 0 8 -8 8 -8 8 -16 16 -16 24 -24 32 -37 43 -48 56 -67 76 -87 100 -114 129 -145
36 -145 163 -184 204 -230 255 -285 317 -350 389 -429 475 -522 577 -638 702 -773 850 -939 1035
55 1035 -1143 1265 -1402 1560 -1742 1958 -2213 2524 -2911 3403 -4058 4952 -6231 7976 -14073
70 -14073 261521 55120 -261262 52415 132169 -87645 -24368 58145 -72270 8741 76157
81 76157 -70297 -35437 88717 -34304 -50283 76409 -4188 -63515 59172 15638 -53662
92 -53662 53967 17595 -86117 56321 82749 -104877 -34940 119231 -22190 -87909 55774
103 55774 28696 -62455 13919 27542 -37694 861 14565 -27381 14011 15176 -45533 9350
115 9350 46331 -39919 -21158 57891 -13732 -46820 52671 28903 -60277 3828 58296 -14905
127a4905j4673N2205j4992k0417K6993j1490k9187K8745K5242l6573k1667L4642
139C923J4422k9302j421J9032j5117l222L1944j3161l8171K6680L4857k4017k3508
152a7061O640J9690J9754k7387l8483M7489L4853o5950q427O6128l0974m2141
164c5869N8158l501n8468M6162K4249o7004K6459N0050o8292n024P8067m3586
176A401n0904O9939M256n6283L6474J3871m3443L4523J6975n5945K8017L9464
188C8345o0708P520N9623n6920k3467P8177k9804o0256O7632J0034p1977M2425
200F24L6642o9945J2771N8560n1221j8019N5752k6006k5717M9136j8149l8791
212c4363N3241N069n5514L0828K9407m3816J1828K6880m0758J1522M2575m9240
$$ plain form
127 -14905 -29578 22627 7635 -12782 14211 2721 -26466 2279 27521 -9052 -30719 3923
139 3923 18345 -10957 -12378 6654 -8463 -11685 20259 7098 -31073 -4393 30464 6447 -17061
152 -17061 -10421 9269 29023 1636 -36847 10642 45495 -20455 -28882 37246 6272 -35869
164 -35869 22289 18788 -39680 6482 30731 -36273 -9814 40236 -28056 -33080 44987 1401
176 1401 -49503 20436 24692 -31591 4883 18754 -24689 9834 26809 -29136 -1119 38345
188 38345 -22363 -14843 44780 -12140 -35607 42570 12766 -47490 20142 30176 -41801 624
200 624 37266 -32679 -19908 38652 -12569 -30588 25164 -842 -26559 22577 4428 -34363
212 -34363 18878 23947 -31567 -739 28668 -15148 -3320 23560 -17198 -5676 36899 -12341
224a2341j8106O4471j7981n1934M1081J8708m2174J3765J8755l1328J2138K5555
236B0609l4830n587L6924j3597k0384J9517q91q431J6300r689j5208K5952L154
249A3839k7340J2006J7304j9261j290J6331j0689o412J2262m392n951Q070n093
262f16o929J1919J711j4373j895J2642O675j2357j5799J6015K3467k0721k4817
275b5078K4385K1822k0853j4073J0742J0983L535j0712j5356J5897K0523k0041
287A774j7731J8513J0941j1845o560R24O277N169j1485n888J5516k353j5578J2572
301B46Q910k0652J208K1754q838j4598R859N972j451J914j0204l067K2832L30
315A4215k9047N532K7729p575k1119M135J3479K653r814j0395Q673J2492r922
$$ plain form
224 -12341 -30447 34024 16043 -35891 5190 23898 -18276 -4511 14244 -17084 -4946 20609
236 20609 -14221 -19808 17116 3519 -16865 2652 1761 -6670 9630 -59 -15267 10685 13839
249 13839 -13501 -1495 15809 -3452 -4742 11589 900 -5512 6750 2358 -3593 4477 -616
262 -616 -7545 4374 6085 -8288 -10183 2459 9134 -3223 -19022 -3007 20460 -261 -25078
275 -25078 -693 21129 276 -13797 -3055 7928 11463 751 -14605 1292 21815 1774
287 1774 -15957 2556 13497 1652 -4908 -3984 2293 7462 -4023 -9911 5605 3252 -12326 246
301 246 9156 -11496 -10288 11466 2628 -11970 -2111 3861 2410 4324 -5880 -8947 13885 14215
315 14215 -14832 -9300 18429 10854 -10265 -6130 7349 10002 188 -10207 -1534 10958 1036
328A036j2251R833O696q329k455N693m18m125J647M591j073o098J800R089k247
343C389p932K484N389J073J104q035n280J7353O705k6654l913L0226j041k9007
357a4139L874K1762n038j3680Q96P071K201m405m293L583J726k100M003j844q014
372h397R237R726j6189m404K0688m339j7603J5011R183k0682L267K0445j5249
385F94j3152K0532K098j8981O053J0173j0719K86P700q862j707J0198m975o630
399g292Q093p18m808P415k750q953J2647N861j8225L418J7751j0936r701J5146
413F948j631j1251J1863O68j5383J1009R961j9183K53J7513j1092q675J4512n303
427B09r394J4411m122j3790J6859K856k1931J4261J4885k6516L092K7771k1513
$$ plain form
328 1036 -11215 -1382 5314 -3015 -5470 223 -195 -4320 -2673 1918 845 -5253 -3453 5636 3389
343 3389 -4543 -2059 3330 4403 5507 -2528 -7808 9545 16250 -10404 -14317 15909 14868 -14139
357 -14139 -10265 11497 6459 -7221 -6325 746 2947 -1458 -5751 -2168 -442 -2542 1461 -383 -8397
372 -8397 840 10566 -5623 -10027 10661 6322 -11281 3730 12913 -7769 -4502 15943 694
385 694 -12458 8074 10172 -8809 -2756 7417 -3302 -3016 4684 -4178 -5885 4313 -662 -7292
399 -7292 801 83 -4725 2690 -60 -9013 3634 9495 -8730 -5312 12439 1503 -8198 6948
413 6948 5317 -5934 5929 6597 -8786 2223 12184 -6999 -6746 10767 -325 -9000 5512 209
427 209 -9185 5226 1104 -12686 4173 7029 -14902 -641 14244 -12272 -9180 18591 -2922
440b922j4181L2908o304k9255K6358J2553l3353R001K4919k4417m727K3792j5148
453g76j0714K4187j0236j8031K2799j0k1967J7407N366k5024J7071J6351l1856
466a5433L772L0107k2006j1594K9586j3172j9686L3478j309l6448K2386K4365
478B4046l1529k463K3415j4457l552J8261j8184q938K8885r350k4150K2086O462
491A0532k3550J1723J1820k1829N107J8254j9143k964K1602j3140j2979K4459
503I892j122k3156J3658J4029j7063j034J2442p655k092R243p314m418J1637l385
517C662j0924Q432O224j0841l280R329J475o493l331K609N268J999q076p153J1082
532a8J2677j4360j3663J7846J0391j6182k379J1236o659m41J2646j1447j0135
$$ plain form
440 -2922 -17103 15805 9501 -19754 6604 19157 -14196 -5195 19724 -4693 -9420 14372 -776
453 -776 -11490 12697 2461 -15570 7229 7219 -14748 2659 8025 -16999 72 16423 -15433
466 -15433 -11661 18446 -3560 -15154 14432 1260 -18426 15052 13743 -22705 -319 24046
478 24046 -7483 -9946 13469 -988 -4540 13721 -4463 -13401 15484 6134 -18016 4070 10532
491 10532 -13018 -1295 10525 -11304 -6197 12057 -7086 -10050 11552 -1588 -14567 9892
503 9892 8770 -14386 -728 13301 -3762 -4796 7646 -9 -2101 7142 -172 -4590 7047 3662
517 3662 -7262 1170 7394 -3447 -6727 2602 4077 -2416 -5747 -3138 2130 4129 -3947 -11100 -18
532 -18 12659 -1701 -15364 2482 12873 -3309 -5688 5548 -1111 -1552 11094 -353 -10488
545a0488J8357J53j5248J1282J438j8638J6510J5487l1645m126L2851r421k0000
558a3488J4522k616o581K1191j1369k7145L1332J6249l9079O297L0197k4768o460
571a1718K9627j8495j5129L1469r478k4428L1930k3l8342K7774K4834m3700l22
584a6001L6694k1899j2371K6467j7601j1665L4426j4166l0453L5740P465l9077
596b2441J9725K3407l5001L824K9820k4269o182K8642k1731j2783M0691j3762
608I940l9229L5192K1345l9330J237K3206j5261J481J3318k3021O32K7844j7938
621e84j6238K5555m928j9820K3077L515k8551J4279J9122k1404j796J6981j2929
634c721k621J9239j1779j4215J9287M478j5293L624M623m874N548m29r504N588
$$ plain form
545 -10488 7869 8022 -7226 4056 5494 -13144 3366 18853 -12792 -16918 15933 6512 -13488
558 -13488 1034 -1582 -8163 13028 1659 -25486 5846 22095 -16984 -10687 19510 -5258 -11718
571 -11718 17909 -586 -15715 15754 6276 -18152 13778 13755 -24587 3187 28021 -15679 -16001
584 -16001 20693 -1206 -13577 12890 -4711 -16376 18050 3884 -26569 9171 16636 -22441
596 -22441 -2716 20691 -14310 -10486 19334 -4935 -11117 17525 -4206 -16989 23702 9940
608 9940 -29289 5903 27248 -12082 -10845 12361 -2900 -1419 11899 -11122 -10490 17354 -584
621 -584 -16822 8733 3805 -16015 7062 10577 -17974 -3695 15427 -5977 -7773 9208 -3721
634 -3721 -6342 12897 1118 -13097 6190 10668 -4625 -1001 3622 -1252 4296 3867 -5637 -49
648d9N639q379J153M858p644O2R622m435p691M429M966j866l726K91M514j551
664A93m100O780J926j1287M468J3343j0297r133J1981K214p432L363j639l676
678c296R536k450j2426J0144N035j4245O103J0573j6917K87J8445j2545r392J7430
692F282m817j1689J7141k220j8746J8221Q607k3998P663J8037k0056j054K1122
705A4493j5872r444K3875r117j7006K1598m93k2539J8033R418k5836P430J9657
718A4197k1090l521K1239j3041r355J9505o791j2277J7584l232j5491J8955K583
731I265k3299J4314J6042k3716j98K0578j3400o385J6714r796q837J8798n953
744D127j6763J7998L099k0253J0846J1772j9051J070J6376j1850n746J3055n452
$$ plain form
648 -49 5590 -2789 -1636 3222 -4422 -4360 5262 827 -6864 -2435 2531 665 -3061 -2770 1744 193
664 193 -3907 2873 4799 -6488 -2020 11323 1026 -8107 3874 6088 -1344 2019 380 -3296
678 -3296 6240 3790 -8636 1508 6543 -7702 -1599 8974 -7943 -7656 10789 -1756 -11148 6282
692 6282 1465 -10224 6917 4697 -14049 4172 12779 -11219 -3556 14481 -5575 -6629 14493
705 14493 -1379 -10823 13052 3935 -13071 8527 8034 -14505 3528 12946 -12890 -5460 14197
718 14197 -6893 -10414 10825 -2216 -11571 7934 1143 -11134 6450 3218 -12273 6682 9265
731 9265 -14034 280 16322 -7394 -7592 12986 -414 -6799 9915 119 -8718 10080 4127
744 4127 -12636 5362 8461 -11792 -946 10826 -8225 -7155 9221 -2629 -8375 4680 -772
757g72n038J0821n549p588J3417j54j2280Q007M797q641M927K083r224P399O681
772H886j3880K92J3582p072q021Q836r92m289M838l941l962R626j874r994P433
787e32N341r442J431N733m631J370L589o439L167O970r013j920J1127l517q367
802e133P288J903m730K537k137k674Q942l124j2432J0196R632j5359k869J3674
816E714m175p432O338r93k961O750l900o420J0157J906j0840M102P586o694q68
831a730M708l486J306L642p029P96R408p557o756J1745M67j1545M493O538o909
846a909j151M304l426M28L676m608j379O175j540m022L025J707j093J25j277P97
862a68L380k375l225M695J514n357J605L150k978p84K288j989j20J497k046r1
$$ plain form
757 -772 -5810 5011 -538 -8126 5291 5137 -7143 864 5661 -2980 1947 4030 -5194 2205 8886
772 8886 -4994 -4702 8880 1808 -6213 2623 1631 -2658 2180 -1761 -5723 3903 2029 -7965 -532
787 -532 4809 -4633 -3202 2531 -2100 -730 2859 -3580 -413 6557 -2456 -4376 6751 3234 -5133
802 -5133 2155 4058 -672 1865 -272 -2946 5996 2872 -9560 636 10268 -5091 -7960 5714
816 5714 1539 -5893 445 -548 -3509 3241 -659 -7079 3078 4984 -5856 -1754 5832 -862 -1730
831 -1730 2978 -508 798 4440 -2589 -1793 7615 58 -6698 5047 5514 -6031 -1538 5000 -1909
846 -1909 -3060 1244 -2182 -1754 1922 -2686 -4065 2110 570 -3452 -427 1280 187 312 -965 -168
862 -168 3212 837 -2388 2307 3821 -1536 69 3219 241 -543 1745 -244 -364 1133 -913 -1004
878a004K026k123o47K456k307m48L085k286j671M908j765m018N367R35n717L478
894B69L736n664R12N190m417j894N881k931l193N004j802m017O045j520o856O739
910A482K809j0135L295Q329q745l405J0904l607p199Q024J028p978N608M120q740
925d210K269P794o551k626P841k659m188N500j529l821N923j641p306P163L692
940E651j0921J766J0078p871m984R441k045o881P033P81q075O623L954j0218L101
955b567R181q133m250J1109k557p404P679L47p519O934L178j1447M012J0614j1245
970b068n007J3053k775r823P720K149q406N462L240r382M037Q351j1292j560J2806
985F505n908q732J1130J804r538M857L698p319N278L883j0796L312J1322r951
$$ plain form
878 -1004 1022 -1101 -1748 708 -1599 -2047 1038 -1248 -2919 1989 224 -3794 1573 2508 -3209 269
894 269 4005 -1659 -747 4443 26 -1868 4013 1082 -2111 2893 1091 -2926 3119 1599 -5257 1482
910 1482 4291 -5844 -2549 5780 -2965 -6370 4534 927 -6272 1752 2780 -5198 410 4530 -4210
925 -4210 -1941 5853 -698 -3324 4517 1858 -2330 3170 1641 -2180 3743 2102 -5204 1959 5651
940 5651 -5270 -3504 6574 -1297 -6281 3160 1115 -5766 1267 2048 -6027 596 4550 -5668 -2567
955 -2567 6614 -1519 -5769 5340 2783 -4621 3058 3405 -4114 2820 5998 -5449 -1437 9177 -2068
970 -2068 -7075 5978 3203 -6620 1100 3249 -5157 305 3545 -5837 -1800 6551 -4741 -6301 6505
985 6505 597 -8135 2995 4799 -4739 118 3816 -3503 1775 5658 -5138 -1826 9496 -455
999d55o267J1836j432q420O764j9p880Q604K007j3291O576J0961j4048m037J6775
1014G674m965j2908J1190N292j0974K698N736o618L071N520r339j61J2037n403
1028B850r588R202M108q878J049M671m024N36J810m442K126M435o896k337R520
1043D142j318r683L938P373m294l041J624j63K885K628p862j080J1151j357j1588
1058f645N569R254r018m071J0329k105q170O434K696o945K736K351o889N010O008
1073F544j2106k156J5111m276j2130Q153M765p665M146K369q934O083Q636j2511
1087c971j794J4131p229q275J3366j091j2931R556N607j1607L565O280j0548L626
1101a315J0075j3819k499J6233p426j0675J3599q27j3196J2802M693j8044O888
$$ plain form
999 -455 -6722 5114 3682 -4738 2026 2007 -5873 2731 4738 -8553 -1977 8984 -5064 -9101 7674
1014 7674 2709 -10199 991 6283 -4691 -1993 3743 -2875 196 5716 -3623 -3784 8253 2850
1028 2850 -6738 2464 6572 -2306 -1257 3414 -610 -74 1736 -2706 -580 3855 -3041 -5378 4142
1043 4142 2824 -6859 -2921 4452 158 -2883 -1259 -1422 1463 4091 -3771 -4851 6300 4943 -6645
1058 -6645 -1076 8178 -840 -4911 5418 3313 -4857 1577 4273 -2672 64 2415 -4474 536 6544
1073 6544 -5562 -7718 7393 3117 -9013 -860 3905 -3760 386 2755 -6179 -96 8540 -3971
1087 -3971 -5765 8366 1137 -7138 6228 5137 -7794 1762 7369 -4238 -673 5607 -4941 -1315
1101 -1315 8760 -5059 -7558 8675 1249 -9426 4173 3346 -9850 2952 7645 -10399 -3511
1114c511J4024j4908k363J5615r866p277J6830l856j4526J2768N129j3406N353
1127FO402j1531L895J0187j1848k972J2146n805n897J0346n049q110J2904L52
1141E026j4861Q730Q067j2165J525J0187r973k764J3015m538r026Q515K733o912
1155b441L483J380n057L961L146o660J142M483m676p4M926m676k986N871rm898
1171c085K137Q64j869K644K58m045O41M743q54l514M93L057k5k312P81J631j413
1188A32N2K424j329l160K826J342j980J09q42j319M211Q5p299K583O646n659l357
1205d535O560k171l675O175j569o474P485K212r172M428O348q548j29R250o347
1220a62l367Q248k830o080P771r00p260O895K074r483M547N911r622K072P055
$$ plain form
1114 -3511 10513 -4395 -6758 8857 -1009 -8286 8544 4688 -9838 2930 8059 -5347 6
1127 6 6408 -5123 -1228 8959 -2889 -5861 6285 480 -5417 4929 -120 -8230 4674 5026
1141 5026 -9835 -1105 6962 -5203 -3678 6509 -3464 -6228 6787 2249 -6777 1738 4471 -2441
1155 -2441 1042 2422 -2635 1326 4472 -2188 -1046 3437 -1239 -1313 3613 -1063 -4049 1822 1813 -3085
1171 -3085 -948 -84 -1953 691 949 -3096 -2455 2288 1434 -2080 -1587 1470 1445 -867 -86 1545 132
1188 132 184 2608 1279 -1881 945 2287 307 416 -426 -1745 2466 2551 -4748 -2165 4481 -1178 -4535
1205 -4535 2025 -146 -3821 2354 785 -5689 1796 4008 -5164 -736 5612 -2936 -3065 6185 -162
1220 -162 -3529 4719 1889 -4191 3580 2680 -4580 2315 4389 -5094 -547 5364 -4258 -2186 4869
1235D869q424n77R860p847m758J2574l895j0823J1014M672j2880L574Q518q024
1249b147K09P133q148K40J1010q022p649J1823J314j0066M226K815m869L847M57
1264B173p812O195N290j1238J069J0753p474o247J0601m93q390N118L233m856
1278b078K246O74l628M777J797p775L179O480n947k352N483j898j719L767l805
1293g99k371P170j931p213N276L652o475m2M084k119n64J582k019J284J453l200
1309b232J272L880m413p26N575k481l427M990p94l600M229j12n478M715L267p342
1325b677N42N812l586k343L380k177l90L850l932k529O471p61n905L717K631m066
1341a963J382K025l573J987L313m677J99N567m116k825N490o87m565L885J027
$$ plain form
1235 4869 -3555 -4132 5728 -2119 -6877 5697 1802 -9021 1993 6665 -6215 -2641 5877 -2147
1249 -2147 -1938 5195 -2953 -2713 8297 275 -7374 4449 5763 -4303 -77 2738 -2131 1716 2173
1264 2173 -5639 556 5846 -5392 -4323 6430 -1044 -7291 3310 2817 -5573 -455 2778 -2078
1278 -2078 168 842 -2786 1991 3788 -3987 -808 5672 -275 -2627 2856 958 -761 3006 -799
1293 -799 -3170 4000 2069 -5144 132 3784 -2691 -2733 1351 -768 -1332 250 -1769 -485 968 -2232
1309 -2232 -960 2920 -1493 -2219 3356 875 -2552 2438 1644 -1956 2273 2161 -3317 1398 4665 -2677
1325 -2677 -2135 3677 91 -2252 1128 -1049 -1439 2411 -1521 -4050 2421 1660 -4245 -528 2103 -1963
1341 -1963 -581 1444 -2129 -142 3171 -1506 -1307 4260 144 -2681 2809 2122 -2443 1442 2469
1356B469m016K056J241l495J958J362m341J705L928m570j521M839j688k883L388
1371D32J84k986K474J127l005J705K167k526k75J942r52J76P29j191L97R68j728
1388c62N02J193j981L95K037k973n31L556j749l164L448P02l274J634R37j898
1404a528J758O54l032K216K601m525O26L913k518j251L164k169j090M542k445
1419I16m150N706P99o502K640L756n310M94M406m434j150N422k916l390N512q64
1435I35m794M895J334o032L121L849n077N20M171m169j5N438m386l513P918j065
1451C130p285M805L296o284J362L864n011O70M589m689k018O139j926m741M808
1466G09J202n209L136K758n220J194M797m450q25N244l753k148O092j296n990
$$ plain form
1356 2469 -1547 509 1750 -1745 213 1575 -2766 -1061 2867 -1703 -3224 1615 -73 -2956 432
1371 432 616 -2370 104 1231 -1774 -69 2098 -428 -703 1239 287 463 1192 1 398 1366 -362
1388 -362 140 1333 -648 -253 1784 -1189 -1720 1836 87 -3077 371 1073 -2201 -567 370 -1528
1404 -1528 230 884 -2148 68 2669 -1856 -1230 2683 165 -1086 2078 -91 -1181 3361 916
1419 916 -3234 2472 3271 -3231 -591 3165 -2145 -1651 2755 -1679 -2829 2593 -323 -3713 1799 935
1435 935 -3859 1036 2370 -3662 -541 3308 -1769 -1249 2922 -1247 -1262 4176 -210 -3723 4195 3130
1451 3130 -4155 650 3946 -2338 -976 2888 -2123 -1453 3136 -1553 -3571 2568 642 -4099 709
1466 709 1911 -3298 -162 2596 -2624 -1430 3367 -1083 -1908 3336 -417 -2565 3527 2231 -3759
1481c759M862L713o585M6N151k975j909K967k394j040M934k457n404N056L303
1496C509n946m34M374j810q87K382k897l25N174k381m981N415L165o414L43N362
1512C649l391j878M179j761k330L665j078l662M127Q46n835K606M830n658k223
1527c914N646q70l449K565l10j917M261p87n841M771M845o985j990P243j329m139
1543b200L611l76k662L937m1n412L559L964o071r95O190l195l912N196J41n148
1559c414K931K288l550Q46K224l739J482L954m734j671O326q40n515L553K739
1574B880m165R50L378m048O2M693l971k603N881r15o105M348L005n185m37M148
1590A916k885o75L523l455j169N048j800m707N121J747o062K623M896o111n10
$$ plain form
1481 -3759 1103 4816 -1769 -1723 3428 453 -1456 1511 -883 -1923 3011 554 -4850 206 3509
1496 3509 -2437 -2871 1503 -307 -1194 1188 -1709 -2034 3140 759 -4222 1193 4358 -2056 -1713 3649
1512 3649 258 -1620 2559 798 -1532 2133 1055 -2607 1520 2366 -3469 -863 3967 -1691 -3914
1527 -3914 1732 862 -2587 -22 -332 -2249 2012 1225 -4616 155 5000 -1985 -3975 3268 1939 -2200
1543 -2200 1411 1035 -1627 2310 2269 -3143 416 4380 -1691 -2686 3504 309 -3603 1593 1734 -3414
1559 -3414 -483 1805 -1745 -899 1325 -2414 -932 3022 -1712 -3383 2943 2103 -3412 141 2880
1574 2880 -1285 -335 3043 -1005 -943 3750 -221 -2824 3057 2142 -3963 385 3390 -1795 -2232 1916
1590 1916 -969 -1644 1879 -1576 -2745 2303 503 -4204 917 2664 -3398 -775 4121 -1990 -2500
1605b500O490l008m142N335r9m282M225R16o538L264M961o255j035N793l334k374
1621b583M926k660l712O544m65o793M431L716o776J729N630n975j516P350l101
1636G45m477O456n58n605N292J633o859L071M550n751j40N643n267j579P156l766
1652E44n176O198J215o382K855K627m849K691L113n875L87O459l595l665N347
1667A894o55l726M175N53m665K503L242m670J078K751l381k49M374k988l302M170
1683A104O43l307J109Q39j974J406J590l387K31L446j793j870K297R2r64R47p
1700D02j166J325P18j448k22J541l30j239O88O17j31o18k22J48L14K09j008q82
1718a304J620N99k518q7K705r67j950J994q5j640J942R50k494N31K003j860P33
$$ plain form
1605 -2500 3990 982 -3160 2175 2076 -2206 2019 2935 -3603 -339 4622 -1633 -2668 3125 -209 -2583
1621 -2583 2343 -317 -4029 2515 2050 -4743 -312 3404 -3372 -1643 3987 -1988 -3504 3846 745
1636 745 -3732 2724 2166 -3439 1853 3486 -3373 -302 4248 -1503 -1643 4000 -1267 -2846 4310 544
1652 544 -4632 1566 2781 -3601 -746 1881 -2968 -277 2836 -3039 -2652 3807 212 -3453 1894
1667 1894 1239 -2487 1688 2241 -2424 79 3321 -1349 -271 2480 -901 -1150 3224 236 -3066 1104
1683 1104 1747 -1560 -451 388 -1586 -180 1410 -1977 -1746 1700 -93 -1963 334 426 -538 409 402
1700 402 -764 561 1279 -169 -391 1150 820 -419 269 886 755 137 -85 63 377 586 -422 -1304
1718 -1304 316 915 -1603 -1690 1015 48 -1902 92 7 -1633 309 1259 -1235 -704 1299 -561 172
1735A72J348k408j2M687k928l902M709J487m935J277K476l519J490K041m281L09
1751a989M999l227l258M832k31m302L311J375l606J703K097l427J354K696l796
1766a469L92M509l722k299N272p89m510L746R38l892K794J133m728K238L876n128
1782a639r54M846j847k538K734n95j836K914q29l151L211J873m204J265K794k753
1798g09m1K592k111n03L223k275j496L178o86k866K587N35l087J570J442k501
1814a148O16J273j733J049M52k369P62L008k317j859K773J84k115J466N26j145
1830e77J445l9j845J653P41k094R19J249j797L88J712k292q8K200k013p48K441
1847A255j360j892K774j62k849J904J494k869M97K185j508p43K423j402m80J783
$$ plain form
1735 172 1520 -888 -900 3787 859 -3043 1666 3153 -1782 -505 1971 -1548 -58 1983 -2298 -1989
1751 -1989 3010 -217 -3475 1357 1126 -3176 135 1510 -2096 -393 1704 -1723 -369 2327 -1469
1766 -1469 -1077 3432 -290 -2589 2683 1894 -2616 1130 2068 -1824 970 2103 -2625 -387 3489 -1639
1782 -1639 -2593 2253 406 -2132 602 7 -1829 1085 256 -2895 316 2189 -2015 -750 2044 -709
1798 -709 -750 1842 -269 -772 2451 176 -1320 1858 1172 -1694 893 1428 -1659 -89 1353 -1148
1814 -1148 -532 741 -992 57 509 -1860 -1098 1910 -407 -2266 507 691 -1424 42 568 -577
1830 -577 868 829 -1016 637 1378 -716 203 1452 -345 43 1755 -537 -625 1575 -438 -1186 1255
1847 1255 -105 -1997 777 615 -2234 -330 1164 -1705 -1208 977 -531 -1274 1149 -253 -733 1050
1863A050r31q18K169p68j691J843L84k155J219J097k136O88J591k507P3K163j318
1880d7j427J944n94j238J875m59j395J451O74j839O14J059j181M47O99p56J14
1897e9P03l87j40Q80o39o08J054m57m87R52m12p35N33n22JM16l74j033J447M85
1917F18j797Q60R48j798M61J483j259k11J558n50o63J357j163l72K197j255j860
1934a446K610M03k676P29J878j742K11J002k338P81K400k661j232L358l37l341
1950b401K365J131k725J963O99k856J313L098l518o51L570j313k071K755p59j758
1966a158K584k26l432K778K191m179L95L408l218o19L010j805j913L156o32k406
1982b066K482N49l136K318J819l400mL251j692j392K417j081j199K789p17k888
$$ plain form
1863 1050 119 -699 1470 702 -989 854 1238 -917 302 1399 -737 -49 1542 -965 -892 1271 -47
1880 -47 -1474 470 -124 -1362 513 54 -1341 110 784 -1055 -441 618 -563 -116 583 -173 -59
1897 -59 644 257 117 997 358 -250 804 347 -140 812 400 -335 198 -324 -323 93 -281 -1314 133 618
1917 618 -1179 -319 629 -1169 -708 775 -484 -695 863 313 -350 1007 -156 -528 1669 414 -1446
1934 -1446 1164 1567 -1109 -380 1498 -244 -33 969 -1369 -588 1812 -849 -2081 1277 940 -2401
1950 -2401 -36 1095 -1630 333 1032 -1824 -511 2587 -931 -1582 1988 675 -1396 1359 600 -1158
1966 -1158 1426 1200 -2232 546 2737 -1442 -1047 2361 -857 -1476 1534 -271 -2184 972 340 -2066
1982 -2066 416 965 -2171 147 1966 -1434 -1438 1813 121 -1271 1146 65 -1134 1655 938 -1950
1998a950L279R64l646J061K488k626n74K632j230k345K714p2k275J467P58j712
2014a067Q65J130k252K62K513j887j359K399N56j986L72J635j313L72O08j527
2030f79P40J614j590j329K654k33k284R83J371j851j36J447j385m22K000r77j629
2047a706J896L28j922P93J736j936%K193j602o32K279r53j548K256L44k782J480
2064B24J855k466l90K130j176j121J846o96j469K227p8l046K100J313k578j04
2080a429K560j335r35J984r95j245K621l01k791K484J216l289P80L016k340j066
2096a065K757j223j583K095M4k510J766J012k794R23K195k616o89L239j687j929
2112b065K547K56k597J725J325k478P52K227k343J45K215j833j105L026o20k931
$$ plain form
1998 -1950 1329 2293 -1353 -292 2196 -430 -1004 1628 398 -1947 767 695 -1580 -113 645 -1067
2014 -1067 -202 928 -1324 -1062 1451 -436 -1795 604 1160 -826 -454 1181 -132 240 848 -679
2030 -679 61 1675 85 -1244 1410 1177 -1107 -124 1247 -604 -740 707 -678 -1100 900 -77 -1706
2047 -1706 190 518 -1404 -611 1125 -811 -811 1382 -220 -852 1427 474 -1074 1182 1526 -1256 224
2064 224 2079 -387 -777 1353 177 -944 902 206 -1263 964 886 -2160 -60 1253 -1325 -1429
2080 -1429 1131 -204 -1139 845 -150 -1395 1226 925 -1866 618 1834 -1455 -675 2341 1 -1065
2096 -1065 1692 469 -1114 981 1025 -1485 281 1293 -1501 -578 1617 -999 -1688 1551 -136 -2065
2112 -2065 482 738 -1859 -134 1191 -1287 -535 1692 -651 -506 1709 -124 -1229 1797 1177 -1754
2128a754K400J393k954N60J933k428L31K057j964j144L058j019k555K618M50l065
2144b083J595K116k529n30K848j663j183K764j337j301K630j71k943J663K204
2159B080k554R1J866j927k54K328j595j554K573j0k574J616J160k390O83J768
2175A307k313o6K435j791j083K699q77k367K695O32k590J561J213k196O41J945
2191A845j850r30K486p10k009J796K54j755J027Q00j641L3J448j396j04R77n07
2208b36n12J110o3j346J063M53r96M9J325j069k04J102l34q84R14O04j009J82
2226A49J46J41k58J53q77K28J135n10j197L53J310j054m13Q83m68l36Q57j73r06
2245h37J294K6j383Q02J295j553k23J699p34p72J098k90p96R36n4j350J188Q86
$$ plain form
2128 -1754 646 2039 -915 -355 1578 -850 -519 1538 -426 -1570 1488 469 -2086 532 982 -2083
2144 -2083 -488 1628 -901 -1431 1417 -246 -1429 1335 -2 -1303 1327 1156 -1787 -124 2080
2159 2080 -474 -383 1483 -444 -698 1630 35 -1519 1054 1044 -1530 86 1246 -1144 -461 1307
2175 1307 -1006 -1072 1363 -428 -1511 1188 311 -2056 639 1271 -1319 242 1455 -741 -100 1845
2191 1845 -5 -935 1551 841 -1168 628 882 -873 154 954 -687 -654 794 -602 -706 271 -236
2208 -236 -748 362 299 -1047 16 469 -527 -478 847 -222 -426 676 342 -542 372 976 -33 149
2226 149 295 436 178 331 -546 -318 817 307 -890 -537 773 -281 -694 189 -279 -615 242 69 -837
2245 -837 457 483 -900 -98 1197 -356 -579 1120 386 -386 712 422 -374 562 508 -842 346 1232
2263A232k060K57J533j349n96J621o93j132J512j09j688J466Q22k080Q29J825
2279A390j885k93J856j231n99K179r41j462K164m8k001J313J025k326N57J594
2295A292j753j47J518j300p79J730o78j279J610m1j356J069P77j910O96J525j440
2312d66k31J324n33l73J017l86p91J282k98j135J295J79j367O63N94r05l3N23
2330C59n13r9O23p08m58J163o42n42P10j64l44P88k27m69R02j01j035R23M64j012
2350c82J87J034q02RO21o38j60Q08n09r21J387n82r02Q35M61j095M31L88q97N22
2370b05N29q26n0J222o85p73J664p47o00Q13J51j290J220K91r87L74O49r65J68
2389d7P94r26l79J427q99o19O81J44q07L79N04j048O19M84j001OJ175r54n3R70
$$ plain form
2263 1232 -828 -571 962 -387 -983 638 -55 -1187 325 216 -1472 -6 816 -1264 -435 1390
2279 1390 -495 -788 1068 -163 -762 1417 476 -986 1178 1130 -871 442 1467 -859 -302 1292
2295 1292 -461 -608 910 -390 -1169 561 -117 -1396 214 173 -1183 -114 663 -1247 -551 974 -466
2312 -466 -697 627 94 -279 738 352 -439 843 545 -590 705 884 -483 180 774 -131 -164 359
2330 359 -154 -253 370 -338 -796 367 -275 -817 -107 -271 -615 173 -54 -523 379 278 -757 166 630 -382
2350 -382 -195 839 37 46 667 29 -131 677 168 -753 634 52 -850 -15 446 -649 -218 170 -727 -205
2370 -205 324 -502 -552 670 -15 -788 876 129 -471 342 493 -797 423 714 -273 101 750 -215 -47
2389 -47 747 -179 -558 869 -30 -649 32 176 -631 -252 252 -796 -177 307 -694 -688 487 -467 -520 450
2409D50l17n72R64k54m74O42R0o96L62K36n79J53M77m61k64O30l24k04j6M2r1
2430b06M9l23J57M45l26K39l42Q1K78Ro3k19N03m42k4O85k73l97Q92l17p44R35
2452E97j01r10O53N96j242K18R59j212O5J219o79j010J220j59j136J102L85j614
2470a049R79R03j627L1K005j047r24J682p82q02J465j45j588J358P18j976P08
2487i1J310j813J80J757j693o22J547n33j326J737q0j746J555Q31k005L98J606
$$ plain form
2409 450 133 -439 525 271 -203 439 529 -167 195 431 -148 5 482 21 -243 387 63 -141 -157 -115 -206
2430 -206 -157 -480 -323 122 -204 35 -307 -226 52 61 -2 -221 282 -160 -184 501 228 -169 723 406 -338 597
2452 597 496 -414 239 835 -407 -189 770 -442 -377 842 163 -847 373 214 -922 180 565 -1049
2470 -1049 -70 833 -794 -763 1242 195 -729 953 171 -631 834 689 -899 459 1177 -799 -91
2487 -91 1219 -594 -414 1343 -350 -972 575 42 -1284 453 373 -1373 182 1013 -992 -594 1012
$$ [...]
8191H7
##END NTUPLES=NMR FID
##END=
