##TITLE=1H_Art-H2SO4(A)-f14-crsst
 CDCl3
 8 sc, 
 4.8.2023
##JCAMPDX= 6.0         $$ Bruker NMR JCAMP-DX V2.0
##DATA TYPE= NMR FID
##DATA CLASS= NTUPLES
##ORIGIN= UXNMR, Bruker Analytische Messtechnik GmbH
##OWNER= root
$$ XWIN-NMR		Version 3.5
$$ Fri Aug  4 15:44:25 2023 Russian Standard Time (UT+4h)  she@DPX200
##.OBSERVE FREQUENCY= 200.13135
##.OBSERVE NUCLEUS= ^1H
##.DELAY= (6, 6)
##.ACQUISITION MODE= SIMULTANEOUS
##.ACQUISITION SCHEME= undefined
##.AVERAGES= 8
##.DIGITISER RES= 18
##SPECTROMETER/DATA SYSTEM= spect
##.PULSE SEQUENCE= zg30
##.SOLVENT NAME= CDCl3
##.SHIFT REFERENCE= (INTERNAL, CDCl3, 0, 15.7039)
##AUDIT TRAIL= $$ (NUMBER, WHEN, WHO, WHERE, WHAT)
$$ ##TITLE= Audit trail, XWIN-NMR		Version 3.5
$$ ##JCAMPDX= 5.01
$$ ##ORIGIN= Bruker BioSpin GmbH
$$ ##OWNER= she
$$ F:/spectra/data/she/nmr/H-F/1/audita.txt
$$ ##AUDIT TRAIL=  $$ (NUMBER, WHEN, WHO, WHERE, WHAT)
(   1,<2023-08-04 15:43:30.00 +0400>,<she>,<DPX200>,
      <created by zg, POWCHK disabled, PULCHK disabled
       configuration hash MD5:
       00 E9 B6 7A A2 85 ED C7 34 08 36 98 17 FE 4E 26
       data hash MD5: 16K
       03 94 2D BC EA DD 43 CA 36 7B AB 76 1C 39 A8 34>)
$$ ##END=
$$ 
$$ hash MD5
$$ 66 98 2A C5 0C 0A 61 C4 2A 36 14 41 81 CD 96 EA
##$RELAX= 
##$RELAX= 
##$RELAX= 
##$RELAX= 
##$RELAX= 
##$RELAX= 
$$ Bruker specific parameters
$$ --------------------------
##$DU= <F:/spectra>
##$EXPNO= 1
##$NAME= <H-F>
##$PROCNO= 1
##$TYPE= <nmr>
##$USER= <she>
##$AMP= (0..31)
100 100 100 100 100 100 100 100 100 100 100 100 100 100 100 100 100 100 
100 100 100 100 100 100 100 100 100 100 100 100 100 100 
##$AQSEQ= 0
##$AQ_mod= 1
##$AUNM= <au_zg>
##$AUTOPOS= <>
##$BF1= 200.13
##$BF2= 200.13
##$BF3= 200.13
##$BF4= 200.13
##$BF5= 200.13
##$BF6= 200.13
##$BF7= 200.13
##$BF8= 200.13
##$BYTORDA= 1
##$CFDGTYP= 0
##$CFRGTYP= 5
##$CHEMSTR= <none>
##$CNST= (0..31)
1 1 145 1 1 1 1 1 1 1 1 1 1 1 1 1 1 1 1 1 1 1 1 1 1 1 1 1 1 1 1 1 
##$CPDPRG= <>
##$CPDPRG1= <>
##$CPDPRG2= <>
##$CPDPRG3= <>
##$CPDPRG4= <mlev>
##$CPDPRG5= <mlev>
##$CPDPRG6= <mlev>
##$CPDPRG7= <mlev>
##$CPDPRG8= <mlev>
##$CPDPRGB= <>
##$CPDPRGT= <>
##$D= (0..31)
0 1.2 0 0 0 0 0 0 0 0.06 0 0.03 0 0 0 0 0.0002 0 0 0 0 0 0 0 0 0 0 0 0 
0 0 0 
##$DATE= 1691149409
##$DBL= (0..7)
120 120 120 120 120 120 120 120 
##$DBP= (0..7)
150 150 150 150 150 150 150 150 
##$DBP07= 0
##$DBPNAM0= <>
##$DBPNAM1= <>
##$DBPNAM2= <>
##$DBPNAM3= <>
##$DBPNAM4= <>
##$DBPNAM5= <>
##$DBPNAM6= <>
##$DBPNAM7= <>
##$DBPOAL= (0..7)
0.5 0.5 0.5 0.5 0.5 0.5 0.5 0.5 
##$DBPOFFS= (0..7)
0 0 0 0 0 0 0 0 
##$DE= 6
##$DECBNUC= <off>
##$DECIM= 32
##$DECNUC= <off>
##$DECSTAT= 4
##$DIGMOD= 1
##$DIGTYP= 9
##$DL= (0..7)
0 120 120 120 120 120 120 120 
##$DP= (0..7)
150 150 150 150 150 150 150 150 
##$DP07= 0
##$DPNAME0= <>
##$DPNAME1= <>
##$DPNAME2= <>
##$DPNAME3= <>
##$DPNAME4= <>
##$DPNAME5= <>
##$DPNAME6= <>
##$DPNAME7= <>
##$DPOAL= (0..7)
0.5 0.5 0.5 0.5 0.5 0.5 0.5 0.5 
##$DPOFFS= (0..7)
0 0 0 0 0 0 0 0 
##$DQDMODE= 0
##$DR= 18
##$DS= 0
$$ [...]
##$SUBNAM2= <"">
##$SUBNAM3= <"">
##$SUBNAM4= <"">
##$SUBNAM5= <"">
##$SUBNAM6= <"">
##$SUBNAM7= <"">
##$SUBNAM8= <"">
##$SUBNAM9= <"">
##$SW= 18.05172834244
##$SWIBOX= (0..15)
0 0 2 0 0 0 0 0 0 0 0 0 0 0 0 0 
##$SW_h= 3612.71676300578
##$TD= 16384
##$TD0= 1
##$TE= 0
##$TE2= 300
##$TE3= 300
##$TEG= 300
##$TL= (0..7)
0 120 120 120 120 120 120 120 
##$TP= (0..7)
150 150 150 150 150 150 150 150 
##$TP07= 0
##$TPNAME0= <>
##$TPNAME1= <>
##$TPNAME2= <>
##$TPNAME3= <>
##$TPNAME4= <>
##$TPNAME5= <>
##$TPNAME6= <>
##$TPNAME7= <>
##$TPOAL= (0..7)
0.5 0.5 0.5 0.5 0.5 0.5 0.5 0.5 
##$TPOFFS= (0..7)
0 0 0 0 0 0 0 0 
##$TUNHIN= 0
##$TUNHOUT= 0
##$TUNXOUT= 0
##$USERA1= <user>
##$USERA2= <user>
##$USERA3= <user>
##$USERA4= <user>
##$USERA5= <user>
##$V9= 5
##$VALIST= <valist>
##$VCLIST= <CCCCCCCCCCCCCCC>
##$VD= 0
##$VDLIST= <DDDDDDDDDDDDDDD>
##$VPLIST= <PPPPPPPPPPPPPPP>
##$VTLIST= <TTTTTTTTTTTTTTT>
##$WBST= 1024
##$WBSW= 4
##$XGAIN= (0..3)
0 0 0 0 
##$XL= 0
##$YL= 0
##$YMAX_a= 140575
##$YMIN_a= -132243
##$ZGOPTNS= <>
##$ZL1= 120
##$ZL2= 120
##$ZL3= 120
##$ZL4= 120
##$ABSF1= 10
##$ABSF2= 0
##$ABSG= 5
##$ABSL= 3
##$ALPHA= 0
##$AQORDER= 0
##$ASSFAC= 0
##$ASSFACI= 0
##$ASSFACX= 0
##$ASSWID= 0
##$AUNMP= <proc_1d>
##$AZFE= 0.1
##$AZFW= 0.1
##$BCFW= 1
##$BC_mod= 2
##$BYTORDP= 1
##$COROFFS= 0
##$CY= 11.3945322036743
##$DATMOD= 1
##$DC= 2
##$DFILT= <>
##$DTYPP= 0
##$F1P= 15.7292609196834
##$F2P= 12.9074282941183
##$FCOR= 0.5
##$FTSIZE= 0
##$FT_mod= 4
##$GAMMA= 1
##$GB= 0.15
##$INTBC= 1
##$INTSCL= 1
##$ISEN= 128
##$LB= 0.24
##$LEV0= 0
##$LPBIN= 0
##$MAXI= 10000
##$MC2= 0
##$MEAN= 0
##$ME_mod= 0
##$MI= 1.114404
##$NCOEF= 0
##$NC_proc= 0
##$NLEV= 6
##$NOISF1= 3.799351
##$NOISF2= 2.8
##$NSP= 1
##$NTH_PI= 0
##$NZP= 0
##$OFFSET= 15.70392
##$PC= 1
##$PHC0= -21049.46
##$PHC1= 16.05272
##$PH_mod= 1
##$PKNL= yes
##$PPARMOD= 0
##$PSCAL= 0
##$PSIGN= 0
##$REVERSE= no
##$SF= 200.130013532006
##$SI= 16384
##$SIGF1= 3
##$SIGF2= 2
##$SINO= 400
##$SIOLD= 16384
##$SREGLST= <1H.CDCl3>
##$SSB= 0
##$STSI= 0
##$STSR= 0
##$SW_p= 3612.71676300578
##$SYMM= 0
##$S_DEV= 0
##$TDeff= 0
##$TDoff= 0
##$TI= <>
##$TILT= no
##$TM1= 0
##$TM2= 0
##$TOPLEV= 0
##$USERP1= <user>
##$USERP2= <user>
##$USERP3= <user>
##$USERP4= <user>
##$USERP5= <user>
##$WDW= 1
##$XDIM= 8192
##$YMAX_p= 0
##$YMIN_p= 0
$$ End of Bruker specific parameters
$$ ---------------------------------
##NTUPLES= NMR FID
##VAR_NAME=  TIME,          FID/REAL,        FID/IMAG
##SYMBOL=    X,             R,               I
##VAR_TYPE=  INDEPENDENT,   DEPENDENT,       DEPENDENT
##VAR_FORM=  AFFN,          ASDF,            ASDF
##VAR_DIM=   8192,          8192,            8192
##UNITS=     SECONDS,       ARBITRARY UNITS, ARBITRARY UNITS
##FACTOR=    0.0002768,     1,               1
##FIRST=     0,             0,               0
##LAST=      2.2672688,     0,               0
##MIN=       0,             -132243,         0
##MAX=       2.2672688,     140575,          0
$$ Real data points
##PAGE= N=1
##DATA TABLE= (X++(R..R)), XYDATA
0 0 0 0 0 0 0 0 0 0 0 0 0 0 0 -8 8 -8 8 -8 16 -16 16 -24 24 -32 37 -40 48 -56 64 -73 87 -96 112 -126 142
35 142 -159 178 -200 223 -250 276 -307 341 -378 418 -461 509 -560 617 -679 751 -824 912 -1005
54 -1005 1111 -1229 1366 -1524 1706 -1923 2181 -2504 2910 -3441 4173 -5248 6974 -10204 18255
69 18255 -80850 -69006 140575 -4867 -104507 25399 64559 -40830 -11293 24796 -8950
80 -8950 2259 24684 -17605 -2901 25981 -3363 -7668 18865 -8785 -7555 24225 -5112 -24558
93 -24558 20405 6202 -30848 9786 20444 -34936 -12804 34648 -8912 -37534 13026 21093
105 21093 -17031 -13107 8805 6058 534 -2027 -2661 6230 9346 2182 -2222 697 8186 9815 -3728
120 -3728 -6710 9165 8069 -6921 -4049 1164 -69 3369 -8070 -14172 11670 7556 -28514 -5427
134 -5427 28419 -13017 -30187 20576 15414 -25341 -1456 18255 -5734 -1064 8427 -7800 8086
147 8086 18121 -17094 -5107 31888 -5922 -23875 25711 11205 -31944 10567 25287 -28907
159 -28907 -11336 30488 -12736 -26406 20018 3506 -25549 7370 9440 -19361 2806 12757
171 12757 -14674 -1435 14619 -8813 -2198 16293 -7448 -6091 21686 -1315 -15790 18914
183 18914 11179 -19721 5727 17569 -13392 -5064 14832 -8862 -9783 13182 -4888 -17376 9725
196 9725 5884 -18499 -2974 10965 -5930 -8532 3489 313 -771 2486 -2602 -907 7607 3034
210 3034 -3335 2194 6833 3251 -1556 100 6746 2993 -6114 1357 8671 -5531 -8177 7742 2440
225 2440 -11835 -1990 5019 -4436 -4380 -1441 -4876 2236 3513 -9088 -4240 9542 115 -5791 3596
240 3596 1175 1039 9458 -2752 -8931 14645 11505 -15286 -1419 17507 -3383 -8500 8661 -1658
254 -1658 -7535 9272 -960 -15123 5195 8184 -14919 -4647 10424 -7516 -9527 8693 -92
267 -92 -10345 3580 5877 -3959 770 1819 -1373 7265 4813 -7515 1475 12729 -106 -6119
281 -6119 3100 3834 2051 2009 -6416 -4183 10121 1752 -14187 -2387 9381 -3095 -8941 -916 197
296 197 -949 121 -3978 -3911 3937 2991 -3648 -1505 4242 3729 106 -333 3333 4724 -1188 32 7072
313 7072 1127 -6524 3909 9451 -5418 -8621 5794 5743 -6917 -7070 1173 2313 -1625 -5908 -4654
328 -4654 2463 2613 -4612 -4710 1845 3232 683 -2319 -1463 5150 5059 -2890 -1277 7385 3065 -3782 2897
345 2897 6065 -3315 -1695 7404 679 -8739 1568 7697 -5244 -8711 3547 3104 -7463 -3650
359 -3650 3403 -2928 -4601 2868 -4 -5318 1096 4925 -2556 -2272 4736 2426 -1461 2691 3341 -520
375 -520 2221 4404 -228 -1616 2658 3254 -1092 -2750 337 2301 -1456 -5022 -812 1832 -3347 -4737
391 -4737 311 -400 -3815 -632 649 -2659 -300 3309 -1048 -2405 4057 3369 -2661 858 5533 779
407 779 -915 3885 2077 -1363 2564 2536 -3331 -598 4825 -2129 -5922 1694 1887 -5514 -2569 1769
423 1769 -3403 -2231 1719 -3173 -3557 3415 342 -4186 1873 2850 -1842 2276 3300 -2747 2653 6952
439 6952 -2960 -1625 7982 -190 -4553 6728 1952 -9032 3727 7765 -9674 -5080 8860 -3256
453 -3256 -9021 4205 -466 -8085 4534 2234 -11428 601 10730 -6381 -7411 8050 3511
466 3511 -3590 2546 1028 -886 6812 1549 -5943 5073 7047 -5745 -692 7108 -3365 -3713 6414
481 6414 -1469 -7821 3308 2677 -7399 -1433 2544 -5718 -1852 4415 -5025 -6639 5825 4010 -6997
496 -6997 -2485 6455 2108 -2693 989 2600 1344 2834 2154 -2151 478 7058 1291 -6497 738
511 738 6645 -1726 -4918 1184 -30 -2204 929 -3235 -5196 2779 1096 -6922 -668 3564 -4535
526 -4535 -600 5014 -4214 -2664 8836 -587 -6475 7901 4193 -7277 6104 7758 -9905 741
540 741 14133 -6272 -9976 11644 2577 -11689 4337 4567 -10758 1355 7132 -11074 -4791 10175
554 10175 -4445 -9394 6837 225 -7746 5743 2675 -8592 4930 8527 -7438 -735 9662
567 9662 -2461 -2242 8729 -1891 -5157 9445 2696 -9312 4079 6978 -7934 -1768 6257 -5956
581 -5956 -5174 6506 -2245 -9314 3030 4063 -6479 -2802 3298 -1559 -1418 2057 -1168 -1650 3669
596 3669 3158 -1714 -1150 4360 4507 -1856 -2178 4540 3683 -2406 -684 1833 792 697 -1878 -3544 1849
613 1849 2150 -5842 -3100 3452 -2529 -4323 2141 -1803 -3827 4466 -136 -6783 5205 5587 -8199
628 -8199 968 10294 -4836 -3496 11937 -908 -8441 9815 5969 -10968 2535 9871 -7651
641 -7651 -2999 8129 -5634 -5772 8822 -3109 -11160 6662 4088 -11393 -345 6282 -5321
654 -5321 -1881 4255 -5137 -110 8253 -4643 -5008 10475 1394 -7688 7362 5462 -8350 4255
668 4255 9602 -7991 -3728 11247 -1416 -8992 5170 3114 -6669 697 2316 -6286 -1235 4683
682 4683 -3709 -5738 1856 1599 -2256 -1845 -98 1483 1694 -1265 -1146 2739 2181 51 856 1089 1357
699 1357 2010 373 -111 1471 530 140 911 -1347 -1354 1442 -1139 -3260 950 -759 -4191 1745 859
716 859 -7037 -459 6678 -3973 -5943 5642 2301 -3994 3043 1661 -3702 5818 5329 -7499 734
731 734 10646 -2845 -5768 7546 2186 -5922 3555 2411 -6341 1068 4005 -5310 -2333 2760 -3761
746 -3761 -1738 3338 -5131 -4200 6692 -1003 -7451 3990 3637 -5185 1988 4487 -4864 1425 8267
761 8267 -3634 -4147 8019 2646 -5207 2520 3728 -3170 660 3105 -3354 -1941 3307 -793 -3911
776 -3911 -1242 40 -65 -1545 -3629 -100 2569 -1980 -3049 2341 1011 -2380 1874 2044 -1923 1541
792 1541 3523 -615 -283 3035 1333 -62 921 -316 381 1387 -969 -1161 78 -812 -755 121 -3000
809 -3000 -2214 2251 -1500 -4721 1607 1732 -4151 -599 3618 -2635 -1717 4637 163 -3300 3208 3567
825 3567 -1576 789 2681 -7 1277 1558 -1302 843 2391 -1904 -1454 2161 -595 -2684 134 -604
841 -604 -1960 318 -999 -3207 558 98 -3576 194 2323 -1982 -1234 3060 -67 -1712 2754 1982
857 1982 -1169 1583 2328 -119 630 1220 -217 946 740 -1187 26 736 -1202 -828 -294 -2108 -287
874 -287 627 -2909 -2294 2280 -837 -3868 832 2024 -2631 -152 2538 -1240 -598 3591 612 -1797
890 -1797 2057 2455 7 946 936 -26 1518 907 -1900 -1 1566 -840 -1654 -66 -1439 -932 691
907 691 -2347 -3109 1556 893 -3784 -923 2522 -1318 -1289 2050 -19 -1827 2778 2670 -1909 -44 3672
924 3672 1291 -925 1497 1550 -214 1480 945 -2056 -238 2259 -792 -3241 -403 1173 -1135 -2254
940 -2254 -1017 -805 50 -361 -2113 -870 1173 -174 -1039 676 312 248 2355 806 -2217 2115 4119
957 4119 -1344 -1497 3273 1105 -1815 1648 432 -3167 1057 3019 -3693 -3125 2823 150 -4317 -366
973 -366 1055 -2523 -573 978 -2200 -1089 2705 -162 -2345 1486 2294 -345 520 1393 -222 1257
989 1257 2409 -472 -696 2493 1216 -1512 633 374 -1263 497 74 -2892 -551 1932 -2370 -3365
1005 -3365 1553 86 -3730 665 1669 -3196 -357 3949 -1951 -2718 4334 1699 -3548 2217 3957
1020 3957 -2798 131 4742 -1204 -2383 3859 875 -3472 1683 1631 -3011 43 1397 -3511 -1219
1035 -1219 2655 -3058 -3142 2572 -965 -3373 2168 410 -3895 1719 2952 -3918 -85 5030 -1700
1050 -1700 -2304 4975 1283 -3444 3193 3369 -3582 334 4415 -2017 -2563 3124 -210 -3299 1360 661
1066 661 -3134 -232 1488 -2866 -1553 1736 -1150 -2579 907 718 -1337 356 1019 -316 784 1493
1082 1493 -286 558 2679 897 -715 1748 1673 -883 -230 1926 -553 -1151 1762 -365 -3260 1367
1098 1367 1458 -4076 -1431 2887 -2095 -3528 2781 265 -4480 1599 2989 -4121 -971 4930 -1370
1113 -1370 -2735 3950 684 -2417 3159 1896 -3528 2497 3871 -3668 -646 4409 -1677 -2610 2578
1128 2578 -1157 -3056 2705 -426 -5151 1963 2265 -5274 -341 3886 -3839 -2426 4965 -1758 -4741
1143 -4741 4596 2807 -4418 1322 4186 -2025 -186 3963 -1653 -849 4847 -168 -3453 2424 2042
1158 2042 -2901 -288 1276 -2285 -774 1304 -2150 -2388 1225 -102 -2278 -544 84 -571 536 -69
1174 -69 -1560 851 1912 -523 -640 1825 1633 254 507 1072 277 506 1915 74 -2095 1061 2694
1191 2694 -2221 -2536 2172 507 -3260 51 752 -2924 -380 1865 -3626 -2297 3612 -657 -3931
1206 -3931 2542 2044 -2953 1245 2996 -2759 140 4609 -828 -2182 3443 1099 -1221 2215 -264
1221 -264 -2348 3062 1080 -4866 1099 3919 -4641 -2853 4289 -2038 -4072 3291 217 -4795 1661
1236 1661 2386 -4093 335 3709 -2433 -1001 3992 -726 -2480 3931 1820 -2933 1488 2939 -803
1251 -803 -73 1473 -861 24 878 -1701 -233 1494 -1673 -1876 1357 -982 -2621 701 767 -2362 -570
1268 -570 1324 -1116 -993 963 492 -352 479 876 726 281 703 1279 560 -230 1253 988 -748 310
1286 310 1450 -1125 -876 1499 -911 -2074 1512 -170 -3077 273 1106 -2890 -835 1928 -1010 -1474
1302 -1474 1421 141 -821 1485 -143 -943 2265 767 -1594 1956 2253 -1850 594 2901 -1123 -546
1318 -546 2397 -722 -2146 2056 -203 -3003 722 426 -3080 177 1511 -3083 -1351 2552 -1325
1333 -1325 -2500 1309 580 -1331 836 603 -577 1274 1583 -766 582 1616 15 558 749 -870
1349 -870 703 1943 -1775 -915 2272 -596 -2289 853 223 -2470 533 545 -2347 -828 1165 -690
1365 -690 -1131 442 -425 -403 1309 -46 -711 1482 1055 -80 231 246 583 1654 -22 -1700 1969 1673
1383 1673 -2373 -843 2306 -706 -2078 966 -332 -2024 441 363 -2140 -754 557 -866 -819 115
1399 115 -468 -81 997 -356 -460 1208 914 216 642 269 683 1600 131 -1086 1121 1276 -927 -366
1417 -366 925 -383 -598 326 -648 -1414 180 26 -1591 -953 -51 200 -488 -798 160 582 -283 41 722
1436 722 5 135 1613 378 -899 1474 1932 -1050 -242 2180 -366 -997 1198 -12 -1691 620
1452 620 766 -2063 -621 737 -871 -1144 194 -883 -837 650 -582 -980 1196 183 -945 1203
1468 1203 1023 -1122 1156 2037 -1108 22 2771 -95 -1398 2001 1102 -1709 949 1375 -2016 -417
1484 -417 1730 -1313 -1969 1174 -268 -2234 57 760 -1942 -441 1036 -826 -952 1358 366 -1169
1500 -1169 1023 1269 -323 635 1115 74 573 1107 -49 111 1339 -168 -942 864 429 -1612 -348
1517 -348 683 -1403 -1233 876 -1009 -1956 875 530 -2378 -16 1591 -1207 -1135 1742 212 -1694
1533 -1694 1572 1586 -1508 315 2524 -414 -783 1742 813 -699 872 141 -812 784 561 -2011 -445
1550 -445 1017 -1046 -1246 351 -590 -1092 294 -474 -1922 772 1369 -1673 -419 1872 -311 -921 1560
1567 1560 599 -902 1606 1433 -1364 251 2364 -653 -1004 1842 168 -1758 652 1095 -2173 -533
1583 -533 1543 -1416 -1965 725 -19 -1779 440 436 -1669 143 1258 -903 -686 1709 28 -933 1672
1600 1672 488 -597 1633 1114 -1453 1110 1982 -1306 -458 1889 -893 -1626 2133 90 -3118 625
1616 625 1628 -3048 -1035 1931 -1330 -1726 1404 -64 -2144 1426 1322 -2429 241 2330 -386 -663
1632 -663 1669 55 -484 1772 244 -1299 1591 1129 -1221 -186 881 -796 -360 883 -1405 -1230
1648 -1230 1169 -374 -2023 219 798 -1326 -630 639 -878 -658 1104 -189 -1444 1179 1556 -877
1664 -877 -359 1570 508 -753 1109 1020 -847 406 1258 -779 -748 1622 -126 -1599 345 468 -1624
1681 -1624 -359 564 -1633 -940 912 -553 -1670 800 -63 -1232 828 522 -1196 679 1694 -1453
1697 -1453 -30 2635 -336 -1161 2449 427 -1789 1461 1444 -2304 375 2385 -1581 -1368 1979 -866
1713 -866 -2182 1364 159 -2742 617 1010 -2102 -504 1669 -998 -1136 1632 -43 -1053 1606 878
1729 878 -867 1310 1364 -1010 463 1533 -698 27 1544 -746 -686 1364 -192 -1392 487 221 -1822
1746 -1822 -394 552 -1095 -941 356 -422 -1051 327 231 -657 -360 863 402 -436 550 1067 454 -345
1764 -345 535 857 -176 600 478 -418 112 739 -506 -1032 653 12 -1151 -315 -212 -658 8 -335 -1207
1783 -1207 131 737 -1273 -260 1224 -678 -584 1467 239 -1339 1359 1537 -1296 212 1912 -583
1799 -583 -212 1714 -540 -1160 1999 124 -1984 671 942 -1721 -232 860 -1544 -528 758 -888
1815 -888 -1496 998 -84 -1319 353 183 -781 696 481 -791 770 1474 -928 28 1679 -273 -553
1832 -553 1515 70 -1006 802 509 -1257 -243 673 -958 -388 234 -765 -602 350 -678 -994 -84
1849 -84 -105 237 22 -389 344 777 -199 -310 1197 459 -360 715 811 -598 423 964 -569 -29 796
1868 796 408 -677 77 64 -518 164 -726 -905 141 -337 -954 -204 -115 -696 155 393 -715 36 1008 -435
1888 -435 -287 1192 311 -330 1259 548 -602 914 1367 -445 -495 826 224 -418 132 -342 -328 215 -441
1907 -441 -839 -216 -207 -366 -251 72 -761 196 219 -788 278 734 -134 -73 910 -313 54 1056 237 -472
1927 -472 1034 449 -463 351 550 -290 168 240 -320 -184 254 -1041 -647 30 -841 -543 409 -549 -903 686
1947 686 -132 -911 266 414 -1027 369 1054 -632 -176 1680 66 -491 1288 973 -621 569 1048
1964 1048 -788 -257 843 -366 -677 279 -319 -883 -99 -314 -770 -230 -221 -625 229 -208 -666 199 761
1983 761 -701 -235 1134 461 -297 553 897 -305 271 768 -94 -104 745 392 -612 123 559 -554 -552
2002 -552 287 -3 -702 -291 78 -407 -739 248 -18 -873 119 -5 -449 353 585 -372 229 1168 97 -150
2022 -150 856 543 -12 380 270 -74 764 498 -768 43 991 -729 -887 545 -139 -1186 150 -213
2040 -213 -1141 308 543 -1087 -437 1434 -367 -789 953 233 -883 709 1187 -571 -91 1571 -176
2057 -176 -360 780 -23 -258 565 138 -766 400 266 -876 -361 339 -547 -620 -77 -515 -680 551 -209
2076 -209 -1185 235 930 -814 -366 926 179 -267 1163 522 -521 511 990 -598 -378 1131 -49
2093 -49 -783 528 455 -723 -19 511 -907 -746 260 -531 -1011 264 -90 -927 67 144 -790 6 448
2112 448 -313 -120 821 111 -229 694 600 -561 687 519 -377 276 936 -263 -592 751 -350 -956 562
2131 562 112 -1183 -23 449 -763 -816 474 -432 -1146 459 249 -1076 101 802 -607 -390 961
2148 961 157 -162 785 554 -356 331 763 -277 186 619 -273 -231 304 -205 -602 386 -305 -1095 27 383
2168 383 -849 -630 598 -178 -684 435 418 -953 430 1095 -989 172 1446 -428 -603 1072 487
2185 487 -1004 431 925 -519 147 880 -895 -697 1038 -210 -1066 379 57 -817 -19 187 -794 -86
2203 -86 356 -926 -379 689 -339 -440 950 256 -884 495 834 -428 206 1067 -317 28 1119
2220 1119 196 -610 438 522 -742 0 750 -612 -731 363 54 -1017 102 -106 -682 -524 79 -425
2238 -425 -218 389 99 -370 203 586 107 94 265 469 267 410 160 38 567 421 -149 292 631 -133
2258 -133 -279 150 -433 -373 359 -190 -994 112 -5 -1166 -105 562 -484 -555 877 43 -889 738 765
2277 765 -812 444 1207 -95 -327 921 179 -562 866 373 -851 216 530 -511 -128 310 -669
2294 -669 -439 135 -694 -435 757 -495 -1057 466 298 -863 143 744 -607 -299 726 -315 -394 967
2312 967 332 -397 712 810 -308 213 578 -120 -207 448 56 -338 -225 116 -368 -167 -284 -168 -192 -281 -237
2333 -237 32 -323 58 117 -135 -275 126 639 38 105 433 306 251 56 100 139 415 66 65 183 17 21 -20
2356 -20 -540 -228 185 -525 -586 311 -135 -1023 116 -61 -697 -624 490 -316 -510 617 75 -159 444 594
2376 594 196 98 610 142 86 477 -182 -312 144 -93 -169 25 -64 -540 12 -145 -745 -67 0 -804 -194 285
2398 285 -646 -538 642 -57 -271 515 157 -301 159 428 -186 157 561 292 357 202 36 -79 26 156
2418 156 140 -178 -407 -139 335 -381 -631 363 -293 -695 -15 207 -665 -308 362 -324 34 384 -205 -56
2438 -56 714 433 -53 554 506 40 325 511 -121 183 126 -293 -269 261 -572 -280 376 -482 -407 282 -84 -770
2460 -770 20 153 -528 -92 212 -254 -309 500 199 -165 378 244 -18 182 516 34 47 343 -117 103 149
2481 149 105 -57 -49 -139 -112 -45 -332 -300 -185 -450 -374 113 -209 -310 -37 -313 13 -193 -35 192 386 32 177
2504 177 513 451 59 218 354 -337 249 230 -464 -239 515 -444 -764 605 129 -749 162 255 -658 -419 277
2525 277 -710 -530 558 107 -560 155 244 -442 -10 473 54 211 522 95 245 319 206 -163 595 47
2545 47 -527 600 403 -834 -286 190 -467 -336 232 -127 -524 283 -65 -909 33 282 -647 -282 630 -79
2565 -79 -257 338 121 44 216 566 80 -18 330 138 -131 195 21 -61 179 -100 -130 103 -7 -509 -337 -64
2587 -64 -303 -403 84 -85 -377 -118 473 -280 -304 513 7 -484 633 435 -748 237 772 -246 45 652
2607 652 247 -356 208 270 -607 -13 428 -490 -300 305 -424 -439 -34 -35 -780 -120 -37 -629 230 467 -256 -78
2629 -78 518 -180 -214 725 21 -449 653 790 -73 229 380 -259 -275 311 -257 -532 587 64 -579 79
2649 79 296 -712 -505 274 -334 -579 262 -230 -512 -16 465 -394 123 559 288 -280 459 423 -136 351
2669 351 482 162 -90 363 -192 -34 305 -199 -224 318 -143 -562 18 153 -198 -501 145 -451 -428 33 -224
2690 -224 -503 285 464 -410 -59 610 44 -209 499 270 -298 180 340 -166 201 696 -51 -88 268 16
2710 16 -475 39 340 -398 -80 169 -476 -35 137 -1 -360 191 -94 -255 327 -31 -319 235 550 282
2730 282 63 647 131 162 376 307 -195 256 464 -365 -143 181 -75 -479 160 143 -531 -69 291 -338 -465
2751 -465 278 53 -396 71 -31 -214 270 197 -208 242 238 -65 -195 356 69 -7 686 184 -165 105 -17
2772 -17 -448 235 400 -513 -181 197 -452 -538 137 -198 -594 23 99 -585 46 161 -18 -282 567 135 -209
2793 -209 442 448 -66 -21 295 -124 -142 408 112 71 20 38 -130 203 -285 -116 -81 197 -307 -78 53 -150 -114
2816 -114 -69 64 -393 83 119 -325 -91 382 -165 -351 294 359 15 252 366 -141 25 187 69 -30 110
2837 110 74 -291 -247 -42 -186 -219 -14 -185 -325 -335 77 -245 -233 35 -19 -34 67 174 164 -16 -18 -157 435
2860 435 306 -153 121 485 -180 -94 455 -148 -125 90 161 -272 -24 128 -534 97 135 -60 -96 198 -288 -435
2882 -435 -30 11 -227 42 92 -221 83 105 -218 238 315 166 303 302 291 162 210 146 -77 367 -3 -347 362
2905 362 61 -498 -100 156 -314 -257 -4 -106 -320 -67 106 -80 20 -17 -24 19 143 210 215 -16 189 249 139
2928 139 38 1 323 -133 179 330 139 -47 20 -9 -266 120 128 -210 -302 32 -194 -158 100 -50 95 78 -7
2951 -7 -89 260 45 295 268 -19 46 254 39 -72 143 132 13 -39 84 -12 -29 -20 -136 -183 -86 -103 -110 -240 5
2976 5 -217 -125 28 -164 30 -134 25 184 -6 -44 173 327 -69 178 396 102 136 222 42 -257 257 245
2998 245 -174 -67 72 -219 -18 170 -423 -398 325 101 -148 -10 -253 -281 -143 -110 -106 138 158 -298 11 619
3020 619 -14 -56 208 152 -148 440 319 -319 371 491 -519 -114 145 150 -412 28 244 -306 -179 23 -53
3041 -53 -188 145 -123 -160 -175 220 -142 221 65 124 297 97 43 215 116 79 85 335 -233 -153 522 -56 119
3064 119 214 233 -10 -103 37 -55 -213 -36 -287 -642 43 83 -375 -313 404 383 -320 76 162 -106 128 308 13
3087 13 -77 119 96 -217 -14 164 -311 -78 269 -261 -360 53 -125 -379 -299 -188 -277 -136 -68 -433 -19 175
3109 175 -262 -93 261 -78 -145 421 207 -287 311 199 -330 -40 353 -272 -333 478 -53 -356 138 96 -408
3130 -408 48 28 -259 -309 232 -85 -388 299 -118 -169 82 -101 -336 8 109 10 -115 481 15 67 78 113
3152 113 -20 -24 240 -195 139 605 99 -138 144 61 -671 65 123 -227 -340 -30 -53 -431 128 101 -251 -1
3174 -1 281 -339 -122 108 29 -143 13 -33 -18 114 199 68 60 298 -66 -27 -32 -41 -205 4 88 -489 -51 102 -505
3199 -505 -235 54 -214 -103 70 -202 -239 -21 -44 -326 88 184 -104 -7 244 181 -98 134 266 91 302 294
3221 294 -331 109 290 -36 -288 77 -75 -525 374 102 -419 -139 14 -272 -268 219 -162 -251 192 -41 -328
3242 -328 159 61 83 113 45 -183 105 370 -82 -177 284 8 -27 -38 277 -182 -309 139 -134 -186 197 49 -391
3265 -391 -306 166 -199 113 110 48 -125 -241 49 -53 235 75 -103 -162 77 -132 -59 283 53 -103 227 10
3287 10 161 325 125 -274 -43 149 -28 -219 -198 -392 -261 -184 34 -136 -301 265 5 -148 -128 461 57
3308 57 5 37 72 318 258 -47 36 118 229 -212 170 192 136 -120 64 36 -169 -159 -249 -306 -27 41 -256 -30 99
3333 99 -53 -110 -55 -55 -206 448 333 -205 266 100 -553 147 307 -32 84 307 16 -201 373 55 -379 -70
3355 -70 190 -147 -322 157 -279 9 -35 104 -182 -145 38 -168 -4 24 -101 46 296 109 -26 201 75
3376 75 -46 201 160 -31 60 -37 -157 237 551 19 -153 122 -90 -234 -108 -243 -169 -117 -140 -205 -114 -88 159
3399 159 58 150 -22 -59 -42 -118 163 -104 294 366 125 -9 71 -122 136 -66 30 152 -201 -40 -59 -152 -229
3422 -229 50 -142 -299 -57 3 3 -164 -356 -174 107 -245 138 -19 85 -171 281 240 111 277 89 0 46
3444 46 390 69 -38 195 117 -144 13 -92 -79 -254 -43 -181 -44 -330 -197 -99 54 -140 129 -116 -11
3465 -11 2 69 -63 161 -14 156 -127 112 164 210 -40 225 133 32 172 201 -120 92 12 -58 13 153 43
3488 43 -8 -93 -183 164 -225 -159 -84 67 -238 -50 142 -251 -73 150 49 -331 98 60 28 65 254 -106 -70
3511 -70 366 -121 -183 276 -38 -240 101 -25 78 -119 -86 -258 -87 -151 -274 49 -123 7 -9 -200 -210 36
3533 36 298 179 -331 244 181 -139 145 194 268 -219 244 290 3 208 -99 136 -98 -113 -45 -134 -262 -43 -160
3556 -160 -263 -41 127 -28 -30 209 -196 -408 99 62 112 282 9 166 432 101 -76 45 70 8 -41 327
3578 327 225 -326 221 -129 -383 210 -99 -213 -52 -141 -231 -173 244 -79 -52 124 -164 43 111 172 -127 153
3600 153 292 -15 64 198 247 16 256 -144 44 -31 105 70 41 -97 -222 -253 -162 -244 -40 73 -216 -281 -7
3623 -7 49 -313 79 48 -167 23 -6 55 199 250 208 -261 -187 157 45 -277 423 -13 -149 224 36 -139 24
3646 24 106 -16 -261 -114 -210 -242 106 -33 -200 -262 14 -220 -109 157 139 -58 193 325 -67 146 -145 -33
3668 -33 286 102 40 52 46 80 -263 130 47 -448 -155 80 -167 -222 214 -32 -405 -128 167 -282 -38 42 -3
3691 -3 -76 208 -122 -22 159 143 2 255 223 -106 37 -149 11 -103 120 -490 -187 209 79 -15 30 -91
3713 -91 -242 -57 209 -144 -133 -281 -186 -39 -26 -85 -166 259 119 7 148 145 68 34 192 79 -41 -97 -64 -159
3737 -159 201 142 41 -344 62 -243 -131 41 160 106 -115 182 -100 21 166 -65 -15 -104 152 -102 252
3758 252 51 -133 15 223 -184 -92 255 159 22 360 298 -18 -71 -96 -45 -202 223 -93 -361 -13 321 -43
3780 -43 -126 -232 -306 -287 155 -45 72 26 146 -79 -68 92 -144 -120 -5 -62 -111 -72 180 33 320 273 160 28
3804 28 20 -88 40 307 11 -228 -100 -119 -208 -5 -40 -311 66 105 -277 -134 -49 43 56 71 51 246 52 337
3828 337 203 133 111 108 -147 165 -41 8 132 -113 -225 134 -2 0 -248 35 -49 -268 -209 -32 -70 -3 -105 47
3852 47 81 55 165 -195 79 -151 100 -132 50 167 77 -115 145 36 66 -59 -18 17 395 -214 65 180
3874 180 -56 95 -227 -1 -295 13 -33 -86 -283 -109 -104 23 264 71 9 261 85 132 32 202 96 -88
3896 -88 66 -102 168 187 110 -44 84 93 -155 -169 -45 124 -161 204 -55 -380 -266 46 -95 130 117 185 140
3919 140 -11 -79 -199 32 146 150 -92 180 -150 183 80 29 165 195 90 -105 53 -220 7 -168 88 -73
3941 -73 -92 131 190 -52 -180 -121 -80 18 -83 -140 281 108 -36 78 254 -13 57 11 27 232 92 57 20 41
3965 41 -176 -232 163 -150 -69 -132 -122 -35 -178 164 63 -121 -252 -46 174 334 -93 -20 109 -8 -101 146 84
3988 84 113 -23 50 134 350 268 42 254 183 145 4 -205 -22 -265 -60 17 30 -7 -94 -204 -199 84 -120 -26 -40
4013 -40 251 -105 229 183 51 174 7 -32 -16 129 -117 -127 99 -28 48 -4 188 152 -324 237 229 33 -108
4036 -108 -153 48 -240 -52 221 93 77 -38 117 197 -53 207 215 52 134 -91 31 121 105 107 -8 -226 392
4059 392 -142 57 -159 145 73 -272 19 -50 -137 -95 247 -52 -238 -105 75 -276 -148 -47 -164 -99 -170 353
4081 353 -143 -64 -28 -212 146 24 63 -24 401 -1 103 318 -75 -39 146 -244 -100 10 -174 101 -10 -211
4103 -211 -64 -190 184 207 -154 -100 15 -219 -51 -80 -177 92 312 160 -265 234 8 -107 175 223 -57 237
4125 237 -221 -224 -112 -213 -255 -142 -45 -112 5 174 165 -158 -9 161 29 -142 -66 -21 29 -198 -160 -48 -63 349
4149 349 252 97 290 167 -119 351 226 -149 54 44 -66 62 139 121 -182 -39 82 -434 43 -161 -110 -41
4171 -41 -14 -104 122 -93 341 85 -130 179 88 251 -31 6 51 -109 39 104 162 -26 108 62 -193 -101 -48 20
4195 20 3 93 -102 -96 -162 -151 -170 -449 90 183 41 -44 241 30 170 -203 295 33 -32 -142 177 -128 92 122
4219 122 -84 285 237 117 -108 -64 -41 142 -185 7 45 -205 -60 -34 -400 -226 -35 -115 -57 -143 127 319 10
4242 10 -139 38 103 18 3 215 -76 94 188 46 21 222 -26 -131 147 191 -71 7 37 -273 -53 -112 -65 -187
4266 -187 158 68 18 -35 12 24 -66 -17 129 54 389 46 -213 267 4 -28 57 225 -208 -32 162 -51 -41 115
4290 115 -58 -85 -180 -225 -160 122 256 -132 3 63 157 -260 170 210 -1 -146 8 -46 87 231 -27 -43 119
4313 119 -82 -43 55 409 318 -31 117 8 168 44 -92 -268 -87 -179 -98 75 83 -34 -73 153 84 -157 46
4336 46 15 -198 106 -71 196 158 -227 53 -233 -300 57 -12 175 288 -141 -261 176 218 64 51 187 -133
4358 -133 20 9 -362 -56 206 -66 -182 178 33 -207 44 149 -124 32 -46 -9 -262 -89 81 64 224
4379 224 245 -75 157 -130 152 -70 284 -257 -218 -208 16 -133 92 -157 -170 -153 -27 75 -69 119 77 25
4401 25 -74 7 -66 156 84 114 120 264 76 174 240 42 96 -80 -146 76 -63 -177 -230 -161 127 51 169 261 -115
4426 -115 -64 3 -133 39 -78 -113 -28 -169 113 499 11 167 -133 130 -31 -79 100 -73 157 -7 -121 -4
4448 -4 91 -216 -59 -75 -64 39 47 -118 -67 -11 -242 -25 42 -42 -64 74 99 43 256 -129 -8 58 122 233 160 124
4474 124 122 321 164 37 -112 117 -168 -68 10 -237 39 -59 -213 17 -78 -198 -38 -235 -17 23 -118 -184
4496 -184 -41 88 -92 -32 -181 83 -4 76 194 134 274 45 46 236 32 51 -19 -6 147 272 135 -104 -160
4519 -160 -36 -343 97 -103 117 122 -79 -53 242 -94 -85 97 76 174 -85 95 -132 -42 153 160 -131 44 97 -182
4543 -182 6 -86 154 -126 -91 143 177 -166 56 -129 -30 59 -98 -52 -154 44 -22 181 46 -296 -13 172
4565 172 -16 39 119 -47 -61 531 -123 -199 127 82 -1 -2 144 20 161 -16 -204 31 -143 -43 -193 23 -103
4588 -103 -258 -103 47 -9 -278 137 -156 95 -300 195 199 -111 213 225 3 77 189 -63 195 -64 138 2
4610 2 261 -161 50 65 -11 -193 -54 87 -315 -108 -125 -240 -70 -73 129 -326 53 -64 58 109 43 -90 12
4633 12 47 172 45 33 135 281 83 -84 215 89 -108 4 85 -97 39 165 -252 -57 105 -494 -3
4654 -3 24 -85 -251 14 -176 -77 -107 -97 108 49 106 -1 103 -28 -166 283 126 -54 -79 196 -111 -99 305
4677 305 -133 -244 54 -226 -129 55 186 110 -121 84 -10 12 -57 62 -21 145 56 -61 -6 -35 220 -50 221
4700 221 -105 5 -58 216 -78 163 -96 -193 41 351 65 -297 -40 -308 16 -320 -1 131 -389 22 -83
4721 -83 -80 124 -35 73 -73 -87 101 152 73 -194 -95 66 151 -162 -92 167 -69 179 54 61 -112 87 -70 154
4745 154 -13 -60 -54 118 -1 -111 171 -83 84 -87 112 139 -207 209 -219 -33 104 186 -109 189 81 -32
4767 -32 57 90 22 -148 188 -42 101 140 411 70 -181 -219 -78 135 -6 239 -141 80 33 90 -174 -172 -125 40
4791 40 90 125 188 64 94 -139 95 188 221 -38 310 240 96 88 -112 -5 -106 -139 50 -77 -69 -394 -169 86
4815 86 8 137 -53 64 -175 -122 -59 157 -208 -60 61 15 -85 -27 -106 326 108 121 -80 -4 -101 -9 -59 47
4839 47 62 -43 -92 -111 -269 -68 -120 134 87 -48 -21 64 -16 -276 -62 27 -10 -208 -40 95 77 174 104 128 31
4864 31 -52 336 33 9 -201 97 96 84 -213 24 4 160 -200 -13 -57 -170 -16 -44 36 116 302 -184 144 116
4888 116 71 55 242 -104 67 28 -103 -77 -107 95 31 -65 18 14 31 201 109 -157 -146 77 -35 -71 -91 -84 -153 24
4914 24 175 -263 22 -3 90 -99 -27 66 -72 95 -40 -6 -113 -93 108 30 3 127 -75 85 104 -185 64
4937 64 -377 264 94 -77 -152 -106 68 -13 -95 185 -59 -329 215 74 -15 -63 168 4 -110 110 -75 284
4959 284 168 -29 208 -23 -111 12 20 -135 1 -9 91 -140 -129 -36 179 192 -241 54 -49 184 140 -29 148
4982 148 15 191 286 277 196 -113 137 20 210 106 21 304 128 186 -95 65 10 -199 24 39 -10 -13 -269 -95
5006 -95 167 141 -126 -25 0 140 58 10 -23 81 -183 -69 -99 -116 -194 -14 -43 263 95 -77 -223 155 185 -105
5030 -105 -134 139 -167 -141 -133 34 -208 -62 81 -274 -75 13 -5 -186 129 219 -89 73 -76 39 -119 -59 -13
5053 -13 -98 105 74 -73 139 231 -2 298 21 202 -194 -52 11 5 183 -17 -51 -42 -96 23 29 39 -61 2 -129
5078 -129 42 272 -115 2 258 -50 -16 -147 -2 -76 32 46 55 -24 133 36 -52 6 -109 -26 229 -1 -375
5101 -375 53 -31 154 -76 140 204 168 27 -11 262 11 -7 -28 -100 -302 201 154 109 167 129 42 30 269 151
5125 151 35 13 83 -172 -41 -71 -130 69 -196 -205 -43 -172 -126 -60 -135 -209 -121 -140 -138 52 270 -15 48 -180 167
5150 167 192 138 207 -26 147 46 -105 96 143 -132 -160 -217 -87 166 10 124 -367 -77 211 -171 76 -30
5172 -30 -150 -5 69 -67 127 52 24 -62 -1 3 17 -49 -54 82 63 -175 67 280 149 -37 98 -181 29 3 -11
5197 -11 174 -178 -344 -72 -146 -300 -301 -28 -231 -193 35 -217 -95 225 211 -135 77 314 78 -207 236 -39
5219 -39 -133 -19 312 130 -105 -52 -185 -14 118 80 -156 21 -95 -72 -44 -87 30 -87 -100 -60 -45 -48 156 -202
5243 -202 -99 99 -191 -33 -14 -31 136 28 31 -162 25 157 282 -20 -62 111 -161 51 -70 -38 -78 4 -49
5266 -49 261 12 -119 -33 -55 129 -158 239 41 34 199 -156 19 51 120 203 430 100 -199 43 -128 78 8
5289 8 108 -2 -155 27 -12 -195 -48 163 97 -85 129 -2 -53 115 80 -160 -211 267 264 -36 -65 -5 5 246
5313 246 -44 226 -57 -113 220 -31 61 -47 214 436 65 -63 188 -102 -160 87 -27 117 -94 260 -78
5334 -78 55 -68 -152 -188 99 142 -93 117 2 -18 -331 93 295 126 -129 -41 -148 72 -145 3 -204 -39
5356 -39 -4 -381 20 -116 -137 125 98 52 -18 36 -90 39 121 -12 -34 61 57 220 -63 -71 -35 222 161 -222 -1
5381 -1 -68 -21 89 117 -145 181 65 -22 -52 17 47 -142 83 81 -65 -102 87 24 -128 -116 225 60 130 -210 25
5406 25 138 -117 277 -257 126 2 -102 -195 -27 125 0 -23 191 -27 -293 -121 -127 -84 41 -188 11 -76
5428 -76 92 29 -127 97 75 -63 -63 109 117 1 279 71 52 -126 -174 38 -75 55 81 166 -20 39 -108 200
5452 200 -221 69 168 -185 -24 -236 -143 98 -128 -44 153 -79 -132 98 -361 -116 304 -56 -62 40 -38 133
5474 133 62 -37 15 40 33 -116 -10 -214 -139 144 -315 114 -23 -177 -120 43 37 -30 -314 -72 245 -110 65 129
5498 129 -86 -137 -172 356 24 40 314 126 39 26 -53 179 -79 351 229 -74 -83 10 -43 -139 155 -210 -77 148
5522 148 -16 19 36 -38 -105 159 111 -50 144 -15 -51 -87 -4 66 49 -117 30 -36 0 244 184 -241 -131 2
5546 2 240 107 46 139 34 -277 121 -55 -47 212 -5 173 -305 159 139 -227 -102 184 174 4 -6 -47 -40 -101
5570 -101 131 -72 -211 14 117 -78 112 -237 -231 -57 -70 -355 -162 5 -364 -110 11 -165 -25 -211 -229
5591 -229 111 -44 -58 -18 -153 -61 -189 -7 168 57 -294 -86 -82 303 183 17 11 -92 92 -35 -48 -43 -194
5614 -194 -38 -94 67 -75 4 125 -74 -65 -194 69 -122 -73 138 94 -91 237 29 -72 -53 308 32 69 -11
5637 -11 28 -258 105 -37 65 -225 -23 19 -97 33 244 -254 -35 179 -137 -10 -82 -17 -393 190 58 216
5659 216 94 232 -100 105 261 -13 6 66 204 -151 -87 -112 -80 23 -408 -153 -227 -19 -48 -84 -29 -191 -175
5682 -175 -189 -129 -279 181 248 156 -8 90 173 -63 -2 31 28 -85 134 215 69 62 250 -183 -64 -297 227 -181
5706 -181 105 -163 -381 140 146 -132 85 -44 15 6 -248 124 59 -114 -36 209 -108 14 37 57 126 85 282 30
5730 30 -129 28 -223 409 -9 38 104 -43 -11 -93 64 -41 66 0 -57 -182 -19 78 -27 78 -30 -46 79
5753 79 -105 85 121 153 176 117 62 114 58 -29 110 113 -25 128 -57 -38 -33 7 4 48 -225 -42 -29 78 108 -96 79
5780 79 35 41 -100 -255 -21 244 -241 -90 -23 223 25 -129 99 48 48 54 68 5 19 -72 72 292 -135 -17 38
5805 38 114 174 8 72 -46 -204 138 -366 98 -94 6 -271 190 244 190 -68 -167 -126 -105 7 204 45 117
5828 117 102 -72 77 34 207 40 -36 -10 -175 -101 -163 64 43 41 19 -146 -21 57 -124 44 -97 -221 -19 262
5852 262 210 228 63 -133 -37 194 -70 -215 -31 39 46 -106 25 33 45 256 77 -76 12 -145 27 -177 48
5875 48 -136 39 -28 135 -21 -212 -45 -6 23 61 -61 -45 -1 -13 -216 -142 20 52 100 -90 -69 -249 164 -14
5899 -14 23 1 129 -74 -144 -409 119 186 -89 -207 -71 -64 -42 101 4 56 -25 262 -46 -54 -250 -134 79 225
5923 225 124 -77 -68 -17 -286 78 32 102 5 -122 -39 18 -222 -4 -186 62 122 -43 -72 -21 -193 -218 -22 -151
5947 -151 200 -54 -149 -146 -71 165 124 -26 4 155 79 26 78 -63 -161 -61 127 -44 63 3 -21 -54 67 -110
5971 -110 27 -355 -200 -60 1 -128 114 109 47 95 128 -2 144 131 0 -4 -226 98 118 -122 160 88 101 204
5995 204 -44 117 57 29 88 46 -5 -63 -65 218 -299 -263 34 -222 31 138 -230 -2 221 71 58 -203 -20
6018 -20 -217 -122 2 64 352 -129 -52 52 81 -64 60 91 -264 62 -31 -146 258 366 -20 19 15 -30 -212 206
6042 206 -20 16 -61 259 -87 -79 60 314 215 -59 8 -157 -162 -3 -200 -128 15 75 177 37 27 54 -176 42
6066 42 198 182 -21 -299 -165 6 168 -167 38 144 17 -186 33 -74 254 129 154 221 -111 149 80 45
6088 45 6 -139 171 255 193 59 -81 -13 -144 67 -126 -288 151 -288 -140 102 41 -188 -40 -16 131 -17
6110 -17 90 127 20 142 59 -21 168 44 179 237 -143 58 -546 23 -59 -138 -109 33 72 53 -32 -28 7 -229 -15
6135 -15 -161 18 -124 -103 43 37 147 -274 75 -57 -117 -23 -11 196 8 -9 270 153 182 136 112 54 -53 -8
6159 -8 -78 -90 -51 3 -187 98 -231 -106 -139 -86 -116 -359 -77 55 0 0 -89 -7 -40 52 -4 -14 42 168 -126 -79 -9
6186 -9 113 -66 140 -38 115 -101 255 120 -231 65 -44 -114 -309 -217 -148 260 -130 164 82 17 -30 101 131
6209 131 70 117 -9 -26 131 -4 86 104 112 69 -33 -205 151 18 -60 163 -252 -26 -246 82 1 -159 -95 39
6233 39 -262 -282 151 -80 8 53 83 193 -121 -231 -27 -15 -148 114 99 -94 -89 155 74 -49 -154 213 -126
6256 -126 37 -40 137 71 -193 -130 -82 100 347 -104 -180 93 -27 -50 -103 -284 9 -141 -32 192 -155 47
6278 47 58 15 -155 -26 109 -162 -88 -280 -139 183 208 64 116 -35 -150 -83 -26 -59 -68 92 6 134 -177 -122
6302 -122 175 -59 5 11 37 71 -82 63 18 375 -60 -54 -232 149 -90 -92 -317 -221 -37 -206 -30 58 184 174
6326 174 69 21 114 -202 -46 -83 180 -41 86 268 -38 178 281 12 54 200 286 -191 -57 -54 3 10 264
6349 264 94 -124 -180 -82 -63 -252 -243 39 -96 74 85 7 -88 66 43 -79 134 -60 -49 146 171 -194 6 96
6373 96 13 -183 -21 -72 -8 349 8 111 -75 233 99 17 18 -50 148 19 -50 -98 -336 -57 -167 -174 -9 48
6397 48 -156 51 -59 22 79 -59 65 137 14 -70 243 155 -54 59 31 -14 110 -198 149 46 0 -145 53
6420 53 61 130 48 140 142 20 -119 -111 -9 -123 -108 145 97 83 -38 -35 -119 -101 232 -125 -137 -142 99 266 46 118 101
6447 101 -115 -358 64 -208 153 -86 140 155 -131 34 102 92 33 30 134 -39 162 176 42 -243 -7 -157
6469 -157 -330 -173 -174 -77 -87 -169 16 -59 91 168 76 -217 -55 -225 -219 -206 -9 177 -33 -205 -66 -73 128 -118
6493 -118 -179 -2 216 -29 -106 99 128 13 -14 337 230 108 116 121 60 -188 202 151 -174 24 -343 155 194 52
6517 52 -158 -156 -50 -61 -16 -26 173 -155 -246 42 -171 -294 -19 -55 97 2 93 185 12 16 212 52 112 -201 -191
6542 -191 168 -138 -174 181 -315 55 -79 -44 -105 -17 -107 -153 24 -222 -141 66 -38 16 88 -225 160 -204 278
6565 278 58 160 -17 -95 -35 21 -214 55 322 -135 -16 -138 -56 -29 221 -175 -118 -52 -28 -293 -104 -90 -140
6588 -140 -454 204 -31 -162 -86 35 295 -266 -161 305 -16 87 -82 93 -16 25 -318 -135 -10 3 -25
6609 -25 -10 -156 181 -3 -135 -32 53 -57 -86 160 2 10 -169 -47 44 106 11 -95 -158 112 105 130 -272 -45
6633 -45 2 291 -60 -27 -3 32 173 -30 -103 -142 104 -129 -334 22 72 93 0 58 168 -228 102 -25 -10 241
6657 241 -177 -88 -290 -156 -54 145 82 34 122 133 1 166 156 -3 -75 182 -71 2 202 -6 17 106 -73
6680 -73 240 109 174 28 221 32 -345 -3 -40 18 1 1 121 54 30 -68 -230 -14 26 -94 -84 -182 -125 -141 162
6705 162 20 81 -129 -134 -101 64 -187 82 -188 -4 -60 -144 18 14 173 -189 -313 -128 -98 2 -309 -60 69
6728 69 -75 36 181 22 -9 92 50 53 -9 -111 -37 -265 172 174 315 43 28 -10 142 161 73 -89 -9 21 -76
6753 -76 95 -170 -178 4 -1 123 -180 187 -178 -27 -90 -50 -112 30 174 215 -228 54 199 39 45 4 75 -1 87
6778 87 -123 67 85 153 -220 -28 113 -218 -81 16 -11 202 78 72 26 302 -94 -75 45 223 92 -91 -93 -197
6802 -197 92 -30 -35 104 -18 -60 4 99 113 -128 -203 49 18 -144 -62 174 61 145 298 -260 161 52 102 45
6826 45 147 184 -25 -185 -51 45 115 -24 -150 307 -29 -234 50 -100 -162 -108 94 125 84 -12 -275 143 -123
6849 -123 127 56 51 63 238 -76 -236 -245 125 210 -1 34 205 -135 147 211 86 -60 -57 114 -62 67 -240 93
6873 93 176 -78 -220 135 -3 -15 267 85 -16 115 96 122 283 -62 35 -80 18 111 14 206 123 45 287 245
6897 245 164 101 -76 293 71 -141 -105 177 -186 107 156 -55 28 63 -126 -130 125 -40 220 -55 132 172 -101
6920 -101 -33 43 -309 8 60 61 206 193 20 -200 -70 -166 18 -114 -13 -154 -111 277 -62 -2 -203 123 -75
6943 -75 -90 -248 -38 42 -152 -113 -148 107 -165 77 10 36 257 144 -65 -6 -40 84 87 263 -168 78 95 -56
6967 -56 -155 61 147 112 -249 -221 -215 95 135 39 -250 14 -79 -101 197 96 71 -137 -202 -109 -109 -22 84 90 -170 -64
6993 -64 101 -98 -63 -164 -179 -251 124 -12 129 46 45 98 52 236 -64 77 -71 -87 56 -93 85 41 -156 7
7017 7 -215 -81 100 122 83 37 84 -62 91 -100 -121 -278 -37 76 10 -182 162 -89 -278 80 -40 -217 -39
7040 -39 130 39 -87 -51 95 -50 -220 -28 -9 -142 -59 -131 43 220 -24 -293 112 -81 68 29 -11 121 80
7063 80 283 14 -108 115 176 -193 23 -127 -173 27 -61 72 -125 -111 -86 -34 -118 -76 -84 180 149 73 -71 -42 -85
7088 -85 -196 -54 89 122 223 127 158 -84 -87 -264 123 -31 18 -26 -34 121 108 -7 -8 -7 48 -13 -176 2 -23 122
7114 122 150 33 90 56 -24 -62 74 36 109 88 91 -64 154 -151 165 -57 -4 -208 -16 19 -61 -183 -79 -24 -159
7139 -159 -124 -21 188 34 53 -71 232 14 6 -12 74 110 129 -22 228 -163 4 174 -76 -384 261 -54 125
7162 125 -98 152 -124 -69 -261 29 -93 -41 145 77 -4 -43 62 34 -68 -158 153 -81 343 264 64 33 -5
7185 -5 -17 251 -187 -164 52 -21 -29 14 -135 16 53 -38 -143 10 -91 -123 188 58 -60 87 -248 -3 -166 -59
7209 -59 135 -70 -189 161 -94 61 -4 -50 27 268 84 -56 44 206 61 -178 46 199 126 -19 -86 30
7231 30 -46 -51 305 29 -176 -42 -45 222 -84 120 66 118 44 111 48 185 68 -146 144 195 318 420 38 -92
7255 -92 10 21 -79 -3 168 -78 27 152 -67 -136 -93 82 -130 -52 -21 -35 86 -66 50 77 -88 173 -1
7278 -1 -176 -85 -31 88 -144 7 205 -197 57 -298 9 -78 88 -138 -174 118 100 57 176 33 41 -130 51
7301 51 103 26 -44 -57 -45 92 222 103 -23 15 146 -23 19 170 255 -179 -4 41 79 48 -197 151 384 -129
7325 -129 47 353 -13 -142 -18 -169 14 -166 -58 99 -125 -394 -72 -38 -95 -41 257 13 -2 239 -182
7346 -182 44 9 -224 -134 -8 33 -130 75 100 -181 -139 -72 -242 -81 -129 163 103 -94 59 -139 -25 203 144
7369 144 44 -26 -59 -140 -234 123 -93 -156 -75 78 -39 3 -7 -17 -183 11 137 -213 263 75 -149 -188 -147 -1
7393 -1 97 -51 -192 173 -177 -37 313 -44 -220 247 0 309 108 78 136 -232 189 21 -57 36 -21 -17 180
7416 180 -102 169 -5 -1 -18 138 196 31 -226 379 91 -142 246 199 68 -209 -54 60 -129 1 -174 81
7438 81 -201 -88 308 103 251 103 -215 -2 -176 -30 -24 100 -13 60 253 175 67 -89 -128 -152 -52 61
7460 61 -310 65 15 -209 170 46 -70 48 204 23 -17 292 207 36 36 -42 -176 113 19 -239 140 -50 -151
7483 -151 -69 -27 240 46 82 -28 -139 116 -75 -7 87 -167 -108 -94 215 -159 175 103 -100 -254 6 133 61
7506 61 48 -21 -159 -205 -1 59 167 139 26 71 -166 73 49 -48 93 -81 72 -3 -17 18 -130 -60 50 34 -143
7531 -143 97 -61 9 69 -202 66 -146 -248 -70 -1 189 23 -61 -108 -88 171 316 38 155 -155 -70 31
7553 31 -89 90 48 109 -19 61 6 -187 -44 -131 -54 -48 9 75 39 29 106 37 -30 30 -176 -262 -69 -290 -33 -137
7579 -137 -110 248 124 49 -143 -246 320 -125 34 89 -27 -59 -44 123 117 33 22 67 124 -46 -310 282 181 30
7603 30 99 99 102 93 -6 183 76 -120 -28 30 -32 -5 13 -188 -2 -176 19 76 37 -96 -251 -67 126 -48 3 113
7629 113 -143 29 -208 93 112 -132 102 214 119 98 -203 82 -28 -93 -164 -177 -20 -148 -192 -75 60 133 -112
7652 -112 -156 -52 -9 -159 98 -56 93 -5 -236 -80 -164 172 155 39 40 82 -130 181 -38 -7 -11 -41 -113 26
7676 26 53 -50 62 -203 -34 201 -157 79 -24 -38 -51 164 -4 -131 -63 111 -144 -155 -50 -285 44 -125
7698 -125 -64 -50 -135 87 312 50 -385 -304 -28 66 -140 -95 -143 -45 180 -6 115 -43 67 78 44 99 131 -125
7722 -125 -36 132 -290 -83 -210 259 202 64 180 92 68 71 60 -99 -171 -71 69 256 109 161 102 -129 -17
7745 -17 52 -91 -47 -70 65 -89 -218 -216 147 51 21 -41 113 -86 41 -63 -113 -18 105 146 71 52 75 -31 13
7770 13 219 -75 -40 95 -100 13 159 79 285 60 24 -148 -130 -17 77 167 21 40 89 211 188 178 141 6
7794 6 149 -353 -147 38 -24 -43 -134 271 -25 -166 156 152 -268 -65 -13 134 10 -85 34 -19 53 71 211 -123
7818 -123 -188 51 60 -167 190 -215 61 95 149 -67 162 -125 -152 160 68 129 193 -16 -97 163 105 -46 8 -10
7842 -10 -100 -80 -183 54 125 -160 191 -64 105 -151 295 -120 -174 -14 -177 -21 -71 -157 86 -60 247 -28
7864 -28 73 -157 222 -208 -12 -13 -24 31 22 233 -143 101 119 -140 37 -21 -54 -151 -182 79 22 185 -78 196
7888 196 50 146 -5 84 -81 -84 16 137 -194 227 -218 79 -126 -203 30 -436 -76 105 -17 -199 64 209
7910 209 84 -425 -130 -54 96 -21 -224 -262 183 -169 -310 -22 51 104 -103 113 53 -188 -16 -215 -65 90
7932 90 122 -8 71 137 -63 -41 137 109 -8 -184 -161 -28 240 -288 -241 -75 99 61 66 236 23 86 83 -95 -55
7957 -55 137 -58 -43 152 69 -155 -86 -176 -94 -261 132 132 149 -39 -52 -123 116 -38 -54 84 231 -96 -249 -14
7981 -14 82 -2 216 1 -156 -117 204 126 104 -35 -33 202 41 -11 112 156 -99 -420 87 72 -269 85 64 -133
8005 -133 72 -63 -27 113 131 107 31 32 212 -368 -15 -62 -142 -4 -101 67 28 46 -35 -230 -8 139 -143 196
8029 196 56 -49 3 106 -71 39 140 -157 -205 40 -141 -154 -33 26 4 166 39 -152 92 -187 -52 62
8051 62 19 -173 46 148 116 -48 54 -139 77 -117 201 -207 18 153 -10 107 -34 134 -105 -149 55
8072 55 -50 -141 176 -186 -204 40 1 93 -59 115 -87 28 249 -189 -62 163 -114 -23 176 -126 88 222
8094 222 112 -103 -120 -68 -157 27 149 -99 91 111 119 230 189 51 313 -38 -153 -41 44 97 73 -170 -106 128
8118 128 121 209 255 49 90 -37 -113 -112 -162 166 -102 -49 -45 169 -36 59 38 -11 -102 -180 -27 45 200 -169 -14 -24
8144 -24 73 -88 -95 -91 140 -90 10 -58 -27 85 -90 -224 150 -12 -67 -49 149 -18 -14 -12 -201 -107 198 -276 -388
8169 -388 -114 72 144 -51 -112 -39 -82 -300 -29 49 320 90 149 -82 -190 22 46 -140 95 213 -255 -131
8191a31
$$ Imaginary data points
##PAGE= N=2
##DATA TABLE= (X++(I..I)), XYDATA
0 0 0 0 0 0 0 0 0 0 0 0 0 0 0 0 0 0 0 -6 8 -8 8 -8 8 -16 16 -16 23 -24 28 -32 38 -43 49 -56 63 -70 81 -90 100
39 100 -113 126 -140 156 -174 191 -213 235 -259 284 -313 345 -381 420 -462 508 -562 622 -691 767
59 767 -859 966 -1093 1248 -1442 1691 -2025 2490 -3175 4218 -9388 122557 30396 -132243
73 -132243 15339 79538 -39794 -42547 31865 -6663 -13745 16353 -12647 -16463 24544 -425
85 -425 -16453 14997 2957 -11331 22668 5805 -21991 17572 20922 -23539 4972 29372 -21504
98 -21504 -16503 36522 618 -38758 9435 26930 -19711 -20870 9239 4871 -8276 -7466 -5694
111 -5694 862 4089 -3811 -6820 -601 5671 6191 -3664 -6391 9801 11293 -4621 -2059 7784 5206
126 5206 4747 -625 -7206 11087 13051 -20135 -8139 27959 -5439 -32993 14566 19932 -27870
139 -27870 -12029 19454 -6804 -13284 5752 -6137 -2330 13605 -13086 -12541 26612 1982 -27445
152 -27445 19299 21901 -27018 2806 33616 -17542 -16446 34129 1285 -28235 18517 15905 -24824
165 -24824 1968 16720 -17132 -5737 14525 -12832 -10669 12860 -7356 -12370 11230 -4594
177 -4594 -13963 14328 2445 -19863 11330 15516 -18304 -269 22103 -7331 -8953 18416 593
190 593 -10365 14492 4605 -14924 9048 12856 -14661 -5236 13941 -3916 -12251 2588 1440
203 1440 -5568 -1686 -3940 -4667 2840 -246 -7060 -1344 4621 56 -3524 -362 5370 3756 -4338
218 -4338 1502 10841 -507 -5882 9607 7739 -8604 -387 9993 -925 -4887 1490 -1266 260
232 260 2807 -8021 -6631 7161 -551 -10811 -439 1353 -3824 2799 -2728 -10773 8935 11129
246 11129 -14474 -5332 18590 827 -11125 8767 6226 -6227 8067 6121 -10893 4898 13504
259 13504 -9950 -6530 13151 -2493 -11416 7055 2389 -12644 -291 5994 -6633 -5025 1174
272 1174 -3331 890 2407 -8769 -2298 11135 -460 -8370 3549 6880 1441 1638 -1412 -1027 10727
287 10727 5646 -10414 -652 13377 787 -8762 1074 3969 -1018 -1247 -3585 -4335 2368 1006 -6673
302 -6673 -4701 2049 728 -3777 -3417 486 2191 -2260 -1858 4771 1927 -5414 3308 10390 -2203
317 -2203 -6513 7869 9405 -4536 -4562 5277 5514 -1001 -3991 -2040 3326 2338 -5413 -5730 1289 1790
333 1790 -2999 -5136 -2921 1489 1680 -4965 -4308 4374 2266 -5061 740 6053 -1375 -2436 7614
348 7614 3476 -6187 3011 10544 -1508 -6856 6083 7069 -5179 -3078 4936 -349 -5073 1598 817
363 817 -6010 -1442 3251 -3933 -5658 2017 826 -4521 -958 1758 -2073 -211 3511 -14 -2211
378 -2211 2735 4202 142 -955 2814 4904 1107 -2092 1679 4486 -531 -3169 1577 1743 -3442
393 -3442 -1376 741 -2918 -2711 1119 -2088 -4765 1074 1510 -4968 -2380 3259 -656 -3542 2019 2326
409 2326 -1453 1720 3800 -843 447 6461 1047 -3283 3924 5490 -2677 -1390 4358 -762 -2621
424 -2621 2180 -1565 -4143 1388 215 -5743 -1415 1768 -4132 -2042 1466 -3623 -1475 4643 -2878
439 -2878 -4444 6176 1866 -5299 4958 5556 -6219 2758 10860 -5296 -5074 11495 2381 -8720
453 -8720 4510 4674 -6953 1796 4655 -9514 -2253 9791 -5519 -11512 5598 3582 -8116 -1691
467 -1691 1209 -3062 2429 1454 -6746 2307 7689 -4402 -2657 8490 204 -3784 6901 3136 -5722
482 -5722 4324 6916 -4883 -1545 5362 -2340 -2661 4578 -2594 -7219 3854 3507 -8412 -5039 5227
497 5227 678 -5839 -1643 1718 -489 -286 778 -2361 -38 5944 2107 -5303 1353 8855 470
512 470 -4197 3396 4040 -558 1649 402 -3244 2988 3105 -5923 -2181 4166 -3559 -4214 3499 -3599
528 -3599 -6103 5094 -410 -9299 3466 5294 -8491 666 8382 -7408 -3095 13952 -2075 -11227
542 -11227 11213 8532 -10498 2661 10141 -6928 -558 10753 -5854 -6456 11169 -380 -11353
555 -11353 5162 3784 -9702 1072 3829 -9611 -329 7676 -7511 -6205 8365 -1341 -6760
568 -6760 6352 684 -6611 6991 5424 -8553 2424 10362 -4598 -2442 9410 -894 -5105
581 -5105 7490 2095 -8092 2667 6070 -5892 -4365 3720 -1103 -3676 -192 -1753 -3396 818
595 818 1011 -3886 -3052 2540 2722 -3074 -2919 4128 3720 -2367 -723 3841 2541 1211 373 -829 3134
612 3134 4213 -2862 -2178 5309 198 -4147 1733 516 -4570 1907 336 -7862 1122 5029 -8370
627 -8370 -4160 8338 -4040 -8280 8506 1874 -10144 5949 8560 -9834 -436 12520 -3970
640 -3970 -4881 10094 211 -6402 8974 2432 -9832 5525 8307 -9799 -2684 8825 -3875 -5468
654 -5468 4060 -3636 -4054 5648 -3936 -8507 6963 2509 -10444 2755 7216 -8030 -395 10225
668 10225 -5167 -5534 11417 2621 -9080 5132 7708 -4822 269 6106 -3298 -1620 5825 -1430
682 -1430 -5725 2489 2668 -3539 -2814 -456 -78 -162 -2557 -3115 946 320 -2177 -1060 223 304 1043 301
700 301 -571 1690 1762 539 1355 877 87 2998 1293 -1728 1796 2174 -2106 1106 2862 -5175 -1685
717 -1685 6255 -3034 -7994 3557 2738 -6646 -483 1730 -4898 1113 4263 -7258 -2371 9760 -1577
732 -1577 -8077 6536 5343 -5838 2401 6109 -4143 582 6753 -2424 -2399 4991 -686 -2437 3747
747 3747 -2373 -4834 5319 463 -8705 1312 4460 -6203 -2196 4073 -4689 -2321 5949 -2980
761 -2980 -6379 6250 3932 -6485 986 6213 -1870 -320 4863 -715 -1320 4627 1642 -2712 716
776 716 2236 720 -810 -2077 -158 2455 -1914 -4296 991 870 -4046 -848 1067 -3026 -1318 2154
792 2154 -1428 -2229 2049 1299 -1020 601 970 944 2191 902 -69 1718 1235 539 1581 -134 -771
809 -771 2822 417 -3721 808 2599 -3820 -2316 3094 -2512 -4122 2584 -326 -4941 925 2512
824 2512 -3314 -1472 2504 -216 -630 1633 -275 328 3324 99 -657 3211 1507 -1614 1446 1718
840 1718 -1223 668 900 -1996 241 764 -3102 -1030 2050 -2757 -3064 1761 -694 -3749 609 963
856 963 -2783 -331 1818 -1005 -490 1435 97 796 1744 50 791 2422 705 365 1441 297 459
873 459 1928 -1018 -1538 2523 188 -4042 -176 2009 -2863 -2306 1623 -2069 -2716 1790 -333 -3507
889 -3507 441 2193 -1395 -447 1253 356 1127 1880 -709 458 2933 733 -474 1445 1035 19
905 19 1582 -396 -2065 1834 1822 -3328 -1875 2322 -1182 -3022 637 -440 -3119 468 1335 -2960
921 -2960 -1584 2650 395 -1962 540 1778 124 1063 1528 -585 789 3591 980 -2085 1363 3052
937 3052 146 -1265 38 268 -53 -486 -1666 -1370 741 -498 -2287 -801 -932 -1024 508 -481 -2824
954 -2824 513 3241 -1786 -2734 2723 2017 -1720 1064 2374 -1305 1117 4200 -1349 -2612 4188 2381
970 2381 -3488 -270 2689 -1454 -1421 1015 -1665 -1926 1627 -631 -3864 -103 1494 -1719 -1755 505
986 505 -510 -199 1604 -693 -1384 2370 1718 -1046 827 1932 196 1090 1728 -966 353 3046 -428
1003 -428 -2458 1781 1593 -3121 -467 2000 -3118 -1761 2806 -1761 -4744 2470 1627 -4736 -259 3771
1019 3771 -2674 -1986 4328 -6 -3305 3169 2645 -2593 1597 3502 -1286 133 3269 -1403 -815 3740
1035 3740 -732 -2875 2424 722 -3465 913 1078 -4002 -9 2664 -4414 -2648 3762 -1675 -4321
1050 -4321 3215 1592 -4700 1201 3773 -3110 -880 5093 -134 -2697 3444 2436 -2452 1721 2722
1065 2722 -1773 246 2490 -1499 -1669 2057 -140 -2727 299 452 -2027 -1121 324 -1241 -1111 113
1081 113 -906 -1096 1119 -86 -1445 1032 1992 -904 -151 2429 320 -546 2580 1190 -1795 1673
1097 1673 3281 -2330 -1317 4175 -353 -3878 1835 1381 -4119 -1 2764 -4180 -2803 3784 -959
1112 -959 -4855 1923 1357 -3379 1150 1980 -3256 741 4595 -2740 -1724 5314 467 -3121 3193 1847
1128 1847 -2464 2805 2063 -4018 1494 4122 -3882 -1630 4163 -2345 -3949 3934 -353 -6188 2271
1143 2271 3013 -5879 -1402 4221 -2470 -2317 3180 -695 -2318 3739 989 -3647 2318 3915 -2176
1158 -2176 -82 3282 -430 -685 2403 -396 -1576 1897 789 -2212 -476 480 -965 -395 -731 -2278
1174 -2278 -135 983 -1558 -2155 351 895 -943 -737 739 321 90 1321 421 -1025 1584 3291
1190 3291 -620 -1915 3255 2559 -2315 28 2282 -1538 -677 2233 -2158 -2962 3056 140 -5032 697
1206 697 2413 -3605 -1229 2649 -2663 -2089 3719 -674 -3617 2374 1758 -2276 1421 1548 -1672 2743
1222 2743 2726 -3427 522 5832 -2125 -3241 4699 539 -4680 2609 1887 -4754 181 3103 -3910 -2234
1238 -2234 2951 -1950 -3171 2728 -562 -3875 2268 2023 -3613 77 3141 -1190 -831 2001 266
1253 266 -253 2002 -272 47 2401 -65 -1182 1969 560 -2018 763 1425 -2013 -853 1482 -1068
1269 -1068 -2178 70 -300 -1387 -813 -270 -446 -506 -308 393 352 -635 759 1186 -411 272 1998 62
1287 62 -419 2459 648 -1322 1685 1522 -1839 280 2082 -1923 -1335 1875 -647 -2864 792 -212
1303 -212 -1935 -156 -396 -1831 544 399 -2364 572 2279 -2013 -787 2705 -332 -1240 2905 846
1319 846 -1396 2296 1559 -1737 1138 2169 -1863 -139 2349 -2097 -1925 2435 -339 -3344 670 874
1335 874 -2420 -544 436 -1483 -167 432 -1491 -389 1333 -200 -354 1193 -127 469 2146 -770
1351 -770 -726 2765 1072 -1752 1633 1707 -1522 441 1557 -1276 -1017 1591 -572 -1762 254 -120 -1318
1368 -1318 108 -624 -1376 371 466 -1524 -596 -51 26 1084 -31 -1358 1543 2516 -1302 -446 2994
1385 2994 1178 -1675 1463 1365 -1339 666 1416 -1433 -534 1436 -527 -1468 66 -670 -1058 65 -975
1402 -975 -1546 233 308 -800 -473 74 -1 691 135 -574 1256 1883 -212 -226 1388 824 -30 1067 378
1421 378 -472 679 724 -776 -835 527 -50 -996 -1082 -419 111 -978 -1064 -176 -654 -697 472 104 -1509 423
1441 423 1695 -954 -979 2282 407 -980 1545 1243 -1072 1291 1982 -1074 -129 1767 71 -766 889
1458 889 -351 -877 327 -609 -1548 500 46 -2019 -223 391 -1747 -465 1275 -1481 -1030 2255 135
1475 135 -2160 1601 1696 -1329 578 2291 -531 -495 2541 116 -1572 1696 1247 -1752 111 1337
1491 1337 -1087 -1011 900 -717 -1671 495 57 -1871 -386 636 -1390 -613 534 -395 -332 649 -211
1508 -211 -29 1359 582 -712 743 1422 -631 109 1544 -387 -671 1448 290 -1459 811 955 -1945
1525 -1945 -780 1543 -1363 -1862 1126 190 -2389 547 1226 -2117 -964 2151 -421 -1334 1334 1336 -732
1542 -732 665 1017 -632 921 1234 -986 -133 1822 -270 -981 893 731 -1228 543 130 -1801 188
1559 188 1005 -1761 -1268 1431 -394 -1881 618 395 -1626 315 1349 -1576 -220 2411 -195 -1147
1575 -1147 1638 1499 -1354 1076 2115 -1086 -269 2392 10 -1713 1271 865 -1669 -143 960 -1705
1591 -1705 -791 960 -1069 -1511 1002 -181 -1903 376 308 -1509 671 769 -1417 227 2067 -641
1607 -641 -901 2339 167 -1199 2294 1278 -2246 681 2873 -1589 -1578 2494 -72 -2203 975 568
1623 568 -2426 187 1220 -2476 -1099 2000 -960 -1642 1104 -74 -1206 1169 496 -1366 1018 1696
1639 1696 -1036 -213 2048 374 -258 1679 201 -737 1494 857 -1418 239 1539 -1366 -985 910
1655 910 -508 -1429 647 -164 -1776 46 1010 -1463 -1440 1227 -38 -1520 441 883 -920 -30 1645
1672 1645 -114 -612 1603 1090 -939 773 1682 -658 -233 1142 -475 -975 1092 -188 -1637 539
1688 539 292 -1341 -145 337 -1554 -235 1170 -2023 -1099 1925 -332 -2031 1841 1145 -2027 719
1704 719 2032 -1815 -308 2743 -424 -1495 2526 486 -1975 1129 1218 -1980 -99 1626 -1791 -1120
1720 -1120 1680 -736 -2027 817 45 -2075 560 307 -1374 151 770 -1168 -246 1471 -743 -631
1736 -631 1554 283 -918 1394 765 -914 972 1457 -817 -196 1284 -425 -1201 574 -17 -1486
1752 -1486 -152 382 -847 -888 221 -208 -1234 -445 268 -240 -650 297 647 -315 150 962 -300 417
1770 417 1264 129 -553 1060 978 -200 31 854 29 -23 166 -824 -238 466 -1239 -1031 827 -674 -1676
1789 -1676 610 219 -1986 191 1254 -1682 -773 1710 -463 -676 1492 189 -1040 1550 1408 -1575
1805 -1575 624 1839 -720 -602 1399 -453 -860 1354 -289 -1395 682 637 -1465 -149 491 -1276
1821 -1276 -287 -32 -1277 -110 788 -847 -776 1357 327 -1037 1211 488 -791 957 1286 -427 85
1838 85 1345 -169 -175 772 65 -287 649 63 -552 -38 47 -272 -527 -469 -87 256 -665 -1024 213 68 -733
1859 -733 78 408 -438 148 1113 10 -331 1155 712 -370 471 752 -15 455 270 -408 774 566 -601
1878 -601 -271 132 -774 -432 518 -881 -578 277 -748 -903 433 17 -1112 385 408 -1035 30 1634
1896 1634 -304 -495 1493 675 -494 646 678 252 473 381 -111 297 182 -549 -275 66 -678 -415 55
1915 55 -762 -557 129 -863 -672 270 -686 -795 346 -8 -738 689 492 -570 197 865 -118 245 835
1934 835 10 234 833 15 -306 810 -303 -383 753 45 -807 216 172 -1351 -198 276 -1248 -493
1952 -493 728 -858 -1150 662 -232 -1266 707 918 -770 408 1101 -365 -122 1538 260 -506 810
1969 810 553 -244 450 314 -365 240 231 -279 -185 50 -734 -277 393 -624 -1075 450 139 -1006 -144 615
1989 615 -368 -238 403 119 -402 742 611 -146 394 930 44 -183 715 776 -233 -126 502 -28 -552 244
2009 244 -54 -811 -122 -11 -812 -313 -92 -527 -531 276 -355 -922 501 299 -508 236 617 -161 398 784
2029 784 -216 341 1493 85 -1083 1010 591 -858 404 350 -1064 -28 704 -985 -1057 815 -389
2046 -389 -1895 243 287 -1179 -198 864 -683 -882 1380 -56 -568 810 555 -159 606 613 -365 493
2064 493 952 -339 -301 816 140 -521 318 -209 -533 521 32 -1375 -153 833 -1138 -937 597 98
2082 98 -896 212 37 -967 108 1097 -603 -459 1229 365 -663 513 1372 -276 522 1159 -74
2099 -74 -236 803 255 -691 470 501 -782 -245 357 -750 -264 409 -654 -1013 93 -127 -674 401
2117 401 315 -741 153 828 -267 53 1064 -54 -456 1021 404 -596 800 987 -632 52 1276
2134 1276 -243 -841 635 -78 -1213 -22 372 -930 -689 668 -477 -1123 739 89 -835 -50 252
2151 252 -491 105 746 -90 108 920 257 -455 436 580 -503 465 611 -596 -5 849 -463 -516 865
2170 865 -313 -801 73 180 -1111 -248 430 -1142 -798 879 -339 -1218 493 488 -862 43 898 -376
2188 -376 -107 1019 -45 -471 1188 384 -676 763 835 -680 -69 944 -506 -139 435 -184 -594 405
2206 405 -495 -1415 365 262 -1256 -166 873 -680 -414 886 -144 -760 986 505 -837 307 916
2223 916 -307 -6 1068 2 -673 917 340 -403 49 636 -241 -509 199 -143 -411 -79 -17 -528 -216
2242 -216 46 -427 -314 123 -146 -5 209 -11 -34 597 373 -137 359 664 -232 -60 851 442 -461 526
2262 526 417 -534 166 609 -632 -556 483 -471 -1166 406 150 -1212 -43 548 -792 -579 872 -269
2280 -269 -713 515 281 -609 435 653 -787 319 663 -414 -95 860 28 -286 735 -233 -282 725
2298 725 284 -1123 203 639 -976 -312 472 -541 -606 541 -503 -907 494 330 -821 77 682 -414
2316 -414 -129 1045 150 -323 573 414 -392 -171 339 -90 -27 79 11 219 -191 -339 -245 63 -178 -488 -196
2337 -196 -176 -228 43 -404 -326 99 -81 -303 -35 -9 138 477 -17 175 54 349 376 612 -130 -34 338 115
2359 115 -170 276 -104 -309 -31 270 -630 -672 295 -319 -781 98 51 -472 -264 179 -449 8 339 -138 107
2380 107 347 -95 -149 444 211 -118 500 218 -98 454 425 -292 335 152 -394 -221 318 -536 -519 238 -251
2401 -251 -997 -68 38 -776 -281 278 -462 -195 235 -43 55 444 168 269 534 -69 180 486 162 172 744
2422 744 73 -226 773 -55 -421 -134 375 -270 -481 160 -511 -539 176 -256 -842 148 169 -319 -87 342 -206
2443 -206 -32 224 -302 250 351 -14 324 655 -86 280 602 139 -440 633 304 -373 -317 354 -210 -68
2463 -68 -39 -320 -513 110 -169 -633 -88 91 -137 -184 331 62 99 445 106 140 243 376 367 237 293 556 137
2486 137 -59 237 281 75 78 229 -172 -312 -76 -22 -248 -244 -323 -387 60 -211 -202 -52 196 -203 196 296 -118
2509 -118 159 446 -21 -97 472 -53 -118 677 611 -476 286 926 -139 -411 572 -241 -618 259 -289 -766
2529 -766 -86 264 -515 -283 199 -359 -239 177 -65 -411 316 68 -311 200 397 -422 304 715 -342 48
2549 48 744 -18 -248 738 214 -373 277 87 -789 -162 457 -856 -769 448 -72 -732 -37 226 -242 -87
2569 -87 251 -4 -195 201 84 39 176 268 25 129 79 223 246 446 0 -89 257 -15 -43 89 287 -306
2591 -306 -240 56 -504 -276 43 96 -541 91 92 -525 -311 404 -331 -470 654 95 -572 373 516 -195 86
2612 86 578 98 -47 649 0 -87 328 257 -522 206 230 -562 -332 61 -242 -681 65 21 -754 -136 372 -488
2634 -488 -82 283 -487 240 681 -164 -263 652 9 -332 615 703 -591 168 730 -37 -526 578 -87 -760
2654 -760 117 245 -460 -24 428 -536 -471 288 -271 -613 5 418 -304 -135 549 -189 -67 597 -80 -26 287
2675 287 169 53 74 313 -223 243 590 -344 -365 459 -178 -647 337 284 -893 60 191 -737 -348 353 -303
2696 -303 -683 416 484 -437 107 748 -578 -69 523 182 42 617 437 -184 554 368 -366 401 471 -263
2716 -263 -326 242 -202 -339 362 -61 -611 -125 -22 -218 -195 229 -242 -185 392 181 -535 179 178 -357 392 757
2738 757 -13 -355 647 425 -311 375 452 -414 19 410 -328 -178 528 -52 -410 -365 17 -421 -300 165
2758 165 -590 -362 39 -255 -199 240 3 -302 240 88 -123 475 542 -198 128 514 0 -228 521 221 -321
2779 -321 631 259 -624 -62 144 -290 -284 513 -282 -615 -66 56 -748 -47 138 -306 -247 84 -203 -299 205
2800 205 52 164 132 85 -30 269 241 21 31 436 13 220 299 54 -149 289 2 -311 -150 -110 -371 -96
2822 -96 99 55 -179 -31 -10 -332 -54 200 -193 -156 144 159 95 109 533 -41 -57 245 217 -96 274 263 -86
2845 -86 -143 53 -118 -279 84 -164 -84 -157 -238 -449 -28 -24 -155 120 42 -172 -43 456 -15 -58 485 15 -201
2868 -201 533 254 -181 254 429 -27 -233 524 66 -143 356 30 -113 -294 237 -238 -158 164 -82 -155 -111
2889 -111 -86 -177 186 -32 -65 357 126 137 328 352 -95 -233 235 73 145 263 4 -80 267 -1 -124 127
2911 127 -52 -344 -163 -22 -325 -308 -127 -320 -17 93 -204 -98 -94 -53 23 91 -171 36 140 -64 71 316
2933 316 108 36 400 143 -173 219 290 103 -110 171 -43 -233 -52 -89 -167 -222 -205 -316 -110 39 -241 -237 -187
2956 -187 -124 197 156 -438 221 179 -7 -5 263 18 -157 325 312 -134 14 142 -408 5 159 -166 115 -97
2978 -97 -279 -255 -153 -412 -76 -127 -460 -66 148 -139 -36 275 -13 -303 293 162 -123 190 153 -164 121
2999 121 262 65 -18 359 48 -148 277 -22 -159 21 -60 -214 204 -54 -400 -74 70 -314 -122 64 -302
3020 -302 -190 -89 -55 -333 -19 454 -84 38 381 -130 168 571 -12 54 210 226 -99 299 375 -239 -7
3041 -7 256 -47 12 67 -223 -200 -47 -138 -144 136 60 -182 -127 -89 -18 -22 76 -104 -49 87 -17 -109 -74 73 52 -10 -38
3068 -38 -99 9 -65 -79 -310 -247 35 -106 -424 16 97 -567 -154 39 -324 -134 19 -189 -331 123 222 114
3090 114 208 499 -79 -270 545 86 79 388 261 -106 105 269 -100 271 130 -569 37 214 -468 -280 -82
3111 -82 -17 -590 -4 227 -594 -5 394 -539 -91 583 -39 -199 453 384 -421 319 248 -281 -226 249 127 -170
3133 -170 306 215 -67 122 80 -126 23 -86 224 -251 12 -311 -368 15 -409 -100 94 -172 48 57 276 -3
3155 -3 90 113 159 -24 276 176 51 400 135 -143 -375 457 -56 -281 134 388 -325 -323 378 -162 -151 151 -19
3178 -19 -389 -51 -150 -412 -485 114 -283 -164 461 -48 13 164 -9 -291 250 151 -299 182 261 -82 21 262
3200 262 -256 -94 161 22 -149 41 103 -372 -363 178 -250 -603 55 98 -319 263 223 145 1 375 -32 -232
3222 -232 297 226 -94 281 121 -169 134 40 -7 -107 159 -257 -105 -136 -39 -308 -100 26 -299 191 10 -314
3244 -314 -295 374 186 -14 -61 5 -256 -11 336 -259 372 459 251 28 242 93 -181 326 289 -32 -175 294
3266 294 142 -320 41 77 58 31 -220 -323 -52 -3 -23 -163 40 138 -10 109 -18 17 324 250 -207 260 421
3289 421 31 -17 367 170 -116 -15 192 -66 -125 372 28 -165 -8 -349 -199 -73 -195 -310 -51 216 -125
3310 -125 -173 280 197 -212 112 -54 149 32 27 67 89 12 -21 37 23 -15 80 33 -4 0 178 -24 -243 -63 61
3335 61 -52 -108 -83 -7 -288 -152 -18 -147 -133 331 -126 -51 165 110 -292 126 227 -135 61 286 226 -160 124
3358 124 12 -334 -63 127 -219 165 -22 -155 -65 -205 -438 -174 -8 -253 -329 69 -99 -138 19 -177 -210
3379 -210 -29 98 119 -178 203 123 -106 75 151 150 159 146 139 -41 18 130 -271 -31 197 -310 -127 -150 -105 -286
3403 -286 -333 -142 102 -252 -254 101 -103 205 151 -121 -77 63 157 58 -103 375 154 240 174 32 119 38 35 285
3427 285 103 -246 -93 -257 -213 -223 -53 -156 -156 178 -103 -262 16 -19 99 79 30 -53 -108 205 298 -79 170
3450 170 139 210 126 159 -13 -39 138 107 -54 -113 -87 -104 -139 -357 -308 -64 -114 -235 39 -161 -50 107 41 225
3474 225 130 253 -45 -65 166 -189 30 184 -125 104 192 138 32 143 -143 -74 254 -249 -214 84 -146 -130
3496 -130 -55 105 -261 -147 5 -85 -332 -39 -247 -254 93 254 -72 -131 221 88 199 350 165 112 110 76 247
3519 247 -62 136 108 122 -51 -97 -216 -10 135 -341 142 -126 -198 -97 16 -79 14 -12 -101 -127 286 114 -72
3542 -72 148 334 239 280 302 -129 -34 -55 93 37 1 112 -207 -243 -111 -147 -44 -337 136 78 -419 -29 131 -227
3566 -227 164 178 -153 166 256 -68 -219 -141 148 14 266 -86 -327 -27 25 43 219 110 -101 167 120 -262
3588 -262 -134 154 -189 -367 22 77 -416 -201 87 -75 -186 310 -189 -84 87 79 -69 229 97 -3 70
3609 70 64 -98 120 109 -87 -67 126 66 -113 173 194 -311 -54 33 -172 -28 -64 -63 -56 173 7 103 -7 76 -61
3634 -61 -199 111 -11 -8 120 306 131 -20 -17 -83 122 307 -107 -32 197 -16 -7 -20 1 -68 -78 -43 -116 160 194
3659 194 249 -518 310 -37 -105 -79 -51 -166 131 154 146 97 215 144 -70 59 103 42 5 332 133 -139 -98 217
3683 217 -60 117 -295 -280 -105 23 -15 84 259 -384 -308 56 -127 -291 111 347 -215 108 -152 54 -57
3704 -57 447 60 -45 271 141 -3 69 89 -47 82 118 -118 -150 231 -41 -31 226 61 -267 0 109 -85
3726 -85 -285 -109 -329 -333 -50 346 -23 -12 56 118 115 185 -20 46 -26 331 70 132 195 -7 -151 19 98 99 142 27
3752 27 2 -146 -79 -175 -67 32 -277 -345 148 61 57 133 192 -36 44 236 -169 -91 -13 248 55 325 394 1 -76
3777 -76 19 -87 -7 202 -187 37 -8 112 -297 -164 -130 -45 -282 117 162 -53 12 -169 -88 3 267 -471 -88
3800 -88 50 52 346 84 177 15 23 37 -32 127 -72 -164 105 168 -141 -52 -135 372 -197 64 -121 -284 -316 42
3824 42 -197 -167 163 130 -89 248 -93 -120 78 241 106 -160 33 26 47 9 130 -71 -147 276 -106 -24 187
3847 187 -238 -276 164 -18 -189 -82 -95 148 127 74 -129 -88 197 -27 178 84 107 181 167 421 102 -33 322
3870 322 15 -57 5 149 -108 -89 -6 -126 138 53 -161 166 -118 -8 -464 19 25 356 166 144 -124 -273 279
3893 279 -145 -35 67 -218 51 113 18 96 -1 163 45 64 337 16 -63 -66 -284 29 -113 112 39 -296 -19
3916 -19 -254 -283 81 -67 -76 45 -234 37 63 155 43 52 146 32 178 282 32 189 80 298 72 173 293
3939 293 -173 -167 -59 -32 -48 197 -108 -51 -49 9 -144 -217 125 -80 64 -58 175 -24 140 -92 -47 130 69 249
3963 249 169 176 -11 -125 -81 -84 108 159 -77 -115 64 74 -105 -78 -225 -7 -279 -85 -190 -28 85 -24 -260
3986 -260 92 5 -97 -10 147 226 -33 157 128 12 -8 -208 173 -163 321 161 -113 -29 93 -26 18 -49 -221
4009 -221 -198 -342 19 -46 -170 212 -197 -271 -223 33 -105 -266 -183 -37 17 0 26 -69 67 5 191 20 209
4032 209 74 30 -15 -81 122 -117 -130 -14 -62 -23 6 -124 131 -89 14 -180 -206 -56 -21 -152 198 16 434
4055 434 261 -104 135 104 214 2 421 138 200 48 244 126 -140 186 248 84 -149 256 -415 0 250
4076 250 -165 -100 70 -172 -104 -302 -114 4 -159 -165 -48 -31 -164 202 121 288 37 -33 -51 18 -253 -45 16
4099 16 -46 123 69 134 -131 -22 -185 81 215 53 -245 -67 -91 -81 61 -152 10 164 88 52 103 -86 75
4122 75 -129 17 -255 -67 -203 258 177 32 284 -128 -81 135 -58 -48 117 -55 -62 -161 227 -175 -227 -58 -145
4145 -145 -105 -226 93 -131 -1 170 24 -249 28 95 -56 83 371 56 124 281 90 -240 62 124 -164
4166 -164 4 65 -17 -61 -42 -200 -377 179 -110 -254 127 60 -261 -163 283 -26 -5 51 132 214 -30 -15 -36 108
4190 108 47 -52 -41 325 -95 45 -3 119 -94 21 27 -204 -63 -82 78 -333 34 148 -120 -42 107 -140 -180
4213 -180 27 -118 -37 95 58 -119 -123 17 -154 -30 14 74 172 -35 -179 -45 137 -84 204 66 -46 -196
4235 -196 27 103 -85 -140 -151 -60 -26 288 153 -202 -63 -51 204 -186 266 -127 -409 -39 227 101 80 296
4257 296 -29 16 372 -88 245 105 198 -37 52 18 -151 85 -250 -78 -273 -3 -151 -68 230 -181 -261 -1
4279 -1 -25 -94 143 14 7 -130 36 77 206 403 58 -176 -137 179 -126 -124 149 -206 65 28 5 67 46 -156 -19
4304 -19 3 -161 79 -102 -169 132 48 87 -58 -186 137 347 -84 147 15 59 6 59 -316 84 -371 86 35
4327 35 -222 398 26 -160 5 -187 -315 -241 32 164 -68 -40 -114 -271 150 124 14 24 37 -149 86 64 -62
4350 -62 284 86 -103 90 -25 -2 -47 186 17 -72 147 -135 -105 -50 124 -110 -262 -106 -93 -510 -292 55
4372 55 -214 6 186 -174 -166 65 -17 -16 333 155 -222 0 71 110 -76 29 128 70 314 84 -59 -161 68
4395 68 -70 -21 -257 -26 -167 -159 55 -225 -136 -94 -91 -112 150 -89 86 -51 -187 -233 -34 -28 115 165 38 2 -59
4420 -59 -158 170 -137 101 88 164 38 -60 23 -3 -19 99 -166 -85 2 -106 -152 -33 -288 -72 34 65 -82 -128
4444 -128 69 -226 -27 59 -40 -1 41 123 -171 -86 -190 132 -342 0 -21 -40 28 155 219 -147 -314 6 203
4467 203 -335 -8 -82 -71 51 93 99 46 -54 256 -169 62 -153 168 -88 -28 43 352 -33 -42 0 -136 -98 97
4491 97 -74 55 112 -232 -247 -448 -196 22 -63 -471 -162 -328 -103 -23 23 283 173 -140 199 -112 74 -20
4513 -20 -142 42 -41 40 123 57 78 -93 -128 0 87 -222 172 82 -67 -75 223 78 -19 -42 -116 -114 137 -69 159
4538 159 152 -147 -62 -50 -63 212 45 161 -281 -20 0 2 70 34 -83 -174 -91 94 -101 8 -249 -118 68 -130
4562 -130 -52 -19 -79 74 -141 21 -423 -145 289 -102 -262 -274 79 37 118 -141 85 86 -5 214 17 -56 78
4585 78 -318 60 -88 -111 -15 14 -131 1 -82 147 71 -160 -145 -278 185 -138 -25 -157 -148 -36 -133 154 -53
4608 -53 360 126 -125 104 51 252 -259 119 102 -34 -79 210 -193 75 178 62 -155 118 -91 35 39 21
4630 21 -371 -126 -102 191 53 241 253 -75 8 84 176 -107 59 4 -223 181 241 -70 -14 4 -7 -186 224 -21
4654 -21 -20 91 38 -33 -53 -44 -185 -100 127 -33 -188 75 156 -98 27 -38 29 -9 166 -175 -22 260 -34 -145
4678 -145 -131 51 220 76 67 -56 -69 172 -17 -158 -56 4 -11 30 -3 -197 78 -78 -93 89 118 39 -72 -2
4702 -2 136 -36 -28 265 245 -103 -174 113 -16 -104 222 -96 -103 237 -260 -354 -125 138 -241 50 -247 -160 -168 -72 94
4727 94 -143 295 -26 -23 154 -136 -182 221 -233 -196 304 -37 -66 97 263 265 -34 -10 21 23 42 25 -58 45 249
4752 249 -169 114 68 -34 50 162 116 -286 185 67 -92 -7 176 -74 32 60 39 113 127 371 20 62 157
4775 157 389 -35 100 94 25 182 -107 -4 -19 11 63 -269 -90 -314 80 35 -165 -88 -155 -51 -282 -103 -252
4798 -252 90 -8 416 155 6 33 211 107 169 64 7 -158 162 26 18 166 253 100 -40 -94 -195 -173 103
4821 103 -272 -390 -149 -201 35 -212 -74 6 -113 -124 4 110 59 -37 -58 68 -18 -119 21 312 149 -202
4843 -202 72 -119 -174 1 230 -61 211 203 -325 25 127 -75 -144 -219 -113 -81 -21 -5 -72 181 -159 -169 -12
4866 -12 87 -106 69 216 187 -47 -1 66 -347 -127 63 20 -81 -262 -85 -116 -111 47 -260 20 -8 -42 146 -110
4890 -110 181 -360 56 -117 21 -136 75 105 219 240 95 18 -134 -30 -5 -53 -30 248 -149 -112 150 85 -189
4913 -189 -214 42 176 -10 -18 -94 160 -124 116 -138 -198 138 -109 -128 335 211 19 -148 20 111 38 220 134
4936 134 -61 -178 80 62 -18 141 175 -118 -112 -189 25 32 -116 134 2 -42 54 -114 133 -58 95 -31 55 -106
4960 -106 3 -5 163 -13 227 212 74 161 64 -39 252 31 22 -48 -61 -64 42 -159 -13 259 -158 -11 -173 85
4984 85 -251 65 -41 -3 -33 9 -177 220 44 7 -27 92 233 92 -4 -221 -166 394 81 23 -19 73 13 -64
5008 -64 147 -204 88 -192 -99 -169 -119 131 -189 -89 -26 -34 -8 -21 227 58 11 -175 -75 -260 20 200 -105
5031 -105 -118 172 89 -62 149 -172 20 -15 -226 -228 -76 166 -250 -218 287 -88 -18 -1 -97 -83 -54 91 -60 30
5055 30 9 -5 158 -37 41 -12 297 48 344 106 -34 246 15 167 -79 94 -42 -227 -167 -86 -299 -68
5077 -68 150 294 -122 -150 -112 -90 74 -88 -24 -3 161 76 212 -406 58 -14 -114 -36 -216 -297 -171 -56 89
5100 89 -49 -46 143 -39 -221 163 -128 -259 91 18 -265 -147 13 136 -82 145 41 -38 173 265 -149 -83
5122 -83 160 39 21 82 125 -8 105 73 -190 -67 -299 -48 -90 48 -98 -97 100 28 -55 86 136 -67 -77 87
5146 87 48 -44 311 -98 -9 67 293 -30 -147 -82 -132 -32 -57 -144 39 50 -21 -52 236 -107 -211 -91 -32 -23 167
5171 167 -204 -191 -164 -75 8 -6 -69 -210 -375 142 0 37 52 -101 -222 -129 -109 124 13 53 133 258 147 -120
5195 -120 -68 -74 -98 -111 -44 -8 64 -186 164 281 -264 -127 -8 -143 -30 14 -1 207 89 -323 -9 125 143 -99
5219 -99 114 60 166 -16 108 44 66 308 -113 -151 -207 -124 -119 -4 -259 62 -107 122 136 -74 9 -49 24 -24 242
5244 242 -56 65 -127 -149 58 85 100 -143 -23 129 62 -136 6 -189 -169 -255 -139 -178 160 -36 -259 -59
5266 -59 -120 69 -45 178 -124 -210 82 86 -57 118 -41 213 127 -135 -75 -192 -55 -57 21 -69 61 51 -83 44
5290 44 -149 13 31 -184 61 -140 383 62 -98 -43 -96 30 -18 145 5 18 -153 -35 148 64 -135 2
5312 2 -116 224 -77 182 88 -193 -37 59 27 201 -128 -32 -186 90 73 -235 -177 -178 -157 -45 -187 16 52 150
5336 150 -81 -176 -1 58 -159 -96 -198 -126 -228 25 151 -176 87 -16 136 167 -290 -299 344 -67 51 -188
5358 -188 -29 139 42 27 37 -187 206 -117 99 275 -125 -84 -75 -89 -47 -112 110 -163 -38 66 277 191 -19
5381 -19 62 32 -103 -10 18 24 91 202 -47 -143 83 -37 -61 -131 25 171 -169 -144 -262 -7 26 220 -319 54
5405 54 -8 -189 69 -129 -149 -297 73 -142 -18 159 5 70 19 16 83 238 75 -87 -58 -144 121 -24 -11 -174
5429 -174 13 -70 83 88 -4 -93 -66 35 14 -276 -24 -164 190 -186 -61 -7 -84 120 163 -78 41 23 136 163
5453 163 122 -1 82 -59 -95 -15 -286 82 115 -293 277 199 263 -322 -76 66 -240 -62 -77 150 83 41 14 -63
5477 -63 169 -16 18 -71 120 89 162 195 83 97 -256 78 40 169 151 88 -73 -83 -95 -4 96 -184 -183 -187 -160 129
5503 129 82 -12 0 88 -60 23 95 -254 107 -37 61 254 -101 -92 -128 46 -204 -68 39 -55 80 -7 34 0 -176
5528 -176 115 -78 30 -6 21 -62 -4 -171 -73 36 -78 98 111 18 -6 58 222 281 344 -69 -136 125 -48 -191
5552 -191 -251 -91 17 -138 -146 -235 -58 -98 -162 25 -61 46 -114 -185 -62 -12 -7 32 36 -327 -44 -224 -70 139 -102
5577 -102 96 57 52 -84 56 43 -223 89 41 206 46 -106 -217 -117 -52 -260 -126 -60 -280 -163 42 -42 107
5600 107 1 -78 -151 74 31 159 -71 -16 115 -6 234 -107 -257 -115 -57 -37 -76 -204 -97 116 -12 60 -77
5623 -77 157 -50 -62 127 6 -179 -33 -477 -88 155 166 -30 -82 -165 32 -45 -199 154 111 9 9 -27 220
5646 220 64 143 -14 -49 138 -99 -150 -154 -79 -211 104 -58 -203 -303 0 12 -194 190 -197 143 9 -9 -80
5669 -80 -242 161 193 263 167 123 101 41 130 128 93 251 -58 59 -16 -1 21 -90 -156 -56 61 233 -117 43 31
5694 31 -139 -10 85 54 8 221 -77 -9 248 93 -52 -3 178 19 235 76 -49 44 122 180 147 30 -240
5717 -240 114 192 59 43 129 111 -1 3 137 92 25 -229 -120 -291 76 -140 232 235 -130 -53 232 -163 -91 -178
5741 -178 -32 84 -96 -145 31 -167 -125 74 -176 -247 129 71 -177 -132 -38 -125 -235 110 13 -40 -72 86 98 137
5765 137 168 -56 -23 -198 53 -73 -95 121 -5 -99 -79 -82 -126 174 165 -93 -175 32 1 68 -142 -172 132 -93 163
5790 163 -71 79 -72 -198 -153 191 -200 217 -37 -81 -140 295 -90 -82 312 169 220 -17 52 -204 19 232
5812 232 401 158 137 -131 148 -143 122 -148 -9 -114 -87 181 -142 63 -5 -44 14 -177 26 338 -131 175
5834 175 -9 94 307 68 193 75 214 27 -111 130 122 -80 -71 155 83 -9 115 105 -265 -61 78 -134
5856 -134 29 148 -50 83 -76 -238 205 -13 209 59 68 -68 46 -128 179 108 -68 -167 -127 -81 -27 -181
5878 -181 -57 112 51 -168 -330 -178 212 22 197 160 69 -4 113 0 -64 -33 178 107 -87 -44 167 -19 -16
5901 -16 -181 70 6 4 39 59 93 -36 52 -8 36 152 -308 -65 34 -20 6 -189 -140 -356 -45 -62 -106 170 89 -223
5927 -223 -208 -221 -161 111 67 -94 149 -11 269 5 24 145 23 -230 -227 140 -146 -147 8 183 -363 -216 240
5950 240 -6 48 -235 131 -88 69 -224 -37 -132 -5 -345 -109 133 -78 -21 -171 22 306 83 -116 -2
5971 -2 -145 30 -77 -248 84 -14 261 25 -40 -7 -4 170 83 -27 -140 23 97 18 22 -43 93 29 -168 238 -85
5996 -85 16 118 -154 352 200 81 -195 169 -347 178 -177 -194 206 -143 179 -21 -40 -199 -82 18 95
6017 95 -183 212 316 -307 112 -67 39 108 -72 98 16 -123 45 -409 -258 -169 143 -85 -174 -26 335 15
6039 15 -134 -97 100 -76 -22 196 117 65 86 104 -123 72 96 90 17 -211 -267 79 -24 79 161 129 100 -136 -90
6064 -90 282 124 -3 25 -196 73 -67 -91 131 36 -40 -93 -16 -101 -175 24 -92 -162 -36 28 -345 53 54 58 -259
6089 -259 55 -241 -92 -23 32 65 70 1 -148 -76 -193 21 10 -75 -234 370 -136 -225 -142 -204 -12 -101 -118 7 -203
6114 -203 -126 -116 135 101 -64 -60 169 112 109 49 128 216 9 194 246 -127 81 176 -62 -61 -259 -214 -59 186 -174
6139 -174 91 -101 54 -196 29 -94 80 -54 -233 25 110 298 -151 54 -184 56 92 -78 182 -32 92
6160 92 98 77 -68 -184 78 -13 15 5 -205 221 29 29 64 -76 174 -222 -68 240 55 -4 -45 225 148 29
6184 29 -93 -14 -159 38 -165 47 133 124 54 165 169 91 -151 -73 -68 -212 -60 303 -73 307 58 -204 -102 12
6208 12 -124 12 170 129 45 -396 -218 -72 -59 -268 52 -95 197 165 227 165 236 -123 -8 92 -120 170 213
6231 213 -217 194 -125 -53 25 28 -93 -159 14 73 -156 -155 193 -266 37 43 -70 -342 154 111 29 -107 -35 43 88
6256 88 48 90 62 210 145 40 -70 -212 -8 45 207 68 108 36 -56 -329 -69 -96 50 -5 132 67 -106 -60
6280 -60 -134 138 -58 45 59 -32 174 -239 -3 76 108 -148 165 13 138 -222 -135 123 -126 49 -6 -184 95
6303 95 -207 -207 -2 -36 -237 135 -59 -297 80 -122 29 -29 40 -5 -84 -19 21 190 -230 93 38 -103 14 -167
6327 -167 33 8 -4 -71 -217 -249 -8 -47 -66 -96 -43 -266 -24 -9 83 136 128 175 -97 108 90 -36 71 18 41 161
6353 161 76 131 -62 -86 81 145 -124 78 -311 -220 105 -44 -42 1 -213 42 -196 0 -127 -109 -187 -109 28 -56
6377 -56 5 74 -61 24 35 -95 -130 100 125 227 -110 -76 -34 242 -190 -169 208 -8 173 23 208 82 -294
6400 -294 119 292 88 6 219 87 -328 66 0 -28 89 -264 40 241 -117 -98 187 -149 -108 -89 -386 -7
6422 -7 221 -183 193 151 310 30 44 -244 -27 -145 -245 36 68 49 -10 -30 -69 -139 -97 95 -178 -29 78 -75
6446 -75 175 182 95 183 87 0 -22 114 -13 -203 -132 199 38 -28 -229 -55 -6 -63 24 -80 -79 -231 -336 -82 126
6471 126 41 162 310 116 5 -209 144 -76 -56 72 256 -194 -304 -126 127 -98 -16 22 138 -12 281
6492 281 209 -61 10 -76 -35 68 -125 108 -152 -113 -90 -243 117 -3 272 147 85 11 127 18 -49 31 67 105
6516 105 68 -33 -117 5 -50 158 130 13 -248 25 16 -172 2 -17 -131 -22 208 -179 75 151 182 -28 5
6539 5 25 120 27 19 122 -177 64 265 9 5 141 -81 104 98 -132 -144 -38 33 72 -55 -193 144 -48 -98 83
6564 83 -201 171 50 -22 -33 -32 36 -70 81 -129 111 -118 59 -83 -277 -42 -67 102 -59 7 122 -335 -99
6587 -99 -295 90 -42 -220 -26 44 -200 -110 67 -168 -235 -31 79 21 -87 17 91 8 181 185 -35 164 -41
6610 -41 -192 -36 203 218 36 -53 -17 158 146 -144 148 30 -114 -259 -168 -179 -86 92 -83 54 -45 28 -183
6633 -183 -5 306 24 75 51 -146 11 -323 87 182 -3 61 243 -13 -110 -312 50 261 115 76 -69 -2
6655 -2 -40 25 112 87 84 -157 5 277 -125 90 31 179 28 217 -52 -5 8 103 -93 146 68 87 94 -77 -10 -12
6681 -12 -155 -24 -72 -247 22 -190 -18 110 -93 -48 70 78 105 255 -113 103 62 -53 179 19 -189 -4
6703 -4 65 -101 9 67 -175 60 61 60 -77 -21 -5 72 -161 2 68 -26 -310 -47 -206 -52 57 63 -31 -2 389 63
6729 63 -64 27 103 -55 129 -113 71 23 -76 134 151 145 124 192 207 -21 34 82 -147 -185 -46 -6 -211 31 27 -40
6755 -40 89 -30 77 70 186 -26 -101 252 -240 -100 -218 38 391 -98 193 99 17 167 -7 147 241 -56
6777 -56 228 -111 -169 -213 -171 164 -68 59 48 138 -254 -114 63 9 151 -38 -8 94 108 106 37 272 -38 -31 74
6802 74 255 81 8 -8 272 -284 94 -83 174 -43 -37 16 -8 131 -91 -187 -147 -120 -123 -60 -82 -288 148 24 -51
6827 -51 124 96 -42 147 32 95 61 45 -120 242 -7 -123 11 99 119 -307 -16 -59 -36 -109 -250 -220 97 -88
6851 -88 -79 54 -6 -53 104 117 157 85 -119 106 38 -114 -29 69 -38 270 -49 97 187 190 -90 89 96 74 -30 49
6877 49 -195 120 -135 -63 195 179 -173 -39 -213 51 -19 -130 -91 -102 32 -12 1 76 -221 43 51 74 -144 -91
6901 -91 -71 63 -146 119 -72 139 408 -179 -13 106 -118 39 -59 113 81 -244 -5 -33 -187 37 20 -163
6923 -163 72 -52 166 192 101 30 66 -189 46 -71 49 -321 79 244 371 99 43 -162 95 35 -108 8
6945 8 94 -13 -113 43 -161 165 0 127 187 -52 1 -132 -236 102 -238 76 -147 176 -129 189 -50 -16
6967 -16 50 74 36 -22 103 35 86 -153 43 97 -91 -156 115 60 -1 -60 -41 -64 -44 79 -191 36 -42 88 121 193
6993 193 200 169 -123 192 -5 35 -114 131 -189 5 -199 -156 -108 68 -80 187 -94 -52 240 48 -214 195
7015 195 -182 -251 -114 90 77 -14 -47 229 77 -195 -36 -69 221 -46 -35 -49 117 -107 -77 87 -47 81 -203
7038 -203 158 34 7 125 -11 -317 -119 -115 -29 278 -86 164 -178 -147 35 -352 -145 184 48 40 -68 27 -162
7061 -162 26 -19 56 10 -23 96 -207 -39 -288 65 -278 253 -96 129 -52 -109 -68 -21 140 -36 -7 -118 -160
7084 -160 -34 34 -140 113 -222 -32 56 254 -44 -104 -9 19 -57 54 -44 -24 -57 -8 210 -204 273 31 155
7107 155 -31 88 -86 23 -26 -100 60 -32 -89 -174 254 -71 -142 224 -67 133 29 162 12 -104 -53 6 13
7130 13 -136 -30 -194 -119 -144 19 35 -143 169 -17 1 -149 -91 -171 -72 -181 194 -182 -96 7 -192 -42 -27
7153 -27 -25 231 -104 -70 111 -22 -199 109 89 18 366 -94 76 82 -87 -9 147 110 240 94 2 -15 -148 -362
7177 -362 -207 -307 -74 -231 26 -45 179 208 -75 -41 107 -38 -35 228 111 103 14 -80 86 18 121 248 37
7200 37 52 169 -64 165 2 -71 80 -124 157 9 77 -3 10 98 133 297 33 -68 -16 -163 -240 -80 -152 281
7224 281 91 -2 -12 215 185 -181 94 108 249 -222 -52 -33 -239 43 28 -345 28 47 15 310 115 126 93
7247 93 -119 3 -146 89 213 -90 -102 2 59 -53 91 11 -61 -92 251 205 -50 -61 -26 -104 104 73 -271 146
7271 146 -217 124 -157 -134 -178 -176 -18 -28 -61 3 -74 145 16 -88 -171 223 86 28 29 -139 252 -281 -9 94
7295 94 342 143 -136 -68 58 45 5 152 -177 -241 76 -254 226 6 202 -180 -44 -1 -125 4 105 109 -55
7318 -55 94 43 -112 -125 -44 178 62 -109 210 -126 218 -246 -101 -91 -218 -55 -25 239 -85 74 125 -85
7340 -85 17 52 -117 119 -147 29 -30 -79 -52 102 151 188 247 -227 -10 -8 -75 74 -133 192 78 42 367 15
7364 15 -278 139 -138 21 -174 37 19 225 -212 -11 79 -93 21 187 27 38 296 -15 -60 52 130 152
7386 152 110 -112 214 120 22 65 -52 -36 -86 67 200 -91 -21 -183 -166 -103 32 -45 -141 121 -236 -326 -23 67
7410 67 -125 274 -186 1 25 -182 254 -166 204 53 -89 14 42 110 -37 65 -8 -96 -12 208 93 58 124
7433 124 82 -17 -55 -18 121 -93 37 -260 152 238 173 130 -49 -19 -59 65 -17 -12 -6 156 -5 213 -105 110 -115
7458 -115 75 -21 170 -389 -207 -67 76 -31 -127 -4 26 -96 57 -155 -108 -4 -122 -78 32 -151 -29 -129
7480 -129 -102 -128 -92 120 -18 101 42 -136 127 37 -38 -68 142 219 159 -94 -110 -215 21 -242 -315 -159 27 213
7504 213 122 -125 50 -40 7 -132 -133 45 208 5 159 126 13 -89 55 96 31 8 231 -55 -95 8 -132
7527 -132 -132 5 -127 50 116 -38 -85 -197 192 -116 26 -230 -303 53 19 128 208 -221 -53 -75 50 -228 87
7550 87 -15 217 -69 112 -259 -269 -100 -144 213 -282 -145 -97 81 101 198 1 4 21 240 184 62 -187 -137 46
7574 46 71 146 154 108 -57 11 40 165 -89 -35 -90 -71 -29 -64 59 198 63 -95 132 -36 -54 219 67 73 -136
7599 -136 -150 139 67 243 38 -277 84 -43 -199 -89 -3 -142 -47 74 43 -169 -17 -45 117 -168 5 -8
7621 -8 -208 -47 131 169 214 109 164 71 -151 15 -228 154 -52 -28 196 66 141 -154 56 282 123 42 77
7644 77 -233 -4 -55 47 84 178 85 58 109 -149 -283 -32 -123 -116 -14 171 25 82 -96 -17 -84 76 -53 49
7668 49 -71 68 -70 106 -22 -16 -83 79 112 -3 122 46 61 -175 -13 -138 149 107 -23 100 148 65 55 -181
7692 -181 -242 -182 -20 -68 -153 -36 154 -17 154 160 -221 -123 -25 98 7 -46 13 -121 47 140 -9 -36 118 -61
7716 -61 -271 -117 81 236 258 66 2 7 69 50 31 125 -28 165 -74 -55 107 -183 -71 -93 -147 122 40 115 139
7741 139 111 -122 88 102 -152 -75 -301 193 77 -236 -119 22 -22 75 195 -172 -98 265 -205 -168 -62 -2 24
7764 24 -198 200 88 157 69 29 176 -25 54 48 34 -46 -7 -153 85 -310 242 138 36 64 -143 95 73 43
7788 43 18 -136 24 11 173 -151 17 8 -127 104 192 -62 105 246 -27 20 -13 134 44 258 55 54 13 -1
7812 -1 111 179 -28 -299 18 87 -184 -99 -108 112 -165 -107 6 -50 -273 131 2 16 124 -144 118 -173 -6
7835 -6 272 -149 -18 -31 155 -107 40 -150 -39 -216 -118 -68 -74 37 -48 -102 -29 -167 -118 -122 -39 79 -31 90 24
7860 24 -166 -29 47 6 92 -31 260 -53 168 102 192 -53 9 -141 -151 65 -92 18 -38 -88 -134 163 -167 -18
7884 -18 -88 -103 -34 344 11 53 -131 -204 120 223 -59 25 -1 -179 31 59 162 -54 -136 -35 -347 10 157
7907 157 221 -21 39 -80 -16 -136 -85 55 -95 279 19 233 100 70 -23 -63 -18 -71 101 -140 89 99 -122
7930 -122 28 -28 -185 -71 -1 48 57 85 110 208 153 -165 49 -197 89 62 -43 112 41 -174 -131 -110 -30 -288 14
7955 14 -35 -92 77 39 -215 -39 -59 -172 313 -173 -112 34 -127 -92 -20 -41 168 186 51 -12 37 73 48 -29 201
7980 201 -93 -248 -45 -122 203 -119 -99 -5 222 -70 39 -128 67 43 -102 -24 133 307 -125 -40 35 191
8002 191 267 -3 146 65 7 116 232 -22 190 -21 77 -89 -107 91 72 -166 58 -43 104 87 283 47
8024 47 -77 -167 179 81 24 -77 -85 48 126 7 -29 68 144 189 -4 174 -11 -117 52 -57 229 84 106 99 240
8049 240 270 -179 40 106 211 114 108 9 106 -20 -99 74 -6 -203 -117 -94 183 -3 93 -25 -375 -195 -28 -154
8073 -154 320 52 74 -2 60 64 131 180 124 -234 -279 119 56 -37 135 -215 135 -15 39 114 139 -75 308 24 31
8098 31 156 -8 222 101 42 129 -135 16 -290 -65 4 147 -173 -209 -121 79 52 -18 58 -55 121 -238 282
8121 282 -232 203 -34 73 -94 77 -22 160 29 84 -51 51 -38 132 229 88 50 -3 134 88 66 -71 -151
8144 -151 58 -90 114 -242 -6 -52 -83 -57 -144 -74 -104 -345 -74 20 -31 0 -223 -14 -68 -1 -229 90 -240 -4
8168 -4 39 116 -110 197 -155 236 -66 6 -137 -46 176 41 -74 13 -96 -138 -164 -16 58 -137 147 -65 -74
8191g4
##END NTUPLES=NMR FID
##END=
