##TITLE=1H_Art-H2SO4(A)-f10-mat
 CDCl3
 8 sc, 
 4.8.2023
##JCAMPDX= 6.0         $$ Bruker NMR JCAMP-DX V2.0
##DATA TYPE= NMR FID
##DATA CLASS= NTUPLES
##ORIGIN= UXNMR, Bruker Analytische Messtechnik GmbH
##OWNER= root
$$ XWIN-NMR		Version 3.5
$$ Fri Aug  4 15:50:08 2023 Russian Standard Time (UT+4h)  she@DPX200
##.OBSERVE FREQUENCY= 200.13135
##.OBSERVE NUCLEUS= ^1H
##.DELAY= (6, 6)
##.ACQUISITION MODE= SIMULTANEOUS
##.ACQUISITION SCHEME= undefined
##.AVERAGES= 8
##.DIGITISER RES= 18
##SPECTROMETER/DATA SYSTEM= spect
##.PULSE SEQUENCE= zg30
##.SOLVENT NAME= CDCl3
##.SHIFT REFERENCE= (INTERNAL, CDCl3, 0, 15.7039)
##AUDIT TRAIL= $$ (NUMBER, WHEN, WHO, WHERE, WHAT)
$$ ##TITLE= Audit trail, XWIN-NMR		Version 3.5
$$ ##JCAMPDX= 5.01
$$ ##ORIGIN= Bruker BioSpin GmbH
$$ ##OWNER= she
$$ F:/spectra/data/she/nmr/H-F/1/audita.txt
$$ ##AUDIT TRAIL=  $$ (NUMBER, WHEN, WHO, WHERE, WHAT)
(   1,<2023-08-04 15:48:51.28 +0400>,<she>,<DPX200>,
      <created by zg, POWCHK disabled, PULCHK disabled
       configuration hash MD5:
       00 E9 B6 7A A2 85 ED C7 34 08 36 98 17 FE 4E 26
       data hash MD5: 16K
       E0 98 4B CB E1 C7 BE 65 B0 CE 02 66 2E C9 27 74>)
$$ ##END=
$$ 
$$ hash MD5
$$ 37 5F D7 C8 65 8B 51 66 3A 88 1A DC C3 F6 26 F4
##$RELAX= 
##$RELAX= 
##$RELAX= 
##$RELAX= 
##$RELAX= 
##$RELAX= 
$$ Bruker specific parameters
$$ --------------------------
##$DU= <F:/spectra>
##$EXPNO= 1
##$NAME= <H-F>
##$PROCNO= 1
##$TYPE= <nmr>
##$USER= <she>
##$AMP= (0..31)
100 100 100 100 100 100 100 100 100 100 100 100 100 100 100 100 100 100 
100 100 100 100 100 100 100 100 100 100 100 100 100 100 
##$AQSEQ= 0
##$AQ_mod= 1
##$AUNM= <au_zg>
##$AUTOPOS= <>
##$BF1= 200.13
##$BF2= 200.13
##$BF3= 200.13
##$BF4= 200.13
##$BF5= 200.13
##$BF6= 200.13
##$BF7= 200.13
##$BF8= 200.13
##$BYTORDA= 1
##$CFDGTYP= 0
##$CFRGTYP= 5
##$CHEMSTR= <none>
##$CNST= (0..31)
1 1 145 1 1 1 1 1 1 1 1 1 1 1 1 1 1 1 1 1 1 1 1 1 1 1 1 1 1 1 1 1 
##$CPDPRG= <>
##$CPDPRG1= <>
##$CPDPRG2= <>
##$CPDPRG3= <>
##$CPDPRG4= <mlev>
##$CPDPRG5= <mlev>
##$CPDPRG6= <mlev>
##$CPDPRG7= <mlev>
##$CPDPRG8= <mlev>
##$CPDPRGB= <>
##$CPDPRGT= <>
##$D= (0..31)
0 1.2 0 0 0 0 0 0 0 0.06 0 0.03 0 0 0 0 0.0002 0 0 0 0 0 0 0 0 0 0 0 0 
0 0 0 
##$DATE= 1691149730
##$DBL= (0..7)
120 120 120 120 120 120 120 120 
##$DBP= (0..7)
150 150 150 150 150 150 150 150 
##$DBP07= 0
##$DBPNAM0= <>
##$DBPNAM1= <>
##$DBPNAM2= <>
##$DBPNAM3= <>
##$DBPNAM4= <>
##$DBPNAM5= <>
##$DBPNAM6= <>
##$DBPNAM7= <>
##$DBPOAL= (0..7)
0.5 0.5 0.5 0.5 0.5 0.5 0.5 0.5 
##$DBPOFFS= (0..7)
0 0 0 0 0 0 0 0 
##$DE= 6
##$DECBNUC= <off>
##$DECIM= 32
##$DECNUC= <off>
##$DECSTAT= 4
##$DIGMOD= 1
##$DIGTYP= 9
##$DL= (0..7)
0 120 120 120 120 120 120 120 
##$DP= (0..7)
150 150 150 150 150 150 150 150 
##$DP07= 0
##$DPNAME0= <>
##$DPNAME1= <>
##$DPNAME2= <>
##$DPNAME3= <>
##$DPNAME4= <>
##$DPNAME5= <>
##$DPNAME6= <>
##$DPNAME7= <>
##$DPOAL= (0..7)
0.5 0.5 0.5 0.5 0.5 0.5 0.5 0.5 
##$DPOFFS= (0..7)
0 0 0 0 0 0 0 0 
##$DQDMODE= 0
##$DR= 18
##$DS= 0
$$ [...]
##$SUBNAM2= <"">
##$SUBNAM3= <"">
##$SUBNAM4= <"">
##$SUBNAM5= <"">
##$SUBNAM6= <"">
##$SUBNAM7= <"">
##$SUBNAM8= <"">
##$SUBNAM9= <"">
##$SW= 18.05172834244
##$SWIBOX= (0..15)
0 0 2 0 0 0 0 0 0 0 0 0 0 0 0 0 
##$SW_h= 3612.71676300578
##$TD= 16384
##$TD0= 1
##$TE= 0
##$TE2= 300
##$TE3= 300
##$TEG= 300
##$TL= (0..7)
0 120 120 120 120 120 120 120 
##$TP= (0..7)
150 150 150 150 150 150 150 150 
##$TP07= 0
##$TPNAME0= <>
##$TPNAME1= <>
##$TPNAME2= <>
##$TPNAME3= <>
##$TPNAME4= <>
##$TPNAME5= <>
##$TPNAME6= <>
##$TPNAME7= <>
##$TPOAL= (0..7)
0.5 0.5 0.5 0.5 0.5 0.5 0.5 0.5 
##$TPOFFS= (0..7)
0 0 0 0 0 0 0 0 
##$TUNHIN= 0
##$TUNHOUT= 0
##$TUNXOUT= 0
##$USERA1= <user>
##$USERA2= <user>
##$USERA3= <user>
##$USERA4= <user>
##$USERA5= <user>
##$V9= 5
##$VALIST= <valist>
##$VCLIST= <CCCCCCCCCCCCCCC>
##$VD= 0
##$VDLIST= <DDDDDDDDDDDDDDD>
##$VPLIST= <PPPPPPPPPPPPPPP>
##$VTLIST= <TTTTTTTTTTTTTTT>
##$WBST= 1024
##$WBSW= 4
##$XGAIN= (0..3)
0 0 0 0 
##$XL= 0
##$YL= 0
##$YMAX_a= 181383
##$YMIN_a= -164055
##$ZGOPTNS= <>
##$ZL1= 120
##$ZL2= 120
##$ZL3= 120
##$ZL4= 120
##$ABSF1= 10
##$ABSF2= 0
##$ABSG= 5
##$ABSL= 3
##$ALPHA= 0
##$AQORDER= 0
##$ASSFAC= 0
##$ASSFACI= 0
##$ASSFACX= 0
##$ASSWID= 0
##$AUNMP= <proc_1d>
##$AZFE= 0.1
##$AZFW= 0.1
##$BCFW= 1
##$BC_mod= 2
##$BYTORDP= 1
##$COROFFS= 0
##$CY= 11.3945322036743
##$DATMOD= 1
##$DC= 2
##$DFILT= <>
##$DTYPP= 0
##$F1P= 15.7292609196834
##$F2P= 12.9074282941183
##$FCOR= 0.5
##$FTSIZE= 0
##$FT_mod= 4
##$GAMMA= 1
##$GB= 0.15
##$INTBC= 1
##$INTSCL= 1
##$ISEN= 128
##$LB= 0.24
##$LEV0= 0
##$LPBIN= 0
##$MAXI= 10000
##$MC2= 0
##$MEAN= 0
##$ME_mod= 0
##$MI= 1.114404
##$NCOEF= 0
##$NC_proc= 0
##$NLEV= 6
##$NOISF1= 3.799351
##$NOISF2= 2.8
##$NSP= 1
##$NTH_PI= 0
##$NZP= 0
##$OFFSET= 15.70392
##$PC= 1
##$PHC0= -21054.9
##$PHC1= 25.25272
##$PH_mod= 1
##$PKNL= yes
##$PPARMOD= 0
##$PSCAL= 0
##$PSIGN= 0
##$REVERSE= no
##$SF= 200.130013532006
##$SI= 16384
##$SIGF1= 3
##$SIGF2= 2
##$SINO= 400
##$SIOLD= 16384
##$SREGLST= <1H.CDCl3>
##$SSB= 0
##$STSI= 0
##$STSR= 0
##$SW_p= 3612.71676300578
##$SYMM= 0
##$S_DEV= 0
##$TDeff= 0
##$TDoff= 0
##$TI= <>
##$TILT= no
##$TM1= 0
##$TM2= 0
##$TOPLEV= 0
##$USERP1= <user>
##$USERP2= <user>
##$USERP3= <user>
##$USERP4= <user>
##$USERP5= <user>
##$WDW= 1
##$XDIM= 8192
##$YMAX_p= 0
##$YMIN_p= 0
$$ End of Bruker specific parameters
$$ ---------------------------------
##NTUPLES= NMR FID
##VAR_NAME=  TIME,          FID/REAL,        FID/IMAG
##SYMBOL=    X,             R,               I
##VAR_TYPE=  INDEPENDENT,   DEPENDENT,       DEPENDENT
##VAR_FORM=  AFFN,          ASDF,            ASDF
##VAR_DIM=   8192,          8192,            8192
##UNITS=     SECONDS,       ARBITRARY UNITS, ARBITRARY UNITS
##FACTOR=    0.0002768,     1,               1
##FIRST=     0,             0,               0
##LAST=      2.2672688,     0,               0
##MIN=       0,             -164055,         0
##MAX=       2.2672688,     181383,          0
$$ Real data points
##PAGE= N=1
##DATA TABLE= (X++(R..R)), XYDATA
$$ [...]
1960G58m36J85M4j31l5m03j52J43m3k01o76J20N07j67p88N15O11k74j83N21K65
$$ 758 322 507 551 420 385 -18 -170 -27 -70 -271 -947 -827 -320 -487 -1275 -760 -149 -423 -606 -85 180
1981A80p14N75O46j42k79l48K43J057j47o48L43m16j27L76N72n63p75m90K12Q17
$$ 180 -534 41 687 545 266 -82 161 1218 1071 423 766 350 223 599 1171 608 -167 -657 -445 372
2001C72l94m46l40O7l16Q25N83o68j485O52R38P77m01n09K42k36M78J222R5j016
$$ 372 -22 -468 -808 -741 -1057 -232 351 -317 -1802 -1150 -212 565 164 -345 -103 -339 139 1361 1456 440
2021D40r03P45P15P14r57j076K29L01j94R39k8j880q18J465J118p65j046j78j48
$$ 440 -463 282 997 1711 754 -322 -93 208 14 953 925 -955 -1773 -308 810 45 -1001 -1179 -1327
2040a327N01R01mo29k90l4J033R03j43r69n49R60M47K03R5n67j319J018P34m5
$$ -1327 -826 75 71 -558 -848 -882 151 1054 911 -58 -607 353 800 1003 1098 531 -788 230 964 919
2060I19k41j088j58L14L65j55J17n92j217R65J166n61r88K65K25L60L10K17l15
$$ 919 678 -410 -568 -254 111 -44 73 -519 -1736 -771 395 -166 -1154 -889 -664 -304 6 223 -92
2079i2R8m42R90P81n92r07L86Q78p32K5K53K63p84k16O30K46j025j61K18l43L26
$$ -92 6 -436 554 1335 743 -164 222 1100 368 393 646 909 125 -91 539 785 -240 -401 -183 -526 -200
2100b00j91m33K08k3k87M51L78o34m0J151r1q71N51O62P1j41k35M27k4k92M66
$$ -200 -391 -824 -616 -639 -926 -475 -97 -731 -771 380 289 -582 -31 631 702 561 326 753 729 437 903
2121I03J19n82o99J75P95m13j64p44j36N50O7m31P31q19o77O98N98j9q63J2M55
$$ 903 1022 440 -259 -84 711 298 134 -610 -746 -196 -129 -560 171 -648 -1325 -627 -29 -48 -911 -899 -444
2142d44L82L46K50k94n59r1J081P31k37r18m19Q10q0J27J53l70p78l80J280j3
$$ -444 -62 284 534 240 -319 -410 671 1402 1165 247 -172 638 558 685 838 468 -310 -690 590 577
2162E77j019n00J9N83L05k21l72l85n06R89J052K21j676J15Q78K92L26M09r82
$$ 577 -442 -942 -923 -340 -35 -256 -628 -1013 -1519 -530 522 743 -933 -818 60 352 678 1087 105
2181A05k04L35L92P45m69o38r04J094O67o12o32jm59j75Q19J68r01o00N85K29
$$ 105 -99 236 628 1373 904 266 -638 456 1123 511 -121 -122 -581 -756 63 231 -670 -1270 -685 -456
2201d56L13k05l62j64N71J90N6O36m38q70J088R67n76p89N16K25l61K22L02n86
$$ -456 -143 -348 -710 -874 -303 -113 -57 579 141 -729 359 1326 750 -39 477 702 341 563 865 279
2221B79n75K15J92L11m89k77l05K92Pl12q0M2j0j88Q73oq99L66R18j60j94K24
$$ 279 -296 -81 111 422 -67 -344 -649 -357 -350 -662 -742 -700 -710 -898 -25 -31 -930 -564 354 194 0 224
2243B24K53m5j22L18J50q9n18q2O69J39r67M6K06k74j77P97p15l85j05M23M37
$$ 224 477 432 310 628 778 689 171 89 758 897 -70 -24 182 -92 -269 528 -187 -572 -677 -254 183
2264A83p34k05k01Q07L01n74J85L52m84J44J189L2j096j66P34L81k3P1p74m13
$$ 183 -551 -756 -957 -150 151 -423 -238 114 -370 -226 963 995 -101 -267 467 848 825 896 122 -291
2284b91O53Q7j86L52o95p55P41P45q79n65L86l14m0R72M6r88j33K02N91N52n7
$$ -291 362 449 263 615 -80 -835 -94 651 -228 -793 -407 -721 -761 211 257 -731 -864 -662 -71 481 424
2305D24q69N8R19O2j01K21k93o77N93Q46l72p34j20K54j97M13Om20q04K51N45
$$ 424 -445 -387 532 594 493 714 421 -256 337 1183 811 77 -43 211 14 427 433 13 -791 -540 5
2326EK24k81q28l34O47N64L8l82J35m96K37J033Q9r06N0N17J30M38P4n67j50j31
$$ 5 229 -52 -880 -1214 -567 -3 35 -347 -212 -708 -471 562 651 -255 -205 312 442 880 954 387 237 106
2348A06J32L01L09r49n22O22K51m03j50j15m33J31N56j25k33j36k88O01O28k83
$$ 106 238 539 848 -101 -623 -1 250 -153 -303 -418 -851 -720 -164 -289 -522 -658 -946 -345 283 0
2368@p68O91O00m38O1O80n49m25R45J45o66L45m18j55L08M14r91P2Q5n94L67P46
$$ 0 -768 -77 523 85 146 826 277 -148 797 942 276 621 203 48 356 770 -221 -149 -64 -658 -291 455
2390D55n97r22N78L57k86l07N11k94K58m4O51m45k18J43K30M64K83p07K22M45
$$ 455 -142 -1064 -486 -129 -415 -722 -211 -505 -247 -291 360 -85 -303 -160 70 534 817 110 332 777
2410G77l83M0K39j07q14L11N06j94m81l16K39j5j8j75J77m28j39N13L51k59l06
$$ 777 394 434 673 566 -248 63 569 375 -106 -422 -183 -198 -216 -391 -214 -642 -781 -268 83 -176 -482
2431d82J95KN93l1o1k65J15j68N88P46o79q67M63M65J27k08n93r4P7K25n9J22
$$ -482 -287 -285 308 277 216 -49 66 -102 486 1232 553 -314 149 614 741 533 -60 -154 -77 148 89 211
2453B11o78l00Q9O84j80l06j45j51J59P07r9l18j01N6N95O15nr73J40M88J54j20
$$ 211 -467 -767 -678 6 -174 -480 -625 -776 -617 90 -9 -327 -428 -372 223 838 833 -140 0 488 642 522
2475E22J97m24o01M96N49k07l73m81j23L03J65k54J93l12n14M63N05J18q54k68
$$ 522 719 295 -306 190 739 532 159 -322 -445 -142 23 -231 -38 -350 -864 -401 104 222 -632 -900
2495i00P06L28j00jJ25k52j9Q05K59n38n19M46K25K03l61j84l15R3qJ52K12o23
$$ -900 -194 134 34 33 158 -94 -113 692 951 413 -106 340 565 768 407 223 -92 1 -7 145 357 -266
2517b66l49L13K30j96J30k45l93j26O76j87K0J41J13L9L97q7k20PK68K58k34J50
$$ -266 -615 -302 -72 -268 -138 -383 -776 -902 -226 -413 -393 -252 -139 -100 297 210 -10 -3 265 523 289 439
2539D39K03n19L5O93n63m00J72J94j46j36j65o4k47l3K93mp4m65L23N25j87l95
$$ 439 642 123 158 851 288 -112 60 254 108 -28 -193 -257 -504 -537 -244 -248 -322 -787 -464 61 -126 -521
2561e21M45k06L51L43k16J25k02q2J63O24j70p76J16K77L14j89j24k67l42L2P15
$$ -521 -76 -282 69 412 196 321 119 37 200 824 654 -122 -6 271 585 396 272 5 -337 -305 410
2582D10l50m24j57j00R4M30J73o16m9PL10P46K4p05l00O00P33k96k38J23m07K03
$$ 410 60 -364 -521 -621 -527 -97 76 -540 -589 -582 -272 474 498 -207 -507 93 826 530 292 415 8 211
2604B11M32L09n77m80j0J83N02p8n32l21j38J25M23J78r72j51K53Q39k21k5l07
$$ 211 643 952 375 -105 -115 68 570 492 -40 -361 -499 -374 49 227 -745 -896 -643 196 -25 -50 -357
2625c57l25L96P85j30j41l09j44K70Q61k89n21J71J00P6M7K41o47m21L53lN05
$$ -357 -682 -286 499 369 228 -81 -225 45 906 617 96 267 367 443 490 731 84 -337 16 13 518
2646E18l81q73K08J12q9K09J04m04o2K03O66j50l68qM84k52O28k86k57L44J76
$$ 518 137 -736 -528 -416 -505 -296 -192 -596 -658 -455 211 61 -307 -315 169 -83 545 259 2 346 522
2667E22k87J62L52o36k86P09P5o57N2R5l41kM98m93l29K21k53P8M02n02j84N97
$$ 522 235 397 749 113 -173 536 611 -46 6 101 -240 -242 256 -237 -566 -345 -598 -520 -118 -620 -804 -207
2689b07K10l21K34L74p3k76O20j9k01p8pJ39J47J67o07j04K54Oj52K19r10R7L58
$$ -207 3 -318 -84 290 217 -59 561 542 341 263 256 395 542 709 102 -2 252 258 106 325 -585 -488 -130
2712a30L4k72j31j6k31N30L79l81k66J44j16O29J13j74l19L15k07O78K60m29m95
$$ -130 -96 -368 -499 -515 -746 -216 163 -218 -484 -340 -456 173 286 112 -207 108 -99 579 839 410 -85
2733h5J69M05J12j22k39m23j66L95L00l33k19l22j95O46K66k33o77K53j06Q1Q77
$$ -85 84 489 601 479 240 -183 -349 46 346 13 -206 -528 -723 -77 189 -44 -721 -468 -574 -493 384
2754C84k6o22k49Q50K21k16P9m62k15O12L60j22k51j43k74L48N51n35m13m83K73
$$ 384 358 -264 -513 337 558 342 421 -41 -256 356 716 594 343 200 -74 274 825 290 -123 -606 -333
2775c33N63j21j73l41k95J80K05L49l06k87L16j47M46Q0J74l58k20L99K51K6K52
$$ -333 230 109 -64 -405 -700 -520 -315 34 -272 -559 -243 -390 56 136 310 -48 -268 131 382 408 660
2796F60m23k29L87M39m27j61k15K07k73J27o5k03l63J94R3J44l72M9K51J0l47
$$ 660 237 8 395 834 407 246 31 238 -35 92 27 -176 -539 -345 -252 -108 -480 -431 -180 -170 -517
2817e17L21jo3K00J45j62O7k0L28k62M78j36k7l50J97J47M7j19l69K11K23j88
$$ -517 -196 -197 -260 -60 85 -77 -10 -30 298 36 514 378 351 1 198 345 392 273 -96 115 338 150
2839A50l92j44J03J48j06R7P2o73M72L66J03k24k85MP6O86P4n75K6K15KK72J57
$$ 150 -242 -386 -283 -135 -241 -144 -72 -745 -273 93 196 -28 -313 -309 -233 453 527 -48 -22 193 195 467 624
2862F24m46l44J61L38K69J0o89l19J7K95L94k69k82p28L78L72L45m18o6k49J19
$$ 624 178 -166 -5 333 602 612 -77 -396 -379 -84 310 41 -241 -969 -591 -219 126 -292 -358 -607 -488
2883d88O75j4j07n70K96L72J52L46m12l5m07P18K03j24k79l96n4J50P1J67j67
$$ -488 187 173 66 -504 -208 164 316 662 250 215 -192 526 729 605 326 -70 -124 26 97 264 97
2904I7o49J84L10L93m20l95J4m0N66K17l20l46K2K49J64J81j87j25q2N58L6r0
$$ 97 -552 -368 -58 335 -85 -480 -466 -506 60 277 -43 -389 -367 -118 46 227 40 -85 -167 391 427 337
2926C37K98n05j10K58j3q7k1k67O8Kj37K81o7k78k61K09J32qk81L77k52N9L87
$$ 337 635 130 20 278 265 178 157 -110 -42 -40 -177 104 37 -241 -502 -293 -161 -169 -450 -73 -325 -266 121
2949A21m50J76M29R5k42J78m0j58M15k80J27k62K33j76K52j34n26R8J70J82m87
$$ 121 -329 -153 276 371 129 307 267 109 524 244 371 109 342 166 418 284 -242 -144 26 208 -279
2970b79r1N0j95K77K00k07j13j01M98k76M38k65k74J78Q7O68Q5o06j33p6K78M57
$$ -279 -370 -320 -515 -238 -38 -245 -358 -459 39 -237 201 -64 -338 -160 -73 595 680 74 -59 -135 143 600
2992F00K3o46j3J7L43K36l82l48l63Q4N75k66j34k43k30L11O04m06J37k93j63
$$ 600 623 -23 -36 -19 324 560 178 -170 -533 -449 126 -140 -274 -517 -747 -436 168 -238 -101 -394 -557
3013e57L30M93k1l56j33L07L43N9P4r9n59K58L65n5N4m42l03K23j09O3J42m09
$$ -557 -227 266 245 -111 -244 63 406 465 539 440 -119 139 504 449 503 61 -242 -19 -128 -65 77 -332
3035c32k65J47L41J2J7l05j35O2O20p4k12R5k40J44N75K43p16P0j10K44K22L0
$$ -332 -597 -450 -109 -97 -80 -385 -520 -458 162 88 -124 -29 -269 -125 450 693 -23 47 -63 181 403 433
3057D33n3n98J88Q8L48m51Pl24j2J44J59k88j71K89q1J12j1O2k79N5N08O7j51
$$ 433 380 -218 -30 58 406 -45 -38 -362 -374 -230 -71 -359 -530 -241 -322 -210 -221 -159 -438 -383 125 192 41
3080D1O1K2J27QP1nl01J90K85l78K26N1l52N5J79k76l02J05K42j36j37l1k48P3
$$ 41 102 124 251 259 330 325 24 214 499 121 347 398 46 101 280 4 -298 -193 49 -87 -224 -255 -503 -430
3104d30L09m2l4N6j07J34K68k09K44n9k30K41M83j61o62M62k2J49J99k11l96M6
$$ -430 -121 -163 -197 -141 -248 -114 154 -55 189 130 -100 141 624 463 -199 263 241 390 589 378 -18 28
3126B8o9K79K7j30n56m78M76M15l1j78qk52L5O56j17j85n5j27j83P39L39m99n20
$$ 28 -41 238 265 135 -421 -899 -423 -8 -39 -217 -225 -477 -442 214 97 -88 -143 -270 -453 286 625 126 -394
3149c94N19L11l08O03p33j40J63M70j46l44m5k86j50Q69j56n46K23n42J86M45
$$ -394 125 436 128 731 -2 -142 21 491 345 1 -44 -330 -480 389 233 -313 -90 -632 -446 -1
3169aj1l38l46M20j96K58M47j85m58M66K49j5j6l7m65K07M66j07j32j31k02J92
$$ -1 -12 -350 -696 -276 -472 -214 233 48 -410 56 305 290 274 237 -228 -21 445 338 206 75 -127 65
3191F5J42m6r5k67N0j44L35j14Pm67J88J82J68k4jj81J83J40K31n14L09j26J03
$$ 65 207 161 66 -201 -151 -295 40 -74 -67 -534 -346 -164 4 -20 -21 -202 -19 121 352 -162 147 21 124
3214A24n7J51N0l89M46k41J56oq0l02M04k61k09%J76j32N7M16p05Q5L30k86k01
$$ 124 67 218 268 -121 325 84 240 234 154 -148 256 -5 -214 -214 -38 -170 -113 303 -402 -317 13 -273 -474
3237d74M59l8j77n4O28k52J46j15K2l6M64k08l95o3K68M5q8L22n64j89K83J44
$$ -474 -15 -53 -230 -284 344 92 238 123 145 109 573 365 -30 -93 175 220 132 454 -110 -299 -16 128
3259A28k44J58l53k15J07M20n4m08J42k6J46M14j27j03l32K65L43mP8l28k51K88
$$ 128 -116 42 -311 -526 -419 1 -53 -461 -319 -345 -199 215 88 -15 -347 -82 261 257 335 7 -244 44
3281D4L54m8j22m7m76M28K50k08m8k52k71J88J22K26m40K4k89J05O46k29j65j61
$$ 44 398 350 228 181 -295 133 383 175 127 -125 -396 -208 -86 140 -300 -276 -565 -460 186 -43 -208 -369
3303c69J71N9K24K73m10k09L27K17j24K61m59k11L20L64j03m13K72j94j80L18
$$ -369 -198 -139 85 358 -52 -261 66 283 159 420 -39 -250 70 434 331 -82 190 -4 -184 134
3323A34j91j36m63L95M1OJ51o7l10R3K68j40L74r6k34O8M21j20k1k49J12N7K01
$$ 134 -57 -193 -656 -261 -220 -214 -63 -130 -440 -347 -79 -219 155 59 -175 -107 314 194 173 -76 36 93 294
3346B94M4k84J03j61J8J47K0k58J61L4j10k7N0j41l79K17K69j50p9P2j8l2L24
$$ 294 338 54 157 -4 14 161 181 -77 84 118 8 -19 31 -110 -489 -272 -3 -153 -232 -160 -178 -210 114
3369A14k97K98M2k67N06m37K66L7Qj66M56m88K6j29Q9J86r1p1l45J70mQ0j06q7
$$ 114 -183 115 157 -110 396 -41 225 262 270 104 560 72 98 -31 58 244 153 82 -263 -93 -97 -17 -123 -210
3393b10j84J83K01k01k26L92k74m6K45K93l22m5N95j3qk36P6k15J96O6J58m10
$$ -210 -394 -211 -10 -211 -437 -45 -319 -365 -120 173 -149 -194 401 388 380 144 220 5 201 267 425 15
3415A5n8Jn2L89j44j50k01l58M89j48K38j64l66n1J87K74J35j54k37M13nL02l09
$$ 15 -43 -42 -94 295 151 1 -200 -558 -69 -217 21 -143 -509 -560 -373 -99 36 -118 -355 58 53 355 46
3438D6l7j55K87J27K03K1l63J70j49%q5j47J55l07j18O41k33l0l74j27K55R9j03
$$ 46 9 -146 141 268 471 492 129 299 150 150 65 -82 73 -234 -352 289 56 26 -348 -475 -220 -121 -224
3461b24J70j37nJ27J31R8l46J67J66J84l00J72j05k22L91pQ0l70l9J19mk91J18
$$ -224 -54 -191 -196 -69 62 160 -186 -19 147 331 31 203 98 -124 267 260 340 -30 -69 50 46 -245 -127
3484a27K59m73Q7L7L02k42j33J67j58K72L5m01K71r5J72J32K3k40K68K53m5J44
$$ -127 132 -341 -254 -217 85 -157 -290 -123 -281 -9 26 -375 -104 -199 -27 105 128 -112 156 409 364 508
3506E08n24K43k01k7J16j01J4rj51L19pm24J84QJ64m82J26J12m05M99m09L50K74
$$ 508 -16 227 26 -1 115 14 28 19 -132 187 180 -244 -60 -52 112 -370 -244 -132 -537 -38 -447 -97 177
3529A77k75PJ82K89k42k00o4J27J46J76qm70K19j9K57j73N8m02K79K02k99L6k28
$$ 177 -98 -91 91 380 138 -62 -126 1 147 323 315 -155 64 45 302 129 187 -215 64 266 -33 3 -225
3552b25k14J0K24L89k76J1p2j19L29n0M2P7k29J22l6K27j13j37J91n8J75j36j4
$$ -225 -439 -429 -205 184 -92 -81 -153 -272 57 7 49 126 -103 19 -17 210 97 -40 151 93 268 132 118
3575A18K8j29r6L54l55R3k69J22p9J24K78k74m16J47L70J13j62L3o4k22N64r5
$$ 118 146 17 -79 275 -80 13 -256 -134 -213 -89 189 -85 -501 -354 16 129 -33 0 -64 -286 278 183
3597A83k7k67j40M96Kk97K07q5j22K92l1p1k95o1J46j65M74k12k82K9L8L35l09
$$ 183 156 -111 -251 245 247 -50 157 72 -50 242 211 140 -155 -216 -70 -235 239 27 -255 -226 -188 147 -162
3620a62J34l50J90k8N1K83m04K74R0J96l37K0L9J26jK42j15k99J60j00j67M45
$$ -162 -28 -378 -188 -216 -165 118 -286 -12 78 274 -63 -43 -4 122 121 363 248 -51 109 9 -158 287
3642B87r8k11M1nL0k39K89l00K23j77K74n07K16k34L31j1J69j32O9J7j41L28q
$$ 287 189 -22 19 14 44 -195 94 -206 17 -160 114 -393 -177 -411 -80 -91 78 -54 15 32 -109 219 211
3665B11O1j14P9P2j59J52k30j50J65k0P6L7j99j6k01L38l5j18j69l10L22L08K
$$ 211 272 158 237 309 150 302 72 -78 87 67 143 180 -19 -35 -236 102 67 -51 -220 -530 -208 100 102
3688A02k22k05M28j80K17K40l04l18M02k21L09n4n2p1Q4J90j79p8j84j28M94k02
$$ 102 -120 -325 103 -77 140 380 76 -242 160 -61 248 194 142 71 155 345 166 88 -96 -224 270 68
3710F8j80J21m04J52P6J4J65l37L17k75RM00k59k6L06R3J61l27K12l62Q8K9J24
$$ 68 -112 9 -395 -243 -167 -153 12 -325 -8 -283 -274 126 -133 -159 147 240 401 74 286 -76 12 41 165
3733A65Kk54L01k91J95Q0k9k90m48M18J56R5l23J74r7j46L15k09l8K37k22J98
$$ 165 167 -87 214 -77 118 198 169 -121 -569 -151 5 100 -223 -49 -146 -292 23 -186 -224 13 -209 -11
3755a1L26l84K5m6K10j46M60k63k87J81J48k7K4Q4j64k99K94J91m19p4J08j49
$$ -11 315 -69 -44 -90 120 -26 434 171 -116 65 213 186 210 294 130 -169 125 316 -103 -177 -69 -218
3777b18n5K31k72p7J0K94J98j46j16J22j91L32k7k93M23k05%q2K33j57o6K16Q5
$$ -218 -273 -42 -314 -391 -381 -87 111 -35 -151 -29 -220 112 85 -208 215 10 10 -72 161 4 -62 154 239
3800B39L8p5L45o85K87r5J18k54j88J1K50n0k40L4p2K27J36J37j72r3l5n2L52
$$ 239 277 202 547 -138 149 54 172 -82 -270 -259 -9 -59 -299 -265 -337 -110 26 163 -9 -102 -137 -189 163
3823A63j52O1P2j94n3J80j03M0k81K80J9K73l15R0k66J72L0P2Pl83Q5J39j34N
$$ 163 11 72 144 -50 -103 77 -26 14 -267 13 32 305 -10 80 -186 -14 16 88 95 -288 -203 -64 -198 -193
3847a93p3j97K37L64q3j14qP0N7K98n6r5k37L9J26J35j01o1J24l36J53L56l74
$$ -193 -266 -463 -226 138 55 -59 -67 3 60 358 302 207 -30 9 135 270 169 108 232 -104 49 405 31
3870C1K1k32J39k40L65j49P4j26J16O7l84L87k38j61J73K29N2K66m02j36K58L9
$$ 31 52 -180 -41 -281 84 -65 9 -117 -1 66 -318 69 -169 -330 -157 72 124 390 -12 -148 110 149
3892A49Rk75J35j8nM99n9l16J66l55K73j31k3j70l05J10K05J10J7k3l49J5J98
$$ 149 158 -117 18 0 -5 494 435 119 285 -70 203 72 49 -121 -426 -316 -111 -1 16 -7 -356 -341 -143
3915a43J42K42j68j78J98rJ05n9r3RO7J10j09j20L8K3L5j30J18q8k4j2J41k65
$$ -143 -1 241 73 -105 93 84 189 130 37 46 113 223 114 -6 32 55 90 -40 78 -10 -34 -46 95 -170
3939a70k07p1M31l56M09k8j35j7M5K73l44J83J11J66lj70L67k14j1j96j7K09k42
$$ -170 -377 -448 -17 -373 36 8 -127 -144 -99 174 -170 13 124 290 287 117 484 270 259 63 46 255 13
3962A3m2R3J56k41L77l54k08L24l56L30k11j09J84l35L82j8l08K43NJ36O5l6n6
$$ 13 -29 64 220 -21 356 2 -206 118 -238 92 -119 -228 -44 -379 3 -15 -323 -80 -75 61 126 90 34
3985C4k04J78J18J15J7m36K68P0O4K3n1m4j02j10q7K68m44L12j54N8K36l64m7
$$ 34 -170 8 126 241 258 -178 90 160 224 247 196 152 50 -60 -147 121 -323 -11 -165 -107 129 -235 -282
4008b82R5j39L45p4n5q6M3QL80Q9j83M5j56j2L93j09l48j09J24M74m26J32k66
$$ -282 -187 -326 19 -55 -110 -196 -153 -145 235 324 141 186 30 18 411 302 -46 -155 -31 443 17 149 -117
4031a17ko9J31J36j49k57J69O4jj68L20j72k66L13L76m38L4J65j85o7L48n6N0
$$ -117 -119 -188 -57 79 -70 -327 -158 -94 -95 -263 57 -115 -381 -68 308 -130 -96 69 -116 -183 165 109 159
4054A59j82q7M49k52K70j63l80J17J75p3Rl06J59q3K53k18P5k32L49l21J17M10
$$ 159 -23 -110 339 87 357 194 -186 -69 106 33 42 -264 -105 -188 65 -153 -78 -310 39 -282 -165 245
4076B45l46P7o2J81k74J40K27J2l00K27R7m8k17K91j82P2j01M5M1j39K15l97K15
$$ 245 -101 -24 -86 95 -179 -39 188 200 -100 127 224 176 -41 250 68 140 39 84 125 -14 201 -196 19
4099A9j15M2L1M1k12J63l17K77q9Q7J47j04r2K11K7J08m30L25m3J44J31j98j44
$$ 19 -96 -54 -23 18 -194 -31 -348 -71 -160 -73 74 -30 -122 89 116 224 -206 119 76 220 351 153 9
4122Ij91L21J12k62J09j13j37K7N41m38j71O2k94O24j44l7j22k91J81L28K71j77
$$ 9 -182 139 251 -11 98 -15 -152 -125 416 -22 -193 -131 -425 199 55 18 -104 -395 -214 114 385 208
4144B08l31pL45j15J56j45j43j35L51M8o3j22k32Q0N09l55K74o7n44J12j24J46
$$ 208 -123 -130 215 100 256 111 -32 -167 184 232 169 47 -185 -105 404 49 323 256 -288 -176 -300 -154
4166a54j46J48j09Q0L41j32j50j41K9r2N39K83k28m89L47k4K0P9q1O3j24J04j6
$$ -154 -300 -152 -261 -181 160 28 -122 -263 -234 -326 213 496 268 -221 126 102 122 201 120 183 59 163 147
4189A47J2j49j11k97M15J14k59k9k80R8L86k95L3J46o5M5J63j38j5J77j40l3O9
$$ 147 159 10 -101 -398 17 131 -128 -157 -437 -339 47 -248 -215 -69 -134 -89 74 -64 -79 98 -42 -75 -6
4212fO5rkK17j2j45J8L1j43O5K02k30j35J67L7k49J71r0j30j95M05q5j40J77P3
$$ -6 59 50 48 265 253 108 126 157 14 79 281 51 -84 83 120 -129 42 -48 -178 -373 32 -53 -193 -16 57
4237E7j6k20K31k19P4K70k93P8J27j1j39n0O15k04q7j95j43J8J63j02m1n9M9j49
$$ 57 41 -179 52 -167 -93 177 -116 -38 89 78 -61 -111 504 300 213 18 -125 -107 56 -46 -87 -146 -97 -246
4261b46K45J72k73k13K91J44K41l45j67k9r3L58j58J30o3r5K02M17m4m57L42k27
$$ -246 -1 171 -102 -315 -24 120 361 16 -151 -180 -273 85 -73 57 -6 -101 101 518 474 17 359 132
4283A32j65O5J62k47N6kj15K45k13j43J41M6o4j15J97l3m51L41JO17n21J6J58
$$ 132 -33 32 194 -53 3 1 -114 131 -82 -225 -84 -38 -102 -217 -20 -53 -504 -163 -162 455 -66 -50 108
4306A08p5J62k21l5k3O9J6K17J35j92j54K03j19j13J70j8k78j1J82P4j96J89k17
$$ 108 33 195 -26 -61 -84 -15 1 218 353 161 7 210 91 -22 148 130 -148 -159 23 97 -99 90 -127
4329a27k35M69r1l59M71m5j20Oj32P3k8J59J9q7K78k28K63j57J64mj9l04K22j
$$ -127 -362 107 16 -343 128 83 -37 -31 -163 -90 -118 41 60 -27 251 23 286 129 293 289 270 -34 188 187
4353A87j93j10J90q4j00K13K7k39l0j42M1J63L97n57N9K86l1O3j30L8L04m13K38
$$ 187 -6 -116 74 -10 -110 103 130 -109 -139 -281 -240 -77 320 -237 -178 108 77 140 10 48 352 -61 177
4376A77k69K61l09M36l48J55L3l9k50j07L20l5K6K9j49R4r4K8j18J60k9m1LK89
$$ 177 -92 169 -140 296 -52 103 136 97 -153 -260 60 25 51 80 -69 25 -69 -41 -159 1 -28 -69 -66 223
4400B23j61l9j73K90l4q6J01J0N6j3Q1j04m33M23q4r0K13l23p5J56L24l48J66
$$ 223 62 23 -150 140 106 20 121 131 187 174 255 151 -282 141 57 -33 180 -143 -218 -62 262 -86 80
4423H0L1n1r7o7NR5m85N39R8j50l1J81m17L07q8L85j90K2k24l0P7M60l22J3k40
$$ 80 111 60 -37 -104 -99 -4 -489 50 148 -2 -33 148 -269 38 -50 335 145 167 -57 -87 -10 450 128 141 -99
4448i9K27j98J47l9O7j58J0q0M9k15Q3K50j29K21k80K8R5J72k43r4N86m04j9J31
$$ -99 128 -70 77 38 105 -53 -43 -123 -74 -289 -206 44 -85 136 -144 -116 -21 151 -92 -186 400 -4 -23 108
4472A08n3Mj75J25r9J27j62K66j02j0j27J3J01p6j1q2M1k14L01K5j73Q6J16j12
$$ 108 55 59 -116 9 -90 37 -125 141 39 29 -98 -85 16 -60 -71 -153 -112 -326 -25 0 -173 -87 29 -83
4496h3o0R7J29J13j13K19k17R1J01l57L5K34l2k95o9K43M8j61J97l66K43J5O9
$$ -83 -143 -46 83 196 83 302 85 176 277 -80 -45 189 157 -138 -207 36 84 -77 120 -246 -3 12 81
4519H1j75O5j21j50J50p1K04k65J82J87o0n7N9J03j37K4K93n49N57l40JM13kl47
$$ 81 -94 -29 -150 -300 -150 -221 -17 -282 -100 87 27 -30 29 132 -5 19 312 -237 320 -20 -19 394 392 45
4543D5j17l02K56L22j71j04O4j43N2K0K59k81k03J86J16k0K7j34Q4J20J7j98J35
$$ 45 -72 -374 -118 204 33 -71 -7 -150 -98 -78 181 -100 -303 -117 -1 -21 6 -128 -44 76 93 -105 30
4566C0m15K91J53r4k4J2K3o5L56p5k91m7K80j83k7K06o3j49r5J07P2j72n0j8L13
$$ 30 -385 -94 59 -35 -59 -47 -24 -89 267 192 -99 -146 134 -49 -76 130 67 -82 -177 -70 2 -170 -220 -238 75
4591G5k2O6k9m2Q3Q2k69o8J51K9j24J6K1K36n7k02J80k01J70J2k37L63k85NJ32
$$ 75 53 119 90 48 131 213 -56 -124 27 56 -68 -52 -31 205 148 -54 126 -75 95 107 -130 233 -52 -47 85
4616H5J42k66l2J83r9j44p5J08K01j54l2J53J59k72J00o8K59P2l49J2K71K94m46
$$ 85 227 -39 -71 112 13 -131 -206 -98 103 -51 -83 70 229 -43 57 -11 248 320 -29 -17 254 548 102
4639A02J81j23j85Q8J95l16m5K11q8nRq3j34R4l92M68M5k10J32Q0R4m3m2j06J02
$$ 102 283 160 -25 63 258 -58 -103 108 20 15 24 -59 -193 -99 -491 -23 22 -188 -56 24 118 75 33 -73 29
4664B9oK01nq0j71j54J80L81k89l64J76J69j52J55J07r9n2O0l29J34j61N9L1J43
$$ 29 23 224 219 139 -32 -186 -6 375 86 -278 -102 67 -85 70 177 78 26 86 -243 -109 -270 -211 -180 -37
4688c7n0P1J1j26j11J23M52j59j58l1j0K3K3N9Q5o9QQM7k13j33n4J32J3M9k9p9
$$ -37 -87 -16 -5 -131 -242 -119 333 174 16 -15 -25 -2 21 80 165 96 104 112 159 -54 -187 -241 -109 -96 -47 -76 -155
4715a55j39L06j22k12K55j71Q7L36m8j45j87Q5J51L31k74n2r5K73q7j64j23P2
$$ -155 -294 12 -110 -322 -67 -238 -151 185 137 -8 -195 -110 41 372 98 46 -49 224 137 -27 -150 -78
4737g8K4lm8Q4l05J15K25O9K3N3k97l10L20O4J32n2lJ90l17J14J36j90K04q6J18
$$ -78 -54 -57 -105 -21 -326 -211 14 83 106 159 -138 -448 -128 -64 68 16 13 203 -114 0 136 -54 150 64 182
4762A82k49M77m25r9L08r9K34m38K66l41K16J9l0j11l7j22J34J15N2J04k75q2
$$ 182 -67 410 -15 -114 194 95 329 -109 157 -184 32 51 21 -90 -127 -249 -115 0 52 156 -119 -201
4784b01J36RK40k20r5L6J70K00l84K70j05j53J84M7p8J66p2n5K01j13l32J1K80
$$ -201 -65 -56 184 -36 -131 -95 75 275 -109 161 56 -97 87 134 56 222 150 95 296 183 -149 -138 142
4807A42l4j71j75L81j92K66m07K25k39l1K11L5j59R1J46l33L57k8K20m2k42k9
$$ 142 108 -63 -238 143 -49 217 -190 35 -204 -235 -24 11 -148 -57 89 -244 113 85 305 263 21 -8
4829hL75j33R6j97l7p4J72j84p1m0j3j7K83k38j54J25r3J60o0L52m41Q0R6k05
$$ -8 367 234 330 133 96 22 194 10 -61 -101 -114 -131 152 -86 -240 -115 -208 -48 -108 244 -197 -117 -21 -226
4853b26J67Q3k5r7K42j24n3J07J00l8p7q3K90j69k86J79k2k29J95K6r0M2r3K04
$$ -226 -59 24 -1 -98 144 20 -33 74 174 136 59 -24 266 97 -189 -10 -32 -261 -66 -40 -130 -88 -181 23
4877B3K16r6m9m29J56L52pLm06L76K8k44J77m5l9j87K77P0J25n13m4M34j81l8
$$ 23 239 143 94 -335 -179 173 166 169 -237 139 167 -77 100 55 16 -171 106 176 301 -212 -256 178 -3 -41
4901d1J28k52J6N3R0L5j22j01J10j90J00K53k13J60k52J19j1J16j39J97L43k68
$$ -41 87 -165 -149 -96 -6 29 -93 -194 -84 -274 -174 79 -134 26 -226 -107 -118 -2 -141 56 399 131
4923A31J28j24j36J04j63m0J15K52n08L43n3J8L5J13k77j3J18R0j64Qrk98J43
$$ 131 259 135 -1 103 -60 -100 15 267 -241 102 49 67 102 215 -62 -75 43 133 -31 -23 -32 -330 -187
4946a87K40L5j38J2Q9N0j87lN4K29N4p8N2l60J61k8J91l78O2J37J42J13l80K88
$$ -187 53 88 -50 -38 51 101 -86 -89 -35 194 248 170 222 -138 23 -5 186 -192 -130 7 149 262 -118 170
4970A70m68J13J82R6l52N17j51k44L19l07J72j82K06mJ38k14j7K7J3K13q4j6J0
$$ 170 -298 -185 -3 93 -259 258 107 -137 182 -125 47 -135 71 67 205 -9 -26 1 14 227 143 127 137
4993A37j16P1j34J50J4l36J22j8K84K12m42J55K2l08J0J58K1r3j89K58j29J83
$$ 137 21 92 -42 108 122 -214 -92 -110 174 386 -56 99 121 -187 -177 -19 2 -91 -280 -22 -151 32
5015C2k2j10K1J75J30j02j50j94L99k05J94N0j43m3j56L04j08j75o3K14l01L7
$$ 32 10 -100 -79 96 226 124 -26 -220 179 -26 168 218 75 32 -124 180 72 -103 -166 48 -253 -216
5037b16J46j41O8J74q4J27k2n8k8k09K58J17j56r6L16m88K07J58Qk66J46R0j04
$$ -216 -70 -211 -143 31 -53 74 52 -6 -34 -243 15 132 -24 -120 196 -292 -85 73 81 -185 -39 51 -53
5060e3K75k13j75J76q0r5K77l09K47o8j85qJ02J36M2j95L04j59k29K64j79L32
$$ -53 222 9 -166 10 -70 -165 112 -197 50 -18 -203 -211 -109 27 69 -126 178 19 -210 54 -125 207
5082B07j24O1r5j5J52k21L13l00j00J01j20L9K87l10J39k80J88J71n2m3k03J10
$$ 207 83 144 49 34 186 -35 278 -22 -122 -21 -141 -102 185 -125 14 -266 -78 93 41 -2 -205 -95
5104i5K29k40O9j82K05J30K37m49O8j91P9Q6J42nj86j19M35Q8m89N64m07K80L6
$$ -95 134 -106 -37 -219 -14 116 353 -96 -28 -219 -140 -54 88 83 -103 -222 213 301 -188 376 -31 249 285
5127B85l8k15l42J82p8J10J38K1o6j8o7J68l1l1K87o18M73R4k46j64K25l7K25
$$ 285 247 32 -310 -128 -206 -96 42 63 -3 -21 -88 80 49 18 305 -313 160 254 8 -156 69 32 257
5150B57o0k7Q0l25L2L2L00l80l0L77m25J96M3j53J33j91N1j4K07k98J99j4lp3
$$ 257 197 170 250 -75 -43 -11 289 -91 -121 256 -169 27 70 -83 50 -141 -90 -104 103 -195 4 -10 -13 -86
5174h6K7L85m61kR3K42j46J36l63L89k39R6k00K76k40K46l8j08o3p3J00J73j13
$$ -86 -59 326 -135 -137 -44 198 52 188 -175 214 -25 71 -129 147 -93 153 115 7 -56 -129 -29 144 31
5197C1r2J21p9j34K44l92M73k45J43k3p8J83l77L75o5kj37J56Q7l08J04L32j05
$$ 31 -61 60 -19 -153 91 -301 172 -73 70 47 -31 152 -225 150 85 83 -54 102 189 -119 -15 317 212
5220B12nj22j82P2J86l38%J78P4N3k15m9j91J71L41k49L87m74L4K69k89L94k87
$$ 212 207 85 -97 -25 161 -177 -177 1 75 128 -87 -136 -327 -156 185 -64 323 -151 -117 152 -137 257 -30
5243c0L7j27L30m3j81L1k4j19J48N8J06m42J95k28L39LJ07j60Kn5j55K28k11K00
$$ -30 7 -120 210 167 -14 17 -7 -126 22 80 186 -256 -61 -289 50 53 160 0 2 -53 -208 20 -191 9
5267Ik85K10J93j18J39k57q6K26J35k23K37r0r0K90k97Q2j43J99j15j88J69J23
$$ 9 -276 -66 127 9 148 -109 -195 31 166 -57 180 90 0 290 -7 75 -68 131 16 -172 -3 120
5289A20j84J08j70m6J37J09k48j09M73j62k89J67J55P4l01M33l30l8L35l55J79
$$ 120 -64 44 -126 -172 -35 74 -174 -283 190 28 -261 -94 61 135 -166 267 -63 -101 234 -121 58
5310E8K08k05J97k88p2K81P8Kk63P7j59M1k5J70l01L11k34K57k29j45K84k69O5
$$ 58 266 61 258 -30 -102 179 257 259 -4 73 -86 -45 -70 100 -201 110 -124 133 -96 -241 43 -226 -161
5333a61M02m25L58k33j0R0P4m1J22k47L80k84P2n7o3K14Pk16O9k7J63k60J21k94
$$ -161 241 -184 174 -59 -69 21 95 54 176 -71 309 25 97 40 -23 191 198 -18 51 24 187 -73 48 -246
5357b46J79J36J4j85M2K23m12J96j45O9M3O3k0M7j05J10K2m4M4r0K69l11J43N9
$$ -246 -67 69 83 -102 -60 163 -249 -53 -198 -129 -86 -23 -43 4 -101 9 31 -13 31 -59 210 -101 42 101
5381A01q0J94j32M9k0l94J74J18M5q7K0j43L22n59K80K50l5o9J12O3k48J93P8
$$ 101 21 215 83 132 112 -282 -108 10 55 -32 -12 -155 167 -392 -112 138 103 34 146 209 -39 154 232
5404B32l94J26JP0j0Q9pqM1J28Ll08N8o0J46l26K69k56K19J16k36o4K21j57L54
$$ 232 -162 -36 -35 35 25 114 107 99 140 268 271 -37 21 -39 107 -219 50 -206 13 129 -107 -171 50 -107 247
5429B47l12K85k57l2q7RL22n1k57K05q9p4O2j02K20n1oj31K30j40j5r4qKj62K93
$$ 247 -65 220 -37 -69 -156 -147 175 124 -133 72 -17 -91 -29 -131 89 38 32 -99 131 -9 -24 -118 -126 -124 -286 7
5455GJ6k20L01j69K9j02K84k99M76m26P9K8j49M84k99j35O9K32j15Q8j75J37j32
$$ 7 23 -197 104 -65 -36 -138 146 -153 323 -103 -24 4 -145 339 40 -95 -26 206 91 179 4 141 9
5478Ij8K49j41J29j03k06K66j6l71K52j81n9L76l24O2r1L27q5k38J95rn5j62K60
$$ 9 -9 240 99 228 125 -81 185 169 -202 50 -131 -190 186 -138 -76 -167 160 75 -163 32 23 -32 -194 66
5502F6J46l21J70j53J04L17q5j69r4K95Q5j48q0M6k83Q1J37l41K02K2j69P7K25
$$ 66 212 -109 61 -92 12 329 244 75 -19 276 361 213 133 179 -104 -23 114 -227 -25 -3 -172 -95 130
5525A30J6k35K45r1j23K29L3j14k55J60K91j76P7L5m36L56k03J17N7k16J67l36
$$ 130 146 -89 156 65 -58 171 204 90 -165 -5 286 110 187 222 -214 142 -61 56 113 -103 64 -272
5547b72L63RKK3p9j21M5N1q5P7J30k41Q5p2j61J00J63M2m1o5L11j40N6l15K68
$$ -272 91 100 102 125 46 -75 -30 21 -64 13 143 -98 -13 -85 -246 -146 17 59 18 -47 264 124 180 -135 133
5572A33J38k35j26K81j03j20J75l30R9L22l90J60k02K19o7J31k66K14p0j22J41
$$ 133 271 36 -90 191 88 -32 143 -187 -88 234 -156 4 -198 21 -46 85 -181 33 -37 -159 -18
5593a8O0RJ35l52J50j75M06n2j17J97l90K97q2K7l14J08K31m2m8l3k85P9J48J76
$$ -18 42 51 186 -166 -16 -191 215 163 46 243 -147 150 68 95 -219 -111 120 78 30 -3 -288 -209 -61 115
5617A15j35Q1K7Q7j37k97K60J34k16q2J25j21J35Rm2J31j56J83NR4j54J2k2J43
$$ 115 -20 61 88 175 38 -259 1 135 -81 -163 -38 -159 -24 -15 -57 74 -82 101 106 200 46 58 36 179
5641A79lk88J02L6j56j6K86k51M0K7J05j00K21n76K99J69q2j03Q9m3p5K48k44
$$ 179 176 -112 -10 26 -130 -146 140 -111 -71 -44 61 -39 182 -394 -95 74 -8 -111 -22 -65 -140 108 -136
5664a36J29J07k81K40j46K35O4k72J0J33k7j54l1L27j73L13m39J70k41J97rk73
$$ -136 -7 100 -181 59 -87 148 212 -60 -50 83 56 -98 -129 198 25 338 -101 69 -172 25 16 -257
5686b57J19J6K34oj94J56j48q6M40l98r7J4M39l34Q4K9J05j65j87K67K25k91J40
$$ -257 -138 -122 112 106 -88 68 -80 -166 274 -124 -221 -207 232 -102 -18 11 116 -49 -236 31 256 -35 105
5709A05q8M7l61K01r0L53j24L2p5N1m05M64l24P0L46l73J98o5Q7j95K56m1J43
$$ 105 17 64 -297 -96 -186 167 43 75 0 51 -354 110 -214 -144 202 -171 27 -38 49 -146 110 69 212
5732B12J0j11J04j1K00l13k88J49r6L27l1j67l5K75n69L28M0j18k19L04MJ25j06
$$ 212 222 111 215 204 404 91 -197 -48 -144 183 152 -15 -50 225 -344 -16 24 -94 -313 -9 -5 120 14
5755A4p8J88r0P7j36j50K30J33k88K21L47j23m22J46k7M2j98j73O09l87l32M21
$$ 14 -64 124 34 111 -25 -175 55 188 -100 121 468 345 -77 69 42 84 -114 -287 322 -65 -397 24
5777B4k38K75l73M73j47j6O1J6j8K15l90J97j60J2K0K38l42N39k64m7N6k30K76
$$ 24 -214 61 -312 161 14 -2 59 75 57 272 -118 79 -81 -69 -49 189 -153 386 122 75 131 -99 177
5800A77l10L49l51J80r5J69k67J31K7J05r5n0J04k21J21j50L50n26J36M11n5l47
$$ 177 -133 216 -135 45 -50 119 -148 -17 10 115 20 -30 74 -147 -26 -176 174 -352 -216 195 140 -207
5822b07J53P4l13K69j39L53J4j82K2l2Q2j99J67K09l19r5K45l31R4PJ84q2on5
$$ -207 -54 20 -293 -24 -163 190 204 22 44 12 94 -105 62 271 -48 -143 102 -229 -135 -128 56 -26 -32 -87
5846h7O3P8j85K67k31J83k13K0J71n7J2J88j91j54J48o7K18l44M1J65o7n4L2j73
$$ -87 -24 54 -131 136 -95 88 -125 -105 66 9 21 209 18 -136 12 -55 163 -181 -140 25 -42 -96 -64 -237
5870b37O3K59P3r8M4l2j22j13m4K49j5j50n5J41J32k91N6j05J53M01k22mj19K56
$$ -237 -174 85 158 60 104 72 -50 -163 -207 42 27 -123 -178 -37 95 -196 -140 -245 -92 309 87 83 -36 220
5894B20l93J98K45l12K4R6j25L16k08J8o2L3k46J46L6j19o2K30j11m5j56J06K92
$$ 220 -173 25 270 -42 -18 78 -47 269 61 79 17 50 -196 -50 -14 -133 -195 35 -76 -121 -277 -171 121
5917A21j3j09j80K17J08l26K38k5q7K24J8j35k52J39J63m16J41K16p9J36j37J11
$$ 121 108 -1 -181 36 144 -182 56 31 -56 168 186 51 -201 -62 101 -315 -174 42 -37 99 -38 73
5939G3R2K7r6j24j81J95k3K7p4o4m8K41k6K75k04k27K33J20O9%k39j11M0J17J30
$$ 73 165 192 96 -28 -209 -14 -37 -10 -84 -148 -196 45 19 294 90 -137 96 216 285 285 46 -65 -25 92 222
5964B22J9l85J59L5j65R8L3m1j76J18M7JQ1K8p7j07j00K21J21m37J71K47n6k0
$$ 222 241 -144 15 50 -115 -17 16 -25 -201 -83 -36 -35 46 74 -3 -110 -210 11 132 -305 -134 113 57 37
5988C7J8j77J85K05n2n5J09l58K8nR6k62L82l82J99q8K49k29Q1l91L91p7K39j61
$$ 37 55 -122 63 268 216 161 270 -88 -60 -65 31 -231 151 -231 -32 -120 129 -100 -19 -410 -19 -96 143 -18
6012a8j11K4j07K14j26J54M6K8k39M31q7j08m4m7k5M7qL6o4o6r1J15J03j68J75
$$ -18 -129 -105 -212 2 -124 30 76 104 -135 296 209 101 57 10 -15 32 24 60 -4 -70 -161 -46 57 -111 64
6037F4q0j22K57k14P3j19J61j35Q7K01l79L26K18k13j27L6k94K95p7j57L19j73
$$ 64 -16 -138 119 -95 -22 -141 20 -115 -28 173 -206 120 338 125 -2 34 -260 35 -42 -199 120 -53
6059e3K81k12j67J37j36K02k5j10K34l07J07J49m5j90L04k54J33K6l12J91k63
$$ -53 228 16 -151 -14 -150 52 27 -83 151 -156 -49 100 55 -135 169 -85 48 74 -238 -47 -310
6080c10J03M16j71L0k94L38l88K66j21L75p0l79J52K8K1O7R7k52N2j79K70m7j31
$$ -310 -207 209 38 68 -226 112 -276 -10 -131 244 174 -205 -53 -25 -4 63 160 -92 -40 -219 51 4 -127
6103a27j52L74l00n6O3J42m5K89l97L16k27K60p1j23M89m69J12j58p6j01J27J41
$$ -127 -279 95 -205 -261 -198 -56 -101 188 -209 107 -120 140 69 -54 435 -34 78 -80 -156 -257 -130 11
6125A1j02j58J96L5J62P9m2k30Qk0K4M3k6O8O7j02j00nj60M04j55j11J10N9K14
$$ 11 -91 -249 -53 -18 144 223 181 -49 -41 -61 -37 6 -20 48 115 13 -87 -92 -252 152 -3 -114 -4 55 269
6150B69k60K41o0j00k27J52J59p5qj04J22j4M7k40K61l45j21K50J25k78J74k98
$$ 269 9 250 190 90 -137 15 174 99 91 -13 109 95 142 -98 163 -182 -303 -53 72 -206 -32 -330
6172c30K60R8Q8k17j10J63j01K32j42m2M91k83J59l67p7m9K50p6R2q7J67l4j47
$$ -330 -70 28 116 -101 -211 -48 -149 83 -59 -101 390 107 266 -101 -178 -227 23 -53 39 -48 119 85 -62
6195f2k72K92P5q0o7J82M0l15J11J25k24j16M04k54K72k36K05k07R3M6J19m10
$$ -62 -334 -42 33 -47 -114 68 108 -207 -96 29 -195 -311 93 -161 111 -125 80 -127 -34 12 131 -279
6217b79M75J34k96J44j33j28J93k7q9M8q3j73K48j96L52k35K8k83K82J9J55j74
$$ -279 196 330 34 178 45 -83 110 83 -6 42 -41 -214 34 -162 190 -45 -17 -300 -18 1 156 -18
6239a8q5K2k16K71J98Nj72Q7j17J52L6k99p1J01J24J07N1k34m2m5K41qp7J41k67
$$ -18 -103 -81 -297 -26 172 177 5 92 -25 127 163 -136 -207 -106 18 125 176 -58 -100 -145 96 88 11 152 -115
6264a15m9J48O0l17K70k8J76r8j72J88k62N55n25J42J77j27rP4r9K00K1j46k74
$$ -115 -164 -16 44 -273 -3 -31 145 47 -125 63 -199 356 -169 -27 150 23 14 88 -11 189 210 64 -210
6287b10J82R9L6j63J77j64o4j5J78k25O2J79l02L31j35JJ46j20K96j91k71N1k5
$$ -210 -28 71 107 -56 121 -43 -107 -122 56 -169 -107 72 -230 101 -34 -33 113 -7 289 98 -173 -122 -147
6310a47J68n4K24N9m0l45K82R3l18L08l14J36K17j37j98j44J27j56K56j71K30
$$ -147 21 -33 191 250 210 -135 147 240 -78 230 -84 52 269 132 -66 -210 -83 -239 17 -154 76
6331G6j64J69Q1k76k70N62k18%p2K56j73j40J21K48j82r3L34j55l56K51K69k25
$$ 76 -88 81 162 -114 -384 178 -40 -40 -112 144 -29 -169 -48 200 18 -75 259 104 -252 -1 268 43
6353D3j3j33J03j35J02K9l7Jj12J49o3L4r6R5J20j13K0K08k11j85K30p0j9k6R1
$$ 43 30 -103 0 -135 -33 -4 -41 -40 -152 -3 -66 -32 -128 -33 87 -26 -6 202 -9 -194 36 -34 -53 -79 12
6378A2j68L26J1n0j15p7N8K4m4J03p4L17n58L6J2L9l6K59J13q3k10J26J17o2J23
$$ 12 -156 170 181 131 16 -61 -3 21 -23 80 6 323 -235 -199 -187 -148 -184 75 188 105 -105 21 138 76 199
6403A99k81J72r3q5Qj6Q5Q8J4O3M5J4n9jq9R9j28r7n8l8L69j47j40J73l39K12
$$ 199 -82 90 -3 -88 -80 -96 -11 77 91 154 199 213 154 153 64 163 35 -62 -120 -158 211 64 -76 97 -242 -30
6429c0K21k38K79l21J76N8j03j21r4J88K19Jp8K0j2m9J0j60lm0j27J14L99j46
$$ -30 191 -47 232 -89 87 145 42 -79 -173 15 234 235 157 177 165 116 126 -34 -37 -77 -204 -90 309 163
6453A63j82O5j02R8k52K11M9j24J00k16L59k44J70kL1l13K83k45J79L6l17J40
$$ 163 -19 46 -56 42 -210 1 50 -74 26 -190 169 -75 95 93 124 -189 94 -151 28 64 -253 -113
6475a13L53j20j68P3k13K17p0L4M4j36J03o1j56K16n8jJ06k2P6j71k2n4j06K75
$$ -113 240 120 -48 25 -188 29 -41 -7 37 -99 4 -57 -213 3 -55 -56 50 28 104 -67 -89 -143 -249 26
6499B6K8k12J84Pj27M5M8k48K82J30j74L12l09P9M2n9L6J4q2j88L09k80K70k49
$$ 26 54 -158 26 33 -94 -49 -1 -249 33 163 -11 301 -8 71 113 54 90 104 22 -166 143 -137 133 -116
6523a16J38j06Q8q7q7K27o4l5R8O2j23J18k02R1J15j51J06oj29K77k32k68M28
$$ -116 22 -84 4 -83 -170 57 -7 -42 56 118 -5 113 -89 2 117 -34 72 66 -63 214 -18 -286 142
6546A42j20j71K58L8k22J42k44K42k70J87O3J84l16J90q4q7k12M67l46R7M8Q8
$$ 142 22 -149 109 147 -75 67 -177 65 -205 -18 45 229 -87 103 19 -68 -280 187 -159 -62 -14 74
6568G4jn5J4m3J51qk07J38j7L6j28K14j58j38J21k18L36jk8O3l89L70k01K71l63
$$ 74 73 18 32 -11 140 132 -75 63 46 82 -46 168 10 -128 -7 -225 111 110 82 145 -244 126 -75 196 -167
6593a67J16K34J20j28J01m74J77K7k16L49l88N68k20j43m9K18nM8k73J53J17k35
$$ -167 -51 183 303 175 276 -198 -21 6 -210 139 -249 319 99 -44 -93 125 120 168 -105 48 165 -70
6615g0j06L97l40L12n57K58k67L21J38RMj12k3Mj38n9K29j41J23K89m51J62L9
$$ -70 -176 221 -119 193 -364 -106 -373 -52 86 95 99 -13 -36 -32 -170 -229 0 -141 -18 271 -180 -18 21
6638B1J37p8o3J15j23J98J01j25j41Q1K82l83lJ35j33L2l59K61K01K27k94j00
$$ 21 158 80 17 132 9 207 308 183 42 123 405 22 19 154 21 53 -306 -45 156 383 89 -11
6660a1k77M51J9J11k54JJ27j66P9q6n4N1oj23K28n3r1K14p1k7L7K3j73j52J39
$$ -11 -288 163 182 293 39 40 167 1 80 -6 -60 -9 -15 -138 90 37 -54 160 89 62 99 122 -51 -203 -64
6685f4j02K37rj07J24l11K57n5K8l55M09J61k03J95k48L23k0k67l1J22j21j16
$$ -64 -166 71 62 -45 79 -232 25 -30 -2 -357 52 213 10 205 -43 280 260 -7 -38 84 -37 -153
6707a53L48Ml30J06M2k28R2J77O6J57j01j25r1J70r1k3R4j9k16O1K7J47m3j12
$$ -153 195 199 -131 -25 17 -211 -119 58 124 281 180 55 -36 134 43 20 114 95 -121 -60 -33 114 71 -41
6731d1k7J93j5j60j43K26p7K86j75Q5R7m79K57Pk3o4J2M8k39J99p2j50K74j79
$$ -41 -68 125 110 -50 -193 33 -44 242 67 152 249 -230 27 34 11 -53 -41 7 -232 -33 -105 -255 19 -160
6755a60j17K92n2j6J13N1p9J10k86K01K02k54J65k38K13j91M3O7j81j43L20o8
$$ -160 -277 15 -37 -53 60 111 32 142 -144 57 259 5 170 -68 145 -46 -3 64 -117 -260 60 -8
6777hl43P23n68L65J7j60k41J77M5R4j09l68L34R7P0j07N2J27j85Q0K43k99J77
$$ -8 -351 372 -196 169 186 26 -215 -38 7 101 -8 -376 -42 55 125 18 70 197 12 92 335 36 213
6800B13j28P3oO1Rj35o3l14K51P6j21J64r3j69L42k63J23r4k24K19j13K17k31
$$ 213 85 158 152 213 222 87 24 -290 -39 37 -84 80 -13 -182 160 -103 20 -74 -298 -79 -192 25 -206
6823b06Q6p2L92j11J7n6J62j79J4Nj10K02k87L43q1k69J71l2k33M66k58k1J41
$$ -206 -120 -192 200 89 106 50 212 33 47 52 -58 144 -143 200 119 -150 21 -11 -244 222 -36 -57 84
6846H4j97K13J22m63J45J80j03j12L34n07M47O5k13n9O6L16k88L9j69J20Q9R7
$$ 84 -113 100 222 -241 -96 84 -19 -131 203 -304 143 208 -5 -64 2 318 30 69 -100 20 109 206
6868B06n4LL1oj76J69k68NJ2J25r7K25m0j16j25r4J49o8J01J07k13J34J94r3J30
$$ 206 152 155 186 180 4 173 -95 -90 -78 47 -50 175 135 19 -106 -200 -51 -119 -18 89 -124 10 204 111 241
6893B41k40j16J93N8p8o8q6K04k88K44m6J30k15M3J13q3N0l9k28K7q4K95j73J33
$$ 241 1 -115 78 136 58 -10 -96 108 -180 64 18 148 -67 -24 89 6 56 17 -211 -184 -268 27 -146 -13
6917a3k40N28k12r6nm3K81k17N2O7o7R3J08k02J34N4j67o8J16J8j22K6r4j92M23
$$ -13 -253 275 63 -33 -38 -81 200 -17 35 102 35 128 236 34 168 222 55 -13 103 121 -1 25 -69 -261 162
6942A62l26J34L0O4l86M95j00j36n3k4L19m34L31Lo8J12K4k54J28K9K39m28Q7
$$ 162 -164 -30 0 64 -322 173 73 -63 -116 -140 179 -255 76 79 11 123 147 -107 21 50 289 -139 -52
6965e2M42n40K95j80N5l02J24oJ70l01L64j17P9K05o8l59K69m04L20L5j27J85
$$ -52 390 -150 145 -35 20 -282 -158 -164 6 -295 69 -48 31 236 168 -191 78 -326 -6 29 -98 87
6987H7P8j82k53L71k61K69l00L13j30j62K05k44M21j37k62K28K33n58L36Qj24
$$ 87 165 -17 -270 101 -160 109 -191 122 -8 -170 35 -209 212 75 -187 41 274 -284 52 60 -64
7008f4M5J2M4J8N6p4Q9J32k29j58q0K06k0Q6m0K2K3o0j03P2J07j61Lk2K16N0J7
$$ -64 -19 -7 37 55 111 37 126 258 29 -129 -209 -3 -23 63 23 45 68 8 -95 -23 84 -77 -74 -96 120 170 187
7035A87j76j26K96q3O7l27K53l19K35J09N3k3o1j57J78j30K03k76L7J24M0r3r4
$$ 187 11 -115 181 98 165 -162 91 -228 7 116 169 146 85 -72 106 -24 179 -97 -60 64 104 11 -83
7058h3K38k55J40r7J96L1p7k19m6J19K18j10o2P8k02J68k01J98m1j9q6J69k07
$$ -83 155 -100 40 -57 139 170 93 -126 -172 -53 165 55 -7 71 -131 37 -164 34 -7 -26 -112 57 -150
7081a50L99j98l86N45j97OM7o2K01O3l08j4J88p4Q5j1m5j19p6m5R8O9n3N6j43
$$ -150 249 51 -335 210 13 19 66 4 205 268 -40 -54 134 60 145 134 89 -30 -106 -151 -53 16 -37 19 -124
7106a24L1L6j43K02j94J86K17j91j1k7L94m74J1R3qJ16m2r9j12K69k11J60k3J9
$$ -124 -93 -57 -200 2 -192 -6 211 20 9 -18 376 -98 -87 6 -2 114 72 -27 -139 130 -81 79 56 75
7130G5j71J76L7k31l8J69n1p0J01n0J81j57p7L75m22Q2j1j7K25k75K46L6m5J0
$$ 75 -96 80 117 -114 -152 17 -34 -104 -3 -53 128 -29 -106 269 -153 -71 -82 -99 126 -149 97 133 88 98
7154I8j38j00K39k23j0L14K52l39j86K32l41J20L2J63k63J68qN6q0n1j5QK29l84
$$ 98 -40 -140 99 -124 -134 180 432 93 -93 139 -202 -82 -50 113 -150 18 10 66 -14 -65 -80 -72 157 -227
7178b27J58O5ML27k34R9j12r2pj31M3J06j85L52l05J64j17K11l2J19k79L17l65
$$ -227 -69 -4 0 327 93 192 80 -12 -19 -150 -107 -1 -186 166 -139 25 -92 119 87 206 -73 244 -121
7201a21j85L75J5pj98J82j71O8Q4M0l36K00J6J76j08R7k11J72j84K35n2k74K0
$$ -121 -306 69 84 77 -121 61 -110 -42 42 82 -254 -54 -38 138 30 127 -84 88 -96 139 87 -187 -167
7224a67pK18l48L84o6Q3k87Q3P5j8k7q8K41p0j53L75j78m06K33P2L94m41J48L4
$$ -167 -174 44 -304 80 14 97 -190 -107 -32 -50 -77 -165 76 6 -147 228 50 -356 -123 -51 343 -98 50 84
7248H4k94L70j83j3j15K77k42L89j55Qj42J35j65M9K63j68J6k99L28m07J80L3
$$ 84 -210 160 -23 -36 -151 126 -116 273 118 126 -16 119 -46 3 266 98 114 -185 143 -264 -84 -51
7270e1pj66L58n26M47j39K11j78kK67l11LK10o5K44j93R5p4L4o6r9J36K2l08j8
$$ -51 -58 -224 134 -392 55 -84 127 -51 -53 214 -97 -94 116 51 295 102 197 123 157 91 -8 128 150 -158 -176
7295a76K65j69j65K33K12k94R5N1j90J21J38k92K99k41k21K65k07L46j8L6N1k00
$$ -176 89 -80 -245 -12 200 -94 1 52 -138 -17 121 -171 128 -113 -334 -69 -276 70 52 88 139 -61
7317f1m2J90K10j55r5n1J92j7l38kL15l21J13K28k70J75k49L41j86j46J49k70
$$ -61 -103 87 297 142 47 -4 188 171 -167 -169 146 -175 -62 166 -104 71 -178 163 -23 -169 -20 -290
7339b90M12l01L00L06l98j84mn1K02J7kK64l35J47q8j72l7L68r9J8L9k17Pm7l0
$$ -290 122 -179 121 427 29 -155 -159 -210 -8 9 7 271 -64 83 -5 -177 -214 154 55 73 112 -105 -98 -145 -175
7364a75J65%m7L1Q0J62j63j82L2R1j30L32k68K21j56m36M90j2j10K61r5J97j37
$$ -175 -10 -10 -57 -26 54 216 53 -129 -97 -6 -136 196 -72 149 -7 -443 47 35 -75 186 91 288 151
7387A51p8R3o0l14J48r8J87m3L1j95K57k04M0l1l0l5K23O4j51L44k00J29l67N6
$$ 151 73 166 106 -208 -60 -158 29 -14 17 -178 79 -125 -85 -116 -146 -181 42 106 -45 299 99 228 -139 -83
7411h3Q5nj94J53J6l0L3O2J00j80k30K37K6O1J37o5k28L3K21j36q7n8M57l58J13
$$ -83 2 -3 -197 -44 -28 -58 -25 37 137 -43 -273 -36 -10 51 188 123 -105 -72 149 13 -74 -132 325 -33 80
7436H0k13J83j96J91k0P7%j08n0J00j10p0O0qo6K8J25j85N8J15j63K15k17R0J16
$$ 80 -133 50 -146 45 25 102 102 -6 -56 44 -66 -136 -76 -84 -150 -122 3 -182 -124 -9 -172 43 -174 -84 32
7461C2J97p7j05L69l39J01l29R6J94j25K28j14l07j68J18K21j52J93O1k47K47
$$ 32 229 152 47 416 77 178 -151 -55 139 14 242 128 -179 -347 -229 -8 -160 33 94 -153 94
7482I4N6l78J84N0n1J45k86J06J30J76n6K8O7m37P4p4L91k53mJ95q8j52J72RJ42
$$ 94 150 -228 -44 6 -45 100 -186 -80 50 226 170 198 265 -172 -98 -172 219 -34 -38 157 69 -83 89 98 240
7507B40l98K31r5K88m3j21q1p7q0K67j65O3p9J83n7P7j80j25J80K0j6n2P2l3J89
$$ 240 -158 73 -22 266 223 102 21 -56 -136 131 -34 29 -50 133 76 153 -27 -152 28 48 32 -20 52 19 208
7532B08j23m92M75l65K28R1P5j93K12j88J5K56k87n7N1K44k15J89P5k66Q8o6L4
$$ 208 85 -407 68 -297 -69 22 97 -96 116 -72 -57 199 -88 -145 -94 150 -65 124 199 -67 21 -45 -11
7555a1j40K25j5p8j18O5P8J91k28P4mo7J24K8qr8o0r9L14o1j85J22J72l20K25
$$ -11 -151 74 59 -19 -137 -72 6 197 -31 43 39 -28 96 124 116 18 -42 -141 173 112 -73 49 221 -99 126
7580A26k85r9K06j24J38K37m1l13K07P6l69Q6l1K15J8j77J6K15j60L24k02j66
$$ 126 -159 -258 -52 -176 -38 199 158 -155 52 128 -241 -155 -186 29 47 -130 -114 101 -59 265 63 -103
7602a03n7J85N7j30p8K5J06J92o5k21oK37Q3l76K03P6qm6j77J65J5N8l39M11k65
$$ -103 -160 25 82 -48 -126 -101 5 197 132 -89 -95 142 225 -151 52 128 120 74 -103 62 77 135 -204 207 -58
7627e8J89j71N1kj40j02K43J88m77L72j98L75k54n0K2K8j50K83N3k24N0r4K6k1
$$ -58 131 -40 11 9 -131 -233 10 198 -279 93 -105 270 16 -34 -12 16 -134 149 202 -22 28 -66 -40 -61
7651f1K81l38J26J27l15J52O7k24K1K35K1j89L39l42J69j0j12KJ2J29r6m6j8R9
$$ -61 220 -118 8 135 -180 -28 39 -185 -164 71 92 -97 242 -100 69 59 -53 -51 -39 90 -6 -52 -70 29
7675B9m2K00j40LL7p5j74L11l1j27Jk7J96j61N9j01k79L42PJJ12m2j3j47J2K28
$$ 29 -13 187 47 50 87 12 -162 149 118 -9 -8 -35 161 0 59 -42 -321 21 28 29 141 99 86 -61 -49 179
7701A79k96J38J79k47J67q4k03L30J77m04k69K68J28q5n7J62r9J36o1k5k6J57
$$ 179 -117 21 200 -47 120 36 -167 163 340 -64 -333 -65 63 -22 -79 83 -16 120 59 34 8 165
7723A65m9r3k14J93m7M8j7k96K40J76j17k4J68j52k34J19O0J57k57J59m7m4J42
$$ 165 116 23 -191 2 -45 3 -14 -310 -70 106 -11 -35 133 -19 -253 -134 -74 83 -174 -15 -62 -106 36
7746C6l8m6J41j13pk05K84j29j31K28m56M01K17k15J20oJ05l51N0j04K77N5j05
$$ 36 -2 -48 93 -20 -27 -232 52 -77 -208 20 -436 -35 182 -33 87 81 186 -165 -115 -219 58 113 8
7769HJ23j90P2K21k54n8N1j88M26l78L48q5l92J80K86m79L01l8J96k38j1O2p9
$$ 8 131 -59 13 234 -20 -78 -27 -215 211 -167 181 96 -296 -116 170 -309 -8 -46 150 -88 -99 -37 -116
7792a16K55K51k76Jj20j12J51n4m8r2J53j76M50j57N8k35J95N2k94K73j44q0j09
$$ -116 139 390 114 115 -5 -117 34 -20 -68 -160 -7 -183 267 110 168 -67 128 180 -114 159 15 -65 -174
7815a74L72l26R0N5j00M0RO2J24k91J58J02l42J81K70l93K44L4k26L8k71N21k
$$ -174 198 -128 -38 17 -83 -43 -34 28 152 -139 19 121 -221 -40 230 -163 81 115 -111 -73 -344 177 175
7838A75l09L23n7k7M7j75K91m09K04r4K07k99J91j99K33r6qK05k66N5J14j96R4
$$ 175 -134 189 132 105 152 -23 268 -141 63 -31 176 -123 68 -131 102 6 -2 203 -63 -8 106 -90 4
7861Dj21L83j12Qk26JR6k72M49k98l1J32k08K46j62J10J36k59J81j65Q3n1N37
$$ 4 -117 266 154 162 -64 -63 33 -239 210 -88 -119 13 -195 51 -111 -1 135 -124 57 -108 -25 -76 461
7884D61o08K53k33J00l25M26o9K69j39q6j78J57m8Q3J37R5k80J3j23K57K18m26
$$ 461 -147 106 -127 -27 -352 74 5 274 135 49 -129 28 -20 63 200 295 15 28 -95 162 380 -46
7906d6K15j36k4l93K48j26J73k3PR0J60j86l9j55L87r3p2l6Q8k7n3L2j1j82L41
$$ -46 169 33 9 -384 -136 -262 -89 -112 -105 -15 145 -41 -80 -235 152 59 -13 -49 39 12 -41 -9 -20 -202 139
7931A39j69O4M9j08jJ65k82J01p2k16P9J86K37k83Q4J26m33N96m93N5K70k39L50
$$ 139 -30 34 83 -25 -26 139 -143 -42 -114 -330 -251 -65 172 -111 -27 99 -334 262 -231 -176 94 -145 205
7954B05k72N2J80R1k94J19m9j82J27l6j51K57R5k27J45r6j11LO7J29k2l9P3N0
$$ 205 -67 -15 165 256 -38 81 32 -150 -23 -59 -210 47 142 -85 60 -36 -147 -144 -77 52 30 -9 64 114
7978A14k63J11n2K72k56J41j13l5K72j78M4j01J70k15K89l64L07p0l3j06Q0J09
$$ 114 -149 -38 -90 182 -74 67 -46 -81 191 13 57 -44 126 -89 200 -164 143 73 40 -66 14 123
8000A23n2m8l10K20J40Q4j73nK8J16%j30R9m87N28k44q8L41J4j32%r5J79l25M91
$$ 123 71 23 -287 -67 73 157 -16 -21 7 123 123 -7 92 -395 133 -111 -199 142 156 24 24 -71 108 -217 274
8025B74k07J0l1k1K5J16j01r5n6J77k50K02K6Kj79K71l45M7K10l65J34L6K31j40
$$ 274 67 77 46 25 50 166 65 -30 -86 91 -159 43 69 71 -108 163 -182 -135 75 -290 -156 -120 111 -29
8049b9j12L1J98m6m8L5K45nm31J2n9J55r5K59j64m1K02p0q3J24l3J00n3o2j66
$$ -29 -141 -110 88 42 -6 29 274 269 -162 -150 -209 -54 -149 110 -54 -95 107 37 -46 78 45 145 92 30 -136
8074a36J14P8j55J85k42J80J08k61M2N4N3J55j84P0j52%L8N9J20P3k46n5L41k63
$$ -136 -22 56 -99 86 -156 24 132 -129 -87 -33 20 175 -9 61 -91 -91 -53 6 126 199 -47 -102 239 -24
8098b4j82P1j02L00J8j67m3J6L03j31J38j9M5j66o2j15N5K8P5j99P3m1l3L90m67
$$ -24 -206 -135 -237 63 81 -86 -129 -113 190 59 197 178 223 57 -5 -120 -65 -37 38 -161 -88 -129 -162 228 -239
8123b39K20m6K69l10K95k6j39Jn2n6R7K1M4K6j27J13N3L7m58L24J5p5J44m54M59
$$ -239 -19 -65 204 -106 189 163 24 25 -27 -83 14 35 79 105 -22 91 144 181 -277 47 62 -13 131 -323 136
8148A36m7j13J29m1n3J24k36P1M4L6q2L3K7n4K09r3l1k43p8L00o1p1K83m10M32
$$ 136 89 -24 105 64 11 135 -101 -30 14 50 -32 1 28 -26 183 90 59 -184 -262 38 -23 -94 189 -221 211
8173B11k31M8K2j72M27j73m6l40L85j99K02l41K69N0j50J77j07J9
$$ 211 -20 28 50 -122 305 132 86 -254 131 -68 134 -207 62 112 -38 139 32 51
8191E1
$$ Imaginary data points
##PAGE= N=2
##DATA TABLE= (X++(I..I)), XYDATA
0@%%%%%%%%%%%%%%%%Qj6J6j6J6k4L2l2M0m8N6o6P4q8J02j16J32j49J69j92K17
$$ 0 0 0 0 0 0 0 0 0 0 0 0 0 0 0 0 0 8 -8 8 -8 8 -16 16 -16 24 -24 32 -34 40 -48 54 -62 70 -79 90 -102 115
37A15k43K72l04L40l80M22m68N18n73O33p00P75q54R40j034J139j257J384j527
$$ 115 -128 144 -160 180 -200 222 -246 272 -301 332 -368 407 -447 493 -541 598 -659 725 -802
56h02J689j872K083k324K604k940L347l845M481n323O478q160J0754j8756J82324
$$ -802 887 -985 1098 -1226 1378 -1562 1785 -2060 2421 -2902 3576 -4584 6170 -12586 169738
71A69738j10991k22802J73964P0210j37507J7998R5446n7051k4096J7684k0281
$$ 169738 58747 -164055 9909 80119 -57388 -39390 56056 -995 -25091 -7407 -27688
82b7688L0936M4618o0539k2785M4597p677n567M5080k6926m6112L5969K3446k4787
$$ -27688 3248 47866 -12673 -35458 9139 1462 -4105 40975 14049 -32063 3906 27352 2565
95B565J5486K573m3778R597L7310k5082j0684K8195k7608l2138M5058K1390l7317
$$ 2565 18051 20624 -23154 -13557 23753 -1329 -12013 16182 -11426 -43564 1494 22884 -14433
108a4433n73J4611j8928J0354L0750j4885k0017J0398K142L522J2823j0892j0226
$$ -14433 -15006 -395 -19323 -8969 21781 6896 -13121 -2723 -581 2941 15764 4872 -5354
121e354J1636m696q050J8822N514j8809m802N468M805P289n199j2198K703K297
$$ -5354 6282 1586 -6464 12358 17872 -937 -5739 -271 4534 11823 6624 -5574 -2871 -574
135e74o491M572O100p369r582j786R351R233q304o007J3015l745j4252K1047K0380
$$ -574 -7065 -2493 3607 -3762 -13344 -15130 -5779 3454 -4850 -10857 2158 -1587 -15839 5208 25588
150B5588k3978j5124K0142O704j0887N907N321j4638o769R280N738J125l091j5078
$$ 25588 1610 -13514 6628 13332 2445 8352 13673 -965 -7734 1546 7284 8409 5318 -9760
164i760m693J8024N375j2550K664J163j8128O466K5308p599j8370K791j237K841
$$ -9760 -14453 3571 8946 -3604 -940 223 -17905 -11439 13869 6270 -12100 -9309 -10546 -7705
178g705J9688n175j9476J0013L745r829K1656J3445l1489q813K5319K99p025R835
$$ -7705 11983 6808 -12668 -2655 1090 -8739 12917 26362 -5127 -13940 11379 11678 4653 14488
192A4488q500j9105O864J3401K284m574j6609o760J7538N529j0607O236J849k0995
$$ 14488 5988 -13117 -6253 7148 9432 4858 -11751 -18511 -973 4556 -6051 185 2034 -18961
206a8961K769L0190m01k3321Q26P952l099Q085R220j2807q823P723J883M083J0984
$$ -18961 -16192 13998 13597 -9724 -8898 -946 -4045 4040 13260 453 -8370 -647 1236 5319 16303
221A6303j0254j8236J1538J4686q311l275M541r255p916R525Q957m762j2921n590
$$ 16303 6049 -12187 -649 14037 5726 2451 6992 -2263 -10179 -654 8303 3541 -9380 -14970
235a4970J0467O510q257K13O673p247m592J2364O801n090n179p58N257P121m744
$$ -14970 -4503 2007 -6250 -6037 636 -6611 -11203 1161 7962 2872 -2307 -3065 2192 9313 4569
250D569m164N373k032p790O654P558p460o159L143K280P5j719j241K461r99p886
$$ 4569 405 5778 3746 -4044 2610 10168 2708 -3451 -308 1972 2047 328 -913 1548 549 -7337
266g337P56J0874k872j2607L639R314o923m689J1542L112j1328m59J0855K217
$$ -7337 -6581 4293 1421 -11186 -7547 1767 -5156 -9845 1697 4809 -6519 -6978 3877 6094
280F094m198J423K851k037m649M219Q961m822j3174J968Q894l143l205K430m244
$$ 6094 1896 3319 6170 4133 -516 3703 12664 7842 -5332 -3364 5530 2387 -818 1612 -2632
295b632n360M565L448N70J027p702p122J1637J0062r592n916N925j757l508R061
$$ -2632 -7992 -3427 21 591 1618 -6084 -13206 -1569 8493 -1099 -7015 -1090 -2847 -6355 2706
310B706O343q682q524L784J0882M727o719o041L118K397k165M627N120j0198j0986
$$ 2706 9049 367 -8157 -4373 6509 11236 4517 -1524 1594 3991 1826 6453 11573 1375 -9611
325i611O272J0143k302p354l878j029J798L695L543r39p659m353R159R632l385
$$ -9611 -3339 6804 4502 -2852 -6730 -7759 -5961 -2266 1277 338 -7321 -11674 -2515 7117 3732
340C732p357J147K737QK823M548k660q744j168R661O500o411p720J855M450j330
$$ 3732 -3625 -2478 259 267 3090 7638 4978 -3766 -4934 4727 11227 4816 -2904 -1049 3401 2071
356B071k27L681l542q731J064R697k23q325k179K874l03m42L531P82m634k713
$$ 2071 1844 5525 1983 -6748 -5684 4013 3790 -4535 -6714 -3840 -4143 -4585 -1054 -272 -4906 -7619
372g619N580O665j827l691J495K228K72J039R50r68j517k114J495L149k933m369
$$ -7619 -2039 4626 2799 -892 603 2831 3103 4142 5092 4124 2607 493 1988 5137 2204 -2165
388b165K081K222l441j530K657J62k069j686J435K598k996l009M681K993o871
$$ -2165 -84 2138 -1303 -2833 -176 -14 -2083 -3769 -2334 264 -2732 -5741 -1060 1933 -4938
403d938k158P964K291n942l00N311O81l721K633O001k772o231K484N763j465l327
$$ -4938 -7096 868 3159 -2783 -3083 2228 2909 -812 1821 7822 5050 -1181 1303 7066 5601 2274
419B274j081r00p28k10J484P75n013m649M554M645k153k003r57j097K951K789
$$ 2274 1193 293 -435 -645 839 1614 -3399 -8048 -3494 1151 -1002 -3005 -3962 -5059 -2108 681
435F81j058J782j815o726N040J1851n368r667N642L345m116L997M888o670n244
$$ 681 -377 1405 -410 -7136 -2096 9755 4387 -5280 362 3707 -409 3588 8476 1806 -3438
450c438M346M406M30k239n457k280M568J283l159J60j14o588o85J0182J706q692
$$ -3438 908 5314 5744 3505 -1952 -4232 336 1619 -1540 -1380 -1494 -8082 -8767 1415 3121 -5571
466e571j669L858L311K638j047k078J497j065n77Q074Q63j0710PQ202l014j577
$$ -5571 -7240 -3382 -71 2567 1520 -558 939 -126 -703 7371 8234 -2476 -2469 5733 2719 1142
482A142M521m645m799M144J887MQ16p168l154R174J260p400M52J983l268J898
$$ 1142 5663 1018 -3781 363 2250 2254 3070 -4098 -7252 1922 3182 -4218 -3766 -1783 -5051 -3153
498c153L367k508l16M43j371M006L958l777j451L597L26p81L263n97n219O34M412
$$ -3153 214 -2294 -2610 -2167 -3538 468 4426 649 -802 2795 3121 2340 5603 5006 -213 421 4833
515D833J81n220j316J677j16r14Nj146L1j134j286M216J825o448j169O966j083
$$ 4833 5014 -206 -1522 155 39 -875 -870 -2016 -1985 -3119 -4405 -189 1636 -4812 -5981 985 -98
532i8l511L533M88l361K040K416Q75J188m830k195J0011J899r749Q29O444l944
$$ -98 -3609 -76 412 -2949 -909 1507 2382 3570 -1260 -3455 6556 8455 -1294 -465 5979 2035
548B035k374M939j254m979m42O97J412Q35l392l656K342L017j570N81R84l175
$$ 2035 -339 4600 3346 -1633 -2075 -1378 34 869 -2523 -6179 -3837 -820 -2390 -1809 -825 -4000
564d000j218O611L053n648k393N263Q16k440K947J205l408j231J799K839J249
$$ -4000 -5218 1393 4446 -1202 -3595 1668 2484 44 2991 4196 788 -443 1356 4195 5444
579E444m646l251M635R22l623J931q2m883J463K883k284j38p24m790M162N401
$$ 5444 798 -2453 2182 3104 -519 1412 1330 -3553 -2090 793 -1491 -1629 -2353 -7143 -2981 2420
595B420n611k432O067j302k874N699J959l378j112Q99L607K559m266l567M101
$$ 2420 -3191 -5623 444 -858 -3732 1967 3926 548 -564 335 3942 6501 2235 -1332 2769
610B769J102k376Q21k93l770L46K559k88j578j371j261J564R05q29L53l47k787
$$ 2769 3871 1495 2316 2023 -1747 -1401 1158 870 -708 -2079 -3340 -1776 -871 -1700 -1347 -1694 -4481
627d481L06N395J020o020j073N262J369j192J708j335j961M298P90k098L001j467
$$ -4481 -4175 1220 2240 -3780 -4853 409 1778 586 2294 959 -1002 3296 4086 1988 4989 3522
643C522o432M051O457o721l102M604n145k237Q669j425q756J815K569q25M065
$$ 3522 -2910 1141 7598 877 -2225 2379 -2766 -5003 3666 2241 -6515 -4700 -2131 -2956 1109
658A109o92o789K996N085l662J528M186m569l087N307K391j111j95k679j171M256
$$ 1109 417 -6372 -3376 1709 -1953 -425 3761 -808 -3895 1412 3803 2692 2497 -182 -1353 2903
674B903J946k154q21j033k930L428M242m644n167L371R79l695K628J992n534j328
$$ 2903 4849 2695 1874 841 -2089 1339 5581 937 -4230 -859 120 -3575 -947 1045 -4489 -5817
690e817M135k1M26K009m195j359O610J013k938K047q2l162L732L212l638j768
$$ -5817 -1682 -1703 -1277 732 -3463 -4822 1788 2801 -137 1910 1828 -1334 2398 5610 1972 204
706B04J684m96N18O12k176K42j34j537P08J426k219r07K74p96J534N41l354M81
$$ 204 1888 1392 1910 2522 346 588 454 -1083 -375 1051 -1168 -2075 -1801 -2597 -1063 -522 -3876 -3395
724c395L721k096j535L550p09j741L724J129l580J007L392j576K36J694k079j359
$$ -3395 326 -1770 -3305 245 -464 -2205 1519 2648 -932 75 3467 1891 2127 3821 1742 383
740C83K626m07j841J402j759m031K938L834m445k550K957k413q39N723o56n953
$$ 383 3009 2602 761 2163 404 -3627 -689 3145 -1300 -3850 -893 -3306 -4145 1578 922 -5031
756e031J560K510l26K744P2n430J736M648k123J138L900n570l779P420L005m435
$$ -5031 -3471 -961 -1287 1457 1529 -3901 -2165 2483 360 1498 5398 -172 -3951 3469 6474 2039
772B039j24j221k776L870L181m284j338j42l871K469O642m132p093L160K107j824
$$ 2039 1915 694 -2082 1788 4969 685 -653 -795 -4666 -2197 4445 313 -6780 -3620 -1513 -3337
788c337L929J745o455q62M993J461R3K270m932l341O779L737m225r1M92m340J939
$$ -3337 592 2337 -4118 -4980 13 1474 1567 3837 -1095 -4436 2343 6080 1855 1764 2256 -2084 -145
805a45O149k153m938K29K78p6K888n74l885p33K85N22K793l0m850n66L318J169
$$ -145 6004 3851 -1087 -858 -580 -656 2232 1658 -2227 -2960 -2675 -2153 640 610 -4240 -4806 -1488 -319
823c19m25N86p69j045J113K277J761m54k636k45K945P17j595k33L81k132L10J562
$$ -319 -744 -158 -927 -1972 -859 1418 3179 2725 89 -156 2789 3506 1911 1678 2059 -73 237 1799
841A799n93j708k17l64Q3M94r12k29N12q24j077J938L45j097J101O01j260O57
$$ 1799 1206 -502 -719 -1083 -1000 -506 -1418 -1647 -1135 -1959 -3036 -1098 -753 -1850 -749 -148 -1408 -751
859g51J091O16L61K32j268L2K642O25j581m28M1j310P22K026q87l130j370J340
$$ -751 340 956 1317 1549 281 313 2955 3580 1999 1571 1612 302 1024 3050 2163 -967 -2337 -997
877i97J099J12q97j867r23L45K113K061j203l776J91L302J278M88j47k206j044
$$ -997 102 214 -683 -2550 -3473 -3128 -1015 1046 -157 -3933 -3742 -440 838 1326 1179 -1027 -2071
894b071L252K526n93q67k473j001L046L584k012l725k08l13J062K453J30m251
$$ -2071 1181 3707 3114 2247 -226 -1227 1819 5403 3391 -334 -542 -855 207 2660 2790 -1461
910a461l506K038L566j37j051j868k762J210N130R79l251j112k68O17M043K492
$$ -1461 -4967 -2929 637 500 -551 -2419 -5181 -3971 1159 2138 -1113 -2225 -2493 -1876 2167 4659
926D659l764k064J011J413J585K070k501m123N81L484J169j268k413j630j61J788
$$ 4659 895 -1169 -158 1255 2840 4910 2409 -1714 -1133 2351 3520 2252 -161 -1791 -1952 -164
942a64J468p82k178j277j77J730K547j644k656J005L87K99L202q8l449M22K908
$$ -164 1304 522 -1656 -2933 -3110 -1380 1167 -477 -3133 -2128 -1741 -1442 1760 1672 -1777 -1355 1553
959A553K6P85M31k456l60K499m10m11Q28j758j773J694M26j115pn65j390L81J003
$$ 1553 1579 2364 2795 339 -21 2478 2068 1657 2485 727 -1046 648 1074 -41 -48 -613 -2003 -1622 -619
978f19o94o22P22p36l31P82J011l06P30L87j280l7K891N04k097J197J69j900K187
$$ -619 -1313 -1935 -1213 -1949 -2280 -1498 -487 -793 -63 324 -956 -993 1898 2402 305 1502 1671 -229 1958
997A958K231l105o06J065k122M61L505k336m010J917M01j524K475J112n196r81
$$ 1958 4189 1084 478 1543 -579 -118 3387 1051 -2959 -1042 -641 -2165 310 1422 -3774 -4755
1013d755L515J491n90k66j031j101J719L109L38j731j333p1J165L069J441m295
$$ -4755 -1240 251 -339 -605 -1636 -2737 -1018 2091 2429 698 -635 -706 459 3528 4969 674
1029F74j798J568R48J256J020l682k713K166J356k23Q12k820l451J775L436j6
$$ 674 -1124 444 1392 2648 3668 -14 -2727 -561 795 572 1384 -1436 -4887 -3112 324 308
1045C08o23j958k363J974L754M84j584j231r74J829L384M99k402j663N45J247
$$ 308 -315 -2273 -4636 -2662 1092 1576 -8 -1239 -2213 -384 3000 3499 1097 -566 -21 1226
1061A226J609R97k034l445J072K417j42k58m40l850o60M243M86k617m62r82m18
$$ 1226 2835 3832 1798 -1647 -575 1842 1700 1442 1002 -2848 -3508 735 1221 -1396 -1858 -2840 -3258
1078c258L219M09k619R58N02j850K279L357j951k470J784N44K96J786n86k595
$$ -3258 -39 370 -2249 -1291 -789 -2639 -360 2997 1046 -1424 360 904 1200 2986 2400 -195
1094a95M34J541L78q42m64j002j71N04j41j174O43L79j796p00J961o9j351R56
$$ -195 239 1780 2158 1316 852 -150 -321 183 42 -1132 -489 -110 -1906 -2606 -645 -714 -2065 -1109
1112a109K26r49J285N78r36J107J188j291l21J391L73R53p81j789J064J799j336
$$ -1109 -883 -1832 -547 31 -905 202 1390 99 -222 1169 1542 2495 1714 -75 989 2788 1452
1129A452j84N66k791o17L128j72k110j70n87r65J501J591k257o80J92k38J865
$$ 1452 1268 1834 -957 -1574 1554 1382 -728 -898 -1485 -2450 -949 642 -1615 -2295 -2103 -2341 -476
1146d76K041j387k618K92K648J481J02j053j239o71K543J570q67j013j134r22
$$ -476 1565 178 -2440 -2148 500 1981 2083 1030 -209 -880 1663 3233 2366 1353 219 -703
1162g03J798J640p19k153j518o25K286J817k056k290l67K68K128J911k166k265
$$ -703 1095 2735 2016 -137 -1655 -2280 6 1823 -233 -2523 -2890 -2622 -494 1417 -749 -3014
1178c014R68R92J016K186j347k439N92K075Q71Q25n16k606k50K374J292o02k024
$$ -3014 -2046 -1054 -38 2148 801 -1638 -1046 1029 1900 2725 2209 -397 -647 1727 3019 2417 393
1195C93j587O59J850J38j195j188r54m6J135J308m15k542o16J604P88Q70l1j814
$$ 393 -1194 -535 1315 1453 258 -930 -1884 -1930 -795 513 98 -2444 -3060 -1456 -668 202 171 -1643
1213a643o48K364J595m84m95l96j9J532M71o96P3m93j125J170N65r02n41r53j68
$$ -1643 -2291 73 1668 1184 689 293 274 1806 2277 1581 1654 1161 36 1206 1771 869 328 -625 -793
1232g93R51k37j197k06P44j004L59P21q46m36J652m15k62L32N01L33N46r7m44
$$ -793 158 -79 -1276 -1482 -738 -1742 -1383 -662 -1508 -1944 -292 -707 -969 -637 -136 197 743 646 202
1251B02Q49K51j25O92J10j232n46M67J274n37j295j212N51Q16l51p95K1r25q41
$$ 202 1051 1302 1177 1869 1979 747 201 668 1942 1405 110 -1102 -551 265 -86 -881 -860 -1785 -2626
1270b626J403J812j270j690R78K41M21J923l54k441J056J418K6J108L67k875l32
$$ -2626 -1223 589 -681 -2371 -1393 -1152 -731 1192 838 -1603 -547 871 897 2005 2372 -503 -835
1287h35K816R03j606l59j131p81J818J064j344j538n56m20J627J163j527j586
$$ -835 1981 2884 1278 919 -212 -993 825 1889 545 -993 -1549 -1969 -342 821 -706 -2292
1303b292J59k5J337J736j382k212R15J793O49M57o0j766J42K007N78K48m87k085
$$ -2292 -2133 -2158 -821 915 -467 -2679 -1764 29 678 1135 1075 -691 -549 1458 2036 2284 1797 -288
1321b88k12K373P96k143l70m96n07P13J359j514j123M0k93Q38J370j740j309J202
$$ -288 -500 1873 2669 526 156 -340 -847 -134 1225 -289 -1412 -1372 -1665 -827 543 -1197 -2506 -1304
1339a304O12N29J48J34j362P05J595J41k73K26k42o68J609J28j069k83l99L67
$$ -1304 -692 -163 -15 119 -1243 -538 1057 1198 925 1151 909 241 1850 1978 909 626 227 594
1357E94M99n28j171J83P1l48K52m18p18K89M71o65M76P33j567K03K043K38j595
$$ 594 1093 565 -606 -423 -352 -700 -448 -866 -1584 -1295 -824 -1489 -1013 -280 -1847 -1644 399 637 -958
1376i58J083K24p15J652N27j564O5Q69l74M67R14j481j605J563J058j340p14K22
$$ -958 125 349 -366 1286 1813 249 314 1183 809 1276 2190 709 -896 667 1725 385 -329 -107
1394a07j003K0J182q4j088q89pJ063O73l27j059K71L89P40J405k9j682K47J354
$$ -107 -1110 -1090 92 8 -1080 -1969 -1976 -913 -240 -567 -1626 -1355 -966 -226 1179 1150 -532 -285 1069
1413A069L30N78j53j981M0K014m56k34M14j969j131J993P10j541n27k39j323J283
$$ 1069 1399 1977 1824 -157 -117 1897 1441 1207 1621 -348 -1479 514 1224 -317 -844 -1083 -2406 -1123
1431a123J769j357j246L60J2J283P91j110n03M75O87P47Q05m57j062Q6Q27J262
$$ -1123 646 -711 -1957 -1597 -1585 -302 489 -621 -1124 -649 38 785 1590 1133 71 157 984 2246
1449B246l37j668M7M72M24k28j36r36p14j37J012j27p79p77K13M71K83j95m70
$$ 2246 1909 241 288 760 1184 956 820 -116 -830 -967 45 -82 -861 -1638 -1425 -954 -671 -866 -1336
1468a336o6M94L89M08Q91r46j083K038J081j390j35Q29p06N4J580o29j054m31
$$ -1336 -1402 -908 -519 -111 780 -166 -1249 789 1870 480 345 1174 468 522 2102 1473 419 -12
1486a2N95K81pp69q93j57L08R84q47q04K15p42J69K241j73k734Q19J949n28M7
$$ -12 583 864 857 88 -805 -962 -654 330 -517 -1321 -1106 -1848 -1679 562 389 -2345 -1526 423 -105 -58
1506e8J263j194p42J386J207n82k05p99m56Q67J560j020j162m47K24M15M41o3
$$ -58 1205 11 -731 655 1862 1280 1075 276 -180 687 2247 1227 65 -382 -158 257 698 635
1524F35j746r33J107J055k25n69q10m22Q62J115j87R7n35r25J706J698r95r36
$$ 635 -1111 -2044 -937 118 -107 -676 -1486 -1908 -1046 69 -118 -21 -556 -1481 225 1923 928 -8
1542hP31n59N94J768j004j192K60j47j69J377n88k658R72J347j634M0J786k270
$$ -8 723 164 758 2526 1522 330 590 443 274 1651 1063 -1595 -623 724 -910 -870 916 -1354
1560a354j388K364R53j841j54R00r30P81J422q26j360K321r2j122J799M99k684
$$ -1354 -2742 -378 575 -1266 -1420 -520 -1450 -669 753 -73 -1433 888 796 -326 1473 1972 -712
1577g12J031K660k195j192K457q36k263J904J012k938J28J415j265K10O36j816
$$ -712 319 2979 784 -408 2049 1213 -1050 854 1866 -1072 -944 471 -794 -584 52 -1764
1593a764l57K205n46j014J086M2j103Q91J679m31j369O29O51j12R92j63j385M4
$$ -1764 -2121 84 -462 -1476 -390 -348 -1451 -560 1119 688 -681 -52 599 487 1479 1316 -69 -25
1611b5J156j69O56q2k331p6K004K7j726P41j021j252J410J513j864o87N95j080
$$ -25 1131 962 1618 1536 -795 -871 1133 1160 -566 175 -846 -2098 -688 825 -1039 -1726 -1131 -2211
1629b211J638J990j643j806J727O87j026K491L70l337k5K998O08k025O07j31j936
$$ -2211 -573 1417 -226 -2032 -305 382 -644 1847 2217 -1120 -1145 1853 2461 436 1043 912 -1024
1646a024J457K017j826r90O61j576q4L509j314m018J693J888j669O53J513k533
$$ -1024 433 2450 624 -366 295 -1281 -1365 2144 830 -3188 -1495 393 -1276 -623 890 -1643
1662a643j346L181L95j137Q65j10j597J668J688j150r8L33j196M83K223r31k106
$$ -1643 -2989 192 587 -550 315 205 -1392 276 1964 814 716 1049 -147 336 2559 1628 -478
1679d78M62O86q57M52M83j414r75J303k27n00P73o03j020J182O76j114P52R65
$$ -478 -16 670 -187 265 748 -666 -1641 -338 -565 -1065 -292 -895 -1915 -733 -57 -1171 -419 546
1697E46j955P52K117j099j190J506L18p01J004j35j116J164M05j781O48R06j839
$$ 546 -1409 -657 1460 361 -829 677 995 294 1298 1163 47 1211 1616 -165 483 1389 -450
1714d50j12J976j067k035J105R79j555O7J011j290n73J816Q3o85L72O3j029K229
$$ -450 -562 1414 347 -1688 -583 396 -1159 -1092 -81 -1371 -1944 -128 -45 -730 -358 -295 -1324 905
1732I05J027k336n98K711j202o19K049q6k386L75J389k5k24l53j225k09J115L7
$$ 905 1932 -404 -1002 1709 507 -112 1937 1851 -535 -160 1229 1204 980 627 -598 -807 308 345
1750C45n50l03r68l26J434Q87p96j411o5P36J013L67k01n80q32J203J235O25j053
$$ 345 -205 -508 -1476 -1802 -368 519 -277 -1688 -1753 -1017 -4 363 162 -418 -1250 -47 1188 1813 760
1769G60r30N8J076N47k75o6j337p69J644J420j886j131J20K5M20Q41n13j321j53
$$ 760 -170 -112 964 1511 1236 1170 -167 -936 708 2128 242 -889 -769 -744 -324 517 4 -1317 -1470
1788a470J14N29J320j78j930n6J817M04n19O27m85j047J385J666q34j057P1j54
$$ -1470 -1356 -827 493 315 -1615 -1671 146 550 31 658 173 -874 511 2177 1343 286 357 203
1806B03L66J129p29j087L29m27k33Q44l8j482l05J084J93p97M80l13m16J13J053
$$ 203 569 1698 969 -118 211 -216 -449 395 357 -1125 -1430 -346 -153 -950 -470 -783 -1199 -1086 -33
1825c3j99J12p9m62Q00P79l29l87N72pp80P54N87n61l48J56j45k7n19K0J58J78
$$ -33 -232 -120 -199 -661 139 918 589 202 774 767 -13 741 1328 767 419 575 430 403 -116 -96 62 240
1847B40j175J04P19n54n26P73k15j203Q75Q97j36l65K25l32O36Q29K9m06Q6Ok96
$$ 240 -935 -831 -112 -666 -1192 -419 -634 -1837 -962 -65 -201 -566 -341 -673 -37 792 821 415 501 507 211
1868B11R74O17j230j033Q00M73k02K20m77j477K18Q12O34k33j425o92M91J323
$$ 211 1185 1802 572 -461 339 812 610 830 353 -1124 -906 -94 540 307 -1118 -1810 -1319 4
1886Dl8m64m88k80P58L87R57l40j267k84J858P79l63p98j43n03N47J636j01j811
$$ 4 -34 -498 -986 -1266 -508 -121 836 496 -771 -1055 803 1582 1219 421 278 -225 322 1958 1857 46
1906D6n94J08J212J50n41j333R8j26M17P15k80j219p46J235J172J14q94m20J22
$$ 46 -548 -440 772 922 381 -952 -854 -980 -563 152 -128 -1347 -2093 -858 314 428 -466 -886 -764
1925g64R23L96P43n51r37l87J495P41k82j317J02J23J3P20K75j096r69K76L67
$$ -764 159 555 1298 747 -190 -577 918 1659 1377 60 162 285 298 1018 1293 197 -772 -496 -129
1944a29N80n95r78j62N42Q6j80N94j51j057Q76J230p29l05L18L69Q1M96l16K6
$$ -129 451 -144 -1122 -1284 -742 -656 -836 -242 -393 -1450 -574 656 -73 -378 -60 309 390 886 570 596
1964E96K22k15P9O76m98q62L20M78p66n92M43L05o50k68L04p7o04M90J28j45l00
$$ 596 818 603 682 1358 860 -2 318 796 30 -562 -119 186 -464 -732 -428 -505 -1109 -619 -491 -636 -936
1985i36k00O69N39k4n16M21j18L05M94J95N9p02j17P19Q62m33j169R4NQ2J22K81
$$ -936 -1136 -467 72 48 -468 -47 -165 140 634 829 888 186 69 788 1650 1217 48 142 147 229 351 632
2007F32r03j143M74J060L04r23o40J34K56J55R47l34j246k8J118Q65J18o19r30
$$ 632 -271 -1414 -940 120 424 -499 -1139 -1005 -749 -594 353 19 -1227 -1255 -137 728 846 227 -703
2026g03N99J201k11J22M80j564p55J935R28j401r72K54l64M20M60m53p62n20J66
$$ -703 -104 1097 886 1008 1488 -76 -831 1104 2032 631 -341 -87 -451 -31 429 -24 -786 -1306 -1140
2045a140R89O80p48j444M48J093L19O6pp01l82J000J001j25p88n73M02P73J92
$$ -1140 -151 529 -219 -1663 -1215 -122 197 263 256 -445 -827 173 1174 1049 261 -312 90 863 1055
2064A055l84k14k01m30N21R25q05j169J95N6J86J68l10l92k19O4J56O99k46n03
$$ 1055 671 457 256 -174 347 1272 467 -702 -507 -451 -265 -97 -407 -799 -1018 -954 -798 -99 -345 -848
2084h48K77R82l59l59M10K61k47K23Q71k6o63j31K42J63lm02j84%k01j47l2M85
$$ -848 -571 411 52 -307 103 364 117 340 1211 1185 522 391 633 796 793 391 207 207 6 -141 -173 312
2106C12r23n49P89K62j045L77M16J00m22j25L16K24Q0P6P28m17o24O60O27J06
$$ 312 -611 -1160 -371 -109 -1154 -777 -361 -261 -683 -808 -492 -268 -188 -112 616 199 -425 235 862 968
2126I68l70k69o8O01J68o99r0r6o94K83J044m56j250j11P23m2j99K30l42n54L42
$$ 968 598 329 261 862 1030 331 241 145 -549 -266 778 322 -928 -1039 -316 -358 -557 -327 -669 -1223 -881
2147h81Q71L62l83q09K31R80L41p7n94N3l2K60J198l89r19o62O74N03J15m38p09
$$ -881 -10 352 -31 -840 -609 371 712 635 41 94 62 322 1520 1131 212 -450 224 727 842 404 -305
2168c05j75l2K96O57l89j397KR88L83j6l38l81k50P02O66k34J86p37l52R73J237
$$ -305 -480 -512 -216 441 52 -1345 -1343 -355 28 12 -326 -707 -957 -255 411 177 363 -374 -726 247 1484
2189A484j068m23J09K83J39O38j9r21n67M93O19n01l86o74r4P17Q8k20K26n50
$$ 1484 416 -7 102 385 524 1162 1143 222 -345 148 767 266 -120 -794 -888 -171 -83 -303 -77 -627
2209f27q10Q49R75n89p13P05K24j23K94M58m70j50O10J04J75k37l91J20M5L31
$$ -627 -1437 -588 387 -202 -915 -210 14 -109 185 643 173 23 633 737 912 675 284 404 449 780
2229G80l85n11K60n44O4P64n33q68O2O33p3n11J33L11j71J06M29j52j71J52J33
$$ 780 395 -116 144 -400 -336 428 -105 -973 -911 -278 -351 -862 -729 -418 -589 -483 -54 -206 -377 -225 -92
2250i2M57L08p34N2R85k22m46L95l53k85j2O72j85l48m79j97M68K49p51j27K53
$$ -92 365 673 -61 -9 976 754 308 703 350 65 53 725 540 192 -287 -484 -16 233 -518 -645 -392
2271c92m17k53Q33M72j233k04J044J08j4J12l46j78J141m2j38L88o88m10R06Q23
$$ -392 -809 -1062 -229 243 -990 -1194 -150 -42 -56 56 -290 -468 673 631 493 881 193 -217 689 1512
2291A512j088r02P54L3l41N85k51r38k85P90L51r9o26o12J62O41Rj03K92m36m04
$$ 1512 424 -478 276 309 -32 553 302 -636 -921 -131 220 121 -505 -1117 -955 -314 -305 -408 -116 -552 -956
2312i56R61R07l30q36K7O79K25m11Q65r78m7J73K94L05j77j206n0M70L97m88n02
$$ -956 5 912 582 -254 -227 452 677 266 1131 153 106 279 573 878 701 -505 -555 -85 312 -176 -678
2333f78K83m31R0Q39J47j169j01M82O93J48k40m80L20K6N30P4J4m60q5R73k7l73
$$ -678 -395 -826 -736 103 250 -919 -1020 -538 155 303 63 -417 -97 -71 459 533 547 87 2 975 948 575
2355E75l81R7Rj38N91j79r85j18N8R5L00r4j007M42O31l80K50J06m67m81J123
$$ 575 194 291 300 162 753 574 -411 -529 -471 -376 -76 -170 -1177 -735 -104 -484 -234 -128 -595 -1076 47
2376D7M41p47M2M38q9N3O12m33l13N20l88M28J56k91p46K18P20o91l48L82k61
$$ 47 488 -259 -217 221 132 185 797 364 51 571 183 611 767 476 -270 -52 668 -23 -371 11 -250
2397b50k64J16K86m52k14K68j74N82j62m58J80N92Rj68K93K20m28M65L56N5n38
$$ -250 -514 -398 -112 -564 -778 -510 -684 -102 -264 -722 -542 50 59 -109 184 404 -24 441 797 852 314
2418C14j79M96j49J52m65K56k29l26L20j7m28k42m6P7L99k74k95k18M23l8K74
$$ 314 135 631 482 634 169 425 196 -130 190 173 -255 -497 -543 -466 -67 -341 -636 -854 -431 -469 -195
2439a95M10o27j17O32L77k4m20j36K76K81L09p6k48l01l85N49N97m12q00Q6m3
$$ -195 215 -412 -529 103 480 456 36 -100 176 457 766 690 442 141 -244 305 902 490 -310 -224 -267
2460b67L71m6J6p31k29o3P81M01o85o86O0J390j81K70k40m03j78N81Q47n09l56
$$ -267 104 58 74 -657 -886 -949 -168 233 -452 -1138 -1078 312 131 401 161 -242 -420 161 1008 499 143
2481A43j97L89N91j06l12m00j40J67j53N45l65p33l91P30K28j50k73N1l62J56
$$ 143 -54 335 926 820 508 108 -32 135 -18 527 162 -571 -962 -232 -4 -154 -427 -376 -738 -582
2501e82O61J93p42m92P21M79K23M0l75n7K22J04N75m05q0m92L33J65j35l01m9
$$ -582 79 272 -470 -962 -241 238 461 501 126 69 291 395 970 565 485 -7 326 491 356 55 6
2522FL0k32K85J3j38m90J67r0L29n73j70M24m1J61q7L08L5RK17P05j77q47O61
$$ 6 36 -196 89 102 -36 -526 -359 -449 -120 -693 -863 -439 -480 -319 -406 -98 -63 -54 163 868 691 -156 505
2545E05J57j92K25k17p5K0J3m6k15o0l52K49M47n81n63K38q8M56k26K96m36k7
$$ 505 662 470 695 478 403 423 436 390 175 115 -237 12 459 -122 -685 -447 -535 -79 -305 -9 -445 -472
2567d72j06K16O64n36K45k16L99J40j51J25J98n46L98M54l07m56l1O0J53k3R0
$$ -472 -578 -362 302 -234 11 -205 194 334 183 308 506 -40 358 812 505 49 18 78 231 208 298
2588B98n83j37J32J77P2o1n80l09N56O01n23J56kl40M21N08J82p02P8j10P51L69
$$ 298 -285 -422 -290 -113 -41 -102 -682 -991 -435 166 -357 -201 -203 -543 -122 386 568 -134 -56 -166 585 954
2610I54l09n67r2M73j37L78k68q26q5L46N23l63l22k80k38N91M03k37m21k75J88
$$ 954 645 78 -14 459 322 700 432 -394 -479 -133 390 27 -295 -575 -813 -222 181 -56 -477 -752 -564
2631e64M26M02k70m78J36K78j1N53j31o1k51J51M07k0N8n20k02K51j39o8n2k19
$$ -564 -138 264 -6 -484 -348 -70 -81 472 341 280 29 180 587 567 625 105 -97 154 15 -53 -105 -324
2653c24l76K92P36l05n68QK67k54K91qm09K14L40o5j75O64k16j53L73M39p10L61
$$ -324 -700 -408 328 23 -545 -537 -270 -524 -233 -241 -650 -436 -96 -161 -336 328 112 -41 332 771 61 422
2675D22K19n50M52j3j88m53M16L5j54j0l62o6L62j17l57O9J92k48rL88j83m48
$$ 422 641 91 543 530 342 -111 305 340 186 176 -186 -252 110 -7 -364 -295 -103 -351 -360 28 -155 -603
2697f03l9O63OJ04K45k79r9N88j12k3k25J3m85J053o7n17k53J29p6J91K39n58
$$ -603 -642 21 27 131 376 97 -2 586 474 451 226 239 -246 807 740 223 -30 99 23 214 453 -105
2719a05k87j70J28J6L48r5o74L68L49O2P3l7n68Q6P66J81Qm61j07K56M79n0k89
$$ -105 -392 -562 -434 -418 -70 -165 -839 -471 -122 -60 13 -24 -592 -506 260 441 449 -12 -119 137 616 566 277
2742B77j33L7k94P89j28n48o25J86M66q7J55k09p27M23K66J07j7m35m30M50M53
$$ 277 144 181 -113 676 548 0 -625 -439 27 -60 95 -114 -841 -418 -152 -45 -62 -497 -927 -477 -24
2763b4J75J29l81J2j51O12O02p28n0l02J40M24K00l55l31nK7K30K00m98n99L19
$$ -24 151 280 -101 -89 -240 372 974 246 196 -106 34 458 658 303 -28 -33 -6 224 424 -74 -673 -354
2785c54J94O6K18k50n53r6K20N44q8J0m95M04L79L51m98p1L13j91J01L86l15P6
$$ -354 -160 -94 124 -126 -679 -775 -555 -11 -99 -89 -584 -180 199 550 52 -19 294 103 204 590 275 351
2807C51k07K80J14m07J53n50PK97j7j26j0l22K62j71N7q5m0M86n35J63L40k32
$$ 351 144 424 538 131 284 -266 -259 38 21 -105 -115 -437 -175 -346 -289 -374 -414 72 -463 -300 40 -192
2829a92K08L22k88O4J87j73J79L62j63l65j60L43n1K27j98m72J49J27K25p7o79
$$ -192 16 338 50 114 301 128 307 669 506 141 -19 324 273 500 302 -170 -21 106 331 254 -425
2850d25K4q9N14j67L06o90j94K17K71L76j25M6m15R9O86J22m53k30PN13J89K64
$$ -425 -401 -490 24 -143 163 -527 -721 -504 -233 143 18 64 -351 -252 434 556 103 -127 -120 393 582 846
2872H46l91n23j38L57J75J31p56k50L80r8R9K80l04n50k3L96O22j75l53k53m4
$$ 846 455 -68 -206 151 326 457 -299 -549 -169 -267 -168 112 -192 -742 -765 -369 253 78 -275 -528 -572
2893e72R01Q4j96k07j6j84Q34l5j96k33l82M11J85n6r6l43k31K56K31Nk82o87
$$ -572 329 413 217 10 -6 -190 644 609 413 180 -202 209 394 338 242 -101 -332 -76 155 160 -122 -809
2915h09M62P6K12k17o1k12K16L80J12m81K22j37M84J05J43j21k67K1J38N7j8j
$$ -809 -347 -271 -59 -276 -337 -549 -333 47 159 -322 -100 -237 247 352 495 374 107 128 266 323 305 304
2937C04O2j02r5L12n93K6K39l80j27K12Q4j51j73J32k6R2n1K8k11K86J33q9K16
$$ 304 366 264 169 481 -112 -86 153 -227 -354 -142 -58 -209 -382 -250 -276 -184 -235 -207 -418 -132 1 -88 128
2960A28J44j59l03M16k74q3P28j59k05k26J42O5l3J57l15l49R6O2K66l13K4k79
$$ 128 272 113 -190 226 -48 -131 597 438 233 7 149 214 181 338 23 -326 -230 -168 98 -215 -191 -470
2982d70o2K04K85J40p27O2L78L00m5L44m95J27J49L06%j31l80J78N4L14L9m27
$$ -470 -532 -328 -43 97 -630 -568 -190 110 65 409 -86 41 190 496 496 365 -15 163 217 531 570 143
3004A43l95K15J38K63L4n86k58m6L73J15L8m15j99J34N72l3J46n98O6J50K52K65
$$ 143 -252 -37 101 364 398 -188 -446 -492 -119 -4 34 -381 -580 -446 126 93 239 -359 -293 -143 109 374
3026C74j78m28L45J08K35K47j69l79q8P7K04R8n52j75J07m1K37j44o8l70J63K09
$$ 374 196 -232 113 221 456 703 534 155 67 144 348 446 -106 -281 -174 -215 22 -122 -190 -560 -397 -188
3048a88K33j27m06j33K93M62m6J50k76j20K68M97l93O7Q8j44j0J00L56m01q8J47
$$ -188 45 -82 -488 -621 -328 134 88 238 -38 -158 110 607 214 281 369 225 215 315 671 270 182 329
3070C29j90r3r1j77K50m17N1K53k10k75L48j85L66k75p8l5M06J41k99K85oL7J70
$$ 329 139 46 -45 -222 28 -389 -338 -85 -295 -570 -222 -407 -41 -316 -394 -429 -23 118 -181 104 98 135 305
3093C05kj99J11J71N2m49r7K58n22M71q0K02m38N2k8j68M07j76m09L23j22j7M33
$$ 305 303 104 215 386 438 -11 -108 150 -372 99 19 221 -217 -165 -193 -361 46 -130 -539 -216 -338 -355 78
3116G8j50k20k1L3N38L8K05j80n63L07M61j77J46l57j44M14J35j98l23j77j55
$$ 78 -72 -292 -313 -280 258 296 501 321 -242 65 526 349 495 138 -6 408 543 345 22 -155 -310
3137c10R1K81N4m46q8P6J86m9J61p49J70O83j29J19K16n48j41M12L92o3l61K68
$$ -310 -219 62 116 -330 -418 -342 -156 -205 -44 -793 -623 60 -69 50 266 -282 -423 -11 381 318 -43 225
3159B25l65K49M22N9o32n2M58n14K70K23p01j85M67O0o9J02j69m78K39N00j36
$$ 225 -140 109 531 590 -42 -94 364 -150 120 343 -358 -543 -76 -16 -85 17 -152 -630 -391 109 -27
3180b7j71K38n57L04M32J4k38k2M3J42O8M14m12j94J12J55JK3l61K58l99N12k47
$$ -27 -198 40 -517 -213 219 233 -5 -27 16 158 226 640 228 34 146 301 302 325 -36 222 -177 335 88
3203H8j37J39l56J18J6o3l32L90Q9l40O62k26j46j16L61m0j39K09J47l13K88J90
$$ 88 -49 90 -266 -148 -132 -195 -527 -137 -48 -388 274 48 -98 -214 147 107 -32 177 324 11 299 489
3225D89m36L31O0j89k93L66K6m77R2j12k26L10Kl52PK53p0J5l09M75k65N54k01
$$ 489 53 384 444 255 -38 328 354 -123 -31 -143 -369 -59 -57 -409 -402 -149 -219 -204 -513 -38 -303 251 50
3248E0m61L40K52Q1l09J47k1l00L36P9j8n0Q2k41J50J60k29j26j8J19m4K80m35
$$ 50 -411 -71 181 262 -47 100 79 -221 115 194 176 126 208 -33 117 277 48 -78 -96 23 -21 259 -176
3271a76k96K30J49j32K18K52m84j51L46J24O7k4k90P2N00j5k97M81m36r5J05M44
$$ -176 -472 -242 -93 -225 -7 245 -239 -390 -44 80 147 123 -167 -95 405 390 93 574 138 43 148 592
3293E92m1p32R8J1J48M8J12n77l8J00N2J07M34o74l3L03J17K0K7j53J16J95L16
$$ 592 551 -181 -83 -72 76 124 236 -341 -379 -279 -227 -120 314 -360 -393 -90 27 47 74 -79 37 232 548
3316E48l44l38J03K41j50J61K94m35J58j5K42k19k08L6m14J29K7j77O7K0m19L57
$$ 548 204 -134 -31 210 60 221 515 80 238 223 465 246 38 74 -340 -211 -184 -361 -294 -274 -693 -336
3338c36L11N6l61K7K99l24M06M2k13n3K7j3K42Nk21j05K49K06J41j06k35j29L52
$$ -336 -25 31 -330 -303 -4 -328 78 120 -93 -146 -119 -132 110 115 -106 -211 38 244 385 279 44 -85 267
3361B67k14J34j77J05j99m6k06K53l11K03kj04P5J96j75K89j19K21J5k36J23J11
$$ 267 53 187 10 115 -84 -130 -336 -83 -394 -191 -193 -297 -222 -26 -201 88 -31 190 205 -31 92 203
3383B03M0K08l87m7J98J38j44j36k01LK00N4j96q7m7JK33k9o2j78j11K16J47N4
$$ 203 243 451 64 17 215 353 209 73 -128 -125 75 129 -67 -154 -201 -200 33 4 -58 -236 -347 -131 16 70
3407G0j55j59l4L49K84k06L9l66L22L51p2Kj84m41K94J97K8p8l23l50R5M34m1
$$ 70 -85 -244 -278 71 355 149 188 -178 144 495 423 425 241 -200 94 291 319 241 -82 -432 -337 97 56
3430E6k30j34o5K06K50j69j4l77k9N76M7q2m7J9j26L17K92j53l28l2K70k10O0
$$ 56 -174 -308 -373 -167 83 -86 -100 -477 -506 70 117 35 -12 7 -119 198 490 337 9 -23 247 37 97
3453I7J64l08m5J05J28k47L23l43on8L30j37K14p17Q6L05J02l8j39J8k8L75k21
$$ 97 261 -47 -92 13 141 -106 217 -126 -132 -190 140 3 217 -500 -414 -109 -7 -45 -184 -166 -194 181 -40
3476d0J66j21L76j52r3R1o1L1J04P3k80l3j84k1j35K07K5K64m02k16J66K2K23
$$ -40 126 5 381 229 136 227 166 197 301 374 94 61 -123 -144 -279 -72 -47 217 -185 -401 -235 -213 10
3499A0l3j49j14K93N2j59j7J38N6M2L61o31J61K56l69L67J43l47Q3Q7j38j54J60
$$ 10 -23 -172 -286 7 59 -100 -117 21 77 119 480 -151 10 266 -103 264 407 60 143 230 92 -62 98
3522I8o9p0j74L17k72l27K64q0J48J48r0j86J52n3o0K38J86k64N2K46J07l28K94
$$ 98 29 -41 -215 102 -170 -497 -233 -313 -165 -17 -107 -293 -141 -194 -254 -16 170 -94 -42 204 311 -17 277
3545B77n9l99N78J58m04j89M6j37L80J3m04jo9M2Q2L32q29L76k1N8J56O6l00O
$$ 277 218 -181 397 555 151 -38 8 -129 251 264 -140 -141 -210 -168 -86 246 -583 -207 -228 -170 -14 52 -248 -242
3569b42k6L75K4j03r0q5N59o4j2j31j85j63J72M00n4k67j63l4L9J32j57j20J55
$$ -242 -268 107 131 28 -62 -147 412 348 336 205 20 -143 29 429 375 108 -55 -89 -50 82 -75 -195 -40
3592d0l6p0K52k85m2J65k31J68J71r3k68P5K18j06J08J73o6rJ97P7pk11Q9l70
$$ -40 -76 -146 106 -179 -221 -56 -287 -119 52 -41 -309 -234 -16 -122 -14 159 93 84 281 358 351 140 229 -141
3616a41J65Q7p2J9j76J51J5q9Rk96J52K16j7J19l11O3j58J99J09L5l4j63K38j59
$$ -141 24 111 39 58 -118 33 48 -41 -32 -328 -176 40 23 142 -169 -106 -264 -65 44 79 45 -118 120 -39
3640c9OR7r2J13Q2j9J37k08k31K12K16k94k8j27J66j57L1k1r3J19J5J58r3%l06
$$ -39 -33 64 -28 85 167 148 285 77 -154 58 274 -20 -48 -175 -9 -166 -135 -156 -249 -130 -115 43 -50 -50 -356
3665c56J37K80j82L22k27o7K6L30J54m01J15j4j1K8K80l47K3K4j18O3j57K34k94
$$ -356 -219 61 -121 201 -26 -93 -67 263 417 16 131 117 106 134 414 67 90 114 -4 59 -98 136 -158
3688a58K2M3r5J7L7j63j21M72m4k05K43m6j18L12J81l96k2J70pJ05K1J00M4p83
$$ -158 -136 -93 -188 -171 -134 -297 -418 54 10 -195 48 2 -116 196 377 -19 -41 129 122 227 248 348 392 -391
3712c91M74j6O5K12l56l06L12rp2k27k4Q9R8J3R3R7j05N8j42M10k78j16N3J91
$$ -391 83 67 132 344 -12 -318 -6 -15 -87 -314 -338 -249 -151 -138 -45 52 -53 5 -137 273 -5 -121 -68 123
3736A23L80l03O6J5n87L80O1K42k16j0k36J48j12P3k16l5N7J56Q8j74k10j38N53
$$ 123 503 200 266 281 -306 74 135 377 161 151 -85 63 -49 24 -192 -227 -170 -14 74 -100 -310 -448 105
3759A05k83J77j57J14m17M74J65j90Q7J23j16j75L06k77J59J01r5K64p4Rj64k30
$$ 105 -178 -1 -158 -44 -461 13 178 -12 75 198 82 -93 213 -64 95 196 101 365 291 300 136 -94
3781i4K75l68L08k23L6j76K31j83M9K07j24j13J07K4P1k56M04l9j96J73k33J99
$$ -94 181 -187 121 -102 -66 -242 -11 -194 -145 62 -62 -175 -68 -44 27 -229 175 136 -60 113 -120 79
3803G9K1J87m5j42r2Q0p7J48o3nj49n7P5k98J98l46J55J64N9K11j49k3k35L08
$$ 79 100 287 242 100 8 88 11 159 96 91 -58 -115 -40 -338 -140 -486 -331 -167 -108 103 -46 -69 -304 4
3827Dnl6o1r2J96Q4j74K46j09K15K8j88K40l02N2j59r9J78L3j46k27K12k82K33
$$ 4 -1 -37 -98 -190 6 90 -84 162 53 268 296 108 348 46 98 -61 -160 18 51 -95 -322 -110 -392 -159
3851a59N8j84J14J85j73K41j70o6K59Q7o8j45M9r4jR2K05K31n35J43k5J09n3L05
$$ -159 -101 -285 -171 14 -159 82 -88 -154 105 192 124 -21 28 -66 -67 25 230 461 -74 69 44 153 100 405
3875D05o34J62K75k5n4L2j65p1K21j74l98J89k2K43q2r5K43k86J03J25jL58j48
$$ 405 -229 -67 208 183 129 161 -4 -75 146 -28 -426 -237 -259 -16 -98 -193 50 -236 -133 -8 -9 349 201
3898B01k96J23J79L2k1j86K3j43J30K8J36j93M7m9p1P5j54j07n8O9O1J89j00m3
$$ 201 -95 28 207 239 218 32 55 -88 42 70 206 13 60 11 -60 15 -139 -246 -304 -235 -174 15 -85 -128
3922a28j20J51MK58k63K21j06J00%j0J63k24K7J04q5R9n9k36J00Q1j33J63l36
$$ -128 -248 -97 -93 165 -98 123 17 117 117 107 270 46 73 177 92 191 132 -104 -4 77 -56 107 -229
3945b29J39j45L59j95k18K66k38L01j18k14K59N9J42k10QK09n0j13J57j25J15
$$ -229 -90 -235 124 -71 -289 -23 -261 40 -78 -292 -33 26 168 -42 -34 175 125 12 169 44 159
3966A59j75J11l6K81k8n33J59m6J79j13J90k12r1jK81k04k51K46O7k60L77k53
$$ 159 -16 95 59 340 312 -221 -62 -108 71 -42 148 -64 -155 -156 125 -79 -330 -84 -17 -277 100 -153
3988a53R0j40j2J68P6J66j54j12j39L20M1K40j89k19J11K79R6l80j94OJ10L6k69
$$ -153 -63 -203 -215 -47 29 195 41 -71 -210 110 151 391 202 -17 94 373 469 89 -105 -99 11 47 -222
4011b22J63k37o9L89j02R5k81K25k58J75L09j51J3l3q3L09R5r6k52q4J45K99k62
$$ -222 -59 -296 -365 24 -78 17 -264 -39 -297 -122 187 36 49 16 -67 242 337 241 -11 -95 50 349 87
4034H7Kn7k21J94K41k45P7j06J01k41M14l69j41J64k29K80p0Q5N5j63J50L1l7
$$ 87 89 32 -189 5 246 1 78 -28 73 -168 246 -123 -264 -100 -329 -49 -119 -34 21 -142 8 39 2
4057Bk5k2Q7O4M9p0J24n9q1q1M4K03j04l96L91l52K09k61L09l7k13N48k76p2J5
$$ 2 -23 -45 42 106 155 85 209 150 69 -12 32 235 131 -265 126 -226 -17 -278 31 -6 -219 329 53 -19 -4
4082dj57J77j67r3K25K31j58L00k02r1k9L8J58p6j36qr4J18J30J25j67j58o6j92
$$ -4 -161 16 -151 -244 -19 212 54 354 152 61 32 70 228 152 16 8 -86 32 162 287 120 -38 -104 -296
4106b96M91k62j38q5J2K35L9j64L0O5J31p1L21j53n7Pl7K34o3j79kM9Q4P2m7k49
$$ -296 195 -67 -205 -290 -278 -43 -4 -168 -138 -73 58 -13 308 155 98 105 68 302 239 60 58 107 191 263 216 -33
4132c3K9K10j63R3j50l7oM2K3NK7m18J64J25J24J01k00%k75K18J12J75J61l60
$$ -33 -4 206 43 136 -14 -51 -57 -15 8 13 40 -378 -214 -89 35 136 -64 -64 -339 -121 -9 166 327 -33
4156c3k7K0L15R3j75j67N3n0K01k70R1k7pJ59k30K94p81L96kP5l7N8k24K2L64
$$ -33 -60 -40 275 368 193 26 79 29 230 -40 51 24 17 176 -54 240 -541 -145 -147 -72 -109 -51 -275 -253 111
4181A11l17r2L72j90J84Q7j30J09j87K69k04L03l18o0L27l78K40j1j61j91O8K09
$$ 111 -206 -298 74 -116 68 155 25 134 -53 216 12 315 -3 -63 264 -114 126 115 -46 -237 -169 40
4203D0K09m19N6j86P9K72p0k64J39J70J4L1k72Q4L02N4j68J31j40j82L16r7J1
$$ 40 249 -170 -114 -300 -221 51 -19 -283 -144 26 40 71 -201 -117 185 239 71 202 62 -120 196 99 110
4226A10M7K16n85J91N4L16m42K5l9l0L11j90k1l78K09K3J23J16j74K25k19j20
$$ 110 157 373 -212 -21 33 349 -93 -68 -107 -137 174 -16 -37 -415 -206 -183 -60 56 -118 107 -112 -232
4248b32N57k33qN8k61J56K14k79J52l7O1P7j05J58l17j81K86J46j01k70K0j50
$$ -232 325 92 84 142 -119 37 251 -28 124 87 148 225 120 278 -39 -220 66 212 111 -159 -139 -289
4270b89Q5Q1J29k9k12j04L76o9R4k78N2Q5K02O3jo4k51K81L5n7N7j40k32L51L65
$$ -289 -204 -123 6 -23 -235 -339 37 -32 62 -216 -164 -79 123 186 185 121 -130 151 186 129 186 46 -186 165 530
4295E30l10k58P7l10L98j50l3J57l05m1m8L17r0k62K3M8M21l89J62R6r1K12j58
$$ 530 220 -38 39 -271 127 -23 -56 101 -204 -245 -293 24 -66 -328 -305 -257 164 -225 -63 33 -58 154 -4
4318dj36K49n0J44j86K09j4r5j78q4J21OJ2M9k98l8K50p8K63k57r5j30N15l05
$$ -4 -140 109 59 203 17 226 212 117 -61 -145 -24 -18 -6 43 -255 -293 -43 -121 142 -115 -210 -340 175 -130
4342a30j72O23m22J23o3r1K43l7K1k2l11o4L31J00Pj84M04j8l72r7K23j23k51
$$ -130 -302 321 -101 22 -41 -132 111 74 95 73 -238 -302 29 129 136 -48 356 338 -34 -131 92 -31 -282
4365b82M11l25P6JM5l12K23j0J27OJ02j1j3J7K0l4j95K74j3o0J11K1L3j00M8o8
$$ -282 129 -196 -120 -119 -74 -386 -163 -173 -46 -40 62 51 38 55 75 41 -154 120 107 47 158 179 212 112 160 92
4391I2J5k7k61J84K1r4q3p7K40L0r2J22j31n8J4J64j62L88l97l2QJ25J03Q8j18
$$ 92 107 80 -181 3 24 -70 -153 -230 10 40 -52 70 -61 -119 -105 59 -103 285 -112 -144 -136 -11 92 180 62
4416F2J6j60K72j47L20j09m99K00Q3K8j67J24k11J64j21L60m22J85M0l55J81R0
$$ 62 78 -82 190 43 363 254 -245 -45 38 66 -101 23 -188 -24 -145 215 -207 -22 18 -337 -156 -66
4438f6J70j2k92J72N3N8R5l89J30K70J54l94J10k7n3J10J41j96JJ30k57J20O6
$$ -66 104 92 -200 -28 25 83 178 -211 -81 189 343 -51 59 32 -21 89 230 34 35 165 -92 28 94
4461I4k55k1n0K1M04l93K14j37kJ46q9n7J44k88M29j00k9j9J4O9lL1R4j68K1L27
$$ 94 -161 -182 -232 -211 193 -200 14 -123 -125 21 -68 -125 19 -269 160 60 31 12 26 95 92 123 217 49 70 397
4487C97n79K67M5J9k05j15K02l6j98J79l25K36Q9J2p7j12K29N6j61L0P6k47J53
$$ 397 -182 85 130 149 -56 -171 31 -5 -203 -24 -349 -113 -24 -12 -89 -201 28 84 -77 -47 29 -218 -65
4510f5R9L33n87J36M4J92k02J39j04J15o4M3j7Q3k25oj29J73m7q3k4q0J34M6q8
$$ -65 34 367 -220 -84 -40 152 -50 89 -15 100 36 79 62 145 -80 -86 -215 -42 -89 -172 -196 -276 -142 -96 -184
4535a84M45k92n9K71l6P1k99K24k72K14O8L2j86J57n1o6m2j82R2J34Q7j13j36
$$ -184 261 -31 -90 181 145 216 -83 141 -131 83 151 183 -3 154 103 37 -5 -187 -95 39 126 13 -123
4558a23K46k00Q3J25K07k91l93N34k19j10K70o2l91K96k2r3L69j82k2K04k09K09
$$ -123 123 -77 6 131 338 47 -346 188 -31 -141 129 67 -324 -28 -50 -143 226 44 22 226 17 226
4580B26k22J55j42J23l28L80j68k35N58m79n6J63j70K12j56J69Kqm8J05j30k07
$$ 226 4 159 17 140 -188 192 24 -211 347 -132 -188 -25 -195 17 -139 30 32 24 -24 81 -49 -256
4602b56J09K37N4J20j85J91p5J81m83O9N4K36k97l3K11o9j82l6K47k82L07k51
$$ -256 -147 90 144 264 79 270 195 376 -107 -38 16 252 -45 -78 133 64 -118 -154 93 -189 118 -133
4624a33J68l10K36l09K61J8j12K92j01l16J73K80L5k82J35K71k59J27j00J37l58
$$ -133 35 -275 -39 -348 -87 -69 -181 111 10 -306 -133 147 182 -100 35 306 47 174 74 211 -147
4645a47J65M3J37l39J56J20l33O9L50j51N8j32k64L42K1l53J95o4J25k13K40O6
$$ -147 18 61 198 -141 15 135 -198 -129 221 70 128 -4 -268 74 95 -258 -63 -127 -2 -215 25 91
4667I1j53J82r9K3j81L61j27P2Q7j57L2l5K60k67J06Q1j08k17l6K64r3kj26j61
$$ 91 -62 120 21 44 -137 224 97 169 256 99 131 96 356 89 195 276 168 -49 -85 179 86 84 -42 -203
4691b03j60K77N1j32K4J61j70N6j8J51J27r6q8M5K23q5k79n7K50J39j0k13j2K67
$$ -203 -363 -86 -35 -167 -143 18 -152 -96 -114 37 164 68 -20 25 248 163 -116 -173 77 216 206 -7 -19 248
4715B48k05nLn8k0M7j92K00J2j53K9P6n5O6k7l47L20J84L6k45P3QNM35m76k3P7
$$ 248 43 38 41 -17 -37 10 -182 18 30 -123 -94 -18 -73 -7 -34 -381 -61 123 159 -86 -13 -5 0 435 -41 -64 13
4742A3J11k27L6L60l38n4P1L33l93k27M6J98j64P1q7J20l4L76p8M5j27p8j83J10
$$ 13 124 -103 -67 293 -45 -99 -28 305 -88 -315 -269 -71 -235 -164 -251 -131 -165 211 133 178 51 -27 -210 -100
4766a00n3J98J5P6J21m59L07p4L17k37j48Kj51L79k95O0j5j69K28K51k38k19J04
$$ -100 -153 45 60 136 257 -202 105 31 348 111 -37 -35 -186 193 -102 -42 -57 -226 2 253 15 -204 -100
4789a00K09j80L1J6j46K87k16K13J49k03j65L42k73j28J30J52o6J58j24J68j29
$$ -100 109 -71 -40 -24 -170 117 -99 114 263 60 -105 237 -36 -164 -34 118 52 210 86 254 125
4810A25j67j13Q0j3q6J26K8j9O0O9j40j28J42j74L29J0m37M17O5l21RJ34J71k79
$$ 125 -42 -155 -75 -88 -174 -48 -20 -39 21 90 -50 -178 -36 -210 119 129 -308 109 174 -147 -138 -4 167 -112
4834a12l3K79k20K36Oq1q7Q2j18k32J6L00K8J45k24j3m7j24K33j04m7r7K79m5
$$ -112 -145 134 -86 150 156 75 -12 70 -48 -280 -264 36 64 209 -15 -28 -75 -199 34 -70 -117 -214 65 20
4858B0j40r1R2n2m0K84k20Q2k03K34l4J96Q0l17O7M1Q2j29K25n64L10k81K11K13
$$ 20 -120 -211 -119 -171 -211 73 -147 -65 -268 -34 -68 128 208 -109 -42 -1 81 -48 177 -387 -77 -358 -147 66
4882F6Qk51j07K77j25L75l43J5J50p4J2L3j2q5J21Q0J21k30j44K71k85M94l43
$$ 66 74 -177 -284 -7 -132 243 -100 -85 65 -9 3 36 24 -61 60 140 261 31 -113 158 -127 367 24
4905B4O3l1K5K1k35J55p7jO4j74K33r7k41o8K42o1J53K4j67J54j42K05p3Q7J09
$$ 24 87 56 81 102 -133 22 -55 -56 8 -166 67 -30 -271 -339 -97 -158 -5 19 -148 6 -136 69 -4 83 192
4930A92j60K85l34M0rm1J6J51J76j86P2k3l72M98k88q5R9p9lq5N6P0l39M83j00
$$ 192 32 317 -17 23 14 -27 -11 140 316 130 202 179 -193 305 17 -68 31 -48 -51 -136 -80 -10 -349 134 34
4955C4l47L54k16L8NJ7K53k2m5j00M48l13j4J1M7P2o1J31k18l42Q0M30J4k12l74
$$ 34 -313 41 -175 -137 -132 -115 138 116 71 -29 419 106 92 103 150 222 161 292 74 -268 -188 242 256 44 -330
4980c30K35J85L0L3j27k12J52kl2K42m29J89J07O4j09K92k23J06j3j0o1Q9j22
$$ -330 -95 90 120 153 26 -186 -34 -36 -68 174 -255 -66 41 105 -4 288 65 171 158 148 87 176 54
5003E4j7k28K31K41j69j25n2L83m98J89J60R2o64O02q5j11j67o6K87P6j55R8k06
$$ 54 37 -191 40 281 112 -13 -65 318 -180 9 169 261 -403 199 114 3 -164 -230 57 133 -22 76 -130
5026a30J93j11K82l51K75j78n6L4N2J11j54J49r7Q8l20K64q9R5k85L68k67lJ29
$$ -130 63 -48 234 -117 158 -20 -76 -42 10 121 -33 116 19 107 -213 51 -38 57 -228 140 -127 -130 -1
5049aK7N9p7J80j56M4N6rjj85j87M19N0j69M92q33J71J22n2L68m28J80p9J28j66
$$ -1 26 85 8 188 32 76 132 123 122 -63 -250 169 219 50 542 -291 -120 2 -50 318 -110 70 -9 119 -47
5074d7p1K54k93J77J84n91M24p6K1j56M29j76P0j22o9m4L13j09j12J24k8q3k47
$$ -47 -118 136 -157 20 204 -387 37 -39 -18 -174 255 79 149 27 -42 -86 227 118 6 130 102 19 -228
5097b28K06k15J66J8p4MJ47j59o3KJ80J47J62m92QL59J90m86Q6J08k76M86j19
$$ -228 -22 -237 -71 -53 -127 -123 24 -135 -198 -196 -16 131 293 -199 -191 168 358 -128 -42 66 -210 276 157
5120A57j77o4N8o4K03q4M50l86k03Q2K3J58j30k27L3L59mj64k89L28q3R3p0J05
$$ 157 -20 -84 -26 -90 113 29 479 93 -110 -28 -5 153 23 -204 -171 188 184 20 -269 59 -24 69 -1 104
5144A04j77mr2k9J52j5R8j14J7j48N16qm45K10K04j56M4j70J09J12k75K51k58
$$ 104 -73 -77 -169 -198 -46 -61 37 -77 -60 -208 308 300 -145 65 269 113 157 -13 96 208 -67 184 -74
5167g4N9J70m56J29P5J28O9j92PRL14n20K1N6J94N4ok4j35J66j06M17j45j94P6
$$ -74 -15 155 -301 -172 -97 31 100 -92 -85 -76 238 -282 -261 -205 -11 43 37 13 -122 44 -62 355 210 16 92
5192I2j71J53M9j15J52k53L34k02K4n3Rk31M13k35k12J73K26k15J87j38p2k9L
$$ 92 -79 74 123 8 160 -93 241 39 63 10 19 -212 201 -34 -246 -73 153 -62 125 -13 -85 -114 -111
5215a11J22j16N5q7q3L30j4j84J81k69N8K23J35k86J50k73J59K78m24j30K41k33
$$ -111 11 -105 -50 -137 -220 110 96 -88 93 -176 -118 105 240 -46 104 -169 -10 268 -156 -286 -45 -278
5237b78K86k46L16k48J51l21K17O6J23l17M3K99l6r4KJ64k05L08l65K38j03L45
$$ -278 8 -238 78 -170 -19 -340 -123 -57 66 -251 -208 91 55 -39 -37 127 -78 230 -135 103 0 345
5259C45m64J44J52j48O2Nm14K91j68K93j40k55P2K38J35k10j50J71jj84J55K46
$$ 345 -119 25 177 29 91 96 -318 -27 -195 98 -42 -297 -225 13 148 -62 -212 -41 -42 -226 -71 175
5281A75o5p0K33l35L91k94Q3j77J60J69o9j08J3o8j00R3J12j13j12K2J13l16j18
$$ 175 110 40 273 -62 329 35 118 -59 101 270 201 93 106 38 -62 31 143 30 -82 -60 53 -263 -381
5304c81K11K45l37j02N08j48p1K2J22J8m1o4q9k1J15J18j22L87k7k00n8j82Q8
$$ -381 -170 75 -262 -364 144 -4 -75 -53 69 87 46 -18 -107 -128 -13 105 -17 370 343 143 85 -97 -9
5327inj99K10k73L84P6k74L12l33J3k0Q7J70j82J79J60m52L70q4q0j15O7j57K74
$$ -9 -14 -213 -3 -276 108 184 -90 222 -111 -98 -118 -31 139 -43 136 296 -156 214 130 50 -65 2 -155 119
5351A19k42J29K08m5K9p1n2k7j8l11J01J2J43P8jk55K17k20P6Q3j84J39k57J20
$$ 119 -123 6 214 169 198 127 75 48 30 -281 -180 -168 -25 53 52 -203 14 -206 -130 -47 -231 -92 -349 -229
5375b29L9L2L25j55o2K40j75K49m46J97J7nJ65j20J1j29l4K3n2Q3J8m8j09K05
$$ -229 -190 -158 167 12 -50 190 15 264 -182 15 32 27 192 72 83 -46 -80 -57 -109 -26 -8 -56 -165 40
5399D0J67k24j83J08m4K10k14J7j23M4P6J92O6k11j31P2M10oo2m26L54j51J15
$$ 40 207 -17 -200 -92 -136 74 -140 -123 -246 -202 -126 66 132 -79 -210 -138 272 266 204 -222 132 -19 96
5422I6p7N6j92j7K12j84K12k13p7L50l41pp4K86k15J31J00j66RL48l67P5L36k66
$$ 96 19 75 -117 -134 78 -106 106 -107 -184 166 -175 -182 -256 30 -185 -54 46 -120 -111 237 -130 -55 281 15
5446A5J01k8j32J03P9j35j01J34m2J09j80L32j15l07K86j07k61K43j01P6o3j73
$$ 15 116 88 -44 59 138 3 -98 36 -6 103 -77 255 140 -167 119 12 -249 -6 -107 -31 -94 -267
5468b67J1L59j52j3p9Kl5n0J82j35N70l59M4j9J16K73l30j54N0J6J19j29J20o3
$$ -267 -256 103 -49 -62 -141 -139 -174 -224 -42 -177 393 34 78 59 175 448 118 -36 14 30 149 20 140 77
5492G7Oj12M7P0L6l77J59J40k00L8K28k3k31K68j56J31k21L1K79j12l82K72j66
$$ 77 83 -29 18 88 124 -253 -94 46 -154 -116 112 89 -142 126 -30 101 -120 -89 190 78 -304 -32 -198
5515a98J16Q7K4J35j62m7J14o5pL5k60MJ96l7lr9q9j1L02j9K5N4n0jk1K56l64
$$ -198 -82 5 29 164 2 -45 69 4 -3 32 -228 -224 -28 -65 -68 -167 -256 -267 35 16 41 95 45 44 23 279 -85
5542h5J60j43oJ13%j27L12l3k25Q6k42K87k89K18l38M43p6J18k01LJ4o5j2J61
$$ -85 75 -68 -74 39 39 -88 224 191 -34 52 -190 97 -192 26 -312 131 55 173 -28 -25 -11 -76 -88 73
5566G3m7k54m5J61J50o0J93k5J7j76nlJ53j52R7J90Nl58M64k99L6j07l8K3n6J48
$$ 73 26 -228 -273 -112 38 -22 171 146 163 -13 -18 -21 132 -20 77 267 272 -86 378 79 115 8 -30 -7 -63 85
5592H5L8k37RP4l2K04l56j3P3P2J98m6J21k80K8K12P5j54K39k02j33N2L17Q1k71
$$ 85 123 -114 -105 -31 -63 141 -215 -228 -155 -83 115 69 190 -90 -62 150 225 71 310 108 -25 27 344 425 154
5617A54l89K24j45J27L6J4k2K09k56K16k00j27l3j2N3O6l09K83K33j35m4J08J2
$$ 154 -235 -11 -156 -29 7 21 -1 208 -48 168 -32 -159 -192 -204 -151 -85 -394 -111 122 -13 -57 51 63
5640F3m1J26J22p6m89P8K37P5q7Q6k2p6K07r3j27M0J34j62j77J2J9J49k15k02
$$ 63 22 148 270 194 -295 -217 20 95 8 94 72 -4 203 110 -17 23 157 -5 -182 -170 -151 -2 -217 -419
5664d19K08K52k53P5n0L59j54J50l7J9R1p6k74J55m6J25n4j68K97j49L8j82O1
$$ -419 -211 41 -212 -137 -187 172 18 168 131 150 241 165 -109 46 0 125 71 -97 200 51 89 -93 -32
5687c2J9OKK9j44J13P6r6M8j65l4J51J63k32J92Rj60J04l7J62j35L6K05m6j0j9
$$ -32 -13 -7 -5 24 -120 -7 69 -27 21 -144 -178 -27 136 -96 96 105 -55 49 12 174 39 75 280 234 224 205
5713B05m91K43j61J45O3P9k18k13N25j32j91J67N7k08O6j18L95j87j17N9r1L20
$$ 205 -286 -43 -204 -59 4 83 -135 -348 177 45 -146 21 78 -130 -64 -182 213 26 -91 -32 -123 197
5735A97l68J45nN6j98L45j95p4K49j56j11J53j80K96k54p6K14k2R9k53R3k1QK92
$$ 197 -171 -26 -31 25 -173 172 -23 -97 152 -4 -115 38 -142 154 -100 -176 38 16 115 -138 -45 -66 -58 234
5759B34k93L0k72J21K28l9oQL07l68J57N8k03J52p5j10J58r0O3Q6k11K8L81k09
$$ 234 -59 -29 -301 -180 48 9 3 11 318 -50 107 165 -38 114 39 -71 87 -3 60 146 -65 -37 344 135
5783A35j39r0P9k16L5L83l11M8M5jj41J50J31r3j21r4J93O4m7k03K23n7J29J9
$$ 135 -4 -94 -15 -231 -196 187 -124 -76 -31 -32 -173 -23 108 15 -106 -200 -7 57 10 -193 30 -27 102 121
$$ [...]
8191f1
##END NTUPLES=NMR FID
##END=
