##TITLE=1H_Art-H2EOH(A)-f21-f5
 CDCl3
 8 sc, 
 4.8.2023
##JCAMPDX= 6.0         $$ Bruker NMR JCAMP-DX V2.0
##DATA TYPE= NMR FID
##DATA CLASS= NTUPLES
##ORIGIN= UXNMR, Bruker Analytische Messtechnik GmbH
##OWNER= root
$$ XWIN-NMR		Version 3.5
$$ Fri Aug  4 15:39:55 2023 Russian Standard Time (UT+4h)  she@DPX200
##.OBSERVE FREQUENCY= 200.13135
##.OBSERVE NUCLEUS= ^1H
##.DELAY= (6, 6)
##.ACQUISITION MODE= SIMULTANEOUS
##.ACQUISITION SCHEME= undefined
##.AVERAGES= 8
##.DIGITISER RES= 18
##SPECTROMETER/DATA SYSTEM= spect
##.PULSE SEQUENCE= zg30
##.SOLVENT NAME= CDCl3
##.SHIFT REFERENCE= (INTERNAL, CDCl3, 0, 15.7039)
##AUDIT TRAIL= $$ (NUMBER, WHEN, WHO, WHERE, WHAT)
$$ ##TITLE= Audit trail, XWIN-NMR		Version 3.5
$$ ##JCAMPDX= 5.01
$$ ##ORIGIN= Bruker BioSpin GmbH
$$ ##OWNER= she
$$ F:/spectra/data/she/nmr/H-F/1/audita.txt
$$ ##AUDIT TRAIL=  $$ (NUMBER, WHEN, WHO, WHERE, WHAT)
(   1,<2023-08-04 15:38:55.40 +0400>,<she>,<DPX200>,
      <created by zg, POWCHK disabled, PULCHK disabled
       configuration hash MD5:
       00 E9 B6 7A A2 85 ED C7 34 08 36 98 17 FE 4E 26
       data hash MD5: 16K
       2E 3B 9D 84 E8 88 7A B6 18 21 9A 3F 75 C5 E6 1F>)
$$ ##END=
$$ 
$$ hash MD5
$$ 69 51 A4 ED 22 92 58 2D 5B 9F 46 35 83 EF 05 53
##$RELAX= 
##$RELAX= 
##$RELAX= 
##$RELAX= 
##$RELAX= 
##$RELAX= 
$$ Bruker specific parameters
$$ --------------------------
##$DU= <F:/spectra>
##$EXPNO= 1
##$NAME= <H-F>
##$PROCNO= 1
##$TYPE= <nmr>
##$USER= <she>
##$AMP= (0..31)
100 100 100 100 100 100 100 100 100 100 100 100 100 100 100 100 100 100 
100 100 100 100 100 100 100 100 100 100 100 100 100 100 
##$AQSEQ= 0
##$AQ_mod= 1
##$AUNM= <au_zg>
##$AUTOPOS= <>
##$BF1= 200.13
##$BF2= 200.13
##$BF3= 200.13
##$BF4= 200.13
##$BF5= 200.13
##$BF6= 200.13
##$BF7= 200.13
##$BF8= 200.13
##$BYTORDA= 1
##$CFDGTYP= 0
##$CFRGTYP= 5
##$CHEMSTR= <none>
##$CNST= (0..31)
1 1 145 1 1 1 1 1 1 1 1 1 1 1 1 1 1 1 1 1 1 1 1 1 1 1 1 1 1 1 1 1 
##$CPDPRG= <>
##$CPDPRG1= <>
##$CPDPRG2= <>
##$CPDPRG3= <>
##$CPDPRG4= <mlev>
##$CPDPRG5= <mlev>
##$CPDPRG6= <mlev>
##$CPDPRG7= <mlev>
##$CPDPRG8= <mlev>
##$CPDPRGB= <>
##$CPDPRGT= <>
##$D= (0..31)
0 1.2 0 0 0 0 0 0 0 0.06 0 0.03 0 0 0 0 0.0002 0 0 0 0 0 0 0 0 0 0 0 0 
0 0 0 
##$DATE= 1691149134
##$DBL= (0..7)
120 120 120 120 120 120 120 120 
##$DBP= (0..7)
150 150 150 150 150 150 150 150 
##$DBP07= 0
##$DBPNAM0= <>
##$DBPNAM1= <>
##$DBPNAM2= <>
##$DBPNAM3= <>
##$DBPNAM4= <>
##$DBPNAM5= <>
##$DBPNAM6= <>
##$DBPNAM7= <>
##$DBPOAL= (0..7)
0.5 0.5 0.5 0.5 0.5 0.5 0.5 0.5 
##$DBPOFFS= (0..7)
0 0 0 0 0 0 0 0 
##$DE= 6
##$DECBNUC= <off>
##$DECIM= 32
##$DECNUC= <off>
##$DECSTAT= 4
##$DIGMOD= 1
##$DIGTYP= 9
##$DL= (0..7)
0 120 120 120 120 120 120 120 
##$DP= (0..7)
150 150 150 150 150 150 150 150 
##$DP07= 0
##$DPNAME0= <>
##$DPNAME1= <>
##$DPNAME2= <>
##$DPNAME3= <>
##$DPNAME4= <>
##$DPNAME5= <>
##$DPNAME6= <>
##$DPNAME7= <>
##$DPOAL= (0..7)
0.5 0.5 0.5 0.5 0.5 0.5 0.5 0.5 
##$DPOFFS= (0..7)
0 0 0 0 0 0 0 0 
##$DQDMODE= 0
##$DR= 18
##$DS= 0
$$ [...]
##$SUBNAM2= <"">
##$SUBNAM3= <"">
##$SUBNAM4= <"">
##$SUBNAM5= <"">
##$SUBNAM6= <"">
##$SUBNAM7= <"">
##$SUBNAM8= <"">
##$SUBNAM9= <"">
##$SW= 18.05172834244
##$SWIBOX= (0..15)
0 0 2 0 0 0 0 0 0 0 0 0 0 0 0 0 
##$SW_h= 3612.71676300578
##$TD= 16384
##$TD0= 1
##$TE= 0
##$TE2= 300
##$TE3= 300
##$TEG= 300
##$TL= (0..7)
0 120 120 120 120 120 120 120 
##$TP= (0..7)
150 150 150 150 150 150 150 150 
##$TP07= 0
##$TPNAME0= <>
##$TPNAME1= <>
##$TPNAME2= <>
##$TPNAME3= <>
##$TPNAME4= <>
##$TPNAME5= <>
##$TPNAME6= <>
##$TPNAME7= <>
##$TPOAL= (0..7)
0.5 0.5 0.5 0.5 0.5 0.5 0.5 0.5 
##$TPOFFS= (0..7)
0 0 0 0 0 0 0 0 
##$TUNHIN= 0
##$TUNHOUT= 0
##$TUNXOUT= 0
##$USERA1= <user>
##$USERA2= <user>
##$USERA3= <user>
##$USERA4= <user>
##$USERA5= <user>
##$V9= 5
##$VALIST= <valist>
##$VCLIST= <CCCCCCCCCCCCCCC>
##$VD= 0
##$VDLIST= <DDDDDDDDDDDDDDD>
##$VPLIST= <PPPPPPPPPPPPPPP>
##$VTLIST= <TTTTTTTTTTTTTTT>
##$WBST= 1024
##$WBSW= 4
##$XGAIN= (0..3)
0 0 0 0 
##$XL= 0
##$YL= 0
##$YMAX_a= 355361
##$YMIN_a= -315694
##$ZGOPTNS= <>
##$ZL1= 120
##$ZL2= 120
##$ZL3= 120
##$ZL4= 120
##$ABSF1= 10
##$ABSF2= 0
##$ABSG= 5
##$ABSL= 3
##$ALPHA= 0
##$AQORDER= 0
##$ASSFAC= 0
##$ASSFACI= 0
##$ASSFACX= 0
##$ASSWID= 0
##$AUNMP= <proc_1d>
##$AZFE= 0.1
##$AZFW= 0.1
##$BCFW= 1
##$BC_mod= 2
##$BYTORDP= 1
##$COROFFS= 0
##$CY= 11.3945322036743
##$DATMOD= 1
##$DC= 2
##$DFILT= <>
##$DTYPP= 0
##$F1P= 15.7292609196834
##$F2P= 12.9074282941183
##$FCOR= 0.5
##$FTSIZE= 0
##$FT_mod= 4
##$GAMMA= 1
##$GB= 0.15
##$INTBC= 1
##$INTSCL= 1
##$ISEN= 128
##$LB= 0.24
##$LEV0= 0
##$LPBIN= 0
##$MAXI= 10000
##$MC2= 0
##$MEAN= 0
##$ME_mod= 0
##$MI= 1.114404
##$NCOEF= 0
##$NC_proc= 0
##$NLEV= 6
##$NOISF1= 3.799351
##$NOISF2= 2.8
##$NSP= 1
##$NTH_PI= 0
##$NZP= 0
##$OFFSET= 15.70392
##$PC= 1
##$PHC0= -21050.25
##$PHC1= 18.05272
##$PH_mod= 1
##$PKNL= yes
##$PPARMOD= 0
##$PSCAL= 0
##$PSIGN= 0
##$REVERSE= no
##$SF= 200.130013532006
##$SI= 16384
##$SIGF1= 3
##$SIGF2= 2
##$SINO= 400
##$SIOLD= 16384
##$SREGLST= <1H.CDCl3>
##$SSB= 0
##$STSI= 0
##$STSR= 0
##$SW_p= 3612.71676300578
##$SYMM= 0
##$S_DEV= 0
##$TDeff= 0
##$TDoff= 0
##$TI= <>
##$TILT= no
##$TM1= 0
##$TM2= 0
##$TOPLEV= 0
##$USERP1= <user>
##$USERP2= <user>
##$USERP3= <user>
##$USERP4= <user>
##$USERP5= <user>
##$WDW= 1
##$XDIM= 8192
##$YMAX_p= 0
##$YMIN_p= 0
$$ End of Bruker specific parameters
$$ ---------------------------------
##NTUPLES= NMR FID
##VAR_NAME=  TIME,          FID/REAL,        FID/IMAG
##SYMBOL=    X,             R,               I
##VAR_TYPE=  INDEPENDENT,   DEPENDENT,       DEPENDENT
##VAR_FORM=  AFFN,          ASDF,            ASDF
##VAR_DIM=   8192,          8192,            8192
##UNITS=     SECONDS,       ARBITRARY UNITS, ARBITRARY UNITS
##FACTOR=    0.0002768,     1,               1
##FIRST=     0,             0,               0
##LAST=      2.2672688,     0,               0
##MIN=       0,             -315694,         0
##MAX=       2.2672688,     355361,          0
$$ Real data points
##PAGE= N=1
##DATA TABLE= (X++(R..R)), XYDATA
$$ plain form
0 0 0 0 0 0 0 0 0 0 0 0 8 -8 8 -8 16 -16 24 -24 32 -40 48 -56 67 -80 96 -112 128 -144 168 -192 221 -252
32 -252 286 -324 365 -411 460 -516 577 -643 715 -794 881 -975 1077 -1190 1311 -1447 1595
49 1595 -1756 1934 -2133 2350 -2595 2867 -3177 3526 -3933 4405 -4963 5634 -6463 7512 -8889
64 -8889 10781 -13558 18025 -26373 47187 -205630 -190649 355361 -14479 -254952 91860
75 91860 186131 -95179 -36307 42105 -37573 -11257 31419 -49050 25098 75798 -19611 -4337
87 -4337 54357 -62475 -50189 68123 -12909 -71294 71605 48289 -69287 18561 54664 -88691
99 -88691 -52455 74210 -4826 -72484 39341 70889 -22378 -44143 3185 15768 -8195 -28564
111 -28564 -2576 38396 25183 -3809 2855 2466 -7912 -2515 -9042 -12432 16502 25742 3120
$$ packed form
0@%%%%%%%%%%Qj6J6j6K4l2M0m8N6p2Q8j04J23j47J76k08K40k72L12l60M13m73
32b52N38o10O89p76Q71r76J093j220J358j509J675j856K052k267K501k758L042
49A595l351L690m067M483m945N462o044O703p459Q338r368J0597j2097J3975j6401
64h889J9670k4339L1583m4398P3560k52817J4981N46010l69840k40473L46812
75I1860R4271k81310N8872P8412p9678K6316M2676q0469P4148N0700r5409J5274
87d337N8694j16832J2286J18312q1032n8385J42899k3316j17576Q7848L6103j43355
99h8691L6236J26665p9036o7658J11825L1548r3267k1765M7328J2583k3963k0369
111b8564K5988M0972j3213k8992O664l89j0378N397o527l390K8934R240k2622
$$ plain form
124 3120 -7300 -4883 6238 1034 -42299 -26347 49975 11917 -60633 27387 71124 -59344
136 -59344 -62889 61895 12195 -68670 17240 48369 -14012 7882 13533 -30669 16734 24220
148 24220 -58782 -1825 78692 -22886 -44257 67699 8624 -75279 28160 38207 -67975
159 -67975 -2483 66540 -28442 -28951 47188 -13700 -44575 23919 -4520 -35041 32711 17440
171 17440 -33134 22340 21846 -41468 5947 28113 -43124 -192 61906 -20498 -31224 56884
183 56884 5749 -59038 17932 30904 -36255 234 33327 -14961 -3269 24598 -24213 -25049
195 -25049 22305 -5403 -27633 16062 18900 -11342 -2505 916 -8586 3032 -3738 -16177 11165
208 11165 23106 -4785 -4278 15111 1937 -13389 -4257 7747 7077 -4486 -654 20642 7184
$$ packed form
124C120j0420K417J1121n204m3333J5952P6322l8058p2550Q8020M3737j30468
136e9344l545J24784m9700q0865Q5910L1129o2381K1894N651m4202M7403P486
148B4220q3002N6957Q0517j01578k1371J11956n9075q3903J03439J0047j06182
159f7975O5492O9023r4982n09P6139o0888l0875O8494k8439l0521O7752j5271
171A7440n0574N5474m94o3314M7415K2166p1237M2932O2098q2404j0726Q8108
183E6884n1135o4787P6970J2972o7159L6489L3093m8288J1692K7867m8811q36
195b5049M7354k7708k2230M3695K838l0242Q837L421r502J1618o770j2439K7342
208A1165J1941k7891N07J9389j3174j5326R132J2004o70j1563L832K1296j3458
$$ plain form
221 7184 -24533 -3145 18845 -15164 -22836 13732 12208 -5071 1639 -7974 -9940 14606 -4849
234 -4849 -33266 8881 29706 -12322 -9247 18808 -1918 -5205 9472 -16673 -9939 33660 6170
247 6170 -25360 18090 22596 -21241 -4121 11821 -18839 -2024 23106 -13346 -10909 25610 -7371
260 -7371 -26932 15702 1364 -34030 11121 28648 -22014 -12792 26483 1214 -16154 1760
272 1760 -5157 -1599 22398 69 -19871 17983 25433 -15998 -18041 8719 10001 1649 -6532 -7992
286 -7992 15056 17135 -18125 -17862 11427 1786 -14709 1272 3825 -4612 6340 3612 -13695 -3452
300 -3452 7712 -6097 -5484 8362 3571 -851 8059 5453 -5863 -6568 3352 10997 1134 -12626
314 -12626 4264 24038 -421 -23335 -101 15141 -5209 -14080 -1137 6978 7886 -1804 -14981
$$ packed form
221G184l1717K1388K1990l4009p672L6568j524j7279O710r613j966K4546j9455
234d849k8417M2147K0825m2028L075K8055k0726l287J4677k6145O734M3599k7490
247F170l1530M3450M506m3837J7120J5942l0660J6815K5130l6452K437L6519l2981
260g371j9561M2634j4338l5394M5151J7527n0662R222L9275k5269j7368J7914
272A760o917L558K3997k2329j9940L7854P450m1431k043K6760J282q352q181j460
286g992K3048K079l5260K63K9289r641j6495J5981K553q437J0952k728j7307J0243
300c452J1164j3809O13J3846m791m422Q910k606j1316p05R920P645r863j3760
314a2626J6890J9774k4459k2914K3234J5242k0350q871J2943Q115R08r690j3177
$$ plain form
327 -14981 -3517 11668 -4140 -16219 1705 10700 714 -328 1030 -2552 1895 3197 -5625 -533
341 -533 9811 2096 -744 9257 1347 -10514 4132 10149 -11344 -10644 15368 9554 -13775 -5125
355 -5125 9559 -3913 -11926 1074 -17 -6558 4289 7163 -6725 -4667 6514 -718 -7184 406
369 406 3282 3010 5927 706 -3325 5538 5182 -6506 -3949 5554 3504 1526 2093 -2231 1070 4483
385 4483 -7135 -10349 5278 4533 -9579 -2137 8776 -2634 -7628 810 -1466 -5405 1689 2302
399 2302 -1861 4543 5642 -3409 -1223 4427 -1584 -2448 5597 2685 -844 6486 4424 -5943 -906
414 -906 5448 -5537 -6077 6613 1508 -7345 3935 4584 -11634 -5203 8399 -6178 -11184 8287
428 8287 5508 -8082 3657 4922 -10305 1915 10878 -10101 -5639 18850 2894 -11878 9336
$$ packed form
327a4981J1464J5185j5808j2079J7924Q995r986j042J358l582M447J302q822N092
341e33J0344p715k840J0001p910j1861J4646O017k1493P00K6012n814k3329Q650
355e125J4684j3472q013J3000j091o541J0847K874j3888K058J1181p232o466P590
369D06K876k72K917n221m031Q863l56j1688K557R503k050j978N67m324L301L413
385D483j1618l214J5627p45j4112P442J0913j1410m994Q438k276l939P094O13
399B302m163O404J099r051K186N650o011q64Q045k912l529P330k062j0367N037
414i06O354j0985n40J2690n105q853J1280O49j6218O431J3602j4577n006J9471
428H287k779j3590J1739J265j5227J2220Q963k0979M462K4489j5956j4772K1214
$$ plain form
441 9336 7282 -10205 4651 5807 -13632 4268 18357 -11547 -10897 15887 -2501 -15915 7918
454 7918 -290 -16667 11471 11245 -21899 -1078 20991 -12589 -15709 14260 317 -9311 14646
467 14646 1996 -14428 14629 11997 -19885 864 18075 -11579 -4228 21243 -5647 -14861 17100
480 17100 5139 -21358 1033 10715 -7782 -638 4176 -10837 1656 12918 -14270 -16936 13951
493 13951 9692 -13002 -3496 8828 2427 240 -1099 -5966 2793 10599 -1547 -7236 6430 10610
507 10610 -2358 -5857 3338 2470 -3813 1532 2678 -5656 -1246 7919 -4739 -10646 3910 736
521 736 -8809 4054 4118 -12710 2978 15222 -12510 -12952 16276 3787 -13169 8568 5881 -9275
535 -9275 12349 9469 -21768 2955 26200 -13527 -16528 21985 3311 -16784 11562 2428 -20186
$$ packed form
441I336k054j7487J4856J156j9439J7900J4089k9904O50K6784j8388j3414K3833
454G918q208j6377K8138k26l3144K0821K2069l3580l120K9969j3943r628K3957
467A4646j2650j6424K9057k632l1882K0749J7211k9654P351K5471k6890r214L1961
480A7100j1961k6497K2391R682j8497P144M814j5013J2493J1262k7188k666L0887
493A3951m259k2694R506J2324o401k187j339m867Q759P806j2146n689J3666M180
507A0610j2968l499R195q68o283N345J146q334M410R165j2658n907J4556l174
521G36r545J2863O4j6828J5688J2244k7732m42K9228j2489j6956K1737k687j5156
535i275K1624k880l1237K4723K3245l9727l001L8513j8674k0095K8346r134k2614
$$ plain form
548 -20186 11014 11746 -24999 -436 22061 -15857 -10797 21133 -10504 -19424 22526 3704 -26717
561 -26717 12461 19727 -18773 -294 17126 -13386 -1856 22044 -12778 -15231 26805 5883
573 5883 -23433 8872 12470 -15278 2772 9744 -16993 -235 19689 -12957 -15962 16154 2001
586 2001 -16401 3857 3999 -9305 6593 6535 -13535 179 14347 -4392 -9726 6618 5373 -1411
600 -1411 1819 730 275 5241 1209 -5773 -271 6803 1731 -6496 -2095 7552 740 -9568 -707
615 -707 4953 -6159 -3347 5193 -4460 -3410 8172 -4033 -9374 9653 2478 -12753 7451 9781
629 9781 -12786 3246 16823 -12403 -8518 20420 -1933 -16094 14528 6511 -15683 9840 9012
642 9012 -21105 4057 20356 -20402 -13374 24641 -2260 -20986 11410 4347 -15125 8611 3695
$$ packed form
548b0186L1200P32l6745K4563K2497l7918N060L1930l1637q920M1950j8822l0421
561b6717L9178P266l8500J8479J7420l0512J1530K3900l4822k453M2036k0922
573E883k9316L2305L598k7748J8050O972k6737J6758J9924l2646l005L2116j4153
586B001j8402K0258J42j3304J5898n8k0070J3714J4168j8739n334J6344j245o784
600a411L230j089m55M966m032o982N502P074n072q227M401R647o812j0308Q861
615g07N660j1112K812Q540r653J050J1582j2205n341J9027p175j5231K0204K330
629I781k2567J6032J3577k9226L885K8938k2353j4161L0622q017k2194K5523q28
642I012l0117K5162J6299m0758P028L8015k6901j8726L2396p063j9472K3736m916
$$ plain form
655 3695 -19289 10413 16752 -21481 -3265 24384 -10540 -13479 21271 -775 -18245 18454 10457
668 10457 -21257 6467 17659 -15820 -4231 16598 -9759 -9286 16816 -3118 -16518 10314
680 10314 6108 -14408 103 5405 -7891 1924 5708 -9976 -1033 11042 -5512 -7086 8851
693 8851 1825 -6319 5891 4842 -5670 1275 6956 -694 -3896 442 3960 2880 -3735 -3685 3676
708 3676 2242 -2897 -1811 -3491 -1398 5528 -2243 -10390 3585 7891 -7680 -4751 4907 -2008 -391
723 -391 5251 -6471 -2691 13422 -514 -10390 8849 5817 -9601 6264 8182 -12359 1518
736 1518 16051 -8850 -10263 12482 -378 -10343 7233 -1399 -12060 10282 6228 -18639 -119
749 -119 14334 -9059 -7108 9167 -4739 -3195 13160 -6101 -12213 16131 7728 -16778 2725
$$ packed form
655C695k2984K9702O339l8233J8216K7649l4924k939L4750k2046j7470L6699p997
668A0457l1714K7724J1192l3479J1589K0829k6357M73K6102j9934j3400K6832
680A0314m206k0516J4511N302j3296R815L784j5684Q943J2075j6554j574J5937
693H851p026q144J2210j049j0512O945N681p650l202M338L518j080o615N0P361
708C676j434n139J086j680K093O926p771q147J3975M306j5571K929R658o915J617
723c91N642j1722L780J6113j3936r876J9239l032j5418J5865J918k0541J3877
736A518J4533k4901j413K2745j2860r965J7576q632j0661K2342m054k4867J8520
749a19J4453k3393J951J6275j3906J544J6355j9261o112K8344q403k4506J9503
$$ plain form
762 2725 13854 -6845 -2079 8946 -5690 -2411 10578 -4266 -8064 9009 1099 -8895 4389
775 4389 1813 -9684 2655 5525 -8799 -2640 6023 -2904 -2251 3102 -5127 -1565 9353 -2094
789 -2094 -8818 6528 7864 -4599 -2124 4301 2213 1167 -1095 -2041 4027 3132 -3970 -312 2529
804 2529 -2454 -693 1623 -4249 -1987 3952 -2560 -3798 2697 -1370 -4078 2917 -200 -5278 3004
819 3004 3053 -4219 729 4213 -2335 1205 4056 -3219 579 6868 -2639 -3441 7258 616 -5585 3938
835 3938 2915 -6648 1049 4526 -5641 -2322 4741 -3146 -4173 2350 -1457 -2748 2324 -1886 -3291
850 -3291 4331 414 -5291 2969 4462 -3723 13 4395 -988 331 3877 -1652 -670 5130 -827
865 -827 -3613 3391 1625 -3083 764 521 -2812 600 222 -3946 -377 968 -3015 -77 1230 -4478
$$ packed form
762B725J1129k0699M766J1025j4636L279J2989j4844l798J7073p910r994J3284
775D389k576j1497J2339K870j4324O159Q663q927O53N353q229L562J0918j1447
789b094o724J5346J336j2463K475O425k088j046k262r46O068q95p102L658K841
804B529m983J761K316n872K262N939o512j238O495m067k708O995l117n078Q282
819C004M9p272M948L484o548L540K851p275L798O289r507q02J0699o642o201R523
835C938j023r563P697L477j0167L319P063p887j027O523l807j291N072m210j405
850c291P622l917n705Q260J493q185L736M382n383J319L546n529R82N800n957
865h27k786P004j766m708L847k43l333L412l78m168L569J345l983K938J307n708
$$ plain form
881 -4478 -404 5190 -2773 -4784 4213 2705 -2823 1084 1468 -133 3919 947 -4721 3295 6433
896 6433 -4315 -2879 5139 -383 -3007 3382 -881 -5335 2543 2832 -5305 -1658 2129 -2354 -880
911 -880 906 -4370 -789 6400 -1957 -6950 3723 5793 -2855 -1483 2530 30 2307 3668 -3008
926 -3008 -1505 6340 1495 -5029 890 3392 -1726 -625 1197 -3262 -916 3948 -2276 -6581 1305
941 1305 3775 -3540 -2832 1084 -1286 -230 2893 -2920 -3571 5196 3240 -4534 769 4886 -1358 214
957 214 3873 -2752 -2057 7778 1490 -8230 1767 6936 -3278 -4311 1763 -875 -707 1915 -4472 -3748
973 -3748 5189 21 -7564 1174 4399 -4223 -1005 4872 -2983 -3029 6426 1653 -5257 2452 4524 -2387
989 -2387 843 3412 -2567 283 6027 -2196 -5018 4603 3413 -5242 -1139 2603 -2644 -490 2278
$$ packed form
881d478M074N594p963k011Q997j508n528L907L84j601M052k972n668Q016L138
896F433j0748J436Q018n522k624O389m263m454P878K89q137L647L787m483J474
911h80J786n276L581P189q357m993J0673K070q648J372M013k500K277J361o676
926c008J503P845m845o524N919K502n118J101J822m459K346M864o224m305P886
941A305K470p315P08L916k370J056L123n813o51Q767j956p774N303M117o244J572
957B14L659o625O95R835o288r720R997N169j0214j033O074k638J68K622o387P24
973c748Q937n168p585Q738L225q622L218N877p855m6R455m773o910P709K072o911
989b387L230K569n979K850N744q223k822R621j190q655M103L742n247K154K768
$$ plain form
1004 2278 -5118 -3293 6105 -758 -7970 2632 4702 -5703 -1320 5650 -3189 -3264 7677 144 -7228
1019 -7228 5261 6828 -5805 -347 6221 -3105 -1233 7124 -3803 -5762 8511 1738 -10380 2761
1033 2761 6420 -7826 -2063 5650 -5674 -3196 8040 -4245 -8506 8493 2666 -10603 3337
1046 3337 7182 -7725 271 9443 -5449 -4456 10809 -165 -8228 6958 5017 -7377 2402 5369
1060 5369 -6154 885 6681 -7295 -4125 9710 -2764 -9880 6330 4015 -9638 378 6267
1073 6267 -6013 -2767 5926 -2904 -3627 5822 508 -5028 3533 3110 -3588 1705 4245 -3422 298
1088 298 6179 -1410 -4024 4259 3188 -4612 -807 3806 -1457 -2469 1988 -1196 -4364 2100 1641
1103 1641 -5804 -1315 5089 -2266 -4470 3747 227 -4196 3917 2508 -6522 2263 8288 -4382 -4165
$$ packed form
1004B278p396J825R398o863p212J0602K070j0405M383O970q839p5J0941p533p372
1019g228J2489J567j2633N458O568r326J872Q357j0927j959J4273o773j2118J3141
1033B761L659j4246N763P713j1324K478J1236j2285m261J6999n827j3269J3940
1046C337L845j4907P996R172j4892R93J5265j0974q063J5186j941j2394R779K967
1060E369j1523P039N796j3976L170J3835j2474p116J6210k315j3653J0016N889
1073F267j2280L246Q693q830p23R449n314n536Q561m23o698N293K540p667L720
1088B98N881p589k614Q283j071p800L805M613n263j012M457l184l168O464m59
1103A641p445M489O404p355k204Q217l520m423Q113j409r030Q785O025j2670K17
$$ plain form
1118 -4165 8091 897 -5641 5059 2231 -6088 4332 4970 -7933 -110 7749 -6120 -4297 8026
1132 8026 -4520 -8062 9835 874 -13562 4686 9665 -9985 -3877 8795 -3785 -3167 8221
1145 8221 -4017 -5619 11774 1455 -11655 7195 8826 -9364 19 9315 -6218 -3005 10413
1158 10413 -3557 -8959 7769 3344 -9172 1760 3191 -6505 1243 4474 -7923 -2792 8144
1171 8144 -2631 -7307 4343 2628 -3803 2125 1550 -3889 3138 5287 -4222 -1870 5879 1086 -2803
1186 -2803 1484 1533 -757 1239 1126 -2479 -956 2650 -216 -4107 -410 2647 -2039 -3100 1848 403
1202 403 -4061 1481 3049 -4686 -1895 5955 -470 -4392 3368 1444 -2153 3699 839 -5093 4585
1217 4585 5515 -6861 -435 8436 -3651 -4698 7144 -1528 -7139 6002 2536 -9538 1924 6236
$$ packed form
1118d165J2256p194o538J0700k828q319J0420O38j2903P823P859j3869J823J2323
1132H026j2546l542J7897q961j4436J8248M979j9650O108J2672j2580O18J1388
1145H221j2238j602J7393j0319j3110J8850J631j8190R383R296j5533L213J3418
1158A0413j3970n402J6728m425j2516J0932J431r696P748L231j2397N131J0936
1171H144j0775m676J1650j715o431N928n75n439P027K149r509K352P749m793l889
1186b803M287M9k290J996j13l605J523L606k866l891L697L057m686j061M948j445
1202D03m464N542J568p735K791P850o425l922P760j924l597N852k860n932R678
1217D585R30j2376O426Q871j2087j047J1842q672n611J3141l466j2074J1462M312
$$ plain form
1231 6236 -7345 -1639 6265 -5519 -3687 8172 -3257 -7663 7769 3278 -8308 3051 5612
1244 5612 -5733 1516 6659 -5861 -623 9501 -3256 -6124 7386 1398 -6936 3922 2783
1257 2783 -6550 2019 4976 -7062 -1637 6503 -3040 -5036 4388 -353 -4384 2428 946 -3527 1943
1272 1943 1771 -2799 1452 2402 -2172 1405 2879 -2202 343 4305 -973 -2002 3127 1064 -1648
1287 -1648 624 414 -670 544 -1121 -872 1124 -966 -2111 750 -312 -1893 558 -100 -2626 1657
1303 1657 1289 -3111 739 3082 -2606 -471 4422 -1744 -1772 4836 3 -3984 3727 3303 -3647 579
1319 579 2349 -2696 735 2109 -4009 -657 3990 -3168 -3550 3672 -1345 -4163 3480 185 -5047
1334 -5047 2557 3573 -4577 -461 4689 -1619 -1046 3364 -1470 -1022 4929 -630 -3193 3923 1706
$$ packed form
1231F236j3581N706P904j1784J832J1859j1429m406J5432m491j1586J1359K561
1244E612j1345P249N143j2520N238J0124j2757k868J3510n988q334J0858j139
1257B783r333Q569K957j2038N425Q140r543j996R424m741m031O812j482m473N470
1272A943j72m570M251R50m574L577J474n081K545L962n278j029N129k063k712
1287a648K272k10j084J214j665K49J996k090j145K861j062j581K451o58k526M283
1303A657l68m400L850K343n688K135M893o166k8O608m833l987P711m24o950M226
1319E79J770n045L431J374o118L352M647p158l82P222n017k818P643l295n232
1334e047P604J016q150M116N150o308N73M410m834M48N951n559k563P116k217
$$ plain form
1349 1706 -3031 1848 1682 -3449 1259 3128 -4182 -1643 3800 -1340 -3018 616 -977 -1044 2066 -1840
1365 -1840 -3486 2837 1812 -3745 278 2613 -876 702 1522 -2028 950 3462 -1461 -1143 3006
1380 3006 -330 -805 3312 -825 -3325 2878 2284 -4228 -819 2203 -1153 -710 -491 -2905 954 2416
1396 2416 -3982 -2773 4296 213 -3561 1797 1088 -2206 2034 2325 -3279 678 4054 -1262 -1086 2697
1412 2697 -151 -847 2910 -271 -2483 2439 1963 -3003 -954 1274 -794 -429 -242 -2484 -689 1700
1428 1700 -1288 -2366 560 1142 -883 -571 178 609 1100 200 -385 376 1225 1182 167 -727 302 1776
1446 1776 213 -914 243 102 -571 813 -749 -2274 1160 1089 -2892 -981 2009 -1601 -1609 1495 -1317
1463 -1317 -2208 3212 372 -3817 1723 3068 -2605 -220 3178 -1366 -313 3617 -1153 -1927 3918
$$ packed form
1349A706m737M879j66n131M708J869p310K539N443n140j678L634j593o7L110l906
1365a840j646O323j025n557M023K335l489J578Q20l550K978K512m923L18M149
1380C006l336m75M117m137k500O203n94o512L409L022l356M43K19k414L859J462
1396B416o398J209P069m083l774N358p09l294M240K91n604L957L376n316J76L783
1412B697k848o96L757l181k212M922m76m966K049K228k068L65J87k242J795K389
1428A700k988j078K926N82k025L12P49M31M91r00n85P61Q49m3j015q94J029J474
1446A776j563j127J157j41o73J384j562j525L434p1l981J911K990l610qL104k812
1463a317q91N420k840m189N540J345n673K385L398m544J053L930m770p74N845
$$ plain form
1478 3918 916 -3827 2031 2704 -3259 199 2805 -3312 -1664 3316 -2209 -3633 3086 558 -4493
1493 -4493 1245 2379 -3718 -453 3362 -1849 -1831 3543 -117 -2499 2914 1404 -2543 1860 2942
1508 2942 -2450 43 3570 -1437 -1712 3261 -58 -3538 1849 2140 -3552 -544 2784 -2595 -2161 2318
1524 2318 -742 -2815 1945 703 -3422 932 2723 -2529 -894 3680 -1046 -1672 3675 776 -2982
1539 -2982 2306 2489 -2746 793 3712 -2666 -1590 4005 -975 -3673 2559 1298 -4730 183 2991
1554 2991 -3131 -1523 2490 -2206 -2714 3269 -50 -3338 2219 1555 -2743 1306 2325 -2663 205
1569 205 4652 -1570 -3140 4308 1934 -3459 890 2820 -2368 106 2863 -2881 -1972 3768 -523
1584 -523 -4566 1282 2272 -2937 -768 1779 -2335 -706 2805 -2062 -3329 3391 2134 -3469 179
$$ packed form
1478C918l002m743N858O73n963L458K606o117J648M980n525j424O719k528n051
1493d493N738J134o097L265L815n211J8N374l660k382N413j510l947M403J082
1508B942n392K493L527n007k75M973l319l480N387K91n692L008L328n379M34M479
1524B318l060k073M760j242m125M354J791n252J635M574m726o26N347k899l758
1539b982N288J83n235L539K919o378J076N595m980k698O232j261o028M913K808
1554B991o122J608M013m696n08N983l319l288N557o64m298M049J019m988K868
1569B05M447o222j570P448k374n393M349J930n188K474K757n744R09N740m291
1584e23m043N848R90n209K169K547m114J629L511m867j267O720j257n603L648
$$ plain form
1599 179 2810 -1352 778 2789 -2434 -924 5763 219 -5058 2806 4521 -3995 -1364 3497 -1975
1614 -1975 -2076 3265 -1640 -4250 3263 1071 -5130 1062 2727 -4016 -235 4194 -3493 -2210 5760
1629 5760 -372 -5182 3469 3154 -3707 1229 3428 -3241 640 5105 -3268 -2783 5761 241 -5238
1644 -5238 2568 2415 -4359 342 2774 -3766 -1309 3583 -2705 -3413 3593 -155 -3693 2266 1270 -3636
1660 -3636 1316 3537 -2629 -1639 3785 276 -2071 2600 1127 -2029 1509 1944 -2192 53 2920
1675 2920 -517 -2113 1381 640 -1638 -154 180 -1586 -528 1242 -1418 -1904 1328 571 -2107 137
1691 137 1483 -1634 -490 2643 -882 -1640 2972 1089 -2854 1569 2657 -2608 62 3448 -1862
1706 -1862 -1720 3590 -387 -3991 2508 1454 -4183 629 3080 -3617 -1070 3662 -2817 -2801 3920 -912
$$ packed form
1599A79K631m162K130K011n223J510O687n544n277P864J715q516K631M861n472
1614a975j01N341m905k610P513k192o201O192J665o743L781M429p687J283P970
1629E760o132m810Q651l15o861M936K199o669L881M465q373M85Q544n520n479
1644e238P806j53o774M701K432o540K457M892o288p08P006l748l538N959r96m906
1660c636M952K221o166R90N424l509k347M671j473l156L538M35m136K245K867
1675B920l437j596L494p41k278J484L34j766J058J770k660m86L232p57k678K244
1691A37J346l117J144L133l525p58M612j883l943M423J088n265K670L386n310
1706a862J42N310l977l604O499j054n637M812K451o697K547M732o479J6O721m832
$$ plain form
1722 -912 -4245 3207 1713 -4841 1432 3729 -3716 -398 4673 -2096 -1893 4789 -824 -3246 3965
1737 3965 1406 -4474 1967 3242 -4554 -655 3619 -2719 -2553 3001 -1319 -3221 2158 175 -3338
1752 -3338 1691 1208 -3357 475 3122 -2303 -1444 3108 -78 -1839 1784 1013 -996 1363 619 -1430
1768 -1430 1020 1721 -1157 -512 1413 -178 -1067 319 219 -954 -489 655 -253 -963 -556 532 -357
1785 -357 -1131 306 138 -478 282 182 -656 1164 1893 -1427 -333 2622 -124 -1084 2007 575 -1763
1802 -1763 2048 1223 -2847 326 3037 -2267 -1739 2142 -740 -1522 1492 -1280 -2660 2621 745 -4019
1818 -4019 514 2951 -2248 -921 2949 -1277 -1317 3051 -249 -2250 2509 946 -2468 1951 1574 -2589
1834 -2589 954 2752 -2816 -1237 3333 -486 -2572 1108 47 -1717 1137 -454 -2700 1406 1171
$$ packed form
1722i12l333P452j494o554O273K297p445L318N071o769K03O682n613k422P211
1737C965k559n880O441J275p796L899M274o338J66N554m320j902N379j983l513
1752c338N029m83m565L832K647n425Q59M552l186j761L623p71k009K359p44k049
1768a430K450P01k878O45J925j591q89J386j00j173M65J144r08p10M07J088q89
1785c57p74J437j68o16P60j00q38J820P29l320J094K955k746r60L091j432k338
1802a763L811q25m070L173K711n304N28L881k882p82L014k772j380N281j876m764
1818d019M533K437n199J327L870m226m0M368l300k001M759j563l414M419l77m163
1834b589L543J798n568J579M570l819k086L680j061j764K854j591k246M106k35
$$ plain form
1849 1171 -2595 -643 1906 -988 -401 1009 -749 -655 2135 -302 -1511 1652 876 -579 907 476
1865 476 -456 1269 687 -1637 425 1164 -1061 -446 740 -897 -543 1160 -1309 -1393 701 -209 -1126
1882 -1126 607 -451 -1188 1400 563 -2297 346 1972 -899 -429 1419 410 99 1165 -527 -573
1898 -573 2141 -52 -1511 1070 878 -1570 217 627 -1539 -165 768 -1411 -703 950 -936 -1073
1914 -1073 953 -636 -1400 1083 386 -1292 395 1002 -307 330 628 -93 665 768 -547 97 1024
1931 1024 -414 -174 828 -76 -534 478 -549 -945 542 -385 -1332 318 -178 -1330 275 181 -1487
1948 -1487 128 689 -1290 51 1414 -845 -756 2043 -177 -1055 2016 895 -1929 1122 1809 -1210
1964 -1210 283 1407 -1191 -69 1264 -1326 -756 1852 -1106 -2115 1587 173 -2857 225 1425
$$ packed form
1849A171l766J952K549k894N87J410j758R4K790k437j209L163p76j455J486m31
1865D76r32J725n82k324K062P39k225O15J186j637L54J703k469q4K094r10r17
1882a126J733j058p37K588q37k860K643J626k871M70J848j009l11J066j692m6
1898e73K714k193j459K581j92k448J787M10k166J374R33k179P08J653j886j37
1914a073K026j589p64K483o97j678J687O07j309O37K98p21P58J03j315O44R27
1931A024j438K40J002r04m58J012j027l96J487r27r47J650m96j152J605r4j668
1948a487J615N61j979J341J363k259Q9K799k220q78L071j121k824L051O87l019
1964a210J493J124k598J122J333k590N70K608k958j009L702j414l030L082J200
$$ plain form
1979 1425 -1941 29 1600 -1223 -1064 1998 -670 -1439 2228 650 -1693 1360 1462 -1349 191 2080
1995 2080 -1139 -969 1672 -341 -1235 1097 -103 -1413 975 568 -2085 -434 1283 -1115 -1466 787
2011 787 -121 -833 513 325 -1183 578 1382 -516 -779 1385 738 -584 284 876 -52 375 777 -437
2029 -437 59 1265 -169 -1281 532 967 -1187 -245 846 -1308 -1281 1168 -242 -1772 509 672 -1276
2046 -1276 449 1103 -1429 161 1685 -1218 -1505 2439 823 -2000 1239 1837 -1632 378 1811 -1301
2062 -1301 -363 2499 -1072 -1992 1891 283 -2659 689 998 -2439 -131 1958 -2014 -1511 2183 -534
2078 -534 -1839 1227 691 -1776 1410 1303 -2072 297 2748 -694 -1439 2034 254 -1196 1285 740
2094 740 -1934 882 1783 -1898 -1003 2048 -594 -2135 914 170 -1963 690 714 -2491 -146 2168
$$ packed form
1979A425l366J970J571k823J59L062k668p69L667j578k343L053J02k811J540J889
1995B080l219J70K641k013q94K332j200j310K388m07k653J651J717k398l51K253
2011G87r08p12J346j88j508J761Q04j898k63K164o47j322Q68N92r28M27M02j214
2029d37M96J206j434j112J813M35k154R42J091k154K7K449j410j530K281J63j948
2046a276J725O54k532J590J524k903k87L944j616k823L239N98l469K010J433l112
2062a301R38K862l571r20L883j608k942L348L09l437K308K089l972N03L694k717
2078e34j305L066n36k467L186j07l375K369K451l442p45L473j780j450K481n45
2094G40k674K816R01l681Q95L051k642j541L049p44k133K653K4l205K345K314
$$ plain form
2110 2168 -1413 -1774 1931 266 -1491 1023 828 -1277 963 1716 -1249 -33 2625 -236 -1643 1810
2126 1810 603 -1664 1032 1031 -2283 -85 1745 -1637 -1437 1949 -324 -2083 1149 581 -2577 439
2142 439 1462 -2059 -443 2400 -621 -1501 1800 568 -1103 1104 1133 -1291 926 1812 -1578 -788
2158 -788 1784 -583 -1565 1638 317 -1956 408 1196 -1486 -454 1122 -1071 -1577 1276 147 -1886
2174 -1886 442 998 -1370 289 1424 -833 -505 1769 194 -1387 1509 1222 -1606 92 1773 -778
2190 -778 -616 1513 -568 -1024 1720 106 -1982 831 1009 -2013 -396 1777 -1150 -1513 1813 -64
2206 -64 -2380 1024 1030 -1790 121 1145 -1175 -1 2113 -1200 -856 2462 325 -2159 1722 1484 -1661
2223 -1661 404 1805 -1262 -752 2074 -970 -1606 1401 45 -2192 589 455 -1972 394 1454 -1846
$$ packed form
2110B168l581l61L705j665j757K514j95k105K240P53k965J216K658k861j407L453
2126A810j207k267K696jl314K198J830l382K00L386k273j759L232n68l158L016
2142D39J023l521J616K843l021q80L301j232j671K207K9k424K217Q86l390P90
2158g88K572k367r82L203j321k273K364P88k682J032J576k193n06K853j129k033
2174a886K328N56k368J659J135k257L28K274j575j581K896k87k828J698J681k551
2190g78J62K129k081m56K744j614k088K813J78l022J617K173k927l63L326j877
2206f4k316L404Ok820J911J024k320J174K114l313L44L318k137k484L881k38l145
2223a661K065J401l067N10K826l044o36L007j356k237K781j34k427K366J060l300
$$ plain form
2239 -1846 -880 1949 -498 -1595 1529 765 -1498 720 1193 -1202 43 1466 -539 -320 1257 -199
2255 -199 -406 1193 116 -1182 244 997 -985 -661 753 -156 -1375 66 27 -633 -55 -91 -1007 -417
2273 -417 701 -59 -1032 379 786 -193 229 853 -32 15 1275 -107 -880 1126 939 -1245 277 1103
2291 1103 -796 -369 931 -688 -1139 1083 -10 -1858 443 508 -1671 310 1090 -1419 -503 2062
2307 2062 -565 -1362 1458 512 -1278 662 1008 -759 1075 1548 -1652 -131 2062 -758 -1416 1488
2323 1488 -25 -1409 904 -112 -1764 538 838 -1597 -165 1219 -895 -826 920 -387 -1121 747
2339 747 279 -1126 647 711 -626 163 689 -423 83 1021 -309 -252 570 437 -713 312 104 -231
2357 -231 265 -414 -128 484 -109 -659 32 -78 -532 -3 175 -700 -140 232 -172 422 353 -145 265 827
$$ packed form
2239a846R66K829k447j097L124p64k263K218M73k395J245J423k005K19J577j456
2255a99k07J599j077j298J426P53j982L24J414r09j219J441l9o60N78l6r16N90
2273d17J118p60r73J411M07r79M22O24q85M7J260j382p73K006j87k184J522Q26
2291A103j899M27J300j619m51K222j093j848K301O5k179J981P80k509R16K565
2307B062k627p97K820r46j790J940L46j767J834M73l200J521K193k820o58K904
2323A488j513j384K313j016j652K302L00k435J432J384k114O9J746j307p34J868
2339G47m68j405J773O4j337P89N26j112N06R38j330N7Q22j33j150J025k08l35
2357b31M96o79K86O12n93n50O91j10m54N29J78q75N60L72m04N94o9m98M10N62
$$ plain form
2377 827 -488 50 849 -10 -264 692 56 -607 583 200 -820 395 256 -1179 30 489 -748 -424
2395 -424 726 -588 -792 927 -73 -912 123 231 -920 297 491 -674 369 861 -556 132 1228
2412 1228 -214 -359 885 89 -390 566 239 -527 392 158 -916 266 529 -1018 -407 619 -807
2429 -807 -455 278 -531 -285 715 -201 -524 692 102 -504 726 333 -320 661 652 -462 397 999 -525
2448 -525 -196 883 -344 -242 723 -299 -986 812 55 -1024 245 374 -1066 -287 820 -984 -556
2465 -556 1107 -129 -710 1002 -188 -384 815 244 -1067 1018 1272 -953 -38 1272 -73 -445 869
2482 869 -206 -296 692 -23 -774 620 434 -1303 -312 730 -782 -391 391 -681 -519 435 -91 -795
2500 -795 295 141 73 132 259 -318 259 871 -156 -106 316 623 -36 -214 270 196 -257 -235 -38 57 -473
$$ packed form
2377H27j315N38P99q59k54R56o36o63J190l83j020J215j39j435J209M59j237L24
2395d24J150j314k04J719j000q39J035J08j151J217J94j165J043M92j417O88J096
2412A228j442j45J244p96m79R56l27p66R19k34j074J182K63j547O11J026j426
2429h07L52P33q09K46J000r16l23J216n90o06J230l93o53R81rj114Q59O02j524
2448e25L29J079j227J02R65j022o87J798p57j079J269J29j440P79J107j804M28
2465e56J663j236n81J712j190j96J199n71j311K085K54k225R15J310j345l72J314
2482H69j075r0R88p15p51J394j86j737R91J042j512L91P82j072J62R54n26p04
2500g95J090j54o8N9J27n77N77O12j027N0M22L07o59j78M84p4m53K2J97R5n30
$$ plain form
2521 -473 285 -316 -618 -70 116 -560 -275 155 -510 202 569 -836 -314 1350 152 -1060 735 686 -730
2540 -730 580 645 -629 97 1157 -705 -548 1361 66 -1226 782 128 -1450 257 647 -1251 -729
2557 -729 1097 -814 -1184 692 -381 -1037 822 283 -1470 813 845 -1349 11 1443 -566 -712 1482
2574 1482 -366 -693 936 822 -1336 159 1106 -739 -172 824 -760 -1164 914 -409 -1302 401 460
2591 460 -1129 -445 643 -400 -466 719 -125 -293 615 -14 -656 438 714 -527 415 1059 -227 -705
2609 -705 840 451 -685 343 714 -535 -254 577 -297 -627 324 -281 -998 208 533 -1163 -88 586
2627 586 -611 -797 754 125 -928 560 524 -789 780 997 -833 133 1204 -418 -590 1210 58
2644 58 -901 540 833 -1322 -29 988 -1157 -598 901 -405 -1016 632 210 -1319 442 509 -983
$$ packed form
2521d73P58o01l02N48J86o76K85M30o65P12L67j405N22J664j198j212J795m9j416
2540g30J310O5j274P26J060j862J57J909j295j292K008o54j578J707L90j898N22
2557g29J826j911l70J876j073o56J859n39j753K283L2k194J360J432k009j46K194
2574A482j848l27J629j14k158J495R47j845N67R96j584m04K078j323q93J703N9
2591D60j589O84J088j043o6J185q44j68R08o29o42J094K76j241R42O44j286m78
2609g05J545l89j136J028L71j249K81Q31q74l30R51o05p17J206L25j696J075O74
2627E86j197j86J551o29j053J488l6j313J569K17j830R66J071j622j72J800j152
2644E8r59J441K93k155J293J017k145N59J499j306o11J648m22j529J761O7j492
$$ plain form
2661 -983 109 987 -819 -578 1256 112 -929 1038 332 -758 529 949 -976 -228 1235 -352
2677 -352 -955 782 7 -954 699 292 -1334 5 1025 -924 -1018 998 -358 -1029 452 180 -866
2694 -866 427 462 -984 151 1111 -302 -454 1138 355 -785 991 588 -783 237 966 -649 -598
2711 -598 872 -220 -848 472 154 -1125 292 743 -1260 -275 874 -617 -802 508 29 -900 707
2728 707 365 -812 472 1463 -333 -127 1031 -292 -487 876 457 -610 487 756 -638 20 1093
2745 1093 -618 -608 504 -161 -786 266 81 -915 -201 473 -628 -308 771 -478 -441 648 20 -921
2763 -921 293 767 -752 -79 953 -17 -272 621 34 -440 544 295 -1049 75 554 -295 -360 522 -159
2782 -159 -795 318 65 -1064 203 328 -800 -132 780 -293 -371 850 -118 -806 877 464 -691 164
$$ packed form
2661i83J092Q78j806K41J834j144j041J967p06j090J287M20j925P48J463j587
2677c52o03J737p75r61J653m07j626J339J020j949r4K016j356o71J481k72j046
2694h66J293L5j446J135R60j413j52J592p83j140J776m03j371J020P29j615N1
2711e98J470j092o28J320l18j279J417M51k003R85J149j491j85J310m79r29J607
2728G07l42j177J284R91j796K06J158j323j95J363m19j067J097K69j394O58J073
2745A093j711J0J112o65o25J052j85r96P14O74j101L20J079j249L7J089o28r41
2763i21J214M74j519O73J032r70k55Q93n87m74R84k49j344J124M79q49o5Q82o81
2782a59o36J113k53j129J267J25j128O68R12j073p8J221r68o88J683m13j155Q55
$$ plain form
2800 164 1192 -438 -271 871 -174 -350 916 -134 -672 433 371 -935 -28 281 -754 -322 700
2817 700 -560 -914 559 125 -990 390 446 -650 271 714 -584 -93 630 -397 -264 704 155 -443
2835 -443 478 422 -277 147 64 -719 -390 -5 -252 -295 408 -150 -523 131 69 -380 -273 131 43 -322 74 67
2857 67 -163 8 -102 -18 -196 345 236 -12 220 363 68 -103 411 -13 175 246 135 -567 96 138 -487
2878 -487 0 273 -451 -240 234 -238 -600 292 134 -474 20 9 -357 215 804 -145 -302 642 105 -352
2898 -352 622 59 -300 174 350 -228 421 299 -580 -118 389 -543 -602 360 -94 -557 175 97 -623 -42 -174
2919 -174 -616 219 386 -291 158 547 -223 -165 497 27 -179 267 449 -179 381 74 -421 390 97 -420
2939 -420 -73 -17 -219 -173 -48 -419 -321 151 -275 -324 -29 -187 -110 344 -68 -526 466 478 -261 335 384 -145
$$ packed form
2800A64J028j630J67J142j045j76J266j050n38J105o2j306R07L09j035M32J022
2817G00j260l54J473m34j115J380N6j096R21M43j298M91P23j027J33R68n49n98
2835d43R21n6o99M24q3p83L29L85k47m3P03n58l73O54o2m49J07M04q8l65L96p
2857F7k30J71j10Q4j78N41j09k48K32J43k95j71N14m24J88P1j11p02O63M2o25
2878d87M87K73p24K11M74m72l62Q92j58o08M94j1l66N72N89r49j57R44n37m57
2898c52R74n63l59M74J76n78O49j22q79M62N07r32n9R62m54m63P32p8p20N81j32
2919a74m42Q35J67o77M49L89p70N8O62m70k06M46J82o28N60l07m95Q11k93n17
2939d20L47N6k02M6J25l71R8M72m26m9K95j58P7M54m12m58R92J2p39N96M9n29
$$ plain form
2961 -145 -46 414 189 -85 749 72 -3 453 -11 -374 78 109 -574 67 184 -401 -159 213 -185 -302 145
2982 145 54 -21 39 -125 -152 256 323 -251 -6 241 34 -180 433 374 209 134 5 115 -87 -36 -254 23 -313
3005 -313 -17 101 -312 25 -122 -450 -218 -95 -607 -449 293 24 -808 55 -32 22 294 299 -189 46 437
3026 437 -86 146 524 48 -360 685 122 -234 486 229 -839 -299 679 -511 -446 612 -370 -748 660
3045 660 -118 -697 334 266 -603 127 676 -433 13 912 -26 -265 631 66 -320 744 205 -586 640
3064 640 405 -576 9 973 -633 -192 633 -141 -588 234 175 -916 -35 113 -338 -223 327 -275 -229 413
3084 413 -92 -401 262 160 -387 179 254 -256 -144 655 296 -65 287 147 -171 47 386 -124 -242 173
3104 173 -215 -582 46 -145 -566 -295 280 -165 -416 275 333 -523 345 268 -188 34 355 -282 -100 797 178
$$ packed form
2961a45R9M60k25k74Q34o77p5M56m64l63M52L1o83O41J17n85K42L72l98j17M47
2982A45r1p5O0j64k7M08O7n74K45K47k07k14O13n9j65p5j29J10k02N1k18K77l36
3005c13K96J18m13L37j47l28K32J23n12J58P42k69q32Q63q7N4K72Nm88K35L91
3026D37n23K32L78m76m08J045n63l56P20k57j068N40R78j190O5J058r82l78J408
3045F60p78n79J031o8q69P30N49j109M46Q99r38k39Q96n65l86J064n39p91J226
3064F40k35r81N85R64j606M41Q25p74m47Q22n9j091Q81J48m51J15N50o02M6O42
3084D13n05l09O63j02n47N66P5n10J12P99l59l61L52j40l18K18L39n10j18M15
3104A73l88l67O28j91m21K71N75m45k51O91N8q56Q68p7m56K22L21o37J82Q97o19
$$ plain form
3125 178 -429 617 391 -571 446 621 -635 3 846 -581 -699 391 -210 -748 340 -133 -974 238
3143 238 445 -724 -307 781 -303 -375 507 62 -334 681 485 -618 194 684 -530 84 1026 -6
3161 -6 -128 603 -187 -778 278 511 -770 76 522 -327 -136 270 -485 -434 469 -187 -807 170 168 -327 98
3182 98 573 -372 -56 727 68 -580 418 407 -333 329 529 -429 -252 461 -93 -326 372 156 -573 341 496
3203 496 -729 -494 203 -251 -545 411 -65 -626 201 537 -364 -148 434 -172 -201 833 -217 -429 346
3222 346 191 -783 92 891 -407 -383 586 -217 -563 289 6 -454 219 247 -895 -15 403 -473 -444 608
3242 608 -118 -539 593 34 -733 247 671 -391 -49 701 49 -129 803 94 -307 437 351 -573 261 633
3262 633 -484 -416 403 -225 -578 200 -73 -666 203 186 -673 21 396 -500 -405 595 122 -241 370 364 -240
$$ packed form
3125A78o07J046k26r62J017J75j256O38Q43j427j18J090o01n38J088m73q41J212
3143B38K07j169M17J088j084p2Q82m45l96J015j96j103Q12M90j214O14R42j032
3161fj22P31p90n91J056K33j281Q46M46q49J91M06p55N1R03o56o20R77km95M25
3182I8M75r45L16P83o59o48R98j1p40O62K00r58J77P13n54k33O98k16p29R14J55
3203D96j225K35O97m54k94R56m76n61Q27L36r01K16N82o06k9J034j050k12P75
3222C46j55r74Q75P99j298K4R69q03l46Q52k83m60O73K8j142Q80M18q76K9J052
3242F08p26m21J132n59p67R80M24j062L42P50o52j78R32p09m01P44q6r24Q34L72
3262F33j117O8Q19o28l53P78k73n93Q69j7q59O94L75q96R5J000m73l63O11oo04
$$ plain form
3283 -240 44 585 -71 -6 657 146 67 530 213 -296 360 274 -342 -165 429 -459 -226 139 -84 -565 173
3304 173 219 -428 -143 114 -465 -231 181 -349 -232 390 17 -298 389 312 -377 190 496 -477 34 200 52
3325 52 -521 76 74 -392 69 217 -300 -58 145 -459 -232 403 -17 -383 296 140 -394 172 179 -12 29 233
3347 233 22 -37 313 135 96 237 346 -315 -193 491 -318 -267 -118 172 -136 36 17 -298 -213 50 -420 45
3369 45 72 -152 -440 108 242 -329 106 395 -182 -53 151 104 126 178 60 -123 257 168 -413 243 313 56
3391 56 -130 369 -219 -292 22 -110 -520 -145 -8 -352 -233 185 -82 -95 201 -168 13 423 150 -142 238
3412 238 325 58 148 195 67 14 36 217 359 205 -228 21 86 -342 -175 -24 -53 -363 -32 -117 -272 146 -36
3435 -36 -147 -24 98 -98 5 -71 -39 188 368 -88 197 50 -41 161 24 27 75 259 220 -131 -38 42 -157
$$ packed form
3283b40K84N41o56O5O63n11p9M63l17n09O56q6o16J77N94q88K33L65k23m81P38
3304A73M6o47K85K57n79K34M12n30J17O22l73l15O87p7o89N67L06r73N11J66j48
3325E2n73N97km66M61J48n17K42K03o04K27O35m20l66O79j56n34N66Pj91M1K04
3347B33k11n9L50j78l9J41J09o61J22O84q09N1J49K90l08J72j9l15Q5K63m70M65
3369D5K7k24k88N48J34n71M35K89n77J29K04m7K2N2j18j83L80q9n81O56P0k57
3391E6j86M99n88p3L14j32m10L75J37l44J19M18k67j3K96l69J81M10k73k92L80
3412B38Q7k67R0M7j28n3K2J81J42j54m33K49O5m28J67J51k9l10L31q5j55M18j82
3435c6j11J23J22j96J03p6L2K27J80m56K85j47r1K02j37LM8J84l9l51R3Q0j99
$$ plain form
3458 -157 164 101 -72 -29 -167 71 123 -30 6 4 -163 -201 -166 -9 -37 -231 -7 178 -259 -15 147 -69 -144
3481 -144 85 102 -150 26 -192 35 264 214 -123 247 94 -56 -207 -67 -258 -14 36 21 70 115 -20 -1
3503 -1 164 143 -238 279 193 -133 246 -2 12 224 -113 -295 141 40 -401 -150 189 -317 -114 94 -59 -340
3525 -340 271 -157 -80 22 -53 -326 84 69 -327 80 227 -406 -439 330 -57 -222 289 122 -289 376 502
3546 502 -78 106 332 -302 -9 388 -186 -138 180 131 -627 164 -64 -233 -20 128 -391 -339 31 -384 -376 268
3568 268 50 -81 489 200 -300 192 334 89 75 118 238 -53 437 80 -166 74 222 -111 -217 60 -191
3589 -191 -212 132 422 -354 -127 175 -175 -242 -12 -177 -331 184 48 -260 143 114 -103 155 212 -31 -300
3610 -300 121 222 -207 99 469 -383 -29 137 -301 -223 114 147 -494 355 117 -464 -13 272 -290 -60 10
$$ packed form
3458a57L21o3j73M3j38K38N2j53L6kj67l8L5J57k8j94K24J85m37K44J62k16p5
3481a44K29J7k52J76k18K27K29n0l37L70j53j50j51J40j91K44N0j5M9M5j35J9
3503aJ65k1l81N17q6l26L79k48J4K12l37j82M36j01m41K51L39n06K03K08j53k81
3525c40O11m28P7J02p5k73M10j5l96M07J47o33l3P69l87j65N11j67m11O65J26
3546E02n80J84K26o34K93L97n74M8L18m9p58P91k28j69K13J48n19N2L70m15QO44
3568B68k18j31N70k89n00M92J42k45j4M3J20k91M90l57k46K40J48l33j06K77k51
3589a91k1L44K90p76K27L02l50o7K30j65j54N15j36l08M03k9k17K58N7k43k69
3610c00M21J01m29L06L70q52L54J66m38P8L37L3o41Q49k38n81M51K85n62K30P0
$$ plain form
3631 10 -169 -171 402 -76 -364 294 -8 -250 -130 374 -115 78 636 -210 -295 456 -52 -314 355 142 -234
3652 -234 238 222 -103 -280 224 -167 -336 250 -161 -320 264 188 -258 -105 334 -50 -28 433 -17 38 369
3673 369 29 -179 194 516 -156 -40 215 -59 17 353 224 -302 163 120 -238 -68 231 -296 -322 33 -113
3694 -113 -531 149 111 -380 13 532 -187 -81 444 98 -51 231 284 -500 239 287 -80 43 402 -110 -147
3715 -147 181 56 -243 115 270 -387 -138 290 -339 -177 297 -219 -364 147 68 -326 191 47 -385 109
3735 109 484 -17 -263 422 15 -160 285 124 -477 115 149 -319 -121 35 -147 -281 228 -81 -511 91
3755 91 -48 -405 -75 220 -303 -14 152 161 -128 348 189 -293 -23 103 13 33 357 -168 -181 223 109 -350
3777 -350 313 -84 -374 -47 385 -159 -124 90 -82 -85 47 -161 -374 -49 -49 -401 37 331 -375 -362 49 224
$$ packed form
3631A0j79kN73m78k88O58l02k42J20N04m89J93N58q46q5P51n08k62O69k13l76
3652b34M72j6l25j77N04l91j69N86m11j59N84p6m46J53M39l84K2M61m50N5L31
3673C69l40k08L73L22o72J16K55k74P6L36j29n26M65m3l58J70K99n27k6L55j46
3694a13m18O80l8m91L93N19p19J06N25l46j49K82N3p84P39M8l67J23L59n12l7
3715a47L28j25k99L58J55o57K49M28o29J62M74n16j45N11p9l94N17j44m32M94
3735A09L75n01k46O85m07j75M45j61o01N92L4m68J98J56j82j34N09l09m30O02
3755I1j39l57L30K95n23K89J66Rk89M76j59m82K70J26r0K0L24n25j3M04j14m59
3777c50O63l97k90L27M32n44L5K14j72lJ32k08k13L25%l52M38K94p06J3M11J75
$$ plain form
3799 224 -268 372 253 -279 -79 295 25 -3 486 -24 -93 110 0 -524 -7 126 -378 -7 268 -231 -25
3820 -25 63 -107 -311 204 19 -320 -183 90 196 143 311 -30 -379 385 301 267 239 70 -128 56 164 -27
3842 -27 -58 274 -220 24 110 54 -154 229 108 -478 -28 483 -16 -191 334 187 -395 419 27 -58 40 170
3864 170 -133 73 372 -116 -192 -70 88 -251 228 65 13 -22 330 -180 -123 89 100 -160 -185 -21 -137 13
3886 13 -135 -401 -71 195 -32 -174 291 -123 -24 334 144 22 -20 314 93 70 47 -161 -63 37 -16 -133
3908 -133 80 142 -244 -214 36 -12 -109 78 139 -156 -33 180 -70 0 148 136 -49 -255 -211 228 356 122 -39
3931 -39 160 29 177 -114 -230 184 152 65 -44 158 91 -250 -4 -21 73 -112 -101 -11 -234 82 -108 142 -22
3954 -22 20 -3 -101 -195 1 338 109 81 199 -207 107 -43 79 201 105 -85 -215 321 58 163 -11 23 -362
$$ packed form
3799B24m92O40j19n32K00L74k70k8M89n10o9K03j10n24N17J33n04L71K75m99K06
3820b5Q8j70k04N15j85l39J37K73J06n3J68l41l49P64q4l4k8j69j98J84J08j91
3842b7l1L32m94K44Q6n6k08L83j21n86M50N11m99j75N25j47n82Q14l92q5R8J30
3864A70l03K06K99m88p6J22J58l39M79j63n2l5L52n10N7K12J1k60k5J64j16J50
3886A3j48k66L30K66k27j42M65m14R9L58j90j22m2L34k21k3k3k08R8J00n3j17
3908a33K13O2l86L0K50m8r7J87O1k95J23K13k50P0J48j2j85k06M4M39J28k34j61
3931c9J99j31J48k91j16M14l2q7j09K02o7l41K46j7R4j85J1R0k23L16j90K50j64
3954b2M2k3r8r4J96L37k29k8J18m06L14j50J22J22r6j90j30N36k63J05j74L4l85
$$ plain form
3977 -362 33 82 123 -170 147 -125 -53 9 -339 -73 1 -126 31 -41 -251 202 36 29 241 90 175 86 10 227
4001 227 14 279 73 42 98 94 33 -198 94 -85 -139 -91 -102 62 -72 112 -250 1 -11 20 99 -119 -13 -265
4025 -265 164 -188 1 -2 -57 -76 363 39 106 376 191 81 -154 237 175 -227 -33 -260 -230 -227 48 -65 -86
4048 -86 -35 44 -82 211 232 -20 -61 -138 -26 84 256 -27 -36 10 207 60 318 -4 165 208 26 65 -10 76
4072 76 -114 -234 -92 -458 -146 131 95 141 119 117 -45 -87 -155 40 56 -86 89 278 177 144 116 -92 206 -21
4096 -21 -196 181 103 278 -203 207 19 94 234 21 -409 129 40 -209 -151 127 -374 -356 -165 -182 -271 -92 26
4119 26 -76 46 11 -126 115 221 -178 73 346 140 -102 317 40 -164 284 123 -332 -78 394 -137 -230
4140 -230 201 -231 -133 232 -448 -411 326 120 -141 -131 198 -50 50 182 -11 -382 199 181 -157 280 211 -219
$$ packed form
3977c62L95M9M1k93L17k72P2O2l48K66P4j27J57p2k10M53j66pK12j51Q5q9p6K17
4001B27k13K65k06l1N6mo1k31K92j79n4M8j1J64j34J84l62K51j2L1P9k18J06k52
4025b65M29l52J89ln5j9M39l24O7K70j85j10k35L91o2m02J94k27L0LK75j13k1
4048h6N1P9j26K93K1k52m1p7J12J10J72k83rM6J97j47K58l22J69M3j82L9p5Q6
4072G6j90j20J42l66L12K77l6M6k2kj62m2o8J95J6j42J75J89j01l3k8k08K98k27
4096b1j75L77p8J75m81M10j88P5J40k13m30N38q9k49N8K78n01J8J91j7q9J79J18
4119B6j02J22l5j37K41J06l99K51K73k06k42M19k77k04M48j61m55K54M72n31r3
4140b30M31m32R8L65o80L7P37k06k61J0L29k48J00J32j93l71N81j8l38M37o9m30
$$ plain form
4162 -219 -34 342 -3 -131 266 122 -137 110 -60 74 -172 75 -56 -451 49 -259 -42 128 40 -79
4182 -79 -29 182 -31 -266 373 169 -101 145 100 101 -95 113 139 121 371 71 -83 192 -41 -76 -73 73 -58
4205 -58 -146 315 2 -531 253 -90 -168 104 -27 -143 6 131 -144 -27 156 181 0 105 15 -158 155 70
4227 70 -200 86 279 -160 -17 48 -50 102 -57 -21 -150 327 19 -402 153 110 -288 -23 172 51 -257 25
4249 25 296 -302 26 47 -106 323 204 -142 -228 257 -167 49 356 230 247 -131 138 -102 -310 175 24
4270 24 -105 170 -157 -23 -91 141 -267 148 530 -21 -50 203 -129 -33 -45 95 -137 -52 265 80 12 -83 38
4293 38 -313 160 -150 -138 256 -201 -75 -137 61 -368 -197 69 33 -257 -147 201 -89 -106 245 -30 -3 115
4315 115 -378 51 416 220 -130 79 183 -38 213 -10 83 21 269 -171 58 89 -212 -296 -57 216 -394
$$ packed form
4162b19J85L76l45j28L97j44k59K47j70J34k46K47j31l95N00l08K17J70q8j19
4182g9N0K11k13k35O39k04k70K46m5Jj96K08K6j8K50l00j54K75k33l5LJ46j31
4205e8q8M61l13n33P84l43p8K72j31j16J49J25k75J17J83K5j81J05r0j73L13q5
4227G0k70K86J93m39J43O5r8J52j59L6j29M77l08m21N55m3l98K65J95j21l08K82
4249B5K71n98L28K1j53M29j19l46q6M85m24K16L07j26J7l78K69k40k08M85j51
4270B4j29K75l27J34o8K32m08M15L82n51k9K53l32R6j2J40k32Q5L17j85o8r5J21
4293C8l51M73l10J2L94m57J26o2J98m29J71K66l6k90J10L48k90j7L51k75K7J18
4315A15m93M29L65j96l50K09J04k21K51k23R3o2K48m40K29L1l01q4K39K73o10
$$ plain form
4336 -394 -77 252 209 -317 169 -5 -226 248 102 -254 135 255 -48 96 93 -117 -57 374 155 -11 37 156
4358 156 -169 155 258 -143 -123 253 -113 -6 111 -126 -188 66 71 -21 -197 172 -11 8 141 -269 -123 90
4380 90 -88 117 70 262 20 165 167 30 -217 132 -40 -327 88 -55 -160 -266 176 36 -143 -276 -69
4401 -69 -78 -261 -133 -238 101 13 -262 -385 -203 -26 -388 -127 279 75 38 20 137 97 -29 175 -117 291
4423 291 56 -193 -135 40 -48 -100 185 -235 130 -244 96 -189 58 -89 -107 -60 33 -230 83 -99 -51 130
4445 130 172 302 -62 -18 303 19 25 207 37 362 80 135 -65 -30 106 -142 -169 260 121 9 236 106
4467 106 -353 76 139 -114 203 45 212 -156 10 51 63 -31 -28 151 188 -54 31 177 164 -53 -76 -251 220
4490 220 -24 -71 -73 -83 -50 84 259 -9 -101 -141 -221 12 105 -116 -147 -225 59 -111 -99 -12 84 -39 172 145 -67
$$ packed form
4336c94L17L29m3n26M86j74k21M74j46l56L89J20l03J44lk10O0M31k19j66M8J19
4358A56l25L24J03m01K0L76l66J07J17k37o2K54Nr2j76L69j83J9J33m10J46K13
4380I0j78K05m7J92k42J45Kj37k47L49j72k87M15j43j05j06M42j40j79j33K07
4401f9rj83J28j05L39q8k75j23J82J77l62K61M06k04l7j8J17m0j26K04k92M08
4423B91k35k49N8J75q8n2K85m20L65l74L40k85K47j47j8M7R3k63L13j82M8J81
4445A30M2J30l64M4L21k84OJ82j70L25k82N5k00L5J36k48k7M29j39j12K27j30
4467A06m59M29O3k53L17j58J67l68J66M1J2r4LJ79L7k42Q5J46j3k17k3j75M71
4490B20k44m7kj0L3J34J75k68r2m0q0K33R3k21l1p8K84j70J2Q7R6j23K11k7k12
$$ plain form
4515 -67 -30 201 -105 30 143 -302 -140 -4 -131 27 -317 -126 16 -62 -31 17 86 39 -263 102 120 -161 -169
4538 -169 -63 87 -186 8 -101 9 -52 184 108 88 -30 282 -298 80 114 -275 257 -30 6 -26 124 305
4560 305 -63 -147 128 -186 -94 -122 83 -229 186 117 17 -330 84 -98 -178 97 90 -39 -321 46 -153 267
4582 267 75 -146 48 -1 190 137 -153 23 -51 30 26 -351 -135 -19 35 67 -12 52 -231 -122 -231 108 224
4605 224 -77 -211 -2 2 -215 218 123 78 -40 -39 200 -189 -32 -112 38 -26 186 -24 -267 -92 -89 -292 -59
4628 -59 108 -82 -27 -46 0 -11 -136 -56 -68 38 110 -184 95 -16 77 -189 29 279 -36 215 12 201 -35
4651 -35 -195 -213 86 -22 53 110 -247 -206 3 45 73 -35 16 -5 -52 -149 -108 112 199 111 89 -194 162 -89 -30
4676 -30 308 111 57 -191 -70 -1 -168 152 -148 147 -211 211 -70 158 211 -185 -70 -238 60 56 9 -118
$$ packed form
4515f7L7K31l06J35J13m45J62J36j27J58l44J91J42p8L1M8O9m7l02L65J8k81q
4538a69J06J50k73J94j09J10o1K36p6k0j18L12n80L78L4l89N32k87L6l2J50J81
4560C05l68q4K75l14R2k8K05l12M15o9j00l47M14j82q0K75pj29k82L67j99M20
4582B67j92k21J94m9J91n3k90J76p4Q1ml77K16J16N4L2p9O4k83J09j09L39J16
4605B24l01j34K09Mk17M33r5m5j18JK39l89J57q0J50o4K12k10k43J75Lk03K33
4628e9J67j90N5j9M6j1j25Q0j2J06P2k94K79j11R3k66K18K50l15K51k03J89k36
4651c5j60j8K99j08P5N7l57M1K09M2K8j08N1k1m7r7M1K20Q7q8k2k83L56k51N9
4676c0L38j97n4k48J21O9j67L20l00K95l58M22k81K28N3l96J15j68K98mm7j27
$$ plain form
4698 -118 -248 -258 -4 -383 -115 -66 -44 -148 373 303 -125 25 262 -323 232 -82 41 2 105 34 -415 20
4720 20 10 -318 13 41 -160 89 87 -182 -315 282 193 -312 266 154 45 70 50 -275 -243 113 -143 72 240
4743 240 -55 -74 115 156 -106 -148 -223 -295 46 -114 -81 -4 -88 118 -160 50 -19 -136 -147 -55 -6 -207 55 -108
4767 -108 109 -84 180 -195 252 17 11 2 146 170 -219 100 144 -128 62 95 -103 -136 403 -137 -242 148 -261
4790 -261 -117 -159 -149 -491 251 192 -60 -343 197 43 -124 300 153 -98 160 209 -182 -39 76 121 -10 125
4812 125 131 -70 275 82 -133 237 -42 208 -45 65 -103 -304 -228 39 -396 -46 -101 -480 -31 87 -176
4833 -176 -127 210 -172 35 175 118 -78 124 124 3 -77 174 57 -72 125 40 -3 -20 -136 -71 9 106 -73 -209
4857 -209 129 -25 -125 200 -62 -279 -4 199 37 -148 -35 -83 -32 133 143 38 -263 94 -296 72 -69
$$ packed form
4698a18j30j0K54l79K68M9K2j04N21p0m28J50K37n85N55l14J23l9J03p1m49M35
4720B0j0l28L31K8k01K49kk69j33N97q9n05N78j12j09K5k0l25L2L56k56K15J68
4743B40k95j9J89M1k62m2p5p2L41j60L3P7q4K06k78K10o9j17j1R2M9k01K62j63
4767a08K17j93K64l75M47k35orJ44K4l89L19M4k72J90L3j98l3N39n40j05L90m09
4790b61J44m2J0l42P42n9k52k83N40j54j67M24j47k51K58M9l91J43J15M5j31J35
4812A25Ok01L45j93k15L70k79K50k53J10j68k01P6K67m35L50n5l79M49J18k63
4833a76M9L37l82K07J40n7j96K02%j21q0K51j17j29J97q5m3j7j16O5Q0R7j79j36
4857b09L38j54j00L25k62k17K75K03j62j85J13m8N1J65J0j05l01L57l90L68j41
$$ plain form
4878 -69 -133 12 352 116 -104 221 -103 -297 -189 58 46 -4 -153 -131 -35 -11 -38 20 128 247 -100 195 -20
4901 -20 -13 199 143 154 -53 18 17 181 133 249 -4 12 201 -81 113 61 73 -82 -211 103 -68 110 -58 116
4925 116 -32 266 -115 31 142 26 -33 251 11 -96 12 -42 -4 -2 286 -125 97 115 -98 -87 7 124 22
4948 22 88 -126 68 -104 179 -229 -221 -75 -178 -204 -51 71 135 72 119 -120 3 65 107 -100 -17 -85 -96 100
4972 100 126 -59 -55 -121 -103 -263 78 3 -282 49 67 -77 -213 122 -52 -157 -183 66 -178 -227 -39 122 30
4995 30 31 108 12 122 -96 55 95 -235 160 46 142 29 -130 57 -2 26 102 -117 -67 -53 -198 -68 -82 -27 -190
5020 -190 228 -63 -242 -229 -2 -123 44 250 149 7 416 208 2 -56 82 -152 92 63 -214 151 -4
5041 -4 -215 -62 43 -23 19 -83 -130 36 -23 -219 14 40 -160 91 -207 143 62 -77 -5 119 275 -80 -15
$$ packed form
4878f9o4J45L40k36k20L25l24j94J08K47j2n0j49K2R6K4k7N8J08J19l47K95k15
4901b0PK12n6J1k07P1jJ64m8J16k53J6J89k82J94n2J2j55j29L14j71J78j68J74
4925A16j48K98l81J46J11j16n9K84k40j07J08n4L8KK88m11K22J8k13J1R4J17j02
4948B2O6k14J94j72K83m08QJ46j03k6J53J22O4o3M7k39J23O2M2k07Q3o8j1J96
4972A00K6j85Mo6J8j60L41p5k85L31J8j44j36L35j74j05k6K49k44m9J88J61r2
4995C0JP7r6J10k18J51M0l30L95j14R6j13j59J87n9K8P6k19N0J4j45J30j4N5j63
5020a90M18k91j79J3K27j21J67K06j01j42M09k08k06n8J38k34K44k9k77L65j55
5041dk11J53J05o6M2j02m7J66n9j96K33K6k00K51k98L50q1j39P2J24J56l55O5
$$ plain form
5064 -15 99 -102 10 -46 -26 -15 -103 33 95 16 -156 158 148 53 -52 -84 143 -103 139 32 18 -13 -43 -138 -12
5089 -12 62 24 -34 -3 -49 101 123 -47 -189 -129 15 87 27 35 -16 91 251 -132 7 32 -71 -75 71 -63 46
5114 46 -200 155 -100 -318 -70 -156 -127 118 -50 -22 21 144 0 68 354 -186 127 125 136 45 157 63 -191 -49
5138 -49 57 -165 -235 48 -66 -207 -170 61 -193 277 -3 -294 -44 -62 33 -60 124 -99 -7 342 109 -50
5160 -50 132 -152 267 -127 171 85 40 -183 68 92 184 114 1 129 282 -154 -44 38 -154 -97 -99 120 -149
5183 -149 -87 12 80 206 -239 -92 -108 162 134 -33 30 220 67 -167 114 -57 173 22 -112 5 34 150
5205 150 -100 -30 76 -233 -90 63 -114 13 123 -207 -243 113 118 -34 -25 -54 -250 197 311 123 111 95 -135
5228 -135 -91 -8 108 -25 132 -144 -73 108 177 -69 -331 -60 -91 -160 31 -117 -104 -366 166 130 -46 8 -42
$$ packed form
5064a5J14k01J12n6K0J1q8J36O2p9j72L14j0r5j05l2K27k46K42j07j4l1l0r5J26
5089a2P4l8n8L1m6J50K2j70j42O0J44P2o0Qn1J07J60l83J39K5j03mJ46j34J09
5114D6k46L55k55k18K48q6K9K45j68K8M3J23j44O8K86n40L13kJ1r1J12r4k54J42
5138d9J06k22p0K83j14j41L7K31k54M70k80k91K50j8R5r3J84k23R2L49k33j59
5160e0J82k84M19l94K98q6m5k23K51K4R2p0j13J28J53m36J10Q2j92N7kK19k69
5183a49O2R9O8J26m45J47j6K70k8j67O3J90j53k34K81j71K30j51j34J17K9J16
5205A50k50P0J06l09J43J53j77J27J10l30l6L56Nj52Rk9j96M47J14j88j2j6k30
5228a35M4Q3J16j33J57k76P1J81O9k46k62K71l1o9J91j48J3k62N32l6j76N4n0
$$ plain form
5251 -42 138 78 37 -126 48 143 -33 -5 122 30 -195 283 188 144 18 81 -8 77 82 -8 -43 -31 145 -3 -10 1
5277 1 -35 -29 -126 19 -215 40 28 15 154 45 40 -66 -54 -120 40 55 -192 -167 178 155 10 126 -330 -281 -288 -89
5303 -89 36 13 -9 -137 -72 -26 -338 -28 -24 173 -141 161 267 -330 185 -153 114 -101 121 194 -49 119 -150
5326 -150 -155 38 -12 -26 14 166 31 275 80 156 -156 -186 -6 -139 -127 -134 -90 -304 75 63 -221 199 30 -127
5350 -127 289 274 250 88 140 189 -126 221 -95 96 142 215 -27 -28 348 151 -217 -118 154 -80 -77 168 -95 -10
5374 -10 -53 43 -158 129 37 -102 109 93 124 39 60 -206 -57 232 132 -145 125 -32 33 203 -49 -139 -238 182
5398 182 245 -45 -44 116 -101 -18 23 -6 -13 -91 55 -138 -60 -314 -222 -43 -91 -16 10 33 111 195 166 -57 -194 -102
5424 -102 102 -86 -32 70 -53 -16 -2 -63 15 29 -205 -47 -30 -36 66 -273 196 13 -130 82 -74 -349 -46
$$ packed form
5251d2J80o0m1j63J74R5j76K8J27r2k25M78r5m4j26O3q9Q5Nr0l5J2J76j48pJ1
5277Al6Or7J45k34K55j2j3J39j09nj06J2o6J60J5k47K5L45k3j45J16m56M9pJ99
5303h9J25k3k2j28O5M6l12L10MJ97l14L02J06n97N15l38K67k15K22P3k43J68k69
5326a50nJ93n0j4M0J52j35K44j95P6l12l0J80j33J2pM4k14L79j2k84M20j69j57
5350a27M16j5k4j62N2M9l15L47l16J91M6P3k42jL76j97l68R9K72k34LK45k63Q5
5374a0m3R6k01K87r2j39K11j6L1q5K1k66J49K89j00k77K70j57O5J70k52r0r9M20
5398A82O3k90JJ60k17Q3M1k9pp8J46j93P8k54R2J79m8P5K6K3P8Q4k9k23j37R2
5424a02K04j88N4J02j23L7J4o1P8J4k34J58J7oJ02l39M69j83j43K12j56k75L03
$$ plain form
5447 -46 93 138 393 70 -72 76 106 72 144 2 175 -52 192 16 -216 87 11 -51 -71 145 -71 -247 156
5470 156 -21 152 -42 158 72 -205 -115 -109 -349 154 -105 -347 421 144 54 57 205 -115 -35 -35 -110 66 146 196
5494 196 -140 180 -265 -287 -40 -111 -154 25 39 -159 -29 -39 -43 211 -89 90 -35 -109 193 141 -245 44 239
5517 239 155 113 -57 -92 87 -60 240 75 161 97 -22 176 -141 -105 -134 -204 -127 89 -186 -150 -44 -104 -53 114
5541 114 -145 -27 52 -97 -187 -6 -115 119 128 -1 236 25 62 76 13 195 29 -325 -89 49 58 -38 58 55
5565 55 -65 18 -146 -225 -25 -81 15 -44 70 -82 -8 156 -182 -73 14 12 -216 -258 -140 96 394 91 96 1 105
5590 105 -22 55 124 66 -180 -4 6 -118 123 91 -66 -23 52 -147 165 103 101 -163 -133 86 -91 -123 -31 -5 238
5615 238 90 -120 76 83 114 -22 224 -62 104 -307 192 -115 44 63 -241 -27 217 26 -69 -137 -66 9 -14
$$ packed form
5447d6J39M5K55l23j42J48L0l4P2j42J73k27K44j76k32L03p6o2k0K16k16j76M03
5470A56j77J73j94K00q6k77R0Ok40N03k59k42P68k77r0LJ48l20Q0%p5J76Q0N0
5494A96l36L20m45k2K47p1m3J79J4j98J30j0mK54l00J79j25p4L02n2l86K89J95
5517B39q4m2j70l5J79j47L00j65Q6o4j19J98l17L6k9p0P7K16k75L6J06o0N1J67
5541A14k59J18P9j49r0J81j09K34Rj29K37k11L7J4o3J82j66l54K36J38Rr6R6l
5565E5j20Q3j64p9K00n6R6n9J14j52P4J64l38J09Q7kk28m2J18K36K98l03Nr5J04
5590A05j27P7O9n8k46J76J0j24K41l2j57M3P5j99L12o2kk64L0K19j77l2R2K6K43
5615B38j48k10J96PL1j36K46k86J66m11M99l07J59J9l04K14K44j91r5o8P1P5k3
$$ plain form
5638 -14 -208 -44 4 -58 142 -22 198 103 -175 188 -4 58 -2 143 209 39 57 -84 -223 -162 37 -84 -26
5661 -26 290 -57 -345 82 -270 -231 47 148 -244 105 206 164 -251 -138 59 -59 224 29 -108 252 193
5682 193 -93 -157 66 38 190 -217 349 12 -182 118 -27 -188 -123 154 2 115 -200 -145 -54 102 -218 162
5704 162 78 11 -21 206 52 -60 296 -94 -97 235 289 74 -153 48 -213 -161 69 64 -93 200 46 19 -347
5727 -347 -243 15 -246 46 -7 4 222 114 -28 -29 52 44 186 67 60 -33 81 135 -181 28 -26 -114 57 200
5751 200 32 -87 -77 -3 -111 -256 -152 -330 -61 -58 -80 -80 201 -43 -46 -129 -52 40 -263 -165 182 189 179 36 -123
5776 -123 -112 -80 9 27 -80 -51 65 169 -6 85 52 98 -186 -186 31 -112 -45 -167 -59 8 20 81 -38 86 -13
5801 -13 22 47 87 -64 45 234 -77 30 -1 -123 179 54 -135 120 133 -29 33 -178 -79 235 -75 5 -63
$$ packed form
5638a4j94J64M8o2K00j64K20r5k78L63j92O2o0J45O6j70J8j41j39O1J99j21N8
5661b6L16l47k88M27l52L9K78J01l92L49J01m2m15J13J97j18K83j95j37L60n9
5682A93k86o4K23k8J52m07N66l37j94L00j45j61O5K77j52J13l15N5R1J56l20L80
5704A62q4o7l2K27j54j12L56l90lL32N4k15k27K01k61N2K30nj57K93j54k7l66
5727c47J04K58k61K92n3J1K18j08j42jQ1qJ42j19pr3J14N4l16K09n4q8J71J43
5751B00j68j19J0P4j08j45J04j78K69Lk2%K81k44lq3P7R2l03R8L47Pj0j43j59
5776a23J1L2Q9J8j07K9J16J04j75R1l3M6k84%K17j43O7j22J08O7J2O1j19J24r9
5801a3L5K5M0j51J09J89l11J07l1j22L02j25j89K55J3j62O2k11R9L14l10Q0o8
$$ plain form
5824 -63 72 -175 202 -41 -1 110 107 55 -93 52 4 272 113 179 -47 190 -51 109 148 136 -58 -118 149
5847 149 -202 -105 -189 60 126 248 -10 -211 140 -263 30 -61 -136 -14 34 -80 140 -24 -225 -64 92 48
5869 48 30 -134 -54 -29 -115 67 -91 299 300 -88 132 164 89 125 -276 -72 8 21 -97 34 -49 -65 -84 -356 -165
5894 -165 -176 291 -51 -22 75 201 93 -160 -96 -262 -40 -17 -110 192 152 33 -134 -44 92 209 12 -135 -45
5917 -45 -71 141 63 114 71 -104 -247 19 -252 273 57 -57 84 323 247 -111 -258 62 -149 -7 122 104
5939 104 -74 230 121 100 -37 64 182 10 43 -26 38 40 52 -144 0 15 -101 35 -156 -26 -142 -146 31
5962 31 107 60 -89 7 50 -113 -21 -43 -76 -140 -181 -3 -325 40 42 88 -84 132 -264 -220 182 134 23 -271 -63
5987 -63 -61 -34 -116 107 -114 128 -103 -51 -274 276 -58 -130 143 -65 129 309 294 121 188 282 18 -170 66
$$ packed form
5824f3J35k47L77k43M0J11ln2j48J45m8K68j59O6k26K37k41J60L9j2j94o0K67
5847A49l51R7q4K49O6J22k58k01L51m03K93r1p5J22M8j14K20j64k01J61J56m4
5869D8j8j64Q0K5q6J82j58L90Jl88K20L2p5L6m01K04Q0J3j18J31q3j6j9k72J91
5894a65j1M67l42K9R7J26j08k53O4j66K22K3r3L02m0j19j67R0J36J17j97j47R0
5917d5k6K12p8N1m3j75j43K66k71N25k16j14J41K39p6l58j47L20k11J42J29j8
5939A04j78L04j09k1j37J01J18j72L3o9O4KJ2j96J44J5j16J36j91J30j16mJ77
5962C1P6m7j49R6M3j63R2k2l3o4m1J78l22L65KM6j72K16l96M4M02m8j11k94K08
5987f3KK7q2K23k21K42k31N2k23N50l34p2K73k08J94J80j5j73O7R4k64j88K36
$$ plain form
6010 66 76 -158 91 17 -182 -2 -225 12 -77 62 -217 -160 28 128 -278 190 91 107 77 -14 10 227 49
6033 49 269 35 147 15 193 92 -98 -51 -169 -65 -158 -19 -127 180 -72 -25 -144 -107 -112 -179 -134 -175 27
6056 27 -7 -130 27 61 -47 123 -41 -193 -122 -270 -28 3 -1 -143 48 44 -133 -92 249 -21 113 -3 50 115
6080 115 -197 -227 -248 248 13 78 27 -59 -121 -92 139 -157 0 108 -115 -74 172 257 -19 49 -41 27 85 71 -121
6105 -121 -205 -167 -220 -10 143 118 56 136 165 -37 40 -94 -84 69 -150 -180 81 -96 5 76 20 54 66 36 83
6130 83 241 -90 -20 6 -10 -67 12 -17 102 -119 89 117 -214 67 11 -161 41 -266 81 -225 72 6 48 -84
6154 -84 -181 -133 98 17 41 63 19 34 122 7 119 18 -79 -204 171 -22 -105 122 -96 -29 183 -34 213 18
6178 18 117 -159 -183 35 52 -119 117 83 -159 82 -21 248 -106 103 -61 -76 -112 49 -140 61 -17 -51 89
$$ packed form
6010F6J0k34K49p4j99J80k23K37q9J39k79N7J88J00m06M68r9J6l0r1K4K17j78
6033D9K20k34J12j32J78j01j90M7j18J04r3J39j08L07k52M7j19L7no7M5m1K02
6056B7l4j23J57L4j08J70j64j52P1j48K42L1mj42J91mj77M1L41k70J34j16N3O5
6080A15l12l0k1M96k35O5n1q6o2K9K31k96J57J08k23M1K46Q5k76O8r0O8N8j4j92
6105a21q4L8n3K10J53k5o2Q0K9k02P7j34J0J53k19l0K61j77J01P1n6L4J2l0M7
6130H3J58l31P0K6j6n7P9k9J19k21K08K8l31K81n6j72K02l07L47l06K97o6M2j32
6154h4r7M8K31q1K4K2m4J5Q8j15J12j01r7j25L75j93q3K27k18O7K12k17K47j95
6178A8R9k76k4K18J7j71K36l4k42K41j03K69l54K09j64j5l6J61j89K01p8l4J40
$$ plain form
6201 89 4 6 -32 166 133 71 8 -92 31 41 9 -165 -109 83 22 -53 38 -213 22 -77 120 -198 26 293 -39
6226 -39 124 112 44 -30 -30 100 -184 69 -4 43 -34 -239 47 16 -9 4 -26 60 -36 -280 -62 -111 -82 -367 -66 154
6252 154 -47 -90 -109 -303 -99 -203 280 139 208 36 -202 -198 52 -265 240 -36 98 104 -40 46 -188 328 -66
6275 -66 16 15 284 -164 300 61 -106 -275 90 -46 71 -110 107 45 49 -75 -115 -36 56 117 -99 186 56 -86
6299 -86 236 137 -156 -192 -115 -387 -36 -173 -36 -170 110 260 59 112 39 -212 90 269 -218 -334 253 -100
6321 -100 -2 115 85 -163 -87 27 11 -215 283 -35 -17 -124 -48 6 -171 -149 -42 20 68 12 -43 -105 56 -94
6345 -94 -7 -104 -278 -243 -123 19 28 -109 -48 -10 263 54 -48 -83 89 -50 198 -35 -214 -64 -43 -22 -216 -66
6369 -66 149 100 37 12 -96 108 67 50 -31 -81 -114 -78 -104 -17 -30 -112 -155 36 -255 -15 -38 -95 -57 327 -164 50
$$ packed form
6201H9q5Kl8J98l3o2o3j00J23J0l2j74N6J92o1p5R1k51K35r9J97l18K24K67l32
6226c9J63j2o8p4%J30k84K53p3M7p7k05K86l1k5J3l0Q6r6k44K18m9K9k85L01K20
6252A54k01m3j9j94K04j04M83j41O9j72k38MK50l17N05k76J34Oj44Q6k34N16l94
6275f6Q2jK69m48M64k39j67j69L65j36J17j81K17o2Mj24m0P9R2O1k16K85j30j42
6299h6L22r9k93l6P7k72L51j37J37j34K80J50k01N3p3k51L02J79m87j16N87l53
6321a00R8J17l0k48P6J14j6k26M98l18J8j07P6N4j77K2J07O2M8n6n5o2J61j50
6345i4Q7r7j74L5J20J42Rj37O1L8K73k09j02l5J72j39K48k33j79J50K1K1j94J50
6369f6K15m9o3k5j08K04m1j7q1n0l3L6k6Q7j3q2m3J91k91K40k3n7L8L84m91K14
$$ plain form
6395 50 -79 31 -79 -218 -34 -165 -111 -146 -56 3 -82 155 -89 -199 -56 6 -37 -131 -33 119 46 -71 89 -157
6419 -157 -162 -215 30 -63 218 -6 -138 1 72 -154 -66 -287 -249 138 104 68 -39 -8 -10 135 -118 117 139 106 -110
6444 -110 -237 341 -166 -15 51 7 -176 234 92 26 105 85 -91 -13 247 -8 -144 53 -81 -214 197 -148
6466 -148 28 28 -29 -143 254 -38 -302 -31 33 94 177 -35 -64 89 -26 -141 130 22 42 74 96 23 7 128
6490 128 205 -102 162 206 -129 180 36 52 -147 -153 58 42 213 8 -96 -110 -41 223 33 -87 14 198 -6
6513 -6 178 -84 2 -150 241 -150 95 -109 102 330 -64 20 11 227 -45 -42 -79 228 -148 -95 39 -212 64
6536 64 0 60 -94 -196 -358 84 -128 -31 -124 269 81 -160 102 104 45 -21 -29 -156 62 194 -7 137 264 -41
6560 -41 -17 -312 -103 285 -188 306 -187 4 143 -89 154 172 -27 -111 53 117 141 -168 52 -109 -42 -139 -143
$$ packed form
6395E0j29J10j10j39J84j31N4l5R0N9q5K37k44j10J43O2m3r4R8J52p3j17J60k46
6419a57nn3K45r3K81k24j32J39P1k26Q8k21L8L87l4l6j07L1kJ45k53K35K2l3k16
6444a10j27N78n07J51O6m4j83M10j42o6P9k0j76P8K60k55j36J97j34j33M11l45
6466a48J76%n7j14L97k92k64K71O4O1Q3k12k9J53j15j15K71j08K0L2K2p3j6J21
6490A28P7l07K64M4l35L09j44J6j99oK11j6J71k05j04j4O9K64j90j20J01J84k04
6513fJ84k62Q6j52L91l91K45k04K11K28l94Q4rK16k72Ll7L07l76N3J34k51K76
6536F4o4O0j54j02j62M42k12R7r3L93j88k41K62Kn9o6qj27K18J32k01J44J27l05
6560d1K4k95K09L88m73M94m93J91J39k32K43J8j99q4J64O4K4l09K20j61O7r7m
$$ plain form
6583 -143 113 254 129 104 77 170 55 -198 -109 -17 -184 364 140 -17 -35 17 -173 -107 -221 193 -11 -234 134
6606 134 -111 -97 -184 -134 -69 113 36 -5 26 -6 133 63 -97 -136 205 -103 94 -111 37 -146 -6 -12 -1 -130
6630 -130 -12 -264 -140 -3 -92 193 6 -340 85 44 -28 -148 -33 -11 -91 -19 96 152 -47 -24 149 -35 -74
6653 -74 -30 125 85 -19 181 -111 -73 -179 -22 23 -98 -216 -186 -92 117 271 -17 -135 1 -65 -109 -153 -172 11
6677 11 -46 297 -250 -67 16 164 -219 143 62 171 -226 129 -34 -12 -17 281 -71 -152 45 -207 -213 -28 132
6700 132 -61 -147 57 52 -201 17 84 -131 -240 100 -47 52 -106 210 -226 162 -5 -49 -45 157 32 -11 -43
6723 -43 -205 14 -90 15 -19 78 -90 72 113 13 102 -170 -54 -28 -221 222 -267 -106 211 -104 -2 235
6745 235 -8 93 136 -147 211 -140 -161 -100 -94 -82 -78 262 95 -29 -297 11 63 26 -158 -96 -77 -29 48 -140 -99
$$ packed form
6583a43K56J41j25k5k7R3j15k53Q9R2j67N48k24j57j8N2j90O6j14M14k04k23L68
6606A34k45J4q7N0O5J82p7m1L1l2J39p0j60l9L41l08J97k05J48j83J40oJ1j29
6630a30J18k52J24J37q9K85j87l46M25m1p2j20J15K2q0P2J15N6j99K3J73j84l9
6653g4M4J55m0j04K00k92L8j06J57M5j21j18L0R4K09J54k88j18J36o6m4m4j9J83
6677A1n7L43n47J83Q3J48l83L62q1J09l97L55j63K2nK98l52q1J97k52oJ85J60
6700A32j93q6K04nk53K18O7k15j09L40j47R9j58L16m36L88j67m4MK02j25m3l2
6723d3j62K19j04J05l4R7j68J62M1j00Q9k72J16K6j93M43m89J61L17l15J02K37
6745B35k43J01M3k83L58l51k1O1OJ2ML40j67j24k68L08N2l7j84O2J9M8P7j88M1
$$ plain form
6770 -99 151 68 125 -27 -29 59 -139 33 190 -147 320 -78 -160 113 -47 299 -30 -62 -267 -69 -252 -5 94
6793 94 -69 80 -114 -195 -28 -129 -342 56 80 -127 -107 72 79 -216 -155 329 278 158 73 -56 -142 109 125 238
6817 238 152 -27 98 -106 29 -98 30 115 -92 39 -62 38 -161 -133 212 163 80 47 15 203 -5 -25 -70
6840 -70 27 50 -76 -48 -109 -62 -135 -16 -24 -6 187 151 -21 -63 -174 189 -196 -47 -211 128 277 5 -21 118
6864 118 -198 -13 -113 44 -44 -115 109 -86 203 -226 -7 65 183 -67 2 84 7 172 -30 163 81 -15 -166
6887 -166 64 -41 5 -322 -319 -154 -277 -42 -188 -26 51 69 172 -73 -10 -23 92 157 414 -62 44 -90 -51
6910 -51 -95 127 -52 171 159 -29 -98 -45 -232 -72 -27 -20 61 230 -115 -73 -282 -45 17 96 49 1 79 -36 -130
6935 -130 -66 -67 -78 177 152 -26 229 -163 -249 356 78 -192 -23 -105 9 -45 -24 36 -114 113 287 -139 -119 181
$$ packed form
6770i9K50q3N7j52kQ8j98J72J57l37M67l98q2K73j60L46l29l2k05J98j83K47R9
6793I4j63J49j94q1J67j01k13L98K4k07K0J79Pk95O1M84n1j20q5j29q6K51J6J13
6817B38q6j79J25k04J35j27J28Q5k07J31j01J00j99K8L45m9q3l3l2J88k08k0m5
6840g0R7K3j26K8o1M7p3J19qJ8J93l6j72m2j11L63l85J49j64L39J49k72k6J39
6864A18l16J85j00J57q8p1K24j95K89m29K19P2J18k50O9Q2p7J65k02J93q2r6j51
6887a66K30j05M6l27LJ65j23K35j46J62P7J8J03k45O3j3J15O5K57m76J06j34L9
6910e1m4K22j79K23j2j88o9N3j87J60M5PQ1J69l45M2k09K37O2P9m7m8P8j15r4
6935a30O4jj1K55k5j78K55l92q6O05k78k70J69q2J14n4K1O0j50K27J74m26K0L00
$$ plain form
6959 181 14 72 -259 -13 154 68 103 -181 193 24 320 174 76 75 -9 14 -127 41 -115 -141 -309 -20 -87
6982 -87 -61 24 -248 -173 -168 -162 154 -184 -50 32 -27 103 -109 -13 105 105 188 67 87 139 39 202 104 68 217 -19
7008 -19 -22 158 -35 -26 -134 -24 100 63 -80 65 -58 86 80 -296 -292 162 239 -143 -191 162 114 -114 54 -59
7032 -59 -34 -11 87 -129 -78 -50 -68 -210 165 33 66 -129 -129 -42 -126 270 24 41 -146 -45 -25 -183 156 44 -62
7057 -62 162 253 87 -79 151 290 6 -225 64 102 -2 94 -75 153 -78 -143 -146 157 281 4 -17 115 -153
7080 -153 36 -179 208 205 -125 -116 135 8 104 -9 126 62 -307 -6 -83 98 186 28 305 60 29 -1 -2 76
7104 76 -147 210 134 26 -162 40 273 -114 -111 113 -9 -110 -274 -113 51 -351 78 -136 -202 -168 134 134 37
7127 37 153 -106 -34 -3 57 46 156 67 172 114 276 149 -187 43 36 -98 -75 -7 -105 37 -218 58 77 -18 44
$$ packed form
6959A81j67N8l31K46J67q6L5k84L74j69K96j46r8jq4K3j41J68j56k6j68K89o7
6982h7K6Q5k72P5NOL16l38J34Q2n9J30k12R6J18%Q3j21K0N2j00J63r8l6J49k36
7008a9lJ80j93Rj08J10J24l7j43J45j23J44ol76MM54P7l82m8L53m8k28J68j13
7032e9K5K3R8k16N1K8j8j42L75j32L3j95%Q7q4L96k46J7j87J01K0j58L39j12j06
7057f2K24R1j66j66K30J39k84k31K89L8j04R6j69K28k31o5lL03J24k77k1J32k68
7080a53J89k15L87ll30RK51j27R6j13J35o4l69L01p7J81Q8j58K77k45l1l0jP8
7104G6k23L57p6j08j88K02K33l87LK24j22j01j64J61J64m02M29k14o6L4L02%r7
7127C7J16k59P2L1O0j1J10q9J05n8J62j27l36K30pj34K3O8r8J42k55K76J9r5O2
$$ plain form
7152 44 -84 -3 320 10 -208 310 15 125 102 -170 79 -28 -2 -21 19 2 -29 108 -7 84 168 -29 122
7175 122 -188 -285 -47 -68 -367 -41 -86 29 198 -265 188 -50 -275 25 -73 -46 -209 -74 -42 87 85 -342 410
7198 410 205 58 226 90 126 108 -148 40 -72 -124 272 -250 -63 -265 -76 53 -246 257 7 -89 -25 -46
7220 -46 74 48 47 -228 -79 79 -135 18 144 47 172 57 111 -22 136 -73 74 0 58 -74 137 -130 290
7243 290 339 17 -12 -141 -143 112 -128 17 54 150 158 -86 12 -225 -56 -68 110 -12 133 11 258 14 30 257
7267 257 -141 -59 235 -46 -6 -58 -44 -13 216 -180 65 48 60 -350 -20 164 8 93 68 225 96 193 146 12
7291 12 -154 174 98 167 -83 41 -81 221 227 139 27 -42 -51 38 -79 130 -120 108 -21 -227 69 2 -199 72
7315 72 -20 -49 -142 -21 -348 16 119 -148 -86 147 -120 54 -96 -61 394 -127 108 176 -183 214 180 80 -141
$$ packed form
7152D4j28Q1L23l10k18N18k95J10k3k72K49j07K6j9M0j7l1J37j15R1Q4j97J51
7175A22l10r7K38k1k99L26m5J15J69m63M53k38k25L00r8K7j63J35L2J29km27P52
7198D10k05j47J68j36L6j8k56J88j12n2L96n22J87k02J89J29k99N03k50r6O4k1
7220d6J20k6jk75J49J58k14J53J26r7J25j15N4j33J58k09J47p4N8j32K11k67M20
7243B90M9l22k9j29kK55k40J45L7R6Qk44R8k37J69j2J78j22J45j22K47k44J6K27
7267B57l98Q2K94k81M0n2J4L1K29l96K45j7J2m10L30J84j56Q5k5J57j29R7m7j34
7291A2j66L28p6O9k50J24j22L02Oq8j12o9rQ9j17K09k50K28j29k06K96o7k01K71
7315G2r2k9r3J21l27L64J03k67O2K33k67J74j50L5M55n21K35O8l59L97l4j00k21
$$ plain form
7338 -141 98 -87 -191 243 -61 112 168 -148 27 -94 -5 -167 -55 -78 96 -110 -28 5 83 78 -91 180 -30
7361 -30 -127 -85 -102 95 220 -283 -332 -1 -86 149 119 -95 -69 154 71 -254 73 -82 -11 -182 -9 206 -151
7384 -151 -135 -138 -103 37 79 62 57 -163 198 249 64 101 -59 294 -324 -59 72 -155 -128 -54 -18 129 -81 -194
7408 -194 126 -14 -2 -183 105 48 138 41 98 -55 -154 -159 -45 -54 -237 151 350 -214 73 133 85 -105 -110 -195 -152
7433 -152 49 -271 96 -32 107 -9 132 -239 58 185 -19 -60 5 231 40 275 -55 183 106 -4 60
7454 60 -107 136 41 -116 26 -56 197 190 190 -17 44 -46 -56 -21 -125 290 26 84 -133 11 87 172 34 38 97 81
7480 81 380 37 -33 123 38 291 193 111 29 8 -1 232 -6 18 -113 73 2 -160 -72 32 73 92 -113 -221 -71
7505 -71 64 88 -13 -204 -75 240 308 -140 -213 -145 3 62 -150 -181 -87 -34 -151 89 -38 -93 114 -86 -14 59
$$ packed form
7338a41K39j85j04M34l04J73N6l16J75j21Q9j62J12k3J74k06Q2L3P8nj69K71k10
7361c0r7M2j7J97J25n03m9L31q5K35l0k14K6K23q3l25L27j55P1j71J73K15l57
7384a51J6lL5J40M2j7nk20L61N1j85L7j60L53o18K65J31k27K7P4L6J47k10j13
7408a94L20j40J2j81K88n7R0r7N7j53r9nJ14rj83L88J99n64K87O0m8j90nq5M3
7433a52K01l20L67j28J39j16J41l71K97J27k04m1O5K26j91K35l30K38p7j10O4
7454F0j67K43r5j57J42q2K53p%k07O1r0j0L5j04M15k64N8k17J44P6Q5j38MN9j6
7480H1K99l43p0J56q5K53r8q2q2k1rK33k38K4j31J86p1j62Q8J04M1J9k05j08J50
7505g1J35K4j01j91J29L15O8m48p3O8J48N9k12l1R4N3j17K40j27n5K07k00P2P3
$$ plain form
7529 59 -34 -61 -87 100 -54 79 -115 280 -195 164 -122 -40 -72 43 111 -88 350 197 -196 189 -279 396
7551 396 8 89 -133 -3 120 -1 76 -48 129 -79 406 140 -73 -141 96 -115 -65 -320 15 24 24 -5 -149
7574 -149 255 49 136 54 -162 -89 91 -5 -31 -44 -114 -94 -67 -8 -150 139 4 -40 208 107 -111 -19 24 -4 -272
7599 -272 161 107 -46 -162 438 -134 362 -33 50 72 -50 -313 29 5 -12 140 -115 -29 -61 191 -57 -4 -177
7622 -177 -4 15 -120 -52 72 -230 122 -248 11 239 23 -216 -18 140 -184 -13 45 246 121 159 137 69
7644 69 -80 -80 34 -89 138 61 -50 -16 -152 -65 -161 -206 -78 137 143 -31 -71 -96 -166 53 40 17 93 -105 32
7669 32 19 -70 126 -60 9 13 85 -76 252 -77 22 76 -77 68 57 88 -128 195 107 260 226 24 -22 10 -132
7694 -132 -222 -188 -64 164 -47 -22 4 -60 114 -256 -136 297 149 74 -41 -20 279 -141 -10 102 42 259 253
$$ packed form
7529E9r3k7k6J87j54J33j94L95m75L59k86Q2l2J15O8j99M38j53l93L85m68O75
7551C96l88Q1k22J30J23j21P7j24J77k08M85k66k13o8K37k11N0k55L35R%k9j44
7574a49M04k06Q7q2k16P3J80r6k6j3p0K0K7N9j42K89j35m4K48j01k18R2M3k8k68
7599b72M33n4j53j16O00n72M96l95Q3K2j22k63L42k4j7J52k55Q6l2K52k48N3j73
7622a77J73J9j35O8J24l02L52l70K59K28k16k39J98J58l24J71N8K01j25L8k2o8
7644F9j49%J14j23K27p7j11L4j36Q7r6m5J28K15Oj74m0k5p0K19j3k3P6j98J37
7669C2j3q9J96j86O9MP2j61L28l29R9N4j53J45j1L1k16L23q8J53l4k02m6L2j42
7694a32r0L4J24K28k11K5K6o4J74l70J20M33j48p5j15K1K99m20J31J12o0K17o
$$ plain form
7717 253 140 -223 102 218 -57 163 7 -82 -209 -71 -95 -258 -27 3 -55 -242 -23 132 -126 -14 -47 67
7739 67 138 -77 122 -62 9 -79 142 -68 60 163 -128 15 -46 -107 24 155 -179 138 0 61 31 -207 -140
7762 -140 -169 -69 269 -32 -88 66 -13 -19 -52 -77 -111 -126 -146 98 -33 -45 -24 109 -182 39 -157 -300 -206 -158 141
7787 141 -16 -126 173 46 63 365 63 80 93 -158 -126 -118 -71 -25 4 163 -168 -135 90 153 -181 113 -194 -49
7811 -49 -88 2 -69 313 -123 -324 68 -201 155 -155 14 101 -271 33 93 35 -104 -45 -181 38 164 141 -171
7834 -171 -33 18 50 -36 -11 -95 -210 57 -68 -12 86 225 -52 165 220 75 -9 -39 113 166 -188 -106 -7 160
7858 160 -68 26 31 200 256 10 -277 -49 232 115 -42 -72 49 -244 -1 71 89 204 4 69 52 71 101 80
7882 80 41 -25 156 -101 107 67 -267 -9 -120 91 174 -101 11 92 27 -6 -112 207 -36 -273 -120 11 123
$$ packed form
7717B53j13l63L25J16k75K20j56q9j27J38k4j63K31L0n8j87K19J55k58J12l3J14
7739F7P1k15J99j84P1q8K21k10J28J03k91J43o1o1J31J31l34L17j38O1l0k38O7
7762a40k9J00L38l01n6J54p9ol3k5l4j5k0K44j31j2K1J33k91K21j96j43R4M8K99
7787A41j57j10K99j27J7L02l02J7J3k51L2QM7M6K9J59l31L3K25O3l34K94l07J45
7811d9l9R0p1L82m36k01L92k69L56l10J69Q7l72L04O0n8j39N9j36K19J26k3l12
7834a71J38N1L2q6K5q4j15K67j25N6R8J39k77K17N5j45q4l0J52N3l54Q2R9J67
7858A60k28R4NJ69N6k46k87K28K81j17j57l0J21k93K43P2J8J15k00O5j7J9L0k1
7882H0l9o6J81k57K08m0l34K58j11K11Q3k75J12Q1o5l3j06L19k43k37J53J31J12
$$ plain form
7905 123 11 108 -117 -141 60 -159 -85 112 179 226 -193 -61 -126 -48 -27 -66 -63 44 -188 -121 -28 69 -26 12 171
7930 171 34 -22 165 -248 63 -90 23 -40 -52 126 10 138 145 -81 -49 -25 162 99 66 5 -78 -244 -169 -132
7954 -132 86 72 -78 -199 -49 -46 46 -205 41 101 9 12 9 7 -146 -108 76 67 -244 -31 -23 -59 -58 134 28 152 54
7981 54 -244 119 -117 79 -60 -55 -120 99 91 29 19 113 -21 12 209 -300 -213 96 60 -96 -117 -83 162 -137 110
8006 110 -55 -23 -165 22 88 -115 -79 306 -103 138 91 -21 65 -248 -95 23 -141 41 120 253 10 -122
8028 -122 239 1 97 211 26 215 12 -132 -47 6 -104 -85 -72 -3 -172 58 21 135 70 16 108 -207 88
8051 88 -83 -68 45 55 75 1 -50 -117 -53 -134 132 137 -108 87 77 -24 122 199 330 -212 48 -104 135 -231
8075 -231 -138 67 -275 -151 37 -82 -53 48 156 91 -23 -66 -252 159 -50 -18 39 59 158 -25 77 -7 -58
$$ packed form
7905A23j12R7k25k4K01k19P4J97O7M7m19J32o5P8K1l9LJ07k32O7R3R7r5L8J59
7930A71j37n6J87m13L11j53J13o3j2J78j16J28Pk26L2K4J87o3l3o1q3j66P5L7
7954a32K18j4j50j21J50LR2k51K46O0r2Llkj53L8J84rl11K13Ql6JJ92j06J24r8
7981E4k98L63k36J96j39No5K19qo2j0R4j34L3J97n09Q7L09l6j56k1L4K45k99K47
8006A10j65L2j42J87O6k03L6L85m09K41m7j12Q6l13J53J18j64J82P9J33k43j32
8028a22L61k38R6J14j85J89k03j44Q5N3j10J9J3O9j69K30l7J14o5n4R2l15K95
8051H8j71J5J13J0K0p4n1o7O4q1K66Nk45J95j0j01J46P7J31n42K60j52K39l66
8075b31R3K05l42J24J88j19K9J01J08o5j14m3j86M11k09L2N7K0R9j83J02q4n1
$$ plain form
8098 -58 43 -19 -38 156 -32 114 193 280 163 173 212 -195 127 -17 128 -211 -80 47 -140 -237 43 -42 -89
8121 -89 20 -202 167 354 -287 89 -57 -132 60 -104 128 -174 -180 -212 111 -277 -146 -97 -138 81 38 -32 -138
8144 -138 67 231 -52 -33 73 2 145 -230 131 15 -69 -96 222 -106 -32 -35 25 67 35 -290 -18 31 120 478
8168 478 -45 219 -128 -225 -120 -9 163 -19 120 -70 -31 44 -239 22 -90 -57 73 132 -63 2 -76 145
8190 145 94
$$ packed form
8098e8J01o2j9J94j88J46P9Q7j17J0L9m07L22j44J45l39J31J27j87r7K80q5m7
8121h9J09k22L69J87o41L76j46p5J92j64K32l02ol2L23l88J31M9m1K19m3p0j06
8144a38K05J64k83J9J06p1J43l75L61j16q4k7L18l28P4lO0M2l2l25K72M9Q9L58
8168D78n23K64l47r7J05J11J72j82J39j90L9P5k83K61j12L3J30N9j95O5p8K21
8190A45n1
8191I4
$$ Imaginary data points
##PAGE= N=2
##DATA TABLE= (X++(I..I)), XYDATA
$$ plain form
0 0 0 0 0 0 0 0 0 0 0 0 0 0 0 -8 8 -8 8 -8 16 -16 17 -24 28 -32 40 -47 54 -63 73 -84 96 -108 124 -141 160
35 160 -181 204 -228 257 -287 320 -356 396 -439 486 -538 594 -655 722 -798 878 -967 1066
53 1066 -1173 1294 -1429 1581 -1754 1951 -2181 2451 -2771 3163 -3651 4276 -5104 6250 -7901
68 -7901 10244 -18300 329699 95829 -315694 67556 216641 -106994 -123005 63713 -21785
79 -21785 -29798 40086 -16771 -1111 75390 -23493 -45181 35949 -32083 -57121 75505 29093
91 29093 -62670 54763 71388 -72203 -16220 61263 -59798 -57165 87212 26994 -71813 25866
103 25866 70424 -40373 -66108 3789 20527 -10015 -22615 3071 36257 15874 -23257 -14945
115 -14945 -1039 -9672 -2312 3337 924 20989 27169 -2540 -14222 -3216 4675 2759 -21101
$$ packed form
0@%%%%%%%%%%%%%qJ6j6J6j6K4l2L3m1N2o0P2q7J01j17J36j57J80k04K32k65L01
35A60l41L85m32M85n44O07o76P52q35R25j024J132j249J377j520J676j845K033
53A066k239K467k723L010l335L705m132M632n222N934o814P927r380J1354j4151
68g901J8145k8544L47999k33870m11523L83250J49085l23635j6011J86718q5498
79b1785q013O9884n6857J5660P6501r8883k1688Q1130o8032k5038J32626m6412
91B9093r1763J17433J6625j43591N5983P7483j21061K633J44377o0218r8807R7679
103B5866M4558j10797k5735O9897J6738l0542j2600K5686L3186k0383l9131Q312
115a4945J3906q633P360N649k413K0065O180k9709j1682J1006P891j916k3860
$$ plain form
128 -21101 -11819 50387 25944 -53909 5688 64441 -49918 -75908 58297 35372 -69895 3861
140 3861 60475 -20275 -23413 12027 -26894 -3869 29598 -37858 -12182 77069 -5831 -62159
152 -62159 48479 28673 -75499 11897 62815 -46889 -15692 76087 -11591 -49552 39887
163 39887 4603 -51988 19240 20745 -32225 20270 27927 -38336 -1609 25437 -40138 -13820
175 -13820 35122 -26511 -15212 57298 -9407 -49670 39932 18129 -61607 8404 50033 -25343
187 -25343 -10035 42194 -5620 -17463 22434 -11828 -26438 25964 11459 -24608 13790 24429
199 24429 -16815 -13504 2313 -8476 -2592 1084 -11749 6843 20235 -9597 -16239 7405 -187
212 -187 -16316 -2578 12244 8566 -1473 -643 14730 5913 -22045 -4937 23984 -3591 -18362
$$ packed form
128b1101R282O2206k4443p9853N9597N8753j14359k5990J34205k2925j05267P3756
140C861N6614q0750l138L5440l8921K3025L3467o7456K5676Q9251q2900n6328
152f2159J10638j9806j04172Q7396N0918j09704L1197R1779q7678l7961Q9439
163C9887l5284n6591P1228J505n2970N2495P657o6263L6727K7046o5575K6318
175a3820M8942o1633J1299P2510o6705m0263Q9602k1803p9736P0011M1629p5376
187b5343J5308N2229m7814j1843L9897l4262j4610N2402j4505l6067L8398J0639
199B4429m1244L311J5817j0789N884L676j2833J8592J3392k9832o642K3644p592
212a87j6129J3738J4822l678j0039Q30J5373q817k7958J7108K8921k7575j4771
$$ plain form
225 -18362 19166 21415 -8687 -4987 -2641 -9662 9078 1089 -26902 5803 32264 -12719 -23123
238 -23123 13508 -709 -17150 3994 -6807 -11126 27703 10999 -30006 7022 25833 -20879
250 -20879 -12959 19894 -5539 -3986 27047 -2267 -15990 21850 2282 -28619 11426 15198 -26223
263 -26223 5376 32578 -18838 -23549 22356 2747 -26582 -1949 3392 -3952 14227 847 -22591
276 -22591 8725 22584 -18514 -21415 14446 15996 -431 -4004 -1844 13426 15446 -15705 -17552
289 -17552 16041 11275 -12358 1818 10635 -3581 372 2100 -13592 -6769 8544 -3567 -8105
302 -8105 6266 3281 -6333 507 634 -9392 -6916 4591 9342 1149 -9540 3400 20729 -668
316 -668 -22850 1591 21630 -409 -12083 4890 12346 5329 -3926 -12618 -2555 12373 -1592
$$ packed form
225a8362L7528K249l0102L700K346p021J8740p989k7991L2705K6461m4983j0404
238b3123L6631j4217j6441K1144j0801m319L8829j6704m1005L7028J8811m6712
250b0879P920L2853k5433J553L1033k9314j3723L7840j9568l0901M0045L772m1421
263b6223L1599K7202n1416m711M5905j9609k9329K4633N341p344J8179j3380k3438
276b2591L1316J3859m1098k901L5861J550j6427l573K160J5270K020l1151j847
289a7552L3593m766k3633J4176Q817j4216L953J728j5692O823J5313j2111m538
302h105J4371k985r614O840J27j0026K476J1507M751q193j0689J2940J7329k1397
316f68k2182K4441K0039k2039j1674J6973P456p017r255q692J0063J4928j3965
$$ plain form
329 -1592 -15611 2224 12900 -2435 -7784 -2389 -4274 -2102 1349 -5156 -2404 8447 2252 -4988
343 -4988 3916 1260 -9676 2267 12501 -5203 -7697 16538 12749 -13003 -6462 12302 777
356 777 -10623 3142 6281 -3915 2138 6124 -7700 -8581 4453 -612 -9095 -1089 4270 225
370 225 672 -2065 -6069 1210 4005 -6299 -3563 8242 5688 19 1672 -398 363 4839 -2578
385 -2578 -6632 8148 9803 -6375 -2620 9481 -1224 -9692 120 1454 -4977 561 2649 -3551
399 -3551 -331 2092 -6160 -5526 2570 -1354 -3854 4449 3627 -2379 3016 3839 -5449 -1522 7527 -258
415 -258 -3482 8874 6257 -5651 2008 6702 -7933 -5639 9849 -877 -10809 6797 7699 -10103
429 -10103 -3332 4487 -9884 -4068 9739 -7416 -9656 14982 4145 -16531 3257 9743 -10301
$$ packed form
329a592j4019J7835J0676j5335n349N395j885K172L451o505K752J0851o195p240
343d988Q904k656j0936J1943J0234j7704k494K4235l789k5752O541J8764j1525
356G77j1400J3765L139j0196O053L986j3824q81J3034n065q483Q006N359m045
370B25M47k737m004P279K795j0304K736J1805k554n669J653k070P61M476p417
385b578m054J4780J655j6178L755J2101j0705q468R812J334o431N538K088o200
399c551L220K423q252O34Q096l924k500Q303q22o006N395Q23r288L927R049p785
415b58l224J2356k617j1908P659M694j4635K294J5488j0726r932J7606R02j7802
429a0103O771P819j4371N816J3807j7155k240K4638j0837k0676J9788O486k0044
$$ plain form
442 -10301 -546 10401 -7693 1206 19345 -6206 -14086 16077 5792 -16203 6672 9401 -12659
455 -12659 6570 14772 -18355 -8123 20822 -8188 -21558 12750 6900 -14354 6994 5177 -17200
468 -17200 5018 13081 -19066 -5807 20631 -5543 -10137 19235 769 -17507 13735 11933 -18799
481 -18799 -107 19044 -3454 -4483 7985 -5147 -1906 11808 -9207 -16840 13604 12852 -15609
494 -15609 -7777 9518 459 -6548 -3620 -5006 920 8235 -2096 -8789 4813 9783 -3964 -7579
508 -7579 3930 5815 -1393 1959 5623 -1703 -603 8340 -1054 -9288 4582 6110 -6984 1290
522 1290 6456 -9467 -2297 12795 -9878 -17238 13376 7285 -17033 1823 9160 -10733 2633
535 2633 9879 -18313 -3917 26442 -7394 -20852 20640 12401 -18914 6029 11762 -15806 5844
$$ packed form
442a0301R755J0947j8094Q899J8139k5551p880L0163j0285k1995K2875K729k2060
455a2659J9229Q202l3127J0232K8945k9010j3370L4308n850k1254K1348j817k2377
468a7200K2218Q063l2147J3259K6438k6174m594K9372j8466j8276L1242j802l0732
481a8799J8692J9151k2498j029J2468j3132L241J3714k1015p633L0444p52k8461
494a5609P832J7295r059p007K928j386N926P315j0331o693J3602M970j3747l615
508g579J1509J885p208L352L664p326J100Q943r394q234J3870J528j3094Q274
522A290N166j5923P170J5092k2673p360L0614o091k4318J8856P337j9893J3366
535B633P246k8192J4396L0359l3836j3458M1492q239l1315K4943N733k7568K1650
$$ plain form
548 5844 18629 -18004 -6227 25388 -8662 -18102 18948 -916 -23449 15921 11032 -27913 3044
561 3044 22999 -18312 -11865 18231 -8377 -10950 19300 -5650 -19293 21829 12053 -25526 3053
574 3053 20158 -11741 -3338 15401 -9077 -3869 20907 -6038 -18275 15609 8781 -17919 799
587 799 9823 -8312 423 7209 -12372 -5268 12821 -4271 -13952 5061 6941 -4849 -1324 1209
601 1209 -961 2921 1098 -5179 946 7677 2802 -4593 -488 8286 2720 -7691 -175 8101 -2360
616 -2360 -4191 6114 -704 -5313 5742 -1536 -11049 5507 5319 -13288 1008 10906 -11789 -4729
630 -4729 15151 -8915 -14141 17608 3886 -18809 9968 13343 -15068 2777 14723 -15296 -1644
643 -1644 23602 -11701 -16809 24926 6269 -23957 7518 12813 -15529 1757 9687 -16068 1934
$$ packed form
548E844J2785l6633J1777L1615l4050r440L7050j9864k2533L9370m889l8945L0957
561C044J9955m1311O447L0096k6608k573L0250k4950j3643M1122r776l7579K8579
574C053J7105l1899Q403J8739k4478N208K4776k6945j2237L3884o828k6700J8718
587G99R024j8135Q735O786j9581P104J8089j7092r681J9013J880j1790L525K533
601A209k170L882j823o277O125O731m875p395M105Q774n566j0411P516Q276j0461
616b360j831J0305o818m609J1055p278r513J6556j88j8607J4296R898k2695P060
630d729J9880k4066n226L1749j3722k2695K8777L375k8411J7845J1946l0019J3652
643a644K5246l5303n108M1735j8657l0226L1475N295k8342J7286P930k5755J8002
$$ plain form
656 1934 18115 -18389 -12486 23089 -5327 -21165 16502 6277 -21422 10676 15348 -20852 -1086
669 -1086 21673 -11046 -10163 19094 -1260 -12383 15727 4273 -16733 8373 12190 -13060 -2746
682 -2746 10312 -5009 -2332 6728 -7842 -5131 9698 -3908 -11188 6148 3372 -9120 1844
695 1844 5090 -6462 -1800 6576 -795 -4725 1750 4934 2911 -2427 -1940 4919 4423 -2270 -700
710 -700 1137 467 4922 31 -8477 2547 8789 -6827 -7751 5505 -222 -4491 3049 -4361 -5852
725 -5852 9194 495 -13501 4552 8644 -9963 444 10422 -8754 -2365 16451 -4185 -12731
738 -12731 12972 6645 -10958 5381 6113 -9692 6320 9981 -15382 -3618 16728 -5928 -12655
751 -12655 8694 96 -8285 8349 -2949 -14810 10607 10016 -18198 -2705 16254 -5551 -8167
$$ packed form
656A934J6181l6504N903L5575k8416j5838L7667j0225k7699L2098M672l6200J9766
669a086K2759l2719Q83K9257k0354j1123K8110j1454k1006K5106L817k5250J0314
682b746J3058j5321K677R060j4570K711J4829j3606p280J7336k776j2492J0964
695A844L246j1552M662Q376p371l930O475L184k023n338M87O859m96o693J570
710g00J837o70M455m891q508J1024O242j5616r24J3256n727m269P540p410j491
725e852J5046q699j3996J8053M092j8607J0407R978j9176O389J8816k0636q546
738a2731K5703o327j7603J6339P32j5805J6012L661k5363J1764K0346k2656o727
751a2655K1349q598q381J6634j1298j1861K5417n91k8214J5493J8959k1805k616
$$ plain form
764 -8167 9296 -1326 -5166 10283 447 -8852 8618 6281 -8571 2879 6470 -7007 936
777 936 8225 -6564 -4783 7724 -950 -5499 2272 -2520 -4074 5969 -1194 -10362 3692 7706
791 7706 -6404 -5340 4510 1916 -1035 -949 -1138 3723 4032 -3360 -470 5006 39 -791 3562 -1230
807 -1230 -1447 4866 6 -4008 2593 899 -4480 1672 1172 -5626 658 3443 -5210 -2660 3468 -2226
823 -2226 -2453 2581 -2481 -1771 5620 -1287 -5252 5754 3240 -5504 3074 5590 -4502 675 7039
838 7039 -2954 -2835 6040 -58 -4394 3347 954 -3561 1558 -126 -4211 2079 1078 -6327 134
853 134 3946 -4627 -3069 3489 -1058 -2316 2465 -790 -1998 4295 731 -3912 3250 3792 -2543 833
869 833 3003 -1104 976 2372 -2127 -369 2655 -1792 -924 1764 -3196 -1855 4245 -2266 -6354 2686
$$ packed form
764h167J7463j0622l840J5449r836r299J7470k337j4852J1450L591j3477P943
777I36P289j4789J781J2507q674m549P771m792j554J0043p163r168J4054M014
791G706j4110J064R850k594k951Q6j89M861L09p392K890N476m967q30M353m792
807a230k17O313m860m014O601j694n379O152n00o798O284K785q653K550O128n694
823b226k27N034n062P10P391o907l965J1006k514q744Q578K516j0092N177O364
838G039r993J19Q875o098m336P741k393m515N119j684m085O290j001p405O461
853A34L812q573J558O558m547j258M781l255j208O293l564m643P162N42o335L376
869H33K170m107K080J396m499J758L024m447Q68K688m960J341O100o511m088R040
$$ plain form
885 2686 2613 -4829 -1429 1720 -1649 859 699 -4610 1848 6219 -3057 -3996 5730 2103 -3251 3019
901 3019 2537 -3412 2955 5158 -3577 -1616 4214 -673 -2141 1493 -2671 -1933 4667 -1732 -7866 1882
917 1882 5160 -4727 -4264 2230 122 -720 1752 -2656 -2416 5273 2236 -4999 743 5281 -292 -846
933 -846 2504 -417 -280 4369 -96 -4978 2116 5284 -3024 -3686 1841 -213 -1829 1122 -2264 -4769
949 -4769 2906 2570 -6073 -1979 4433 -1457 -2928 2967 -1144 -2663 6457 2692 -7356 1357 8952
964 8952 -1715 -4609 3944 2312 -533 2615 -1737 -3076 5313 1928 -7159 -328 5552 -3796 -3662
979 -3662 3877 -2028 -5401 3885 1639 -7012 94 4792 -2658 -2207 3175 -1453 -1111 5247 -646 -5037
995 -5037 4444 5788 -4055 -1366 4995 -170 -872 3218 -1941 -2704 5476 903 -7539 1205 5914 -5124
$$ packed form
885B686p3p442L400L149l369K508j60n309O458M371r276r39R726l627n354O270
901C019m82n949O367K203q735J961N830m887j468L634m164P38O600o399o134R748
917A882L278r887M63O494k108q42K472m408K40P689l037p235N742M538n573n54
933h46L350k921J37M649m465m882P094L168q308o62N527k054j616K951l386k505
949d769P675l36q643M094O412n890j471N895m111j519R120l765j0048Q713P595
964H952j0667k894Q553j632k845L148m352j339Q389l385r087O831N880r348J34
979c662P539n905l373R286k246q651P106M698p450M51N382m628L42O358n893m391
995e037R481J344r843K689O361n165p02M090n159p63Q180m573q442Q744M709j1038
$$ plain form
1011 -5124 -4496 5019 -2244 -5529 4640 923 -8317 2367 7041 -6200 -3483 6582 -1085 -3250
1025 -3250 5929 -367 -5866 7401 4900 -9178 1362 9648 -4929 -3986 7548 -1898 -4921 7056
1039 7056 -877 -9185 5875 5003 -11246 -537 8580 -6942 -4569 8594 -3628 -8008 8141
1052 8141 2005 -10259 4059 7457 -7099 -759 7825 -3810 -1976 7700 -3241 -5173 9662
1065 9662 1693 -9526 5238 7441 -8480 -1954 8072 -4022 -5216 5683 -992 -6132 3834
1078 3834 1364 -7119 772 3953 -4550 -1184 3983 -2384 -2118 4765 -397 -4618 3704 4663 -3690
1093 -3690 -1175 5599 673 -2407 2546 1458 -2793 1990 3221 -4283 -1978 5327 -1200 -5607 2210
1108 2210 1553 -5114 999 2957 -6242 -1275 7183 -4229 -7173 6972 2784 -7042 2481 4428 -5477
$$ packed form
1011e124O28R515p263l285J0169l717r240J0684M674j3241K717J0065p667k165
1025c250R179o296n499J3267k501j4078J0540Q286j4577R43J1534r446l023J1977
1039G056p933q308J5060q72j6249J0709R117j5522K373J3163j2222m380J6149
1052H141o136j2264J4318L398j4556O340Q584j1635J834R676j0941j932J4835
1065I662p969j1219J4764K203j5921O526J0026j2094j194J0899o675n140R966
1078C834k470q483P891L181q503L366N167o367K66O883n162m221Q322R59q353
1093c690K515O774m926l080M953j088m251M783J231p504K305P305o527m407P817
1108B210o57o667O113J958r199M967Q458j1412k944J4145m188r826R523J947r905
$$ plain form
1123 -5477 2053 6915 -5744 -1786 9423 -2434 -5810 8155 615 -8278 7568 4997 -12417
1136 -12417 1487 11939 -8474 -7461 8975 -1176 -7402 5422 -1351 -8275 7773 3220 -12805
1149 -12805 2878 10721 -8635 -4439 10584 -2920 -5774 9917 508 -9383 6885 7257 -7995
1162 -7995 164 7259 -4406 -1031 6304 -5236 -4388 8352 -792 -8898 2922 4255 -5373 -1171
1176 -1171 2393 -4078 177 4129 -4139 -3864 5087 1661 -4468 699 2710 -641 806 1980 -1020
1191 -1020 131 3406 1069 -2788 258 3819 -376 -3043 1770 1621 -3805 -26 3277 -4099 -3455
1206 -3455 4638 146 -6363 1353 2530 -3417 783 1693 -4864 1926 5795 -5842 -2898 8982 -934
1221 -934 -6321 6453 2811 -6988 4642 5866 -7725 206 8730 -4909 -4223 7032 -2455 -5637
$$ packed form
1123e477P530M862j2659L958J1209j1857l376J3965p540q893J5846k571j7414
1136a2417J3904J0452k0413J013J6436j0151o226J2824o773o924J6048m553j6025
1149a2805J5683P843j9356M196J5023j3504k854J5691r409r891J6268L72j5252
1162g995Q159P095j1665L375P335j1540Q48J2740r144q106J1820J333r628M202
1176a171L564o471M255L952q268K75Q951l426o129N167K011l351J447J174l000
1191a020J151L275k337l857L046L561m195k667M813j49n426L779L303p376O44
1206c455Q093m492o509P716J177n947M200R10o557O790L869j1637K944J1880r916
1221i34n387J2774l642r799J1630J224j3591P931Q524j3639O86J1255r487l182
$$ plain form
1235 -5637 6803 -319 -9395 4912 4530 -9567 -658 6753 -5517 -2523 6483 -4199 -4411 8469
1249 8469 -907 -7743 6300 4718 -6984 1989 5505 -4848 465 6752 -4534 -3133 7410 -626
1263 -626 -6124 4051 2362 -5315 1056 1890 -4311 186 2173 -3324 -787 2316 -2494 -1255 2250
1278 2250 -2261 -1573 3715 -358 -3082 2262 1945 -1738 674 1887 -132 606 409 -131 1610 515
1294 515 -1516 887 1407 -1722 111 688 -2502 352 1542 -3046 -1059 2590 -2375 -2405 3176 -1336
1310 -1336 -3684 3613 968 -4599 2168 4150 -3135 -520 3961 -1033 -47 3385 -1919 -758 4934
1325 4934 -1040 -3605 3820 939 -4260 2227 2168 -4921 519 4072 -4593 -2649 4280 -1403 -3636
1340 -3636 2151 -793 -2699 3422 269 -4156 2565 3114 -3382 306 3467 -1855 484 3860 -2173
$$ packed form
1235e637J2440p122r076J4307l82j4097Q909P411j2270K994R006j0682k12J2880
1249H469r376o836J4043j582j1702Q973L516j0353N313O287j1286J401J0543q036
1263f26n498J0175j689p677O371Q34o201M497J987n497K537L103m810J239L505
1278B250m511O88N288m073k724N344l17l683K412J213k019P38j97n40J741j095
1294E15k031K403N20l129J833N77l190K854J190m588J987L649m965l0N581m512
1310a336k348P297k645n567O767J982p285K615M481m994R86L432n304J161N692
1325D934n974k565P425k881n199O487n9p089N440L553q665J944O929n683k233
1340c636N787k944j906O121l153m425O721N49o496L688L161n322K339L376o033
$$ plain form
1355 -2173 -1969 4614 780 -3372 1542 1292 -1335 1437 -636 -3781 1872 1848 -4379 -1415 2572 -1546
1371 -1546 -1487 1063 -1764 -613 2764 -1275 -2491 2744 644 -1881 2719 908 -3002 2656 3484 -3058
1387 -3058 -917 4087 212 -1225 653 -1093 403 2877 -2906 -3668 3761 883 -4705 30 1654
1402 1654 -3068 -60 1971 -3442 -1072 3606 -921 -2498 2055 610 -1496 1949 778 -2195 2586
1417 2586 3166 -2186 -658 3068 708 -481 650 -804 -317 2023 -456 -2584 570 1457 -1437 -1298
1433 -1298 -264 -111 157 -490 -1601 -637 723 -114 -343 -605 607 1769 545 -849 904 1169 -50
1450 -50 1022 855 -989 1466 1977 -1934 -977 2746 -454 -2326 1481 -354 -2550 1755 644 -4194
1466 -4194 -116 2885 -2623 -2196 2566 -1209 -1934 2707 -176 -2683 3055 2099 -3703 1048 3895 -2415
$$ packed form
1355b173K04O583l834m152M914k50k627K772k073l145N653k4o227K964L987m118
1371a546N9K550k827J151L377m039j216N235k100k525M600j811l910N658Q28o542
1387c058K141N004l875j437J878j746J496K474n783p62P429k878n588M735J624
1402A654m722L008K031n413K370M678m527j577M553j445k106L445j171k973M781
1417B586N80n352J528L726k360j189J131j454M87K340k479k128L154Q87k894J39
1433a298J034J53K68o47j111R64J360q37k29k62J212J162j224j394J753K65j219
1450e0J072j67j844K455N11l911R57L723l200j872L807j835k196M305j111m838
1466d194M078L001n508M27M762l775p25M641k883k507N738r56n802M751K847o310
$$ plain form
1482 -2415 -561 4021 -1391 -1884 3871 16 -3574 2915 2122 -4113 177 3471 -3437 -1943 3326
1497 3326 -1464 -3432 2203 362 -3541 1323 1741 -3058 -253 3002 -2161 -1427 3542 -190 -2645
1512 -2645 3162 1744 -2944 1405 3393 -2377 -771 3983 -727 -2194 2524 879 -3010 1120 1567
1527 1567 -3327 -382 2725 -2679 -2464 2794 -583 -3363 2061 1202 -3573 859 3008 -2624 -703
1542 -703 3991 -1203 -2141 4035 921 -3413 2615 3269 -3402 -350 3926 -1763 -2370 3205 -853 -3161
1558 -3161 2409 813 -4193 534 2096 -3258 -894 2319 -2476 -1759 3692 -959 -4094 3213 2573
1573 2573 -4023 -217 3727 -1218 -967 3226 -923 -1745 3992 1176 -4070 840 3719 -1860 -1425 2196
1589 2196 -1307 -1548 2213 -1303 -3762 2011 2361 -4007 -1069 2511 -1285 -1500 2288 -1672 -2015 4467
$$ packed form
1482b415J854M582n412m93N755l855l590O489p93o235M290L294o908J494N269
1497C326m790j968N635j841l903M864M18m799K805L255n163P34M969l732k455
1512b645N807j418m688M349J988n770J606M754m710j467M718j645l889M130M47
1527A567m894K945L107n404K15N258l377k780N424q59m775M432K149n632J921
1542g03M694n194r38O176l114m334O028O54o671L052M276n689o07N575m058k308
1558c161N570j596n006M727J562n354K364L213m795P17N451m651l135P307o40
1573B573o596L806L944m945K51M193m149q22N737k816n246M910K879n579M35L621
1589B196l503k41L761l516k459N773L50o368K938L580l796k15L788l960l43O482
$$ plain form
1605 4467 1265 -5287 1686 5479 -2845 -2523 4710 364 -2608 3412 481 -3519 2981 2895 -4710 -571
1621 -571 4104 -2948 -2411 3663 -2090 -4026 4340 433 -5969 1827 3899 -4498 -1510 3798 -2447
1636 -2447 -1257 4865 -1567 -4112 5122 2211 -5038 1733 4621 -3290 -584 4138 -2036 -1983 4213
1651 4213 -661 -3714 3011 1404 -3967 1084 2295 -3933 -575 3690 -2581 -3135 3322 376 -3228
1666 -3228 1278 1590 -2244 444 2205 -1731 -561 3336 121 -2111 1760 2130 -1049 206 1360
1681 1360 -728 -303 1691 -390 -1767 1099 968 -2133 -645 1452 -1523 -1431 1386 -621 -2734 1851
1697 1851 1322 -3291 189 2975 -1958 -1267 3587 -579 -2504 3414 1158 -3464 1973 3076 -3352
1712 -3352 40 3970 -2248 -2141 3974 -1153 -3741 3205 823 -4641 1722 2611 -4670 -420 3995
$$ packed form
1605D467l202o552O973L793q324L22P233m346k972O020k931m000O500q6p605M139
1621e71M675p052N37O074n753j936Q366l907o402P796K072q397K988N308o245
1636b447J190O122o432k545R234k911p249O771K888p911K706M722o174N3O196
1651D213m874l053O725j607n371N051J211o228L358M265o271n54O457k946l604
1666c228M506L12l834K688J761l936J170L897l215k232L871L70l179J255J154
1681A360k088M25J994k081j377K866j31l101J488K097k975R2K817k007k113M585
1697A851n29m613L480K786m933O91M854m166j925N918k256m622N437J103o428
1712c352L392L930o218J07O115n127k588O946k382n464O363Q89p281M250M415
$$ plain form
1727 3995 -3531 -2415 4484 -1045 -3540 3429 840 -4265 2898 2705 -4074 911 4775 -2782 -1340
1742 -1340 4801 -723 -2852 3474 766 -3384 1885 1888 -3009 615 2091 -3167 -879 3010 -1993 -3023
1758 -3023 2492 275 -2962 687 1351 -1614 -4 1050 -1086 280 1832 -741 -990 1792 806 -801
1774 -801 893 995 -249 -46 1251 493 -497 -266 577 -38 -1244 -278 202 -874 -446 -505 -1096 158
1792 158 815 -1650 -1339 1882 294 -1929 1005 1074 -1570 1204 1900 -2157 -270 3338 -956 -2017
1808 -2017 2754 873 -1790 1621 887 -2338 1733 1834 -3709 -428 3335 -1988 -2389 2362 -683 -2724
1824 -2724 1917 139 -3104 1463 1460 -2799 683 2460 -2152 137 3068 -1844 -1817 3832 803 -2665
1840 -2665 1420 1653 -1591 1114 902 -1925 755 2040 -2666 -1436 2049 -908 -1883 1049 -676 -1586
$$ packed form
1727C995p526J116O899n529k495O969k589n105P163j93o779M985L864p557J442
1742a340O141n524k129O326k708m150N269Lm897L624J476n258K288L889n003j030
1758c023N515k217l237L649O64k965J610J054k136J366J552k573k49K782r86j607
1774h01J694J02j244K03J297p58r90K31Q43o15j206R66M80j076M28n9n91J254
1792A58O57k465L11L221j588k223K934O9k644K774O96m057J887L608m294j061
1808b017M771j881k663L411p34l225M071J01n543L281L763n323m01M751l045k041
1824b724M641j778l243M567lm259L482J777m612K289K931m912K7N649l029l468
1840b665M085K33l244K705k12k827K680J285m706J230L485k957r75K932j725r10
$$ plain form
1856 -1586 1273 -198 -2243 604 932 -1226 367 688 -860 992 928 -1134 287 1912 -265 -250
1872 -250 1519 -64 -323 1260 -1 -1388 823 611 -1072 195 -23 -1339 680 507 -2316 -523
1888 -523 1560 -1059 -1808 941 80 -778 713 -377 -1011 1921 438 -1699 1101 1319 -975 249
1904 249 1821 -910 -156 1598 -589 -796 1268 -166 -1259 921 -29 -1483 297 557 -1409 -556
1920 -556 1035 -679 -658 362 -625 -249 827 -701 -439 1004 185 -400 884 462 -197 845 505 -369
1938 -369 1035 750 -830 644 696 -1148 310 753 -1288 -464 941 -1293 -941 1169 -982 -1256 1297
1955 1297 -90 -2028 1177 708 -1896 392 2056 -1295 -712 1761 -295 -663 1730 -70 -669 1951
1971 1951 135 -1910 1538 1466 -2293 176 2070 -1811 -1139 1601 -731 -1800 1355 -11 -2352 1110
$$ packed form
1856a586K859j471k045K847L28k158J593L21j548J852o4k062J421J625k177J5
1872b50J769j583k59J583j261j387K211k12j683J267k18j316K019j73k823J793
1888e23K083k619p49K749q61q58J491j090o34K932j483k137K800K18k294J224
1904B49J572k731P54J754k187k07K064j434j093K180r50j454J780K60j966Q53
1920e56J591j714K1J020r87L76J076j528K62J443q19n85J284m22o59J042l40q74
1938c69J404k85j580J474N2j844J458M43k041Q24J405k234L52K110k151k74K553
1955A297j387j938L205m69k604K288J664l351N83K473k056l68K393j800n99K620
1971A951j816k045L448p2l759K469J894l881O72K740k332j069L155j366k341L462
$$ plain form
1987 1110 882 -2164 255 1819 -1537 -552 2144 -435 -1261 1972 1083 -1087 985 875 -1122 636
2003 636 1485 -1526 -352 1916 -609 -1481 981 577 -1016 -40 261 -951 -243 895 -823 -1471 925
2020 925 624 -1459 -467 884 -96 -314 552 -106 -201 1171 392 -787 662 1536 -461 -236 1322 -409
2038 -409 -983 1357 531 -1484 369 1218 -1246 -396 1117 -1278 -828 1414 -912 -2048 1675 919 -2716
2055 -2716 208 1908 -1110 -596 1710 -724 -830 2385 63 -1944 2051 1489 -2138 562 2305 -1505
2071 -1505 -564 2117 -1064 -2003 2007 210 -2595 898 1175 -2128 -10 1613 -2249 -942 2157 -499
2087 -499 -2009 1549 999 -1695 663 1522 -1250 691 1997 -1254 -1033 2534 541 -1936 939 1138
2103 1138 -1420 411 1285 -1828 -556 2144 -1091 -2719 1530 797 -2252 164 1110 -1626 -181 1302
$$ packed form
1987A110k28l046K419J564l356R85K696k579q26L233q89k170K072j10j997J758
2003F36Q49l011J174K268k525q72K462m04j593R76L01j212P08J138j718o48K396
2020I25l01k083R92J351r80k18Q66o58r5J372p79j179J449Q74j997K25J558j731
2038d09n74K340q26k015J853Q49k464Q50J513k395M50K242k326j136L723p56l635
2055b716K924J700l018N14K306k434j06L215k322k007L995n62l627K700J743l810
2071a505R41K681l181r39M010j797k805L493K77l303K118J623l862J307L099k656
2087d99j510L558n50k694K358Q59k772J941J306l251K21L567j993k477K875J99
2103A138k558J831Q74l113J272K700l235j628M249p33l049K416R46k736J445J483
$$ plain form
2119 1302 -1557 -1175 2017 89 -2047 1486 1629 -1584 448 1954 -1158 -346 2290 -347 -1534 2271
2135 2271 800 -2126 799 1184 -2117 -201 1729 -1694 -1492 1491 -237 -2333 697 471 -1841 349
2151 349 1154 -1199 -290 1975 -1043 -866 2004 259 -1479 1345 1340 -1335 -38 2198 -750 -786 1570
2168 1570 -112 -1432 1292 696 -1686 53 1074 -1386 -893 1252 -1303 -1509 1030 -57 -2055 663
2184 663 1540 -1728 -479 1949 -237 -1036 1266 483 -670 1567 1198 -1462 653 1971 -1421 -932
2200 -932 2241 -249 -1944 1571 478 -2656 161 1546 -2231 -974 1333 -1156 -1188 1404 -677 -1817
2216 -1817 1698 432 -2517 696 1943 -1612 -464 2521 -661 -1285 2112 497 -1546 1776 960
2231 960 -1615 317 1279 -1558 -331 1912 -1390 -1657 1726 -195 -1951 811 697 -2024 -283 1129
$$ packed form
2119A302k859L82L192j928k136L533J43l213K032J506l112Q12K636k637j187L805
2135B271j471k926K925L85l301J916J930l423K02K983j728k096L030k26k312K190
2151C49Q05k353R09K265l018J77K870j745j738K824nk675J297K236k948l6K356
2168A570j682j320K724n96k382J739J021k460M93K145k555k06K539j087j998K718
2184F63Q77l268J249K428k186p99K302p83j153K237l69k660K115J318l392M89
2200i32L173k490j695L515j093l134K817J385l777J257K307k489l2K592k081j140
2216a817L515j266k949L213J247l555J148K985l182o24L397j615k043L322q16
2231I60k575J932R62k837J227K243l302k67L383j921j756K762j14k721J741J412
$$ plain form
2247 1129 -1241 -459 1125 -179 -865 1181 279 -631 756 553 -814 547 1441 -453 -560 1172 349
2264 349 -884 -200 457 -424 -404 -64 -697 -515 320 -223 -1247 -61 504 -480 -924 482 -255 -346 964
2283 964 212 -871 475 1174 -1013 -111 1486 -188 -529 1074 147 -989 1364 614 -1420 504 1045
2300 1045 -1189 -256 1207 -1017 -1061 1544 -269 -2279 948 747 -1783 -44 1191 -1182 -299 1123
2316 1123 -1118 -548 2089 -172 -1468 1584 711 -1172 809 1035 -1017 270 1539 -1486 -678 1649
2332 1649 -719 -1349 1088 194 -1278 358 269 -1128 -258 323 -1231 -147 668 -362 -458 1206 -114
2349 -114 -709 982 602 -510 234 638 71 423 137 -159 581 377 -344 8 689 -421 -233 333 -253
$$ packed form
2247A129k370P82J584j304o86K046r02r10J387k03j367J361Q94j894j07J732q23
2264C49j233O84O57q81K0L40o33J82Q35n43j024J186N65r84m44J406p37r1J310
2283I64p52j083J346O99k187R02J597j674l41J603r27j136K353p50k034J924N41
2300A045k234R33J463k224m4K605j813k010L227k01k530J739J235k373Q83J422
2316A123k241N70K637k261j296L052q73j883J981K26k052J287J269l025Q08K327
2332A649k368o30K437q94j472J636q9j397Q70N81j554J084Q15j030r6J664j320
2349a14n95J691l80j112P44M04n67L52k86k96P40k04p21L52O81j110J88N66n86
$$ [...]
8191a41
##END NTUPLES=NMR FID
##END=
