##TITLE=1H_Art-H2EOH(A)-f10-c2y4f
 CDCl3
 8 sc, 
 4.8.2023
##JCAMPDX= 6.0         $$ Bruker NMR JCAMP-DX V2.0
##DATA TYPE= NMR FID
##DATA CLASS= NTUPLES
##ORIGIN= UXNMR, Bruker Analytische Messtechnik GmbH
##OWNER= root
$$ XWIN-NMR		Version 3.5
$$ Fri Aug  4 15:24:06 2023 Russian Standard Time (UT+4h)  she@DPX200
##.OBSERVE FREQUENCY= 200.13135
##.OBSERVE NUCLEUS= ^1H
##.DELAY= (6, 6)
##.ACQUISITION MODE= SIMULTANEOUS
##.ACQUISITION SCHEME= undefined
##.AVERAGES= 8
##.DIGITISER RES= 18
##SPECTROMETER/DATA SYSTEM= spect
##.PULSE SEQUENCE= zg30
##.SOLVENT NAME= CDCl3
##.SHIFT REFERENCE= (INTERNAL, CDCl3, 0, 15.7039)
##AUDIT TRAIL= $$ (NUMBER, WHEN, WHO, WHERE, WHAT)
$$ ##TITLE= Audit trail, XWIN-NMR		Version 3.5
$$ ##JCAMPDX= 5.01
$$ ##ORIGIN= Bruker BioSpin GmbH
$$ ##OWNER= she
$$ F:/spectra/data/she/nmr/H-F/1/audita.txt
$$ ##AUDIT TRAIL=  $$ (NUMBER, WHEN, WHO, WHERE, WHAT)
(   1,<2023-08-04 15:23:05.18 +0400>,<she>,<DPX200>,
      <created by zg, POWCHK disabled, PULCHK disabled
       configuration hash MD5:
       00 E9 B6 7A A2 85 ED C7 34 08 36 98 17 FE 4E 26
       data hash MD5: 16K
       5A 02 96 F6 D7 BB 35 1F DF 54 37 19 66 34 B0 DF>)
$$ ##END=
$$ 
$$ hash MD5
$$ 19 13 E7 6C C8 A1 D4 9B 54 5E ED BF 26 4F B1 C6
##$RELAX= 
##$RELAX= 
##$RELAX= 
##$RELAX= 
##$RELAX= 
##$RELAX= 
$$ Bruker specific parameters
$$ --------------------------
##$DU= <F:/spectra>
##$EXPNO= 1
##$NAME= <H-F>
##$PROCNO= 1
##$TYPE= <nmr>
##$USER= <she>
##$AMP= (0..31)
100 100 100 100 100 100 100 100 100 100 100 100 100 100 100 100 100 100 
100 100 100 100 100 100 100 100 100 100 100 100 100 100 
##$AQSEQ= 0
##$AQ_mod= 1
##$AUNM= <au_zg>
##$AUTOPOS= <>
##$BF1= 200.13
##$BF2= 200.13
##$BF3= 200.13
##$BF4= 200.13
##$BF5= 200.13
##$BF6= 200.13
##$BF7= 200.13
##$BF8= 200.13
##$BYTORDA= 1
##$CFDGTYP= 0
##$CFRGTYP= 5
##$CHEMSTR= <none>
##$CNST= (0..31)
1 1 145 1 1 1 1 1 1 1 1 1 1 1 1 1 1 1 1 1 1 1 1 1 1 1 1 1 1 1 1 1 
##$CPDPRG= <>
##$CPDPRG1= <>
##$CPDPRG2= <>
##$CPDPRG3= <>
##$CPDPRG4= <mlev>
##$CPDPRG5= <mlev>
##$CPDPRG6= <mlev>
##$CPDPRG7= <mlev>
##$CPDPRG8= <mlev>
##$CPDPRGB= <>
##$CPDPRGT= <>
##$D= (0..31)
0 1.2 0 0 0 0 0 0 0 0.06 0 0.03 0 0 0 0 0.0002 0 0 0 0 0 0 0 0 0 0 0 0 
0 0 0 
##$DATE= 1691148184
##$DBL= (0..7)
120 120 120 120 120 120 120 120 
##$DBP= (0..7)
150 150 150 150 150 150 150 150 
##$DBP07= 0
##$DBPNAM0= <>
##$DBPNAM1= <>
##$DBPNAM2= <>
##$DBPNAM3= <>
##$DBPNAM4= <>
##$DBPNAM5= <>
##$DBPNAM6= <>
##$DBPNAM7= <>
##$DBPOAL= (0..7)
0.5 0.5 0.5 0.5 0.5 0.5 0.5 0.5 
##$DBPOFFS= (0..7)
0 0 0 0 0 0 0 0 
##$DE= 6
##$DECBNUC= <off>
##$DECIM= 32
##$DECNUC= <off>
##$DECSTAT= 4
##$DIGMOD= 1
##$DIGTYP= 9
##$DL= (0..7)
0 120 120 120 120 120 120 120 
##$DP= (0..7)
150 150 150 150 150 150 150 150 
##$DP07= 0
##$DPNAME0= <>
##$DPNAME1= <>
##$DPNAME2= <>
##$DPNAME3= <>
##$DPNAME4= <>
##$DPNAME5= <>
##$DPNAME6= <>
##$DPNAME7= <>
##$DPOAL= (0..7)
0.5 0.5 0.5 0.5 0.5 0.5 0.5 0.5 
##$DPOFFS= (0..7)
0 0 0 0 0 0 0 0 
##$DQDMODE= 0
##$DR= 18
##$DS= 0
$$ [...]
##$SUBNAM2= <"">
##$SUBNAM3= <"">
##$SUBNAM4= <"">
##$SUBNAM5= <"">
##$SUBNAM6= <"">
##$SUBNAM7= <"">
##$SUBNAM8= <"">
##$SUBNAM9= <"">
##$SW= 18.05172834244
##$SWIBOX= (0..15)
0 0 2 0 0 0 0 0 0 0 0 0 0 0 0 0 
##$SW_h= 3612.71676300578
##$TD= 16384
##$TD0= 1
##$TE= 0
##$TE2= 300
##$TE3= 300
##$TEG= 300
##$TL= (0..7)
0 120 120 120 120 120 120 120 
##$TP= (0..7)
150 150 150 150 150 150 150 150 
##$TP07= 0
##$TPNAME0= <>
##$TPNAME1= <>
##$TPNAME2= <>
##$TPNAME3= <>
##$TPNAME4= <>
##$TPNAME5= <>
##$TPNAME6= <>
##$TPNAME7= <>
##$TPOAL= (0..7)
0.5 0.5 0.5 0.5 0.5 0.5 0.5 0.5 
##$TPOFFS= (0..7)
0 0 0 0 0 0 0 0 
##$TUNHIN= 0
##$TUNHOUT= 0
##$TUNXOUT= 0
##$USERA1= <user>
##$USERA2= <user>
##$USERA3= <user>
##$USERA4= <user>
##$USERA5= <user>
##$V9= 5
##$VALIST= <valist>
##$VCLIST= <CCCCCCCCCCCCCCC>
##$VD= 0
##$VDLIST= <DDDDDDDDDDDDDDD>
##$VPLIST= <PPPPPPPPPPPPPPP>
##$VTLIST= <TTTTTTTTTTTTTTT>
##$WBST= 1024
##$WBSW= 4
##$XGAIN= (0..3)
0 0 0 0 
##$XL= 0
##$YL= 0
##$YMAX_a= 138487
##$YMIN_a= -130000
##$ZGOPTNS= <>
##$ZL1= 120
##$ZL2= 120
##$ZL3= 120
##$ZL4= 120
##$ABSF1= 10
##$ABSF2= 0
##$ABSG= 5
##$ABSL= 3
##$ALPHA= 0
##$AQORDER= 0
##$ASSFAC= 0
##$ASSFACI= 0
##$ASSFACX= 0
##$ASSWID= 0
##$AUNMP= <proc_1d>
##$AZFE= 0.1
##$AZFW= 0.1
##$BCFW= 1
##$BC_mod= 2
##$BYTORDP= 1
##$COROFFS= 0
##$CY= 11.3945322036743
##$DATMOD= 1
##$DC= 2
##$DFILT= <>
##$DTYPP= 0
##$F1P= 15.7292609196834
##$F2P= 12.9074282941183
##$FCOR= 0.5
##$FTSIZE= 0
##$FT_mod= 4
##$GAMMA= 1
##$GB= 0.15
##$INTBC= 1
##$INTSCL= 1
##$ISEN= 128
##$LB= 0.24
##$LEV0= 0
##$LPBIN= 0
##$MAXI= 10000
##$MC2= 0
##$MEAN= 0
##$ME_mod= 0
##$MI= 1.114404
##$NCOEF= 0
##$NC_proc= 0
##$NLEV= 6
##$NOISF1= 3.799351
##$NOISF2= 2.8
##$NSP= 1
##$NTH_PI= 0
##$NZP= 0
##$OFFSET= 15.70392
##$PC= 1
##$PHC0= -21044.96
##$PHC1= 11.45272
##$PH_mod= 1
##$PKNL= yes
##$PPARMOD= 0
##$PSCAL= 0
##$PSIGN= 0
##$REVERSE= no
##$SF= 200.130013532006
##$SI= 16384
##$SIGF1= 3
##$SIGF2= 2
##$SINO= 400
##$SIOLD= 16384
##$SREGLST= <1H.CDCl3>
##$SSB= 0
##$STSI= 0
##$STSR= 0
##$SW_p= 3612.71676300578
##$SYMM= 0
##$S_DEV= 0
##$TDeff= 0
##$TDoff= 0
##$TI= <>
##$TILT= no
##$TM1= 0
##$TM2= 0
##$TOPLEV= 0
##$USERP1= <user>
##$USERP2= <user>
##$USERP3= <user>
##$USERP4= <user>
##$USERP5= <user>
##$WDW= 1
##$XDIM= 8192
##$YMAX_p= 0
##$YMIN_p= 0
$$ End of Bruker specific parameters
$$ ---------------------------------
##NTUPLES= NMR FID
##VAR_NAME=  TIME,          FID/REAL,        FID/IMAG
##SYMBOL=    X,             R,               I
##VAR_TYPE=  INDEPENDENT,   DEPENDENT,       DEPENDENT
##VAR_FORM=  AFFN,          ASDF,            ASDF
##VAR_DIM=   8192,          8192,            8192
##UNITS=     SECONDS,       ARBITRARY UNITS, ARBITRARY UNITS
##FACTOR=    0.0002768,     1,               1
##FIRST=     0,             0,               0
##LAST=      2.2672688,     0,               0
##MIN=       0,             -130000,         0
##MAX=       2.2672688,     138487,          0
$$ Real data points
##PAGE= N=1
##DATA TABLE= (X++(R..R)), XYDATA
$$ [...]
1862F11j068R91O26j718M66J250j030q09R01k68m71O81m40l97P51j11o55M35K69
$$ 611 -457 534 1160 -558 -92 1158 128 -681 220 -48 -519 162 -278 -675 76 -35 -690 -255 14
1881A4m32Q7L82o08R09L52j207L48J129r78l04J352n02j127J236K41j471L00J110
$$ 14 -418 -331 51 -557 352 704 -503 -155 974 -4 -308 1044 542 -585 651 892 -579 -279 831
1900H31p50m11N21j82m21M48k1m19J42K4m40M13N7l5N47m63j28L97j50k50L74
$$ 831 81 -330 191 9 -412 36 15 -404 -262 -238 -678 -265 -208 -243 304 -159 -287 110 -40 -290 84
1921H4N00p77N23Q31j132n16J439k24j239Q77J52j234N48M83p62L04K88p62L25
$$ 84 584 -193 330 1161 29 -487 952 728 -511 366 518 -716 -168 315 -447 -143 145 -617 -292
1940b92L30o03L1L58o6l07Q64n75n23J292m03q09J095O20j538N48J241j313m02
$$ -292 38 -565 -534 -176 -242 -549 315 -260 -783 509 106 -703 392 1012 -526 22 1263 -50 -452
1959d52J757n81j417J156R41j985L46Q01r83l04J191m17r02O40L88n65j4J16j83
$$ -452 1305 724 -693 463 1404 -581 -235 566 -417 -721 470 53 -849 -209 179 -386 -400 -284 -467
1978d67L70k54J04N18Q1o93M88P02o95m94Q36K5o17N34O1o14J02M84o04k87O27
$$ -467 -97 -351 -247 271 352 -341 147 849 154 -340 496 521 -96 438 499 -115 -13 471 -133 -420 207
1999B07K02q45L2O35l47n30L93L34l12j01M23m13k54P35%n66K85N88p60K61Q24
$$ 207 409 -436 -404 231 -116 -646 -253 81 -231 -332 91 -322 -576 159 159 -407 -122 466 -294 -33 791
2020G91p09k82P23j37m52J54M54m52J88J12q12O60K87j280oJ167m23p20R03k89
$$ 791 82 -200 523 386 -66 88 542 90 278 390 -422 238 525 -755 -761 406 -17 -737 166 -123
2040a23p59J072K26j599R00J080j049n43J775p02j227J608K23j525J006R24j173
$$ -123 -882 190 416 -1183 -283 797 -252 -795 980 278 -949 659 882 -643 363 1287 114
2057A14k66J023n00r81J161k91j160P48P68j153J29P07p39o4N75m80J83O99p14
$$ 114 -152 871 371 -610 551 260 -900 -152 616 -537 -408 299 -440 -504 71 -409 -226 473 -241
2076b41o07J118J84j037M94J055r79j29J026p06o44R45r4p18L02R98j145n2R55
$$ -241 -848 270 454 -583 -89 966 -13 -142 884 178 -466 479 385 -333 -31 967 -178 -230 725
2095G25m47j063P88M81j358L54J120q84m01R68m02q22Q78L93r42O26K44k61k81
$$ 725 278 -785 3 484 -874 -520 600 -284 -685 283 -119 -941 -63 330 -612 14 258 -3 -284
2114b84R81n50l70Q17j99o12N96L15r04O03L81j185N5J080r12n54J161n11p28
$$ -284 697 147 -223 594 395 -217 379 694 -210 393 774 -411 -356 724 -188 -742 419 -92 -820
2133h20R36M25j275L07R41o23q62J548m71j143J212N16r40pQ39k93p80J066q6
$$ -820 116 541 -734 -427 514 -109 -971 577 106 -1037 175 691 -249 -256 583 290 -490 576 490
2152D90n09K53L78q66L59P69r60O0L59n12j29M94m24n30N56M71j130P22M10p52
$$ 490 -19 234 612 -254 105 874 -86 -26 333 -179 -308 186 -238 -768 -212 259 -871 -149 261 -491
2172d91J30O86k41q58J291K9j635J158J114j403l27J405n43q95J122L3j286J151
$$ -491 -361 325 84 -774 517 546 -1089 69 1183 -220 -547 858 315 -580 542 575 -711 440
2190D40N08j238J17R28q06r93J096K00j005P03K29n48K34L15o13l5R71q97J89
$$ 440 948 -290 -173 755 -51 -1044 52 252 -753 -50 179 -369 -135 180 -433 -468 503 -394 -205
2209b05Q21p09n74J106J79j375Q62O83r25P0Q16p50n55J062k44j119R86K65j025
$$ -205 616 -93 -667 439 618 -757 105 788 -137 -67 749 -1 -556 506 262 -857 129 394 -631
2228f31J0J252j079o19J091P4r48O48L68n13j59N45J55m99J99L94l52N3M20j08
$$ -631 -621 631 -448 -1067 24 98 -850 -202 166 -347 -506 39 194 -305 -106 288 -64 -11 409 301
2248C01k51K43k57L5M58l68l37N86j85l99K9L83l06j11K23o78l75J270m19p31
$$ 301 50 293 36 71 529 161 -176 410 225 -174 -145 238 -68 -179 44 -634 -1009 261 -158 -889
2268h89P06P48r94J2J274j058m91J291k62r47Q20P42j222l3J194q77m15Q01j91
$$ -889 -183 565 -429 -417 857 -201 -692 599 337 -610 210 952 -270 -303 891 14 -401 400 209
2287B09q26Q74N49j348k4Q69n02J91J42l98M3L35l73k11P99l33p08Q41K42r85
$$ 209 -617 257 806 -542 -566 303 -199 -8 134 -264 -221 114 -259 -470 329 -4 -712 129 371 -614
2307f14O94N95r17J63Q44p86l06J032k34q57O82J46r70O39M58p88j65J76M39m85
$$ -614 80 675 -242 -79 765 -21 -327 705 471 -386 296 442 -528 111 569 -219 -384 -208 231 -254
2327b54j40K37j28l6K06k10K95r6l3J82j37J0M86l3n60O92k27k3k18L20k48l9
$$ -254 -394 -157 -285 -321 -115 -325 -30 -126 -159 23 -114 -104 382 349 -211 481 254 231 13 333 85 46
2349D6N0m9R8M3j60N1j99j34J78J16m96j4N87l49j51P86k85o10M18P30r16O4N08
$$ 46 96 47 145 188 28 79 -120 -254 -76 40 -456 -470 117 -232 -383 403 118 -492 -74 656 -260 -196 312
2372C12j99l04O76j85m77N17m9m54K53M84m97j01L60j92k94K13j39NL60n03m04
$$ 312 113 -191 485 300 -177 340 291 -163 90 574 77 -24 336 144 -150 63 -76 -71 289 -214 -618
2393f18N62j32L9K48K36n99P5M45p16L03P15m09m70P27k22k02K63K36o56J82J68
$$ -618 -56 -188 -149 99 335 -264 -189 256 -460 -157 558 149 -321 406 184 -18 245 481 -175 7 175
2414A75k42J82L2j28n8N5j43L93j21j85M1J34l48n09R04kq16P20J62o07J80N48
$$ 175 -67 115 147 19 -39 16 -127 266 145 -40 1 135 -213 -722 182 180 -636 84 246 -361 -181 367
2436C67l85j47O49k94m28O04j27m1jN9j17J49p3k31j85J53l77K01O11o24j99O60
$$ 367 -18 -165 484 190 -238 366 239 198 197 256 139 288 215 -16 -201 -48 -425 -224 387 -237 -436 224
2458B24m80p8K21J02n31L77O01r71L79N62m67k10P98k99l31K95j4J41r6L5Q7m56
$$ 224 -256 -334 -113 -11 -542 -165 436 -535 -156 406 -61 -271 527 228 -103 192 178 319 223 258 345 -111
2480a11K72m3k26P9n4J41Rn47L96k41m6K26K88n60L17qk02l07N88L10k47oR5j9
$$ -111 161 118 -108 -29 -83 58 67 -480 -84 -325 -371 -145 143 -417 -100 -108 -310 -617 -29 281 34 28 123 104
2504A04K70J36o88M49O8l54J76J58n18L49L14r14o5R60k06r34O75K41p44L64M52
$$ 104 374 510 -178 271 339 -15 161 319 -199 150 464 -450 -515 445 239 -695 -20 221 -523 -159 293
2525B93o77k97J261q84o5N84J53q85O74o3k81M23J37m23Q3L11l59K22L97m15l61
$$ 293 -384 -681 580 -304 -369 215 368 -517 157 94 -187 236 373 -50 33 344 -15 207 604 189 -172
2546a72L07p7l25K63K86o76J46M23m55r5L30O5o25O35K18q52O21N68p29k57Q03
$$ -172 135 58 -267 -4 282 -394 -248 175 -280 -375 -45 20 -605 30 248 -604 17 585 -144 -401 402
2567D02j14p57N57L98q74M21N08l13k35RJ59l40j8O18n48n7J00K6J04J63j21l57
$$ 402 288 -469 88 486 -388 33 541 228 -7 2 161 -179 -197 421 -127 -184 -84 -58 46 209 88 -269
2589b69K72j62J00M3L05m72Q0K67O4k70K73l42j15M22K68o66N21J41m02m32R81
$$ -269 3 -159 -59 -16 289 -183 -103 164 228 -42 231 -111 -226 196 464 -202 319 460 58 -374 607
2610F07n50n91O35K00r06L38N18n92j53P06k97m52O08j22m22M48L25p93M45L39
$$ 607 57 -534 101 301 -605 -267 251 -341 -494 212 -85 -537 71 -51 -473 -25 300 -493 -48 291
2630B91k82j55M14N0l43L57J20m89J51J44j66m8L56o93j26R21n32o01J048k61
$$ 291 9 -146 268 318 -25 332 452 -37 114 258 92 44 400 -293 -419 502 -30 -631 417 156
2650A56r13L70O12r24N78N12o40o9N42J87q75L65O74n32k12P16j76k87L06j11
$$ 156 -757 -387 225 -699 -121 391 -249 -318 224 411 -464 -99 575 43 -169 547 371 84 390 279
2670B79k58J08K99n02K26J29l44j39L10k42m24N30J32n22K26K42l13J18L21l20
$$ 279 21 129 428 -74 152 281 -63 -202 108 -134 -558 -28 104 -418 -192 50 -263 -145 176 -144
2690a44j00M90k94k64Q22o3o36L1P82p24k01P63m12l7Q1K18n48K06O47m83l65
$$ -144 -244 246 -48 -312 510 447 -189 -158 624 -100 -301 462 50 13 94 312 -236 -30 617 134 -231
2711b31N70k94p13N81P4j3r1K21l94K8L59Km04L99k57j35N04L9n00M01K30n14
$$ -231 339 45 -668 -87 -13 -26 -117 104 -290 -262 97 99 -305 94 -163 -298 206 245 -255 146 376 -138
2733a38K18J26P5p34M95J42n67L26J69l32J29J29k36k26N86j01l87J76K99j64
$$ -138 80 206 281 -453 42 184 -383 -57 112 -220 -91 38 -198 -424 162 61 -326 -150 149 -15
2753a5l40N80j57m86N89P0m25J60L23m94K24L53l86L9J94j29k23O11n80j33q5
$$ -15 -355 225 68 -418 171 241 -184 -24 299 -195 29 382 -4 35 229 100 -123 488 -92 -225 -310
2774c10M09j79L7Q2l10m7O55k46l82M57k48o35N79L29m94L41L94l56l28O69k47
$$ -310 99 -80 -43 39 -271 -318 337 91 -291 166 -82 -717 -138 191 -303 38 432 76 -252 417 170
2795A70n55N03P4r4M6K11l65l48M00no3J87j91j17J17N3l65K86J0l73K62Q3p3
$$ 170 -385 118 192 98 144 355 -10 -358 42 37 -26 161 -30 -147 -30 23 -342 -56 -46 -419 -157 -74 -147
2818a47j70L17n7r7M33n7m01P4p1M22k89L37k07l66L92K17m20j60L12M5l48M46
$$ -147 -317 0 -57 -154 279 222 -179 -105 -176 246 -43 294 87 -279 113 330 -90 -250 62 107 -241 205
2840B05J01m10N9j88K37m44N10k28p0n2K99Ql67O37j67k63J81J30j34R3k87J76
$$ 205 306 -104 -45 -233 4 -440 70 -158 -228 -280 19 27 -340 297 130 -133 48 178 44 137 -150 26
2862B6J9O8k44M26Om11J93J57k89j51J88R2m91O79j37p02O49n9J5k25M79k04n60
$$ 26 45 113 -131 295 301 -110 83 240 -49 -200 -12 80 -411 268 131 -571 78 19 34 -191 288 84 -476
2885d76N09m2n7j6K50j48L4L44m63K90k67M02l59J05l26M00p4j12J57l30O3r2
$$ -476 33 -9 -66 -82 168 20 54 398 -65 225 -42 360 1 106 -220 180 106 -6 151 -179 -116 -208
2907b08J53R4l73K73K53m19Q8L95k06k57P9J10m1K60k7o9l5J7L8P7r5q9K60l39
$$ -208 -55 39 -334 -61 192 -227 -139 256 50 -207 -128 -18 -59 201 174 105 70 87 125 202 107 18 278 -61
2931f1k2m3M20l25O6K53l48k40K68l60K80J33j37j08On3J43k08M81l82J55J53
$$ -61 -83 -126 294 -31 35 288 -60 -300 -32 -392 -112 21 -116 -224 -218 -271 -128 -336 145 -237 -82 71
2953G1k01L55k72J74J06r9Mr4K11k49q3J50R9l42J04K32j81k35M25j63l64L59
$$ 71 -130 225 -47 127 233 134 138 44 255 6 -77 73 172 -170 -66 166 -15 -250 175 12 -352 7
2975Gl3n8q7N0Q2k15K53j7J72J01o0l36Q1K3J33l6l23L22M44l01q3L19n15j75
$$ 7 -26 -84 -171 -121 -39 -254 -1 -18 154 255 195 -141 -60 -37 96 60 -263 59 503 202 119 438 -77 -252
2999b52M42j56j25l6J22k15J06L38k38m44L41m5j6Q5K84l70J04J09J8J34j41j57
$$ -252 190 34 -91 -127 -5 -220 -114 224 -14 -458 -117 -162 -178 -93 191 -179 -75 34 52 186 45 -112
3021a12L39m3o7r2L7q0k13L21q3m11M63J02m12K7J40Pl83M19k18q8N31k55j01
$$ -112 227 184 117 25 62 -18 -231 90 7 -404 59 161 -251 -224 -84 -77 -460 -41 -259 -347 184 -71 -172
3044a72l9K65k52J66n1n7J62j30L66j29j63M0J61j82J28mp0k7k89L2J16K91k70
$$ -172 -211 54 -198 -32 -83 -140 22 -108 258 129 -34 6 167 -15 113 109 39 12 -277 -245 -129 162 -108
3067a08l1K00j79J50o2j63k19K98J23k42L08p6J59n38L07L64k82k39O08l93j11
$$ -108 -139 61 -118 32 -30 -193 -412 -114 9 -233 75 -1 158 -380 -73 291 9 -230 378 -15 -126
3088a26J25K38n50N70j89j48J29K84l95J15K87k47j87J74k8m12M29p7j87M5J78
$$ -126 -1 237 -313 257 68 -80 49 333 -62 53 340 93 -94 80 52 -360 69 -8 -195 -150 28
3109B8j54N8K72l94J90M56m05k21M46j09o15O10K9k33p4K16K7n27N90j39k77M90
$$ 28 -126 -68 204 -190 0 456 51 -170 276 167 -448 162 191 -42 -116 100 127 -400 190 51 -226 264
3131B64J67q59L59K20n20J91L07q9k40J66J41m17J85n9K14k23R1R3P7K42r8j78
$$ 264 431 -428 -69 151 -369 -178 129 40 -200 -34 107 -310 -125 -184 30 -193 -102 -9 68 310 212 34
3153C4K98l64p6L57k83K34l34L21j12j50P1J11k96K5M7j7l70M78k28J50Q9K31
$$ 34 332 -32 -108 249 -34 200 -134 187 75 -75 -4 107 -189 -164 -117 -134 -504 -26 -254 -104 -15 216
3175B16o19M29J69n00M39j04Q8j90M11k37l45J49K27Ll74L53m2k87L26j00j02
$$ 216 -403 26 195 -305 134 30 118 -72 339 102 -243 -94 133 136 -238 115 73 -214 112 12 -90
3196i0J85k71M6K7J26k87R3N27n03j52M74j43l98K95K96n22K50J68l14L36K34
$$ -90 95 -176 -130 -103 23 -264 -171 356 -147 -299 175 32 -366 -71 225 -297 -47 121 -193 143 377
3217C77k90k50L09M2l45J26L44k50k39K15l16J29k2K33j40J9J74r6j08j65K32
$$ 377 87 -163 146 188 -157 -31 313 63 -176 39 -277 -148 -170 63 -77 -58 116 20 -88 -253 -21
3238b1j96K80L0n6k1K28k19J1L8k4J45o2j88m3l6M21o50M53M7k59j21M00j07k54
$$ -21 -217 63 93 37 16 244 25 36 74 50 195 133 -55 -98 -134 287 -363 90 137 -122 -243 157 50 -204
3262b04J85K3k16J38K16n83L20L05j28l94K59r0N6J70l3j71K10K07k1j16p8M1
$$ -204 -19 4 -212 -74 142 -441 -121 184 56 -338 -79 -169 -113 57 24 -147 63 270 249 133 55 96
3284I6%j36L4J60j54R8m07O94l56j96L30j53j55J11k46K80m34K43N10n17J23K00
$$ 96 96 -40 -6 154 0 98 -309 385 29 -167 163 10 -145 -34 -280 0 -434 -191 319 -198 -75 125
3306A25j83j29J35J99l05L27N7l7j21K34L3k15P6O8k89n3L74m76M7O3K88k84O8
$$ 125 -58 -187 -52 147 -158 169 226 189 68 302 335 120 196 264 -25 -78 296 -180 -133 -70 218 -66 2
3329Bl6j36O1K32m63J64K99n08J29J70Lk8N24l91j19K44J47k75rq0J90l11K90
$$ 2 -34 -170 -109 123 -340 -176 123 -385 -256 -86 -83 -111 413 22 -97 147 294 19 10 -70 120 -191 99
3352I9o3J55k21M5j56P0J41k18Q0Q9o8k21L18j43n3r2J52N0R5L2k66K47K39k74
$$ 99 36 191 -30 15 -141 -71 70 -148 -68 21 -47 -268 50 -93 -146 -238 -86 -36 59 91 -175 72 311 37
3376C7J33j0n5k0L9mk98J57K83m02m5K72l8N2p7j39J31o8L0l21L94n9J67l76J81
$$ 37 170 160 105 85 124 120 -178 -21 262 -140 -185 87 49 101 24 -115 16 -52 -22 -343 51 -8 159 -217 -36
3401c6j87J07o9K71j90J17L2L02m51K43j70J89j86n1M72m54K13k03N6n5K77P7
$$ -36 -223 -116 -185 86 -104 13 45 347 -104 139 -31 158 -28 -79 393 -61 152 -51 5 -50 227 304
3423C04l48K23j89Kp7LJ16N8k62PJ50P1k72K83ml28L56O2j46K51n4K18m24K99
$$ 304 -44 179 -10 -8 -85 -82 34 92 -170 -163 -13 58 -214 69 65 -263 93 155 9 260 206 424 0 299
3447B99j81l24L12j0%k2n8P9q7l13L42J19l37J17J29L5j96N6K09k7j79lJ26k55
$$ 299 118 -206 106 96 96 74 16 95 8 -305 37 156 -181 -64 65 100 -96 -40 169 142 -37 -40 86 -169
3471a69L03o4lL4j15K33k16p6J27j41P4J16P5N0m4l06r3N9J12j01K41j13K81k78
$$ -169 134 70 67 101 -14 219 3 -73 54 -87 -13 103 178 228 184 -122 -215 -156 -44 -145 96 -17 264 -14
3495a4n6o2M6P5o4J23k06r6Q6L75j47k07J24p2K63R1j01l22K46n1k78K20o8J39
$$ -14 -70 -132 -86 -11 -75 48 -158 -254 -168 207 60 -147 -23 -95 168 259 158 -164 82 31 -247 -27 -95 44
3519D4j48K8J47j68j0R5j53Q1j29K46J44m61j0L89q4J21l6J28k82k9J59J92j20
$$ 44 -104 -76 71 -97 -107 -12 -165 -84 -213 33 177 -284 -294 95 11 132 96 224 -58 -87 72 264 144
3542A44j08K90k39l1J65k61PL2O5J7j13J64k43M0qP5m45M31L28k34j29K19j69
$$ 144 36 326 87 56 221 -40 -33 -1 64 81 -32 132 -111 -71 -79 -4 -449 -18 310 76 -53 166 -3
3565cJ71p8J18j41q1K5K29r4k5M9l32N0K43j81J36J28k07j6q0m7K0L46o3o05K26
$$ -3 168 90 208 67 -14 11 240 146 121 170 -162 -112 131 -50 86 214 7 -9 -89 -136 -116 230 167 -438 -212
3590b12K9OL3K07l54J75K91m5l23L01N5l57L21K30k16j04J30k60O6J94n3k06J5
$$ -212 -183 -177 -144 63 -291 -116 175 130 -193 108 163 -194 127 357 141 37 167 -93 -27 167 114 -92 -77
3613g7L96m73M86l84n9Q8j96L56k45K48k44K00j61J40j69j25J87K9J40J1j02k57
$$ -77 319 -154 332 -52 -111 -23 -219 137 -108 140 -104 96 -65 75 -94 -219 -32 -3 137 148 46 -211
3635b11M13j95k55K34J36J9L1N6k23j61M45k7l01OjJ29j53K02l7l67P1K09j38
$$ -211 202 7 -248 -14 122 141 172 228 5 -156 289 262 -39 -33 -34 95 -58 144 107 -260 -189 20 -118
3658a18P6J26l58J71Q5J62k49J02K15k45r6K48l94K02J77n5MP8k07P2p9nJ05J08
$$ -118 -42 84 -274 -103 -18 144 -105 -3 212 -33 -129 119 -275 -73 104 49 53 131 -76 -4 -83 -88 17 125
3682A25j60n8j7L21j71k33J27M7p5L0nmq7J48O8J41j33k5n0K15j75K69j83l3p1
$$ 125 -35 -93 -110 211 40 -193 -66 -19 -94 -64 -69 -73 -160 -12 56 197 64 39 -11 204 29 298 115 82 11
3707A1q7M35l22Qj91K0k07L61j17j89L3K45j80m3J05O5l3J9O1j19J85K24n80J76
$$ 11 -76 359 37 45 -146 -126 -333 28 -89 -278 -245 0 -180 -223 -118 -53 -86 -67 -6 -125 60 284 -296 -120
3731a20K32l61M20J86l50k14P9O8K2m4Oj10q5K55j24J46J0j12j0LjO1j28R7K78
$$ -120 112 -249 171 357 7 -207 -128 -60 -38 -82 -76 -186 -271 -16 -140 6 16 -96 -106 -103 -104 -43 -171 -74 204
3756B04j18k1m5o8J51j95J44k2M1k7R5K25k97k0J74k22j82Q8kK1j75N37r2l46
$$ 204 86 65 20 -48 103 -92 52 30 71 44 139 364 67 47 221 -1 -183 -95 -97 -76 -251 286 194 -152
3780a52J12J42k96l8L21k79K8L8l1J05Q0r6ON0L0M7K63k71K5j2j60j8K51L6j49
$$ -152 -40 102 -194 -232 89 -190 -162 -124 -155 -50 30 -66 -60 -10 20 67 330 59 84 72 -88 -106 145 181 32
3805C2j25R9K35n14M54k50P0J74k21j04j91N00k18o9P1k40J48M8J00j05j42M38
$$ 32 -93 6 241 -273 181 -69 1 175 -46 -150 -341 159 -59 -128 -57 -297 -149 -101 -1 -106 -248 190
3827A90q1j55J4K58J38o55N58k13j66K57l70M36j95m7n0J0K50k28l8L5J65l4j73
$$ 190 109 -46 -32 226 364 -291 267 54 -112 145 -225 211 16 -31 -81 -71 179 -49 -87 -52 113 79 -94
3850i4m3J14J09p0k7J18j15J85k05K9j26j31K98N9J90j31K47n30M2K21k17o0J1
$$ -94 -137 -23 86 16 -11 107 -8 177 -28 1 -125 -256 42 101 291 160 407 -123 -81 140 -77 -137 -126
3873a26L11m98L83K8p8l0M1J02j26J24q1l9l1m6m5K77M4k80Q1P7j42M0J82k18
$$ -126 185 -313 70 98 20 -10 31 133 7 131 50 11 -20 -66 -111 166 210 -70 11 88 -54 -14 168 -50
3897e0K91j90K24k99P4m2m3L09j71j41j24L70k30k74J47J30j13M7o4J53J60M7
$$ -50 241 51 275 -24 50 8 -35 274 103 -38 -162 208 -22 -296 -149 -19 -132 -85 -149 4 164 211
3919B11l11j7J55j1N0o6j7L1oK6j56k3K68K09m00j46K27j12K1J02k44%K74k05
$$ 211 -100 -117 38 27 77 11 -6 25 19 45 -111 -134 134 343 -57 -203 24 -88 -67 35 -209 -209 65 -140
3943a40J85k6L8l90OM02J2L6l50N75j2m49Q8q7J95l27L19j44M0l8K95j71J07j58
$$ -140 45 19 57 -333 -327 75 87 123 -227 348 336 -113 -25 -112 83 -244 75 -69 -29 -67 228 57 164 6
3967FL2J61l64K29N0o5k8j1m3J19p5k02K10j42J51l9l8j3j01Q0L83k33n1J09O2
$$ 6 38 199 -165 64 114 49 21 10 -33 86 11 -191 19 -123 28 -11 -49 -62 -163 -83 300 67 16 125 187
3992A87k16R8N1k28J23k2j71n6K43k34K63j98K46J48m67J92j33P6R4j11n8P2J1
$$ 187 -29 69 120 -108 15 -7 -178 -234 9 -225 38 -160 86 234 -233 -41 -174 -98 -4 -115 -173 -101 -90
4015i0n8J91k2m4j4o8K70L7k86R8j9J46M6J06k70l76J87k7J42J8R5J6j36r2K53
$$ -90 -148 43 21 -23 -37 -105 165 202 -84 14 -5 141 187 293 23 -353 -166 -193 -51 -33 62 78 -58 -150 103
4040A03j45o5N8K09q3k13Q6o3K59l98J09K15k17K51j06NK43k29k61M84j64L9k02
$$ 103 -42 -107 -49 160 77 -136 -50 -113 146 -252 -143 72 -145 106 0 5 248 19 -242 242 78 117 -85
4063h5Q2kOJ5k97K96J0l6NN7k22K28Q4n36M64R7m9j04j69J62m3JJ66j60j05m3
$$ -85 -3 -5 1 16 -281 15 25 -11 -6 51 -171 57 141 -395 69 166 117 13 -156 6 -37 -36 130 -30 -135 -178
4089a78J72p2K49j71j67K90j9Qm4k9l6k93K90L3l7J7j05OO6K5p1J56nj04k02J14
$$ -178 -6 -78 171 0 -167 123 104 112 68 39 3 -290 0 33 -4 13 -92 -86 -20 5 -66 90 85 -19 -221 -107
4115a07J16j0J32j44j38L28j0k77m3K14k99J7K66j04J47l45M25k78j68M21J33
$$ -107 9 -1 131 -13 -151 177 167 -110 -153 61 -238 -221 45 -59 88 -257 168 -110 -278 143 276
4136B76m29%K25k54J50P8j57q8K08q4J31l58K88k8%k33K93l0N5j34j85M29o9J4
$$ 276 -153 -153 72 -182 -32 46 -111 -199 9 -75 56 -302 -14 -42 -42 -275 18 -12 43 -91 -276 153 84 98
4160I8k94L2M9L98j19k54J98j11J80j50P7q1l48L70J7l08J37K65k89L5M06k44
$$ 98 -196 -164 -115 283 164 -90 108 -3 177 27 104 23 -325 45 62 -246 -109 156 -133 -98 308 64
4182F4r9J38k90J18L8J20j77j38K87q6qL9L7m9R3j34J45j72L1R7O3p3Jk39o8J38
$$ 64 -35 103 -187 -69 -31 89 -88 -226 61 -25 -33 6 43 -6 87 -47 98 -74 -43 54 117 44 45 -194 -262 -124
4208a24N6K73n9n5k07J34j70L3J84j8o6R9P6K12l93J34J48k15M0m7pok70L48j78
$$ -124 -68 205 146 91 -116 18 -152 -119 65 47 -19 80 156 368 -25 109 257 42 82 35 28 22 -248 100 -78
4233g8k14L60r1N5j61L1J47j62M3M8j01J99j38j15J60P3p5k73M15N2J59j83l5
$$ -78 -292 68 -23 32 -129 -98 49 -113 -70 -22 -123 76 -62 -177 -17 56 -19 -292 123 175 334 151 116
4256A16j21J29l6Rr5J40P6l4j94J13O1r7N6j92J79l61L74l43K59k12L30j89N0
$$ 116 -5 124 88 97 2 142 218 184 -10 103 164 67 123 -69 110 -251 123 -220 39 -173 157 -32 18
4279A8P4j54J60j36L6J70q8M0L6j1k02j10J13J49j74NL4q3k9J68j9n9N5K44p5
$$ 18 92 -62 98 -38 -2 168 80 120 156 145 -57 -167 -54 95 -79 -74 -40 -123 -152 16 -3 -62 -7 237 162
4304A62k38L89k69k67M95k90j2k2RK54k74L35p5l97j5J89j92K80K09k01j78P6
$$ 162 -76 313 44 -223 272 -18 -30 -52 -43 211 -63 272 197 -200 -215 -26 -218 62 271 70 -108 -32
4326c2K49q8j8k83j58L26M4r0k52J74R4l1Q5l32K42P9J83k40J02k99L74J15l18
$$ -32 217 129 111 -172 -330 -4 40 -50 -302 -128 -34 -65 20 -312 -70 9 192 -48 54 -245 129 244 -74
4349g4Jl1J4J09Q0Q7j00k51J73j6q7q5J38L0k39L33P0k54K08m4Q6l30nP2J76j64
$$ -74 -73 -104 -90 19 99 186 86 -165 8 -8 -95 -180 -42 -12 -251 82 152 -102 106 62 148 -182 -187 -115 61 -103
4375a03OK02o3k12J04O6r9L59l02L05l64R0Jor4J34k84L75n02J82K65j44oK33
$$ -103 -97 105 42 -170 -66 0 -99 260 -42 263 -101 -11 -10 -16 -110 24 -260 115 -387 -205 60 -84 -90 143
4399A43k77K57j6k7N4rj32j44N8lq2K96k6j75N4m4J55l53M59k01o5l31M41n7j67
$$ 143 -134 123 107 80 134 125 -7 -151 -93 -96 -178 118 92 -83 -29 -73 82 -271 188 -13 -78 -409 32 -25 -192
4424a92J31J88l24K91k43M9m7L29k35k81K81L5Kp3K82l14J84J50j35l6l8R7m30
$$ -192 -61 127 -197 94 -149 -100 -147 182 -53 -334 -53 -18 -16 -89 193 -121 63 213 78 42 4 101 -329
4447c29L88r9K42k78K26kr9j42J42N5k1j14j2q0N1Q9j63J56J07j13k66M00Pj76
$$ -329 59 -40 202 -76 150 148 49 -93 49 104 83 -31 -43 -123 -72 17 -146 10 117 4 -262 138 145 -31
4471c1J67k03J49k17l2K96k78N1j31K90j7p1K03j98q5m7K77o4k0k37K59J39j22
$$ -31 136 -67 82 -135 -167 129 -149 -98 -229 61 44 -27 176 -22 -107 -154 123 59 39 -198 61 200 78
4494G8l05M48m14p7L30j03J32l05J39j6J98nq9l82N54n8k90K84k44J33L58l23
$$ 78 -227 221 -193 -270 60 -43 89 -216 -77 -93 105 100 11 -371 183 125 -165 119 -125 8 366 43
4516D3Jk59M26j94K68m42J68n9J92j25k94M34j63l7L04j42l17K09l4k85K47J54
$$ 43 44 -215 211 17 285 -157 11 -48 144 19 -275 159 -4 -41 263 121 -196 13 -21 -306 -59 95
4538I5j93L14k16J92j99J43O2k79K7J38j40O7k65J64q5L18r5J45L6k38q6J59p0
$$ 95 -98 216 0 192 -7 136 198 -81 -54 84 -56 11 -254 -90 -175 143 48 193 229 -9 -95 64 -6
4561fJ10J15j54K49k62k3K21k28j29J65k44J94L16j84j87p8J30J1j90L02q5r3
$$ -6 104 219 65 314 52 29 250 22 -107 58 -186 8 324 140 -47 -125 5 16 -174 128 43 -50
4583e0q3o2J26j85m4K49Q1P8k31N1Q3l7r1J44Q4R4p3k11r3j5O1jJ37J51j62J07
$$ -50 -133 -195 -69 -254 -298 -49 32 110 -121 -70 13 -24 -115 29 113 207 134 -77 -170 -185 -124 -125 12 163 1 108
4609A08j47J00l07J76K37l62j5J10o0K98l15L14j08j93Q9J18J42n8j51m8O4P7
$$ 108 -39 61 -246 -70 167 -195 -210 -100 -160 138 -177 137 29 -164 -75 43 185 127 -24 -72 -8 69
4631F9r9J25j43R4j20k21K83N0j13K40k50L6N3j01J07O5l9k3J26j22J1m4k45J80
$$ 69 -30 95 -48 46 -74 -295 -12 38 -75 165 -85 -49 4 -97 10 75 36 13 139 17 28 -16 -261 -81
4655h1q5j97K83k27M76k99K73K1kk26J87l69K79j57K21k07j35J02K6J13j76K55
$$ -81 -166 -363 -80 -307 169 -130 143 164 162 -64 123 -246 33 -124 97 -110 -245 -143 -117 -4 -180 75
4677G5j63K33j68j02j06K86K3o8j5Q4j42j16K98k37J15J5p5K25j15j8J5P2k11
$$ 75 -88 145 -23 -125 -231 55 78 10 -5 79 -63 -179 119 -118 -3 12 -63 162 47 29 44 116 -95
4700i5J52n6p0J86j93k23J89j26J78J78o4k28K00J70j81K2Mk13L43k44K14k41
$$ -95 57 1 -69 117 -76 -299 -110 -236 -58 120 56 -172 28 198 17 39 43 -170 173 -71 143 -98
4722i8j42M40k91j0J45j01N2J65J28r5k06K09l39L7q4mJ39J28l92M68L0l96j07
$$ -98 -240 200 -91 -101 44 -57 -5 160 288 193 -13 196 -143 -106 -190 -194 -55 73 -319 149 179 -217 -324
4745c24L20O5J10k14J66j65j89K1n3K85j00j53K18r5N4K19j3j60J27j7J69k15
$$ -324 -4 61 171 -43 123 -42 -231 -210 -263 22 -78 -231 -13 -108 -54 165 152 -8 119 102 271 56
4767E6J89M7l36r9K2K39k56L17k16K62m23K35j38J67M3J2n9k05J82m8J34k08N7
$$ 56 245 292 -44 -143 -121 118 -138 179 -37 225 -198 37 -101 66 109 121 62 -143 39 -9 125 -83 -26
4790b6K81k55%j88K34l6n2j1O7JJ4J70m35M16p2l8K7p5J70l45J72J04j04k6K61
$$ -26 255 0 0 -188 46 10 -42 -53 14 15 29 199 -236 180 108 70 97 22 192 -153 19 123 19 -7 254
4815B54m21L80l56J66p5K05q4k1k30m0J85N4l51L53K10l80K5L47j02r9k0k12J78
$$ 254 -167 213 -143 23 -52 153 69 48 -182 -222 -37 17 -334 19 229 -151 -126 221 119 20 0 -212 -34
4838c4J14M2K06k87J39j93K27j69q9L2J90P3l56J32j3l6J49n2m4J82k71N7ml64
$$ -34 80 122 328 41 180 -13 214 45 -44 -12 178 251 -105 27 14 -22 127 75 31 213 -58 -1 -5 -369
4862c69L45Q5K4K87k65J55k95j30J23K9P9J5j63J87j76J7j49M03k76J19J21k76
$$ -369 -24 61 85 372 107 262 -33 -163 -40 -11 68 83 -80 107 -69 -52 -201 202 -74 45 166 -110
4884a10R1K59m33L50j68q7j49M57q4j3p0P0K4m60J45PJ15J82l0m4r9M8J14k90
$$ -110 -19 240 -193 157 -11 -98 -247 210 126 113 43 113 137 -323 -178 -171 -56 126 96 52 -47 1 115 -175
4908a75K05k4p7J4r9K27j74R9L39k48k39J51oj16Q1j49K41j97J46J15l6j31K11
$$ -175 30 6 -71 -57 -156 71 -103 -4 335 87 -152 -1 -7 -123 -42 -191 50 -147 -1 114 78 -53 158
4931A58q9j80p1J81M8k96K70K19l53K16Q9j70k91M38k85L93j11j34l7m6K06m20
$$ 158 69 -111 -182 -1 47 -249 21 240 -113 103 192 22 -269 169 -116 277 166 32 -5 -51 155 -265
4953b65M80l18o8O5J33nQ2j08L66k68L7j97k25M76k88M6q2o1J15K87j94j39MO1
$$ -265 215 -103 -171 -106 27 22 104 -4 362 94 131 -66 -291 185 -103 -57 -139 -200 -85 202 8 -131 -127 -66
4977f6J50j83j39O1J61j24K93l59K56L8j30Q4j18j5K09J25j10n4k05J72jp4J67
$$ -66 84 -99 -238 -177 -16 -140 153 -206 50 88 -42 42 -76 -91 118 243 133 79 -126 46 45 -29 138
5000A38Mk34J58k20J43j46R1K23j81J0K96l36j52M66l45J14L0j64O7K16l96K26
$$ 138 142 -92 66 -154 -11 -157 -66 157 -24 -14 282 -54 -206 260 -85 29 59 -105 -38 178 -218 8
5022HJ38O4j70M3k54K88j70J64k49J71J30k40M40m61J15o1J9J69l2j29j01J48
$$ 8 146 210 40 83 -171 117 -53 111 -138 33 163 -77 363 -98 17 -44 -25 144 112 -17 -118 30
5044C0J25m1k19o9J45J89j52M6P5k77J17L7N3j17ooK84l03l4K97j65K79l39J64
$$ 30 155 114 -105 -174 -29 160 8 54 129 -148 -31 6 59 -58 -64 -70 214 -89 -123 174 9 288 -51 113
5068A13M6k78Q0k61M21j33J6O7l66J63O1K8M2l9r9j15M07j47K8K35J75o8m34J20
$$ 113 159 -119 -39 -300 121 -12 4 71 -295 -132 -71 -43 -1 -40 -139 -254 153 6 34 269 444 376 -58 62
5092F2j66Q7m0j66M40k43L4N6J71j58l5k85J04R0J27Mq9nR2k4m4j1K15k79m5j9
$$ 62 -104 -17 -57 -223 217 -26 8 64 235 77 42 -243 -139 -49 78 82 -7 -12 80 56 12 1 216 -63 -108 -127
5118a27L07k1N7l55L1j18J13O1k5K23j8j15q7J62l45L76j15J24l65k5M96l22O2
$$ -127 180 159 216 -139 -108 -226 -113 -52 -77 146 128 13 -74 88 -257 119 4 128 -237 -262 234 -88 -26
5141b6j39L64k25O1O0k48J78q4P6K6q3M8k25l8L22M6j26k89K72K18r4p9r0J49
$$ -26 -165 199 -26 35 95 -153 25 -59 17 43 -40 8 -217 -255 67 113 -13 -302 -30 188 94 15 -75 74
5165G4q3j22j02N24l71p3L82k13J62q2p4p7p9K2K52k01P9j41K96k94o9K71j78
$$ 74 -9 -131 -233 291 -80 -153 229 16 178 96 22 -55 -134 -112 140 -61 18 -123 173 -121 -190 81 -97
5188i7K87k54J42l5L02l44m5J39j45P0k1L4k29J49J94l90J9K29p3J15o9P4k24
$$ -97 190 -64 78 43 345 1 -44 95 -50 20 -1 33 -196 -47 147 -243 -224 5 -68 47 -22 52 -172
5211a72K44j5k83J99J56j02Q3k99J95j63J29J3k06J35J42k16J79L3j47J66j60
$$ -172 72 57 -226 -27 129 27 110 -189 6 -157 -28 -15 -221 -86 56 -160 19 52 -95 71 -89
5232h9K02L8p9L6k6k39J11P9k44r8M44J14m87J20P0J00j17K76j27J3q2j50M62
$$ -89 113 151 72 108 82 -157 -46 33 -211 -309 135 249 -238 -118 -48 52 -65 211 84 97 15 -135 327
5255C27l42ON9n9j97M06l88K33Q0j65rn5L5p1L94l34K1Q0q0j83K1N27l09p2j41
$$ 327 -15 -9 50 -9 -206 200 -188 45 125 -40 -49 -104 -69 -140 254 -80 -59 21 -59 -242 -221 306 -3 -75 -216
5280b16M00j05q0k07M44k42J07k22M8K82k08J10n3j9j45q1K42l4m7m9K81k70n2
$$ -216 184 79 -1 -208 236 -6 101 -121 -73 209 1 111 58 39 -106 -187 55 21 -26 -75 206 -64 -116
5303a16J18J17j34k31K66j05K52j56K7j16J00k14J97k7K58m24L63j33K6m04L28
$$ -116 2 119 -15 -246 20 -85 167 11 38 -78 22 -192 5 -22 236 -188 175 42 68 -336 -8
5324hk74L00J36p8j47J14m2n1J08P9k67L29J21j09j06k03j67K83M2m0j87R3Ml4
$$ -8 -282 18 154 76 -71 43 1 -50 58 137 -130 199 320 211 105 -98 -265 18 60 20 -167 -74 -70 -104
5348a04j3J11j64J91k6o0o1l8J16j05K41n5mj64J04Q8JJ74k45J68j57L27j39l48
$$ -104 -117 -6 -170 21 -5 -65 -126 -164 -48 -153 88 33 29 -135 -31 57 58 232 -13 155 -2 325 186 -162
5372a62K08J06R4n09K59Q5l26J22J62k17N3l13L02K05j37j18K30K0n8j17J87Q
$$ -162 46 152 246 -263 -4 81 -245 -123 39 -178 -125 -438 -136 69 -68 -186 44 64 6 -111 76 84
5394H4K35l03M2n0j11L91j50j86j42J44j2L53m03RJ23m8l0k5J18rl8j34l4L74
$$ 84 319 16 58 8 -103 288 138 -48 -190 -46 -58 295 -108 -99 24 -24 -54 -79 39 30 -8 -142 -176 198
5418A98k01K74j70j12J57k63K04O9j94k43L08k58J99K47k67l0N4p1p7J93p0j9
$$ 198 -3 271 101 -11 146 -117 87 156 -38 -281 27 -231 -32 215 -52 -82 -28 -99 -176 17 -53 -72
5440g2J25J04j15r2mOok10K69o0Q9j18P5J4J06r4k62J65N5M5j62P9%j61L1J4K47
$$ -72 53 157 42 -50 -54 -48 -54 -264 5 -55 34 -84 -9 5 111 17 -245 -80 -25 20 -142 -63 -63 -224 -193 -179 68
5467F8K50k93rK84j57k94n7L31j08l56M64p4j5j3K02l11N0j33K4M2j51J85O7J20
$$ 68 318 25 16 300 143 -151 -208 123 15 -341 123 49 34 21 223 -88 -38 -171 -147 -105 -256 -71 -4 116
5491A16j36L2j07J08j5J48k83J55Jj61O4J45J19j1lj88L16k25j89J27P7p4q7J76
$$ 116 -20 12 -95 13 -2 146 -137 18 19 -142 -78 67 186 175 172 -16 300 75 -114 13 90 16 -71 105
5515A05k8K1k17L55k43J43K1j85J3j82K15j4Q9j06j31J24kJ03r0J3j45L68k99
$$ 105 77 98 -119 236 -7 136 157 -28 -15 -197 18 4 93 -13 -144 -20 -22 81 -9 4 -141 227 -72
5538g2j2J10K3K5j83M5Q3m5jj1m7J60q9p7j19L49j98k42K64j0K5m0J2j58J73J13
$$ -72 -84 26 49 74 -109 -64 19 -26 -27 -38 -85 75 -14 -91 -210 139 -59 -301 -37 -47 -22 -62 -50 -208 -35 78
5564G8j07k08L05n6l9L30l70Q1j00j2L23l42J95J52k83O8N1l18M27n58J73K01
$$ 78 -29 -237 68 12 -27 303 -67 14 -86 -98 225 -117 78 230 -53 15 66 -252 175 -383 -210 -9
5586in4L8N6k22K62K25k19L0k06M69m60J26j06N5l9L45m27L38k39J43j9k49K70
$$ -9 -63 -25 31 -191 71 296 77 107 -99 370 -90 36 -70 -15 -54 291 -136 202 -37 106 87 -162 108
5609A08k16M3K65l25L16l76M27m19K9J50J23J6l02K71L1k77L25k16j10J38J59
$$ 108 -108 -65 200 -125 191 -185 242 -177 -148 2 125 141 -161 110 141 -136 189 -27 -137 1 160
5630A60k02J84j20j23L7Qk03M90mj38J25k30J13J9Q8M5m23R4J48Jk49L42j93J17
$$ 160 -42 142 22 -101 -64 -56 -259 231 227 89 214 -16 97 116 204 249 -174 -80 68 69 -180 162 -31 86
5654H6k21M1R9r1J26M7k02J53k32K67n6P7j19Ll3J80j17J32k81m1K89o9K50k95
$$ 86 -135 -94 5 -86 40 87 -115 38 -194 73 17 94 -25 -22 -55 125 8 140 -141 -182 107 38 288 -7
5678gp1R8l21L4K17R1j82J89j59J37M8l44K47J24K0l21J33J12n9p6K25j19M5K13
$$ -7 -78 20 -301 -267 -50 41 -141 48 -111 26 74 -270 -23 101 121 -200 -67 45 -14 -90 135 16 61 274
5702B74j89J73l78N3j12L02k40O8R2J12k85nn2r4L85j47J4R9R2m06L08n1Qk05
$$ 274 85 258 -120 -67 -179 123 -117 -49 43 155 -130 -135 -187 -281 104 -43 -29 70 162 -244 64 13 21 -184
5726a84J05j78K83k18K82J38kl22J8J65Q2Jj92mJ31j04j60K34j01K95m06M03l43
$$ -184 -79 -257 26 -192 90 228 226 -96 -78 87 169 170 -22 -26 105 1 -159 75 -26 269 -137 266 -77
5749g7J65J20p6l50qK57R4M9J61k74n1k58K94j45P2J49o8rM6j88J80j83P2k78
$$ -77 88 208 132 -218 -226 31 125 174 335 61 10 -248 46 -99 -27 122 54 45 91 -97 83 -100 -28 -306
5773c06J91K3Q2j31rN6L39j80k94J88RJ50p2P8j55Nk0K2J92l37M9k5O4K99l15
$$ -306 -115 -92 -10 -141 -150 -94 245 65 -229 -41 -32 118 46 124 -31 -26 -46 -24 168 -169 -120 -145 -81 218 -97
5798i7k76N32k16J66k05n1K0J87k11q5K44R3k07j1J94q5l37K67J35jP5P2n5j48
$$ -97 -373 159 -57 109 -96 -147 -127 60 -151 -236 8 101 -106 -117 77 -8 -345 -78 57 56 131 203 148 0
5822@L2j73J46J15k60N0j02K30r0q6J69J06k5q8K6k11J91k44K21j32K47k50Q4
$$ 0 32 -141 5 120 -140 -90 -192 38 -52 -138 31 137 112 24 50 -161 30 -214 7 -125 122 -128 -44
5845d4l0j86L8K05J37j43M3J69j94J10l02M13p2j33O7j45L39l18L19l34j20L3
$$ -44 -74 -260 -222 -17 120 -23 20 189 -5 105 -197 216 144 11 78 -67 272 -46 273 -61 -181 -148
5867a48K29p2J35r4j38K62ml60K00k16J27L04k88j03K53J5k58K02l26K42j47L03
$$ -148 81 9 144 50 -88 174 170 -190 10 -206 -79 225 -63 -166 87 102 -156 46 -280 -38 -185 118
5889A18J07j48m5j21K6N0j67J25K40l93N6K14k44J68K73l03K0O0O2M9k81J02L63
$$ 118 225 77 32 -89 -63 -13 -180 -55 185 -208 -152 62 -182 -14 259 -44 -24 36 98 147 -134 -32 331
5912C31k32o5n1J73M9j80L7j17K09j17m9Q0M7QQk48M9R1P8j89K33Q4k82J13J94
$$ 331 99 34 -17 156 205 25 62 -55 154 37 -12 68 115 123 131 -117 -68 23 101 -88 145 229 -53 60 254
5937B54l45K60j57j95K84l69J56k7l3M01k55Q2k99J90N0l5J24M7n4Q9k36K57m19
$$ 254 -91 169 12 -183 101 -268 -112 -139 -172 229 -26 56 -243 -53 -3 -38 86 133 79 168 -68 189 -230
5960b30K94L36j3m54J84j38J97N8k78J59p2J21j73N7q9pJ0P5j44L8K17P2j34o5
$$ -230 64 400 387 -67 117 -21 176 234 -44 115 43 164 -9 48 -41 -48 -38 37 -107 -69 148 220 86 21
5984B1j80q1K74J69k23J53k09m0M1K19j71J28k33O9K92j90p1m5J23o0j9j6l0r2
$$ 21 -159 -240 34 203 -20 133 -76 -116 -75 144 -27 101 -132 -63 229 39 -32 -77 46 -14 -33 -49 -79 -171
6008a71J65j71J43N1j9j05J28m6K34j53j62K42n5j2m0M3M0O6m16J05K12M4m06
$$ -171 -6 -177 -34 17 -2 -107 21 -25 209 56 -106 136 81 69 29 72 112 178 -238 -133 79 123 -283
6031b83K67O8r5q4J38k19J94o6K76l08Q5J41j38k6J17Qj61J77j40K00j13k7o3
$$ -283 -16 52 -43 -127 11 -208 -14 -80 196 -112 -27 114 -24 -50 67 75 -86 91 -49 151 38 11 -52
6054e2K03k58O3K20j59j63M80l18k38K74j47OJ77P4J08k09k43J21k9J80l00J83
$$ -52 151 -107 -44 176 17 -146 334 16 -222 52 -95 -89 88 162 270 61 -182 -61 -90 90 -210 -27
6076b7j80K87RO1k9k25K39k02k3Q8R2k34K06p9J22q4n0p1J98N7k1k49J62L2p5
$$ -27 -207 80 89 150 121 -104 135 -67 -90 -2 90 -144 62 -17 105 21 -29 -100 98 155 134 -115 47 79 4
6101Dr3l3J40j41L59l59L5J35j03J96j43K39k00p9J46k79J09KQ1j60J61L06k36
$$ 4 -89 -122 18 -123 236 -123 -88 47 -56 140 -3 236 36 -43 103 -176 -67 -65 16 -144 17 323 87
6124H7k7k75K68o7P7jr8J70l02J13J71l3k53K48r3J48k28j30L42j20J84K0l10
$$ 87 60 -215 53 -14 63 62 -36 134 -168 -55 116 83 -170 78 -15 133 -95 -225 117 -3 181 201 -109
6147a09K51k75K04k61O1K30k41K24L5M0P7j58r7Q2r1J31Q1j58j11j39L73l66L21
$$ -109 142 -133 71 -190 -129 101 -140 84 119 159 236 78 -19 63 -28 103 184 26 -85 -224 149 -217 104
6170A04k35k8K59l9Mj3N5l1O2k72J59j46J70j27l5K95K34l23J15k66L31k49J28
$$ 104 -131 -159 100 61 65 52 107 76 138 -134 25 -121 49 -78 -113 182 416 93 208 -58 273 24 152
6193A52j79P4M6K5J65l12j23P3J05r6J20M8j38K14r8L2N7j42K36j98L9j25j69
$$ 152 -27 47 93 118 283 -29 -152 -79 26 -70 50 98 -40 174 76 108 165 23 259 61 100 -25 -194
6216a94Q0J8q9M9J56J2J48j96J08j47K93k26jQ4J47k46M7j48j8K84k57Q6p5J87
$$ -194 -114 -96 -185 -136 20 32 180 -16 92 -55 238 12 11 95 242 -4 43 -105 -123 161 -96 -10 -85 102
6240A02m2Q3k99J68j04O9P7K42k51J8j15L1J35J48l03J6N9j56J15l2l0q8K34j85
$$ 102 60 143 -156 12 -92 -23 54 296 45 63 -52 -21 114 262 -41 -25 34 -122 -7 -39 -69 -157 77 -108
6264a08O6l4q0K36j73N8J6K26j65j44J13O3K1m34L00l9J80q2j55qL69o7k93K65
$$ -108 -42 -76 -156 80 -93 -35 -19 207 42 -102 11 74 95 -339 -39 -78 102 20 -135 -143 226 159 -134 131
6288A31m3L7n13O24pl27M11j13k38K14m50L34J0m30L08J04L2j55n4p4k4K76p7
$$ 131 88 125 -388 236 229 -98 313 200 -38 176 -274 60 70 -360 -52 52 84 -71 -125 -199 -223 53 -24
6311b4j5J9r0J17jO4k97J61K36j06j89L8R4J2K4N2n8j79J79j98J53L5j23K95q2
$$ -24 -39 -20 -110 7 6 70 -227 -66 170 64 -125 -87 7 19 43 95 37 -142 37 -161 -8 27 -96 199 117
6336A17Jk1l62L04K1j93n4J67l6j41R0RJ53Mk64K56J6n9O5Q0j82K23k40J84J32
$$ 117 118 97 -265 39 60 -133 -187 -20 -56 -197 -107 -98 55 59 -205 51 67 8 73 153 -29 194 -46 138 270
6361B70m68M13j38j92Q4k10J14K68j1j73o0m9K27R0k33J89r7r2M4j9J37j66M5
$$ 270 -198 215 77 -115 -31 -241 -127 141 130 -43 -103 -152 75 165 -68 121 24 -68 -24 -43 94 -72 -27
6384b7K29j04m0L6l76L55M1j32Oq7K79j27j45J41M6j83k9K36l95K24L1J46J23
$$ -27 202 98 58 94 -282 73 114 -18 -12 -99 180 53 -92 49 95 -88 -117 119 -276 -52 -21 125 248
6407B48l39J05k47M42j91r7R1N7J18m03L05l17K33j51K82j33j53K97j92j6K44
$$ 248 -91 14 -233 209 18 -79 12 69 187 -216 89 -228 5 -146 136 3 -150 147 -45 -61 183
6428A83m03J14r4P5K03p8J10o1R0j18m18L45l9J38N9J04m19J44J09J42J70l44
$$ 183 -220 -106 -200 -125 78 0 110 49 139 21 -397 -52 -91 47 106 210 -209 -65 44 186 356 12
6450A2M4j96J50n9j22K72k36L98j62r2O4M8p2J95m28J4M46k07m9N3j71l0J56n0
$$ 12 56 -140 10 -49 -171 101 -135 263 101 9 73 121 49 244 -184 -170 276 69 20 73 -98 -128 28 -22
6474b2J30K6N1l2p8K55l89j33K28q6j80J93K2j0K9Q0M8K7j16j45l7J62Ol66J45
$$ -22 108 134 185 153 75 330 -59 -192 36 -50 -230 -37 -15 -25 4 84 132 159 43 -102 -139 23 29 -337 -192
6499a92L91j48j40l1K41L0l7j8j00r4R6k48J84l15M76K6Ml9o8j79J16kK14j05
$$ -192 199 51 -89 -120 121 151 114 96 -4 -98 -2 -250 -66 -381 95 121 125 86 18 -161 -45 -47 167 62
6523F2n5m5p8K9O1j90L36j46R6p8j36J97j02J24j48j80K14K26k30P4j53J38j18
$$ 62 7 -38 -116 -87 -26 -216 120 -26 70 -8 -144 53 -49 75 -73 -253 -39 187 -43 31 -122 16 -102
6546a02J87n1k02RJ83m0L48m96M52m87J82p5l1J62Q6j32m5J57k05o1J12P3o6O1
$$ -102 85 34 -168 -159 24 -16 332 -164 288 -199 -17 -92 -123 39 125 -7 -52 105 -100 -161 -49 24 -42 19
6570A9k5JK38M8n08M62l08J54l00K99k11J8L63l07q2L25m58L25k61J33K10n9J6
$$ 19 -6 -5 233 281 -227 235 -73 81 -219 80 -131 -113 250 -57 -139 186 -272 53 -208 -75 135 76 92
6593I2q2j3k48J82j14K28l7k03N2J62j76J06L5j95J31lJ10p1J41K7k93k13M35
$$ 92 10 -3 -251 -69 -183 45 8 -195 -143 19 -157 -51 -16 -211 -80 -83 27 -44 97 124 -169 -382 53
6616E3k45K76Jr7k91J51J09J12J0l07n4M55j36p4N0j1k9l7K93l13J07p4J12J04
$$ 53 -192 84 85 -12 -303 -152 -43 69 79 -228 -282 173 37 -37 13 2 -27 -64 229 -84 23 -51 61 165
6640A65l74M04k34j01K58O2n7k94L54k47j2n3l0N8J75O6j58K1k11K14r9j2K20
$$ 165 -209 195 -39 -140 118 180 123 -171 183 -64 -76 -129 -159 -101 74 140 -18 3 -208 6 -93 -105 115
6663A15j1j93j08J04K15J58l37j80R5k9Q1J51LM2l38J26J25l3j2k12L80j25j09
$$ 115 104 -89 -197 -93 122 280 -57 -237 -142 -171 -90 61 64 106 -232 -106 19 -14 -26 -238 142 17 -92
6686i2n3K00k35N96m93K28j19o6J00NJ81l28K44k60l6m1Q7J36j15J6J67l09M43
$$ -92 -145 55 -180 416 -77 151 32 -34 66 71 252 -76 168 -92 -128 -169 -82 54 -61 -45 122 -187 256
6709B56j55nk40K06m1j37L23k27J2k19K42k69M52j32l2R7k00P9M3m6J50j05p2
$$ 256 101 96 -144 62 21 -116 207 -20 -8 -227 15 -254 198 66 34 131 -69 10 53 7 157 52 -20
6732b0L88l07P0k00J1j15O2J09j27L35j27k59J02K00j05P6k42JL53l42k71M52
$$ -20 368 61 131 -69 -58 -173 -111 -2 -129 206 79 -180 -78 122 17 93 -149 -148 205 -137 -408 44
6754D4j76J70J09j21r3NK02j30j35K46m02M13l27J75J90o0L3P0p3K5j48P6j17
$$ 44 -132 38 147 26 -67 -62 140 10 -125 121 -281 132 -195 -20 170 110 143 213 140 165 17 93 -24
6777b4K73k10k3j44K6k0K07j20r6J69K21j52o9l9j54K87n8j51r3K16j78K23q7
$$ -24 249 39 16 -128 -102 -122 85 -35 -131 38 259 107 38 -1 -155 132 74 -77 -170 46 -132 91 4
6800DL8j24N3j18J61m3L5n1O8k19J12K20j86Qj33J11j94L32k47L02K2k92qJ71
$$ 4 42 -82 -29 -147 14 -29 6 -45 23 -196 -84 136 -50 -42 -175 -64 -258 74 -173 129 151 -141 -149 22
6824B2q1J39K4j12K61k30n0J97r8j89P7QJ56J19l09J35j36J05p0k09L14j08J47
$$ 22 -59 80 104 -8 253 23 -27 170 72 -117 -40 -32 124 243 -66 69 -67 38 -32 -241 73 -35 112
6847A12j33j55j74L55r8j03L42m44K35j19J57qO1j0R2l23J0K16j94J38J47j66
$$ 112 -21 -176 -350 5 -93 -196 146 -298 -63 -182 -25 -33 28 18 110 -213 -203 13 -181 -43 104 -62
6869f2J07J13j73j77K98m3k12K94k97J58R0m0J20l30L8J83l05K85J07j5j72L20
$$ -62 45 158 -15 -192 106 63 -149 145 -152 6 96 56 176 -154 -116 67 -238 47 154 139 -33 287
6891B87k59J64l51J6J99j46j1O7j53M48l41m2J84j71O9q5J57r8P8l62K38Q8Q7
$$ 287 28 192 -159 -143 56 -90 -101 -34 -187 261 -80 -122 62 -109 -40 -125 32 -66 12 -350 -112 -24 63
6914F3j17PJ21o4L58j28l80L29m70J93J44LN1j54J5p4K29l30L53j51J71j19J75
$$ 63 -54 -47 74 10 368 240 -140 189 -281 -88 56 59 110 -44 -29 -103 126 -204 149 -2 169 50 225
6937B25J12m24J79j92K11k29J80j02j75K55q2jM21k85j4l8l5K22k15J52k38P6
$$ 225 337 -87 92 -100 111 -118 62 -40 -215 40 -42 -43 378 93 79 41 6 228 13 165 -73 3
6959CL0K1J18j55q9q5K85m82L26k9L5r6J90k40K54j2l73M23l43K20P6R0l3j46
$$ 3 33 54 172 17 -72 -157 128 -354 -28 -57 -22 -118 72 -168 86 74 -299 124 -219 1 77 167 134 -12
6983a2j11J86j29K30j65N7nk25M16k25rK43j9J37k94K11k44Q8O3j67l6J4k0O6
$$ -12 -123 63 -66 164 -1 56 51 -174 242 17 8 251 232 369 75 286 42 130 193 26 -10 4 -16 50
7007E0k06L26k76J14J03q3R1J17l44K69l83K26r2L9K08j72k0M5K75m27R8N5K1
$$ 50 -156 170 -106 8 111 28 119 236 -108 161 -222 4 -88 -49 159 -13 -33 12 287 -140 -42 13 34
7030C4r1K03m01M22p3k43RK19m5Q3j08J60k00N4j41L8r0J23J43l8k3P6q6o9J8
$$ 34 -57 146 -255 167 94 -149 -140 79 34 117 9 169 -31 23 -118 -80 -170 -47 96 58 35 111 25 -44 -26
7055b6P9k1J64m75J24k3L59l30J83r2j46J51m3K10j25q2J6j41K71J4j55N2K65
$$ -26 53 32 196 -279 -155 -178 181 -149 34 -58 -204 -53 -96 114 -11 -93 -77 -218 53 67 -88 -36 229
7078B29k6Qk44J29J62k02R5m10M81j89k55L50k56J26M9k53L00o5r3J03Q8Jk59
$$ 229 203 211 -33 96 258 56 151 -259 222 33 -222 128 -128 -2 47 -206 94 29 -64 39 127 128 -131
7101a31J25O3o3K91j95l42K57k23kJ03L7J71j74p9J73j33K94j63K9k8l1M8k98
$$ -131 -6 57 -6 285 90 -252 5 -218 -220 -117 -80 91 -83 -162 11 -122 172 9 38 10 -21 27 -271
7124b71J28k1J84Q5k66K43k8kJ53j91J68k94J07k80K47K44k08j08l%J14j44J78
$$ -271 -143 -164 20 105 -161 82 54 52 205 14 182 -112 -5 -285 -38 206 -2 -110 -113 -113 1 -143 35
7147C5j43n9q9L46q0o9P2j11R5K4L43n21K32j4k13l8K48j39j49K73J26j25l9l1
$$ 35 -108 -167 -256 90 10 -59 13 -98 -3 21 364 -157 75 61 -152 -190 58 -81 -230 43 169 44 5 -26
7171b6L6K3J30j28J27k49j69L40q1K05k95j2J87n2j23J57k13N5K18j53m5q3J14
$$ -26 10 33 163 35 162 -87 -256 84 3 208 -87 -99 88 36 -87 70 -143 -88 130 -23 -68 -151 -37
7194c7O3J14m4J62r6l12K02J61m56Q8K84J02k82J26Pp0K51l18p9K40J44k62Q8
$$ -37 26 140 96 258 162 -150 52 213 -243 -155 129 231 -51 75 82 12 263 -55 -134 106 250 -12 76
7217G6l77J79J44J1n5K4J2R8j02R7j6l60K34J39k7n4L0l06J07L66k11Q5l33K63
$$ 76 -301 -122 22 33 -22 2 14 112 10 107 91 -269 -35 104 77 23 53 -253 -146 220 9 94 -239 24
7241B4K7mjq7o4L86r7k41r9J31J97k27J11j60K72J10k80J08l89K83J98j95l7m9
$$ 24 51 47 46 -41 -105 281 184 -57 -156 -25 172 -55 56 -104 168 278 -2 106 -283 0 198 3 -34 -83
7265h3K45p4Q0m7p9L02j67k35O8L5M2j45K92N2l44qq2J47J40j82R1P7n2j9O2L1
$$ -83 162 88 168 121 42 344 177 -58 10 45 87 -58 234 286 -58 -66 -148 -1 139 -43 48 125 73 54 116 147
7291A47l59J06K50k58J1M2KK86l14n8K47Q5j95k46J49K0m5J23Q7J42m58J70m6
$$ 147 -212 -106 144 -114 -103 -61 -59 227 -87 -145 102 187 -8 -254 -105 -85 -130 -7 80 222 -236 -66 -112
7314a12J56K4l10J34J67O5k68J43J7P6K10j20j02l6k22J14q4M4jl5K47J15l62
$$ -112 44 68 -242 -108 59 124 -144 -1 16 92 302 182 80 44 -178 -64 -148 -104 -105 -140 107 222 -140
7337a40J62J1r9oNJ34j45n6%M3K35j38L36l05J37k55J70k33K35J19k90j22K07
$$ -140 22 33 -66 -72 -67 67 -78 -134 -134 -91 144 6 342 37 174 -81 89 -144 91 210 -80 -202 5
7360EN2K27m03J09Q1j28K58j46k7RO3K13k70j59J70N7N1l30L48j30j91J00k51
$$ 5 57 284 -119 -10 71 -57 201 55 28 37 100 313 43 -116 54 111 162 -168 180 50 -141 -41 -292
7383b92J83J45O6p0M3j58Pn2J39K57P6n99L02mlN3j36N9J0k84K49o8P5l6l01M47
$$ -292 -109 36 102 32 75 -83 -76 -128 11 268 344 -255 47 43 40 93 -43 16 26 -258 -9 -77 -2 -38 -339 108
7409A08k12L5L43l14K78l90K73l21K85J73k86LM6j59Q9M7jL7L2J38j91J05J56
$$ 108 -104 -69 274 -40 238 -152 121 -200 85 258 -28 -25 21 -138 -49 -2 -3 34 66 204 13 118 274
7432B74n37K41O5J9k22P1K04q9k06Q6l7N6o6K48j29J09k22J23R9k20J40RN1k16
$$ 274 -263 -22 43 62 -160 -89 115 26 -180 -94 -131 -75 -141 107 -22 87 -135 -12 87 -133 7 16 67 -149
7456a49J23L6L9J8j17n9n4N5J07r6k08M37l9K1k8l50OL94N4k99K3J83m2R8l32
$$ -149 -26 10 49 67 -50 -109 -163 -108 -1 -97 -305 132 93 114 86 -264 -258 136 190 -109 -86 97 55 153 -179
7481a79k6K61J34j1j47P6j18J1q6O0L0J47j73J18J5j45r5J16j59J50%j22K95k95
$$ -179 -205 56 190 179 32 108 -10 1 -85 -25 5 152 -21 97 112 -33 -128 -12 -171 -21 -21 -143 152 -143
7505a43K88j59J2M7r1j61O47j10n42J20kJ9J2j2L37l27J2J7j25J38M5m6J14j08
$$ -143 145 -14 -2 45 -46 -207 440 330 -212 -92 -94 -75 -63 -75 262 -65 -53 -36 -161 -23 22 -24 90 -18
7529a8j40M13m48P3%M6P0k45K32l6k51K16j48N75m07L1J93l78M5mJ56J48k25J16
$$ -18 -158 255 -193 -120 -120 -74 -4 -249 -17 -53 -304 -88 -236 339 -68 -37 156 -222 -177 -181 -25 123 -102 14
7553A4k74K00l07K60P5n5p3L48j78P7j53J03k01K70p3j27K87M1j76K0j53q0K79
$$ 14 -260 -60 -367 -107 -32 -87 -160 188 10 87 -66 37 -164 106 33 -94 193 234 58 78 -75 -155 124
7576A24n2j30mL27k21K7J01m28J30j19K30J85l53K84k4N6j31rN8j19J60l41K49
$$ 124 72 -58 -62 265 44 71 172 -256 -126 -245 -15 170 -183 101 77 133 2 -7 51 -68 92 -249 0
7599@jN3J03k13j59J77J40Lj09L7j27L25n0j3m28K97k18J89J09k34J43Q6q5p4
$$ 0 -1 52 155 -58 -217 -40 100 103 -6 31 -96 229 179 166 -262 35 -183 6 115 -119 24 110 25 -49
7623d9K49j66j18K4J59nM0K02o61N45j69k60K14j08K39k2k08K4K29j17k87M18
$$ -49 200 34 -84 -60 99 94 134 336 -325 220 51 -209 5 -103 136 114 -94 -70 159 42 -245 173
7645A73m80L54K38k14j22J4j76K16J6K9l9j72L14m0k4K59m18M1L82n66K92k07
$$ 173 -307 47 285 71 -51 -37 -213 3 19 48 9 -163 151 111 87 346 -72 -31 351 -215 77 -130
7667a30J6K50j24M1K1q3O0o0J05j27r9J85j69L9J32j00k59M00k0o5n0L3O3j80
$$ -130 -114 136 12 53 74 -9 51 -9 96 -31 -130 55 -114 -75 57 -43 -302 98 78 13 -37 -4 59 -121
7691a21J07k34L21q8K6O9k49L08r7K37l36l7j40J40J34j6J31l7k26m3J61L8j23
$$ -121 -14 -248 73 -15 11 80 -169 139 42 279 -57 -94 -234 -94 40 24 155 118 -108 -151 10 48 -75
7714g5j55L27j36j76K30J3P8j78p7K27j49K27m03J70K09k35j04K20q1J01Q9k51
$$ -75 -230 97 -39 -215 15 28 106 -72 -149 78 -71 156 -247 -77 132 -103 -207 13 -68 33 122 -129
7736a29J15J33J72m03J55p9o4LJ0P0Q7R8l92N12j78j32J55P0M2k25j04J84q7P6
$$ -129 -14 119 291 -112 43 -36 -100 -97 -87 -17 70 168 -224 288 110 -22 133 203 245 20 -84 100 13 89
7760H9j76K30j46o3J71O7k30M9r6j16M60l76j01M14j76R5j93K87q1k46J58J57
$$ 89 -87 143 -3 -66 105 172 -58 -9 -105 -221 239 -137 -238 176 0 95 -98 189 108 -138 20 177
7782A77j09J0J43k72p5K94j67k98J83K33j90L15l76J57k59K03Q4M9j00J52k77
$$ 177 68 78 221 -51 -126 168 1 -297 -114 119 -71 244 -132 25 -234 -31 53 102 2 154 -123
7803a23J2J49j54L01l61N6M8J60k34J40j95J38J40j38P2K29j98J60j48Q7n54M98
$$ -123 -111 38 -116 185 -176 -120 -72 88 -146 -6 -201 -63 77 -61 11 240 42 202 54 141 -413 85
7825H5r1J61m3o1l57J64K35j26p1Lq0j27L20o5R0J39j06l65M73N6q9l3j82Q6m7
$$ 85 -6 155 112 51 -306 -142 93 -33 -104 -101 -181 -308 12 -53 37 176 70 -295 178 234 145 112 -70 16 -31
7850c1Q5Ok03J82j23K05J21l04P8n2j58N11k30M8l1Q4p6l8j14J17j77J7n6j9J77
$$ -31 54 60 -143 39 -84 121 242 -62 16 -36 -194 317 87 135 104 188 112 74 -40 77 -100 -83 -139 -158 19
7875A9k7r1J62j17J45k58N6K44j46J60J5J43l50L21j50m28L37j34J21k4Rq1KQ9
$$ 19 -8 -99 63 -54 91 -167 -111 133 -13 147 162 305 -45 276 126 -302 35 -99 22 -2 7 -74 -72 17
7899A7J66l49J1J14L59j60k2k27J31n9J56k90K20j07R1o1J71l25M9o8O7K04k29
$$ 17 183 -166 -155 -41 318 158 136 -91 40 -19 137 -153 67 -40 51 -10 161 -164 -115 -183 -116 88 -141
7922a41J05j09k7L69j33P7j63J26j40j5L51l36K56j4l02J50j90l8M03n12L82j40
$$ -141 -36 -145 -172 197 64 141 -22 104 -36 -51 300 -36 220 206 -96 54 -136 -174 229 -283 99 -41
7944d1k36K78p9J2p4p7K65J1j93J11R9J41j15k3jk38n8J55K0K48l99K83j48o7
$$ -41 -277 1 -78 -66 -140 -217 48 59 -134 -23 76 217 102 79 78 -160 -218 -63 -43 205 -194 89 -59 -126
7968a26n3L71l49J10JJ1R3m6n9K07k3k73oj21P2K20K81k73j61L49j95k33J94P8
$$ -126 -179 192 -157 -47 -46 -35 58 12 -47 160 137 -136 -142 -263 -191 29 310 37 -124 225 30 -203 -9 69
7992F9J97m48L47l24N09m30J21j14J00l52L44j14q1J09K05p0q6O0j21J30p0J48
$$ 69 266 -182 165 -159 350 -80 41 -73 27 -325 19 -95 -176 -67 138 68 -18 42 -79 51 -19 129
8014A29n7k63J08N1j09O1J79k87R0k5J12J23O3j92l6J33k02J76N2J23k82J13P5
$$ 129 72 -191 -83 -32 -141 -80 99 -188 -98 -123 -11 112 175 -17 -53 80 -122 54 106 229 -53 60 135
8037A35j48q8m9j7K10j23K39k36J51k82M57k48O1j88K16l17L2K67j28N1J79l26
$$ 135 -13 -101 -150 -167 43 -80 159 -77 74 -208 249 1 62 -126 90 -227 -195 72 -56 -5 174 -152
8059a52K32q3J9Qq9l4j86K27nJ20o5k2j21j26M81j24j4k61L00k27K45j11J26j04
$$ -152 80 -3 16 24 -65 -99 -285 -58 -63 57 -8 -30 -151 -277 204 80 66 -195 105 -122 123 12 138 34
8083C4k81J65J17J01m2p8K7J21k52O7J33j20j19J94k67O4K29j38N2j65K19j54
$$ 34 -247 -82 35 136 94 16 43 164 -88 -21 112 -8 -127 67 -200 -136 93 -45 7 -158 61 -93
8105i3J71k34J60p3l0m1j4J12m3K30n0J1p8J34l13M87l54R8L7J78l81L33l39K54
$$ -93 78 -156 4 -69 -99 -140 -154 -42 -85 145 95 106 28 162 -151 336 -18 80 117 295 -86 247 -92 162
8129A62j09j84K97q7j46L44m13n3K79N7R1Nnj02j46j80Q6K00k62Q5K59N0k91q1
$$ 162 53 -131 166 79 -67 277 -136 -189 90 147 238 243 238 136 -10 -190 -104 96 -166 -81 178 228 -63 -144
8153a44M84k86N9m2j30LJ54O1l2k79J12N2J06n7J30k76m0J09k8kj55M6J40rr1
$$ -144 340 54 113 71 -59 -56 98 159 127 -152 -40 12 118 61 191 -85 -125 -16 -44 -46 -201 -155 -15 -24 -115
8178a15K67n6j84o1O9O4r9K1Kj36L87k00j95
$$ -115 152 96 -88 -149 -80 -16 -115 -94 -92 -228 159 -41 -236
8191b36
$$ Imaginary data points
##PAGE= N=2
##DATA TABLE= (X++(I..I)), XYDATA
0@%%%%%%%%%%%%%%%%%pJ5j6J6j6J6k3L1l2L9m7N3o1P1q2R1j03J18j34J51j70J90
$$ 0 0 0 0 0 0 0 0 0 0 0 0 0 0 0 0 0 0 -7 8 -8 8 -8 8 -15 16 -16 23 -24 29 -32 39 -43 48 -55 63 -71 80 -90 100
39A00k14K39k66K98l29L63m03M46m92N44o00O61p29Q01q83R75j076J190j317J462
$$ 100 -114 125 -141 157 -172 191 -212 234 -258 286 -314 347 -382 419 -464 511 -565 625 -692 770
59G70j631J830k066K349k699L144l729M529n687P443j4057J30499r0524j60171
$$ 770 -861 969 -1097 1252 -1447 1697 -2032 2497 -3190 4253 -9804 120695 30171 -130000
73a30000J45065O2775j17369k148P3902l8338q356L0025k7199m703M0064k3292
$$ -130000 15065 77840 -39529 -41677 32225 -6113 -14469 15556 -11643 -16346 23718 426
85D26j5946K8768r986j3217L1325j6365k5436L8039K138m2223K8324K2213m9358
$$ 426 -15520 13248 3262 -9955 21370 5005 -20431 17608 19746 -22477 5847 28060 -21298
98b1298N997N1146l5716l7580M7304J5669m5144K92K8857n534j2196J664J163
$$ -21298 -15301 35845 129 -37451 9853 25522 -19622 -19330 9527 3993 -8203 -6539 -5376
111e376N338M345o976m505N914P266K82j0282j609J5567N88j5572L717R396l917
$$ -5376 -38 4307 -2669 -7174 -1260 6006 6288 -3994 -5603 9964 10552 -5020 -1303 8093 4176
126D176l29l572p530J6909L157l1080R755L4884l0647k6725M3190O639m4278J3126
$$ 4176 3847 275 -7255 9654 12811 -18269 -8514 26370 -4277 -31002 12188 18827 -25451 -12325
140a2325L0318k3629p033J7121r953L617J4021k4770J255L6428k3369k6846M3460
$$ -12325 17993 -5636 -12669 4452 -5501 -1884 12137 -12633 -11378 25050 1681 -25165 18295
153A8295K228m6199K8979K8537m8761J425M7915l1324k7910M4506k425l9007K5142
$$ 18295 20523 -25676 3303 31840 -16921 -15496 32419 1095 -26815 17691 15266 -23741 1401
166A401J5408l2482R494K0141k5294K81K3001j7921n727K1513j3641q977K5458
$$ 1401 16809 -15673 -6179 13962 -11332 -11051 11950 -5971 -11698 9815 -3826 -12803 12655
179A2655j0353k0060K7712M299l1104J6722K0873k7701q50K4767j6654r580K3209
$$ 12655 2302 -17758 9954 14253 -16851 -129 20744 -6957 -7807 16960 306 -9274 13935
192A3935r953j8210K2671L824k6342R027J8549j7097q198J4608r53p292L836j229
$$ 13935 3982 -14228 8443 12267 -14075 -5048 13501 -3596 -11794 2814 1861 -5431 -1595 -2824
206b824j813O779j606o766M223O123l006m228K402O027j824p870N351R033j0154
$$ -2824 -4637 2142 536 -6230 -2007 4116 1110 -3118 -716 5311 3487 -4383 968 10001 -153
221a53n860J4290n97j5307O782J0269j0012m183N981j797J67K503q734O33J1977
$$ -153 -6013 8277 7680 -7627 -845 9424 -588 -4771 1210 -587 -420 2083 -6651 -6018 5959
236E959o686q741Q620J573l996N913n281o795J7682J879k3122Q171K2308j6642
$$ 5959 -727 -9468 -848 725 -3271 2642 -2639 -9434 8248 10127 -12995 -4824 17484 842
250H42j1165J8830k635j1610J3046j393j5902J3826R006k1500K023J8312j3056
$$ 842 -10323 8507 5872 -5738 7308 5915 -9987 3839 12845 -8655 -6632 11680 -1376
263a376r658J6904k777j4301J0484N719j0810J311N230l445L519Q16r047N882
$$ -1376 -11034 5870 3093 -11208 -724 4995 -5815 -4504 726 -2719 800 1616 -7431 -1549
277a549J0964r819o858J0642K698m816Q92l313m53J1193m039j5142Q487J3243
$$ -1549 9415 -404 -7262 3380 6078 1262 2154 -1159 -1612 9581 5542 -9600 -1113 12130
291A2130j1359r296R606K954n166k76j261r97N100k07o818J182N713l4m308n89
$$ 12130 771 -8525 1081 4035 -1131 -1407 -2668 -3665 1435 1228 -5590 -4408 1305 1271 -3037 -3626
307c626M204K112m759M8O763k583p183P530P299j1802m265J3480J469j3083L79
$$ -3626 578 2690 -2069 -2021 4742 2159 -5024 2506 9805 -1997 -6262 7218 8687 -4396 -4017
322d017R118k93o001k368K294L962r00o019r05N683J159l943k530J849M775l80
$$ -4017 5101 4808 -1193 -3561 -1267 2695 1795 -4224 -5129 554 1713 -2230 -4760 -2911 1864 1484
338A484o051P80P938k413o760N823M856p387j25Q701m117q354Q245O722j0663
$$ 1484 -4567 -3787 4151 1738 -5022 801 5657 -1730 -1855 6846 2729 -5625 2620 9342 -1321
353a321m767J1413N70j0575K253P246n362m223O349r22o459M461M274o971j158
$$ -1321 -6088 5325 5895 -4680 -2427 4819 -543 -4766 1583 661 -5798 -1337 2937 -4034 -5192
368e192P346j510n159M019K319l826J278L999l165k145M688J340m242n97L871
$$ -5192 2154 644 -4515 -496 1823 -2003 -725 3274 109 -2036 2652 3992 -250 -847 3024
383C024J276l518k371L320K102m576j725M549r44l885J844J507l612Q45L419l644
$$ 3024 4300 782 -1589 1731 3833 -743 -2468 2081 1137 -2748 -904 603 -3009 -2164 1255 -2389
399b389k229N690k1n588K531M902l493k459N111j73l387K860K392m791R23N757
$$ -2389 -4618 1072 1051 -4537 -2006 2896 -597 -3056 2055 1882 -1505 1355 3747 -1044 -121 5636
415E636m114m491O108J903p322O24N575l870k872M391k437l116M718P2n573L439
$$ 5636 1522 -2969 3139 5042 -2280 -1656 3919 49 -2823 1568 -869 -3985 733 805 -4768 -1329
431a329K825m484R50K967l673J893M398n930o85Q439l955o067R018J28j0002Q131
$$ -1329 1496 -2988 -2038 929 -2744 -851 3547 -2383 -3068 5371 1416 -4651 4367 4495 -5507 2624
447B624O463j3578L75J4028q052r291J1196L73j0594Q077K481j2292N977J0815
$$ 2624 9087 -4491 -4116 9912 1860 -7431 3765 4138 -6456 1621 4102 -8190 -2213 8602
461H602j3299n868J5026r36j0184M898L090l476L848m64o209O846L992r617K039
$$ 8602 -4697 -10565 4461 3525 -6659 -1761 1329 -2147 1701 1237 -4972 1874 5866 -3751 -1712
476a712Q537o480l327Q910m039o435Q436J602r585L353N552p134O2O239o262m081
$$ -1712 6825 345 -2982 5928 1889 -4546 3890 5492 -4093 -740 4812 -2322 -2260 3979 -2283 -6364
492f364R956n44j0436L100Q746m066o045M408K574k234M10J326k775J472N472
$$ -6364 3592 3048 -7388 -4288 4458 392 -5653 -1245 1329 -905 -495 831 -1944 -472 5000
507E000l267o504N652O857p132m369O708P68m344J922n91l069M230R00p121K191
$$ 5000 1733 -4771 881 7738 606 -3763 2945 3713 -631 1291 700 -2369 1861 2761 -4360 -2169
523b169N601o084q09N745n126j601Q104m145p002J0427Q59j0827P488O382j3126
$$ -2169 3432 -2652 -3461 2284 -2842 -4443 3661 -484 -7486 2941 3800 -7027 461 6843 -6283
538f283L966J3677j3087p552J8586k207j6215J1447O488j4339M385J0108j3399
$$ -6283 -2317 11360 -1727 -9279 9307 7100 -9115 2332 8820 -5519 -1134 8974 -4425
551d425j275J4474q690r605J3345q4j1215P989K600j0635O732P085j2205N91J1794
$$ -4425 -5700 8774 84 -9521 3824 3740 -7475 514 3114 -7521 -789 6296 -5909 -5318 6476
566F476p082m553J0084m524n529J0936j742j0951R490N551j2276K160R541q181
$$ 6476 -606 -5159 4925 401 -5128 5808 4066 -6885 2605 8156 -4120 -1960 7581 -600
580f00l830J0735m672q509R018L118j0186J634O501l886k666L474j331j613L300
$$ -600 -4430 6305 1633 -6876 2142 5260 -4926 -3292 3209 -677 -3343 131 -1200 -2813 487
595D87N05m226M29M725O05n265J91N999q4n543J414M118j381j364J16q51K337
$$ 487 992 -3234 -2805 1920 2525 -2740 -2549 3450 3366 -2177 -763 3355 1974 610 726 -125 2212
612B212J353n769L76N667l248l962M378q90l480M715j194o183P213K720j0941
$$ 2212 3565 -2204 -1828 3839 591 -3371 1007 117 -3363 1352 158 -6025 1188 3908 -7033
627g033M025R749r650l421J2863n263r882J3468K473j5339P458J1003j3450j519
$$ -7033 -3008 6741 -2909 -6330 6533 1270 -8612 4856 7329 -8010 -552 10451 -2999 -4518
641d518J2770p550o109J2214m263j0458J1709K960j4449M816R881r491k421P639
$$ -4518 8252 702 -5407 6807 2544 -7914 3795 6755 -7694 -2878 7003 -2488 -4909 2730
655B730n026q57P114o757l764J1842l271r910J0175L146j1941O034Q603j2351
$$ 2730 -2296 -3153 3961 -2796 -6560 5282 2011 -7899 2276 5422 -6519 -485 8118 -4233
669d233n43J4076p145r661J1516K446j0646L920N235p558Q33O529n504m219O830
$$ -4233 -4776 9300 2155 -7506 4010 6456 -4190 -270 4965 -2593 -1760 4769 -735 -4954 1876
684A876M63n379P25K222J28q18j663O53K399j58k105Q29P65K99O70p82n78J815
$$ 1876 2339 -3040 -2315 -93 35 -783 -2446 -1793 606 448 -1657 -828 -63 236 906 124 -454 1361
702A361K43j154R02m61o29J828p77k122J872K46l096K752R41n917K852N669o881
$$ 1361 1604 450 1352 891 262 2090 1313 -809 1063 1309 -1787 965 1906 -4011 -1159 4510 -2371
719b371l992R052o29p337M822J903n533N036K649r315L621R950q639n889J1921
$$ -2371 -6363 2689 2060 -5277 -455 1448 -4085 951 3600 -5715 -2094 7856 -783 -6672 5249
734E249r10q894N829L938q008K642N746p051p01N831l649k050M339m032j792P408
$$ 5249 4339 -4555 1274 5212 -2796 -154 5592 -1459 -2160 3671 22 -2028 2311 -1721 -3513 3895
750C895l773o778P491K600q201L082M755o870J672P145p493k945J0622k278q418
$$ 3895 122 -6656 835 3435 -4766 -1684 3071 -3799 -2127 5018 -2475 -5420 5202 2924 -5494
765e494O419M153o659Q54M794m416j121N232k002m261K693J912j407j471p18J472
$$ -5494 925 5078 -1581 -727 4067 -349 -1470 3762 1760 -2501 192 2104 697 -774 -1492 -20
781b0J767l334j384M102r14l105K400J182l165J738K484l085m89L634r28j940
$$ -20 1747 -1587 -2971 1131 217 -2888 -488 694 -2471 -733 1751 -1334 -1823 1811 883 -1057
797a057J926j10o6R44m37j196R10L63p01M98j404N9K261k115k850L772J143n301
$$ -1057 869 759 693 1637 1200 4 914 1277 576 1074 -330 -271 1990 -125 -2975 797 1940 -3361
815c361J754L943m630q21M931k097m106N178J340m949J617L287k395l45J930j091
$$ -3361 -1607 2336 -2294 -3115 1816 -281 -4387 791 2131 -2818 -1201 2086 -309 -654 1276 185
831A85m3K359k446q32K994p14k395J779K72j480R24n07j219J634J88l199K019
$$ 185 142 2501 55 -777 2217 1503 -892 887 1159 -321 603 96 -1123 511 699 -2500 -481
848d81J939l551l09L868j970k779L632N06l072J849K015k151j49K023p79l21J053
$$ -481 1458 -2093 -2402 1466 -504 -3283 349 855 -2217 -368 1647 -504 -653 1370 591 270 1323
865A323j065M8R16m07o37P89p76K18R82k589J02L115j947l591L827J115m127J087
$$ 1323 258 306 1222 815 178 967 191 409 1391 -1198 -1096 2019 72 -3519 308 1423 -2704 -1617
883a617L079l209q14L834j319k932L300J910l334L35J907q55K58J030j651K75
$$ -1617 1462 -1747 -2561 1273 -46 -2978 322 2232 -1102 -767 1140 285 543 1573 -78 197
899A97J724j102j138J363k28l37O62j828j055L446l64m055J444L049k651j490
$$ 197 1921 819 -319 1044 816 479 1141 -687 -1742 1704 1340 -2715 -1271 1778 -873 -2363
915b363K997j233k132L263O88l714J249L562k198k100K788Q42k142J178O82j863
$$ -2363 634 -599 -2731 532 1220 -2494 -1245 2317 119 -1981 807 1649 -493 685 1367 -496
931d96R30K593k144k739K780J690k567j277J487K08r21k8q43K45J362n70j240
$$ -496 434 3027 883 -1856 924 2614 47 -1230 257 465 -456 -484 -1327 -1082 280 -290 -1530
948a530O42N04k73P57o72j483K542J776l630l47L955r18k408K156L93k468K179
$$ -1530 -888 -384 -657 100 -572 -2055 487 2263 -1367 -1714 2241 1323 -1085 1071 1464 -1004 1175
965A175K271m592o64N417k067m451L212K240l990J97K420k657l02L079j880k486
$$ 1175 3446 -1146 -1810 3607 1540 -2911 301 2541 -1449 -1252 1168 -1489 -1791 1288 -592 -3078
981c078K799J585k872K92J901j071n1J305j063n98K558k72k095J288P98j069N12
$$ -3078 -279 1306 -1566 -1274 627 -444 -495 810 -253 -851 1707 1435 -660 628 1426 357 869
998H69J72j277O46J937k775j261L273m76l552K525J424l920J089L540l592k317
$$ 869 1041 -236 410 2347 -428 -1689 1584 1108 -2444 81 1505 -2415 -1326 2214 -1378 -3695
1014c695N542o27n039L496L398n306N85M710l229k468N459p28m506L619K076m068
$$ -3695 1847 1220 -3819 -323 3075 -2231 -1646 3064 -165 -2633 2826 2098 -2408 1211 3287 -781
1030g81N08K733l047m4L150k675j779L749j026l492L154K62l697K857J927m856
$$ -781 -273 2460 -587 -631 2519 -156 -1935 1814 788 -2704 450 712 -2985 -128 1799 -3057
1046c057J460M285m239j871N717j381m460M686J959n729J979M865m820j655N410
$$ -3057 -1597 2688 -1551 -3422 2295 914 -3546 1140 3099 -2630 -651 4214 -606 -2261 3149
1061C149j578l449L198J181m146J653K130k979o36K977j367k428K430P08k421
$$ 3149 1571 -1878 1320 2501 -1645 8 2138 -841 -1477 1500 133 -2295 135 843 -1578
1076a578L52J564j010k94J044j007K10R46k95p36J443M37j712R02J295j234n80
$$ -1578 -1226 338 -672 -966 78 -929 -719 227 -68 -804 639 1076 -636 266 1561 327 -253
1093b53K038j118j990K773O29l870R35L956l497k481M722o45m756L705K387o082
$$ -253 1785 667 -1323 1450 2079 -1791 -856 3100 -397 -2878 1844 1199 -3557 148 2535 -3547
1109c547J298N324m137k889N890o83m320L642J374m588L169K869n526P35N379
$$ -3547 -2249 3075 -1062 -3951 1939 1256 -3064 578 1952 -2636 533 3402 -2124 -1389 3990
1124C990l341k997M643o05l227L197J4m342L561J842n679J760M398n409p67O261
$$ 3990 649 -2348 2295 1690 -1537 1660 1674 -2668 893 2735 -2944 -1184 3214 -2195 -2962 3299
1140C299l912m035O611j42o766M270M004n520J88M747l497r16M786k115m159N122
$$ 3299 -613 -4648 1963 1821 -4945 -675 3329 -2191 -2003 2744 -753 -1669 3117 1002 -3157 1965
1156A965J301m895J171L144k926k75K524j960j264K461l09k507R51J190q70J08
$$ 1965 3266 -1629 -458 2686 -240 -515 2009 49 -1215 1246 937 -1570 -619 571 -299 -191
1172a91o32o41J113Q15j874J5J790j84r13P16J25k66K34R73p90j158K222J098
$$ -191 -823 -1464 -351 464 -1410 -1395 395 211 -702 14 139 -127 107 1080 290 -868 1354 2452
1190B452l376m02L855q10l430K106J593l125P85K343l606l21M223k203l860M538
$$ 2452 -924 -1326 2529 1719 -1711 395 1988 -1137 -352 1991 -1615 -1936 2287 84 -3776 762
1206G62J107m825J932L137m012N2M302l039k337M879m62l249K553L22k105K887
$$ 762 1869 -2956 -1024 2113 -1899 -1847 2455 -584 -2921 1958 1496 -1753 800 1122 -983 1904
1222A904M3m405L157L392n735l75N726l427l708N546o09m830L815J764n279J510
$$ 1904 1947 -2458 699 4091 -1644 -2019 3707 280 -3428 2118 1509 -3321 494 2258 -3021 -1511
1238a511M064m213p74M652k802k703N031J15m634K419L037l329k91K803j284p75
$$ -1511 2553 -1660 -2434 2218 -584 -3287 1744 1859 -2775 -356 2681 -648 -939 1864 580 -195
1254a95J493j138M5J506j758p07K117j135j745K139L39k630J129J563k105l14
$$ -195 1298 160 205 1711 -47 -754 1363 228 -1517 622 961 -1669 -540 1023 -1082 -1396
1270a396J855o72r59R71m5m70R5O87Q0k16j70J004J60j452J039Q48j641J38J852
$$ -1396 459 -213 -1172 -201 -246 -716 -621 66 146 -70 -240 764 924 -528 511 1359 -282 -144 1708
1289A708j287j211K195k86k947K035J700l299K35K947k636j405L091o28j890J473
$$ 1708 421 -790 1405 1119 -1828 207 1907 -1392 -1157 1790 -846 -2251 840 212 -1678 -205
1305b05L83j403J423R3j951J737J167k140N38K154j919n41K503j460j145K550
$$ -205 178 -1225 198 291 -1660 77 1244 -896 -358 1796 -123 -664 1839 379 -766 1784
1321A784o45k716K459P67l464J779J986l512J78L465k483k194L479J19k896J397
$$ 1784 1139 -1577 882 1649 -1815 -36 1950 -1562 -1384 2081 -402 -2596 883 1002 -1894 -497
1337d97J113j825P63J241j953N00J630j073l32R74k68K57Q19j836J90K586j664
$$ -497 616 -1209 -446 795 -1158 -658 972 -101 -433 541 273 530 1349 -487 -297 2289 625
1354F25j957K606k86k444J772J398k978L91K099j848p99J665m91r39P66o8o46
$$ 625 -1332 1274 988 -1456 316 1714 -1264 -873 1226 -622 -1421 244 -247 -1186 -420 -488 -1134
1371a134Q91L39r13J33P74L37J40q53o21K556n0k701P39K756k255j426K724m56
$$ -1134 -243 96 -817 -684 90 427 567 -286 -907 1649 1599 -1102 -363 2393 138 -1288 1436 980
1389I80j957J620N47k488Q17J598j697o05J559n54r39R69m91o75J325M53j288
$$ 980 -977 643 1190 -1298 -481 1117 -580 -1185 374 -180 -1119 -150 -641 -1316 9 462 -826
1406h26K57N33M10Q9o82j40J191N64j587M61R34r90K29N38r23l33J023k96j366
$$ -826 -569 -36 374 463 -219 -359 832 1396 -191 270 1204 214 443 981 58 -275 748 452 -914
1425i14P07O62m16p88J87L48k16j46j25M5P0J39Q21n30p42J374P43k098M74K196
$$ -914 -207 455 39 -749 -562 -214 -430 -576 -701 -656 -586 -447 374 -156 -898 476 1219 -879 -405 1791
1445A791j488r68K036m64j585J779L70k408N30K025j631p78J423l71r57J016o50
$$ 1791 303 -665 1371 907 -678 1101 1471 -937 -407 1618 -13 -791 632 261 -696 320 -330
1462c30n90P92M4j216Q70P27j240P88P77j909P50K047j493j414K658j17k245J584
$$ -330 -920 -128 -84 -1300 -430 297 -943 -155 622 -1287 -537 1510 17 -1397 1261 1144 -1101 483
1480D83J314k473M88K265k155j131K952r48k522J758R33j979J51J781j473p63
$$ 483 1797 -676 -188 2077 -78 -1209 1743 795 -1727 31 964 -1015 -864 917 -556 -1319
1496a319J863n35j509R30J068j080j78J110l58j22M53l74n8J041m14q47J221R
$$ -1319 544 9 -1500 -570 498 -582 -760 350 -8 -130 323 -51 -109 932 518 -329 892 901
1514I01r95N14P36j234k81J586j338j040J905j45k255J338J451k283l38K533j220
$$ 901 -94 420 1156 -78 -359 1227 -111 -1151 754 609 -1646 -308 1143 -1140 -1478 1055 -165
1531a65j930K455N86k599R31K438k289q79K467j31j750J386N22j514R39Q22j914
$$ -165 -2095 360 946 -1653 -722 1716 -573 -1452 1015 884 -866 520 1042 -472 467 1289 -625
1548f25M31J591j251o86J190j03j510J313j35j211Q58O35j834L44K021j484r45
$$ -625 -194 1397 146 -540 650 547 -963 350 215 -996 -138 497 -1337 -993 1028 -456 -1401
1565a401J775k92j238J775J91k051J002K245k492n59K552o43k136K170Q04k815
$$ -1401 374 82 -1156 619 810 -1241 -239 2006 -486 -1045 1507 864 -1272 898 1702 -1113
1581a113N37K871k336j526K454j04k213J474R96j968K89J352j769o1J671o58j331
$$ -1113 -576 2295 -41 -1567 887 783 -1430 44 1040 -928 -639 713 -1056 -1117 554 -104 -1435
1598a435J375K51j203J349L33j640Q95J689k180QK229j506j198K987r82k766K566
$$ -1435 -60 191 -1012 337 670 -970 -75 1614 -566 -558 1671 165 -1033 1954 972 -1794 772
1615G72J253l391L46L300k445j761L183p78k387K506K14k630Q75K561k774l05
$$ 772 2025 -1366 -1020 2280 -165 -1926 1257 479 -1908 598 812 -1818 -943 1618 -1156 -1461
1631a461K426j058j049J553K01j661J767O87k242O39J547j004m47J052p36m67
$$ -1461 965 -93 -1142 411 612 -1049 718 1405 -837 -198 1349 345 -102 950 214 -253
1647b53J525j247j107J543N92j997L82J174j243k31J172p71q21J563L43j950N80
$$ -253 1272 25 -1082 461 1053 -944 -562 612 -631 -862 310 -461 -1282 281 624 -1326 -746
1664g46J878j075j411J844K07j473R42R43j582q8K325j030j670J568P22j821K82
$$ -746 1132 57 -1354 490 697 -776 166 1109 -473 -561 1764 734 -936 632 1354 -467 -185
1681a85J647j734m12J325n69j322J485n9j296R21K73r59P22R28j843L47K065j665
$$ -185 1462 -272 -684 641 72 -1250 235 176 -1120 -199 74 -885 -163 765 -1078 -731 1334 -331
1699c31p75K543q44k004K253P49k932J680K103l033m25K931j344k068K759j39
$$ -331 -1106 1437 593 -1411 842 1591 -1341 339 2442 -591 -1016 1915 571 -1497 1262 1123
1715A123k806J917J474l104M25K326j988r85K371n85j783J828J88j562J415N88
$$ 1123 -1683 234 1708 -1396 -971 1355 -633 -1618 753 168 -1615 213 401 -1161 254 842
1731H42j591N48J026j089K3J287r50l65J565j232m99J244m9j515P83J060j481
$$ 842 -749 -201 825 -264 -241 1046 96 -269 1296 64 -435 809 760 -755 28 1088 -393
1748c93m92J422o65q98J192K11j414K30J159l54j121J185L70o02m76Q83nn72M18
$$ -393 -885 537 -128 -1026 166 377 -1037 -807 352 -2 -1123 62 432 -170 -646 237 232 -340 78
1767G8O99p96J05J019j149o11J666q7j576P00N40l95k38K81n82Q2L48o05k3J070
$$ 78 777 -19 86 1105 -44 -655 1011 924 -652 48 588 193 -45 236 -346 -264 84 -521 -544 526
1787E26j019q04J810o07j500J743N93j630O30J722j915j46J886j142j245K621
$$ 526 -493 -1297 513 -94 -1594 149 742 -888 -258 1464 -451 -597 1289 147 -1098 1523
1803A523n28k513K196Q43k399N47J646j428m27J617r44j149J623j74j572Q42N85
$$ 1523 995 -1518 678 1521 -878 -331 1315 -113 -540 1077 133 -1016 607 433 -1139 -297 288
1820B88r83M56K90o93K87P67j114J65J306r42l11J215k8j358J200N38j553N50
$$ 288 -695 -239 51 -642 -355 412 -702 -537 769 -173 -484 731 703 -655 545 1083 -470 80
1838H0J062j027l69J100n62o26R81k80j040M77M59n91k33J75K95R7o95M9R64l87
$$ 80 1142 115 -254 846 284 -342 639 359 -681 -204 255 -336 -569 -394 -99 -2 -697 -648 316 -71
1858g1n83R99Kq60O02P70j078LJ304p29n91O25L81r02M56J97q26P74q6r62J08
$$ -71 -654 345 347 -513 89 859 -219 -216 1088 359 -232 393 774 -128 328 525 -301 473 387 -575 -467
1879d67P03n32P2M09o84J45M11r10J24J019q0r13J098l06r97J139Q20j298k01
$$ -467 236 -296 -224 185 -499 -354 57 -853 -729 290 210 -703 395 89 -908 231 1051 -247 -448
1898d48J711q04o89P11M3m91N37o2o59L62K60q65J33N17o33K26J02m27J71M99
$$ -448 1263 459 -230 481 524 33 570 508 -151 211 471 -394 -261 256 -377 -151 -49 -476 -305 194
1918A94q03o2J033p99k14J107p10k33R80N3r87P44P55j109P1O86k23m76P01o46
$$ 194 -609 -671 362 -437 -651 456 -254 -487 493 546 -441 303 1058 -51 20 706 483 7 708 62
1938F2k76O81k88l04L12k24n23Q48m49q22J090J5q87M51J060j500J17J665j120
$$ 62 -214 467 179 -125 187 -37 -560 288 -161 -983 107 122 -765 -314 746 -754 -637 1028 -92
1957i2r13J462J74j365Q67J034j574J24J223o35o52J245k11j045O88J52p07J98
$$ -92 -1005 457 631 -734 133 1167 -407 -283 940 305 -347 898 687 -358 330 482 -225 -27
1975b7P2o02O29j16m78L36M28j097K34Q81m28m59Q06J55m98L36K37m89OQ58m27
$$ -27 45 -557 72 -44 -522 -186 242 -855 -621 260 -168 -627 179 334 -164 172 409 -80 -74 784 357
1996C57m22N54J70q01oQ06k26r43N29M08r09k5P90k46p81P15L61q51K65L29o59
$$ 357 -65 489 659 -142 -148 658 432 -511 18 426 -483 -508 282 36 -745 -30 331 -520 -255 74 -585
2017e85L12N59l51n75M85O21p98K41O25l60j32O04p64M75N19j035l53J130l50
$$ -585 -273 286 -65 -640 -155 466 -332 -91 534 174 42 646 -118 357 876 -159 -512 618 268
2036B68p54O29J29p37K41Q81j600M5J734j296q57J615J5j370J058P05j384K86
$$ 268 -486 143 272 -465 -224 657 -943 -898 836 -460 -1317 298 313 -1057 1 706 -678 -392
2054c92J476j176p42J437j00j053Q30K60p12M08P29r45q2M43m8o45M62k10k97
$$ -392 1084 -92 -834 603 503 -550 280 540 -172 236 965 20 -62 381 333 -312 150 -60 -357
2073c57P45m33o46N38M56q25k89J295o54n10R77m2q33O40N53j028L9J280r89n87
$$ -357 388 -45 -691 -153 303 -522 -811 484 -170 -680 297 255 -578 62 615 -413 -374 906 -83 -670
2093f70J326lj065O89P04j099m00J430o57j285J526p6r73M90O57j249J57O00n68
$$ -670 656 653 -412 277 981 -118 -518 912 255 -1030 496 420 -553 -63 594 -655 -498 102 -466
2112d66k03Q55k37q14P20K52p82P82O4o39P89L85q40k23J104n94o67R62L01j454
$$ -466 -669 186 -51 -865 -145 107 -675 107 171 -468 321 706 -134 -357 747 153 -514 448 749 -705
2132g05Q53R31j399k51J232n38q47J177r3j491O27J056r39m14J264m46j138J090
$$ -705 148 1079 -320 -571 661 123 -724 453 360 -1131 -504 552 -387 -801 463 17 -1121 -31
2150c1N38r71K70Q12r06j5R89m46j56J86J44l77L28L88r15J49O15o73ML49l83
$$ -31 507 -464 -194 618 -288 -303 686 240 84 270 414 37 365 753 -162 -13 602 -71 -67 282 -101
2171a01n04Q96k14r23Q20J00j128P15J106q00q04J183j04j029J156J56r91O04
$$ -101 -605 291 77 -846 -26 74 -1054 -339 767 -33 -837 346 242 -787 369 525 -466 138
2189A38J005j211l31J214k63j079J215K43j388L17N65m44O2L16m45l72J082j010
$$ 138 1143 -68 -399 815 552 -527 688 931 -457 -140 425 -19 43 359 -86 -458 624 -386
2207c86l96R49r8r47N00M82o42K67O99o43o1R82q88k91Q33L83j259N57N36o39
$$ -386 -782 167 69 -878 -378 104 -538 -271 428 -215 -276 706 -182 -473 360 743 -516 41 577 -62
2227f2k94J173m02j028Q68n5n61J15P22p08l73N54n3n42P43J58q71J52N88j46
$$ -62 -356 817 415 -613 255 200 -361 -246 476 -232 -605 -51 -104 -646 97 255 -616 -464 124 -22
2247b2j01l3K02j99K61R8l79O56L3o92J52K41j9k21M68m84l60N75K62j090N13
$$ -22 -123 -156 46 -153 108 206 -173 483 516 -176 -24 217 198 -23 445 -39 -399 176 438 -652 -139
2268a39Q26j184j62R50k79r15J163n2j168N34Q34q23j91J148l99m86O66j3o49
$$ -139 687 -497 -659 291 12 -903 260 208 -960 -426 408 -415 -606 542 143 -343 323 310 -339
2287c39M91P81j095J73N70k52m47K96j97p3M37k29o62Q11J6j151N53L79l03k91
$$ -339 152 933 -162 11 581 329 -118 178 -19 -92 345 116 -546 265 281 -870 -317 62 -241 -532
2307e32O04o27k83J199l15p25O18N04j057O73M69m75o06R88M7r78O40J88j95K3
$$ -532 72 -555 -838 361 46 -679 -61 443 -614 59 528 53 -553 435 482 -496 144 332 137 160
2327A60M3J03k43Jj40K9J4j87J23k38j39M68k67p1K47M13o94J89K13k80K08K94
$$ 160 203 306 63 64 -76 -47 -33 -220 -97 -335 -474 -6 -273 -344 -97 316 -378 -189 24 -256 -48 246
2349B46k99P9Q5n5K10l32n5K71m9k95J70K92j25n99L86M96j139K90Q99p59m89
$$ 246 -53 26 111 56 266 -66 -121 150 101 -194 -24 268 143 -456 -70 426 -713 -423 476 -283 -772
2370g72J174m44m91M40N36p27P0O38o99n8P49l41k19M15j41j45L49p7n55N95j69
$$ -772 402 -42 -533 -93 443 -284 -214 424 -275 -333 416 75 -144 271 130 -15 334 257 -298 297 128
2391A28n26O16k7o34M62L60r72L68M92o25p7N98l56m64O94M11p31n0N45k76r5
$$ 128 -398 218 191 -443 19 379 -593 -225 267 -358 -435 163 -193 -657 37 448 -283 -333 212 -64 -159
2412a59M41L33n92K53k80K62P9l82J46L61m91k01Q77o30k32K14J50p64L72M87
$$ -159 282 615 23 276 -4 258 337 -45 101 462 -29 -230 647 17 -215 -1 149 -615 -243 244
2432B44q09L21O57p25m25R65j17o92N99K98o24M50K19m76L28kL9L1Jm45M49K24
$$ 244 -565 -244 413 -312 -737 228 111 -581 18 316 -308 142 361 -115 213 211 250 281 282 -163 286 510
2454E10m33k38O17k96l80L82j21m38J88M75o35K50J48j21n33P54k06j18L6K93
$$ 510 77 -161 456 160 -220 162 41 -397 -209 266 -369 -119 29 -92 -625 129 -77 -195 -159 134
2474A34r4j70J91l23K50R0J97p1l07L49K11m28k7K93l0m22L9N09m03k91M20k87
$$ 134 40 -130 61 -262 -12 78 275 204 -103 246 457 29 2 295 265 -157 -118 391 -12 -303 117 -170
2496a70k02L70l6j26kK22k48k1K31j67J09K89l45j78M83k23K25L73n99o4P52m05
$$ -170 -372 -2 -38 -164 -166 56 -192 -213 18 -149 -40 249 -96 -274 209 -14 211 584 -15 -79 673 268
2518B68m58M62J89q24K01O45n69l84Q03j10r66O31L44p63L84K80m03j62M18q2
$$ 268 -190 272 461 -363 -162 483 -86 -470 333 223 -743 -112 232 -531 -147 133 -270 -432 -14 -96
2538i6l99O70j82j40M24j64l20L27O9n71N92K06m91m5M46k76o68Q39m1l86N57
$$ -96 -495 175 -7 -147 277 113 -207 120 189 -382 210 416 -75 -120 326 50 -618 221 180 -206 351
2559C51l9o48M5M89l36m60Q41l5p94N26J67k15K12K47l19j8K6L57m27K64P7j40
$$ 351 312 -336 -291 198 -138 -598 243 208 -586 -60 107 -108 104 351 32 14 40 397 -30 234 311 171
2581A71k92L13j83j04J11O3j66J30J99o66M32P8k07k22K37j6k79N59p8l70J28
$$ 171 -121 192 9 -95 16 79 -87 43 242 -424 8 86 -121 -343 -106 -122 -401 158 80 -290 -162
2602a62L3l26J77O41k93k26O98l07o66L60N17n89n7R88p79k90N31J04o35M76J68
$$ -162 -129 -455 -278 363 70 -156 542 235 -431 -71 446 -143 -200 788 9 -281 250 354 -281 195 363
2623C63o27K25J60m15j58M25O1o31N23K10m23L65K45m67N8M63m31J44J50j50j49
$$ 363 -264 -39 121 -294 -452 -27 34 -597 -74 136 -287 78 323 -144 -86 377 -54 90 240 90 -59
2644e9O30k81n03M55J57p08J21O74l93l55M90Nq42M86M00o64K21J72M9p30P16
$$ -59 571 290 -213 242 399 -309 -188 486 93 -262 228 233 -609 -123 277 -387 -166 6 55 -675 41
2665D1K06n64L22K43j36j8J55l42L9O78o89J87j38K53l34J39K69m48J45J65n28
$$ 41 247 -317 5 248 112 94 249 -93 -54 624 -65 122 -16 237 -97 42 311 -137 8 173 -355
2686c55K89K58k34m01M53L49r83O27J65o35pP48k65n27R63j83n43K68N67o30Q0
$$ -355 -66 192 -42 -443 10 359 -624 3 168 -467 -474 274 9 -518 445 262 -281 -13 554 -76 4
2707DN15m77l04P16k61k18K60J56l07r0J4l03rM10j70l40L42K9j02l14N96j45
$$ 4 519 42 -262 454 193 -25 235 391 84 -6 8 -295 -304 106 -64 -404 -62 -33 -135 -449 147 2
2729Bk41M35m73K14L63j70m29M67K32n54n5P36l33n16M79K30q80Q71L9q83M04
$$ 2 -239 196 -277 -63 300 130 -299 168 400 -154 -209 527 194 -322 157 387 -493 378 417 -466 -62
2750f2M82n41pM53k13o80L53L41n23M7L65j35l93P17k59l72N28K16r3j68K26k97
$$ -62 420 -121 -128 325 112 -568 -215 126 -397 -350 15 -120 -513 204 -55 -427 101 317 224 56 282 -15
2772a5J61K03l45j48L67r4j16L27j84l30M40K4q82L63M78m89M0M49l73l28M08
$$ -15 146 349 4 -144 223 129 13 340 156 -174 266 290 -592 -229 249 -240 -200 249 -124 -452 -44
2793d4K51m90J71K58j97N7L2Kk41L21K2j36k9L30k62M9k3P5k74L87l34j8J28J8
$$ -44 207 -283 -112 146 -51 6 38 40 -201 120 142 6 -23 307 45 94 71 146 -128 259 -75 -93 35 53
2817E3l7r4n7K02j09J27n25M35kk66K32j40M85o84L22L76j49k98K76kj75J76j74
$$ 53 16 -78 -135 67 -42 85 -440 -5 -7 -273 -41 -181 304 -380 -58 318 169 -129 147 145 -30 146 -28
2840b8k3k2N14k93k73K0L74n04O8M66n94L90j45k6m39M98k53K00k53L57k98J41
$$ -28 -51 -73 441 148 -125 -105 269 -235 -167 299 -295 95 -50 -76 -515 -17 -270 -70 -323 34 -264 -123
2862a23K63k70K42P0j92K79K61m09k39M03J8m12M71r9j51N6K72m91l15N36j19
$$ -123 140 -130 112 182 -10 269 530 121 -118 285 303 -109 362 263 112 168 440 -51 -366 170 51
2883E1m43L65J59l07j40K89q7J43M04m85m08L02J41j17K45k02L15j58J6l3K50
$$ 51 -392 -27 132 -175 -315 -26 -113 30 434 -51 -459 -157 -16 -133 112 -90 225 67 83 50 300
2904C00j75j68L14j41k47J46J41q6l52M16j74RK7r0k19K82j09O7Q8k04L81k71
$$ 300 125 -43 271 130 -117 29 170 84 -268 148 -26 -17 10 -80 -299 -17 -126 -59 29 -175 206 -65
2926f5J50j60N9N5p8J04N9k37m7O78k46l40R9J99l28L18j60j94Q6J24q2k20M79
$$ -65 85 -75 -16 39 -39 65 124 -113 -160 518 272 -68 31 230 -98 220 60 -134 -48 76 -6 -226 253
2949B53l95j89K04M65l16o1j80J64N4N5r9K31j50k99L93j08q7o6J47L17k12J96
$$ 253 -142 -331 -127 338 22 -39 -219 -55 -1 54 -45 186 36 -263 130 22 -65 -131 16 333 121 317
2971C17j57l82N78j42n41K38K16j79l57P5Q9J35j50K27m3mj84K28J17l4o2K34
$$ 317 160 -222 356 214 -327 -89 127 -52 -409 -334 -245 -110 -260 -33 -76 -80 -264 -36 81 47 -15 219
2993B19l26o5M68l44K1K26P8k99J62J14j87j81K34k4j23J9J87l20K36k0o7J54
$$ 219 -107 -172 296 -48 -27 199 277 -22 140 254 67 -114 120 96 -27 -8 179 -141 95 75 8 162
3015A62k31m6j59L05l51L29O2k92O0K27o5k65N16N2n40L31K59l54P1J47o3n01
$$ 162 -69 -115 -274 31 -320 9 71 -221 -161 66 1 -264 252 304 -236 95 354 0 71 218 155 -346
3037c46N51O6l92K60K9m22K58K37l60kj93L80k43k9L76l32M4K27l30J21L87m20
$$ -346 205 271 -121 139 168 -254 4 241 -119 -121 -314 66 -177 -206 170 -162 -118 109 -221 -100 287 -133
3059a33P6j37J53J26j33L12k61R0M3K1M2j99r6k00J05K98p9k24K50j80j58J43
$$ -133 -57 -194 -41 85 -48 264 3 93 136 157 199 0 -96 -296 -191 107 28 -196 54 -126 -284 -141
3081a41L36n26P9M12jm05L96j18k53J97K74l19Q2M36m25j60L87N8m11J15K5M9
$$ -141 195 -331 -252 160 159 -246 150 32 -221 -24 250 -69 13 449 24 -136 251 309 -102 13 38 87
3103H7J75k28l42K05M0R7j72K75l19o8L27q9k82K51K63m06q9O59m80M6L71k27
$$ 87 262 34 -308 -103 -63 34 -138 137 -182 -250 77 -12 -294 -43 220 -186 -275 384 -96 -50 321 94
3125I4j96J90K16m10L09K02m50R7rJ26k44K94k45k82K24L22m14J34r1j18J64r3
$$ 94 -102 88 304 -106 203 405 -45 52 43 169 -75 219 -26 -308 -84 238 -176 -42 -133 -251 -87 -180
3147a80M65k69K6l3l66N46pl35R1Q8m5J58K44On41L25O5m26K64O6r6l43M18j6
$$ -180 285 16 42 9 -357 189 182 -153 -62 26 -19 139 383 389 -152 173 238 -188 76 142 46 -297 121 105
3171A05l84K12J69l59J43L67j61l26M48n44J08j01M18l90K40J65Q3j69nL49j65
$$ 105 -279 -67 102 -257 -114 253 92 -234 214 -330 -222 -323 95 -295 -55 110 193 24 19 368 203
3192B03p6j66J8Q5Pj32j0L02q0m84N83m18j59K80J25n48M43J1j96l2M65m80O6
$$ 203 127 -39 -21 64 71 -61 -71 231 151 -333 250 -168 -327 -47 78 -470 -27 -16 -212 -244 221 -259 -193
3215a93M16j07n57M22M46q00M00K94l26l14O65k69j01L54k35j38J01Q0o2j62Q2
$$ -193 223 116 -441 -19 427 -373 27 321 -5 -319 346 77 -24 330 95 -43 58 138 76 -86 -4
3236dl2N0K0l3m8n9J5k9j95L80kK7j21k51K08L59l60j63M34J58m50L48J16k26
$$ -4 -36 14 34 1 -47 -106 -91 -120 -315 65 63 90 -31 -282 -74 285 -75 -238 196 354 -96 252 368 142
3260A42l54K63j9l06QL60l44J66J78M9k65J08j46k28K13K29j29j4KKk17J56R9
$$ 142 -212 51 32 -274 -266 94 -250 -84 94 143 -122 -14 -160 -388 -175 54 -75 -89 -87 -85 -302 -146 -47
3283d7q8Q6K09l9J5j36l1Q6K07j78J9J91l11L9m4J58j38j06L59k28k31L03j14
$$ -47 -135 -49 160 121 136 0 -31 55 262 84 103 294 -17 22 -22 136 -2 -108 251 23 -208 95 -19
3306a9j06J86N3k59k70M75j50j10K60j02L4P6J62l83P6K2N6J53o2j77n0K96m5
$$ -19 -125 61 114 -145 -415 60 -90 -200 60 -42 -8 68 230 -153 -77 -55 1 154 92 -85 -135 161 116
3329A16k32J28Lp4j45L70m32nM90L5l02j89K20k26L68N0m6j9m0n9k26K43L1k13
$$ 116 -116 12 15 -59 -204 166 -266 -271 219 254 -48 -237 -17 -243 125 175 129 110 70 11 -215 28 59 -154
3353a54P6K28l14L89j71k07j48K99j45k8K12Q8k88K58K7n02L92M7k06m4K45k43
$$ -154 -78 150 -164 225 54 -153 -301 -2 -147 -175 37 125 -163 95 122 -380 12 59 -147 -191 54 -189
3375a89k4J11n2p6J26Ok51L85p3L2r9L84k16k55M44k55K5J57p8lm0j2o0q2%K2
$$ -189 -213 -102 -154 -230 -104 -98 -349 36 -37 -5 -104 280 64 -191 253 -2 23 180 102 99 59 47 -13 -95 -95 -73
3401g3n7p3J51N7N4j86N3N7l01M00l7M8j20l1J03j03J05%k00K20L1j56L98j84
$$ -73 -130 -203 -52 5 59 -127 -74 -17 -318 82 45 93 -27 -58 45 -58 47 47 -153 67 98 -58 340 156
3425A56K4K4k06j91L90k39O2J83Ml19K12l8q1l1p9j6J34R5m9l04J85q8N8K39J19
$$ 156 180 204 -2 -193 197 -42 20 203 207 -112 100 62 -19 -50 -129 -145 -11 84 35 -269 -84 -172 -114 125 244
3450B44n0j57k9J81j1k54K73l98N14m38J91J99l33P4J7j21r6J80l2L6k83M33j26
$$ 244 194 37 8 189 178 -76 197 -201 313 -125 66 265 -68 6 23 -98 -194 -14 -46 -10 -293 140 14
3473A4q4J06l2j69K68p7K0k18L82l39J05K74l76R4P0L03l14J05k12J32k6m2M1
$$ 14 -70 36 4 -165 103 26 46 -172 210 -129 -24 250 -126 -32 38 341 27 132 -80 52 26 -16 25
3496B5k05K7R5K09L6k59j03J29R7m0N4J49n23L93J72j08k06N5L20j70j22J27j6
$$ 25 -180 -153 -58 151 187 -72 -175 -46 51 11 65 214 -309 84 256 148 -58 -3 317 147 25 152 136
3519A36k33K58k56K06Q4k16n1K47j88n7P3K18j55J5n2o2K82k16j63K06k47J78
$$ 136 -97 161 -95 111 195 -21 -72 175 -13 -70 3 221 66 81 29 -33 249 33 -130 76 -171 7
3541Go1J94n3m0J33j33K96l42J28j4p7J40j18j95R7N94p11K00M0J31K8m94L12
$$ 7 -54 140 87 47 180 47 343 1 129 115 38 178 60 -135 -38 556 -155 45 85 216 244 -250 62
3564F2m01K41k01J31J01J01q6j43L3P2J84j72K85j30k98J87Q1K1mn0o5K93j88
$$ 62 -339 -98 -299 -168 -67 34 -52 -195 -162 -90 94 -78 207 77 -221 -34 47 68 64 14 -51 242 54
3587E4j99P6K23l41j56L75k05J83J74j79l93K27J97j03j04K07j13J3K97j73m0
$$ 54 -145 -69 154 -187 -343 32 -173 10 184 5 -388 -161 36 -67 -171 36 -77 -64 233 60 20
3608B0R8k17n9k4M23j46L26k48l68J62K33m09K49p7j13J49n1J77Lj88J87j63j49
$$ 20 118 -99 -158 -182 241 95 421 173 -195 -33 200 -209 40 -37 -150 -1 -52 125 128 -60 127 -36 -185
3631a85K73l54M03p5r3n0J34jK38n89M12N1j97J98j0j22J96l6r3j86K95j69k28
$$ -185 88 -266 137 62 -31 -81 53 52 290 -299 113 164 -33 165 155 33 229 193 100 -86 209 40 -188
3654a88m4L89J76l85j96M6P4J22Mr0P5L3N5J29j27j88J04R2K12m13j2K49l06M21
$$ -188 -232 157 333 -52 -248 -202 -128 -6 -2 -92 -17 16 71 200 73 -115 -11 81 293 -120 -132 117 -189 232
3678B32Ml75m9K34k21L17J87j87k43J66j5k0k41M81m29l7O67l29j88l2K42k50
$$ 232 236 -139 -188 46 -175 142 329 142 -101 65 50 30 -211 270 -159 -196 471 142 -46 -78 164 -86
3700h6M0L51l36j01M47k36n3J86k86L1K00K08l43J44j25kn3n2J0P7L2L3k68J47
$$ -86 -46 305 -31 -132 315 79 26 212 -74 -43 157 365 22 166 41 39 -14 -66 -56 21 53 86 -182 -35
3724c5J39k74l9J33M05k79K24j75k00o0J54J25k13L45r7m48K73L50l62R6o9R6
$$ -35 104 -170 -209 -76 329 50 274 99 -101 -161 -7 118 -95 250 153 -295 -22 328 -34 62 -7 89
3746H9l16M52k73J06r2J29n2N3O4k7k51J69J9k88M58q7l65Q1K68m88M74j26P6
$$ 89 -227 225 -48 58 -34 95 43 96 160 133 -118 51 70 -218 240 153 -212 -131 137 -351 123 -3 73
3769G3k8R4k40K60k43M5K35q3o8L6K1J67q2L2m0k83L8J38K4j71kk45L65k66J78
$$ 73 45 139 -101 159 -84 -39 196 113 45 81 102 269 187 219 179 -104 -66 72 96 -75 -77 -322 43 -223 -45
3794d5L2K9m1j37J97M2k4K06j05L2k47K29OQ6j85j60L15p3j75K92k48K17L5l38
$$ -45 -13 16 -25 -162 35 77 53 259 154 186 -61 168 174 260 75 -85 230 157 -18 274 26 243 278 -60
3818f0OP8pp7K93k97L8k42M15k45k57M62j85J14J19j93o1K95j66j14K7K05k62
$$ -60 -54 24 17 -60 233 -64 -26 -268 147 -98 -355 107 -78 36 155 -38 -99 196 30 -84 -57 148 -114
3841a14J60k2j02K08N7k61R4P7M4l15M26mj32k16R1n6m7J42J09j53j12L33l13
$$ -114 46 24 -78 130 187 -74 20 97 141 -174 252 248 116 -100 -9 -65 -112 30 139 -14 -126 207 -106
3864a06J68p7M4J64l03K56k41K88N0L0l92K95j51Q5l2L6k45p9J91k75K81K9j21
$$ -106 62 -15 29 193 -110 146 -95 193 243 273 -119 176 25 110 78 114 -131 -210 -19 -294 -13 16 -105
3887a05J34n9o4K94l42R4j77K87j52Q5j37K93p7j39K21j57qj47M5J53r7j12l2
$$ -105 29 -30 -94 200 -142 -48 -225 62 -90 -5 -142 151 74 -65 156 -1 -9 -156 -111 42 -55 -167 -199
3910a99L30l77L87j85J92q7j87J44n8k99J62K60n6j59J66P2q5k23L8j46l5N85
$$ -199 131 -246 141 -44 148 61 -126 18 -40 -339 -177 83 27 -132 34 106 21 -202 -164 -310 -345 240
3932B40k34O4j16l3j67K62q4R0M5PJ11k94J75Jk25K00k64J72J09l25k20L97J94
$$ 240 6 70 -46 -79 -246 16 -68 22 67 74 185 -109 66 67 -158 42 -222 -50 59 -266 -486 -89 105
3955A05lj64O7J30k34J49j36j1L29n9j76J3j8j43m6J85J9O5j92LK9L31j96kj45
$$ 105 102 -62 5 135 -99 50 -86 -97 232 173 -3 10 -8 -151 -197 -12 7 72 -120 -117 -88 243 47 45 -100
3980a00j26K56j17j38J41M4O9J43j06qpj4j68K40J54j57j02M9O7J91k20l9N5j04
$$ -100 -226 30 -87 -225 -84 -40 29 172 66 58 51 37 -131 109 263 106 4 53 120 311 91 52 107 3
4004CPl4j27J33o2J44N2k08Q4K07j08q4J07k60J74j62j1L03k7j00O0K01n68M09
$$ 3 10 -24 -151 -18 -80 64 116 -92 -8 199 91 7 114 -146 28 -134 -145 158 131 31 91 292 -276 133
4028A33M1l17J85J38K57l99J73k95J09M9pj22L37k59p8p6j3j21L95m37L00k28
$$ 133 174 -143 42 180 437 38 211 -84 25 74 67 -55 282 23 -55 -131 -144 -265 130 -307 -7 -235
4050b35M9J37L9K0m0m7k93L82j26k2L8J09O5J01k52k4K03m7Kj23J29O9j2j63N2
$$ -235 -186 -49 -10 10 -30 -77 -370 12 -114 -136 -98 11 76 177 -75 -99 104 57 59 -64 65 134 122 -41 11
4075A1Q5p8j95K98n12L55P5j79q6N0j05l5L98k88J98K0J53k5N1l0k42O5J71j50
$$ 11 96 18 -177 121 -391 -36 39 -140 -226 -176 -281 -316 82 -206 -8 12 165 140 191 161 -81 -16 155 5
4099EKj65J80Om8L9j86M43j94l3oK02l37K1k2J82l26J65J4n0J27q5r2L08N0k54
$$ 5 7 -158 22 28 -20 19 -167 276 82 49 43 245 -92 -71 -93 89 -237 -72 -58 -108 19 -66 -158 150 200 -54
4125e4K17n2p5k18J59J30k35J25L%j47K38l3Qk93J87K77k22qQ6k58L23K2l06K45
$$ -54 163 111 36 -182 -23 107 -128 -3 0 0 -147 91 58 66 -227 -40 237 15 7 93 -165 158 180 -126 119
4150A19k04K59j59l3Q6j29Q2n1r3K52M0j77P8K1k79K15Pj35M07k64j18J31j10
$$ 119 -85 174 15 -18 68 -61 21 -30 -123 129 169 -8 70 91 -188 27 34 -101 306 42 -76 55 -55
4173e5r1J56J24k37O1l10qK39l2J95k1k64K91l54K84J85j93n8r1P5J46l6L31m98
$$ -55 -146 10 134 -103 -42 -352 -360 -121 -153 42 21 -243 48 -306 -22 163 -30 -88 -179 -104 42 6 337 -161
4197a61K70j70M2K77k57n1j21K22R4O7l99R8rj03L25rk50Q9po1k2J96o2J1J8o8
$$ -161 109 -61 -19 258 1 -50 -171 51 145 212 -187 -89 -98 -201 124 115 -135 -46 -53 -114 -136 60 -2 9 27 -41
4223d1n9P4P6K31n05n3O60n11L37k85J48j89J3m6J43p2K56L5l74K27m0M8k09J44
$$ -41 -100 -26 50 281 -224 -277 383 -128 209 -76 72 -117 -104 -150 -7 -79 177 212 -162 65 25 73 -136 8
4247Hj15K02k5N1p0K7j84L15j13j83J47k67M02m10M1J38k1n0j55L00k28K90p3
$$ 8 -107 95 70 121 51 78 -106 209 96 -87 60 -207 195 -215 -174 -36 -57 -107 -262 38 -190 100 27
4270B7k2K53k42P5j7o3P9p6K92m11q0J36J99k20J66J71k13L0q4q3K67j44O9M0
$$ 27 5 258 16 91 74 11 90 14 306 -105 -185 -49 150 -70 96 267 54 84 0 -83 184 40 109 149
4294A49J22j34M8n6k77K35R6m30L97j80M3N5j83Q0J14l18K35J22p0j59J38N4R6
$$ 149 271 137 185 129 -148 87 183 -247 150 -30 13 68 -115 -35 79 -239 -4 118 48 -111 27 81 177
4317A77j24o0j12O7L95m34j00L37j59J90j62o4L8lj1J25p9Pj02k8O1j24L4N8l6
$$ 177 53 -7 -119 -52 343 -91 -191 146 -13 177 15 -49 -11 -14 -25 100 21 28 -74 -102 -41 -165 -131 -73 -109
4342a09L8p2K13k6j51K96l04Q3Qm14N72j68J15o5L38l16M7l88L98k10O3N7n5q
$$ -109 -71 -143 70 44 -107 189 -115 -32 -24 -438 134 -34 81 16 354 38 85 -303 95 -115 -52 5 -50 -58
4366e8J27J13Kr6J28j26k16J47J17J54j93L2k68K12j65Q4N9j32m9K29j83J42o6
$$ -58 69 182 184 88 216 90 -126 21 138 292 99 131 -137 75 -90 -6 53 -79 -128 101 -82 60 -6
4389fj13K9J57r1Q8P1j8l68J45K00k20j49N72j62k04M0K3p1N3J15O8r3k58N16
$$ -6 -119 -90 67 -24 64 135 117 -251 -106 94 -126 -275 297 135 -69 -29 -6 -77 -24 91 159 66 -192 324
4413C24j86j48N8J9k46M19m07M58l86k75K72M2K7K0J01k32Q0Q1j30J2J47Q2j09
$$ 324 138 -10 48 67 -179 240 -167 291 -95 -370 -98 -56 -29 -9 92 -140 -60 21 -109 -97 50 132 23
4436B3M6k90J76N1j54j10L33j28J77j71k6L86l29O2p9J69l3l35J51Q2M6j97p7
$$ 23 69 -221 -45 6 -148 -258 75 -53 124 -47 -73 313 -16 46 -33 136 103 -232 -81 1 47 -150 -227
4459b27L19j38k8k02J04J58o1M0j19LJ88p0k3L00l97J89k03J03jKJ00r5R8j74
$$ -227 92 -46 -74 -276 -172 -14 -75 -35 -154 -151 37 -33 -56 244 -153 36 -167 -64 -65 -63 37 -58 40 -134
4483a34R6J83k53K83k59K23j08J28k38J9K13q2J65l88M6M2lK68j41j66K1J63P7
$$ -134 -38 145 -108 175 -84 139 31 159 -79 -60 153 71 236 -152 -106 -64 -67 201 60 -106 -85 78 155
4506A55j62j90Q2J05L5j63j9k8L44k28J37MJ23J3l58J65J85j68o4r1J24M1k45
$$ 155 -7 -197 -115 -10 25 -138 -157 -185 159 -69 68 72 195 208 -150 15 200 32 -32 -123 1 42 -203
4529b03J73o6J31j5m8J15p2o6J13j2O7k61L49q0k8j00p8mJ63j17j7k8P6J34P1
$$ -203 -30 -96 35 20 -28 87 15 -51 62 50 117 -144 205 125 97 -3 -81 -85 78 -39 -56 -84 -8 126 197
4554A97j26k4P3qR3m11M78k86Rj95K67k15J24J91l09L7Q2P2r4j06J4L76k17J0
$$ 197 71 47 120 112 205 -206 272 -14 -5 -200 67 -148 -24 167 -142 -105 -23 49 -45 -151 -137 239 22 32
4578C2j7q8r9L75l09J18Q1k00MK78L1j29N6l73L28j46k6mN4j1O2M8r5n6p6j76
$$ 32 15 -73 -172 203 -106 12 93 -107 -103 175 206 77 133 -240 88 -58 -84 -88 -34 -45 17 65 -30 -86 -162 -338
4604c38K18j63J92J11k80L44l49K19r3J64J76j61j72q9M61j05r2j0K10k42j15
$$ -338 -120 -283 -91 20 -260 84 -265 -46 -139 25 201 40 -132 -221 240 135 43 33 243 1 -114
4625a14J64l50L75j18K17q4J17m6j29l78L78K6k04N31m00j03J25J97j34j2k06
$$ -114 50 -300 75 -43 174 90 207 161 32 -346 32 58 -146 385 -15 -118 7 204 70 58 -148
4646a48L03k39J97J23k13j52N4r2P1J70j25q8R0P0Q0j21M9l33L72Q5k63OJ58r8
$$ -148 155 -84 113 236 23 -129 -75 -167 -96 74 -51 -139 -49 21 101 -20 29 -304 68 153 -110 -104 54 -44
4670d4m2K06j59J01Q9K1p0j89J58Q5m1j30q7P0J10k70m6J56K25j50K3o6P4q3l
$$ -44 -86 120 -39 62 151 172 102 -87 71 156 115 -15 -102 -32 78 -192 -238 -82 143 -7 16 -50 24 -59 -62
4695f2O2L6J88k74Q0k3N7M9l75J49P3l88L06K3K11j83r8J26m5Q8n5L31j04J2N4
$$ -62 0 36 224 -50 30 7 64 113 -262 -113 -40 -428 -122 -99 112 -71 -169 -43 -88 0 -55 276 172 184 238
4720B38k92l6J74j33M3QJ13p5m26L62j5M03m73k02N70j67j7J6q5M9k37N8K57k61
$$ 238 -54 -90 84 -49 -6 2 115 40 -386 -24 -39 364 -109 -311 259 92 75 91 6 55 -182 -124 133 -128
4744a28L63j19n5N3m1p6j6L6k11J01k19L90j30Q3j21N4K17l27J0K6J21pr6J23
$$ -128 235 116 61 114 73 -3 -19 17 -194 -93 -312 78 -52 31 -90 -36 181 -146 -136 -110 11 4 -92 31
4768C1J8K7P5k19K30j67K04k0l39L9j53K60K25j77l4k18J06J82j05k25N85l43
$$ 31 49 76 151 -68 162 -5 199 179 -160 -121 -274 -14 211 34 0 -218 -112 70 -35 -260 325 -18
4790a8P3J06k67K11J90m10K62N5l01R8l4K04l92M40k38nJ37j06J78j17k87Ll3
$$ -18 55 161 -106 105 295 -115 147 202 -99 -1 -35 169 -223 217 -21 -26 111 5 183 66 -221 -218 -251
4813b51J28K57m6j68J87j40k8K0k3q6M5j1j51M00j70J82Q1j83j57P2M7k20J54
$$ -251 -123 134 88 -80 107 -33 -61 -41 -64 -150 -105 -116 -267 133 -37 145 226 43 -114 -42 5 -215 -61
4836f1J3l2k74O19l12N2K89l11k45Q3J66q6R1j0J24j72P0J22k06Q7M1j12l9J6
$$ -61 -48 -80 -354 265 -47 5 294 -17 -262 -179 -13 -99 -8 -18 106 -66 4 126 -80 7 48 -64 -103 -87
4860h7o5K13q1L3L6Kk54M46j81j15R0q0j73J53J27r8K51j98k4K65k15o8J09l8
$$ -87 -152 61 -20 13 49 51 -203 243 62 -53 37 -43 -216 -63 64 -34 217 19 -5 260 45 -23 86 48
4884D8j73M8J76l7k25J49Q3j2J65j80Q1l18K67r4J17j20j4k5K32l30K01o8K39
$$ 48 -125 -77 99 62 -163 -14 69 57 222 42 123 -195 72 -22 95 -25 -39 -64 168 -162 39 -29 210
4907B10j02j57J89m8q8QN9k85L71k56R1j05N9J2J06l1O0j54L24q3j32N1j77K22
$$ 210 108 -49 140 92 4 12 71 -214 157 -99 -8 -113 -54 -42 64 33 93 -61 263 180 48 99 -78 144
4931A44k10Q1p7n5J00j77L31q6k17J78J5j39J07jkO3j22K19k04M5J25j9j91l6
$$ 144 -66 15 -62 -117 -17 -194 137 51 -166 12 27 -112 -5 -6 -8 55 -67 152 -52 -7 118 99 -92 -128
4955a28J8J63P0j79lJ56o6J5k68J39P9j18J34O6q5M2l3R0j29m75M52J87l03L98
$$ -128 -110 53 123 -56 -59 97 31 46 -222 -83 -4 -122 12 78 -7 35 2 92 -37 -512 -60 127 -176 222
4979B22n3k00K8J24j42K24r0R8k46P7r3J56n0P4m65L50J66j80k18K73r1k40M27
$$ 222 169 -31 -3 121 -21 203 113 211 -35 42 -51 105 55 129 -336 14 180 0 -218 55 -36 -276 151
5002A51l78J52Pr3J57J39j76n9J44k25P7j28M20k60k23K99O9k14M9J89j79J07
$$ 151 -227 -75 -68 -161 -4 135 -41 -100 44 -181 -104 -232 188 -72 -295 4 73 -141 -92 97 -82 25
5024B5k6J09j37L5k5L3k0k81J30k22M12j0j27J01L3j99L1jQ2O2j20L4o4K07l55
$$ 25 -1 108 -29 6 -19 14 -6 -287 -157 -379 33 23 -104 -3 30 -169 -138 -139 -57 5 -115 -81 -145 62 -293
5049b93M37o9J49l44P2J2Q0qP6J3j03j05Q7J70r0k4K59n22L86k11M4j72m3K81
$$ -293 144 75 224 -120 -48 -36 44 36 112 125 22 -83 4 174 84 60 319 -203 183 -28 16 -156 -199 82
5073H2J3j36k39K7L17k38J36j53O2K77l94L41j22p6M3j31J80j06J91l22O5L39
$$ 82 95 -41 -280 -253 64 -174 -38 -191 -129 148 -246 95 -27 -103 -60 -191 -11 -117 74 -248 -183 156
5095A56j55j00L03k75q0JP2J20j53M5lJ21J05n0P2l2k28R1J27k24J95q5p8K12
$$ 156 1 -99 204 -71 -151 -150 -78 42 -111 -66 -69 52 157 107 179 147 -81 10 137 -87 108 23 -55 157
5119A57j38l05R1J90m9Q5k31L3J90M0k71L52j37k18K92k60J59j36J0J86o6j58
$$ 157 19 -286 -195 -5 -54 31 -200 -167 23 63 -208 144 7 -211 81 -179 -20 -156 -146 40 -26 -184
5141a84J57j12P0O8O0q6Q4j79r8K00M2o9j94J78k2M0j19M6lp6J49K21k68K47k98
$$ -184 -27 -139 -69 -1 59 -27 57 -122 -220 -20 22 -47 -241 -63 -85 -45 -164 -118 -121 -197 -48 173 -95 152 -146
5166a46L5Q7J02j55j67L87j37k0k31n6L45k20M3J66J04j95J72j28K73j61j06j15
$$ -146 -111 -24 78 -77 -244 143 6 -14 -245 -301 44 -176 -133 33 137 -58 114 -14 259 98 -8 -123
5188a23N8n4RR6l43K55J64O5k67J73J43l02j3j68K45J68j71k44M01r2p5J1J1M7
$$ -123 -65 -119 -110 -14 -357 -102 62 127 -140 33 176 -126 -139 -307 -62 106 -65 -309 92 0 -75 -64 -53 -6
5212fK42j84j6k25K70o5J39k95J09j23K55M8j1j35q8K48j89j35K70j15m8P3q0
$$ -6 236 52 36 -189 81 16 155 -140 -31 -154 101 149 138 3 -85 163 -26 -161 109 -6 -54 19 -61
5235f1o7K11K9j74l5nN7K53l85J16J21N9j12j12K98l46J66j16J65k52J45j24J96
$$ -61 -128 83 112 -62 -97 -102 -45 208 -177 -61 60 119 7 -105 193 -153 13 -103 62 -190 -45 -169 27
5258B7n3L4j12K88k44Q1j77J36j11Q9J82l3R1l98K71ml2m0k59K28m1j80M83j56
$$ 27 -26 8 -104 184 -60 21 -156 -20 -131 -42 140 107 198 -200 71 67 35 -5 -264 -36 -77 -257 226 70
5282G0j66M7j27J60n1j10p2J42P8j91K16r9K57l4J45m45K8K6L93m9k20m8q7q5
$$ 70 -96 -49 -176 -16 -67 -177 -249 -107 -29 -220 -4 -103 154 120 265 -180 -152 -126 267 218 -2 -50 -137 -222
5306b22K99k51L4K88k61M1L0J23O2j69L19L3n31M56k78R4L70m85K71l98K64k45
$$ -222 77 -174 -140 148 -113 -72 -42 81 143 -26 293 326 -205 251 -27 67 437 -48 223 -175 89 -156
5328a56n4J13J44m0j22J42R7j40k38M4J88K38l45J37j60J39m2k1J95L6k97R6L
$$ -156 -210 -97 47 7 -115 27 124 -16 -254 -210 -22 216 -129 8 -152 -13 -55 -76 119 155 -142 -46 -43
5351d3j35K58K1l44M4J50L06m03J75p9J68n8j14J18j37J07j93Q2J7m4p3K09n2
$$ -43 -178 80 101 -243 -199 -49 257 -146 29 -50 118 60 -54 64 -73 34 -159 -77 -60 -104 -177 32 -20
5374b0k02JO3O9K14j75Q2J82l13N9q9K26j75n0r1K31O9q9P4K1l39K81J40j55j46
$$ -20 -222 -221 -158 -89 125 -50 32 214 -99 -40 -129 97 -78 -128 -219 12 81 -8 66 87 -252 29 169 14 -132
5399a32M34j70k61K96l32J01L47l45K28j21J58J01k33j96J44K40l23J60k32K45
$$ -132 302 132 -129 167 -165 -64 283 -62 166 45 203 304 71 -125 19 259 -64 96 -136 109
5419A09p7J93k18j21K09m6j63K73l62K06J10j63O3k3j94k47M77LQO8J12l49j9
$$ 109 32 225 7 -114 95 49 -114 159 -203 3 113 -50 13 -10 -204 -451 26 29 37 105 217 -132 -151
5442a51J7L64j30o8Q0l48J61K02o6j89L76l54N4L4r4J88j91J20K4k9O1O3m84K79
$$ -151 -134 230 100 32 112 -236 -75 127 61 -128 248 -106 -52 -18 -112 76 -115 5 29 0 61 124 -360 -81
5466h1J71p1J31l18K89n0R5J28j05q7M1k54J42l57N75j43l4p4J06j62M2J34j81
$$ -81 90 19 150 -168 121 71 166 294 189 102 143 -111 31 -326 249 106 72 -2 104 -58 -16 118 -63
5489f3j93K76j71Q7P7j78L17j59k36J9L62o6K10l89J71k27o8K43J01j74Q2k3M2
$$ -63 -256 20 -151 -64 13 -165 152 -7 -243 -224 138 72 282 -107 64 -163 -231 12 113 -61 21 -2 40
5512D0J58j49J3k05K24J45n69K41L1J13P8l5J68l03mr1J25j66K93J06j6j23l69
$$ 40 198 49 62 -143 81 226 -343 -102 -71 42 120 85 253 -50 -54 -145 -20 -186 107 213 197 74 -295
5535b95l7M06k40J58j20J83J43k92j0M3K51j72M4j17J04Oj6j92O5j8Jj60J89J57
$$ -295 -332 74 -166 -8 -128 55 198 -94 -104 -61 190 18 62 -55 49 55 39 -153 -88 -106 -105 -265 -76 81
5559H1j01j15K47J98k32j04p6K5J04R8j55r5K05l17L55l54J26Or9j8J77P9K0J42
$$ 81 -20 -135 112 310 78 -26 -102 -77 27 125 -30 -125 80 -237 118 -236 -110 -104 -203 -221 -44 35 55 197
5583A97l29P8k48K60J99j41J0J3k20L24L7k23N3j09J08k55L81J05j07j81J40K17
$$ 197 -132 -54 -302 -42 157 16 26 39 -181 143 180 -43 10 -99 9 -246 135 240 133 -48 92 309
5605C09l44J30q8j6O0J61j27K01l86J83r6J42J9m18K54j77N3J19Lj75R1J60J48
$$ 309 -35 95 7 -9 51 212 85 286 -100 83 -13 129 148 -270 -16 -193 -140 -21 -18 -193 -102 58 206
5628B06j98o2L8NO2o6N6mk11K15j66L26l8j50j84rK76j9r3N2j79J45J11k98K34
$$ 206 8 -54 -16 -11 51 -15 41 37 -174 41 -125 201 163 13 -171 -180 96 77 -16 36 -143 2 113 -185 49
5653D9l1k7j80K72j15J65q9j05J88j11j0J75mp1k81P8J61P3o0k4L0l13J89k1K7
$$ 49 18 -9 -189 83 -32 133 44 -61 127 16 6 181 177 106 -175 -97 64 137 77 53 83 -230 -41 -62 -35
5678c5o3K77k52o3J4k3J9K66l71M74k30J15k20L86m76K35Q7o1j05j94L88Q3l35
$$ -35 -98 179 -73 -136 -122 -145 -126 140 -231 243 13 128 -92 294 -182 53 140 79 -26 -220 168 251 -84
5701h4K62j81J71k15N6o2n8J19K90j63k01O5n7k8K76j37Q3n08O29l02l8L25l73
$$ -84 178 -3 168 -47 9 -53 -111 8 298 135 -66 -1 -58 -86 190 53 136 -372 257 -45 -83 242 -131
5724a31K0L0l0K20j43N1j71q7L25k67J52O4J03k37K29q8k10J58q1J06J72j21j79
$$ -131 -111 -81 -111 109 -34 17 -154 -241 84 -183 -31 33 136 -101 128 40 -170 -12 -93 13 185 64 -115
5747a15R5M1j14m7M68l02j51K90l55K80J2j60O5j75R0Q8p9K43J08m12K61p1j5
$$ -115 -20 21 -93 -140 328 26 -125 165 -190 90 102 -58 7 -168 -78 10 -69 174 282 -130 131 60 45
$$ [...]
8191c36
##END NTUPLES=NMR FID
##END=
