##TITLE=1H_Anisidine
 CDCl3
 8 sc, 
 26.10.2023
##JCAMPDX= 6.0         $$ Bruker NMR JCAMP-DX V2.0
##DATA TYPE= NMR FID
##DATA CLASS= NTUPLES
##ORIGIN= UXNMR, Bruker Analytische Messtechnik GmbH
##OWNER= root
$$ XWIN-NMR		Version 3.5
$$ Thu Oct 26 14:40:13 2023 Russian Standard Time (UT+4h)  she@DPX200
##.OBSERVE FREQUENCY= 200.13135
##.OBSERVE NUCLEUS= ^1H
##.DELAY= (6, 6)
##.ACQUISITION MODE= SIMULTANEOUS
##.ACQUISITION SCHEME= undefined
##.AVERAGES= 8
##.DIGITISER RES= 18
##SPECTROMETER/DATA SYSTEM= spect
##.PULSE SEQUENCE= zg30
##.SOLVENT NAME= CDCl3
##.SHIFT REFERENCE= (INTERNAL, CDCl3, 0, 15.7039)
##AUDIT TRAIL= $$ (NUMBER, WHEN, WHO, WHERE, WHAT)
$$ ##TITLE= Audit trail, XWIN-NMR		Version 3.5
$$ ##JCAMPDX= 5.01
$$ ##ORIGIN= Bruker BioSpin GmbH
$$ ##OWNER= she
$$ F:/spectra/data/she/nmr/H-F/1/audita.txt
$$ ##AUDIT TRAIL=  $$ (NUMBER, WHEN, WHO, WHERE, WHAT)
(   1,<2023-10-26 14:39:16.76 +0400>,<she>,<DPX200>,
      <created by zg, POWCHK disabled, PULCHK disabled
       configuration hash MD5:
       00 E9 B6 7A A2 85 ED C7 34 08 36 98 17 FE 4E 26
       data hash MD5: 16K
       97 C9 FB C5 2B 05 A0 10 FC EA DC 9F 78 C4 B7 95>)
$$ ##END=
$$ 
$$ hash MD5
$$ C9 71 93 9D EC A2 16 9A A2 47 AA 11 5B 9D 3D E8
##$RELAX= 
##$RELAX= 
##$RELAX= 
##$RELAX= 
##$RELAX= 
##$RELAX= 
$$ Bruker specific parameters
$$ --------------------------
##$DU= <F:/spectra>
##$EXPNO= 1
##$NAME= <H-F>
##$PROCNO= 1
##$TYPE= <nmr>
##$USER= <she>
##$AMP= (0..31)
100 100 100 100 100 100 100 100 100 100 100 100 100 100 100 100 100 100 
100 100 100 100 100 100 100 100 100 100 100 100 100 100 
##$AQSEQ= 0
##$AQ_mod= 1
##$AUNM= <au_zg>
##$AUTOPOS= <>
##$BF1= 200.13
##$BF2= 200.13
##$BF3= 200.13
##$BF4= 200.13
##$BF5= 200.13
##$BF6= 200.13
##$BF7= 200.13
##$BF8= 200.13
##$BYTORDA= 1
##$CFDGTYP= 0
##$CFRGTYP= 5
##$CHEMSTR= <none>
##$CNST= (0..31)
1 1 145 1 1 1 1 1 1 1 1 1 1 1 1 1 1 1 1 1 1 1 1 1 1 1 1 1 1 1 1 1 
##$CPDPRG= <>
##$CPDPRG1= <>
##$CPDPRG2= <>
##$CPDPRG3= <>
##$CPDPRG4= <mlev>
##$CPDPRG5= <mlev>
##$CPDPRG6= <mlev>
##$CPDPRG7= <mlev>
##$CPDPRG8= <mlev>
##$CPDPRGB= <>
##$CPDPRGT= <>
##$D= (0..31)
0 1.2 0 0 0 0 0 0 0 0.06 0 0.03 0 0 0 0 0.0002 0 0 0 0 0 0 0 0 0 0 0 0 
0 0 0 
##$DATE= 1698316756
##$DBL= (0..7)
120 120 120 120 120 120 120 120 
##$DBP= (0..7)
150 150 150 150 150 150 150 150 
##$DBP07= 0
##$DBPNAM0= <>
##$DBPNAM1= <>
##$DBPNAM2= <>
##$DBPNAM3= <>
##$DBPNAM4= <>
##$DBPNAM5= <>
##$DBPNAM6= <>
##$DBPNAM7= <>
##$DBPOAL= (0..7)
0.5 0.5 0.5 0.5 0.5 0.5 0.5 0.5 
##$DBPOFFS= (0..7)
0 0 0 0 0 0 0 0 
##$DE= 6
##$DECBNUC= <off>
##$DECIM= 32
##$DECNUC= <off>
##$DECSTAT= 4
##$DIGMOD= 1
##$DIGTYP= 9
##$DL= (0..7)
0 120 120 120 120 120 120 120 
##$DP= (0..7)
150 150 150 150 150 150 150 150 
##$DP07= 0
##$DPNAME0= <>
##$DPNAME1= <>
##$DPNAME2= <>
##$DPNAME3= <>
##$DPNAME4= <>
##$DPNAME5= <>
##$DPNAME6= <>
##$DPNAME7= <>
##$DPOAL= (0..7)
0.5 0.5 0.5 0.5 0.5 0.5 0.5 0.5 
##$DPOFFS= (0..7)
0 0 0 0 0 0 0 0 
##$DQDMODE= 0
##$DR= 18
##$DS= 0
##$DSLIST= <SSSSSSSSSSSSSSS>
$$ [...]
##$SUBNAM2= <"">
##$SUBNAM3= <"">
##$SUBNAM4= <"">
##$SUBNAM5= <"">
##$SUBNAM6= <"">
##$SUBNAM7= <"">
##$SUBNAM8= <"">
##$SUBNAM9= <"">
##$SW= 18.05172834244
##$SWIBOX= (0..15)
0 0 2 0 0 0 0 0 0 0 0 0 0 0 0 0 
##$SW_h= 3612.71676300578
##$TD= 16384
##$TD0= 1
##$TE= 0
##$TE2= 300
##$TE3= 300
##$TEG= 300
##$TL= (0..7)
0 120 120 120 120 120 120 120 
##$TP= (0..7)
150 150 150 150 150 150 150 150 
##$TP07= 0
##$TPNAME0= <>
##$TPNAME1= <>
##$TPNAME2= <>
##$TPNAME3= <>
##$TPNAME4= <>
##$TPNAME5= <>
##$TPNAME6= <>
##$TPNAME7= <>
##$TPOAL= (0..7)
0.5 0.5 0.5 0.5 0.5 0.5 0.5 0.5 
##$TPOFFS= (0..7)
0 0 0 0 0 0 0 0 
##$TUNHIN= 0
##$TUNHOUT= 0
##$TUNXOUT= 0
##$USERA1= <user>
##$USERA2= <user>
##$USERA3= <user>
##$USERA4= <user>
##$USERA5= <user>
##$V9= 5
##$VALIST= <valist>
##$VCLIST= <CCCCCCCCCCCCCCC>
##$VD= 0
##$VDLIST= <DDDDDDDDDDDDDDD>
##$VPLIST= <PPPPPPPPPPPPPPP>
##$VTLIST= <TTTTTTTTTTTTTTT>
##$WBST= 1024
##$WBSW= 4
##$XGAIN= (0..3)
0 0 0 0 
##$XL= 0
##$YL= 0
##$YMAX_a= 24748
##$YMIN_a= -43006
##$ZGOPTNS= <>
##$ZL1= 120
##$ZL2= 120
##$ZL3= 120
##$ZL4= 120
##$ABSF1= 10
##$ABSF2= 0
##$ABSG= 5
##$ABSL= 3
##$ALPHA= 0
##$AQORDER= 0
##$ASSFAC= 0
##$ASSFACI= 0
##$ASSFACX= 0
##$ASSWID= 0
##$AUNMP= <proc_1d>
##$AZFE= 0.1
##$AZFW= 0.1
##$BCFW= 1
##$BC_mod= 2
##$BYTORDP= 1
##$COROFFS= 0
##$CY= 11.3945322036743
##$DATMOD= 1
##$DC= 2
##$DFILT= <>
##$DTYPP= 0
##$F1P= 15.7292609196834
##$F2P= 12.9074282941183
##$FCOR= 0.5
##$FTSIZE= 0
##$FT_mod= 4
##$GAMMA= 1
##$GB= 0.15
##$INTBC= 1
##$INTSCL= 1
##$ISEN= 128
##$LB= 0.24
##$LEV0= 0
##$LPBIN= 0
##$MAXI= 10000
##$MC2= 0
##$MEAN= 0
##$ME_mod= 0
##$MI= 1.114404
##$NCOEF= 0
##$NC_proc= 0
##$NLEV= 6
##$NOISF1= 3.799351
##$NOISF2= 2.8
##$NSP= 1
##$NTH_PI= 0
##$NZP= 0
##$OFFSET= 15.70392
##$PC= 1
##$PHC0= -23502.08
##$PHC1= -1.947278
##$PH_mod= 1
##$PKNL= yes
##$PPARMOD= 0
##$PSCAL= 0
##$PSIGN= 0
##$REVERSE= no
##$SF= 200.130013532006
##$SI= 16384
##$SIGF1= 3
##$SIGF2= 2
##$SINO= 400
##$SIOLD= 16384
##$SREGLST= <1H.CDCl3>
##$SSB= 0
##$STSI= 0
##$STSR= 0
##$SW_p= 3612.71676300578
##$SYMM= 0
##$S_DEV= 0
##$TDeff= 0
##$TDoff= 0
##$TI= <>
##$TILT= no
##$TM1= 0
##$TM2= 0
##$TOPLEV= 0
##$USERP1= <user>
##$USERP2= <user>
##$USERP3= <user>
##$USERP4= <user>
##$USERP5= <user>
##$WDW= 1
##$XDIM= 8192
##$YMAX_p= 0
##$YMIN_p= 0
$$ End of Bruker specific parameters
$$ ---------------------------------
##NTUPLES= NMR FID
##VAR_NAME=  TIME,          FID/REAL,        FID/IMAG
##SYMBOL=    X,             R,               I
##VAR_TYPE=  INDEPENDENT,   DEPENDENT,       DEPENDENT
##VAR_FORM=  AFFN,          ASDF,            ASDF
##VAR_DIM=   8192,          8192,            8192
##UNITS=     SECONDS,       ARBITRARY UNITS, ARBITRARY UNITS
##FACTOR=    0.0002768,     1,               1
##FIRST=     0,             0,               0
##LAST=      2.2672688,     0,               0
##MIN=       0,             -43006,          0
##MAX=       2.2672688,     24748,           0
$$ Real data points
##PAGE= N=1
##DATA TABLE= (X++(R..R)), XYDATA
$$ [...]
1801g63J159J184j84j259j408J7J233J428K23j133j521j97J480J244M43j049j478
1818e81j73J090J492L49j025j375o26R79J478O60j172j390p51Q52J244P71q35
1835I87j655p73P00J435Q58l93j570r65O56J342J297m90j443q32K64J535J077
1852B030r0j380j188L6J337J206M9j505j116l59J412J198L4j155j348m01J240
1869@J146K51r51j321l12Q53J491N44j098j227o14J135J557N49q47j348o22Q54
1887D0J479Q26p10j630r09O08J303Q86o69j353j104L29J413R47k37j329j083L8
1905a155J412J099mj076j296P1J385J062J92r49j345j24J229J127K25q92j465
1922e04l22J026J173N82j071j186n95P42J221L02p39j265n08P12J124N18n27j210
$$ plain form
1801 -763 396 1580 1396 137 -1271 -1254 -21 1407 1630 497 -1024 -1221 259 1503 1946 897 -581
1818 -581 -754 336 1828 2177 1152 -223 -849 130 1608 2268 1096 -294 -1045 -193 1051 1822 987
1835 987 -668 -1441 -741 694 1552 1159 -411 -1376 -720 622 1919 1429 -14 -846 -582 953 2030
1852 2030 1940 560 -628 -592 745 1951 2000 495 -621 -980 432 1630 1664 509 -839 -1240 0
1869 0 1146 1397 446 -875 -1187 -334 1157 1701 603 -624 -1238 -103 1454 2003 1156 -192 -814 40
1887 40 1519 2345 1635 5 -904 -296 1007 1893 1224 -129 -1233 -904 509 1456 1219 -110 -1193 -1155
1905 -1155 257 1356 1352 276 -1020 -949 436 1498 1690 741 -604 -728 501 1628 1853 961 -504
1922 -504 -826 200 1373 1955 884 -302 -897 -155 1066 1368 629 -636 -1144 -432 692 1210 683 -527
1940e27p25P73J322O67k14j425o79N27J132J032l75j208r14L47J305P04k67j196
1958B79q53R7R45R36j04j160j086l02J285J061K51j106j224J92P40J237L52j154
1976C86r78j14Q26J271M80q71j180k21Q34J026M06q26q92o33N23J126M30q03j062
1995b72n57M98J034O05o81q59p02J88J323P12k80j082n33Q8J265Q03q2q71j069
2014d72L69Q87P84n5r10j014K82O44Q82m6r72j007pP89J023N9j117p21j90N92
2034b00R56J24p23p70j81R22Q98M77o49q97l02O39P57M88o88p39m01O49P03N34
2054A597m29r99o20K22Q64P20o10j006n70J72J140M93n5j003n96J99P85R35k20
2073A019q77o65J67R59P81R2j027o97r3Q79Q68K69j227r46k88R89J092k34q16
$$ plain form
1940 -527 -1252 -479 843 1510 1296 -129 -808 -281 851 1883 1508 300 -614 -267 1038 1742 1475 279
1958 279 -574 -477 468 1404 1300 140 -946 -1248 37 1098 1349 243 -981 -789 -49 1188 1540 386
1976 386 -592 -706 120 1391 1871 1000 -180 -401 433 1459 1865 1039 147 -486 37 1163 1593 790 -272
1995 -272 -829 -331 703 1308 627 -232 -934 -746 577 1289 1009 -73 -606 -518 747 1550 1468 597 -472
2014 -472 -103 784 1568 1513 603 -411 -129 515 1397 1351 379 -628 -635 154 1177 1236 119 -602 -792 -200
2034 -200 756 880 157 -613 -794 128 1026 1503 854 -43 -345 294 1051 1539 851 112 -289 360 1063 1597
2054 1597 1168 169 -451 -229 635 1355 745 -261 -831 -659 481 974 919 -84 -680 -481 304 1239 1019
2073 1019 142 -523 -356 603 1384 1476 449 -248 -341 538 1406 1675 448 -498 -786 203 1295 1061 245
2092B45q25j74O48R37K15j071q88r4Q27R11K67n19j061k88P45R89M36n32r75n23
2112g30M90J162N41m83r24p89N60Q25L86l65j114o29K59J080O71m40r92o20J93
2131i19J004O99k00q16p43lJ137P32J08r04r98K84R38O82J09p62j051K4N63J087
2151I71M6p40r45l14N63J031P1p33n18p96O52R07N48n13j189j67N64J015M53l59
2171E47q39o48L85J047Q49n94q22p70K43J003O49k97j142p20L95P79P73k99q15
2190b76r65l8J236M79J40r77o96q2O51J057K66o65r32l48J018R55K25o88j049
2209f89k26N95J238J52o20j029n26M44J096N08o80j040l55P7J249K31k58r64o87
2228a484N84Q08R16n13r13n61L80P98Q30j94q22r01K81P91R42q6j018p46k52J035
$$ plain form
2092 245 -580 -754 -106 831 1046 -25 -913 -1007 -180 731 998 479 -582 -870 -125 864 1300 768 -207 -730
2112 -730 -240 922 1463 980 56 -733 -173 652 1038 673 -441 -1070 -811 269 940 500 -492 -1112 -919
2131 -919 85 784 584 -232 -975 -978 159 891 999 95 -903 -619 319 1001 1110 348 -703 -679 -116 971
2151 971 1017 277 -668 -982 -419 612 683 -50 -568 -1364 -712 195 743 230 -959 -1126 -562 453 906 547
2171 547 -292 -940 -555 492 1341 747 -75 -845 -602 401 1050 753 -389 -1109 -714 65 838 539 -276
2190 -276 -1241 -1279 -43 436 576 -401 -1097 -1179 -528 529 795 130 -802 -1150 -132 823 1048 360 -689
2209 -689 -915 -320 918 1070 450 -579 -1105 -661 435 943 263 -777 -1132 -1055 194 425 167 -797 -1484
2228 -1484 -900 -92 824 311 -602 -1163 -783 15 845 651 -171 -1072 -791 0 942 856 -162 -908 -1160 -125
2248a25R97k22n66j048p0M67J050J08r44o76k95N61Q99N52p47j189r8O83Q77O51
2268H65n06r55k69M21Q94M90k48r53n72L06Q36N96k86j111m90l0R86L97M9r12
2288d92r25M02P99O26oj087n33N8Q31J040k49o04p61j05P73P23L79q26o72k25
2308h54N77O49N00o15r84l78O19Q93J76m97r01m75L63J137K02n58o12l65L05Q71
2328E3N18n23q74k82K97Q17P10m09n79p26L16R10N76l47n77p35m2P81O79k09o60
2349c06n81l02P61O33J1p01p02J53N91O41P2m77p73j33O46Q79n9l82p56L0N01
2370b54Q78K32p20p10l20M44P48J69l10n88o30M43O36K23k38p37n45M16Q24L84
2390C45m42m81o44M65P62N86k69r01l74L22Q16K15J03p32n83J56N72O30on98o92
$$ plain form
2248 -125 872 650 84 -964 -1034 -567 483 591 -353 -1029 -1324 -763 136 688 -59 -1248 -1346 -663 214 865
2268 865 359 -596 -865 -444 450 940 692 -261 -833 -527 309 905 619 -492 -982 -1012 -26 371 420 -492
2288 -492 -1417 -1015 -216 410 404 -683 -1216 -1158 -327 713 464 -140 -901 -1006 -233 490 869 43 -629 -854
2308 -854 -277 372 872 257 -727 -1105 -486 407 583 86 -815 -1290 -927 210 412 -146 -758 -1123 -818 53
2328 53 571 48 -826 -1108 -811 6 716 307 -272 -998 -682 228 804 457 -120 -855 -897 -116 563 354 -306
2349 -306 -887 -1189 -428 205 216 -485 -1187 -1034 -443 198 270 -207 -980 -1113 -467 412 353 -29 -785 -755 -254
2370 -254 624 856 136 -574 -894 -450 298 467 157 -431 -1061 -618 18 241 3 -734 -1279 -863 -39 345
2390 345 -97 -578 -1222 -757 5 591 322 -579 -953 -631 185 400 503 -229 -812 -656 -84 546 540 -58 -750
2411g50qN13N92j56o43m66k11P27O59Ko28p60O1O97N43J76n71o22j07M50R73K06
2433F77m64q65mK11J007M00n80q36k47K38N95M65l66p29o16M62P43K57m08o21
2453f81l43J74P34M01j5n58o82L87N42P56j84n93n22J95M86N65P4o17p63K8N79
2474c7O76q0n03p53J3N85M81O8o40m87j79M44N60L90n95p78O3M56O50K99k20r40
2496e27o9L22P99K55k90p08l60L71P71J64l01o28n36J90O20O52k60o90p83K60
2516g48P88N19l89l74m55m7O94M66R4o93n21J53P55N16j42k96p33l9P13M89K70
2537A020q10p93o4M97P53J97n85n89l93L97P68J38n42o09k35L99P46M18l96o95
2557c78j48L2R66M54l38m93o37L39Q76L62k83o11p02K13O40N00j93o06o90J47
$$ plain form
2411 -750 -758 -245 347 191 -452 -918 -1129 -402 257 259 -369 -1129 -1068 -371 172 348 -223 -845 -952 -502 471 677
2433 677 213 -652 -656 -445 562 962 382 -454 -701 -463 132 597 231 -498 -1114 -652 91 348 -60 -681
2453 -681 -1024 -850 -116 285 270 -288 -970 -583 -41 715 531 -62 -584 -389 97 662 736 119 -644 -616 -37
2474 -37 639 559 56 -697 -684 -99 382 450 -190 -677 -856 -412 148 538 -57 -835 -772 -316 334 633 413 -527
2496 -527 -596 -274 525 780 490 -218 -578 -207 564 728 427 -201 -737 -547 73 725 465 -225 -1008 -748
2516 -748 40 559 170 -204 -659 -706 -12 454 548 -145 -666 -513 242 758 616 320 -413 -452 261 750 1020
2537 1020 210 -583 -647 -150 603 800 215 -374 -767 -370 398 536 -6 -615 -850 -451 295 713 317 -378
2557 -378 -526 -494 472 926 588 95 -542 -203 673 1035 752 141 -561 -348 292 792 599 -7 -697 -550
2577e50O06M72n9p20o24N2P31N87j8o44o38Q8N62Q70K7n10p42j39O70O69J11m34
2599C67o62k34L91O94K91m24q31k33K95O79K36j52p52o34M92O65J74p9p33l72
2619h22K66P97N22j04o60m83O2O88M86l37m38l25M8L86O43jo60n10k51O21N66
2640D94J41n14p98k5N79M42K57m83p62k1K34R94J23l60o91m18N14O59M25j81o62
2661e3m53M36P20K32k46p68o76N57M23N20l07n85l62J26K85N84l37m26m23l6R15
2682A26M87k66m60n74J45O03N27n7k58n39j09N51L79Q6l28n16m26N25O40M1o13
2703c6m31o8K44O32J40k69n55n28L94N57M42l48o65p9K03P04Q0n4o47j91L23M62
2725C10M14j64p41l12R6P04K34r9p35l40J69M96K98j21j67p56K24L53M02r6m29
$$ plain form
2577 -550 56 528 469 -251 -875 -823 -92 495 477 -167 -805 -717 -155 715 742 232 -510 -649 21 690 801 367
2599 367 -295 -529 -138 556 847 423 -408 -641 -346 333 569 417 -335 -969 -477 188 362 283 -450 -822
2619 -822 -556 241 763 659 -1 -484 -422 266 752 415 -23 -348 -300 86 729 728 68 -442 -693 -72 494
2640 494 635 121 -677 -702 -123 319 576 93 -669 -690 -456 538 661 301 -390 -808 -294 365 790 609 -53
2661 -53 -506 -70 650 882 636 -132 -808 -251 172 692 385 -200 -562 -436 -151 433 96 -330 -753 -789 126
2682 126 613 347 -113 -687 -542 61 588 531 273 -266 -375 176 555 641 313 -203 -629 -104 536 577 -36
2703 -36 -467 -535 -291 341 481 212 -343 -871 -477 80 522 174 -491 -570 -367 337 417 363 -284 -475 -152 310
2725 310 724 560 -181 -493 -397 307 541 442 -293 -633 -464 32 330 209 42 -714 -490 -137 265 169 -260
2746b60l44J3N62M69Mn08n42P6M73N02J02m50l06j09J70O72K9k27p97K01O2M70
2768B62L0k30n65k69M31K86M62l10m82k50j3P54R6r6m10l70K73M05L88l8l43m51
2790d40J84L26M58k05k60k79k10O93M93m01l74m24K6K14L87j8l09m89N1K25O04
2811B52n9m38k49k25O53N35K3l48n00k29N64M85J85k45o59j51K83N65J43n08m01
2832c24l18J35P79J77l88m80l45J47N80K88j61m75l06K85N64K05j29l66m41J28
2852d45O79L99L6o85m50K66L69L56l7m59p40K23L20O32j57m62n36J27M27M45O5
2873C73m89k05k51M02M19L25m94m81k59M42N22L12k11o36m5J78N90J00k59n78
2893b45p3K67K93K31j89o33j64K23L22L41%o54k88j34P75K93J96o87m30J53N43
$$ plain form
2746 -260 -604 -591 -29 440 444 -64 -606 -530 -57 445 547 97 -209 -318 -148 524 553 326 -471 -270 -208 262
2768 262 292 62 -503 -772 -341 -55 407 97 -385 -635 -648 106 202 106 -304 -674 -401 4 392 354 11 -440
2790 -440 -256 70 528 323 63 -216 -426 267 760 359 -15 -439 -413 -199 188 170 -139 -628 -577 -352 252
2811 252 193 -245 -494 -719 -66 469 492 144 -356 -585 -21 464 649 404 -255 -406 -123 442 585 77 -324
2832 -324 -642 -507 272 449 61 -419 -764 -617 -37 251 90 -385 -691 -406 158 363 234 -132 -573 -445
2852 -445 234 633 669 -16 -466 -200 169 525 488 29 -711 -488 -168 464 307 -155 -691 -564 -137 308 373
2873 373 -116 -321 -572 -170 249 574 80 -401 -660 -218 304 616 405 -231 -276 -98 492 592 333 -245
2893 -245 -318 -51 242 473 284 -349 -513 -290 32 373 373 -281 -569 -703 72 365 561 -126 -556 -403 140
2914A40N70k05l17p02L45L00N06N1m69p32J10M80L55j1k58p04k23P73N18o7m15
2935D5n85j79M01P39N5k20n94k77K06Q21J57m24n04r9M24L04L81k3q11k61L64
2956h0N42L31l05l68n81M1N25O66k82n38o67J94L24M79K68o04l83k3L87M88J12
2977E26m42l79j60M17O02J22m96k90j01L36L35J55k17o07j89J77O21K68o53m46
2997d21K7J0N62L73k81n92j91l1P41K88o8o28l2L8L83N00m78k21l42K35M25M71
3019G68j58l75n65J31M53J49M3l64l04l63O07L01J37m42k93k08K39M87J30k50
3039A23n32R6K73N64J2l65k87j14K20M47J94Rp14j57L15K59K27L1o39n96M96L05
3061A67K50k69l34k44K54L00M18l09m94k52M9O77K89j04k57m81K10O16L5q5k50
$$ plain form
2914 140 710 505 188 -514 -169 131 637 688 219 -513 -403 77 432 421 163 -541 -764 9 527 460 45
2935 45 -540 -719 -318 421 476 256 -338 -615 -409 412 569 145 -359 -458 -34 270 651 628 -183 -444 -80
2956 -80 462 793 488 120 -461 -420 105 771 489 -49 -716 -522 -198 281 549 -55 -438 -461 -74 414 526
2977 526 84 -295 -455 -38 564 686 190 -100 -201 135 470 625 408 -199 -388 -211 410 678 25 -421
2997 -421 -394 -384 178 551 270 -322 -513 -544 197 485 417 -211 -243 -205 178 678 200 -21 -363 -128 297 768
3019 768 610 235 -330 -199 254 403 446 82 -222 -585 22 323 460 18 -275 -483 -244 243 373 123
3039 123 -409 -313 -40 524 536 171 -116 -230 -10 437 631 640 -74 -231 84 343 570 601 -38 -634 -138 167
3061 167 417 148 -186 -430 -176 124 542 233 -261 -513 -464 213 502 398 141 -340 -130 486 521 436 186
3082A86l56L6J51M17j27j57j17k42K68M62j60k31m37p5K62M17O7n34K3j61P3M10
3104A75L52k26l13j01j36O78J19k26m35j34K43K11K49j56n24L2L6M35L29m14k81
3125h7k15P5L73J92Q9n21k14P9J93N31l32k92k44J63M45K82r5j49l28n8K03N54
3147F44j86j75o21L27L67J21l9k42l40j93M21K41P6k30l16l82M35L28m7j09k61
3168a81j73J79M79O5r3k53p2P2J30L32k9l96m38L59J49M33j83l17l63J71K33M00
3190E04j94l29j73N5J73K74Q7m61k35j61L24L37L81n58l54J45L08L81K8l45l31
3211a44p0J81M86m4k69k95j21K47K06J85l78k96j70K08N93q8k03l61j9J29M47
3232B24P9P5n63j31J31N31J38o4m35k86J03M51K05k10k48k99K8L02L40L0l07n33
$$ plain form
3082 186 -170 -134 17 434 307 150 33 -209 59 521 361 130 -307 -382 -120 297 364 -170 -147 -308 -235 175
3104 175 527 301 -12 -113 -249 429 548 322 -113 -247 -4 207 456 300 -224 -192 -156 279 608 194 -87
3125 -87 -302 -227 146 338 427 -94 -308 -229 -36 495 163 -129 -373 -210 235 517 422 273 -55 -113 90 644
3147 644 458 283 -338 -11 356 477 438 196 -144 -337 84 325 401 171 -145 -527 -92 236 189 80 -181
3168 -181 -354 -175 304 369 276 23 -49 23 153 485 456 60 -378 -19 130 563 380 63 -300 -129 104 504
3190 504 310 -19 -192 -137 36 310 397 -64 -299 -460 -136 201 582 24 -330 -185 123 504 532 187 -144
3211 -144 -214 -33 453 409 140 -155 -276 -29 177 362 -16 -312 -482 -274 319 231 28 -333 -352 -223 224
3232 224 303 378 -185 -316 -185 346 484 420 -15 -301 -198 253 458 248 0 -299 -271 31 371 401 94 -439
3254d39k2M82J54L0m43k77l2O25K13m3j77m67j72N67L96p7l40j87k02j6P65J10
3276D48l26k98J4j02L58K51k61l06k83M27J50J90j40l66m42L30M99%j79l54K1
3297c69R2M00J09k63P6l01j3L49L93j9m66j52Q0J34O16l17l12k16l02L95M13J9
3319C46l73k52o4L28J47J44l15k81n8j4M14M18l16n46M3K3M70L12j85l07k05j8
3341b89M89J28J2m00j98J29K67K19Qo88j47K00K66J85M7l64l90N2N45L17k29k74
3363a15k46j6J90N10j46L2n48L46j84N35o6k71l35RJ57L49o1M3l81j66K11K17
3385F4K19l04l40L9O1L30J28k63k82q6L55J52J02K8l21l57L13L70K05j75l93N2
3407a03P4j3K37K5p6m13J32M4L81j58q9l86R9Q6K74K6m17m3p7M05J32N1l07k15
$$ plain form
3254 -439 -461 21 175 205 -238 -515 -547 78 291 248 71 -396 -568 -1 395 318 -22 -209 -411 -427 338 448
3276 448 122 -176 -162 -264 94 345 84 -222 -505 -78 72 262 122 -244 -686 -356 143 143 -36 -390 -369
3297 -369 -277 123 232 -31 45 -256 -269 80 473 454 -12 -164 -84 50 666 349 37 -179 -481 -86 327 346
3319 346 -27 -279 -343 -15 132 276 -39 -320 -378 -392 22 440 124 -422 -379 -356 114 426 241 -66 -271 -289
3341 -289 200 328 340 -60 -258 -129 138 357 365 -323 -470 -270 -4 181 228 -136 -526 -474 71 388 159 -115
3363 -115 -361 -377 -187 323 177 209 -339 7 -177 358 292 21 -314 -305 -148 201 140 183 -198 -364 -153 64
3385 64 283 -21 -361 -322 -261 69 197 -66 -348 -434 -79 73 175 203 -118 -475 -162 208 413 238 -155 -103
3407 -103 -29 -42 195 220 144 -269 -137 -93 288 130 41 -345 -246 -160 114 140 -277 -320 -397 8 140 191 -116 -331
3431c31j1K51L56o5p3l01J7k0L05J61p6k92j86J56L14R1n3m20l26L59K14P2m9
3454I3m5l82R5L49m8j1k76k57K73R8L28j35q8k36K35J10nJ72l52N3j63K04J46
3477A58Jp7l61J8J98K12J02k69l31o7K19L22M5k25k15J03J72K34J25j22m45j8
3499b21K41J35K85l29j98j14N4K64J1J43n34k26L00L19O7j29k01k3k65L54J89
3520A22O5m19J26k46K43K44r7j25j57J52J36K49M6l09k89j28O62j19J18k83j61
3541a70j57L37K52l3k12l12Q7J4K55j0q9k54m9M9K83Q6n2k06j28J02L54j17O7
3564I7k86J5R6J38J70l4l32j00J91R3K13j40k46n6Q3Q0J31R2k76k37J4M03P4q0
3588A03j5m87K16J57J99K84n07J9j93J36N67l15l01K6J99j83J84J46l93j3k55
$$ plain form
3431 -331 -342 -91 265 200 127 -174 -157 -177 128 289 213 -79 -265 -109 205 296 243 -177 -503 -144 70 142 93
3454 93 48 -334 -239 110 62 51 -225 -482 -209 -111 217 82 -6 -242 -7 103 98 270 -82 -29 -192 12 158
3477 158 159 82 -279 -261 -63 149 251 -18 -349 -416 -197 125 170 -55 -270 -167 5 239 364 242 -203 -221
3499 -221 20 155 440 111 -87 -201 -147 117 128 271 -263 -489 -189 130 197 68 -133 -156 -421 -67 122
3520 122 187 -232 -106 -352 -109 135 38 -87 -244 -92 44 293 339 30 -259 -387 275 156 274 -9 -170
3541 -170 -327 10 262 229 17 -295 -208 -194 61 51 -38 -292 -341 -292 -9 77 25 -181 -309 -207 147 30 97
3564 97 -189 -174 -78 60 230 196 -136 -236 -45 48 261 121 -125 -181 -98 -18 113 205 -71 -308 -294 109 183 103
3588 103 88 -399 -183 -26 173 457 -50 -31 -224 -88 479 164 -137 -111 88 -95 89 235 -158 -171 -426
3609d26L61O0K44j35n50K67J42P8K11r0j51l69K15M79q9j18k63P0n4K23M21l17
3631B09k44j01%R1N08l75j08r2nL66k70M15m63l1k23K76L97j27k31k25RK14K35
3654B25K0j64l46J83J26J92P7l09k65K81m0K25K26j76k93l0RK81Q2j61l09J29
3676c7o9N6L02j10k57l31L31J52J34P4k55k23L5J48K48r5j25j44J03K05Q6J35
3698C63k1l78k13R1L61J8j45l3k34J78l7K43Q1m46nR2L46j73k7k08j68J02J90
3721b3L69r6k75j70K39J43j7J9k66NM4K70k0j45k9j03Q2P4P1j01m1j79J82J09
3745A42k5J1k08j14r7L26J19O7j97k37J1O0K61J15j61l43J32K24L43k50J1j43
3767D7k19K50K7J36m4k93j43J51K64L2j92k65N1mL35O2k31r4o6Q2j1K66J23j93
$$ plain form
3609 -426 -65 -5 239 104 -446 -179 -37 41 252 162 11 -358 -143 336 247 129 -134 -64 -118 105 526 209
3631 209 -35 -136 -136 -45 463 88 -20 -112 -117 249 -21 394 -69 -100 -323 -47 350 223 -8 -233 -224 -10 225
3654 225 245 81 -265 -82 44 236 313 4 -261 20 -20 205 431 255 -38 -68 -59 222 304 143 -166 -37
3676 -37 -106 -50 252 142 -115 -446 -115 37 171 245 -10 -233 -198 -50 198 103 -22 -166 -63 142 228 363
3698 363 342 -36 -249 -158 203 221 76 43 -191 -13 -50 193 274 -172 -177 -85 261 88 61 -147 -315 -213 -23
3721 -23 346 250 -25 -195 44 187 170 189 -77 -72 -28 242 222 77 48 -55 27 101 172 71 30 -149 33 142
3745 142 117 128 -80 -194 -291 35 154 221 24 -213 -202 -142 119 234 73 -270 -138 86 429 179 190 47
3767 47 -172 78 105 241 197 -96 -239 -88 176 208 16 -249 -198 -202 133 195 -36 -130 -196 -114 -125 141 264 71
3791G1m3O4L0K02k53p1k18J13K18R8j05k0l31J40N2J45K3k47O5q6K26J05j78l3
3815c3j81J84m3K70m7j27j54L2J7K63J90l77r5K3J66L27k15p6q2k32J92j18K14
3838I8P6k29O6j0J13j55J04k50O6N6j02L09O6k15j90L19j43M72k93k11k1q3L11
3861A54Q1q8r6k40P2J54K8J10k29k10J67J04Q7Q0l07%n4Q4J82J23k10j11j32K72
3885B1K33k7J3l10l7J25K66k18K78n10M4K08K4K15j33Qk99m7K7K55j70r4J59l8
3909gK43M0j71p2j41N2K27k9R7j42j83K31n1N8n0k93R7mJ10J41K9n6L5q7k32L73
3935B15r7K1j67q0K27L29l02k25o8O6J99K5K53l18k31O5R8J46J92k0j73k49J56
3958F2J80k3q9l84K14Pl1J91P6m97J72j9J56L4J84l13n8L92m22J81l3M1k51J11
$$ plain form
3791 71 28 92 122 324 71 0 -218 -105 113 211 106 86 -245 -105 -53 92 115 -132 -67 -153 73 178 0 -33
3815 -33 -214 -30 -73 197 150 23 -131 -99 -82 181 371 -6 -101 -78 88 415 200 124 42 -190 2 -116 98
3838 98 174 -55 11 1 114 -41 63 -187 -121 -65 -167 142 208 -7 -197 122 -21 451 158 -53 -74 -157 154
3861 154 235 147 51 -189 -117 37 65 175 -54 -264 -97 7 94 174 -133 -133 -187 -103 79 202 -8 -119 -251 21
3885 21 254 227 240 -70 -107 18 284 66 344 -166 -122 86 110 325 192 200 -99 -146 -119 136 -34 -128 31 -7
3909 -7 236 276 105 33 -108 -56 171 142 239 97 -86 145 94 152 102 -191 -94 -98 12 153 182 126 161 74 -158 215
3935 215 118 139 -28 -108 119 448 146 -79 -147 -81 118 143 396 78 -153 -88 10 156 348 328 155 -94 62
3958 62 242 219 130 -254 -40 -33 -64 127 203 -294 -122 -141 15 49 233 -80 -138 254 -168 13 -20 21 -230 -119
3982a19J53J76Q3j33l01m6N21L8j93j15j6l19J34M35j45k23j99J22P1K60j8n2
4004A14k11k15K53J73O8J4j41k49J04J87J39l57J19L2mm4J84j24j35m1J61l1K82
4027B78n8j90o5j06J99R4j52o1k55J59Q9L10l61J14k77J84Q9P4L05m90J76l53
4049b97K75M5J4o1L0m4L2J87j49R9j61rK6J81J27j26k37j68M3J58K00rl78Q3k4
4074a63Q0J77o2R6l23l0M68j74N4j67JN3J69j25P9j98j09J00M3K39k76j19r6L10
4098B7k40L58n8j16j5l8L0J25Q1o6l37J21J9K57O7k57m1r3J56P9J41j75mj31J6
4123i4L61j40j13K3j23O6k8L18k20k40l7K67j92K44p5j54P9QJ91R7j78k11J96
4146D5n5O6n1J33j33j31l4J31J37J49k46j66O0l6J52mr8m8K17l48L42K17n66J88
$$ plain form
3982 -119 34 210 293 160 -141 -187 334 372 179 64 48 -271 -137 298 153 -70 -269 -147 -76 184 166 114
4004 114 -97 -312 -59 114 182 196 55 -194 -90 97 236 -121 -2 30 26 -18 166 42 -93 -134 27 -4 278
4027 278 220 30 -35 -141 58 152 0 -61 -316 -157 -68 242 -119 -5 -282 -98 -9 65 370 -120 56 -297
4049 -297 -22 23 37 -24 6 -38 -6 181 32 131 -30 -39 -13 168 295 169 -68 -236 -193 -35 165 156 -222 -139 -163
4074 -163 -83 94 32 128 -195 -225 243 69 123 -44 -43 10 179 54 133 -65 -174 -74 -31 208 -68 -187 -283 27
4098 27 -213 145 87 -29 -44 -82 -52 73 154 88 -249 -128 -109 148 215 -42 -83 -176 -20 59 200 25 21 -110 -94
4123 -94 267 127 14 37 -86 -20 -48 270 50 -190 -227 40 -152 92 17 -137 -58 -50 141 238 60 -151 45
4146 45 -10 56 5 138 5 -126 -160 -29 108 257 11 -155 -95 -131 21 17 -81 -129 88 -260 82 299 -267 -79
4170g9j84Q6L35J0k50Q9j29O7J38j33J39j68J29q6K06L6j07P6k93j8M4J43R2j41
4194Bj86j5J99K16m4k39OJ53j60L02K1l00O8j92K58p9K43P0m57J73j6r9N7l4R5
4219D2k9K15J15j70k76M3J37r5J44n3L0l47j1K61j47J65l1O2k78J23J13K9J33
4242A75j63l83M03L1M4l7m8r2J28R6n8Q3l63k2J30R7Q7N1j71j27k98M40o3r8K13
4267E5l06J99J5P4k35K77Rm28L26N7M8Qj17Q8j72J71Q2l19K58l30L23o6N8p4o4
4292f3o3o4J50J88j25k1j46Q2J42K00l11K03l05O5J30m4K34j81j96J21J19j63
4314d8J30j7j80K%K73j32k1j33o4R8J15m9j08J32o6J65J12k46j4K1j66L08r1J85
4339B06l55J33k0K39j34J48j72O3j24M3J44O1j33l61M64k69P3J27r3K3j25m4K36
$$ plain form
4170 -79 -263 -177 158 168 -82 7 -122 -55 83 -50 89 -79 50 -36 170 206 99 175 -118 -136 -92 51 143 2
4194 2 -184 -199 0 216 172 -67 -61 92 -68 234 255 -45 23 -169 89 10 253 323 -134 39 23 -76 -19 -53 42
4219 42 13 228 343 173 -103 -60 77 -18 126 73 103 -244 -255 6 -141 24 -7 55 -223 -100 13 42 175
4242 175 12 -371 32 63 107 70 22 -70 58 154 96 179 -184 -206 -76 21 108 159 -12 -139 -437 3 -60 -158 55
4267 55 -251 -52 -37 37 -198 79 88 -340 -14 43 91 99 -18 70 -102 69 151 -168 90 -240 83 17 75 1 -63
4292 -63 -126 -190 -40 148 23 2 -144 -62 80 280 -31 172 -133 -68 62 18 252 71 -125 -4 115 -48
4314 -48 82 65 -115 -113 -113 160 28 7 -126 -190 -92 23 -26 -134 -2 -68 97 209 -37 -51 -30 -196 112 21 206
4339 206 -149 -16 -36 203 69 217 45 108 -16 27 171 232 99 -262 202 -67 6 133 40 63 -62 -106 130
4362A30j53j01k7K10j80J35J36l6j59p3Q3j54K28p2n2J77L2m72M04Q7k12P4j79
4385a74J63J05N5k97K1J28q0K40l7J6j82k76J36K04J4k1k50J31l3L17k52J00J10
4408A38k81J55O2r6R4j03j31P6J47p5M7k17qp7M06k22kJ13l14K4L77J86j87L2
4432A44j88J65j15J0J63j67L2k49K17J68j02p6l5j36Q0J07l3m8n3O6j71J77J96
4455A52j39q3p1J8J01K0M6l17K60k4Q3J12Q3o8j38N4j24J76k37Q0r0L2K14q8k3
4480B9k07J40Lj28L08k04r4p7J43K22p1r3j50P5k1O7J89j79Q1o4m3J37j35O8o6
4505g0lj44J26K35j61m4J61r9j37%J62q0J4K7N7o0K4P7k41N5M8J28j52J80q4O0
4531G9j44J72K3k46K58k46J18o6K3P1J67k97j7L2K12r2j05j67J43J17j61J06J74
$$ plain form
4362 130 -23 -124 -151 59 -121 14 150 114 -45 -118 -35 -189 39 -33 -85 92 124 -348 56 143 -69 5 -174
4385 -174 -11 94 149 -148 -127 1 -79 161 124 140 -42 -318 -182 22 36 15 -235 -104 -137 180 -72 28 138
4408 138 -143 12 74 -22 72 -31 -162 -86 61 -14 33 -184 -192 -269 137 -85 -87 26 -288 -264 113 299 112 144
4432 144 -44 121 6 16 179 12 44 -205 12 180 78 2 -33 -169 -89 18 -15 -63 -116 -50 -221 -44 152
4455 152 13 -70 -141 -123 -22 -2 44 -273 -13 -37 46 158 241 173 35 89 -35 141 -96 -16 -106 -74 140 52 29
4480 29 -178 -38 -35 -163 145 -59 -153 -230 -87 135 64 -29 -179 -104 -125 -58 131 -48 33 -31 -74 63 -72 -4 -70
4505 -70 -73 -217 -91 144 -17 -61 100 1 -136 -136 26 -54 -40 -13 44 -16 8 85 -156 -101 -53 75 -77 103 19 79
4531 79 -65 107 130 -116 142 -104 14 -52 -29 42 209 -88 -105 -73 139 47 -58 -225 -82 35 -126 -20 154
4554A54o0o1j47J81JM2j94N5n6Q5R0m0p3q7J32MQ6j1j5J0M2r5Q8K7o7j59l0J59
4582F1j22J34k61J52j3J06L7q0L1r5J8o5J48K71k63k25K33l6K52k50J46k32M9
4605drK0MJ92k33n4J07n2P1J15k34O5K0O4lk6j27R7Q2p1j4K1J8r7p6J94J27n6
4633A41k08j43J53L5J38j36J24l41M49j98q3K69l92J98L8r7J49j78J26n2r6P5
4655b9KR8j15k4J07P5j88J91K0k81J4J84j08j61J3K3J28P2j7j8j47J9K2J69R9
4680A48J93k26j95J0k3N8j07L05j28o4J03N5k5l21K82r9k4M4o7J58j60J2J7QJ05
4705E9m7m8j3%J03M9o1K2j75j6J7K07k42R3J7K5M9p0P0j93J61o0j2K23k7k88k0
4732a77K16n6J59N1j82P2q8o7N6J19J4j02o0J47j14L8m4RJ27k18R4P6K9m6JJ33
$$ plain form
4554 154 94 33 -114 67 68 110 -84 -29 -85 0 90 50 -23 -110 22 26 112 101 86 96 138 43 131 158 91 -68 -98 61
4582 61 -61 73 -188 -36 -49 57 94 14 45 -50 -32 -97 51 322 59 -166 67 31 283 33 179 -53 -4
4605 -4 -13 7 11 203 -30 -84 23 -29 42 157 -77 -12 8 72 69 43 -84 13 95 24 10 31 49 -48 -124 70 197 141
4633 141 -67 -210 -57 -22 116 -20 104 -237 212 14 -69 200 -192 6 44 -53 96 -82 44 -8 -104 -29
4655 -29 -27 71 -44 -68 39 114 -74 117 137 -144 -130 54 -54 -215 -202 -179 -51 21 4 -14 -161 -142 -120 49 148
4680 148 341 115 -80 -70 -93 -35 -142 163 35 -29 74 129 104 -217 65 -34 -58 -14 -81 77 -83 -71 -54 -46 59
4705 59 12 -36 -49 -49 54 103 42 64 -111 -127 -110 97 -145 -52 -35 -10 39 -31 39 -154 7 -53 -65 158 131 -157 -177
4732 -177 39 -17 142 193 11 83 -5 -72 -16 103 117 15 -45 102 -12 26 -18 -9 118 -100 -6 70 99 53 54 187
4758A87q4j22R1j09j29J1K28o6Q7k07Q3p7J33J48k01J32p2j59K41j91J63J72l89
4781a30N6L3J61N3q6j03pmK38l3j88N4m8q5MK41j3m3j15o7Q4R4p0q1l8J30oP9
4809A10n2j9j33K05r6M7R8k78J53pK3P1O5j9j67r2J1K16k68K00j31K4J36NQ6j28
4835F0j24Q9j47O1K35k13r1Mp2K95j88O4J14ol19L52j07J89j02q5j8l2J02J18
4859A79k63J7J77j65K84j67Np0k4j72K33l8j25L51l35Q6k0M5j09O4N9J22p2J4
4883G6n7j4k25L87o5p8j45J55O4p3J94j56j18J2qQ7K0M3p2j69J46j40R2k3M8k13
4909b32J25j2J56QJ15k67Q6J09q7J35k07r9K8P0L5N4JJ5k2N8M1K1j43j01m0J40
4935a3K5J9N7q2L3Q5L1j49p3J73j85q0K53j6j80j13M3K55J29j35M7j27j30n0J09
$$ plain form
4758 187 103 -19 72 -37 -166 -155 73 7 94 -113 -30 -107 26 174 -27 105 33 -126 115 -76 87 259 -130
4781 -130 -74 -41 120 173 87 -16 -23 -27 211 178 -10 44 -4 -89 -85 156 143 100 -15 -82 2 96 26 -55 -93 37 31 110
4809 110 58 39 -94 111 15 62 160 -118 35 28 51 122 187 168 1 -91 -80 136 -132 68 -63 -39 97 102 188 60
4835 60 -64 25 -122 -61 174 -39 -130 -126 -198 97 -91 -27 87 81 -238 114 7 196 94 9 -9 -41 61 179
4859 179 -84 -67 110 -55 229 62 67 -3 -27 -199 34 -4 -129 222 -113 -27 -47 -2 -111 -47 12 134 62 76
4883 76 19 5 -220 167 102 24 -121 34 98 25 219 63 -55 -43 -51 36 56 99 27 -142 4 -136 -44 -67 -19 -232
4909 -232 -107 -119 37 45 160 -107 -21 88 1 136 -71 -170 -142 -72 -37 17 18 33 11 69 110 131 -12 -113 -153 -13
4935 -13 12 31 88 6 39 124 155 6 -67 106 -79 -159 94 78 -102 -215 -172 83 212 77 124 -3 -133 -183 -74
4960g4J98j67J62j28k04K98j36P6P6k79l1O1J52J3P7k17J96m9j35J59j29q1J43
4983a9L4l8L10j71l17Q8J01j6r8J75j28o3J25J72q4k12L8L1O8RL5k05K84m4j10
5008c5j24J44L1J30j84j15J60Q9j5m9JO0j07j7J71k98k1K30ln3q0J55o2j17R4
5033a5pLM2J1j8p2K2K39k12L5k4r3J26q6M9Pk18K30qJ14j36J13O4n1j93L8J19
5060G9k68j1j8K26j1j4J40l23P8j4J78j07Q3j3O9j69J22RrP8j25n6N6n3o7J33
5086gK3mO9k4p7M7j38J63p7q7J58j00J5o5K34j86N4K3N3j59O6q5P6j0n5J20J27
5113A54j93P1L7R3j48o1m8K29j84q0J03o4J81j05m9K71j24j18J74j67J30j00j44
5136a42J83J2j4l9J9m3J51k60K14Ok22LM2P2j00R7l5JJ13J54j98J33j64N3j10
$$ plain form
4960 -74 124 -43 119 -9 -213 85 -51 25 101 -178 -209 -148 4 17 94 -123 73 24 -111 48 -81 -162 -19
4983 -19 15 -23 287 116 -201 -113 -12 -28 -126 49 -79 -142 -17 155 71 -141 -103 -72 -4 5 40 -165 119 75 -35
5008 -35 -159 -15 16 146 -38 -153 7 96 81 32 33 93 -14 -31 140 -158 -179 51 48 -5 -85 70 8 -109 -15
5033 -15 -22 -19 23 34 16 -56 -34 205 -7 28 4 -89 37 -49 0 7 -211 19 11 125 -11 102 166 115 -78 -40 79
5060 79 -189 -200 -218 8 -3 -17 123 -200 -122 -136 42 -65 18 5 74 -95 27 36 27 105 -20 -76 -20 -73 -140 -7
5086 -7 16 12 81 57 -20 27 -111 52 -25 -112 46 -54 -39 -104 130 -56 -2 21 74 -85 -19 -104 -28 -38 -93 27 154
5113 154 -39 32 69 162 14 -47 -95 134 -50 -130 -27 -91 90 -15 -64 207 83 -35 139 -28 102 2 -142
5136 -142 41 53 39 0 19 -24 127 -133 81 87 -135 -132 -90 -18 -118 -21 -56 -55 58 212 14 147 -17 36 -74
5161g4J19j90K96j87p0Q9j34J72Q1k34J70J9j34J19Q0j96LQ2n6J05j37J08r4L2
5185c1l4OJ20O2k53j20K52k5J09j38N7k97J88J47n0J50l9j82J47k31J56N4M0j6
5209G2J3j62O4PJ34k37J58j61J26R3j74ML1j7j38K86J34k97J34L9l1N2j40J63
5233A53k72j02L35o7q1J71l47M43k28Kj25K33j03l9k9k9K21j63p5L1J13O4o4k8
5257A4q3J16p4l1J78j19j15J14j21J42R4k24PJ45P4k7j6l1j19J81j44j12l6J45
5281d2J89j38J68j10K7n0k43J43K17m77M67n3j54r6Q4J05k65K65l8L9N3j67p1
5304a47K10j66J97j37O0K95l54N0j54k1K15j20K1o0J20p0K1Q1O3mj53j5q0J63
5328A5L02k93k7m6J08m3j18J45o6K03q5j65J69KQ1j47nJ17k96K20l30J46J83L5
$$ plain form
5161 -74 45 -145 151 -36 -106 -17 -151 21 102 -132 38 57 -77 42 122 -74 -71 11 -45 60 -77 31 -63 -31
5185 -31 -65 -59 61 123 -130 -250 2 -23 86 -52 5 -292 -104 43 -7 143 104 -78 69 -162 -6 48 88 72
5209 72 85 -77 -13 -6 128 -109 49 -112 14 107 -67 -63 -32 -49 -187 99 233 -64 70 109 78 130 -10 153
5233 153 -119 -221 114 47 -34 137 -210 233 5 7 -118 115 12 -27 -56 -85 136 -27 -102 -71 42 106 42 14
5257 14 -69 47 -27 -58 120 1 -114 0 -121 21 115 -109 -102 43 117 90 74 43 -76 105 -39 -151 -187 -42
5281 -42 147 9 177 67 94 44 -199 -56 161 -316 151 98 -56 -152 -68 37 -228 37 -1 38 91 -76 -147
5304 -147 63 -103 94 -43 17 312 -42 8 -146 -167 48 -72 -51 -111 9 -61 -40 41 104 100 -53 -68 -148 15
5328 15 317 24 -3 -49 59 16 -102 43 -23 180 95 -70 99 101 182 35 30 147 -149 71 -259 -113 70 105
5352A05J0p2q7K65k34O7J24k01K2q3J51m6q3N0O9j24Q5m9J15k5R5k64J08k6k8
5377e6j29K61o8N5j53J01j60P8J00Q2o0k04K67o2j49K14l5N4j60j3J05m5Q6qj24
5402b3m1j3j51M38k78Q5n5j8R9j83M5N1J70n8o0o6J02k16J02L30l4k86J41K7n6
5427E2J91k00%Rj41LN5M7q9O5Rkj35J75n6R6J35k94N3J80q8Mj62J4L30l9j34j14
5455c6O8j4M0P5np7L3L3j28k10K17N1K28k34k12K63k12K20m6L1k47K91j59kj29
5480a61L03k14J14Q0j74rK53j31O8l87L62l35L41j07P7j81N8K36k01L3j05J18
5502C8j09j6M9K7K4R1k59J08k1mj05J26mK4M4j57J31j45L7J67l03K84Q3k00J99
5527A09k28J22L2j46K80K5j97OP4no9L9O8k3j89K19O9j94p5R6j52K47q7j52K11
$$ plain form
5352 105 115 43 -44 221 -13 54 178 -23 -1 -84 67 21 -62 -12 57 -67 18 -31 84 59 154 -110 -2 -28 -56
5377 -56 -185 76 8 63 -90 11 -149 -71 29 111 51 -153 114 52 -97 117 82 136 -24 -37 68 23 109 101 -23
5402 -23 -64 -77 -228 210 -68 17 -38 -56 43 -140 -95 -44 126 68 8 -58 44 -172 -70 260 226 -60 81 108 52
5427 52 243 43 43 52 -89 -86 -31 16 -73 -8 1 -1 -136 39 -17 79 214 -80 -27 153 65 69 -93 -79 251 212 78 -36
5455 -36 32 18 58 133 128 51 84 117 -11 -221 -4 47 275 41 -171 92 -120 100 54 85 -162 129 -30 -32 -161
5480 -161 142 -72 42 122 -52 -61 192 61 129 -258 104 -231 110 3 80 -101 -43 193 -8 25 -80 38
5502 38 -71 -87 -38 -11 13 104 -155 -47 -68 -72 -177 -51 -55 -31 13 -144 -13 -158 -121 46 -257 27 110 -90 109
5527 109 -119 3 35 -111 169 194 -3 3 77 72 3 42 110 87 -102 117 186 -8 -83 13 -139 108 21 -131 80
5552H0j27J74k4j89Q1N4r7P8l0r3QJ51k26K35j95K28J17k27Q7j75j7pJ27m2o4
5577i3M9L6Q2o0K4L4M2o3k4pn8K11q1l9O7j69K36k9j34q9k8P1j51k6J90kJ75j67
5605cK63m24K32j76L20l64R1J04j64L8MP4j33K04j29O0r7K4k7K9J48k09J59k6
5629bm9J56j34k5J17k8j41J71j28k1M5lJ10J2j14N9M7L8r5q0P1O7q6j10R7j04
5655a30P6M2J80k78P2O9l6L5R4j00Q4q2Pj21J72J33j35r8R7j30J61k02J41%J22
5680A73j27l4N8oRj63J38J29j78J14j15J60j4j91JK09Q9k68m4J6J12j35J56p7
5704A2J69q1o6j06J9K12jj20k5k0J0J65j71j46K17j42m7J40j2J30k47J81j77l1
5728a37K47j51K55k81J08l4M8k7j12R2r2J61j81J44M3k21K47p7m2l0Q3j68K06
$$ plain form
5552 80 -47 127 103 -86 -5 49 -48 30 0 -93 -85 66 -160 75 -120 108 225 -2 85 -90 -107 -114 13 -29 -93
5577 -93 -44 -8 74 14 38 72 114 51 27 20 -38 173 92 53 120 -49 187 158 24 -65 -93 -22 -173 -199 -9 -11 164 -3
5605 -3 260 -164 68 -108 212 -152 -61 43 -121 -83 -79 -5 -138 66 -63 -3 -100 -76 -103 -74 74 -135 24 -2
5629 -2 -51 105 -29 -54 63 35 -106 65 -63 -84 -39 -42 68 80 -34 25 72 110 15 -65 6 73 -13 -123 -26 -130
5655 -130 -54 -12 168 -110 -38 31 -5 30 124 24 108 26 33 -88 84 217 82 -16 81 -49 112 -90 51 51 173
5680 173 46 12 70 64 73 -90 48 177 -1 113 -2 158 144 -47 -46 163 252 -16 -60 -44 68 -67 89 12
5704 12 181 100 34 -72 -53 159 158 38 13 -7 3 168 -3 -149 68 -74 -121 19 7 137 -110 71 -106 -137
5728 -137 110 -41 214 -67 41 7 55 28 -84 8 -84 77 -104 40 83 -138 109 32 -10 -40 43 -125 81
5751H1n4r9J1O0mm6J21j01kJ87j88L3R8j63k0J75o3m6j5J53j97PM0KL5%J23j51
5779b3l7m1N5J15n2n7J53k02L53l48R8k0L9j50N6P0k56L24J52j80k31J01M7Kj0
5804d2J50l1j12j17K40j09J4J41j74J09j44J30j6j05J98k54k3J77kJ13n4j51Q7
5827B5p2J70o8q5j04P1R2j24K83k60j1J77j79Mo2K07j72M3m4K6J02k2%m4J63j38
5853b2O7p3n3J50R9r6l5j16R2Q3Mk25K67j84K1j66K76j59J99k20R0k9j21Q4J59
5878I2N7K5k81K47l39L46k06M8j21J18m5J8J57k67K68j32K7l14K90j2N7l1J08
5901A10k34J18j15K32k8j54J56r9OPR3l5j28J45j64J92n7q5n9K33j97L1Q8Jk02
5926a45K20o4j06J01p3L10k00pKo9l7J39J25p9k78K66r7j34J05J5l1L36k47J7
$$ plain form
5751 81 27 -72 -61 -1 -5 -51 70 -31 -33 154 -34 -1 97 -66 -86 89 26 -20 -35 118 -79 -72 -32 -30 5 5 128 -23
5779 -23 -60 -101 -46 69 17 -40 113 -89 264 -84 14 -6 33 -117 -61 9 -247 77 229 49 -182 -81 -34 -32 -42
5804 -42 108 77 -35 -152 88 -21 -7 134 -40 69 -75 55 39 -66 132 -122 -145 32 30 143 89 -62 25
5827 25 -47 123 55 -30 -134 -63 29 -95 188 -72 -83 94 -85 -81 -143 64 -108 -65 -109 -83 19 -3 -3 -47 116 -22
5853 -22 45 -28 -81 69 168 72 37 -79 13 96 100 -125 142 -42 -21 -187 89 -70 129 -91 -1 -30 -151 -67 92
5878 92 149 174 -107 140 -199 147 -59 -11 -132 -14 -59 -41 116 -151 117 -15 12 -302 -12 -24 33 2 110
5901 110 -124 -6 -121 111 83 -71 85 -14 -8 -1 92 57 -71 74 -90 102 45 -40 -99 134 -63 -32 56 57 -145
5926 -145 75 11 -95 6 -67 243 43 36 38 -31 -68 71 196 117 -161 105 8 -126 -21 -6 -37 299 52 69
5950F9p3J58k75n0R1K5M1rLl5R4j23Q4R2j21O6n6N5Q8j32q5J21k02Q0o8J98j05
5977f9J82k08K60j55k30K68o6Q5p1J12q1j38J00j1J45r4j13O7l3N9j17J44l6q1
6001h1J18nj16J4J47J36k84L62k41M6j26R1r0K4J12q8O4J2j98Q3q8J42J1j67K59
6026A37j06q3l7M3O1j31R9mJ38j33j92J58J73%J4r0j38N0j4O9P9J7p3L8M9k12
6052h8K02j73L1m5M6j43j2K79k03j3L24m7j48r3J23j40Q4j87K10j5l6M5P3nJ35
6077B04k75R3r0j57J62j04K95j17Jj89J26K5J48k34J53o6J20k07M6O5mQ8%j97
6101a14R1Q8l9R8p1j44J74j88L6n3J0L63k41n5p0J22k16J59R9l8j73j42K64J45
6125A05j53K47m13K22P5j70J3j7K9k2J18n8P3P2J9j16j94NJ76r8l9l5J17K30j75
$$ plain form
5950 69 -4 154 -121 -171 -80 -55 -14 -23 -20 -55 39 -84 0 92 -29 37 -19 36 124 -8 -93 28 -174 -94 -162 36 -69
5977 -69 113 -95 165 10 -220 48 -18 67 -4 108 27 -111 -11 -22 123 29 -84 -17 -50 9 -108 36 0 -81
6001 -81 37 32 -84 -70 77 213 -71 291 50 96 -30 61 -29 -5 107 19 83 95 -103 -20 -108 34 45 -122 137
6026 137 31 -52 -89 -46 15 -116 -17 -21 117 -16 -208 -50 123 123 137 47 -91 -41 -55 14 93 110 37 75 124 -88
6052 -88 114 -59 -28 -73 -27 -170 -182 97 -106 -119 205 158 10 -83 40 -100 -16 -203 7 -8 -44 1 74 69 204
6077 204 -71 22 -68 -225 -63 -167 128 11 12 -177 -51 -26 122 -112 41 -25 95 -112 -66 -1 -5 83 83 -114
6101 -114 -23 65 26 124 53 -91 83 -105 -69 -122 -112 251 10 -45 -115 7 -209 -50 49 11 -162 -304 -40 105
6125 105 -48 199 -214 8 83 -87 -74 -91 -62 -84 34 -24 49 121 140 24 -170 -165 11 -87 -126 -161 -44 186 11
6150A1MK4J33k85K7J18l1j48J25L2j36K1J69l3k22K72m0oq7p5k7J2J86j97K42
6175H9j94J69L9j58J35p6l7R3m7m6R7l2Qj5r1M7m3M4J74k15J0j69K21Ok2k19J43
6202h9K5N1J51j46j9N7J08j98K34k44l3J34j%M7j7r8r4L15k96K67J10k41j40K38
6227A21j84j8R5O7j14P7j63J53J83k52N5O7j20j3j19O5L22l41J23j43O0J17j04
6250f6J87qj95J08k98K04J12n1j70K21j14J02n0J17J2M4K2L8j51Po7j71J30Q9
6274E2j05Q4J29M3q0j10j5qK23l07K08j87%j4K43j78o0J03L4J41k0k91O9J66j52
6299c2N4k07L38j48q1K4J30j79J00K3j92K95k21P5n3O9J48k29k2N5J64l5j58P2
6323a0n0J54l7k10P5K05j70M5q7J23j92J60p7k8K24j50kPj61K75j16N0L9n9j19
$$ plain form
6150 11 15 39 172 -113 -86 32 1 -147 -22 10 -126 -105 64 31 -191 81 41 35 -52 -127 -154 -142 44 -153 89
6175 89 -105 64 103 -55 80 4 -33 60 13 -33 64 32 40 25 -66 -19 -62 -18 156 -59 -49 -218 3 9 -13 -232 -89
6202 -89 -64 -13 138 -8 -27 30 138 -60 174 -70 -103 31 30 30 77 60 -38 -132 183 -113 154 264 23 -117 121
6227 121 -63 -81 14 81 -33 44 -119 34 217 -35 20 87 -33 -46 -165 -100 222 -119 4 -139 -79 38 -66
6250 -66 121 113 -82 26 -272 -68 44 -7 -177 44 -70 32 -18 99 111 155 177 215 64 71 4 -167 -37 52
6274 52 -53 31 160 203 123 13 -2 -10 213 -94 114 -73 -73 -87 156 -22 -82 21 55 196 176 -115 -46 120 -32
6299 -32 22 -185 153 5 -76 -52 78 -101 -1 22 -170 125 -96 -21 -74 -5 143 -86 -108 -53 111 76 -82 -10
6323 -10 -60 94 57 -153 -78 127 -43 2 -85 38 -154 6 -71 -99 125 -25 -27 -20 -181 94 -22 28 67 8 -111
6348a11Q8N2o5L5n5J86p1p3L11l35k0N0J81k4j25n5o3J9J11k8O4p9M2j63J23k1
6374b6p0Q4q7K07k57K70p3J92j92l2j29n1Q3q4j7L27j08j48J80M1n7j06o9J22
6398@J54j89n0J71l52K33j38O1M6J54j62P9l0j11J96J15K0j30q0K30k75O6L0j37
6422i9J06N9m6ok1k07K24K8o6K8J7n1o3N0J69M5j91k2L3o7l6j12K19J68k71J70
6448E8ML4j15N4o4n0J38K7k01J11j23M20l41M6J71j86M4l4j2p0O1J13j85K43j56
6473a3j56M6O3J21o9K82j47l48J10n4K31K35l46j8J42j59n6K1R3R8Q4q7m5j6N6
6498F8K00k90K9J14n8L6qp1J10j72J04p0N4J01l6j30O2K3O9j68J00o3K00k12J42
6523A34l23M31k78OK1r7O5L9nM3poK1M4r9j28J44j17J17jq6j05K00N6j12M3k9
$$ plain form
6348 -111 -23 29 -36 -1 -56 130 59 -14 297 -38 -58 -8 173 149 24 -31 -94 -75 36 8 72 -7 35 -128 -5 -26
6374 -26 -96 -12 -99 108 -149 121 48 240 48 16 -113 -164 -81 -165 -182 145 37 -111 69 110 53 -53 -122 0
6398 0 154 -35 -85 86 -266 -33 -171 -110 -64 90 -72 7 -23 -134 62 177 197 67 -13 217 -58 8 38 -99
6422 -99 7 66 20 14 -7 -214 10 38 -28 0 17 -34 -97 -47 122 167 -24 -46 -13 -80 -116 -228 -9 159 -112 58
6448 58 62 96 -19 35 -29 -79 59 86 -115 -4 -127 293 -48 -2 169 -17 27 -7 -19 -89 -28 85 -100 143 -13
6473 -13 -169 -123 -60 61 -8 274 127 -221 -111 -165 66 301 -45 -63 79 -80 -136 -115 -22 76 160 73 28 12 68
6498 68 268 -22 7 121 63 99 91 20 130 -42 62 -8 46 147 111 -19 43 66 135 -33 67 4 204 -8 134
6523 134 -189 242 -36 -30 -9 -106 -41 -2 -7 36 29 23 44 88 -11 -139 5 -112 5 4 -82 -187 13 69 -43 0 -29
6550b9o6J08r9R6n3J54J21k22j12K07n5k2j40O4K12J2k51J33J24j18j12K3J69
6573A44j34J07N5o7j41N7J1q7j68K36j05j8Q6J98j51j07J98j32K01l38J63O1j03
6596c4N2P5j03N3K1j20J12j98Q2N8r5J30L7j37OM9k7J17j66L04k63J81j47l4Q3
6621C6j78L23j68J46l40L40M8p2o9Q5k18Q8M6J2m4K38k74O0p5J01q3J21q5n7p9
6646i8J80j28qJ14k37K28L8j10j2R3O0k09J38R6j67MJ0l5J18o7p4l7J3J60j07
6671c7p2J2N8O5k45K54j33K23o6J9r0k3J38j92O0M6r1Q9Kp0L2o6j6J80j00N3q0
6698e0K06k13J35k59K54m6K6k43K20K1Q5j90Mk5jJ20l8K6q1J27k42K75q1P8l6
6723G2m4j21K8J34l0o5m8J63p4k75K12J0J95k23J99j56M0j68J92J50j65q5R5L9
$$ plain form
6550 -29 -95 13 -86 10 -43 111 232 10 -102 105 50 28 -112 -48 164 176 -75 58 182 64 -48 -25 144
6573 144 10 117 172 105 -36 21 32 -55 -223 13 -92 -110 -24 174 23 -84 114 -18 183 -155 8 69 -34
6596 -34 18 93 -10 43 64 -56 56 -142 -60 -2 -97 33 70 -67 -61 -12 -39 78 -88 216 -47 134 -13 -47 36
6621 36 -142 181 13 159 -181 159 207 135 66 151 -67 21 67 79 35 273 -1 59 -16 85 2 123 38 -19 -98
6646 -98 82 -46 -54 60 -177 51 89 -21 -33 60 120 -89 49 145 -22 -18 -8 -43 75 8 -66 -103 -90 70 -37
6671 -37 -109 -97 -39 26 -219 35 -98 125 59 78 -12 -35 103 -89 -29 17 -74 15 17 -53 -21 -87 -103 77 -23 30 -50
6698 -50 156 -57 78 -181 73 27 53 -190 30 51 136 -54 -50 -75 -76 44 6 32 -49 78 -164 111 30 108 72
6723 72 28 -93 -65 69 39 -26 -74 89 15 -260 -48 -38 157 -66 133 -23 17 -151 41 191 26 -59 36 75
6747G5q9q4J37m7P5k47L11l23L09L1j88O6Pr5k3N2J28l23K59l2k3J65r9P0k48
6772a36Q5J02nj48K8O6R2j15J59k18J44p2O9j71Q9J40j78Q9o8o7J54K9j27N1L04
6797B96k73k20L18k38J15j93K56j45J49qm5m5J15j00J4k9J35O1r7J79k00j29M08
6820C24k30q2lm4K04k04Q8r3K03j70K01j51n4J78m3j13N6P5j09j08J34j36m0K26
6844A09k1j08J66k11j1J46j45J35o6N0r5L06l89J04O3J04J3k04l8J6J31j32N3
6867b4j12L62p7j50K01j24m5j17M0J6M7Nl2K01j36m7j27kK1J41j80R7K7q8J70
6892F7l7Q4Jj62J10N4q3k26K82j91K56l67L06q6j87K68K5P5l89J65N2j26N3J6
6916d0J1L7q9O5j02N0N1K1Q2J38j02j70J6J07j68k1K96l93M1K33jj05J17k1K25
$$ plain form
6747 75 -14 -98 39 -8 67 -180 131 -192 117 148 -40 26 33 -62 -85 -33 95 -228 31 -1 -24 141 42 112 -136
6772 -136 -51 51 46 -102 -74 -8 84 -31 128 -90 54 -18 51 -120 -31 109 -69 20 -48 -115 39 68 -59 -8 296
6797 296 23 -197 121 -117 -2 -195 61 -84 65 57 12 -33 82 -18 -4 -33 102 163 66 245 45 -84 324
6820 324 94 12 9 -35 169 -35 53 -40 163 -7 194 43 -11 167 124 11 67 142 33 -75 59 -77 -117 109
6844 109 88 -20 146 -65 -76 70 -75 60 -6 44 -51 255 -134 -30 33 137 150 -54 -92 -76 55 -77 -24
6867 -24 -136 226 149 -1 200 76 31 -86 -46 -30 17 22 -10 191 55 8 -119 -121 -100 41 -139 -42 -15 -103 67
6892 67 30 114 115 -47 63 117 34 -192 90 -101 155 -212 94 8 -179 89 114 189 -200 -35 17 -109 -56 -40
6916 -40 -29 8 -81 -16 -118 -68 -17 4 86 224 122 -48 -32 75 -93 -114 182 -211 -170 63 62 -43 74 53 278
6941B78l48J30n3J07Kj30l5J12n3q7j24J27Q2J12j03K16j74k35J61qjN8k75K44
6965CJ81k36j5J50j31J87k51p4M22k63l1J47r1o8P9M2j33rRQ6L5l8p8L9K21k00
6991a7q4J84q6O9j80j6Q5l9P4m2N2ljj15J85m7K04k68o5j0K73j84J5l1k7j22J57
7018c9J22j28K7n5j0r0J7J22NO9j13J70j15O6r6N8N2j25K13r3j56P5o1J91j32
7043b6j05K8j3K36j88J85j37j55J36j32J93q5N2l2m1J61k43K81L8j73L3m2n9Q2
7067fo6J3m6pJ7K74k65J10rO5j86l3J48R5j36K0J73q6j35L6k03K22O2R4j04j71
7093a24QN1j33M32k96J06J59j99n7n6R9J9k3l8p9J63O9n8j37J00j3L6O2j05m3
7118e7N0J29j17M4J2j24L33k59j35m8J04K1n8M3J11K5q2n1J08j80KJ74m9J25j28
$$ plain form
6941 278 -70 60 7 114 116 -14 -49 63 10 -77 -201 -74 8 120 17 233 59 -176 -15 -23 -24 34 -241 3
6965 3 184 -52 -67 83 -48 139 -112 -186 236 -27 -58 89 -2 -70 9 51 -82 -91 -82 4 39 1 -77 -38 183 -17
6991 -17 -101 83 -3 66 -114 -130 -45 -84 -10 -52 0 -3 -4 -119 66 19 223 -45 -110 -120 153 -31 -16 -47 -74 -196 -39
7018 -39 83 -45 -18 -73 -83 -173 -156 -34 -29 40 -73 97 -18 48 -48 10 62 -63 150 57 -99 -24 -85 106 -26
7043 -26 -131 -103 -116 120 -68 117 -20 -175 -39 -171 22 -63 -11 -43 -84 77 -166 115 153 -20 13 -29 -88 -6
7067 -6 -72 -59 -105 -112 -95 179 -86 24 15 80 -106 -139 9 104 -32 -12 161 75 -60 -24 -227 -5 57 151 47 -124
7093 -124 -116 -65 -198 234 -62 44 203 4 -53 -109 -10 9 -14 -52 -131 32 101 43 -94 6 -7 29 91 -14 -57
7118 -57 -7 122 5 49 61 -63 270 11 -124 -172 -68 -47 -105 -62 49 74 -8 -59 49 -131 -129 45 -4 121 -7
7143gp5k01J97J02jo5o1K51l13NK89j31k7O3rO0%j12j46K14NK2J0p6P7%o1J9m1
7172a2j39K69J8j67p3J36j07J43J0j32L7k8l3Q3r2N1j82J67M9J34p8K11j00k54
7196h9O1K46l44J75Rj0j31K19l2k07K55k97Q7j68J77N5J36k36J05p2N6p3R4O4
7220H0j45q3K40k05J02Q8q5NQ0p4R0n3r4J01j53J05J88j30j72P3J81m9O8k54K44
7245A48j86J60m4j81L94k84J1n7M8r4J09J0j02k2R6O4M5j14J20m4o0K4J2J30k33
7270e0l7K56j22PJ6k2M7L2j50nJ5o7J24j49O1J6K3N6j11RP9J10q7q5J23j58M4
7297b5J42j76L7J26M7j73M2mj58J16J26o2L9j7p5K3n7MO6J11j25j3j7p2J98o5
7323C8j97K19o0J42o7j70nK5Q1k7l2N7J69k17j07J78Mj03J3J11KJ7j11J54j55
$$ plain form
7143 -7 -82 -283 -86 16 15 -50 -111 140 -173 -168 121 -10 -37 26 17 77 77 -35 -181 33 38 60 70 -6 71 71 10 29 -12
7172 -12 -151 118 136 -31 -104 32 -75 68 78 -54 -17 -45 -78 5 -87 -36 -218 -51 -2 132 54 265 165 -89
7196 -89 -28 218 -126 49 58 48 -83 136 104 -103 152 -145 -58 -226 -49 6 142 -94 11 -61 -5 -78 16 80
7220 80 -65 -148 92 -113 -11 77 -8 -3 77 3 93 40 -54 47 -106 -1 187 57 -115 -42 139 90 158 -96 148
7245 148 -38 122 78 -103 291 7 18 -39 9 -85 24 34 -68 -90 6 70 115 1 121 77 17 41 53 183 -50
7270 -50 -87 169 47 54 70 48 95 127 -23 -28 -13 -80 44 -105 -44 -28 -5 51 -60 -51 28 138 51 -34 89 -69 -25
7297 -25 117 -59 -22 104 151 -22 20 16 -142 -26 100 38 77 60 -15 8 -49 -45 21 132 7 -6 -23 -95 103 38
7323 38 -159 60 0 142 75 -95 -100 -75 6 -21 -53 4 173 -44 -151 27 31 -72 -59 52 54 71 -40 114 -41
7348d1J66j92J23j90J56k1K1q1k47L70N7j30O8j47L7o2k4J08K2J70k48j3J88k2
7372F8m6J72k36N6JM0j81j7J63J3k22M37l41R9J63l9j06j40J1J06N0j40J61j50
7396g8J67p9L3q0M5L3K6l5K0o1k6L4l4j44P5J3O0O1p0p6l5J42n3L1j49J93O5l8
7424D0j52K00n6lJ16j41R2M5k11K11k17o9P3j84K63k29J86q1J66k7K5J42k4L5
7448B00O0l04P2pm0k0K8QJ97j67R0o9j83L00k6k54K54j80K57k26j66R9JK24n3
7473I5j08l5J02k0O7r9J26p9J4P1m7mj23P4L5o1N5k63J88r5L05p2K4q1L8J34m11
7500a70J53om6m9J44k9qj9k24M85l11J39k2j7l2J70j97k7R8k0q4J1k0J45K4j67
7526g9J15K5M4j59O1j0P7l6m0j8Jj73Q0R6K9j2o5q3J96k9J45j96n4r5J72l7k02
$$ plain form
7348 -41 125 -67 56 -134 22 1 22 -59 -306 64 121 -9 59 -88 -51 -113 -137 -29 -7 163 -85 -98 90 68
7372 68 22 194 -42 14 15 55 -126 -143 20 33 -189 248 -93 6 169 130 24 -116 -105 1 51 -89 72 -78
7396 -78 89 10 43 -37 8 41 67 32 52 -9 -35 -1 -35 -179 -104 -91 -31 30 -40 -116 -151 -9 -62 -31 -180 13 78 40
7424 40 -112 88 32 29 145 4 96 141 -70 141 -76 -145 -72 -256 7 -222 -36 -117 49 22 47 189 165 200
7448 200 260 -44 28 21 -19 -39 -11 -3 194 27 117 48 -135 165 139 -115 139 -41 216 -10 -176 -77 -76 148 95
7473 95 -13 -48 54 34 101 2 128 49 63 134 87 83 -40 34 69 8 63 -200 -12 -107 198 126 150 69 107 241 -170
7500 -170 -17 -23 -69 -118 26 -3 -11 -30 -254 231 -80 59 37 20 -12 158 -39 -66 32 12 -72 -61 -81 64 88 -79
7526 -79 36 61 105 -54 7 -3 74 38 -2 -20 -19 -192 -112 -16 13 1 -64 -147 49 20 165 -31 -85 -180 -8 -45 -247
7553b47K09J38P4j26j8j35K49r3o6J2k8j14R6J46j42K9J34j61N0J34j57j5j31
7576a62J58l2O9K49k54rj83J98Q7j2k75J35J12n3j27O8J41j09J28k11J51j14n8
7599a03L44k55n1K44l48PJ09o7J84o8K9j91J69Pj16L11q4q6k2J82m8k31q7NK02
7624C6kL7J45j93p8J06L8k34K39p3j1j39N0Kl6P3Q5O2j88O9K81k53N0m6j44J88
7650F4J4j71n6jK49j32j11J58J30k2Rq5j03l6L1K17ol23J32m1N2P7P5j68J71j28
7676dJ09j99jK0J27J36k52Q0J13k68m4M41j17n8j15O7J23p4k00J74k7qK7K7j78
7701a01J79j34j01J61j73K76j53J05J03j95L8J31j71N0M3m8J4j4m6L1l6n5J23
7724B7Q4k72L37j03j0K0J6j99J29j26J31O3m3L2k17L6On0K08j42J02Q4O4l98K49
$$ plain form
7553 -247 -38 100 174 48 30 -105 144 51 -15 -3 -31 -145 -49 97 -45 -16 118 -43 7 141 -16 -31 -162
7576 -162 -4 -36 33 282 28 19 -164 34 121 109 -166 -31 81 28 -99 -31 110 1 129 -82 69 -45 -103
7599 -103 241 -14 -65 179 -169 -162 -53 -120 64 -4 25 -166 3 10 -106 205 121 35 13 195 147 -84 -171 -166 36
7624 36 34 71 216 23 -55 51 89 -145 94 21 10 -129 -79 -77 -113 -40 45 107 -81 -12 269 16 66 20 -124 64
7650 64 78 -93 -149 -150 99 -33 -144 14 144 122 131 46 -57 -93 -62 155 149 -174 -42 -83 -31 46 121 -47 124 -4
7676 -4 105 -94 -95 -75 52 188 -64 16 129 -139 -183 258 141 83 -32 35 158 84 -116 58 31 23 50 77 -101
7701 -101 78 -56 -157 4 -169 107 -46 59 162 -33 5 136 -35 15 58 10 24 10 -36 -5 -41 -96 27
7724 27 111 -161 176 73 63 83 99 -100 29 -97 34 97 54 86 -131 -95 -89 -139 69 -73 29 113 177 -221 28
7749B8n0Ol7pJ45j22L6J10M6j68k9L4J54k24J1P3j5L6r0K6K22k35m1L31k28L6
7775D8n6R5l7n3J30o3q9Q5j47K23j04J28j08L9j36j93K37L11m17P9J66j35j75
7798a72J13J10k90K09j08J73O6j16J73j29m7L8L9O0j91P0n5Q0Jpkk49K29J0j89
7823a84J44N1J52L3k18K28l63J58L0q5J45j8J07j49K8j35J43Q9j93l5l6J45k3
7846A4j5j42K06j76Q3k40K70L7j99L07O7k25j39K09j54Q3J12O6k83K63k11Q8n
7869A6Q8J36l61N3q0K31j32Kj3J39N6j22j15L05j73mj61K13j3Qk48J68q5J02P7
7894H7n6N0j58J06j2K1j4K2j17J64k05L09k73M0J30k24K3J7N5L7O8m9J9j19K70
7919A91k35M4K2J56j68j36J33q6J11j32Q7o5l1MJ89M9m12J78J22r2R0j78J06o2
$$ plain form
7749 28 -22 -16 -53 -60 85 -37 -1 109 155 -13 -42 -8 146 -78 -67 6 -9 27 -63 -37 185 -50 -91 240 12 48
7775 48 -8 87 50 -3 127 64 -25 60 -87 136 32 160 52 91 -45 -238 -1 310 -107 -28 138 3 -172
7798 -172 -59 51 -239 -30 -138 35 101 -15 158 29 -18 20 59 119 -72 -2 -57 23 24 17 15 -234 -5 5 -184
7823 -184 -40 11 163 196 -22 206 -157 1 31 -54 91 73 180 31 59 -76 67 156 -37 -72 -108 37 14
7846 14 -1 -143 63 -113 -30 -270 0 37 -162 145 212 -13 -152 57 -97 -14 98 164 -119 144 -67 21 16
7869 16 104 240 -121 -68 -148 83 -49 -47 -60 79 135 13 -102 203 30 26 -135 78 65 73 -175 -7 -92 10 87
7894 87 31 81 -77 29 17 38 24 46 -71 93 -112 197 -76 -36 94 -130 -107 -90 -35 2 70 21 40 -79 191
7919 191 -44 0 22 178 10 -126 7 -79 32 -100 -13 -78 -109 -105 84 133 -279 -101 21 -71 19 -159 -53 -115
7943a15J00J2O5P2N9j85o1k2K01k65K31j95%Oj3J15r0J62k83L18k44K15k00P3
7967d4K25l22M12l33o3M9O3r7J3P3M7j03N3j8J72k08J21l8m1l3J2J6J2qk9R1j71
7994a49N5N3J47j83mOJ35k5Qj89K04m0j7o1J12l0o1N7R7j43L5K20j33j37J1L5
8020Cr0m5J94j21j84L81J0k44k4J67j35J5K94j85j61J44j64J13QQ0l0N2k2o8J48
8045A36j76LN0j46K05q5N2Lj2l6o5o8J72j57j4N1P4n0L9N7k26K50l2M0l35L24
8071E4k09J29J89j82r6K4L07k22N5k09J03k0q6p9K63%j00RJ66j95J27N8q3mM9
8096D8O9j37p7r8J96p5j36K53%J30j21K5r1J35K9j34n6J1J58k56J15P8j05P1j06
8121g4R0J1pj29r6J53J29j75M4K4Q2o3J37j61k25J30P3k6n1N0k8L12k79L4J61
$$ plain form
7943 -115 -15 -3 62 134 193 8 -53 -75 126 -139 92 -103 -103 -97 -110 5 -85 77 -206 112 -132 83 -117 -44
7967 -44 181 -141 271 -62 -125 -76 -13 -110 -97 -24 23 -80 -27 -45 127 -81 40 2 -39 -72 -60 -44 -32 -40 -69 22 -149
7994 -149 -94 -41 106 -77 -81 -75 60 35 43 -146 58 18 1 -60 52 22 -39 18 115 -28 7 227 94 -43 -32 3
8020 3 -87 -132 62 -59 -243 138 148 -96 -120 47 -88 -73 221 36 -125 19 -145 -32 -24 56 26 78 56 -12 136
8045 136 -40 -37 13 -133 72 -13 39 42 30 -6 -71 -139 33 -124 -138 -87 -13 -63 -24 33 -193 57 25 65 -270 54
8071 54 -155 -26 163 -19 -115 -91 216 -6 49 -160 -57 -77 -163 -242 21 21 -79 -70 96 -99 28 86 3 -1 48
8096 48 117 -20 -97 -195 1 -74 -210 43 43 173 52 77 -14 121 150 16 -40 -29 129 -127 -12 66 -39 32 -74
8121 -74 16 27 20 -109 -205 -52 77 -98 -54 -30 52 -11 126 -35 -260 -130 -57 -83 -134 -84 -112 200 -79 -45 116
8146A16j70J1K7q2J20J21k17r7J85rJ8O9m3P0j54j56K47j65J62j63K7l4J61r7
8170e3M8K0o6J15R6k00J34j59J3J89k06P5K5J33p3J22m26M65j91k37K41
$$ plain form
8146 116 -54 -43 -16 -98 22 143 -74 -171 14 5 23 92 49 119 -35 -191 56 -109 53 -110 -83 -117 44 -53
8170 -53 -5 15 -51 64 160 -40 94 -65 -52 137 -69 6 31 164 91 213 -213 252 61 -176 65
8191F5
$$ Imaginary data points
##PAGE= N=2
##DATA TABLE= (X++(I..I)), XYDATA
0@%%%%%%%%%%%%%%%%%%Qj6J6j6J6j6K2l0L2l2M0m8N4o2P0p9Q9j02J15j29J44j61
40h5J79j98K19k43K69k96L28l64M00m41M86n34N91o53P19p95Q83r82J095j229
60f51J390j584J824k134K552l150M071n705R512l7415j1268M1032J098j5819k6759
75d3006Q7J7072K1875J159j2401j5255L46J0113J3263L050m500j0137n358J555
89b2137R740Q414L61j0498j1529k699J0262J2748K181j1941j4779l053J2397J5022
103e511K825j2288j4135k066J2783J5044L630j0726j3237k082J1541J3924M030
116C732r139j2048l698Q105J2342N132o879j2365o215N553J1447O112m968j2154
130a5043p611L494J1734Q109l620j1463p920L356J1604R038j389j0308q442K396
$$ plain form
0 0 0 0 0 0 0 0 0 0 0 0 0 0 0 0 0 0 0 0 8 -8 8 -8 8 -8 14 -16 16 -16 24 -24 30 -32 38 -41 48 -54 61 -68 76 -85
40 -85 94 -104 115 -128 141 -155 173 -191 209 -232 254 -280 311 -342 377 -418 465 -517 578 -651
60 -651 739 -845 979 -1155 1397 -1753 2318 -3387 6125 -31290 -42558 -1526 -428 -16247 -43006
75 -43006 -42919 -25847 -3972 -2813 -15214 -30469 -30123 -20010 -6747 -3697 -8197 -18334 -23692 -22137
89 -22137 -12397 -3983 -3622 -14120 -25649 -28348 -18086 -5338 -3157 -15098 -29877 -32930 -20533 -5511
103 -5511 -2686 -14974 -29109 -31175 -18392 -3348 282 -10444 -23681 -25763 -14222 -298 3732
116 3732 -5407 -17455 -21153 -13048 -706 4426 -2453 -14818 -21033 -15480 -4033 2079 -2889 -15043
130 -15043 -22654 -19160 -7426 683 -2937 -14400 -22320 -18964 -7360 1678 289 -10019 -18461 -16065
144a6065J1244R709q03r483q767J018R750R200R6r222r561p17Q138Q864Q78q442
160d163r666k337P093R486K182p245r721k737O970R507L779n337r096l420O277
175h428J0165M647m415q587m316N018R674M979l768q824n299L443Q566N385l238
190E002q945o039K180P816N870k266q297o261J441P835O529q00p561o347J218
205h625P622P224Q2o411o546J27P425P378Q44o338p099q85O269P257J043o181
221C186p538j830N285P193J553n528p697k533M718P481K368m402p369k904M615
236c402P540L473l625o979l036L829P515M065k891p114l913K726P081M349k406
251G212p617m584J922O510M465k182p037n567J476O109N343j340o627n355P65
$$ plain form
144 -16065 -4821 4888 4085 -5398 -14165 -13147 -3397 5803 5899 -3323 -12884 -13601 -5463 3401 4279 -4163
160 -4163 -13829 -16166 -9073 413 2595 -4650 -14371 -17108 -10138 -631 3148 -2189 -11285 -14705 -8428
175 -8428 1737 6384 1969 -6618 -10934 -5916 3758 8737 4969 -3855 -9154 -5711 2855 8240 5002
190 5002 -3943 -9982 -7802 14 5884 3618 -4679 -10940 -9499 -1664 4865 4065 -3496 -9843 -8625
205 -8625 -1003 6221 6303 -108 -6654 -6527 898 8276 9120 2782 -4317 -5202 1067 8324 9367 3186
221 3186 -4352 -6182 -897 6296 7849 2321 -5376 -7909 -3191 4290 6658 2256 -5113 -8017 -3402
236 -3402 4138 7611 3986 -2993 -6029 -2200 5315 9380 6489 -625 -4538 -1812 5269 9618 7212
251 7212 -405 -4989 -3067 3443 7908 5726 -1311 -6878 -5402 707 6050 4710 -1917 -7272 -6507
266f507O506N756k94n879n415L20O525O291M97n611o013k41N770O057J133n550
282C345o274j489M850O336J265n197o808k066M122O594J824m385o890k659L920
297c512O874K746l565o505k961L820O886L670k735o484l482L053O736M058k372
312F227o339m595K047O378M610j886o962m943Q28O255M897j083o630n442P28N879
328c1N669j64o014n533K15N782O284P29m804o159o38N405O580J367m841o386j616
345d155M763O299J808m553o699k506L809O472K359m134o729l158L288O642L438
360F944l259o498l383K985P017M180k462o213m008K428P051M760j659o094m823
375c034J615O441N160j187o213n538M51N834N183j63o158o196j77N351N702M90
$$ plain form
266 -6507 -1 5755 5461 -418 -5833 -5513 1012 7303 7800 2189 -3824 -4065 1705 7762 8895 3345
282 3345 -2929 -4418 432 6768 8033 2836 -3972 -6038 -1916 4678 6502 2117 -4773 -7432 -3512
297 -3512 3362 6108 2543 -3962 -6923 -3103 3783 7453 4718 -1766 -5248 -2195 4541 8599 6227
312 6227 -112 -4707 -2660 3718 8328 6442 -520 -5463 -4635 1620 6517 5434 -1196 -6638 -5910 -31
328 -31 5638 5474 -540 -6073 -5858 -76 6208 6937 2133 -4026 -4664 741 7321 8688 3847 -2539 -4155
345 -4155 608 6907 8715 4162 -2537 -5043 -1234 5238 7597 3463 -3266 -6424 -3136 3506 6944
360 6944 3685 -2813 -6196 -3211 3806 7986 5524 -689 -4697 -2269 4782 9542 7883 1789 -3034
375 -3034 -1419 5022 10182 8995 2782 -2756 -2305 3529 8712 8549 2391 -3805 -3982 1369 7071 7561
391G561n280o120j105N252O209J833m438o184j534M678O908K453m234o215k123
406b339L810O520L163l542o775l405L107O377L669l289o860m158K253O228L996
421H755k431o242m770J818O247M634j034n941m742R06O316N519p3n788m974J54
437a646N739N938j2n259n274r20M771N709P07m873o186j587M142N676J419m310
453D034o270k256L658O090K437l340o120k760L491O392L531k707n568l280K742
468G4N992M155k018n665m071J746N876M098j665n838m701R51N221M259p42n768
484A904n064K36M886M613o1m856m815m52M692N314O74m208m756o57M353N331J355
501H489l682n096j310L555N156J981l600n311k431K813N179K256l146n574l106
$$ plain form
391 7561 2281 -3839 -4944 308 6517 8350 3912 -2272 -3806 872 7780 10233 5999 -216 -2339
406 -2339 1471 7991 11154 7612 837 -2568 539 6916 10585 7296 436 -3722 -1469 4759 8755
421 8755 6324 82 -4688 -2870 3377 8011 6977 1036 -3706 -2800 3516 9035 8962 3174 -1800 -1646
437 -1646 4093 10031 10019 4760 -514 -1434 3337 9046 9753 4880 -1306 -2893 1249 6925 8344 4034
453 4034 -2236 -4492 -834 5256 7693 4353 -1767 -4527 -1036 5356 8887 6180 612 -2668 74
468 74 6066 10221 8203 2538 -1533 213 6089 10187 8522 2684 -2017 -1066 4155 8414 7672 1904
484 1904 -3160 -2924 1962 6575 6514 1658 -3157 -3609 1083 6397 7071 2863 -1893 -2550 1803 7134 8489
501 8489 4807 -289 -1599 1956 7112 9093 5493 182 -2249 564 5743 7999 4853 -721 -3827
516c827K365M937K715k505n214l242J925N186L215j588m761l136J289N298L491
531F148o30m620l666J175M326L817l01m415m096J55L908L755L9m297m470o70L695
548a47M028K48l877m627p17L401M194J269l276m492r83L303M562J638k729m104
564b309j418K841M758K018k377m490k034K390M330J912k157m492k589J579M053
579B015K249j595m693k765J070M152K819j237m040l187J097M037L479o75l508
594g82l031P48L914L323J40l423l509R3L659L685j03l305l859o48L214L471N56
611D143l358m084j084K937L581Q48k914m023j335K918M055J338k369l747j571
626d665K727L998J985j827m044j644K242L906K148j659m060k310J289M093K272
$$ plain form
516 -3827 -1462 3475 6190 3685 -1529 -4771 -2846 2340 5555 3967 -794 -3930 -2641 2657 6148
531 6148 5518 898 -2768 -1593 2733 6550 6249 1834 -2262 -2107 1801 5556 5595 1298 -3172 -3842 -147
548 -147 3881 4129 252 -4375 -5092 -1691 2503 3772 496 -3996 -4979 -1676 2886 4524 1795 -2309
564 -2309 -3727 -886 3872 5890 3513 -977 -3011 -621 3709 5621 3464 -1028 -3617 -2038 2015
579 2015 4264 2669 -2024 -4789 -3719 433 3252 2015 -2025 -5212 -4115 -78 3401 2726 -782
594 -782 -3813 -3065 849 4172 4312 889 -2620 -2527 1132 4817 4714 1409 -2450 -3098 116 3587 4143
611 4143 785 -3299 -4383 -1446 2135 2983 69 -3954 -5289 -2371 1684 3022 653 -3094 -4665
626 -4665 -1938 2060 4045 2218 -1826 -3470 -1228 2678 4826 3167 -893 -3203 -1914 2179 4451
641D451j703m100k822R67L938K147j075l853k876N79L816K961n72l575k812M56
657d073L797L450k77l188l052K65L433L691J78l512k980m87L033L545N94l220
673A197m032q88K821L507R57l127l918j332K516L774J413k256m152j511K351M019
689A339K226j865l896k053K113M569K095j365l915k378J280M015K682j290m217
704f60k818P73L927K705p42m440k973K44L702L268m27l941l355K53L536L836J33
721C021l342l618j59L634M118N44l167l544q23L017M177J042k824m176j398K495
737a003M219J147k569m253k154K383L949J692k008m105k340J766M105K609j428
752B010m122k493J507M300K999r00m033k798J049L850L423o46l828l220L46L732
$$ plain form
641 4451 2748 -1352 -4174 -3207 731 2878 1803 -2050 -4926 -4347 -531 2430 1858 -1717 -4529 -4073
657 -4073 -276 3174 2897 -291 -3343 -3078 355 4046 4224 712 -2268 -2755 278 3823 4417 1197
673 1197 -2835 -3723 -902 2605 3562 435 -3483 -4815 -2299 1475 2888 632 -3520 -5031 -2680 1339
689 1339 3565 1700 -2196 -4249 -2136 2433 4528 3163 -752 -3130 -1850 2165 4847 3557 -660
704 -660 -3478 -2705 1222 3927 3185 -1255 -4228 -3984 -282 2986 2559 -1382 -4737 -4484 -948 2888 3021
721 3021 -321 -3939 -4098 -464 3654 4198 1031 -2513 -3336 -319 3858 4900 2076 -2100 -3498 -1003
737 -1003 3216 4363 1794 -2459 -4613 -2230 1719 3411 1403 -2702 -5042 -3276 829 3438 2010
752 2010 -2112 -4605 -3098 1202 4201 3301 -732 -3530 -2481 1369 4792 4146 318 -2902 -2556 1176
768A176L219l40l696l677j69L300L560K31l401m191m08L125L754Q19k867l875
784c440q47K780M239J395k542l758j559K439M274J788j918l983j970K030L711
799B639K083j626m104k453J148L733K461j426l824k753J038L584K970j117l530
814a177k978P30L564L290j10l482l223L52L573L487K28l049l395k86L028L742
830D294K53k996l393r02K384L620Q58k562l829j404K308L247J520j997l865j379
846c843J798L731J939j661l385j798J786L774K058j166l671j773J060L539K512
861D900j263k925k604L72L334K505m59l517k910K91L015K667m38l224k860J54
877b962K817K995M50k832l051j30K665L111Q63k140l257p47K550L337O86j977
$$ plain form
768 1176 4395 4055 359 -3318 -3487 -187 3373 3604 203 -3988 -4396 -1271 2483 3302 435 -3440
784 -3440 -4287 -1507 2732 4127 1585 -2173 -3732 -1293 2981 4769 2851 -1132 -3102 -1072 2639
799 2639 4722 3096 -1008 -3461 -2313 1420 3881 2455 -1369 -4122 -3084 500 3470 2353 -1177
814 -1177 -4155 -3425 139 3429 3319 -163 -3386 -3034 539 4026 4254 1205 -2190 -2476 552 4294
830 4294 4547 1551 -1842 -2744 -360 3260 4118 1556 -2273 -3677 -1369 1878 3398 1401 -2464 -3843
846 -3843 -2045 1686 3625 1964 -1421 -3219 -1433 2341 4399 3233 -438 -2211 -1151 2388 4900
861 4900 3637 712 -1892 -1520 1814 4319 3860 343 -2567 -2276 739 3406 2968 -256 -3116 -2962
877 -2962 -145 2850 3300 468 -2583 -2713 -48 3063 3926 1786 -1471 -2218 332 3669 4355 2378
893B378l088j189K054L168R95j806l586j494J593K912J308j553l168j735J257
908a954K911K051j204l216j757J101L251K178j121k811j910R90L192K109l69l024
924D17k349P89K654K449m95k798k257k07K459K320k11k589k636m64K309K636K64
941B291k436k501m92K299K511Q48j700k737m15J942K737J237j759k719p97J613
957g8K783J283j698k750j655J595K530J285j433l008j607J183K575J412j047k934
973a564j641P93K782J805p35k486j834Q67K675K091m58k381k080N40K550K354
989C278k77k359k219O5K157K182k8k554k215m55J922K332p1k008k548l08J892
1006a214K214P89j966k402n77J873K761R92j824k405o35J742K719J094j563k762
$$ plain form
893 2378 -710 -1899 155 3323 4318 2512 -1074 -2568 -975 1937 3245 1692 -1476 -3211 -1954
908 -1954 957 3008 1804 -1412 -3169 -2068 1183 3361 2240 -571 -2481 -1491 1701 3810 3441 417
924 417 -1932 -1143 1511 3960 3465 667 -1590 -1797 662 2982 2771 182 -2454 -2918 -609 2027 2291
941 2291 -145 -2646 -3138 -839 1672 2520 820 -1917 -2332 -390 2347 3584 1825 -894 -1691 -78
957 -78 2705 3988 2290 -460 -2115 -520 2010 3295 1862 -1146 -2753 -1570 1005 2417 1370 -1564
973 -1564 -3205 -2412 370 2175 1440 -1046 -2880 -2013 662 2753 2295 -86 -2166 -1626 924 3278
989 3278 3001 642 -1577 -1512 645 2827 2799 245 -1970 -2425 -503 1829 1758 -250 -2798 -3106 -1214
1006 -1214 1000 1789 -177 -2579 -3156 -1283 1478 2470 646 -1759 -2394 -652 2067 3161 1598 -1164
1022a164j161J436K916J062j245k820j626R55K997J209j253k887j810Q60K585
1037E4K035j049k741j836P56K824K110o24k548k093Q17K669K143K1k355k483K68
1054b032K598K181M0k134k574l55K282K259L60k220k780p95K147K424N96j994
1070Ck931q07J832K943J213j872k680j057J839K742J359j136k986j233J472K826
1086A527J571j026k819j809R72K842J816j262k950j939M31K627K157n11k899k404
1102c676K77K513K512lk731k542L32K450K786J86k262k626j11K247K963N43k294
1119E64k529q99K101K709Q82k032k914j359J872K758R08j592k909j651J650K791
1135C50J249j251k839j740J192K994K064j227k621j693Q74K660K123m96k603k179
$$ plain form
1022 -1164 -2325 -889 2027 3089 1844 -976 -2602 -1647 1350 2559 1306 -1581 -3391 -2531 54
1037 54 2089 1040 -1701 -3537 -2781 43 2153 1529 -1019 -3112 -2295 374 2517 2538 183 -2300 -2032
1054 -2032 566 2747 2787 653 -1921 -2276 6 2265 2625 405 -2375 -3170 -1023 1401 1997 3
1070 3 -2928 -3735 -1903 1040 2253 381 -2299 -3356 -1517 1225 2584 1448 -1538 -2771 -1299 1527
1086 1527 3098 2072 -747 -2556 -1584 1258 3074 1812 -1138 -3077 -2646 -19 2138 1627 -1272 -3676
1102 -3676 -3399 -886 1626 1623 -1108 -3650 -3318 -868 1918 2104 -158 -2784 -2895 -648 2315 2858 564
1119 564 -1965 -2864 -763 1946 2828 796 -2118 -3477 -1605 1153 2061 469 -2440 -4091 -2441 350
1135 350 1599 348 -2491 -4231 -3039 -45 2019 792 -1829 -3522 -2648 12 2135 1639 -964 -3143
1151c143M26K600K253j88k707k417J19K304K358l6k508k635m50K188K527L48k326
1168a287k603n72K111K500P49j739k777q60K058K824R57j420k950r66J745K654
1184D24J406j644k699j328J001K593J377j121k669j669P75K494J657j068k744
1199c215j769P07K626J879k47k689k127M34K667K069l56k088j968J11K265K366
1215F65j9k054k290l83J990K591L49k076k741l48J751K180P48j798k699j017J971
1232c180K358R85j869k089j043J304K912R78j314k191j248J168K608J373p90k267
1248b305j648R05K264J503o46k354j712L55K004J852m10k198j918J01K027J964
1264b16m21j740k176K11K132K194M0j953j967J08J953K052L36j668k163k96J833
$$ plain form
1151 -3143 -2717 -117 2136 1948 -759 -3176 -3057 -753 1605 1569 -939 -3574 -4024 -1836 691 1039 -1287
1168 -1287 -3890 -4462 -2351 149 898 -841 -3618 -4478 -2420 404 1361 -59 -3009 -3975 -2230 424
1184 424 1830 186 -2513 -3841 -2840 -247 1130 9 -2660 -4329 -3554 -1060 597 -471 -3215
1199 -3215 -4984 -4277 -1651 228 -19 -2708 -4835 -4401 -1734 335 -21 -2109 -4077 -3966 -1701 665
1215 665 646 -1408 -3698 -4081 -2091 500 849 -1227 -3968 -4316 -2565 -385 363 -1435 -4134 -5151 -3180
1232 -3180 -822 163 -1706 -3795 -4838 -3534 -622 356 -958 -3149 -4397 -3229 -621 752 -38 -2305
1248 -2305 -3953 -3048 -784 719 73 -2281 -3993 -3638 -1634 218 -192 -2390 -4308 -4207 -2180 -216
1264 -216 -637 -2377 -4553 -4342 -2210 -16 24 -1929 -3896 -3788 -1835 217 553 -1115 -3278 -3574 -1741
1281a741K146L69j468k237o23J561J993M39j353k174p01J036K088J071j325k191
1297c110j199J249K283J015o76k301r41R74K268J443q96j984r99N60K144J418
1313A248m79j974j433M73J856J493l40k019j678K61J846J600l04j812j914M8K018
1330a110J647L52j661j963R0J670K043L74j329k102j38J600K106M51j414j956
1346a340m88J260J969P44j490k166n77J282J837O33j134k171r25J142K135R45
1362A656r67j915j235R03K089J628p59k248j128J093J845J437o64j586j539N25
1378h65J754J888m66k118j527K44J795J630m47j704j890j2J754J679R7j846j875
1395a909j36J716J978L65j452k044l67J961J992M69j458j692o51J717J964N60
$$ plain form
1281 -1741 405 774 -694 -2931 -3554 -1993 0 439 -914 -3088 -3789 -2753 -665 406 -919 -3110
1297 -3110 -4309 -3060 -777 238 -438 -2739 -3680 -2706 -438 1005 109 -1875 -2874 -2314 -170 1248
1313 1248 769 -1205 -2638 -2165 -309 1184 844 -1175 -2853 -2592 -746 854 550 -1262 -3176 -3128 -1110
1330 -1110 537 889 -772 -2735 -2645 -975 1068 1442 113 -1989 -2127 -527 1579 2030 616 -1340
1346 -1340 -1828 -568 1401 2145 655 -1511 -2088 -806 1031 1664 530 -1641 -2566 -1424 711 1656
1362 1656 689 -1226 -2461 -1558 531 2159 1400 -848 -1976 -883 962 2399 1735 149 -1390 -865
1378 -865 889 2777 2311 193 -1334 -1090 705 2335 1888 184 -1706 -1718 36 1715 1812 -34 -1909
1395 -1909 -2045 -329 1649 2014 562 -1482 -1849 112 2104 2573 1115 -577 -1228 489 2453 3013
1411C013j222k082r54J255J918R71j193k278j082J133J853R55q34k127j288P82
1427a180J980J298p06k014j100M96K250J310j69k097j186M25K080J648m26j667
1443I42j745PJ885J633J79k090j979j71J574K064Rj611k265k26J441K101L82j331
1461G99k131p38J447K439P07j299j775j039J349K430R37j190j886j244J023J969
1477A798J336r95k053j532O96K162J298q53k069j576L73K102J349j06k064j730
1493a864J51J911J996j72j758j764K40J898J970jj644j653l65J673J944O07j584
1510A585k214k77J266J980R12j631k313p97J184J995R11j035k239j291J223K030
1526A289J179q12k323r90R26K202J267o77j780j320P58J903J493l12k011j562
$$ plain form
1411 3013 1791 -291 -1245 10 1928 2899 1706 -572 -1654 -521 1332 2287 1453 -674 -1962 -1180
1427 -1180 800 2098 1392 -622 -1722 -1226 1024 2334 2165 68 -1118 -693 1387 3035 2609 942
1443 942 -803 -796 1089 2722 2901 811 -1168 -1339 235 2299 2308 697 -1568 -1794 -353 1748 2130 799
1461 799 -1332 -2070 -623 1816 2523 1224 -551 -1590 -241 2189 3126 1936 50 -1194 -171 1798
1477 1798 3134 2139 86 -1446 -750 1412 2710 1857 -212 -1788 -1415 687 2036 1930 -134 -1864
1493 -1864 -1713 198 2194 2022 264 -1500 -1260 638 2608 2607 963 -690 -1055 618 2562 3169 1585
1510 1585 -629 -906 360 2340 3252 1621 -692 -1489 -305 1690 2601 1566 -673 -1964 -741 1289
1526 1289 2468 1656 -667 -1657 -731 1471 2738 2061 281 -1039 -281 1622 3115 2803 792 -770
1542g70M46J839J508j79j987j811J7J818J658j33j690j829k63J619J914K09j283
1559A083k025m01J462J974N21j260j878j44J060K109O96j246j716p17J038J967
1575B523O75q90j794j342J044J714R37q98j877j185O14K125R19m19j733j583P69
1592d01J699J361l72j550j370J74J997J577j57j649j403kJ588J826j89j350j743
1609C6j05J201J770P1j310j826k58J054J579M30j382j392n80J168J494P26j228
1626A448j387o05J120J536Q39p41j568r05R65J726P11n74j619q04L14J431J200
1643C087p20j500j489M45J632J128o15j467j294K35J470J221j43j442j147l0J637
1660A008J216J3j352j233J5J400J227J97j243j282j22J009J482L68j421j355l78
$$ plain form
1542 -770 -324 1515 3023 2844 857 -954 -937 881 2539 2406 716 -1113 -1376 243 2157 2366 1083
1559 1083 -942 -1343 119 2093 2614 1354 -524 -668 392 2501 3197 1951 235 -482 556 2523
1575 2523 3198 2308 514 -828 216 1930 2867 1969 92 -1093 -479 1646 2565 2146 413 -1170 -401
1592 -401 1298 2659 2287 737 -633 -459 1538 3115 2958 1309 -94 -96 1492 3318 3129 1779 36
1609 36 -69 1132 2902 2973 1663 -163 -421 633 2212 2642 1260 -132 -712 456 1950 2676 1448
1626 1448 61 -544 576 2112 2951 2210 642 -263 702 2428 3139 2565 946 142 456 1887 3087
1643 3087 2367 867 -622 -177 1455 2583 1968 501 -793 -558 912 2133 1990 548 -599 -629 1008
1660 1008 2224 2237 885 -348 -333 1067 2294 2491 1248 -34 -156 853 2335 2703 1282 -73 -451
1677d51R99J132M94r96j728l96R05J504N60j176j396o12J034J469P05p43j361
1694e7p18Q63J322Q45m80j595q21O44J302R45n32j594q74L42J380R61l13j545
1712G5r91K69R67J177k27j371j121J21J139J296J20j185j440P2J569J170M4j117
1730E67j097m12J265J236K53j143j441k28J108J289L09j169j491m88R11J157O18
1747A244j023j310o21O20J697N37n28j509q47O22J653Q74m31j719p94N83J502
1764E50J045l38j370j050K81J325J162n32j518j140L51J332R81k80j250j533L21
1781a663J271J074R1j013j643M7J100J590L72j395j072m24J315J306M33r04j454
1798i69m33Q73J600L19o66j710r52R91J570N97r47j438p65N67J473R08p37j261
$$ plain form
1677 -451 548 1680 2174 1178 -550 -946 -41 1463 2023 847 -549 -1161 -127 1342 2047 1304 -57
1694 -57 -775 88 1410 2255 1775 180 -641 3 1305 2250 1718 124 -750 -408 972 1933 1620 75
1712 75 -916 -647 320 1497 1270 -101 -1222 -1101 38 1334 1454 269 -1171 -1099 470 1640 1684 567
1730 567 -530 -942 323 1559 1812 669 -772 -1000 108 1397 1706 537 -954 -1442 -531 626 1244
1747 1244 221 -1089 -1710 -1090 607 1144 616 -893 -1740 -1118 535 1409 978 -741 -1535 -952 550
1764 550 1595 1257 -113 -1163 -882 443 1605 1073 -445 -1585 -1234 98 1079 799 -451 -1984 -1663
1781 -1663 -392 682 773 -240 -1883 -1836 -736 854 1226 -169 -1241 -1665 -350 956 1389 485 -969
1798 -969 -1402 -529 1071 1390 724 -986 -1938 -947 623 1220 273 -1165 -1930 -1363 110 1018 281 -980
1816i80r80M32J501J190m80j264j109L15J664J077m37j202j014K85J147J392k37
1833A300j418j413O2J473J000L02j438j298m00J123J495J34j258j269k78J008
1849h75J480M56r78j454l98Q94J738N79q20j489n16P67J569O52o29j490o86K82
1867i18J460P67o68j284j185M48J543Q82m27j254j351M95J289R74j16j275j084
1884a704J62J360J341p7j066j193q1J170J448%r29j357m05J095J304L22j132j224
1902i66m76R08J179N36q23j489o36P81J180P74q39j346o89Q44J228J102n42j291
1920e65p66M17J457Q88l07j395q89L51J180J022L9j412j081p1J383P98j3j456
1938d20j030J21J077P51K92j137q87l09R02J439J59r52j137j50R40J273L91r61
$$ plain form
1816 -980 -1960 -1528 -27 1163 683 -581 -1690 -1375 289 1366 929 -273 -1287 -1002 145 1537 1300
1833 1300 -118 -1531 -1469 4 1004 1306 -132 -1430 -1830 -707 788 922 -336 -1605 -1883 -875
1849 -875 605 1061 83 -1371 -1769 -875 863 1442 622 -867 -1383 -616 953 1605 976 -514 -1200 -918
1867 -918 542 1309 641 -643 -1828 -1380 163 1045 618 -636 -1987 -1492 -203 771 655 -620 -1704
1884 -1704 -1542 -182 1159 1082 16 -1177 -1258 -88 1360 1360 431 -926 -1331 -236 1068 1390 258 -966
1902 -966 -1442 -534 645 1181 358 -1131 -1767 -986 194 968 129 -1217 -1906 -1062 166 1268 726 -565
1920 -565 -1331 -914 543 1431 1124 -271 -1160 -809 371 1393 1432 20 -1061 -1132 251 1049 1036 -420
1938 -420 -1450 -1329 -252 499 791 -346 -1233 -1542 -640 799 958 6 -1131 -1281 -341 932 1323 362
1956C62r21n54P79J275L49n03j227o42P49J051N51m77j441o62M60J122N94n06
1974C59j126o52L45J032O29k30q37p97K40J466N75r7j018p53J04J127P63J10q41
1993C99j247K87P83J034j43q31j224k18Q98J051J54j115r41k19N47J204N12r65
2011c4j056k76R15J094L39m60j052n09O46J295K67l68j106m38M50J089N57m65
2029H88j103o32K36J006O47l46j211q59M07R71O11j18j205o35L10Q67P18J02r36
2048b82n60j87R51R88J16r84o54k71J075Q14J40p23j005j48P22J023J03r28p99
2067f09m24Q18M71O02p17j008k79O13R88M32o24r74l26N40J427J11m38q18m93
2086g08M79R11N56n21q92m55K80J076N95n41j013p72J44J079Q68m99j011o47J19
$$ plain form
1956 362 -559 -1113 -334 941 1290 787 -440 -1082 -333 718 1269 792 -649 -1311 -851 271 865 359
1974 359 -767 -1419 -1074 -42 587 357 -480 -1277 -1037 429 1004 907 -111 -864 -760 367 1130 1240 399
1993 399 -848 -561 222 1256 1113 282 -942 -1160 -262 789 943 -172 -1113 -1332 -785 419 931 -34
2011 -34 -1090 -1366 -451 643 982 522 -530 -1039 -393 902 1169 801 -305 -743 -293 796 1353 888
2029 888 -215 -847 -611 395 1042 696 -515 -1374 -967 4 615 497 -708 -1343 -1033 -166 552 654 -282
2048 -282 -842 -1029 -78 910 1026 42 -612 -883 192 1006 1146 423 -582 -730 -8 1015 1118 190 -609
2067 -609 -1033 -215 256 858 141 -867 -1146 -533 455 887 263 -711 -1037 -497 930 1041 603 -215 -708
2086 -708 -229 682 1238 717 -175 -630 -350 726 1321 780 -233 -1005 -861 218 1086 587 -424 -1071 -952
2105i52P56Q74n9q34r61K27R80P50N2o37r07j89Q71J177J26j068p82l13J067O93
2125H71J68o17r13m71O39R28L44p72r43m89N16J210L98o41j306k89L62J151P13
2144H59n67o33q16M71J298O23l01j300n12K27J141O49m07r29p05J82Q78P56p0
2163H44j134q27J08P10J162k47j113o27j56J065O75J96n58j256J12P90J033K18
2181I95p55p65l33O12J184K34n60j031m60O49J012L84p10j051m70L45J135M25
2199H40n36r64n73M13P87O55n6j100o36L82Q65Q53j59q98o28j07J039P30O3p07
2219B63j108J58P00P68J64q23j116k6P74J026N3q36p40m03P09O91M93p40r80l28
2239a301O37J338J31m83j073k08M71R56O27n13q65m16L13R14M04j33j028p39M69
$$ plain form
2105 -952 -196 678 619 -215 -1176 -949 31 781 833 196 -711 -900 -29 1148 1274 206 -576 -889 178 871
2125 871 1039 422 -491 -962 -323 605 949 177 -766 -1255 -739 471 869 228 -1078 -1367 -1005 146 859
2144 859 292 -341 -1157 -686 612 1235 934 -366 -878 -651 490 1139 732 -197 -902 -720 158 914 844
2163 844 -290 -1117 -1009 -299 863 616 -497 -1124 -1280 -215 460 656 98 -1158 -1046 -256 777 995
2181 995 240 -525 -858 -246 938 1172 612 -419 -879 -230 782 1166 456 -595 -1065 -720 415 840
2199 840 304 -660 -1233 -820 -33 622 566 -534 -1170 -788 77 930 771 -127 -755 -862 177 907 970 263
2219 263 -845 -687 13 781 945 122 -994 -1020 -246 780 833 -3 -743 -1146 -437 254 747 7 -973 -1301
2239 -1301 -664 674 805 322 -751 -959 -488 468 1095 582 -283 -699 -386 528 932 799 -229 -968 -499
2258d99O64N03o6r33r40K18R47P70j32j104o68K8R10J034P3j005o55j39Q91Q22
2278G19L96r90q01k39Q89P35J02n38r19m8L91P01M16q94n71m86N04Q72L34n57
2298A6q00n98M32R70L99j96r79l13L03J023N13j52r75n82J94Q46R89n57o98m60
2318f25k21R52P33l47o44q61N4N03R39K1q68o40j60O87O06L60p26p06m3N34O92
2339B40N26o53p07m65P59R71k00j23p71k62L24O45M87o19o53n14L60Q00L41k66
2359B20r40m44J32Q53O15o34m44n36L32O66N99j51n07o26%P74P25j78n76o76J97
2380e99M09Q00j50m41q84j23P06P10Ko54o34k97O49N93O1n84n96j92O33N95L60
2401C64o43m63l53L71J012J92l32m91n94M73O32N55n47o12k77K31N49L32k69p08
$$ plain form
2258 -499 165 668 602 -331 -1271 -1053 -106 664 532 -572 -1240 -1212 -302 732 805 -200 -855 -994 -103 719
2278 719 1115 125 -676 -915 -26 709 811 273 -646 -694 -303 398 814 -80 -651 -1137 -633 239 573 16
2298 16 -784 -1382 -950 20 419 223 -756 -1069 -766 257 770 618 -357 -939 -745 101 1090 533 -165 -625
2318 -625 -846 106 839 492 -152 -1013 -959 -456 483 504 -364 -1004 -1164 -477 129 489 -237 -943 -986 -452 240
2339 240 766 113 -594 -1059 -300 671 471 348 -423 -685 -361 284 771 152 -501 -1015 -655 145 486 220
2359 220 -720 -1164 -1032 -179 436 -198 -642 -1178 -846 -180 419 268 -239 -865 -865 -91 634 456 -120 -796 -599
2380 -599 -190 610 460 19 -865 -988 -282 428 430 -224 -858 -1155 -506 87 148 -436 -1032 -1224 -591 4 364
2401 364 -279 -742 -1095 -724 288 480 148 -343 -937 -464 168 723 176 -436 -713 -482 67 399 130 -578
2421e78l45K05N76L75p4p72n61K92P08L53l9r92k82K84P96K52J85o41m06o1Q49
2442A24M20o7l56q38J88M00N46J27o97o05J11K83O93mn01o20l08N25N33L38m52
2463a60n74p8K17Q31L38k75p16n24N26R20K67m39p95j44K33R39J76k33r01j86
2483e78n4N57P48k78p99m60J13O47N73j12r06n66M25N93N59l5o00o44R7Q74N25
2504F79J75p12o10l6N07P25J25p12n54j20M62Q45j9n69n99l87O15M43L62l24j038
2525g42j13K91O46O20l86q04k54L34P34N77k48r10l51L40P73N29k40o30p20M51
2545a03N09N52l17p27l51j75J040K21J6p16n68j50N12P44M1m02r07J46N47O75
2565E87J78l63q47J8N42O19K72n19q14j54N64O12K28l62o56m35M37N97M15m99
$$ plain form
2421 -578 -923 -718 -142 233 159 -613 -1174 -882 -174 179 140 -852 -1134 -850 -54 198 383 -258 -664 -725 124
2442 124 544 477 121 -717 -529 -129 417 544 -153 -758 -647 -364 329 325 -176 -796 -1104 -579 -46 292 -160
2463 -160 -734 -812 -595 236 574 299 -417 -941 -415 505 772 333 -462 -606 -373 566 742 509 -392 -578
2483 -578 -632 -75 673 395 -404 -864 -751 -104 469 357 -549 -1115 -690 -97 462 427 -173 -817 -720 154 679
2504 679 854 142 -468 -504 3 728 853 141 -413 -533 -71 774 755 186 -413 -800 -185 258 620 296 -742
2525 -742 -855 -564 82 702 316 -488 -742 -408 326 903 655 -255 -606 -266 507 1036 796 166 -554 -103
2545 -103 406 958 641 -86 -437 -612 428 649 665 -51 -619 -769 -257 487 528 126 -781 -635 -88 587
2565 587 765 402 -445 -427 115 734 1006 487 -327 -481 83 695 923 561 -95 -530 -93 504 919 420
2585D20q95j08J98P37L97l82n16o64K18Q44M98k32n23o17J57Q18N56j3o81n54
2605c42R5O74M29o0m71o38m0M71O76R7o25n08j10J96P19j5k97q49j11M27P48L05
2627G71m56p47l02P60N67L74l50p36l67L68O95L83k40n32o83R5Q91L86j18p99
2647d0n03J5R76M11l41n38l79r8O12N85l56j51n86N0L00R28j36o03k73l10N76
2668A39P14J97m38q02O6L53M87L49m59p83j46N36N38L3j68r37j52L19N92J78l11
2689C05m27m94M99P05K74l40m54l29J23N12N24p6m97n17J29O85M18l39l12p43
2709c54R3O47M77j94l87n82J4N73L17J24n03n76m7P31L43J37k50o68m8K24N68
2730F39L58n68m02j91M76O75J26m55n56l90L17O96P9k03o54j60J06N22K68j93
$$ plain form
2585 420 -475 -583 -385 352 749 367 -149 -813 -595 249 747 515 -8 -625 -468 350 906 893 212 -342
2605 -342 -247 427 856 796 325 -313 -353 118 794 891 266 -242 -352 -156 563 548 251 -598 -709 -282 466 771
2627 771 315 -432 -734 26 593 967 617 -119 -486 -118 577 960 720 188 -495 -400 491 877 759 -40
2647 -40 -543 -528 448 859 518 -20 -399 -497 115 700 344 193 -393 -343 -43 885 749 146 -127 -437 139
2668 139 853 1050 612 -190 -124 229 716 1065 606 -177 -323 213 751 784 616 -321 -473 -154 438 616 305
2689 305 -122 -616 -117 588 862 522 68 -261 -138 374 898 822 325 -192 -63 622 1040 701 389 -354
2709 -354 -261 386 863 669 282 -300 -286 287 604 728 225 -351 -398 333 676 813 563 -105 -153 71 639
2730 639 997 429 27 -164 312 987 1113 658 102 -288 29 725 804 601 -53 -213 -107 415 683 490
2750D90n95l76N40L39N56m27l01k67N7O94K51j67l30n83K13N01M28j88m25m26
2770a6m2N34L47n6l96n99J50L22O11q5m19n51%M67L62M5m04k69k20N79M68J96
2792A024n81p20K08J70O95K65o09l21j28L02O09j77j35n29k58L82L87L50m52m33
2812D9m98K07N51L26j77n43k95K16M35N59j73o12k69K57K84L18K61p03m59M2O71
2833D47M28j42l53m72j18M42M02m4j27q27M3K80N80j58k17n82m2L43N77K2k89
2854A93n76j70M71M68L51l44n03Mj28R46K05m02o06j70R8M56M52k40o22m73K56
2875c34M52O99n06n08m63K76N06L30j19n27m16q1O41L90J84m68l87o2L63O69j40
2896D99l69m85m7N37L90K22n71n63p9L90L98P7k97p14k08L77O59L75n14m85k52
$$ plain form
2750 490 -105 -481 59 398 954 527 226 -41 16 710 961 794 464 -119 94 595 1023 835 410 -16
2770 -16 -58 476 823 767 371 -228 -78 244 855 770 351 -200 -200 267 629 674 270 1 -219 360 828 1024
2792 1024 443 -277 -69 101 796 1061 452 131 3 305 914 737 602 73 -185 197 584 934 482 49
2812 49 -449 -242 309 635 458 -85 -380 -164 271 830 657 45 -224 33 317 635 896 193 -266 -224 447
2833 447 875 733 380 -92 -210 232 634 590 463 -364 -321 -41 539 381 164 -418 -460 -117 460 482 193
2854 193 -383 -553 -82 386 737 393 -110 -106 -234 712 917 515 -91 -261 -163 293 745 505 -117 -590 -334
2875 -334 118 817 311 -197 -660 -384 122 452 333 -194 -610 -691 -50 340 524 56 -331 -393 -30 639 499
2896 499 130 -355 -402 135 525 747 176 -387 -466 -76 322 399 102 -612 -820 -443 216 591 77 -408 -660
2917f60J61O06K82k56n32k00M26N15L46l66m58l96J49O24L21j35n30l88J89L81
2937G9M58l21m27m33r1M57N93k3m71n76k5N04M38J56m44l70q4N21N14l9m03k32
2959b19m50L74O96J57j61q63n8L69L36K54k31n15k15l5P08J19k43l43l00N9N04
2980e7L04ro35m02K15N42L22M7m46n42K37M71L60p0n80l47J31N90K61n3m08l44
3002d13k6K76M71J25o58m06K1M28M37Q9m44m86r0L92N30J24m74m75J12K70N30
3023C33M8ln60k39R7N27J61p1n54k53J85J86L57k04k83j63k63O27L23j23l16l18
3045e06nN15P4K4k46m00J60L02N52j26j97m31j42K19O09J21n29k80k15M79J41
3066A19K67m75l19j44L08K37J17r2o34n2L38M66l5L5m38k64J77M12M20k20m81
$$ plain form
2917 -660 -499 107 389 133 -399 -599 -173 342 688 322 -136 -532 -383 241 562 427 -103 -491 -302 79
2937 79 537 216 -211 -644 -735 -278 315 292 -179 -755 -780 -276 162 318 -126 -496 -580 -59 455 416 13 -219
2959 -219 -669 -295 401 558 397 -466 -524 -155 181 435 204 -311 -526 -561 147 266 23 -320 -620 -561 -57
2980 -57 247 238 -397 -799 -584 -42 280 327 -119 -661 -424 47 407 337 -243 -590 -459 131 392 339 -69 -413
3002 -413 -439 -163 308 433 -225 -631 -610 -182 255 344 -100 -586 -676 -284 246 370 -104 -579 -467 -197 333
3023 333 381 378 -182 -421 -324 203 364 293 -261 -514 -329 -143 214 10 -273 -436 -699 -72 251 128 -188 -506
3045 -506 -511 4 78 102 -144 -544 -384 -82 470 344 147 -284 -426 -207 402 523 -6 -286 -501 -22 119
3066 119 386 -89 -408 -552 -244 -7 110 18 -616 -668 -330 136 101 136 -302 -566 -389 23 443 223 -258
3087b58j39J10N55P4k1l09l99J09M41k2J07l72n27K67M36j2J15k60n60O8K85N61
3109B49j16l14l89J64J57N84p3l26j70k08J58N74j25L4m11M1J05M61r7l66k17
3130b85k50K68M93P9k85l87q6J69M83P0m86o4k33M00L53J30j94l65k0p0M69K84
3152D73k48j98l73K23K89N9k3l14j77p0K60M45k00k46m37J39K85K98Q1l11k41
3173b86k57K85L89J03m09j16k63L37N91l8r1l94k12L73K48O9j79l78q4L21R6M10
3195E15m17l87l29L39M74j7L1n71k56L45K64K94j54m66l7Q2L03M48j98n59r5L03
3217h8L14K19j37j13m31j00M55M14k69l81k6j75M28R0J36m12k34n2L79J91J06
3238C14k54n11L6K35L31J06k30k00j28K55M15J04j89n77j41J29M71L56m42k87
$$ plain form
3087 -258 -397 -287 268 342 321 12 -387 -278 163 141 248 -124 -651 -384 52 40 155 -105 -665 -597 -312 249
3109 249 133 -181 -570 -406 -249 335 262 -64 -234 -442 -284 290 165 199 -212 -171 -66 395 298 -68 -285
3130 -285 -535 -267 226 305 20 -367 -453 -284 199 269 -217 -281 -514 -114 239 369 175 -190 -210 -280 189 473
3152 473 225 27 -346 -123 166 225 202 -112 -289 -359 -99 346 146 -100 -537 -398 -113 185 266 -45 -286
3173 -286 -543 -258 131 234 -175 -291 -554 -217 374 336 245 -149 -361 12 260 329 150 -228 -312 9 105 515
3195 515 98 -289 -618 -279 195 178 209 -362 -618 -273 -9 285 131 -335 -372 -290 13 461 263 -296 -391 -88
3217 -88 226 445 308 195 -236 -336 119 533 264 -117 -143 -318 110 200 336 -76 -310 -362 17 208 314
3238 314 60 -451 -415 -180 151 257 27 -173 -301 -46 369 473 284 -293 -434 -305 166 522 80 -207
3258b07j37Q6L45M19k07n90j69K06O62k1j56l41k12N0L05M26n4o06l53J53O43
3279B42N3J96l56m10O7K94J49J85l67l93K39K52J02N6l37l27j93L73M04J46l04
3300G1l97p9M18rK65l65r1l37L87L96R6j38m66j0J27K97L56l22l97l4n0L62N5
3323A35J09j22l76m2L06L72k85l62k50J19L56J64J77l31k75L2K95K54J6k04m54
3344c66P3M54K01o4j28l26j21J74M28O6j55k11n21M28K82J79j69n61j2J16K69
3365C6K75o7n43j83M60M4L32j18k25k41L2M88R8j54k69m6r3K50L35j55j24k54
3387a22j03P4N94k28l50k50Q3K10L92P3m39k20l8J61M39j2j00l40k90N54J82m0
3409B30k10j93j45M17K91q3j55k16p8K01J92N0j64k06p4j30L43J50q5l64j11R1
$$ plain form
3258 -207 -344 -258 87 506 299 -291 -460 -254 408 387 231 -110 -322 -272 33 459 405 -201 -554 -401 242
3279 242 295 491 135 -275 -208 86 235 420 53 -340 -101 151 253 309 -28 -355 -548 -175 229 375 71
3300 71 -326 -405 13 4 269 -96 -187 -524 -137 259 355 217 -249 -259 -132 165 521 199 -198 -232 -282 80 135
3323 135 244 122 -254 -296 10 382 97 -265 -515 -396 -40 124 301 -30 -305 -273 22 276 292 88 -366
3344 -366 -293 161 362 298 170 -156 -277 -103 325 391 236 25 -496 -68 214 393 224 -337 -349 -233 36
3365 36 311 244 -299 -482 -22 22 354 236 11 -230 -198 290 388 234 -35 -81 -174 76 411 256 132 -122
3387 -122 -225 -151 443 215 -135 -385 -302 -92 300 373 -66 -286 -324 -163 276 264 164 -176 -466 88 270 230
3409 230 20 -173 -318 99 390 307 152 -64 -142 59 251 301 137 -69 -143 -273 70 220 135 -229 -340 -249
3431b49J63J14rl25j34K29K42J93L5j54l45J53J39J18N5k05k02l0J92K94j1j33
3453A30n37J50M21K5Q0l41k90n0K73K57m1j52k13j9J96K86N0j07l22jR3K65L8
3476A91J41l19k69J65K47M6p2j29r2k25M97J04k32k98k46J80M82P5q9k15k37L0
3498b65K76J52Q2l03j39q2L40N7L1j00J8l21L48L50j53j17k13p2j5M40j47r2k03
3521a28k48J30K54K43k49j97j36J08J62L68j65n00K21O3K97J28k72r9j26J5K29
3542I8K86j32j87k35J12L08p6qj44k88o8M20Jj62P4k91n4K63K15K5q0k67p6J15
3566a51L34J59m20q1q2L32K96n3j67m19p0K84K53J39j98k38j90L28K33m0j08l51
3588b10p6l7M25J05o1j42k28j82O73l7j33l59P5K20p2L42J7l24j72K28p8K99j38
$$ plain form
3431 -249 -86 28 19 -306 -440 -211 31 224 259 105 -240 -87 52 170 225 20 -182 -212 -20 274 263 130
3453 130 -407 -257 164 189 269 -72 -362 -412 -139 118 77 -75 -288 -307 -111 175 225 118 -204 -205 -112 153 191
3476 191 332 13 -256 -91 156 202 130 1 -91 -316 181 285 53 -245 -491 -311 171 246 157 -58 -295 -265
3498 -265 11 163 245 -58 -197 -279 61 118 149 49 67 -254 94 444 291 174 -39 -111 -126 314 167 75 -128
3521 -128 -376 -246 8 251 2 -195 -331 -223 -61 307 142 -358 -137 -74 223 351 79 -20 -146 -131 98
3542 98 384 252 65 -170 -58 250 174 166 22 -266 -334 86 87 -75 -1 -292 -346 -83 132 157 77 -190 -266 -151
3566 -151 183 342 -78 -159 -241 91 387 334 167 -252 -322 -38 215 354 156 -82 -272 56 289 249 141 -210
3588 -210 -286 -323 102 207 146 4 -224 -406 267 230 97 -262 -187 33 -39 303 320 -4 -176 52 -26 273 135
3611A35M6k07j01K07J52P5l53j56k1J27K28Rj66k47J44q5M63o7j23k73J27oL21
3634B29K01q8k93k23J92K52P1M3m60q4J5L52K8l41J66k96k8M58M9M1n41j11K08
3657a60K11L19k54j85l4j36K35L63j60k97o3J46P8J59J90m17j24j75M42m4J27
3678B21j50j91K5j33L48J21p2l37k0N0L67j81J5k37J0K39J03J58k52k95J38K14
3700A41q5K16r8l32m0J03K91J33k15q7k80K53P5K79k03k08k54J48J95P6M6j71
3722a7j25QK74J7pl40J63j53L11R2Oj39k82M1K63nR9j50k76J9K78J36l4j35k94
3747b50jL05j39J86q9l93J88P0K52KP0m22nJ53J04R6j07P0j69j67M27k23L37m40
3771a45L8N8M5O3J16k01N9o1m8K58J37n20j6J11J26n6O5j79j98K53K39J5j1q0
$$ plain form
3611 135 181 -26 -127 80 232 307 -46 -202 -223 -96 132 141 -25 -272 -128 -213 250 183 60 -213 -86 -92 229
3634 229 430 342 49 -174 18 270 341 384 -76 -160 -145 207 235 -106 60 -236 -264 194 243 284 -257 -368 -160
3657 -160 51 370 116 -69 -103 -239 -4 359 199 -98 -161 -15 63 222 412 -5 -129 -304 138 94 221
3678 221 71 -120 -95 -228 120 241 169 -168 -188 -138 229 48 63 -174 -164 75 178 336 84 -211 -73 141
3700 141 56 272 174 -158 -198 -95 196 329 114 27 -253 0 75 354 151 -57 -311 -163 32 108 154 -17
3722 -17 -142 -134 140 157 150 -190 -27 -180 131 223 229 90 -192 -151 112 107 206 56 -220 -201 77 213 179 44 -250
3747 -250 -251 54 -85 101 12 -381 -193 -123 129 131 201 -221 -226 -73 31 127 20 90 -79 -246 181 -42 295 -145
3771 -145 -107 -49 -4 59 175 -26 33 -28 -76 182 319 -201 -217 -106 20 -36 29 -150 -348 -95 144 159 148 68
3795F8j73j27J89L92j72K8l96M1K22J20oj4k62j9n0K09N1R3k32j22M6K13R0N3
3819B42k42l24J75Q0J84j08m1j20J15Q7K50j99J6J0j39J19K40j16k99n7J7K62
3841A52J17q5j92j20Q2K2J63j30M6k02K7O4K12k7j77j8n1L02j45J34j29j50K83
3864A78j99K35L1j98O0k18L07O7o9l1p5k38Q6K33j17q2p1j54J52J67J53k10j93
3887a86J4j7M01M0pj23k04p6K86N6M2j06j18n2J74J66N5l81q6j24L66J24n6j65
3911B3k27J19OP1K98j49j46k11L18l4J66k97N3j9J68J68m1j25q0k67K94J45J18
3934C51j20k53j05J02J13J51l4l19K52k79K29M9j8j04j14k7J84J15P3j71j68q
3956a01K57p3J26N1m64K01N9L8J13k06L9n3j98N61j40k80o7j55L34j2J53n0o7
$$ plain form
3795 68 -105 -232 -43 349 177 205 -191 -150 72 192 186 172 -90 -109 -159 50 101 194 -38 -160 -114 99 189 242
3819 242 0 -324 -149 -69 115 7 -34 -154 -39 48 298 99 115 125 -14 105 345 229 -70 -127 -110 152
3841 152 269 184 -8 -128 -46 -24 139 9 55 -147 -120 -56 156 129 -48 -66 -117 185 40 174 45 -105 178
3864 178 -21 214 245 47 107 -111 196 263 194 163 88 -150 -64 169 52 -30 -101 -255 -103 64 217 7 -186
3887 -186 -172 -189 212 252 245 122 -82 -158 128 184 226 120 2 -50 124 290 345 -36 -122 -246 120 244 188 23
3911 23 -204 -85 -79 -8 290 141 -5 -216 102 68 234 -63 -10 -29 139 307 266 141 61 -206 88 233 351
3934 351 231 -22 -127 -25 88 239 205 -114 138 -141 88 137 119 15 -99 -126 58 173 246 75 -93 -101
3956 -101 156 83 209 260 -204 -3 56 94 207 1 40 -13 -211 350 210 -70 -137 -292 42 30 183 133 66
3979F6l12J40J44P7p1J9j91l2J45K90j42k47n8J71n2K89k11l5j33J05J85O4J9
4002B30l62l5l0J28J70n3j00p5K4P2j5Q5k3j47j34J82J57K59k32k81p0K96K36
4025B82j88L5k72j12J85J46K08k79l0j52K75j17K29j06k35j8j04J69M50m53j70
4046b57J95j51K77l5k40J25j38J21J94n2Ok43j07K47J83PJ9j77k05J10K85P5L8
4069B77l00l36K53R3J49K35k16m76r5Q2K20J44m1j64r1n2L68J58l83J4j22L43
4091F0J20k56n3O6j24J44L9R7R6m22J13j22K38K41k02j22o9j84K11Q7m9Q4k11
4114b18J23j99L12J69m50J05N6j9J40J89j48l73L02j7J65Nj86m6j23J95J67O5
4136B14k86p5J11MJ0l3L5l1l59J46M57olk96j3o5J06K64o4j92J46k9J23P8l39
$$ plain form
3979 66 -246 -106 38 115 44 63 -128 -160 -15 275 133 -114 -172 -1 -53 236 25 -10 -143 -38 147 211 230
4002 230 -132 -167 -197 -69 101 48 -52 -127 -103 -31 -46 39 16 -131 -265 -83 74 333 101 -180 -250 46 282
4025 282 94 129 -143 -255 -70 76 284 5 -25 -177 98 -19 210 104 -131 -149 -253 -84 366 -87 -257
4046 -257 -62 -213 64 29 -211 -86 -224 -103 91 39 45 -198 -305 -58 125 132 151 -26 -231 -121 164 239 277
4069 277 -23 -359 -106 -13 136 371 155 -321 -416 -334 -114 30 -11 -175 -266 -318 50 208 -175 -161 -283 60
4091 60 180 -76 -129 -63 -187 -43 -4 93 189 -233 -120 -242 -4 237 35 -87 -156 -340 -129 -42 -91 -7 -218
4114 -218 -95 -294 18 187 -263 -158 -102 -121 19 208 60 -313 -11 -28 137 142 -44 -90 -213 -18 149 214
4136 214 -72 -147 -36 -32 -22 -55 -20 -51 -410 -264 193 187 184 -112 -125 -190 -84 180 116 -76 70 41 164 242 -97
4161i7J63j76K52l19L77k48oK3j4J59j35p9q2l1L5K40J1j15l8j64OM10mO4l05
4186g3j12J13L1K38l6k88PJ50P4n7M5j18k17K17q7J05PM4j78O2J80j70J37j1k1
4211D2k2j39L6K85p8j01j6k30J79J05L5j79kK01r9p2M24n28N0K04n8j42J8j80
4235b67K78q7m6J5K67p9l7r2K4J12J46k84q3K47j20L54j82j28j34j72L89l9Q0
4258A62k29m0rl7K22J17j33j05L2k51L58K5J33l41pM9K24Lo9k20j98O8L75r1j93
4283a55K82j2j36J33j07L22m11K8k47L55M4j13R3j23r6K83j84R4l8N1k42N2K05
4306G8P2k11p8RO9R7J9j04j14JQ4nJ78r5j25j9K23j21K55q3j43k45J85K06N4m6
4332A41k65k49J53J71L56l05o2k11Q2J87rpJ08j30M3J87j01J14p5l06M0J76J5
$$ plain form
4161 -97 66 -110 142 -177 200 -48 -54 -31 -45 114 -21 -100 -182 -213 -178 62 73 -42 -80 -244 -238 172 168 232 -73
4186 -73 -185 -72 -41 197 161 -127 -120 30 104 47 92 -26 -243 -26 -113 -8 -1 43 -135 -73 107 -63 74 63 42
4211 42 20 -119 -83 202 124 23 7 -223 -44 61 96 -83 -85 116 17 -55 369 -159 -109 95 37 -105 -87 -267
4235 -267 11 -76 -122 -107 160 81 44 -48 -24 88 234 -50 -133 114 -6 348 166 38 -96 -268 121 82 162
4258 162 -67 -107 -116 -153 69 186 53 -52 -20 -271 87 112 245 -96 -103 -54 170 173 104 -116 -314 -246 129 38 -155
4283 -155 127 115 -21 112 5 327 -84 -56 -303 52 96 -17 76 -47 -143 140 -44 50 12 63 -179 -127 78
4306 78 150 -61 -139 -130 -61 36 55 -49 -163 -162 -78 -83 95 0 -125 -144 79 -42 213 130 -13 -258 -73 133 187 141
4332 141 -124 -373 -220 -49 307 2 -60 -271 -189 -2 -11 -18 90 -40 3 190 89 203 128 -178 -138 38 53
4355E3J83k68j30P9L5r9K88l07O7k3K4K61r1r4k08K35j04K31m6n6j44n0K12J23
4379A71j26M7l12N9J67J94Jl15J32j10o9J93o2J4J35k78J86l5K05j54p1nO7K9
4403F3p4Q5j92j30L70p8p7K36j37n6M3m9R0n5k3k05J38J63j32K95j45j64j19j02
4427b55L63j05q5N5k26K83J44r5P0l75J32l7P6K60j0j43k38J81K14nL2k41K8m2
4451a9M1J4K39l49j19L55q3j41J84M4k75j9L6K33N5l02L8Q7r9o5L38j33j78N5
4475f3J24PL9j39n8M1R1LK26o8k40J38o9L4J35k74P7k6L1J37p1j35j07J63j31
4500a35J68J95r8p2j72J17q4J41j4p4j39K04j24J60M3L3k20j30J82J76O6k25N8
4523E6n8M4m4p4J26k73K72J14pp3Qj99m1K40j49K90k39J2j07J45J4J28m2j77j15
$$ plain form
4355 53 236 -32 -162 -83 -48 -147 141 -166 -99 -122 -98 163 72 -22 -230 5 -99 132 86 30 -114 -164 48 171
4379 171 45 92 -220 -161 6 200 201 -114 18 -92 -161 32 -30 -16 119 -159 27 -8 197 43 -28 -33 34 63
4403 63 -11 74 -118 -248 122 44 -33 203 66 10 53 4 94 39 16 -189 -51 112 -20 275 130 -34 -153 -255
4427 -255 108 3 -82 -27 -253 30 174 79 149 -226 -94 -131 -55 205 195 52 -186 -5 209 204 236 -5 23 -19
4451 -19 22 36 275 -74 -193 162 79 -62 122 166 -109 -128 -92 141 196 -106 -68 19 -80 -145 193 60 -118 -63
4475 -63 61 68 107 -32 -90 -49 42 45 271 203 -37 101 32 66 201 -73 4 -22 9 146 75 -60 -167 -4 -135
4500 -135 33 228 130 58 -114 3 -81 60 46 -28 -167 37 -87 73 116 149 -71 -201 -19 157 223 -2 56
4523 56 -2 42 -2 -76 50 -223 49 163 156 83 91 -108 -149 91 -58 232 -7 5 -102 43 57 185 143 -34 -149
4548a49J45Q5J20j69j95J66m0K02j76rp0j22J7K75j0M2j95M7o4N1O2J2l5Nj11
4573a16l4K74K3k44J6m6J76J21j82j61J53j2J01J22j31j09j44R3Q6OL7q0O3j01
4597h9J37N7k7p6Qm2L5J06j23n6P4n2O0L5j66J63j26p5J40RK27j74J9j29J56l63
4623b72M99k67L0o5Q2n0R0j34K80k18K2k7J11J40k58Ml3K18j27J75k34L5j49J35
4647a3P0M9j39j26K93r1m5N9k19K16j05j77L02j74J12j25K19m3Q2k3j3K4j48m3
4671e8O5O6l0J37l65K09Jm5P8J3k12J31M3k3ll5J06q0J30P3p8j79k4P4j24J12
4697a8J83j60k9j24j0L27j44O1k39J24J89p2Q4J6k50L9O7QkL6k66N0o7K62J14
4722A79j54j63pJ55R5ML7q5R8l38J63J46j74k2J03o7j7N0J22l30R2P6K44k09N2
$$ plain form
4548 -149 -4 81 201 32 -163 3 -37 165 -11 -20 -90 -212 -195 80 70 112 -83 -36 -100 -49 13 25 -10 -5 -116
4573 -116 -150 124 147 -97 -81 -127 49 170 -12 -173 -20 -32 69 191 60 -49 -193 -100 -14 -8 29 -51 12 -89
4597 -89 48 105 78 2 10 -32 3 109 -14 -70 4 -48 12 47 -119 44 -82 -157 -17 -8 219 45 64 -65 91 -272
4623 -272 227 -40 -10 -75 7 -43 47 -87 193 -25 -3 -30 81 221 -37 -33 -66 152 25 200 -34 1 -148 -13
4647 -13 57 106 -33 -159 134 43 -2 57 -162 54 -51 -228 74 -100 12 -113 106 63 145 122 109 133 -15 -58
4671 -58 7 73 43 180 -185 24 25 -20 58 71 -141 -10 33 10 7 -28 78 -2 128 201 123 -56 -80 -6 -130 -18
4697 -18 165 5 -24 -148 -158 169 25 86 -153 -29 160 88 172 188 -62 -23 44 52 50 86 -180 -130 -197 65 179
4722 179 25 -138 -145 10 105 109 146 61 159 -179 -16 130 -44 -66 37 -30 -47 3 125 -205 -113 -37 207 -2 50
4747E0K00k54Np4J17J44j00j41p9J3R8K5j8o7K71l67K15J08j45J28k54M9K0j2
4771f8J90j50j85K06R3M8o0J0j7K6j69K21j07j35R9j71K44lJ3j38j79R7K52k80
4795a63K74j07j10N0J04mj66J86j28N6l2J70p4k4n2o3J03J30q7m2n8n1j5J11k0
4820a2P4km8J37k10k0J4J96m10J94J07q7J13j28J4j09J55jQ1l1O0q7M4M5k17j1
4846a39K76j79O3P2P1j66j15M5J86j02J22r1j11J40q6q0J04J19j69j43J44J31
4868I2j50K85m26J23J7l4q1K61o8L0j36J48j4J4m3p0K00j05n2k20J03n2R1J62
4892G5k7J53j86j75L25q9m7L2K9j97R1j3j41R8l3J5J0K26r4j43J06R2j93M7k4
4917f3K01j42k57K11Q9J0q9J29j21j71J08O3K63j23j85J20k51J9K60p4j7J83p4
$$ plain form
4747 50 250 -4 1 -73 44 188 88 -53 -132 -119 -21 4 -14 -81 190 -177 38 146 1 129 -125 -76 -56 -68
4771 -68 122 -28 -213 -7 86 134 74 84 67 93 -76 145 38 -97 2 -169 75 72 85 -53 -232 -135 117 -163
4795 -163 111 4 -106 -56 48 44 -122 64 -64 -8 -40 130 56 32 -20 -83 20 150 63 21 -37 -88 -103 8 -12
4820 -12 62 60 12 149 -61 -81 -67 129 -281 -87 20 -67 46 -82 -68 -177 -22 -23 58 27 87 0 44 89 -128 -139
4846 -139 137 -42 21 93 164 -2 -117 -72 114 12 134 43 -68 72 -14 -94 10 129 -40 -183 -39 92
4868 92 -58 227 -199 -76 -59 -93 -174 87 19 49 -87 61 47 61 18 -52 148 43 -9 -229 -126 -178 -87 75
4892 75 48 201 15 -160 165 76 29 61 90 -107 -16 -29 -170 -72 -105 -90 -80 146 52 -91 15 107 -86 -39 -63
4917 -63 138 -4 -261 -50 39 49 -40 89 -32 -203 -95 -32 231 108 -77 43 -208 -189 71 -3 -20 163 89
4940H9j59K15m3j51J02j28L5OL87l76p9o3J53n8L2k3K42k91r8J56K06j78m5K8
4964d1R0L0n3M5j42L8K03J1n6l58l3M11j11m5j01L0m4O0J21L2o1j26PP5O3n3J18
4991A10j64J50q1k4J52j72J98p6k45L05j38J50n0k65p8J80J96O4j20o4p1L5K3
5014A5k78J22J03K0l3Q2J32%n7r6PJ16R1j62j45m5N8K43j10q9J17n6mj27J87j50
5040e9K03Pk61MMR3l5O6j02pJ38j76N7o9J25j17J35J77k68Q5J37p9j01P4K5Nj11
5067e0j06M2K76j53N5j00l8Nl8K1J47N1j54PQ2n8L7m1j7l4J48J26k08J35k17L5
5093d7M4q2J60m3M8q0q0J38J8J34l25J40J04%j03l45K33K43m4j87J35J18j81j28
5117a30J54K05j79r8j02J83m3j89R1J64j3j29K11k10M5J99l8j00N2m0l6l7j95
$$ plain form
4940 89 -70 145 102 -49 53 -75 -40 -34 353 -23 -102 -165 -12 -70 -38 -61 181 -110 -208 -52 154 -24 -69 -41
4964 -41 49 79 26 71 -71 -33 170 181 125 -233 -266 145 34 -11 -112 -82 -126 -66 55 87 26 -100 -93 -18 45 -8 110
4991 110 -54 96 15 -9 143 -29 169 93 -152 153 15 165 115 -150 -228 -48 148 212 92 28 -43 -8 15
5014 15 -263 -141 -38 -18 -51 31 163 163 106 10 17 133 224 62 -83 -128 -70 173 63 -26 91 35 31 -96 91 -59
5040 -59 144 151 -110 -106 -102 -9 -44 22 -80 -87 51 -125 -68 -137 -12 -129 6 183 -85 0 137 58 -43 31 56 61 -50
5067 -50 -156 -114 162 9 64 -36 -74 -69 -107 -86 61 112 -42 -35 47 -11 26 -15 -32 -66 82 208 0 135 -82 -47
5093 -47 -3 -85 75 32 80 0 -80 58 76 210 -115 25 129 129 26 -319 -86 157 113 -74 61 179 -2 -130
5117 -130 24 229 50 -48 -150 33 -10 -199 -108 56 43 -86 125 -85 -40 159 121 21 73 33 -3 -40 -235
5140b35J72P8m9P9q1l1P3p0J75Mj61J00k55J90m6P4O5J1k49k2J84l2o0j7O3J14
5166G4r8Q5m9o3J0J2M9o5P3nl7k5M4j55K87l8j19k3j03J50k7K1O8k25J13J42Q9
5193A85j74o0J63R3j16j05O1j47J46j20n1J84l8J37r6n1pK8o2JK07k37o4R2J06
5218G5p8n0p3J17k4L4P5j45M6n8K33k00JJ08n7J16Om2k24R4rJ14M7j02j05M5O
5245e0J79Pm2p0r6J05O2j27n1O1J40j98J12J1j16k9N1J62j47J28k7j24K28q7n6
5270B6Q8N7j32N0o2j20J17r3j16J28k1J81l3Nn6K9j05Q9r4J21j62J01Q5k05J14
5295hJ17m2j21L07k88R3o3k1Q7j0o0J42r7j05K49j99J04p8OM2O6K9J3m6j12J78
5321A83k82J06N1J15j10j40J43n7J49l69K58l9J22k31%J3K29lq3Ol9l6L4K31j49
$$ plain form
5140 -235 -63 15 -34 45 -36 -67 6 -64 111 115 -46 54 -201 -11 -57 17 82 93 -156 -178 6 -26 -86 -103 -40 74
5166 74 -24 61 12 -51 -41 -29 20 -45 28 23 -14 -39 5 -150 137 99 -20 -43 -146 4 -23 -2 66 -159 -46 96 185
5193 185 11 -49 114 207 91 -14 47 -100 46 -74 -125 59 21 158 62 11 4 32 -30 -29 178 -59 -123 -31 75
5218 75 -3 -53 -126 -9 -33 1 76 -69 -23 -81 152 -48 -47 61 4 120 126 84 -140 -46 -55 59 106 4 -101 -56 -50
5245 -50 129 136 94 24 -72 33 95 -32 -83 -22 118 -80 32 43 -73 -102 -51 111 -36 92 65 -59 169 82 26
5270 26 114 171 39 89 27 -93 24 -69 -185 -57 -78 103 70 75 19 48 -57 32 -62 59 -103 -2 83 -122 -8
5295 -8 109 67 -54 253 -35 58 -5 -26 61 51 -9 133 36 -69 180 -19 85 7 13 55 121 150 163 117 5 183
5321 183 -99 7 58 173 63 -77 66 9 158 -211 47 8 130 -101 -101 -88 141 138 55 61 22 -14 20 251 102
5346A02k04J8J14j69K51p1p9J64k76L7L46j86j18J67o8j49J51l11M63q5NK8j09
5369B1k2K5p4Lj0N5J25j68j83L05M3j16J03j40J40K7j02l2R4m8k2o1M7l9k6Q1
5395B6j21J93P8Pl18J87K8j99N8k0K31j74J0j10K0K26J7o1l0j54L08p0k49J88
5419G1j80nM0P3M6j98J09j1k0J96j25J29lK6j35J04k55L89k54P2l3m8J38k17K3
5444f8K35j06q4O9j95J30Pnj23K64Km5M6j41K2O3j19K57l10J25M3Nl86M04j02
5469a2O2j85J18J72r1n2O9j04lK01p8q2j11O7J81l62J43J29pK3k34M79k22m9j38
5494h6Q9j3o6k9O2l1J17p0J39j34J20o8k1l4K29P9m19N8P3K1j30Q7K37l06O6j50
5520a80K01r4Q5m7M5J30j64K9q4K2Q7j00J26n3Q1j51J72j22J32j85J33k58J88
$$ plain form
5346 102 -102 -84 30 -139 112 41 -38 126 -150 -113 233 47 -71 96 28 -121 30 -281 182 97 102 130 21
5369 21 -1 24 -50 -47 -57 -2 123 -45 -228 77 120 4 107 -33 107 134 32 0 94 46 24 -37 10 -29 -55 26
5395 26 -95 98 176 183 -135 52 80 -119 -61 -81 150 -24 -14 -124 -104 122 139 78 48 -106 202 132 -117 71
5419 71 -109 -114 -74 -1 45 -153 -44 -55 -75 121 -4 125 122 148 13 117 -138 251 -3 69 36 -12 126 -91 -68
5444 -68 167 61 -23 46 -149 -19 -12 -17 -140 124 126 81 127 -14 8 71 -48 209 -101 24 67 72 -314 90 -12
5469 -12 50 -135 -17 155 64 12 81 -23 -26 175 97 15 -96 -29 152 -210 -67 62 55 78 -156 323 101 52 -86
5494 -86 3 -10 -76 -105 -43 -74 43 -27 112 -22 98 30 9 -25 204 283 -136 -78 -5 16 -114 -27 210 -96 -30 -180
5520 -180 21 -73 12 -35 10 140 -24 5 -79 -57 30 -70 56 3 84 -67 105 -17 115 -70 63 -195 -7
5543gK1k83L48j9k23J45M8Jj9J4M2o8l0k04K53j03o4Q3j0J38n5P9p5k8k21K80
5569D3J45j54o2Q3k32N6J87j15O3K0m7Qp3J03N1l7j10J43Ko6L5j36K44j60N8k16
5595a67K01m5j4L1l0k5K16l3j77K3M3M9O3r2R1j65m3J46k3j46K34j40j06J32J77
5620B00j90j60J89k0N0M1k1P0l28J37lJ16j04L6L1j30J92K6M4l01K83j27j97K25
5644E9K10j81n5q3P6N4j65J71QQ7k61J12r7J60n8J2n7n1L8M7l9K03j88J86k47
5669e9J70J13rl76J21K07k26P6j3K1Mj28K38l3lk2P1k35L7R3o2k9j22J41n5M9
$$ plain form
5543 -7 14 -269 79 60 -163 -18 30 31 12 26 68 0 -30 -234 19 -84 -148 -65 -75 63 8 87 12 -16 -237 43
5569 43 188 34 -28 55 -177 -121 66 -49 14 34 -13 -5 -78 25 76 39 -71 72 74 8 43 -93 151 -9 49 -167
5595 -167 34 -11 -25 6 -24 -49 167 134 -43 -20 23 72 135 43 134 -31 -74 72 49 -97 137 -3 -109 23 200
5620 200 10 -150 39 19 69 110 89 159 -169 -32 -35 81 -23 13 44 -86 106 132 176 -125 158 31 -166 59
5644 59 269 88 33 -50 26 80 -85 86 94 181 -80 32 -65 95 37 49 -8 -59 -21 26 -13 190 2 188 -59
5669 -59 111 224 215 -161 -40 167 -59 17 4 25 29 -99 139 106 103 81 152 -83 -46 47 -15 -44 -166 -25 -80 -31
$$ [...]
8191G3
##END NTUPLES=NMR FID
##END=
