##TITLE=1H_Alant-acid-L2-part
 CDCl3, 8 sc, 
 2.9.2021
##JCAMPDX= 6.0         $$ Bruker NMR JCAMP-DX V2.0
##DATA TYPE= NMR FID
##DATA CLASS= NTUPLES
##ORIGIN= UXNMR, Bruker Analytische Messtechnik GmbH
##OWNER= root
$$ XWIN-NMR		Version 3.5
$$ Thu Sep  2 09:11:41 2021 Russian Standard Time (UT+4h)  she@DPX200
##.OBSERVE FREQUENCY= 200.1312
##.OBSERVE NUCLEUS= ^1H
##.DELAY= (6, 6)
##.ACQUISITION MODE= SIMULTANEOUS
##.ACQUISITION SCHEME= undefined
##.AVERAGES= 8
##.DIGITISER RES= 18
##SPECTROMETER/DATA SYSTEM= spect
##.PULSE SEQUENCE= zg30
##.SOLVENT NAME= CD2Cl2
##.SHIFT REFERENCE= (INTERNAL, CD2Cl2, 0, 15.7039)
##AUDIT TRAIL= $$ (NUMBER, WHEN, WHO, WHERE, WHAT)
$$ ##TITLE= Audit trail, XWIN-NMR		Version 3.5
$$ ##JCAMPDX= 5.01
$$ ##ORIGIN= Bruker BioSpin GmbH
$$ ##OWNER= she
$$ F:/spectra/data/she/nmr/H-F/1/audita.txt
$$ ##AUDIT TRAIL=  $$ (NUMBER, WHEN, WHO, WHERE, WHAT)
(   1,<2021-09-02 09:10:16.82 +0400>,<she>,<DPX200>,
      <created by zg, POWCHK disabled, PULCHK disabled
       configuration hash MD5:
       00 E9 B6 7A A2 85 ED C7 34 08 36 98 17 FE 4E 26
       data hash MD5: 16K
       A4 E2 2D C8 42 16 38 4D 47 4B 0B 79 78 E1 75 21>)
$$ ##END=
$$ 
$$ hash MD5
$$ DA F8 0F B8 1F DD D6 05 C7 AA 6F 09 47 A8 13 75
##$RELAX= 
##$RELAX= 
##$RELAX= 
##$RELAX= 
##$RELAX= 
##$RELAX= 
$$ Bruker specific parameters
$$ --------------------------
##$DU= <F:/spectra>
##$EXPNO= 1
##$NAME= <H-F>
##$PROCNO= 1
##$TYPE= <nmr>
##$USER= <she>
##$AMP= (0..31)
100 100 100 100 100 100 100 100 100 100 100 100 100 100 100 100 100 100 
100 100 100 100 100 100 100 100 100 100 100 100 100 100 
##$AQSEQ= 0
##$AQ_mod= 1
##$AUNM= <au_zg>
##$AUTOPOS= <>
##$BF1= 200.13
##$BF2= 200.13
##$BF3= 200.13
##$BF4= 200.13
##$BF5= 200.13
##$BF6= 200.13
##$BF7= 200.13
##$BF8= 200.13
##$BYTORDA= 1
##$CFDGTYP= 0
##$CFRGTYP= 5
##$CHEMSTR= <none>
##$CNST= (0..31)
1 1 145 1 1 1 1 1 1 1 1 1 1 1 1 1 1 1 1 1 1 1 1 1 1 1 1 1 1 1 1 1 
##$CPDPRG= <>
##$CPDPRG1= <>
##$CPDPRG2= <>
##$CPDPRG3= <>
##$CPDPRG4= <mlev>
##$CPDPRG5= <mlev>
##$CPDPRG6= <mlev>
##$CPDPRG7= <mlev>
##$CPDPRG8= <mlev>
##$CPDPRGB= <>
##$CPDPRGT= <>
##$D= (0..31)
0 1.2 0 0 0 0 0 0 0 0.06 0 0.03 0 0 0 0 0.0002 0 0 0 0 0 0 0 0 0 0 0 0 
0 0 0 
##$DATE= 1630559416
##$DBL= (0..7)
120 120 120 120 120 120 120 120 
##$DBP= (0..7)
150 150 150 150 150 150 150 150 
##$DBP07= 0
##$DBPNAM0= <>
##$DBPNAM1= <>
##$DBPNAM2= <>
##$DBPNAM3= <>
##$DBPNAM4= <>
##$DBPNAM5= <>
##$DBPNAM6= <>
##$DBPNAM7= <>
##$DBPOAL= (0..7)
0.5 0.5 0.5 0.5 0.5 0.5 0.5 0.5 
##$DBPOFFS= (0..7)
0 0 0 0 0 0 0 0 
##$DE= 6
##$DECBNUC= <off>
##$DECIM= 32
##$DECNUC= <off>
##$DECSTAT= 4
##$DIGMOD= 1
##$DIGTYP= 9
##$DL= (0..7)
0 120 120 120 120 120 120 120 
##$DP= (0..7)
150 150 150 150 150 150 150 150 
##$DP07= 0
##$DPNAME0= <>
##$DPNAME1= <>
##$DPNAME2= <>
##$DPNAME3= <>
##$DPNAME4= <>
##$DPNAME5= <>
##$DPNAME6= <>
##$DPNAME7= <>
##$DPOAL= (0..7)
0.5 0.5 0.5 0.5 0.5 0.5 0.5 0.5 
##$DPOFFS= (0..7)
0 0 0 0 0 0 0 0 
##$DQDMODE= 0
##$DR= 18
##$DS= 0
$$ [...]
##$SUBNAM2= <"">
##$SUBNAM3= <"">
##$SUBNAM4= <"">
##$SUBNAM5= <"">
##$SUBNAM6= <"">
##$SUBNAM7= <"">
##$SUBNAM8= <"">
##$SUBNAM9= <"">
##$SW= 20.0189188712717
##$SWIBOX= (0..15)
0 0 2 0 0 0 0 0 0 0 0 0 0 0 0 0 
##$SW_h= 4006.41025641026
##$TD= 16384
##$TD0= 1
##$TE= 0
##$TE2= 300
##$TE3= 300
##$TEG= 300
##$TL= (0..7)
0 120 120 120 120 120 120 120 
##$TP= (0..7)
150 150 150 150 150 150 150 150 
##$TP07= 0
##$TPNAME0= <>
##$TPNAME1= <>
##$TPNAME2= <>
##$TPNAME3= <>
##$TPNAME4= <>
##$TPNAME5= <>
##$TPNAME6= <>
##$TPNAME7= <>
##$TPOAL= (0..7)
0.5 0.5 0.5 0.5 0.5 0.5 0.5 0.5 
##$TPOFFS= (0..7)
0 0 0 0 0 0 0 0 
##$TUNHIN= 0
##$TUNHOUT= 0
##$TUNXOUT= 0
##$USERA1= <user>
##$USERA2= <user>
##$USERA3= <user>
##$USERA4= <user>
##$USERA5= <user>
##$V9= 5
##$VALIST= <valist>
##$VCLIST= <CCCCCCCCCCCCCCC>
##$VD= 0
##$VDLIST= <DDDDDDDDDDDDDDD>
##$VPLIST= <PPPPPPPPPPPPPPP>
##$VTLIST= <TTTTTTTTTTTTTTT>
##$WBST= 1024
##$WBSW= 4
##$XGAIN= (0..3)
0 0 0 0 
##$XL= 0
##$YL= 0
##$YMAX_a= 256993
##$YMIN_a= -306853
##$ZGOPTNS= <>
##$ZL1= 120
##$ZL2= 120
##$ZL3= 120
##$ZL4= 120
##$ABSF1= 10
##$ABSF2= 0
##$ABSG= 5
##$ABSL= 3
##$ALPHA= 0
##$AQORDER= 0
##$ASSFAC= 0
##$ASSFACI= 0
##$ASSFACX= 0
##$ASSWID= 0
##$AUNMP= <proc_1d>
##$AZFE= 0.1
##$AZFW= 0.1
##$BCFW= 1
##$BC_mod= 2
##$BYTORDP= 1
##$COROFFS= 0
##$CY= 11.3945322036743
##$DATMOD= 1
##$DC= 2
##$DFILT= <>
##$DTYPP= 0
##$F1P= 2.36226072786647
##$F2P= -0.459571619588291
##$FCOR= 0.5
##$FTSIZE= 0
##$FT_mod= 4
##$GAMMA= 1
##$GB= 0.15
##$INTBC= 1
##$INTSCL= 1
##$ISEN= 128
##$LB= 0.24
##$LEV0= 0
##$LPBIN= 0
##$MAXI= 10000
##$MC2= 0
##$MEAN= 0
##$ME_mod= 0
##$MI= 1.114404
##$NCOEF= 0
##$NC_proc= 0
##$NLEV= 6
##$NOISF1= 3.799351
##$NOISF2= 2.8
##$NSP= 1
##$NTH_PI= 0
##$NZP= 0
##$OFFSET= 15.70392
##$PC= 1
##$PHC0= -13365.5
##$PHC1= 20.60097
##$PH_mod= 1
##$PKNL= yes
##$PPARMOD= 0
##$PSCAL= 0
##$PSIGN= 0
##$REVERSE= no
##$SF= 200.130013532006
##$SI= 16384
##$SIGF1= 3
##$SIGF2= 2
##$SINO= 400
##$SIOLD= 16384
##$SREGLST= <1H.CDCl3>
##$SSB= 0
##$STSI= 0
##$STSR= 0
##$SW_p= 3612.71676300578
##$SYMM= 0
##$S_DEV= 0
##$TDeff= 0
##$TDoff= 0
##$TI= <>
##$TILT= no
##$TM1= 0
##$TM2= 0
##$TOPLEV= 0
##$USERP1= <user>
##$USERP2= <user>
##$USERP3= <user>
##$USERP4= <user>
##$USERP5= <user>
##$WDW= 1
##$XDIM= 8192
##$YMAX_p= 0
##$YMIN_p= 0
$$ End of Bruker specific parameters
$$ ---------------------------------
##NTUPLES= NMR FID
##VAR_NAME=  TIME,          FID/REAL,        FID/IMAG
##SYMBOL=    X,             R,               I
##VAR_TYPE=  INDEPENDENT,   DEPENDENT,       DEPENDENT
##VAR_FORM=  AFFN,          ASDF,            ASDF
##VAR_DIM=   8192,          8192,            8192
##UNITS=     SECONDS,       ARBITRARY UNITS, ARBITRARY UNITS
##FACTOR=    0.0002496,     1,               1
##FIRST=     0,             0,               0
##LAST=      2.0444736,     0,               0
##MIN=       0,             -306853,         0
##MAX=       2.0444736,     256993,          0
$$ Real data points
##PAGE= N=1
##DATA TABLE= (X++(R..R)), XYDATA
0@%%%%%%%%%%qJ6j6J6k4L2m0M8n6P2q8J04j27J51j76K08k41K80l26L75m29M90
$$ 0 0 0 0 0 0 0 0 0 0 0 -8 8 -8 8 -16 16 -24 24 -32 40 -48 56 -71 80 -96 112 -129 151 -175 200 -229 261
32B61n59O36p20Q12r13J023j145J281j428J590j767J959k169K399k648K919l219
$$ 261 -298 338 -382 430 -483 540 -605 676 -752 838 -929 1030 -1139 1260 -1388 1531 -1688
49a688L549l910M307m746N231n772O381p069P850q750R801j1042J2535j4376J6710
$$ -1688 1861 -2049 2258 -2488 2743 -3029 3352 -3717 4133 -4617 5184 -5858 6677 -7699 9011
64I011j9777K4013l0287M0656o1828J80036k93086N301M02954m57130Q8340L43521
$$ 9011 -10766 13247 -17040 23616 -38212 141824 -151262 -145961 256993 -200137 -111797 231724
76B31724l06630k2368K85240k83724o675K21582j70462k571J42186j96556L1563
$$ 231724 -74906 -97274 187966 -95758 -102433 119149 -51313 -53884 88302 -108254 -76691
87g6691J49011j15273J908P8295p5895M8898J7505n8583P3894j6794o7424Q1287
$$ -76691 72320 -42953 -41045 37250 -38645 10253 27758 -30825 43069 26275 -41149 40138
99D0138o7518m4643J59793n3325q0399J45232o1893p1178J27605j25450q8144
$$ 40138 -27380 -72023 87770 34445 -45954 99278 37385 -33793 93812 -31638 -119782
110a19782K01206p9956j00513K12368o1470j47691J58474o3110j37012J87157
$$ -119782 81424 1468 -99045 113323 51853 -95838 62636 -474 -137486 49671
120D9671Q065j29878R6450m1382q6562J39129k8381p3702J51382l8438j31298
$$ 49671 57736 -72142 24308 -17074 -103636 35493 7112 -66590 84792 46354 -84944
131h4944J08341j539r3656J06948J3819j14699N0178O3908l0329R848J1714j8812
$$ -84944 23397 21858 -71798 35150 48969 -65730 -15552 48356 18027 27875 39589 20777
143B0777j9258l1649K743K0462Q478L8530o045n1754J9228R056l5580K5273P039
$$ 20777 1519 -30130 -27387 -6925 1553 40083 34038 -17716 1512 10568 -25012 261 7300
156G300l3571L6761M505o2737K0395L8969k9400Q027L2639j5196k464Q883l5562
$$ 7300 -26271 10490 14995 -47742 -27347 11622 -17778 -9751 22888 7692 5228 14111 -21451
169b1451k3263K9228J7336m332K0047L853k3222K2748P447n3577K2523M3883o6945
$$ -21451 -44714 -15486 1850 -2482 17565 21418 -1804 20944 28391 -25186 -2663 41220 -25725
182b5725j1039O6502k9316J404O5139n9860m6000O0661k7668k5712O5004k1001
$$ -25725 -36764 29738 422 1826 66965 7105 -38895 21766 -5902 -31614 33390 12389
194A2389l0555L5708m9370k4206P7722l923k0262L7967l9756l2569L3122k6397
$$ 12389 -18166 17542 -31828 -56034 21688 17765 -2497 35470 -4286 -36855 -3733 -30130
206c0130n792M7107j2214M700K1194l8710J7408L0300n3125M993K9479l8933K7787
$$ -30130 -35922 11185 -1029 3671 24865 -13845 3563 33863 -19262 -14269 15210 -23723 4064
219D064K8657m9452L2929K8023o1249K7070J9928o1001M5358K2796p9416M4042
$$ 4064 32721 -16731 16198 44221 -17028 10042 29970 -31031 14327 37123 -42293 1749
231A749L5280q1263L3625L9637o5963M6802M2827q3053J2174K6804o8099K8742
$$ 1749 37029 -44234 -10609 29028 -36935 9867 52694 -30359 -18185 8619 -59480 -30738
243c0738M3778l6590M3180K2356o6639J7429J4809m0702M1950J2725m7026L9903
$$ -30738 13040 -23550 19630 41986 -24653 -7224 7585 -33117 8833 21558 -25468 14435
255A4435Q306m6758M2514J3448l7579L3700q948m2430L9534k034k9187L6497k4992
$$ 14435 22741 -24017 18497 31945 -5634 28066 19118 -23312 16222 14188 -14999 21498 -3494
268c494k7639N5168k5367k5556P0078l1074n1350N5305l5686n0723Q0654l653
$$ -3494 -31133 24035 -1332 -26888 43190 12116 -39234 16071 -19615 -70338 10316 6663
280F663m6924O9999l946n7751M3773j1344m4614N5100J335l5038M8270q508l8690
$$ 6663 -40261 29738 25792 -31959 11814 470 -44144 10956 12291 -22747 25523 17015 -21675
293b1675M6203q999l4934N4347l840m8784L3876k115m1065L3025R772l0116K1713
$$ -21675 24528 15529 -19405 34942 31102 -17682 16194 14079 -26986 6039 15811 -14305 7408
306G408P401j9498J0895m817q581N948k5640l248K7196j6324J2186M0187l4393
$$ 7408 14809 -4689 6206 1389 -7192 -1244 -26884 -30132 -2936 -19260 -7074 33113 -1280
319a280j4873L3024l8483j4706N2808j7322j2440M4098k9440k0729M4469k4146
$$ -1280 -16153 16871 -21612 -36318 16490 -832 -13272 30826 1386 -19343 25126 980
331I80j1756N1593l1982k2400M8362m0810k9463O4673k5634l2799O7892j9321
$$ 980 -10776 40817 8835 -13565 34797 -6013 -35476 29197 3563 -29236 38656 19335
343A9335m7464N4201j3469n2317M2306j174l9081L6378P293j9875K9080p689j9343
$$ 19335 -28129 26072 12603 -39714 2592 1418 -37663 -1285 6008 -13867 15213 7524 -11819
356a1819J7848k3440p172L4668j9986l13L8489l3097j1647L8510k8917m403M5374
$$ -11819 6029 -17411 -24583 10085 -9901 -10214 28275 -4822 -16469 22041 -6876 -11279 34095
369C4095k8942j1088L0914m0012m467L9909l3898J0596M7410m8292j083M2638
$$ 34095 5153 -5935 24979 -15033 -19500 20409 -13489 -2893 44517 -3775 -4858 37780
381C7780n9670n628N6199n1712o556O4598m3324j3829N7910m0494k0949M7826
$$ 37780 -21890 -27518 28681 -23031 -29587 35011 -8313 -22142 35768 -4726 -25675 22151
393B2151l5954j6545M5287k5539n683L8950l1215o215L3322l0656K025L6729k9209
$$ 22151 -13803 -30348 14939 -10600 -16283 22667 -8548 -14763 18559 -12097 -10072 26657 -2552
406b552j983K4208l5539k364L0418j7907J1166K4254k3673L162N664l1181J1790
$$ -2552 -4535 19673 -15866 -18230 12188 -5719 5447 29701 6028 9190 14854 -16327 -4537
419d537J0768k4277K3659J1871l1820K3890J1464m0685J8172J4037l8435J7720
$$ -4537 6231 -18046 5613 17484 -14336 9554 21018 -19667 -1495 12542 -25893 -8173
431h173K0054l3436J5112J9885l1858J0384J8908k4336J2327J7134k6035O231
$$ -8173 11881 -21555 -6443 13442 -18416 -8032 10876 -13460 -1133 16001 -10034 -3803
443c803J3415k5063N784J8590j3234J0130J9817j5906l753P878j8220o723J2652
$$ -3803 9612 -15451 -9667 8923 -4311 5819 25636 9730 5977 13855 -4365 -11088 1564
456A564j784K658J2166n146q307L455n071n551M135r06l806L152l232m285O763
$$ 1564 -220 2438 14604 9458 1151 4606 -465 -6016 -1881 -2787 -6593 -3441 -6673 -10958 -4195
471d195p87l585Q453k194m980J2146n487j1147J1408n214r508K1016J613o981
$$ -4195 -4982 -8567 -114 -2308 -7288 4858 -629 -11776 -368 -5582 -15090 5926 7539 558
485E58K3033p005k1726J5967q290j8356K6331k346j5749K8389o869k3913K4694
$$ 558 23591 16586 -5140 10827 2537 -15819 10512 8166 -7583 20806 13937 -9976 14718
498A4718j0959k3409L0003r992k1768L3048j2585k5498L3216j1400k0944L9555
$$ 14718 3759 -19650 10353 361 -21407 11641 -944 -26442 6774 -4626 -25570 13985
510A3985r614k4289L4004j5985k5357L4390j3712j4324M0005j4507j2823L8725
$$ 13985 4371 -19918 14086 -1899 -27256 7134 -6578 -20902 19103 4596 -8227 30498
522C0498k4953j7667L6231l1072j3520M6522k6732j0015M6490l3405j6120M0827
$$ 30498 5545 -12122 24109 -6963 -20483 26039 -693 -10708 35782 2377 -13743 27084
534B7084l5105j1640M4529l3494q500L9393l8972m728M1416l8926K782M3088m1934
$$ 27084 -8021 -19661 24868 -8626 -17126 22267 -16705 -21433 19983 -18943 -16161 26927 -15007
547a5007L64M0968m7074j685M1557m2184O652M4680l6013O295L5189m5801M749
$$ -15007 -14643 26325 -20749 -22434 19123 -23061 -16409 28271 -7742 -1447 33742 -12059 -7310
560g310K9018m1867J5757L1358m1774K0249K5037m7914K0617K3213m8735K2662
$$ -7310 21708 -20159 -4402 26956 -14818 5431 30468 -17446 3171 26384 -22351 311
572C11K3402m6704K2999J9170m4523K3444J6416l9165K9328J2698l7055K7137
$$ 311 23713 -22991 8 19178 -25345 -1901 14515 -24650 4678 17376 -19679 7458
584G458L989m0950K9842M385l5857L9486P914l5543L4495K512l9080K7654J386
$$ 7458 11447 -29503 339 4724 -31133 8353 16267 -19276 15219 17731 -21349 6305 7691
597G691l1409L0897L740k3861K9134n249k3962K8099r512k0811L1417q289k1408
$$ 7691 -23718 7179 10919 -12942 16192 10943 -13019 15080 5568 -15243 16174 7885 -13523
610a3523K7562j1464k1671K8842o843j5433K5914q014j4443J8918j4171j1366
$$ -13523 14039 2575 -19096 9746 2903 -12530 13384 5370 -9073 9845 -4326 -15692
622a5692J8512j1942m793K2222r780k591J7631j6303o694J3510j2621j959J7667
$$ -15692 2820 -9122 -13915 8307 -1473 -4064 13567 -2736 -9430 4080 -8541 -10500 7167
635G167r659J280J3356j2086l250R614o637J518O452n928J443K547j0321K893
$$ 7167 -2492 -1212 12144 58 -3192 6422 -215 1303 7755 1827 3270 5817 -4504 -1611
649a611N172m119O224L585o410r33r72o050j987k48K841K354r34M153R71n916
$$ -1611 3561 -558 5666 9251 2841 1908 936 -5114 -7101 -7349 -4508 -2154 -3088 1065 2036 -3880
665c880L345k140q405O010J968l889Q749Q27m191Q441n787o741J3285m120m181
$$ -3880 -535 -2675 -11080 -5070 -3102 -6991 1758 2585 -1606 6835 1048 -5693 7592 3472 -709
680g09J4130r718r133J5028j0704o336K2004q014o961J7823j6974j2138J8073
$$ -709 13421 3703 -5430 9598 -1106 -7442 14562 6548 -413 17410 436 -11702 6371
693F371j3694p166K2107j1673l688J9353j7917n141J8732j8144k472J9820j8375
$$ 6371 -7323 -14489 7618 -4055 -7743 11610 -6307 -11448 7284 -10860 -13332 6488 -11887
706a1887J797K1610k0468L141K0098k1704M084J7026k1113R364J7318k6605O886
$$ -11887 -10090 11520 -8948 -5807 14291 -7413 -3329 13697 -7416 1948 19266 -7339 -453
719d53J5519k6295J2582J8488k5282J2870J4318l2723P897J2375k8619J6219J6269
$$ -453 15066 -11229 1353 19841 -5441 7429 21747 -10976 -3079 9296 -19323 -3104 13165
732A3165k6923J5734J2023l0885J2720J1216k7042J7543J1057k7674J7934J0171
$$ 13165 -13758 1976 13999 -16886 -4166 7050 -19992 -2449 8608 -19066 -1132 9039
744I039k6063J9557Q414k4993K0354O010k5990K0818N573k4582J9912K041k4047
$$ 9039 -17024 2533 10947 -14046 6308 12318 -13672 7146 12719 -11863 8049 10090 -13957
757a3957K3975L778k2088K2513q41k5139J8597m562k1920K5865L15j7764K2557
$$ -13957 10018 13796 -8292 14221 13380 -11759 6838 2276 -19644 6221 6536 -11228 11329
770A1329n883k1837K0930n879j7594K4662l611j6690K0376o748j4464K2249m872
$$ 11329 5446 -16391 4539 -1340 -18934 5728 2117 -14573 5803 -945 -15409 6840 1968
783A968j2192K0615p095j2567J7975q296r395J8929p751r311J8385p007p434J7142
$$ 1968 -10224 10391 3296 -9271 8704 408 -8987 9942 2191 -7120 11265 4258 -3176 13966
797A3966j0146r730J4101j0869p849J7282n666m506J5690j1373r632J3099r017
$$ 13966 3820 -5910 8191 -2678 -10527 6755 1089 -3417 12273 900 -8732 4367 -4650
810d650o533J6615n712p450J3233q772r174J5263k840o132J3499n263r711J0802
$$ -4650 -11183 5432 -280 -7730 5503 -3269 -12443 2820 -20 -6152 7347 2084 -7627 3175
824C175m705p238J2818j106o833J0604k130p395R533j958q572P425k151o491Q610
$$ 3175 -1530 -8768 4050 2944 -3889 6715 4585 -2810 6723 4765 -3807 3618 1467 -5024 3586
839C586j25l591P979l350o735L657l640k794P307j589l446O258p205m266P810
$$ 3586 3461 -130 7849 4499 -2236 1421 -2219 -5013 2294 705 -2741 3517 -3688 -7954 -144
854a44l414q35J1162o870n867P686p935l481J2764l454l606J3448q675o545J2841
$$ -144 -3558 -4393 6769 -101 -5968 1718 -6217 -9698 3066 -388 -3994 9454 779 -5766 7075
869G075o633n332J3146o960p373J4868m815p723J4865n308j0639J1419n462r617
$$ 7075 442 -4890 8256 1296 -6077 8791 3976 -3747 11118 5810 -4829 6590 1128 -8489
883h489J4146k394q239R455m675q871R356k684l559J0642m765o304N333n656k810
$$ -8489 5657 3263 -4976 4479 -196 -9067 289 -2395 -5954 4688 -77 -6381 -1048 -6704 -9514
898i514J0033k106p14Q679n474l052L942m225J497N528l874J373M978p093K988
$$ -9514 519 -1587 -2301 6378 904 -2148 1794 -2431 -934 4594 720 2093 7071 -22 2966
913B966M551p170L970L861j0959K711O157r376K625P260j0062j091P025q291J263
$$ 2966 7517 347 4317 8178 -2781 -70 6087 -3289 -664 6596 -3466 -4557 2468 -5823 -4560
928d560Q266o994j493M971q488r01Q487k335Q48P745n208m181M702l066j701P310
$$ -4560 3706 -3288 -4781 190 -8298 -9199 -712 -3047 -2199 5546 338 -3843 859 -2207 -3908 3402
944C402J432l106K926j66m368K049L307k213Q0R07k695j848J008m0K53n8r78p99
$$ 3402 4834 1728 4654 4488 120 2169 5476 3263 3343 4250 1555 -293 715 675 928 870 -108 -907
962i07j594q41K488j99k235J503k657l192M884J068j450O778k047o321N051k324
$$ -907 -2501 -3342 -854 -1053 -3288 -1785 -4442 -7634 -2750 -1682 -3132 3646 1599 -4722 329 -1995
978a995m237J0252K00n918R191l152r684J0552m66q421J1900j305j2179J0192
$$ -1995 -6232 4020 4220 -1698 7493 4341 -5343 5209 4743 -3678 8222 6917 -5262 4930
992D930j503j1181J2235P96j1490J0512j201j1808R934j36q959R904k417q976
$$ 4930 3427 -7754 4481 5277 -6213 4299 3098 -8710 1224 1088 -7871 2033 -384 -9360
1006i360J0168k486o129J2997m492o806R686p209m625J3285m959k257J2215j0694
$$ -9360 808 -1678 -7807 5190 698 -6108 3578 -3631 -8256 5029 70 -2187 10028 -666
1020f66m482J2894j0342j222J6831j2681l229J3892j6039j485J6869j2561j299
$$ -666 -5148 7746 -2596 -3818 13013 332 -2897 10995 -5044 -6529 10340 -2221 -3520
1033c520J6032j7134k197J7890j7297j124J9200j6720m240J8646j6222q64J6666
$$ -3520 12512 -4622 -6819 11071 -6226 -7350 11850 -4870 -9110 9536 -6686 -7550 9116
1046I116j3216k733J4004j4574P49J2967j3685N921Q995j4464N252Q392j4185
$$ 9116 -4100 -6833 7171 -7403 -6654 6313 -7372 -1451 7544 -6920 -1668 6724 -7461
1059g461P417R524j5465R777M966j6987Q882O069j4194J2928N713j8259J1117
$$ -7461 -44 9480 -5985 3792 8758 -8229 653 6722 -7472 5456 11169 -7090 4027
1072D027K155j6197J3160M783j7605J4694J988j9223J2987M141j6532J4147L654
$$ 4027 6182 -10015 3145 7928 -9677 5017 7005 -12218 769 4910 -11622 2525 6179
1085F179j8419J1585L788j4118J2106M052j1681P409l86q165J0083j89m719R465
$$ 6179 -12240 -655 3133 -10985 1121 5173 -6508 901 515 -7650 2433 2244 -2475 6990
1099F990n577o545J0325m374l488J1111m644n027P624o785j787P916o947J221
$$ 6990 1413 -5132 5193 819 -2669 8442 3798 -1229 6395 -390 -2177 5739 -1208 13
1113A3P257j0310P33P828j1435O33J0653j0568j38J0516j0156k660R887o258j340
$$ 13 7270 -3040 -2307 5521 -5914 -5281 5372 -5196 -5334 5182 -4974 -7634 2253 -4005 -5345
1128e345Q933n051l320N480k362k12M872n82r37J56k021J325J410J367J718j753
$$ -5345 3588 -1463 -4783 697 -1665 -1877 2995 2413 1476 1632 -389 936 2346 3713 5431 3678
1144C678k246n28j516K594J951k795K047j592p305M155L632o984M895M211j1493
$$ 3678 1432 904 -612 1982 3933 1138 3185 1593 -5712 -1557 2075 -4909 -14 4197 -7296
1159g296K626O135p363K234N891n937M42L185l513L531J706l542L764k51l994
$$ -7296 -4670 1465 -5898 -3664 2227 -3710 -3268 -83 -3596 -65 1641 -1901 1863 1612 -2382
1174b382O003r21m459O864j263m727O279l142k916N349m931m98P082p115j833
$$ -2382 3621 2700 -1759 5105 3842 -885 5394 2252 -664 4685 -246 -744 6338 -777 -2610
1189b610P907j0968m17J2563r742j075J1585j4112k885J3973r744j724J5453j0489
$$ -2610 5297 -5671 -6088 6475 -3267 -4342 7243 -6869 -9754 4219 -5525 -7249 8204 -2285
1203b285o060J2486q078j411J3840q368k445Q379r555J19J0623p595J606O811
$$ -2285 -8345 4141 -3937 -5348 8492 124 -2321 6058 -3497 -3378 7245 -350 1256 8067
1217H067j1151J448P926p760K870N648j0498L201L447q437O687K781r868P775
$$ 8067 -3084 -1636 6290 -1470 1400 7048 -3450 -249 3198 -5239 1448 4229 -5639 2136
1231B136j84j0488J0303J179j2375J0791R50j1735J2361P43j2329J0935Q83j0853
$$ 2136 1952 -8536 1767 2946 -9429 1362 2312 -9423 2938 3681 -8648 2287 3170 -7683
1245g683J1144J882j3056J0859J202j1987J1719J963j0833R442j37j2379R979
$$ -7683 3461 5343 -7713 3146 4348 -7639 4080 6043 -4790 4652 4515 -7864 2115
1258B115J692q354J0015p24j0642Q174m45n908R016k122p219N855m192k679Q634
$$ 2115 3807 -4547 5468 4744 -5898 2276 1831 -4077 4939 2817 -4402 1453 -2739 -5418 3216
1273C216k689k805N312n364l890R073m163k093P546p350j727P979o471J573Q499
$$ 3216 527 -2278 3034 -2330 -6220 2853 -1310 -3403 4143 -3207 -4934 3045 -3426 -1853 6646
1288F646p486j491P023n745r65P945n910k312P460n536k56O235m537j951N390
$$ 6646 -840 -2331 4692 -1053 -2018 5927 17 -2295 5165 -371 -627 5608 1071 -880 4510
1303D510n458k35M792m479j674L873l467o97M754k584j488J106k202Q4K218n60
$$ 4510 -948 -1183 3609 -870 -2544 1329 -2138 -2835 1919 -665 -2153 -1047 -3249 -3165 -947 -1507
1319a507M99o50j693K706J75p64M058p9n367K272J870l323L974L177m561J81K728
$$ -1507 -1008 -1658 -3351 -645 -470 -1234 2824 2745 -2622 -350 1520 -1803 2171 5348 787 968 3696
1336C696m449J162M767l141k147K493l875n82L698j645j210L111l780j134L955
$$ 3696 -753 409 5176 2035 -112 2381 -1494 -2076 1622 -23 -1233 1878 -1902 -3036 919
1351I19l251k233M411j924l577N259O09l662L569J411m468K288K759k973P41K132
$$ 919 -2332 -4565 -154 -2078 -5655 -396 213 -3449 120 1531 -2937 -649 2110 -863 -122 2010
1367B010j672N02J295Q75M66j395o82J130j460j83K436k706j721J937j935l45
$$ 2010 338 840 2135 3010 3476 2081 1399 2529 1069 886 3322 616 -1105 832 -1103 -1448
1383a448L305j303j465N2k697r0K146k136K095K609n088J490M632m819O25N887
$$ -1448 1857 554 -911 -859 -3556 -3646 -1500 -3636 -1541 1068 -4020 -2530 2102 -2717 -2092 3795
1399C795n523j971O438k762j823O319j812l171L916j169j695K818j284j481J447
$$ 3795 -1728 -3699 2739 -23 -1846 4473 2661 -510 3406 2237 542 3360 2076 595 2042
1414B042k753K7K456j895k35K740k440j896K681j991k351J958j32p92J287J250
$$ 2042 -711 -684 1772 -123 -358 2382 -58 -1954 727 -1264 -3615 -1657 -1789 -2581 -1294 -44
1430d4K5j631o2J596j523n31L359n29k892L152Q85k972K691K719l952L97K362
$$ -44 -19 -1650 -1712 -116 -1639 -2170 1189 660 -2232 920 1805 -1167 1524 4243 291 688 3050
1447C050k858n58K549j695j085J995k78j039K410j177j441R88k739j608L455r96
$$ 3050 192 -366 2183 488 -597 1398 1120 81 2491 1314 -127 861 -1878 -3486 -31 -1027
1463a027j835M585j063m395M258M76n468M079J762n246K979K697m318J778L190
$$ -1027 -2862 1723 660 -3735 523 999 -4469 -390 1372 -3874 -895 1802 -2516 -738 2452
1478B452l303J589J585k561J774j3l022K526j38k306M131k26k942L872j330l875
$$ 2452 -851 738 2323 -238 1536 1523 -1499 1027 889 -1417 2714 2488 -454 3418 2088 -1787
1494a787L095j074l227L982j227j653M127k102k036M169m253j862N695m074j865
$$ -1787 1308 234 -2993 989 -238 -1891 2236 134 -1902 2267 -1986 -3848 1847 -2227 -4092
1509d092O537m787k250P719m549k127P867m785k701P329m680l015O759l957j151
$$ -4092 2445 -2342 -4592 3127 -1422 -3549 4318 -467 -3168 4161 -519 -3534 3225 -732 -1883
1524a883P267m245j097O566n965k036N846o234o42O350m990J64N655o133P6M169
$$ -1883 5384 1139 42 6608 643 -1393 4453 -1781 -2423 3927 -1063 -899 4756 -1377 -1301 2868
1540B868o178J219L981o216J984L793o278K827L833o492M177L733p104L832L023
$$ 2868 -3310 -2091 1890 -4326 -2342 1451 -4827 -2000 1833 -4659 -482 3251 -3853 -21 3002
1555C002p813M680K984o693N599L218o251N050J795p184L975R03o600N274J181
$$ 3002 -4811 -131 2853 -3840 1759 4977 -1274 3776 5571 -1613 2362 3265 -3335 1939 3120
1570C120n290N410m38n453M764j359n097O059j745n251O130k112m768O527r80
$$ 3120 -2170 3240 2802 -2651 2113 754 -4343 1716 -29 -5280 850 -1262 -6030 497 -483
1585d83l740O007j447l458M980k851k452M657k842j84N727k838j06M854m908j275
$$ -483 -4223 1784 337 -3121 1859 -992 -3444 1213 -1629 -1813 3914 1076 970 5824 916 -359
1601c59M282m533m50M759l288n46L949l363l90K074l350Q11Q81l020J866L90l872
$$ -359 3923 -610 -1060 3699 411 -135 3814 451 61 2135 -1215 -404 477 -2543 -677 -287 -4159
1618d159K638J116l609M192J301l912K733j8l587K219Q2j142L495j61p62L522
$$ -4159 -1521 -405 -4014 178 1479 -2433 300 282 -3305 -1086 -1004 -2146 1349 1188 426 3948
1634C948k672j365L118k860j827M284k090j252M433j850k135K476j998r45J557
$$ 3948 1276 -89 3029 169 -1658 2626 536 -716 3717 1867 -268 2208 210 -735 822
1649H22j372P2N24k867J605R36k998L019J764l751K358J063m799J896J421l563
$$ 822 -550 -478 46 -2821 -1216 -280 -3278 -259 1505 -2246 112 1175 -3624 -1728 -307 -3870
1665c870L585J593k287L735o02l453L544k203k553N160j895k884O139k444l569
$$ -3870 -285 1308 -979 2756 2154 -1299 2245 42 -2511 2649 754 -2130 4009 1565 -2004
1680b004N605j525l555L954j511k920L974k874j270L296l162l0M705l792L50M617
$$ -2004 3601 2076 -1479 2475 964 -1956 2018 -856 -2126 1170 -1992 -2022 2683 -1109 -759 3858
1696C858o370o20L990n230R45O131m159J110L793n047J045K242m980L419K322
$$ 3858 -2512 -3132 858 -4372 -3427 2704 -1455 -345 3448 -1599 -554 1688 -3292 127 2449
1711B449n634M265K419o047M564K165o776M462K500o632L267K480o419L394J361
$$ 2449 -3185 1080 3499 -2548 2016 4181 -2595 1867 4367 -2265 1002 3482 -2937 457 1818
1726A818m719M246J560m506M091r15n554M838j907m950O416K58m390O348j047
$$ 1818 -2901 1345 2905 -1601 2490 1575 -3979 859 -1048 -5998 418 676 -3714 2634 1587
1741A587n038M773j966m181N834q58k625N150k720k221N473k548k141O289l566
$$ 1587 -3451 1322 -644 -4825 1009 151 -2474 2676 -44 -2265 3208 660 -1481 4808 1242
1756A242k228N274m876j477N833l699j635N469l203q65M062m850j502L250l861
$$ 1242 -986 4288 -588 -2065 3768 69 -1566 3903 700 -165 3897 -953 -2455 795 -3066
1771c066m12M560l519J546L969n412K29L306m747Q11L772l963J971L320m104J257
$$ -3066 -3478 1082 -2437 -891 3078 -2334 -2105 1201 -3546 -2735 1037 -2926 -955 2365 -1739 -482
1787d82K802l022K195J687l527K162R26l946J675J121k246K987J127l468K148
$$ -482 2320 -702 1493 3180 -347 1815 2741 -1205 470 1591 -655 2332 3459 -9 2139
1802B139J88l942J104m09k362K507Q20k242K383N50k102J004j223j849K364K70
$$ 2139 2327 -1615 -511 -920 -3282 -775 45 -2197 186 736 -1366 -362 -1585 -3434 -1070 -800
1818h00j028J835J2n82J198p63r5K458j16j153O08j141p01Q81m58M07J621N69
$$ -800 -1828 7 19 -563 635 -128 -223 2235 2119 966 1574 433 -268 613 155 562 2183 2752
1836B752o55l97j560k77r12m65M9N70L01R04j16p31m3j03j041Mk17P20J025o43
$$ 2752 2097 1700 140 -137 -1049 -1514 -1465 -895 -594 310 194 -537 -580 -683 -1724 -1720 -1937 -1217 -192 -835
1856h35J39M23k49R70M38r08J480M99j758o17M58p00J227J134m80J480L23k318
$$ -835 -696 -273 -522 448 886 -22 1458 1957 199 -418 40 -660 567 1701 1221 2701 3024 706
1874G06j03j002j299J415P4r39J974L54j589Q20k59k069J092K23j679J281N61
$$ 706 603 -399 -1698 -283 -209 -1148 826 1180 -409 411 152 -1917 -825 -602 -2281 -1000 -439
1891d39q19Q55l34n10K335l03r79J512r58j294J303j261j101L168N95q16J761
$$ -439 -1258 -403 -737 -1247 1088 785 -194 1318 360 -934 369 -892 -1993 1175 1770 954 2715
1908B715o31j641L79j504r67J755J04M04R39j040l74J169j916p55J562p21q00
$$ 2715 2084 443 822 -682 -1649 106 210 614 1553 513 139 1308 -608 -1363 199 -522 -1322
1925a322J273j121n69J864p49p03J469J29k32K88j046q38O04j02l53J873O98N99
$$ -1322 -49 -1170 -1739 125 -624 -1327 142 271 39 327 -719 -1557 -953 -1055 -1408 465 1163 1762
1943A762J013j335j626O91l47j551J319J133k14J055Q4j837M50K11j054K26J92
$$ 1762 2775 1440 -186 505 158 -1393 -74 1059 845 1900 1984 147 597 808 -246 -20 172
1960A72k38r2n70j613J398O05p54J521j47j529J009n24k399J589Q46q26K153Q84
$$ 172 -66 -158 -728 -2341 -943 -338 -1092 429 282 -1247 -238 -762 -3161 -1572 -726 -1552 601 1485
1978A485q91J383p66j638N17p17J38K116m70k41K499j238k509J936o25j592K155
$$ 1485 594 1977 1211 -427 90 -627 -489 1627 1157 916 3415 2177 -332 1604 979 -613 1542
1995A542j001k063K177j416j765K442k84p35K664k027j407J832k187j102K317
$$ 1542 541 -1522 655 -761 -2526 -84 -368 -1103 1561 -466 -1873 -41 -2228 -3330 -1013
2010a013q35J00L589j095o43K144k505o00J995k173P43K525j494L46K092k346
$$ -1013 -1848 -1748 1841 746 103 2247 -258 -858 1137 -1036 -293 2232 738 1084 3176 830
2026H30K13J345l009Q78J977k755L63J177l329J334K006k703J842J828l537Q97
$$ 830 1043 2388 -621 257 2234 -521 -158 1019 -2310 -976 1030 -1673 169 1997 -1540 -643
2042f43L17l697J791J721k286K927J626k438J728L41l525K041R16k931K951J016
$$ -643 -326 -4023 -2232 -511 -2797 130 1756 -682 1046 1387 -2138 -97 819 -2112 839 1855
2058A855k282K595N8k620K430m46k178K218m75k042K204j671j712K701j013o48
$$ 1855 -427 2168 2226 -394 2036 1590 -588 1630 1155 -887 1317 -354 -2066 635 -378 -1026
2074a026L032j734j434J926k709j503K792j471L21L365j625l04K371l076l99K263
$$ -1026 2006 272 -1162 764 -1945 -3448 -656 -2127 -1806 1559 -66 -370 2001 -1075 -1474 789
2090G89k724R30K786k133R31K014k655N42J732k506J431Q79k474O99P50k734J856
$$ 789 -1935 -1005 1781 -352 579 2593 -62 480 2212 -294 1137 2016 -458 241 991 -1743 113
2107A13O26j325J828P04k403J418j042k615J654l99r03K728L78j199K223j661
$$ 113 739 -586 1242 1946 -457 961 -81 -2696 -1042 -1441 -2344 384 762 -437 1786 125
2123A25k198K048j096j302L169r81o88K636j433j194K376j241m37K291j856m57
$$ 125 -2073 -25 -1121 -2423 746 -235 -923 1713 280 -914 1462 221 -216 2075 219 -238
2139b38J693k200n7K071j533J035K141k382j51Q30k477K6J077k029J793J531j860
$$ -238 1455 -745 -802 1269 -264 771 2912 530 379 1209 -1268 -1242 -165 -2194 -401 1130 -730
2156g30J477M06k426K69K85k032K079P62j768K211n90j747K523m07j838L107l97
$$ -730 747 1153 -1273 -1004 -719 -2751 -672 90 -1678 533 -57 -1804 719 312 -1526 1581 1184
2173A184j795K019j670j437K989o90j008L419j213j054J921k617j675K522k020
$$ 1184 -611 1408 -262 -1699 1290 600 -408 3011 1798 744 2665 48 -1627 895 -1125
2188a125m56K916j180N8K012l320n25K223l075K45K666k645J034K155l018O57
$$ -1125 -1581 1335 155 213 2225 -1095 -1620 603 -2472 -2227 439 -2206 -1172 983 -2035 -1378
2204a378K145k381J801J712l112J657Q34l246J914J666k644K914J255k838J964
$$ -1378 767 -1614 187 1899 -1213 444 1278 -1968 -54 1612 -1032 1882 3137 299 2263
2219B263L49l981J380O65k668K776P09k243K351k44k895J541n44k222K825q78
$$ 2263 2612 -1369 11 676 -1992 784 1493 -750 1601 1357 -1538 3 -541 -2763 62 -816
2235h16j656K665p14j819K732j188p61L098j440j303K689j904j419K956j560L14
$$ -816 -2472 193 -521 -2340 392 -796 -1557 1541 101 -1202 1487 -417 -1836 1120 -440 -126
2251a26L384j448j032K230k603j045K074k319J14L035j775l37J995k834QJ232
$$ -126 3258 1810 778 3008 405 -640 1434 -885 -771 2264 489 152 2147 -687 -679 553
2267E53k372L29J426j487N60J272k349J068J449j994J001J645j948J100L0k094
$$ 553 -1819 -1490 -64 -1551 -991 281 -2068 -1000 449 -1545 -544 1101 -847 253 283 -1811
2283a811J225J000j250J891J259j714J402l77k607J490l72j035J938J5q78J808
$$ -1811 -586 414 -836 1055 2314 600 2002 1625 -982 508 136 -899 1039 1054 176 1984
2299A984r04j765J289r26r60J493r73q74J828p31p66J169o16MJ683q91n41M69
$$ 1984 1080 -685 604 -322 -1282 211 -762 -1636 192 -539 -1305 -136 -752 -748 935 44 -497 -28
2317b8q84m90R82p27J360J307p77N63o0j405K27l52j019J751M05o26J085J22j402
$$ -28 -912 -1402 -420 -1147 213 1520 743 1306 1246 -159 68 -284 -1303 448 853 227 1312 1434 32
2336C2O52k35j397J320M4j160Q79k67j126J265m23m74J281p1o35M09r38q21O16
$$ 32 684 449 -948 372 416 -744 135 -132 -1258 7 -416 -890 391 320 -315 94 -844 -1665 -1049
2355a049k34j33J682K10L97K61j179j46J26r28K6J791o94Q94Q39j503j15J018
$$ -1049 -1283 -1416 266 476 873 1134 -45 -191 -65 -993 -967 824 130 1024 1863 360 245 1263
2373A263j615O78P47r00L74M94j762L59N93o09M12P45j011M41N6j780k75P95p61
$$ 1263 -352 326 1073 173 547 1041 -721 -362 231 -378 34 779 -232 209 265 -1515 -1790 -995 -1756
2392a756J553N82n65N33M2j193J52L20j064J130M37K7R81J1j022P92n59k22J228
$$ -1756 -203 379 -186 347 389 -804 -652 -332 -1396 -266 171 198 1179 1190 168 960 401 179 1407
2411A407l30o08L97m99q85J100q00K02R84k00p02K41r31p17R5q7j4J331J53j23
$$ 1407 1077 469 866 367 -518 582 -218 -16 968 768 66 307 -624 -1341 -1246 -1333 -1347 -16 137 14
2431A4K67o37r36N21m60R7R76N71Q2J37N63q49K29K5J39j04N15l14p5m39m75N18
$$ 14 281 -356 -1292 -771 -1231 -1134 -158 413 495 632 1195 346 575 600 739 635 1150 836 761 322 -153 365
2453C65K9K18P23k49o89k36j015o26J57L29m50J722j60l07K61n90q14K83j2K94
$$ 365 394 612 1335 1086 397 161 -854 -1480 -1323 -994 -1444 278 118 -189 72 -518 -1332 -1049 -1061 -767
2473g67O20J90k53R15j00r94J213j67n30R62K2o44J77k91m48M67O23j74K29N4
$$ -767 -147 43 -210 705 605 -389 824 657 127 1089 1111 467 644 353 -95 372 995 821 1050 1104
2493A104j000J45r23o06O62m96L55J233n03j66N93j145q47Q38n30L25R38J1J73
$$ 1104 104 249 -674 -1280 -618 -1114 -759 474 -29 -195 398 -747 -1594 -756 -1286 -961 -23 -12 161
2512A61N65q94J74Q11p58L16J004j408q4R80j339L96J084n67L55R42j186n33M38
$$ 161 726 -168 6 817 59 375 1379 -29 -113 867 -472 -76 1008 441 796 1738 552 19 457
2531D57j481OQ64l88M42Q07q29M39k56j378M36K04o08Q51O53r98Q32q2o76P43
$$ 457 -1024 -1018 -154 -542 -100 707 -122 317 61 -1317 -881 -677 -1285 -434 219 -779 53 -29 -705 38
2551C8J61k91R11m79o86R18p45p74J919m04o36J935q11p80O73j225j136J632n98
$$ 38 199 -92 819 340 -346 572 -173 -947 972 568 -68 1867 1056 276 949 -276 -1412 220 -378
2570c78J6J641r01k62P05j402k15P62r10P3J283j057J73Q75j412K33J135r11J61
$$ -378 -362 1279 378 116 821 -581 -796 -34 -944 -871 412 -645 -472 403 -1009 -776 359 -552 -391
2589c91J067j189K73j17m13O36O77o94J146M72j246P29j77j410P90J18p80J411
$$ -391 676 -513 -240 -357 -770 -134 543 -151 995 1467 221 950 773 -637 153 271 -509 902
2607I02N61j232J159p04j689J261k34j160J571o26n74J102q57o83J089l72k24
$$ 902 1463 231 1390 686 -1003 258 24 -1136 435 -191 -765 337 -520 -1203 -114 -486 -710
2624g10J093p02p07R42j148lJ715p37J82J898j353Q0P65j816K96Q09q93O49J510
$$ -710 383 -319 -1026 -84 -1232 -1235 480 -257 -75 1823 470 550 1315 -501 -205 604 -289 360 1870
2643A870j235L23M85j855J61O80j332O67O84j393Q82K21j478J175J7j221J586
$$ 1870 635 958 1443 -412 -251 429 -903 -236 448 -945 -63 158 -1320 -145 -128 -1349 237
2660B37R2j666J147o49j227K076k46p55K108k58r55J338p32j482J677l85p44J785
$$ 237 329 -1337 -190 -839 -2066 10 -236 -991 1117 859 -96 1242 510 -972 705 320 -424 1361
2678A361l40q04J654j288r28J169p33m94J526j438l14J550j885j25J610j201L
$$ 1361 1021 217 1871 583 -345 824 91 -403 1123 -315 -629 921 -964 -1089 521 -680 -677
2695f77J181j016n56J033j652M79J295j041J065Q30j164P29M75j711O27P30j049
$$ -677 504 -512 -1068 -35 -1687 -1208 87 -954 111 941 -223 506 981 -730 -103 627 -422
2712d22J078R81j545J259K18k178J123L12j461J518l83j322J458k75j487J270
$$ -422 656 1637 92 1351 1569 -609 514 826 -635 883 500 -822 636 361 -1126 144
2728A44N3j462J687k64j488J480n93j321J337O0j001K049k94p41R62q17m61Q10
$$ 144 197 -1265 422 158 -1330 150 -443 -1764 -427 -367 -1368 681 387 -354 608 -209 -670 140
2746A40p28n1J898r24j67J409j385k99R03p29o7Q80o77J82L03j295M10Q67j497
$$ 140 -588 -639 1259 335 168 1577 192 -107 796 67 0 880 203 385 688 -607 -197 670 -827
2765h27R36R05j754M63O60j969N92Q59p25Q42Q31j215N32L19j500M65K04m87J179
$$ -827 109 1014 -740 -277 383 -1586 -994 -135 -860 -18 813 -402 130 449 -1051 -586 -382 -869 310
2784C10L79r51J016J92j215P86o3m45R27k91p18P51m35m52O87n82K49P52o42m31
$$ 310 689 -262 754 946 -269 517 454 9 936 645 -73 678 243 -209 478 -104 145 897 255 -176
2804a76Q61j319L1O41q39J36J640j011j40M84j070k02R09q90L54R01q02M34M65
$$ -176 685 -634 -603 38 -801 -665 975 -36 -176 308 -762 -964 -55 -945 -591 310 -492 -58 407
2823D07j206P64N54r18O97O45j072P94M68j404O45K51l84N05K24o79L87n24q93
$$ 407 -799 -35 519 -399 298 943 -129 665 1133 -271 374 625 241 746 970 291 678 154 -739
2842g39P64m21n17J506l28m30O81o13j150R31n26l72Q88j59j21R41o57J1N85l00
$$ -739 25 -396 -913 593 265 -165 516 -97 -1247 -316 -842 -1214 -326 -485 -606 335 -322 -311 274 -26
2862b6l35J014o28j29J160j086p3Q69l58K45Q06q02J77J12r08n55Q10r46O35M53
$$ -26 -361 653 25 -104 1056 -30 -103 766 408 653 1459 657 834 946 38 -517 293 -653 -18 435
2882D35m93K73Q3r50P2m5n91P51J96n32P52m6p12M77N15r58O95L50p06R36k40
$$ 435 -58 215 298 -652 -580 -625 -1216 -465 -269 -801 -49 -95 -807 -330 185 -773 -78 272 -434 502 262
2903B62n04R18k96k95P09M22p45M82m42l45O8j07m4L17Q1mJ2p71m77N4O0j18K55
$$ 262 -242 676 380 85 794 1216 471 953 511 166 234 127 83 400 481 477 489 -282 -759 -705 -645 -763 -508
2926e08J91k21M44n37q1M52m23L32M30j43N3L12o87KO64l9L11M65j77n9k1n51
$$ -508 -317 -538 -94 -631 -712 -260 -683 -351 79 -64 -11 301 -386 -384 280 241 552 1017 840 781 760 209
2948B09k33J73P8K3K26j17l39M75p98l30J92K55j86P3K84l04M0m07P1J92j2K39
$$ 209 -24 149 227 250 476 359 20 495 -303 -633 -441 -186 -372 -299 -15 -319 -279 -686 -615 -423 -435 -196
2970a96N1J22Oj94j84J87M06j12K81M02l14j44Q8m18k58L64J52K40L7J18l62k46
$$ -196 -145 -23 -17 -211 -395 -208 198 86 367 769 455 311 399 -19 -277 87 239 479 516 634 272 26
2992B6J58l77M9r4M32j93m1q2k18j57o4L41k2j10K06J68j89q9k64N6L66l8L90
$$ 26 184 -193 -144 -238 194 1 -40 -122 -340 -497 -561 -220 -242 -352 -146 22 -167 -256 -520 -464 -98 -136 254
3015B54J17k98J46l06j08K39K57k2J96K70j95J27k72l93J33M52l55j25K40k64
$$ 254 371 73 219 -87 -195 44 301 279 475 745 550 677 405 12 145 597 242 117 357 93
3035I3j45O8k76K85j16l61N30j66m30O1j91k88N50J93r7K61j98p6K25j97m84P88
$$ 93 -52 16 -260 25 -91 -452 78 -88 -518 -457 -648 -936 -386 -193 -290 -29 -227 -303 -78 -275 -759 29
3057B9j83K18P22n10j47Q23p94J11L47j69j0L27l98j91N7l86J45J74n43M05L18
$$ 29 -154 64 786 276 129 952 158 269 616 447 437 764 366 175 232 -154 -9 165 -378 27 345
3078C45p93j08L43q32K99L48j58M73K86n39n2L11m47J83O50o66R84k7n09N11k61
$$ 345 -448 -556 -213 -1045 -746 -398 -556 -83 203 -336 -388 -77 -524 -341 309 -357 627 600 91 602 341
3099C41k68L79J9m51N96J17o37M16n0o23L38j8o32J099m54p15O03o92k31P87l10
$$ 341 73 452 471 20 616 733 96 512 462 -161 177 159 -473 626 172 -543 60 -632 -863 -76 -386
3120c86o9Q57q03k61P64r64L12R73p42K21J008p62j91Q67q39O2O58o45L63M01
$$ -386 -455 402 -401 -662 102 -862 -550 423 -319 -98 910 148 -43 824 -15 47 705 60 423 824
3140H24r26M54N90j281O71R5q64J006q1q47N2J67p42L87K45o01R97J48j286J063
$$ 824 -102 352 942 -339 332 427 -437 569 488 -359 -307 -140 -882 -495 -250 -851 146 294 -992 71
3160G1l00r78J246O0n48P45k44m62J031m92n49J089m58m79J120j75q79J082q07
$$ 71 -229 -1207 39 99 -449 296 52 -410 621 129 -420 669 211 -268 852 677 -202 880 73
3179G3m62J026l92k94P85p69k89J003j350O6O37n31O5R20q96n6O52r35QJ050q80
$$ 73 -389 637 245 -49 736 -33 -322 681 -669 -603 34 -497 -432 488 -408 -464 188 -747 -739 311 -569
3200e69K16P32p41P1N09p73M97N16j066O21N09j013Q88Q9p11K84L01o54Q96L4
$$ -569 -353 379 -362 -291 218 -555 -58 458 -608 13 522 -491 397 486 -225 59 360 -294 602 636
3220F36j065J026l99q40J095j70r06J211k50q70R28l57p06O49m25m08J122m44
$$ 636 -429 597 198 -642 453 283 -623 588 338 -532 396 39 -667 -18 -443 -851 271 -173
3238a73m90O76n41p9P84n61o1R96o43p0P75r40K7Q62p46J15P06m13j07O22o53
$$ -173 -663 13 -528 -607 177 -384 -445 551 -92 -162 613 -327 -300 562 -184 -69 637 224 117 739 86
3259H6J28K75p55L20O29r68O20J15j165L77P64r75M89O70j373O33J05o70L52J09
$$ 86 214 489 -266 54 683 -285 335 450 -715 -338 426 -549 -60 610 -763 -130 -25 -695 -343 -234
3279b34m13N81K35m64L06o9n71P08L50p91J166j44m80M26k02k26N28n71K0P70
$$ -234 -647 -66 169 -295 11 -58 -629 79 429 -362 804 660 180 606 404 178 706 135 155 925
3299I25o61m76O73o79j17P70p59L05M40o27l64Q16j241M09M86p81L32O52p67p6
$$ 925 264 -212 461 -218 -335 435 -324 -19 421 -206 -570 246 -995 -586 -100 -881 -549 103 -664 -740
3319g40N38k00J80M66n85O83no68O81J89o39O35J66o10L11K38m41J33k67k69O86
$$ -740 -202 -402 -222 244 -341 342 337 -331 350 539 -100 535 701 91 402 640 199 332 65 -204 482
3340D82m00l97O72l03m91M26l04l95N85k77n97J054n06l2M26l02k85O34l36L9
$$ 482 82 -315 357 54 -437 -11 -315 -710 -125 -402 -999 55 -451 -483 -57 -359 -644 -10 -346 -307
3360c07M52j23J67L58l37K3M03j90j63P04p34K3N41q37k09O22m91L31K47p27L09
$$ -307 145 22 189 547 210 233 636 446 283 987 253 276 817 -20 -229 393 -98 233 480 -247 62
3381F2R2p74M52J23n34N64J93o54J69K31m21O7O18q02M67M14p07N94J40l65M69
$$ 62 154 -620 -168 -45 -579 -15 178 -476 -307 -76 -497 -430 188 -614 -147 267 -440 154 294 -71 398
3402C98k80j04K82K86o73P47j65n65N53j78k40J21K2l74L77K0o97N74k71r4L16
$$ 398 118 14 296 582 -91 656 491 -74 479 301 61 182 204 -170 207 227 -470 104 -167 -261 55
3423E5j52k52M26j75l40K59j93J69K36l44p5O82n84N3M25j67n6K83j38J46J36
$$ 55 -97 -349 77 -98 -438 -179 -372 -203 33 -311 -386 296 -288 -235 190 23 -33 250 112 258 394
3444C94k85J34J42k76L71Ll60K87k32l0p6J0n5L9J38l2ol50J15k16K41k64m8O0
$$ 394 109 243 385 109 480 483 123 410 178 148 72 82 27 66 204 172 166 -184 -69 -285 -44 -308 -356 -296
3468b96P7j5n6m5J23O7K10n4p1k49L46L2j85R5J40K40J18j74R1J25k13k67Q9P3
$$ -296 -219 -234 -290 -335 -212 -145 65 11 -60 -309 37 69 -116 -21 119 359 477 303 394 519 306 39 128 201
3492B01K31k6k30J58n4j90k34K4M9j88J52l53J1k2P7lK7K0K7K22%k91o2M00j62
$$ 201 432 406 176 334 280 90 -144 -120 -71 -259 -107 -460 -449 -471 -394 -397 -370 -350 -323 -101 -101 -392 -454 -54 -216
3517b16J61L84lj34L41k58K47O1l97K71j41m4K3M15m50Q2m3l72K18l34J03j37
$$ -216 -55 329 326 192 533 275 522 583 186 457 316 272 295 710 260 342 299 -73 145 -189 -86 -223
3539b23L8j45l3K49m79K37n5j09J49j07n1k2N03k74M25J55R6J40k50J50J9j2k68
$$ -223 -185 -330 -363 -114 -593 -356 -411 -520 -371 -478 -529 -551 -48 -322 103 258 354 494 244 394 413 401 133
3562A33K37J17j64q3O6j25p1O2j12J5l58J44o3j67RJ42m27K60L75j14j52J03o1
$$ 133 370 487 323 240 306 181 110 172 60 75 -283 -139 -202 -369 -360 -218 -645 -385 -10 -124 -276 -173 -234
3585b34K8L7k5J35o5R7M19k90k27N17l74qK62j05J04N0o2N1J93j43j77P0J26n64
$$ -234 -206 -169 -194 -59 -124 -27 392 102 -125 392 18 10 272 167 271 321 259 310 503 360 183 253 379 -185
3609a85L32m26j37N15l24qL14m97PM19m23Q7N2j25Q8K44k01J63K58m81M34K52
$$ -185 147 -279 -416 99 -225 -233 81 -416 -409 10 -413 -326 -274 -399 -311 -67 -268 -105 153 -328 106 358
3631C58n35K14K61m45L06K68n65M11J17q6J6j50k49K31j80m73Q27j89n67O41N44
$$ 358 -177 37 298 -147 159 427 -138 273 390 304 320 170 -79 152 -28 -501 326 137 -430 211 755
3652G55j098N06r1q07Q11m43l35O33k8m34P14k20l71R06m55m56P48p02K7M97j43
$$ 755 -343 163 72 -735 76 -367 -702 -69 -97 -531 183 -37 -408 498 43 -413 335 -367 -340 157 14
3673A4m36P74R7m66Q82m84n02O77m35r3O13q37K75N35m50l35Q80p75j35O21q72
$$ 14 -422 352 449 -17 865 381 -121 556 121 28 641 -196 79 614 164 -171 709 -66 -201 420 -452
3694d52j29N47m44K50M92o38n6N13p34O40R2p46K4Q42p18N20M22o17M31L37o04
$$ -452 -581 -34 -478 -228 264 -374 -430 83 -651 -11 81 -665 -641 201 -517 3 425 -192 239 576 -28
3715b8J22K32m46N08J59l67M80M9n54L93j73n55M21j48n09N60j4p10N72k43j28
$$ -28 94 326 -120 388 547 180 660 709 155 548 375 -180 241 93 -416 144 130 -580 -8 -251 -379
3736c79L98k61m38M24n1m51M15J5L3N68j59m56R06o40K31L04m49k54P49l66K61
$$ -379 19 -242 -680 -256 -307 -758 -343 -328 -295 273 114 -342 564 -76 155 459 10 -244 505 139 400
3757D00J70l44J01K91m56O3N1m46L8M61r29L92L46m02Q9P6l61K82j55n59O82j36
$$ 400 570 226 327 618 162 225 276 -170 -132 329 -600 -208 138 -264 -175 -99 -460 -178 -333 -892 -210 -346
3779c46l38O19J53k98O64J4o33M61j63m41N55L5k44Q35k32j84K10m14k01M57n54
$$ -346 -684 -65 88 -210 454 468 -165 296 133 -308 247 282 38 873 641 457 667 253 52 509 -45
3800d5m7M56m25k51P87p63P5M79p86J52K95o64J75K04j33L64R5j53J56M26p60
$$ -45 -92 364 -61 -312 475 -288 -213 266 -520 -368 -73 -737 -562 -358 -491 -127 -32 -185 -29 397 -363
3821c63M40l01l8L50j31j87M55J25j73K47J2l70L10j87l71M72l35k43L73j25k
$$ -363 77 -224 -262 88 -43 -230 225 350 177 424 436 66 376 189 -182 290 -45 -288 85 -40 -42
3842d2L13j05l87J52k5n17L31k97q2R04m82j80M47m51P9P83r20q3O70k23J82L29
$$ -42 271 166 -221 -69 -94 -611 -280 -577 -659 245 -237 -417 30 -421 -342 441 -479 -562 108 -115 67 396
3864C96l52K16L20o27m4O82n38K91J71q38J70O00o68M17K68l48k5Q8n19q1L26
$$ 396 44 260 580 -47 -91 591 53 344 515 -323 -153 447 -221 196 464 116 91 179 -340 -421 -95
3885i5m17L82L40l22K59M1p39K71J21m69O05k17k67N94O7n93P96j66l24M29R4
$$ -95 -512 -130 210 -112 147 188 -551 -280 -159 -628 -23 -240 -507 87 154 -439 357 191 -133 296 390
3906C90n21N31r9m27N39p0k34N61m50r5L86j82n26J14j08j23P53n85N7K37k84
$$ 390 -131 400 301 -126 413 343 109 670 220 125 511 329 -197 -83 -191 -314 439 -146 -89 148 -136
3927a36q9N1j97P2Q0k26k4J77j76L48K12m1j22L75n00K40K11nN2J84l78M81K27
$$ -136 -225 -174 -371 -299 -219 -445 -469 -292 -468 -120 92 51 -71 304 -196 44 255 250 302 486 108 589 816
3950H16l84j69M26m07k30N0l44K45M6K01O5r4p82M46j42j85N6J97k31K68n0J77
$$ 816 432 263 689 282 52 102 -242 3 49 250 315 221 -561 -115 -257 -442 -386 -189 -420 -152 -202 -25
3972b5j10J82l67N74p3k41N0k67J79M08qqL79j04k21J9K0k27n9K4K1L56l66k41
$$ -25 -135 47 -320 254 181 -60 -10 -277 -98 310 302 294 673 569 348 367 387 160 101 125 146 502 136 -105
3996a05J53%P2n64L44l31n5J10J84j32j65N1K40K91j95j22M96l87k49L35j06K52
$$ -105 48 48 120 -444 -100 -431 -486 -376 -192 -324 -489 -438 -198 93 -102 -224 272 -115 -364 -29 -135 117
4018A17K29j82k3K01R5m0n4l90J53L05k83l1J56j67L14k97j73k83L80q4l33L23
$$ 117 346 164 141 342 437 397 343 -47 106 411 128 97 253 86 400 103 -70 -353 27 -57 -390 -67
4040f7m47K82P4O8k13N8j52J17L15l22J62J62l32J34M38k08L28j01J78n7l88q5
$$ -67 -514 -232 -158 -90 -303 -245 -397 -280 35 -287 -125 37 -295 -161 277 69 397 296 474 417 29 -56
4062e6lK75j6M17l52m1K20k49J73l53j54K3m1Q0Q6j35j54J57L3J24j04R9k32K0
$$ -56 -59 216 200 617 265 224 444 195 368 15 -139 -116 -157 -77 9 -126 -280 -123 -90 34 -70 29 -203 -183
4086a83k41J55J41k22K07K94K09k7j22j97j09J10k13J84K96j95J7L3J36q3J02
$$ -183 -424 -269 -128 -350 -143 151 360 333 211 14 -95 15 -198 -14 282 87 104 137 273 190 292
4107B92l21RM65l76K0M0k88J28J53m14L73m6k43l18J18p8J82j12r6L37J83l2K72
$$ 292 -29 -20 445 69 89 129 -159 -31 122 -292 81 35 -208 -526 -408 -486 -304 -416 -512 -175 8 -24 248
4130B48l53n58N66J43o29M76L62k03L36K12n35M93K8n77M62n85M45N4k30m22L46
$$ 248 -105 -663 -97 46 -583 -107 255 52 388 600 65 558 586 9 471 -114 331 385 155 -267 79
4151G9Q4l34M03m34qR2k87n12O22k44J84N11k60j86M24m52j02M65l10j05N59j7
$$ 79 163 -171 232 -202 -210 -118 -405 -917 -295 -539 -355 156 -104 -290 134 -318 -420 45 -265 -370 189 172
4173A72m5M04n03K7Q39n27m62Q61m97K9K32o39p4P06o16J55N18p35R1Q6o99N24
$$ 172 127 531 28 55 894 367 -95 766 269 298 530 -109 -183 523 -93 62 580 -155 -64 22 -677 -153
4195a53J4l85L15M44l80R2L81q45j04M04l01M45J62k1K2J52k19L90l8l85M41p
$$ -153 -139 -524 -209 235 -145 -53 328 -517 -621 -217 -518 -73 89 68 90 242 23 413 375 -10 431 424
4217D24l61J64J48n22M05J03k55N36r9o24L53l77o22N87j63m34R59n17J9M58m55
$$ 424 63 227 375 -147 258 361 106 642 543 -81 272 -105 -727 -140 -303 -737 222 -295 -276 182 -273
4238b73k46M07k57l17P81k95o4O31m20K54J81k56L98j00k07Q2R5l28J62J84j34
$$ -273 -519 -112 -369 -686 95 -200 -264 367 -53 201 382 126 524 424 217 299 394 66 228 412 278
4259B78k52L37m18L24j90m36K19o9K56p9r8J23J19k35j92L8k8k10K15J26l10N45
$$ 278 26 363 -55 269 79 -357 -138 -207 49 -30 -128 -5 114 -121 -313 -275 -303 -513 -298 -172 -482 63
4281F3N0l87M87N8r8K72k54m8O4l35O7M16k12r5M65k39j43J67o14J82J75k66K34
$$ 63 113 -274 213 271 173 445 191 143 207 -128 -61 355 143 48 513 274 131 298 -316 -134 41 -225 9
4304IJ87n14L88L16m41j65J29n98M40K98p06L97L18m59L36j36r3J90K63j32K8
$$ 9 196 -318 70 386 -55 -220 -91 -689 -249 49 -657 -260 58 -401 -65 -201 -294 -104 159 27 55
4325E5n0q5M08M0k90P62l24n34L00k16k59M80j89k01R65p11j49M77m05k94M99
$$ 55 5 -80 328 368 78 840 516 -18 282 66 -193 287 98 -103 862 151 2 479 74 -220 279
4346B79l05l23P79m09l72N49m21k55O96n16l7N73o19m6M55k92r8O67p12O62L40
$$ 279 -26 -349 430 21 -351 198 -223 -478 218 -298 -335 238 -381 -427 28 -264 -362 305 -407 255 595
4367E95k01l50N82m49l31M49o50O09K98n79N49J1m79lK68o56M06j55l15L97k9
$$ 595 394 44 626 177 -154 295 -355 254 552 -27 522 533 54 51 319 -337 69 -86 -401 -4 -33
4388c3k58R4r6j85N33O9n89J93K54p45N45J18k96M98L52k45L65n40k48L64j8l8
$$ -33 -291 -197 -293 -478 55 124 -465 -272 -18 -763 -218 -100 -396 102 454 209 574 34 -214 150 132 94
4410I4L96L9m94N35n18n8L31o59J22M28k25k42L32k26m05M81l59J03L29l82j78
$$ 94 490 529 35 570 52 -6 325 -334 -212 216 -9 -251 81 -145 -550 -69 -428 -325 4 -378 -556
4431e56L84k68J84R3j61J78P36n28J22J09l59N8K71j93R3M99l73r6K57l25p5L01
$$ -556 -172 -440 -256 -163 -324 -146 590 62 184 293 -66 -8 263 70 163 662 289 193 450 125 50 351
4453C51n10J05O10n80j74K08k04k7J08j23j8K21j55J5p2j87J94k95L28K85j5L15
$$ 351 -159 -54 556 -24 -198 10 -194 -221 -113 -236 -254 -33 -188 -173 -245 -432 -238 -533 -205 80 65 380
4475C80k79k36k5J35K41k52m6M16r6J86j7l59QJ52j94J16R9p1o1k88N5K9N5P3
$$ 380 101 -135 -160 -25 216 -36 -82 334 238 424 407 48 56 208 14 130 229 158 97 -191 -136 -107 -52 21
4499B1P8k51Q0k60J34l12J34K64jO9J58K74n32J14k60K55j73K92p5K04k51K17
$$ 21 99 -152 -72 -332 -198 -510 -376 -112 -113 -44 114 388 -144 -30 -290 -35 -208 84 9 213 -38 179
4521A79M6k99K31l1j32j06N77k73j7r0N5j81K16r9K75j93k49o6r4n5R9J72j55
$$ 179 225 -74 157 126 -6 -112 465 192 175 85 140 -41 175 76 351 158 -91 -157 -251 -306 -207 -35 -190
4544a90K8L40k05k40r3J05rj76M66jK80m1k73q4J55j49L73j13l76O77l16j30L81
$$ -190 -162 178 -27 -267 -360 -255 -264 -440 26 25 305 264 -9 -93 62 -87 286 173 -203 474 158 28 409
4567D09n7l61L76j31J20j44k11k65M9J43k47O7L61k13pL4m05O6j16k8K23J92o1
$$ 409 352 -9 367 236 356 212 1 -264 -215 -72 -319 -252 109 -104 -111 -77 -482 -416 -532 -560 -337 -145 -206
4590b06J32n0j43L49j36R0M9Jj65N78o6m70K95J81k45M37k09l60N0M1k54Q6j5
$$ -206 -74 -124 -267 82 -54 36 85 86 -79 499 433 -37 258 439 194 631 422 62 112 153 -101 -15 -30
4613c0j09K07Ml64J83p2k38k02j32K90J49n0j50M90k39j08m5L18q5O08k23j79
$$ -30 -139 68 72 -292 -109 -181 -419 -621 -753 -463 -314 -364 -514 -24 -263 -371 -416 -98 -183 425 202 23
4635B3K90j54k43P45k13m81N24K80o90L71k81n39O58k32l26J74J44l46K47m77
$$ 23 313 159 -84 661 448 -33 491 771 81 452 171 -368 290 58 -268 -94 50 -296 -49 -526
4655e26K30K82m78j3K11n6n1P27n41J9L70k59L57j08r7j16M80k34j58N50l50P6
$$ -526 -296 -14 -492 -505 -294 -350 -401 326 -215 -196 174 -85 272 164 67 -49 431 197 39 589 239 315
4677C15J53j88oJ6m47k1M48l87J44L18l83j79O21j162N21L8k83J25L64j21J01
$$ 315 468 280 274 290 -157 -178 270 -117 27 345 -38 -217 404 -758 -237 -199 -482 -357 7 -114 -13
4698a3J07m27J03J99j38J08J55n76N17M6Mj78K38J39L51n35K69j84m74J94L7J86
$$ -13 94 -333 -230 -31 -169 -61 94 -482 35 81 85 -93 145 284 635 100 369 185 -289 -95 -58 128
4720A28j41L54j82o5J66j36n06j2O15o22M58k48j82K89K5j97M22m69M7L78P6m0
$$ 128 -13 341 159 94 260 124 -382 -394 221 -401 57 -191 -373 -84 -59 -256 166 -303 -256 122 198 158
4742A58m9l65oK14q3M91j03N7k53J49k20r4K69K77k10N9k18N58m43k48L3P5k40
$$ 158 109 -256 -262 -48 -131 360 257 314 61 210 -10 -104 165 442 232 291 73 631 188 -60 -27 48 -192
4765a92L37l36RM9jQ8rj64J05O5l06K89j72k03r5M15k81J38N00l25J9J99m60K08
$$ -192 145 -191 -182 -133 -134 -46 -55 -219 -114 -49 -355 -66 -238 -441 -536 -121 -402 -264 236 -89 -70 129 -331 -123
4789a23K89j06K3K47j11K96j11m90N7J11j00J01N07n52J49j02l20P9N1j61M11
$$ -123 166 60 83 330 219 515 404 -86 -29 82 -18 83 590 38 187 85 -235 -156 -105 -266 145
4810A45k72j93J99j67m35M63k1j28K37L03j99J24k92k07M02j18j5N93O4l38J72
$$ 145 -127 -320 -121 -288 -723 -260 -281 -409 -172 131 -68 56 -236 -443 -41 -159 -174 419 483 145 317
4831C17j33j70N06l21n2L68l83j40O70q02k7O26o53l6L44k37k06J69k32r2K92
$$ 317 184 14 520 199 147 515 132 -8 662 -140 -167 459 -194 -230 114 -123 -329 -160 -392 -484 -192
4852a92l73J47O15l96J11J40o77N06J77j06P9N77n53K69M2j87ol5j85M30J56l59
$$ -192 -565 -418 197 -199 -88 52 -625 -119 58 -48 31 608 55 324 366 179 173 138 -47 383 539 180
4874A80K05r4n34L62J80j15J81k22l66L8j41k08K19J92j22J91J3l85N23l9n78
$$ 180 385 291 -243 119 299 184 365 143 -223 -185 -326 -534 -315 -123 -245 -54 -41 -426 97 58 -520
4895e20K32J3n6M74J65j47K99m39j17K76Q6l44M49j05k93L31m47m3K17J13k46
$$ -520 -288 -275 -331 143 308 161 460 21 -96 180 266 -78 371 266 -27 304 -143 -186 31 144 -102
4916a02M42m59m5j1n8m44N82r4L1L15l87k29N24j71k56J53l07L01M95m23L42j8
$$ -102 340 -119 -164 -175 -233 -677 -95 -189 -158 157 -230 -459 65 -106 -362 -209 -516 -215 280 -143 199 181
4938A81k24l11L72K96l46N42m72m8J32J37l31L22k52J13P5P5j66k2PQ0j90J25
$$ 181 -43 -354 18 314 -32 510 38 -10 122 259 -72 250 -2 111 186 261 95 73 80 160 -30 95
4960I5l39L17O8j24k85k49J53N8K09J61r8K2k47j81L38q8K4J58L2p7k6m8L65O9
$$ 95 -244 73 141 17 -268 -517 -364 -306 -97 64 -34 -12 -259 -440 -102 -190 -166 -8 24 -53 -79 -127 238 307
4984C07l38K37m8Q0n6k16J85Rl13M18k14J12j62m3j33J28p8k6P2j28j02j37L41
$$ 307 -31 206 158 238 182 -34 151 160 -153 265 51 163 1 -42 -175 -47 -125 -151 -79 -207 -309 -446 -105
5007a05j60q6J54Q6J5O1L8k65M02l49l8K81J05J9l6R3L9R9p0k14k20M20j08K54
$$ -105 -265 -351 -197 -111 -96 -35 3 -262 140 -209 -247 34 139 158 122 215 254 353 283 69 -151 269 161 415
5031D15J03m67q9Q0m20J51L03l43J65Q4N3rj1m13J13Q8j24K3m1Q5p6N05Lm33M54
$$ 415 518 51 -38 42 -378 -227 76 -267 -102 -18 35 26 15 -398 -285 -197 -321 -298 -339 -254 -330 175 178 -255 199
5056A99k58L28J3k30K59j48m03M39j42J75K97o4k94R6k44l20M8J33r7Q8K21k98
$$ 199 -59 269 282 52 311 163 -240 199 57 232 529 465 171 267 23 -297 -249 -116 -213 -125 96 -202
5078b02O2J2k35M99l21j86K25j52j94M10l04J57M72k16O8K40J24n04J62p2k06
$$ -202 -140 -128 -363 136 -185 -371 -146 -298 -492 -82 -386 -229 243 27 95 335 459 -45 117 45 -161
5099a61K06K16l16O33l59J01J73n83J2M5K51l33K73j00l22J82k89J23q0J12q9
$$ -161 45 261 -55 578 219 320 493 -90 -78 -33 218 -115 158 58 -264 -82 -371 -248 -328 -216 -305
5120c05L29j99k96L11k40N1L32r1N6Q5j60L82j45n3J08K15k75K36j77L3R7k07
$$ -305 24 -175 -471 -160 -400 -349 -17 -108 -52 33 -127 255 110 57 165 380 105 341 164 197 294 87
5142H7j49N8N6m6j19J56j88l25O28j13m89L63N9j39L50l28O9K46l61k3K27l35
$$ 87 -62 -4 52 6 -113 43 -145 -470 158 45 -444 -81 -22 -161 189 -139 -70 176 -185 -208 19 -316
5164c16K38K80j46k73K05l57M40L19m95J71K06Jj00K45l58m5K88n9j58K85n83
$$ -316 -78 202 56 -217 -12 -369 71 390 -105 66 272 273 173 418 60 15 303 244 86 371 -212
5185b12K47kk16LK15k34K61ql12o6Jj20J82K54l09K71K30n63O5K26o1J52K41j59
$$ -212 35 33 -183 -180 35 -199 62 54 -258 -324 -323 -443 -261 -7 -316 -45 185 -378 -313 -87 -148 4 245 86
5209H6o9L45m70K93j69L9M2L64l39J32L6r9l1q4J06n3n6R0N7k56j54J39k29K39
$$ 86 17 362 -108 185 16 55 97 461 122 254 290 191 160 76 182 129 73 163 220 -36 -190 -51 -280 -41
5233d1k81K00O6l20K94oo7l71K53J14j15L32Pj42J08k16K40q0L66j77K3J16j64
$$ -41 -322 -122 -56 -376 -82 -88 -155 -526 -273 -159 -274 58 65 -77 31 -185 55 -25 341 164 187 303 139
5256A39pJ23l1M9J1k15J53j76J19k06j90L32l43l0k5K12r5K07l46q9K22k00K37
$$ 139 132 255 224 273 284 69 222 46 165 -41 -231 101 -242 -272 -297 -85 -180 27 -319 -408 -186 -386 -149
5279a49J9j14k82O61l91J92M45j77j0r9N02m77JJ86j26J99j07k53K14N9j58k13
$$ -149 -130 -244 -526 135 -256 -64 381 204 194 95 597 120 121 307 181 380 273 20 234 293 135 -78
5301g8L9j36O9K59m10K65l6J8l26K1l5J64K2j38L71m6m37L74l08R9L49k80K79
$$ -78 -39 -175 -106 153 -257 8 -28 -10 -336 -315 -350 -186 -164 -302 69 23 -414 -40 -348 -249 100 -180 99
5324I9J56k08P2P7O1m09L05j04K45K83k24k30J18k43O5N7J02m46M74m63j00L34
$$ 99 255 47 119 196 257 -152 153 49 294 577 353 123 241 -2 63 120 222 -224 250 -213 -313 21
5346B1j48J54J02n46J50J82K1k37j50K20n8M33k26j56O16k03l19L62j72R2n3p5
$$ 21 -127 27 129 -417 -267 -85 -64 -301 -451 -231 -289 144 -82 -238 378 175 -144 218 46 138 85 10
5368A0L36N4l73Q5J38k12J30Q4k67J07K1l10n4K14n38N46r6m89N24R9k23MJ42
$$ 10 346 400 27 112 250 38 168 252 -15 92 113 -197 -251 -37 -575 -29 -125 -614 -90 9 -214 -210 -68
5391f8l44J48K63m16K83K20l26J59R8m05M1O73l54M18l61k53K68L4j81P89m16
$$ -68 -412 -264 -1 -417 -134 86 -240 -81 17 -388 -347 326 -28 390 29 -224 44 78 -103 686 270
5412B70j02J28k41j66M16k56l6O1o0j05j19k13J97kl45J99q6J10K00j1J0PQ8K3
$$ 270 168 296 55 -111 305 49 13 74 14 -91 -210 -423 -226 -228 -573 -374 -460 -350 -150 -161 -151 -144 -56 -33
5436c3J72m66K21K39k29K23o9n4K49k91K31K14j08q6l9K3j2J3j5p3O9n2j31n4
$$ -33 139 -327 -106 133 -96 127 58 4 253 -38 193 407 299 213 174 197 185 198 183 110 179 127 -4 -58
5460e8J18N9l81m1j46J77J67j00p2o2j8NK9J70P5r2K4K08j36K86j26n6l7M34j42
$$ -58 60 119 -262 -303 -449 -272 -105 -205 -277 -339 -357 -352 -323 -153 -78 -170 -146 62 -74 212 86 30 -7 427 285
5485B85j01M8J64r1l27K32J05oj01l40K84k99n4N6n7J85n1k66K09R9j45K67k60
$$ 285 184 232 396 305 -22 210 315 309 208 -132 152 -147 -201 -145 -202 -17 -68 -334 -125 -26 -171 96 -164
5508a64k47J27K44Q1r4K34l83J17L69K37j85P6k91J6J21j1Mj50L57l32L75m09
$$ -164 -411 -284 -40 41 -53 181 -202 -85 284 521 336 412 121 137 258 247 251 101 458 126 501 92
5530I2p2J14m88L95O1k79J62l22J22P5N1l84K74j81K25k6K24r3L35l49k12M02
$$ 92 20 134 -354 41 102 -177 -15 -337 -215 -140 -89 -473 -199 -380 -155 -181 43 -50 285 -64 -276 126
5552A26N6j02q3J96k30L75p8j04J83j46j14r6L35k55L2l61N00l67K07l7q8J61
$$ 126 182 80 -3 193 -37 338 260 156 339 193 79 -17 318 63 95 -266 234 -133 74 37 -51 110
5574A10l2k57L28k90j1k5N1r3J79r9mJ3Q5JK79j88j9R6j43M22k72j46L39l0k1
$$ 110 78 -179 149 -141 -152 -177 -126 -219 -40 -139 -143 -130 -45 -44 235 47 28 124 -19 403 131 -15 324 294 273
5599B73j19J44m18M51m54n7K49m9m6L9k29M00j11j95P1o3R1l11J59N1j63Q6J15
$$ 273 154 298 -120 331 -123 -180 69 20 -26 13 -216 184 73 -122 -51 -114 -23 -334 -175 -124 -287 -201 -86
5622h6J15q4j72J33L8M7q6J64l88J60N79l13J26K52l23j31p1J04J04O8M3O5j01
$$ -86 29 -55 -227 -94 -56 -9 -95 69 -319 -159 420 107 233 485 162 31 -40 64 168 236 279 344 243
5645B43j54K26j41r5j34J2P3j53J60l84J81L7n4M3RL8r7j5J25j79L2qJ04P9M1
$$ 243 89 315 174 79 -55 -43 30 -123 37 -347 -166 -129 -183 -140 -131 -93 -190 -205 -80 -259 -227 -235 -131 -52 -11
5670a1p6M84l95K65L4j90K31k46K76j99j0L44l06o9j8Q6%j66k17R5n7K83m33q4
$$ -11 -87 397 2 267 301 111 342 96 372 173 163 507 201 132 114 200 200 34 -183 -88 -145 138 -295 -379
5694c79K15J56k33L12k69j77R0r6L71n2o9K60j66J53p4J05K8j1k9p7K6N1L41k84
$$ -379 -164 -8 -241 71 -198 -375 -285 -381 -10 -62 -131 129 -37 116 42 147 175 164 135 58 84 135 476 192
5718A92q4r3J90j3k43J42j80o2L04j84j80n2J85j64j62R7L8k12K78L2J51j10J3
$$ 192 108 15 205 192 -51 91 -89 -151 153 -31 -211 -263 -78 -242 -404 -307 -269 -481 -203 -171 -20 -130 -117
5741a17j39K50J5p4L69k19K1K5N6Mr3J62J01j23l45M04k13j42J53k15J16K33j74
$$ -117 -256 -6 9 -65 304 85 106 131 187 191 98 260 361 238 -107 297 84 -58 95 -120 -4 229 55
5764E5o5K72l39l8j11M9R5J49j64N1J09l9j78J95k92K4N71m29M1L91m57J98l9
$$ 55 -10 262 -77 -115 -226 -177 -82 67 -97 -46 63 24 -154 41 -251 -227 344 -85 -44 347 -110 88 49
5787D9Q5N1j77K73k07J52j77J90j19n2L81k79j17J03O9l40R3j81O6K0P6k48K50
$$ 49 134 185 8 281 74 226 49 239 120 68 449 170 53 156 225 -115 -22 -203 -137 -117 -41 -289 -39
5810c9k14m1J37qj2j10L56o8J27n5j67l8l8R3J12Pj03L98k92K5R9o6j45L59k75
$$ -39 -253 -294 -157 -165 -177 -287 69 1 128 73 -94 -132 -170 -77 35 42 -61 337 45 70 169 103 -42 317 42
5835D2j7N6j71OL67m63L68j51j54q9K20ol9k4r7J18L9m03L80j64j42J17l37K41
$$ 42 25 81 -90 -84 283 -180 188 37 -117 -206 14 8 -31 -55 -152 -34 5 -398 -18 -182 -324 -207 -544 -303
5859c03J63M77m93Q4K60k67R3K69k43j8O6K33r2Q1l18L22j60k34J84j61j92J08
$$ -303 -140 337 -156 -72 188 -79 14 283 40 22 88 321 229 310 -8 314 154 -80 104 -57 -249 -141
5881a41K50l07K16j55j56L21j66r7J5O3j57L1k89K72M52M8m27L98m43J94J91K63
$$ -141 109 -198 18 -137 -293 28 -138 -235 -220 -157 -314 -283 -572 -300 152 200 -227 171 -272 -78 113 376
5903C76l25J39k11L16k7K20m44J21O6j80K63k88Q2n6J01j25P5j79P0j61Q2k22
$$ 376 51 190 -21 295 268 488 44 165 231 51 314 26 108 52 153 28 103 -76 -6 -167 -85 -307
5925c07j2J41L1L67r5n45J67J17J80j1j2J25j71l03P67k08j00K48j52j69K12R8
$$ -307 -319 -178 -147 220 125 -420 -253 -136 44 33 21 146 -25 -328 439 231 131 379 227 58 270 368
5947C68k44kLO7m88M01j59j06L05K0j08j71J37k52k51L92k15l2J47J09J11l74
$$ 368 124 122 125 192 -296 105 -54 -160 145 165 57 -114 23 -229 -480 -88 -303 -335 -188 -79 32 -342
5969c42M55m83J34j7K52j88J90j15J10P3K57k15J5N9k52m2L20R5j53O0j80K5O1
$$ -342 113 -370 -236 -253 -1 -189 1 -114 -4 69 326 111 126 185 -67 -109 211 306 153 213 33 58 119
5992A19m7j29J48j7k79K1Q5M1j40J28J45m04m1M0M04q6m1Q4m8k02J62K15r9L1
$$ 119 72 -57 91 74 -205 -184 -99 -58 -198 -70 75 -329 -370 -330 74 -12 -53 31 -17 -219 -57 158 59 90
6016I0J62l48J17Q7K9J50k61J35m7m2j7J16l0k45M44k34o8j96K07k84r4K52J2
$$ 90 252 -96 21 108 137 287 26 161 114 72 55 171 141 -104 340 106 38 -158 49 -235 -329 -77 -65
6039f5J11j5q1l7K9k70K22K6Q4q4j39j37M14P5k76J47L55l28k22M58o4p0P6p8
$$ -65 46 31 -50 -87 -58 -328 -106 -80 4 -80 -219 -356 58 133 -143 4 359 31 -191 267 203 133 209 131
6063A31K4k71K77l0j63j46J88OJ94m4j35p6j40M48k86k60K33j40J36l30J75j15
$$ 131 155 -116 161 131 -32 -178 10 16 210 166 31 -45 -185 263 -23 -283 -50 -190 -54 -384 -209 -324
6085c24J21K50o7P2o9J00k41J86j3J36k2J4j84K80N6j22j93M32l88o5Q7J7L2l
$$ -324 -203 47 -20 52 -17 83 -158 28 15 151 129 143 -41 239 295 173 -20 412 24 -41 46 63 95 92
6109I2%j02J33k12J62k58J23p7J85j92q7J1q2K18k0l1K01n4k56L79j39J72j72
$$ 92 92 -10 123 -89 73 -185 -62 -139 46 -146 -233 -222 -304 -86 -106 -137 64 10 -246 133 -6 166 -6
6132fO7J12K59k65J52j64l30N79k59J14o3J89l09J94M9m43R4k72L83J97l51q5
$$ -6 61 173 432 167 319 155 -175 404 145 259 196 385 76 270 319 -124 -30 -302 81 278 -73 -158
6154a58J04p0P7j70j13L54N4r0n7p3J44j6K0n9J38m1J07j65l2K08j98L19j03k47
$$ -158 -54 -124 -47 -217 -330 24 78 -12 -69 -142 2 -14 6 -53 85 44 151 -14 -46 162 -36 283 180 -67
6178f7M3L85j25l9o04L96J81k77J48j57J91j44qJ13j40n1j72M44m56J11m4m1L10
$$ -67 -24 361 236 197 -407 -11 170 -107 41 -116 75 -69 -77 36 -104 -155 -327 117 -339 -228 -272 -313 -3
6201cj86L17k34K53k39L46l62L03k29J30k18J54J91k79M19k13M8J33k21j6j51
$$ -3 -189 128 -106 147 -92 254 -108 195 -34 96 -122 32 223 -56 363 150 198 331 110 94 -57
6222e7K1j30K26j8K83k56l38K8K81j49r1O9pN0J61j72J29J3q8N4j1J34K02j68
$$ -57 -36 -166 60 42 325 69 -269 -241 40 -109 -200 -131 -138 -88 73 -99 30 43 -45 9 -2 132 334 166
6246A66k82J30P2j47K46m8j28J58r0k67M67j50j80J43j07r5K51k88L39j81o4k92
$$ 166 -116 14 86 -61 185 137 9 167 77 -190 277 127 -53 90 -17 -112 139 -149 190 9 -55 -347
6268c47K79k48K21P4k00L42n89L04J55J82j60L0l56J92l4J27q8M74k97j6O4q5
$$ -347 -68 -316 -95 -21 -221 121 -468 -164 -9 173 13 43 -313 -121 -155 -28 -116 358 61 45 109 24
6290B4L12k73M19j86j88m7K05r3Ok42Q9L06k89j49J30j95k4N5rL47k41p0J02j40
$$ 24 336 63 482 296 108 61 266 173 179 -63 26 332 43 -106 24 -171 -195 -140 -149 198 -43 -113 -11 -151
6314a51k7%K72l43J25k10L01o2K57j51J25k92M89j85J29j32M6r8N9o2l8K72k16
$$ -151 -178 -178 94 -249 -124 -334 -33 -95 162 11 136 -156 333 148 277 145 191 93 152 90 52 324 108
6337A08O7j6k41K08k59m4J11o5R0j29M0P2j6l00K18j98J66J12k70M71j93K39L0
$$ 108 175 159 -82 126 -133 -177 -66 -131 -41 -170 -130 -58 -74 -374 -156 -354 -188 -76 -346 125 -68 171 201
6360B01l55M62l30M11m44M79l4l28m1%K37R2q7j33j07m6J55j39J23m35L1M05k17
$$ 201 -154 308 -22 389 -55 424 390 62 21 21 258 350 263 130 23 -23 132 -7 116 -319 -288 117 -100
6383a00J82j33k8k8lk36J01M5k5o2K68r4q3r2K46K24j05P7Q2k47J58J06J3j19
$$ -100 82 -51 -79 -107 -110 -346 -245 -200 -225 -287 -19 -113 -196 -288 -42 182 77 154 236 -11 147 253 266 147
6407A47N5j45O1R8R0l99J70o3N0k09J0M9K5k5k04J22R7m5qj07k35L17J50K11k30
$$ 147 202 57 118 216 306 -93 77 14 64 -145 -135 -86 -61 -86 -290 -168 -71 -116 -124 -231 -466 -149 1 212 -18
6432a8ML9K00l12j0J93j33LJ3L84k59j24N7K00j1J8l57K70o9R2k91Q6K0M0j74
$$ -18 -14 25 225 -87 -97 96 -37 -34 -21 363 104 -20 37 237 226 244 -113 157 88 180 -111 -25 -5 35 -139
6457a39K18j88j46K81l88L41q9j86M07J1j7M2k95j03J8K74l16O3K5J61J3m8J09
$$ -139 79 -109 -255 26 -362 -21 -110 -296 111 122 105 147 -148 -251 -233 41 -275 -212 -187 -26 -13 -61 48
6480D8M87l04r1M3j85r8J14r4K14Q9Nj58L8j79j33LO5N0K42l94q8K47p2M2q6j48
$$ 48 535 231 140 183 -2 -100 14 -80 134 223 228 70 108 -71 -204 -201 -136 -86 156 -238 -326 -79 -151 -109 -195 -343
6506c43L02K6m6j14L2K55j31k18L90k6j36m7L83k44M0l0m3Nk0K78j58j85O1K71
$$ -343 -41 -15 -61 -175 -143 112 -19 -237 153 127 -9 -56 327 83 123 93 50 55 35 313 155 -30 31 302
6530C02l31N7P5k01QN8j18j13J20p2L1j20J50Kk33M70m08J93L69j64N2j54o8M3
$$ 302 -29 28 103 -98 -90 -32 -150 -263 -143 -215 -184 -304 -154 -152 -385 85 -323 -130 239 75 127 -27 -95 -52
6554e2O5K3K21k03J07n7J4LK7L9j15o1J05m5Q0l5k13K6m1L13k48k99J92j12L25
$$ -52 13 36 257 54 161 104 118 121 148 187 72 11 116 71 151 116 -97 -71 -112 201 -47 -346 -154 -266 59
6579E9l72J17L2j58K15P5P3J38j84R2J61l18j65LN41k29R7j52J40j17K6P0k11
$$ 59 -313 -196 -164 -322 -107 -32 41 179 -5 87 248 -70 -235 -232 309 80 177 25 165 48 74 144 -67
6602f7J14M7j35j7L6J03q9j55L16k55N6m7J91j96r1j99L02K11j51l26K38l4K29
$$ -67 47 94 -41 -58 -22 81 -8 -163 153 -102 -46 -93 98 -98 -189 -388 -86 125 -26 -352 -114 -148 81
6625H1q3J88l2k72K59M6P8l67K83j86K95l81J17K45j50K4j04j66J55j83j6K07
$$ 81 -2 186 154 -118 141 187 265 -102 181 -5 290 -91 26 271 121 145 41 -125 30 -153 -169 38
6647C8q3J46m40J22R4k74J81L04k38l5J60o9L03j75l50J75J3Q0J38P9j56J92J88
$$ 38 -45 101 -339 -217 -123 -397 -216 88 -150 -185 -25 -94 209 34 -316 -141 -128 -48 90 169 13 205 393
6670C93l50k9j60M5J03O6k31L22R3l50m0k31L85j23K07j34j6l7o9J41j00l73N02
$$ 393 43 14 -146 -101 2 68 -163 159 252 -98 -138 -369 16 -107 100 -34 -50 -87 -156 -15 -115 -488 14
6693A4k47L74j7n27K62J98l13L13K31k36k8k64L66J26J04j04k03O8J34j5j94p0
$$ 14 -233 141 124 -403 -141 57 -256 57 288 52 24 -240 126 252 356 252 49 117 251 236 42 -28
6715b8K47j75M4N0K06k45l40K06Mn1k07L17j34J88q7j43J12K3o6j9N4o7M2j16
$$ -28 219 44 88 138 344 99 -241 -35 -31 -82 -289 28 -106 82 -5 -148 -36 -13 -79 -98 -44 -111 -69 -185
6739a85L82j20j63J98q3j60L5j4N4R3m3Q8J73l82N39j69j23P7k40PM35k92j02
$$ -185 197 77 -86 112 29 -131 -96 -110 -56 37 -6 82 255 -127 412 243 120 197 -43 -36 399 107 5
6762Er4n3J07L5o1K08l27l5K16j99L10k73J22j50L3R5N7JK37k43k83K77J95r0
$$ 5 -89 -142 -35 0 -61 147 -180 -215 1 -198 112 -161 -39 -189 -156 -61 -4 -3 234 -9 -292 -15 180 90
6786I0N3J49j48r0K07j08Ll1J59k76K25L2k83J17J9k04K98r4m85L13K7q8m4J17
$$ 90 143 292 144 54 261 153 156 125 284 8 233 265 -18 99 118 -86 212 118 -367 -54 -27 -115 -159 -42
6810d2j98Np1R6N4K83l2j74n3l5L24j01L7j57L41k07N1j20J49k62K43j95J65J29
$$ -42 -240 -235 -306 -210 -156 127 95 -79 -132 -167 157 56 93 -64 277 70 121 1 150 -112 131 -64 101 230
6834B30j36j15K47j68J37M1m03j87L58m3N2J78m12q0KO8K50n1J45k87J08R2P6
$$ 230 94 -21 226 58 195 236 -167 -354 4 -39 13 191 -221 -301 -299 -231 19 -32 113 -174 -66 26 102
6857A02j78J62NL5L2K6j32O3J04j54N3n6m9K95j77k26j63K89J64j58r3j16o1L46
$$ 102 -76 86 91 126 158 184 52 115 219 65 118 62 13 308 131 -95 -258 31 195 37 -56 -172 -233 113
6881A13j97k07L05K5k60j4K51l60M77P0j3l05p9R1L81l76L32k98J47l3l05N1J65
$$ 113 -84 -291 14 39 -221 -235 16 -344 133 203 190 -115 -194 -103 278 -98 234 -64 83 50 -255 -204 -39
6904c9J76q0p8K21j56m8N3k17l8M14k13L0q6l1J97j02k10R7j8n6K28l70J13L6
$$ -39 137 57 -21 200 44 -4 49 -168 -206 208 -5 25 -61 -92 105 3 -207 -110 -128 -184 44 -326 -213 -177
6928a77K0l9J20J37j54K35j74J75j04j50J85Q0J0J53j25p1j5K66l49j34N4M0K4
$$ -177 -157 -196 -76 61 -93 142 -32 143 39 -111 74 154 164 317 192 121 106 372 23 -111 -57 -17 7
6951GoK17m18K70k01K92j37j00mL15j46l33K96j70o9p4L38l03L02o2q7J18N2R3
$$ 7 1 218 -200 70 -131 161 24 -76 -80 235 89 -244 52 -118 -187 -261 77 -226 76 14 -73 45 97 190
6975A90L0r3l0j8K11j45J04j42J71j71j79K76J07p2j83k15K17j31Q0k74m5M39
$$ 190 220 127 97 79 290 145 249 107 278 107 -72 204 311 239 56 -159 58 -73 7 -267 -312 127
6997A27m1j88J21k69N0K54l49O7J43m5K0P0j78J28r5N05m85K49R6J29k15J03j14
$$ 127 86 -102 19 -250 -200 54 -295 -228 -85 -130 -110 -40 -218 -90 -185 320 -165 84 180 309 94 197 83
7020H3qJ17l55L32j95j3J16L2K1j82j11K50j26j08L9J10k15J89L3k23J73r6rl6
$$ 83 75 192 -163 169 -26 -39 77 109 130 -52 -163 87 -39 -147 -108 2 -213 -24 9 -214 -41 -137 -146 -182
7044a82J64n7j43L32k96M78l54K81k37pP8M5j80K69k50l7K38j80L09P7k68m8L1
$$ -182 -18 -75 -218 114 -182 296 -58 223 -14 -21 57 102 -78 191 -59 -96 142 -38 271 348 80 32 63
7067F3m22P9J57m3M03m67K03k52J68O7K62p0l66j60M21j35J44l40K33J97q5M5
$$ 63 -359 -280 -123 -166 237 -230 -27 -279 -111 -44 218 148 -218 -378 43 -92 52 -288 -55 142 57 102
7089A02M5K56k89j00K27q3K8n9j01j18jL09m2j96j05O9j00J6J52J65k23Q7p7J84
$$ 102 147 403 114 14 241 158 186 127 26 -92 -93 216 174 -22 -127 -58 -158 -142 10 175 -48 39 -38 146
7113A46l72K48q8L3L2J57k13J32Q1k73J00k2L8j81J47k0JK35k84q1J77N9l3R2
$$ 146 -226 22 -66 -33 -1 156 -57 75 156 -117 -17 -39 -1 -182 -35 -55 -54 181 -103 -184 -7 52 19 111
7137A11k21K46q3K8j99j17J92k11K88r7q5J11K81m59L68l99n6J63J54k5O6j51
$$ 111 -110 136 53 81 -118 -235 -43 -254 34 -63 -148 -37 244 -215 153 -246 -302 -139 15 -10 56 -95
7159i5j55K76j69J24K9r7K5K99k1l16K10l0j26M40j48m5k62R4j5J36J07k84m4
$$ -95 -250 26 -143 -19 10 -87 -62 237 216 -100 110 80 -46 394 246 201 -61 33 18 154 261 -23 -67
7182f7L63o14O72l29j47J45Lk52K40k87K19o5q9J42R7j35K50j84K05n6j94K12
$$ -67 296 -318 354 25 -122 23 26 -226 14 -273 -54 -119 -208 -66 31 -104 146 -38 167 111 -83 129
7204A29k12J15j19j11J85J24J46k17l0L55m87m8L46j46K9N7l9Q5k24J55o9k7m8
$$ 129 -83 32 -87 -198 -13 111 257 40 10 365 -122 -170 176 30 59 116 77 162 -62 93 24 -3 -51
7227e1J52k30J43j28J08l18K15O6n8J11j06K76l88K30j98K02j52Q8p0N3K45k51
$$ -51 101 -129 14 -114 -6 -324 -109 -43 -101 10 -96 180 -208 22 -176 26 -126 -38 -108 -55 190 -61
7249f1K11j19K4jQ1j01P8k11K38M9k86l9J63j54M3K06k51J54r0m7N8K4J17k79
$$ -61 150 31 55 54 135 34 112 -99 139 188 -98 -137 26 -128 -85 121 -130 24 -66 -113 -55 -31 86 -193
7273a93K74j25p8J00J02j93r5K89N4M5p7j35O9K83k53l6j43n8K91j00K1j7j42
$$ -193 81 -44 -122 -22 80 -113 -208 81 135 180 103 -32 37 320 67 31 -112 -170 121 21 42 25 -117
7296a17o3K53l74L63k22mQ4j74q4L34j60j01L96j93J77l2r3M0r7J49j39O4j66
$$ -117 -180 73 -301 62 -160 -164 -80 -254 -338 -4 -164 -265 131 -62 115 83 -10 30 -67 82 -57 7 -159
7319a59K28j26P9o2L30j74r1q9J39j95J36j82M22j21j89Lk54L02O8n7j7n5n0j86
$$ -159 69 -57 22 -40 290 116 25 -64 75 -120 16 -166 256 135 -54 -51 -305 -3 65 8 -9 -64 -114 -300
7343c00L17k78K36j25kJ97k25J80j9J34n7j78L33j72k24J72R1q7J49N7j3j20p2
$$ -300 17 -261 -25 -150 -152 45 -180 0 -19 115 58 -120 213 41 -183 -11 80 -7 142 199 186 66 -6
7366fj78L43p6j60J74j68O8J0m5R5j15K71m86J24m7L33P0k80L16m28K98k99K76
$$ -6 -184 159 83 -77 97 -71 -3 7 -38 57 -58 213 -273 -149 -196 137 207 -73 243 -185 113 -186 90
7389I0p4j0P6j15K0rj57J45k31L98N3j65L3N0R3k83o0r5K43K6J21O6l14r0J96
$$ 90 16 6 82 -33 -13 -22 -179 -34 -265 133 186 21 54 104 197 -86 -146 -241 2 28 149 215 -99 -189 7
7414GK1p8k83L48p3J9P7j34L4N5r6j19K07J2K8M4M0l5j02k9n6M4K45l67M25J50
$$ 7 28 -50 -333 15 -58 -39 38 -96 -62 -7 -103 -222 -15 -3 25 69 109 74 -28 -57 -113 -69 176 -191 234 384
7440C84j37k44j36K47Nl03M63j23l11J56jJ54j44p6l10Q5q9L90j10ok21K42j81
$$ 384 247 3 -133 114 119 -184 279 156 -155 1 0 154 10 -66 -376 -291 -380 10 -100 -106 -327 -85 -266
7463b66J41N3O6k90K77r1J90j93J16K51k58k5m4J22j99L21o5k7L03m13P6qk86
$$ -266 -125 -72 -6 -296 -19 -110 80 -113 3 254 -4 -29 -73 49 -150 171 106 79 382 -31 45 37 -249
7486b49K53K51RJ8k48j00k3Q6rj27J09J50k10K42j32n6M3J0o5j86K21K81k90N0
$$ -249 4 255 264 282 34 -66 -89 -3 -12 -139 -30 120 -90 152 20 -36 7 17 -48 -234 -13 268 -22 28
7510B8P5j84L82n12K75j8k90M40j13q9J30j78l5K57R8l83R9p5J59j13j59M11l22
$$ 28 103 -81 301 -211 64 46 -244 196 83 -6 124 -54 -89 168 266 -117 -18 -93 66 -47 -206 205 -117
7533a17l8J79L8j38K28j91j41k8J4L15k2j45J07K13k62J51j58R3l5j83J93l37
$$ -117 -155 24 62 -76 152 -39 -180 -208 -194 121 99 -46 61 274 12 163 5 98 63 -120 73 -264
7555b64M41j53j9J9rJ59j70L77l88Q1j05J68n2J09k83L8J1o1q4R9m2o1k7r0J23
$$ -264 177 24 5 24 15 174 4 381 -7 74 -31 137 85 194 -89 -51 -40 -101 -185 -86 -128 -189 -216 -306 -183
7580a83j04J17J86k13Q6J73j07l3l6K53q1n7Ql6P4j09j81M21J9j01k9L4r4K58
$$ -183 -287 -170 16 -197 -111 62 -45 -78 -114 139 58 1 9 -27 47 -62 -243 178 197 96 67 101 7 265
7604B65k49J68k35K53l16r8L0J91l6m9r3K98j06k43L07j00j82M1m6mq2K68j05
$$ 265 16 184 -51 202 -114 -212 -182 9 -27 -76 -169 129 23 -220 87 -13 -195 -154 -200 -204 -286 -18 -123
7627a23K54K3K2k67J40J00k07P6l7K51n13O55m24K4kK9j28P6J1R8J98l17J56k04
$$ -123 131 154 176 -91 49 149 -58 18 -19 232 -281 374 -50 -26 -28 1 -127 -51 -40 58 256 -61 95 -109
7651a09J20l5J39p0j07J05o2q8K13j67k91m4M5J74N31n44J9J71K76j17Nmk32J40
$$ -109 11 -24 115 45 -62 43 -19 -107 106 -61 -352 -396 -351 -177 354 -190 -171 0 276 159 164 160 -72 68
7675F8m9r5n0N9j8P4J26J08k95k5K01l89J57J76j16Mj33L7p6L03M3k41l7K59j92
$$ 68 19 -76 -126 -67 -85 -11 115 223 -72 -97 104 -285 -128 48 -68 -64 -197 -160 -236 67 110 -131 -168 91 -101
7700a01M53l84J24L2K31OJn83J06N7J04j41K61j66K03l16K46j18p6J13j76K24
$$ -101 352 -32 92 124 355 361 362 -221 -115 -58 46 -95 166 0 203 -113 133 15 -61 52 -124 100
7722A00M7m5k77J19N5J79l31Q0Q5o5K02j27n1n3J96k75K3K31j35K30r6k07Q7O4
$$ 100 147 102 -175 -56 -1 178 -153 -73 12 -53 149 22 -29 -82 114 -161 -138 93 -42 188 92 -115 -28 36
7746C6j3P4J22j85K07o4k81O2RK52j26k35n3J53n1K93k08o6p3J73P0j10q7J27
$$ 36 23 97 219 34 241 177 -104 -42 -33 219 93 -142 -195 -42 -93 200 -8 -74 -147 26 96 -14 -101 26
7770B6%o4k31K07kn5kR3j80J37O8J48j31q1j7K90p1j09lJ45r9k7j26M36l56K29
$$ 26 26 -38 -269 -62 -64 -119 -121 -28 -208 -71 -3 145 14 -67 -84 206 135 26 23 168 69 42 -84 352 -4 225
7796B25q9m05K10k05K31M3N6k42q8L09l37Q4J63j44K19k15m0L10j99K20J44l75
$$ 225 136 -269 -59 -264 -33 10 66 -176 -264 45 -292 -208 -45 -189 30 -185 -225 85 -114 106 250 -125
7818a25J11j65K45J88l25P0j4J73j33j69L22o0K54m16J42Qj10J3m9m6R7K37l8
$$ -125 -14 -179 66 254 -71 -1 -15 158 25 -144 178 118 372 -44 98 106 -4 9 -40 -86 11 248 210
7841B10j73j27K04k70J53k60K19J4k6k45J28K94j8l48P1Q0K17k18l18M62j63J32
$$ 210 37 -90 114 -156 -3 -263 -44 -30 -56 -301 -173 121 103 -245 -174 -94 123 -95 -413 49 -114 18
7863A8N1o3k66L57m5R8r4J0j84J26j53N1J28J94k94K03p7l03K28q8J44J4k1j8
$$ 18 69 6 -260 97 52 150 56 66 -118 8 -145 -94 34 228 -66 137 60 -243 -15 -103 41 55 34 16
7887A6J42k56n5K96j32O9L0n6qJ19l9m8p1N2Q1n6LJ08j59o4j57Q8J41k57J62k04
$$ 16 158 -98 -153 143 11 80 110 54 46 165 126 78 7 59 140 84 87 195 36 -28 -185 -97 44 -213 -51 -255
7913b55J33K3Q8l3j17O2K64j49j05J59k0J67k85n3K90j02j68J59J4j77Q1M49l7
$$ -255 -122 -99 -11 -44 -161 -99 165 16 -89 70 50 217 -68 -121 169 67 -101 58 72 -105 -24 425 388
7936C88l14k20J58J05J9J7q4J13j63M3LPp8Q1k34J89K32k08k8J5n5K5k4K4K05
$$ 388 74 -146 12 117 136 153 69 182 19 62 65 72 -6 75 -159 30 262 54 26 41 -14 11 -13 11 216
7961B16k82J41l83L00J43q0nR4j87Q6K39l22P0kj17J08K00j38J38m1M9j66K27
$$ 216 -66 75 -308 -8 135 55 50 144 -43 43 282 -40 30 28 -89 19 219 81 219 178 227 61 288
7984B88l34l7K88K3j40J00l48R4J70r1p2j4PL1j80O2R2n8N9J53m25K91j21L88
$$ 288 -46 -83 205 228 88 188 -160 -66 104 13 -59 -73 -66 -35 -215 -153 -61 -119 -60 93 -332 -41 -162 226
8008B26j09j34m8J70Ll5N8l7P6j2j58N8j05Q4PN0k34K10J00J58n40K00N1j25R7
$$ 226 117 -17 -65 105 108 73 131 94 170 158 0 58 -47 37 44 94 -140 70 170 328 -212 -12 39 -86 11
8033A1r1J33NJ1K0j32J80m44M31j64L2k1M4J61j54j21k5K04q5j99K55M8p0L9k61
$$ 11 -80 53 58 69 89 -43 137 -307 124 -40 -8 -29 15 176 22 -99 -124 80 -5 -204 51 99 29 68 -193
8058a93L84j38K5k64L31k7j21l09L62K64l69j63J17J03J95k00j4n1P7P0M2n17
$$ -193 191 53 78 -186 145 118 -3 -312 50 314 -55 -218 -101 2 197 -3 -17 -68 9 79 121 -396
8080c96M81j37K7Qo2P1K14k68J16j62K07%j46m5Q2j39J99Q4j39r7L0j22J82r0
$$ -396 85 -52 -25 -17 -79 -8 206 -62 54 -108 99 99 -47 -92 -10 -149 50 134 -5 -102 -72 -194 -12 -102
8104a02L1J57k25J7N0K42p8q7J66q5j84m1L52r9J0m3j0j35j99K25l18J99J9K62
$$ -102 -71 86 -139 -122 -72 170 92 5 171 86 -98 -139 213 114 124 81 71 -64 -263 -38 -356 -157 -138 124
8128A24K8j34Q4O6k51K99o5L0J22k43j7L31m65K39j23k5O7l66J57k2K42k32q5
$$ 124 152 18 102 168 -83 216 151 181 303 60 43 374 -91 148 25 0 67 -299 -142 -164 78 -154 -239
8151b39J84P6J8J09k02q5q4L90j6m8L3q4K21m49J46K94k31J22R4k5j94n0Ol2o2
$$ -239 -55 21 39 148 -54 -139 -223 167 151 103 136 52 273 -176 -30 264 33 155 249 224 30 -20 -14 -46 -108
8176a08pR5J83k89L1L66k67J94j39J4m4l19K76L8k79
$$ -108 -115 -20 163 -126 -95 271 4 198 59 73 29 -290 -14 24 -255
8191b55
$$ Imaginary data points
##PAGE= N=2
##DATA TABLE= (X++(I..I)), XYDATA
0@%%%%%%%%%%%qJ6j6J6j6K4l2M0m8N6o4P2q8J04j20J38j62J86k10K40k74L11l51
$$ 0 0 0 0 0 0 0 0 0 0 0 0 -8 8 -8 8 -8 16 -16 24 -24 32 -32 40 -48 56 -64 74 -88 98 -112 128 -146 165 -186
34a86L96m47N01n60O24o95P74q58R52j052J161j283J414j558J717j891K082k293
$$ -186 210 -237 264 -296 328 -367 407 -451 501 -551 610 -673 741 -817 900 -991 1091 -1202
52a202K528k789L086l422L802m244M760n370O108p025Q189r722J1842j4956J9958
$$ -1202 1326 -1463 1623 -1799 2003 -2241 2519 -2851 3257 -3768 4421 -5301 6541 -8415 11543
67A1543k9201N1396j89636j50955N33495k98806j35198M41418k20933k07427L42650
$$ 11543 -17658 33738 -155898 -306853 226642 -72164 -207362 234056 13123 -194304 148346
78A48346j70640j49409K86688j00863j24519J89421j20509n1485K00292q5543
$$ 148346 -22294 -171703 114985 14122 -110397 79024 -41485 -92970 107322 21779
88B1779p3845J17870n7338r925N8132p0382L0647K6897r1290N9115P311p4638
$$ 21779 -52066 65804 8466 -1459 56673 -13709 16938 43835 -47455 11660 18971 -55667
100e5667J30868M62j41409J09516L070j35552J04993k7350j26101J88213J3681
$$ -55667 75201 75663 -65746 43770 46840 -88712 16281 -11069 -137170 51043 64724
111F4724j67440J63679J8125k08647J23322M6561j64261J47457Q0188j79481N7159
$$ 64724 -102716 60963 79088 -129559 -6237 40324 -123937 23520 103708 -75773 -18614
122a8614M8453j05429J11484L9911j21269J00513J5818j62239Q2692P0143j11962
$$ -18614 29839 -75590 35894 75805 -45464 55049 70867 -91372 -8680 61463 -50499
133e0499O6238N7649j21344K6792R4468m8230k5455J4337k7805j6510q091J3320
$$ -50499 15739 73388 -47956 -21164 73304 25074 -381 13956 -13849 -30359 -38450 -25130
145b5130L6380N845R204p554n4856R439L3097l1550J1279K6688l3867J5655K2640
$$ -25130 11250 17095 26299 18745 -36111 -26672 6425 -25125 -13846 12842 -21025 -5370 17270
158A7270n3643J1473N8633k5018j3091L3924j6895k1580J0150j9737j3855L8971
$$ 17270 -36373 -24900 33733 8715 -4376 29548 12653 -8927 1223 -18514 -32369 6602
170F602K6713j4230K138L385k7105M777J5510m2516M029N3261m5536k9085P5583
$$ 6602 33315 19085 21223 24608 -2497 2280 17790 -24726 -20697 32564 -12972 -42057 33526
183C3526q254l7891N0237l7530o5855O5865J0220m6525N4752J108n6866L3665
$$ 33526 25272 -12619 37618 88 -65767 98 10318 -36207 18545 19653 -37213 -3548
195c548q984l1811P5688J2116n5995K3056j6443m3036M4392N978j7916M8314k109
$$ -3548 -12532 -44343 31345 43461 -12534 10522 -5921 -48957 -4565 1413 -16503 31811 29702
208B9702k5092K0569k7352p198L9117m1104j4868M9509k4994q1M1573m5101m74
$$ 29702 4610 25179 -2173 -9371 29746 -11358 -26226 23283 -1711 -1792 39781 -5320 -5794
221e794M3236n7019l311M6884n2306J1912M9436p1032R943O5943o9960N99P0696
$$ -5794 37442 -19577 -22888 23996 -28310 -16398 33038 -37994 -28051 37892 -32068 -31469 39227
234C9227n6750L987O0011p7126j7764O3249m4309P964O9800l5955J194L2480o6940
$$ 39227 -17523 -13536 46475 -30651 -48415 14834 -29475 -21511 48289 12334 13528 46008 -20932
247b0932l875M6494l4370J8167L3576n1737J5863L1909n0658J9369L2980m9363
$$ -20932 -24807 21687 -12683 5484 39060 -12677 3186 35095 -15563 3806 36786 -12577
259a2577J0118J4704m6640K7544K2721m1310K3402L626l8445M6996M109m7305
$$ -12577 -2459 12245 -34395 -6851 15870 -25440 -2038 1588 -36857 10139 14248 -33057
271c3057N2201l830p1749M8190J1683n6832P0295L1228o9174M2390K1724p4849
$$ -33057 19144 15314 -56435 -8245 3438 -53394 16901 48129 -21045 21345 43069 -31780
283c1780K7007K5430n0289M1354K8663n1338K7641J4209n2308L1432J6236m7654
$$ -31780 -4773 20657 -29632 11722 40385 -10953 16688 30897 -21411 10021 26257 -21397
295b1397L4236J5055o0552K0199K4511m2899K2270K8173l5362Q702J9565k5695
$$ -21397 12839 27894 -32658 -12459 12052 -30847 -8577 19596 -15766 -7064 12501 -13194
307a3194K800N952j3943Q125p141m577L5174k482q553L2337k6792l3785L6371
$$ -13194 -10394 -4442 -18385 -10260 -17401 -21978 13196 10714 2161 34498 7706 -26079 10292
320A0292j2439k5330N4143N18l6458L5265j1086l8139M2215k194l3733M2504j2890
$$ 10292 -2147 -27477 26666 27184 -9274 25991 14905 -23234 18981 16787 -16946 25558 12668
333A2668m5249M3737j0234m4501O0165L835n4119N2294N932o6877L9820J7132
$$ 12668 -32581 11156 922 -43579 16586 20421 -33698 18596 24528 -42349 -2529 14603
345A4603o0492L3702K9410m3902K5918K7024l2103J4286N046l0866J5431r36j4979
$$ 14603 -45889 -12187 17223 -26679 -761 26263 -5840 8446 13492 -17374 -1943 -2879 -17858
358a7858L6207m576k0187L3453j8248k9978M1153j0200k5026M2227j5852l4293
$$ -17858 18349 13773 -6414 27039 8791 -21187 19966 9766 -15260 26967 11115 -23178
370b3178L3920j7647k0587M8527j5585j7561M6521l4639l1521M9724l3613k8563
$$ -23178 10742 -6905 -27492 21035 5450 -12111 34410 -229 -31750 17974 -15639 -44202
382d4202O7053k3920l3853O7338k0469m4536N7435j7505m5208N0620r245l5022
$$ -44202 22851 -1069 -34922 32416 11947 -32589 24846 7341 -37867 12753 3508 -31514
394c1514M9010n001k8017L8962j5872k6237L8257j4428j8439L9116j9176k3426
$$ -31514 17496 12495 -15522 23440 7568 -18669 19588 5160 -13279 25837 6661 -16765
406a6765L0506k0115j3724M0096r087j0064K4073k3397j4979J5735k2193L435
$$ -16765 13741 -6374 -20098 19998 10911 847 24920 1523 -13456 2279 -19914 -16479
418a6479K6292j9554P824K2224l2332N427K3213l7393K981L1346l1835L650L4102
$$ -16479 9813 -9741 -1917 20307 -12025 -6598 16615 -20778 -17797 13549 -18286 -14636 19466
431A9466k8478j139L0947k6601m099K9556k0207k994K3079k2488n869K2011j7343
$$ 19466 -9012 -10151 20796 -5805 -9904 19652 -555 -3549 19530 -2958 -8827 13184 -4159
444d159k427K5781r955m455J7468j7400j5455J0871r882p148J8132L122m059P623
$$ -4159 -6586 19195 9240 4785 22253 4853 -10602 269 -9613 -16761 1371 4493 434 8057
458H057n624j3338L269N58n663O170M678n591L531J562l768O119M091m878N654
$$ 8057 2433 -10905 -7636 -7078 -12741 -6571 -1893 -7484 -3953 -2391 -6159 -40 4051 -827 4827
473D827J224q105P701N12j3724R621N441j0561J6157P621j7127J0464j025k8456
$$ 4827 6051 -2054 5647 6159 -7565 2056 7497 -3064 13093 20714 3587 14051 13026 -15430
487a5430J1183P661k0134K0526J0609k4677J6553L999l1348J6397O878k8480K3509
$$ -15430 -4247 3414 -16720 3806 14415 -10262 6291 10290 -21058 -4661 2217 -26263 -2754
500b754Q808k9182K5085O843l3357K6865J0004l0746L0439O274l6912K5546M082
$$ -2754 6054 -23128 1957 8800 -24557 2308 12312 -18434 12005 18279 -18633 6913 10995
513A0995l3917L0349Q587k6269L2399n35l1027K8992r027l3779L3966p855k8599
$$ 10995 -22922 7427 16014 -10255 22144 21609 -9418 19574 10547 -23232 10734 2879 -25720
526b5720M5323p092l2809M1387j4649l8123M1688j1563l0484M6076j2523l0866
$$ -25720 19603 12511 -20298 21089 6440 -31683 10005 -1558 -32042 14034 1511 -29355
538b9355M3123j7208k4859M7403j8493k1152M7526k5586k6122M8016k6082k5174
$$ -29355 13768 -3440 -28299 19104 611 -20541 26985 1399 -24723 23293 -2789 -27963
550b7963N2853k2045j8741N1552k4764k2902M0837l3980j7466M3115k8065o663
$$ -27963 24890 2845 -15896 35656 10892 -12010 28827 -5153 -22619 20496 -7569 -14232
562a4232M4860l4038p925L7913m0546l459L9959m0163j045M1821m0326K30L8284
$$ -14232 30628 -3410 -11335 26578 -13968 -17427 22532 -17631 -18676 23145 -17181 -16951 21333
575B1333l9659L065L7174l6467Q673L0342l9528O777K5174m0620J6700K7847l6906
$$ 21333 -18326 -15261 21913 -14554 -5881 24461 -15067 -8290 16884 -23736 -7036 20811 -16095
588a6095K3164K4447m3510J5296J9246m3327J5183K3049l4105J8655K0711l1528
$$ -16095 7069 31516 -11994 3302 22548 -20779 -5596 17453 -16652 2003 22714 -8814
600h814J4863R335l1885J8481Q537k8686K3081O362l0356J9974N922k7846K4146
$$ -8814 6049 15384 -16501 1980 10517 -18169 4912 11274 -19082 892 6814 -21032 3114
613C114P686k4240J8600L164k4770J5429M09j7558K0334Q27j2201K0981k269j4835
$$ 3114 10800 -13440 5160 8324 -16446 -1017 -608 -18166 2168 2995 -9206 11775 9506 -5329
627e329J6091r360j4926J7736l957o828J8481l548r221J2603q665j0067J2996
$$ -5329 10762 1402 -13524 4212 255 -6573 11908 8360 -861 11742 3077 -6990 6006
640F006l752m284Q277o039m197O174q499J043R046l939Q15L779q811l220K335
$$ 6006 2254 -2030 6247 208 -3989 2185 -6314 -5271 3775 -164 651 4430 -4381 -7601 -5266
655e266l666M93M081L776K831j126R87R32o063M57K521o334N632P356m722M826
$$ -5266 -8932 -8439 -4358 -582 2249 1123 2110 3042 -3021 -2564 -43 -6377 -745 6611 1889 6715
671F715K864p793M115r71r269J0698J737j0990J0117l384j4702J4126o49j2379
$$ 6715 9579 1786 5901 4930 -4339 6359 8096 -2894 7223 3839 -10863 3263 2614 -9765
685i765J8446j153j7904J3699o755j8569K0434n10j3632K2209j883j5139J8370
$$ -9765 8681 7528 -10376 3323 -3432 -22001 -1567 -2077 -15709 6500 4617 -10522 7848
698G848q158j5467K2596p153j2315K2759p000r618K3390j3081r494K2697j5316
$$ 7848 -310 -15777 6819 -334 -12649 10110 3110 -6508 16882 3801 -5693 17004 1688
711A688q449K3508j6326n289K3037k0921p818K3993j9087k172K6157k2354m226
$$ 1688 -6761 16747 421 -4868 18169 -2752 -10570 13423 -5664 -7836 18321 -4033 -8259
724h259K1498k7860m515K6029k0130K682K6850k4202n38K2307k7404J089K4231
$$ -8259 13239 -14621 -19136 6893 -13237 -10555 16295 -7907 -8445 13862 -13542 -12453 11778
737A1778k2576M777K2983k5385M783K2246k4875N994J9812k6035P037J8028k7306
$$ 11778 -10798 -6021 16962 -8423 -3640 18606 -6269 -275 19537 -6498 539 18567 -8739
750h739Q436J7662k7017Q690J5357k6031J2571J6022k7347J0107J0654k9023J1182
$$ -8739 -303 17359 -9658 -968 14389 -11642 929 16951 -10396 -289 10365 -18658 -7476
763g476J1710k2645J8485J3638k5365J2388O761k5996J5422R366k1213J8594Q176
$$ -7476 4234 -18411 74 13712 -11653 735 7496 -18500 -3078 6288 -14925 3669 11845
776A1845k3085J4421N844j9623J7414N465j9663J5032K301j9421J4376K175j5956
$$ 11845 -11240 3181 9025 -10598 6816 12281 -7382 7650 9951 -9470 4906 7081 -8875
789h875J6249J120j6540J4944O81j5215J3247k695j6200J3587o11j2202J6941
$$ -8875 7374 8494 -8046 6898 7579 -7636 5611 2916 -13284 303 -308 -12510 4431
802D431J504j2836J1979m407j5600J4232O35j0488J5551L88j3558J1039m37j2609
$$ 4431 5935 -6901 5078 671 -14929 -697 -62 -10550 5001 5389 -8169 2870 2433 -10176
816a0176J4094M138j2048R782M6j3232Q536L045r621J0598M102j1234O510J667
$$ -10176 3918 8056 -3992 5790 5836 -7396 1140 4185 -5436 5162 9264 -1970 4540 6207
830F207j0498O339K231j0593N504L363p647O168M044p193L905m36q855L812J807
$$ 6207 -4291 2048 4279 -6314 -810 2553 -5094 1074 5118 -2075 1830 1394 -7461 -3649 -1842
845a842m409P798M56p081N662k314o120Q504K071m988Q343l781r779P403O38o514
$$ -1842 -6251 1547 2003 -5078 584 -1730 -7850 654 2725 -2263 6080 2299 -7480 -77 561 -5953
861e953J2807J465r528R068k272j2040J0899K80j1009J2659j352j1901J2610N28
$$ -5953 6854 8319 -1209 7859 5587 -6453 4446 4726 -6283 6376 5024 -6877 5733 6261
875F261j3477J1735K02j5006R026K608j2544J1774L675j2184O707J901j0556Q272
$$ 6261 -7216 4519 4721 -10285 -1259 1349 -11195 579 4254 -7930 -1223 678 -9878 -1606
889a606L231o153O561L08r680O084J082l863R755J158n237M965l534o411O029
$$ -1606 1625 -4528 2033 2341 -7339 -1255 -173 -4036 5719 6877 1640 6605 3071 -3340 2689
904B689p02j884N622j215k918M234n840o87N853p155j005O397q556k036R710o557
$$ 2689 1987 103 5725 4510 1592 5826 -14 -701 5152 -2003 -3008 3389 -5167 -7203 2507 -4050
920d050j724Q874p511m411R901m387k558R787m767n549P189l367k557J0583k25
$$ -4050 -5774 3100 -4411 -8822 1079 -3308 -5866 3921 -846 -6395 794 -2573 -5130 5453 5228
935E228l361O081m712o523N550N24k894O362J334o073R25L80m249R83L236k458
$$ 5228 1867 7948 3236 -3287 2263 2787 -107 6255 7589 1516 2441 2821 -1428 -445 2791 333
951C33j867Q25k365j689K025J151q89L67q81m59J07k89K612M91k535J551M69k269
$$ 333 -1534 -709 -3074 -4763 -2738 -1587 -2476 -2109 -2990 -3449 -3342 -3631 -1019 -528 -3063 -1512 -1043 -3312
969c312M815L570l881L478o7p873L913K827n164P350L387r583M268J166j0964
$$ -3312 1503 5073 1192 4670 4603 -3270 643 3470 -1694 5656 9043 -540 3728 4894 -6070
984f070P435M879j0867O502L645j4209O276N826j2155P928O789j4093N822N728
$$ -6070 1365 6244 -4623 1879 5524 -8685 -2409 3417 -8738 -810 5979 -8114 -2292 3436
998C436j3152O827P119j1251O335M388j0960Q030M359j0002R550J034j1414Q798
$$ 3436 -9716 -2889 4230 -7021 -686 3702 -7258 772 5131 -4871 4679 5713 -5701 3097
1012C097m01q238J2070K53r399J0039m902j0583J4040l276p824J4691p028j1636
$$ 3097 2696 -5542 6528 6781 -2618 7421 2519 -8064 5976 2700 -5124 9567 2539 -9097
1026i097J4769o364j0777J9659o075j1004J6917j0240j1041J9487o865j1037K1126
$$ -9097 5672 -692 -11469 8190 2115 -8889 8028 -2212 -13253 6234 -631 -11668 9458
1039I458r615j3636K0892o283j1334J9308p213j1127J6671p403p069J6325p646
$$ 9458 -157 -13793 7099 816 -10518 8790 1577 -9550 7121 -282 -7351 8974 1328
1052A328m616J2948j1758k320J2965j1059L49J4059j3796k18J1233j5877K681
$$ 1328 -3288 9660 -2098 -4418 8547 -2512 -2163 11896 -1900 -2118 9115 -6762 -4081
1065d081J3008j4371M245J2609j8840K701J0602j6581O901J2973j7205O024R094
$$ -4081 8927 -5444 -1199 11410 -7430 -4729 5873 -10708 -3807 9166 -8039 -2015 7079
1078G079j9135P877J3683j7570O609J0955j8852N368J2328j3340M822J0205j3816
$$ 7079 -12056 -4179 9504 -8066 -1457 9498 -9354 -3986 8342 -4998 -176 10029 -3787
1091c787K796O627r102O359N082r035N640o91r613R075J323p992Q789j213r723
$$ -3787 -991 5636 -3466 2893 7975 -1060 4580 3889 -5724 3351 4674 -3318 5471 4258 -5465
1106e465O360j253n642Q479l378m522Q733o557m599J0721o800m437J3125n684
$$ -5465 895 -358 -6000 2479 -899 -5421 3312 -3245 -7844 2877 -3923 -8360 4765 -919
1120i19o082J1728n577o960J1838j639o241R523k009o926O626K7k244L964q27
$$ -919 -7001 4727 -850 -7810 4028 2389 -3852 5671 3662 -3264 3362 3389 1145 5109 4282
1135D282l683J125j095J23K267m11j90k244k937K10K09J574K133l297p56P76n689
$$ 4282 599 1724 629 752 3019 2608 2418 174 -2763 -2553 -2344 -770 1363 -1934 -2690 -1914 -7603
1152g603L333O883n912K98O352q596q84R842m887j432Q067n328k348O114k284
$$ -7603 -4270 2613 -3299 -3001 3351 -5245 -6129 3713 -1174 -2606 5461 133 -2215 3899 1615
1167A615J09L706m530J006K176n048L675J887o055L980J194o679M561L46o656
$$ 1615 1724 5430 900 1906 4082 -966 2709 4596 -1459 2521 3715 -2964 1597 1943 -4713
1182d713M954q71m614P815l767n317Q075m898m931J3610n303o838J1940p529q422
$$ -4713 241 -630 -5244 2571 -1196 -6513 1562 -3336 -8267 5343 40 -6798 5142 -2387 -10809
1197a0809J7079l340r379J5225n212j1978J3946k244p398J3070m494r144R910
$$ -10809 6270 2930 -6449 8776 3564 -8414 5532 3288 -4110 8960 4466 -4678 5232
1210E232m385m649J2306n863n606Q821q179l754J1496o334k514P711q299k165
$$ 5232 847 -3802 8504 2641 -2965 5856 -2323 -6077 5419 -915 -3429 4282 -4017 -6182
1224f182P661n501K003O464r707K483O586j0857N999O287j2789O836P708j3474
$$ -6182 1479 -4022 -2019 4445 -5262 -2779 3807 -7050 -1051 5236 -7553 -717 6991 -6483
1238f483P067P943j3890N136Q619j3102N207Q701j4366M881R423j5181P295Q758
$$ -6483 584 8527 -5363 -227 8392 -4710 497 9198 -5168 -287 9136 -6045 1250 10008
1252A0008j4628M113O593j3776O743Q316j1716N063L847j2182N650O101q199M980
$$ 10008 -4620 -507 6086 -7690 -947 7369 -4347 716 4563 -7619 -1969 4132 -4067 913
1266I13K458r928L925K725n135Q045J95p280M666k11o208R988j713n565P521l643
$$ 913 3371 -6557 -2632 93 -5042 3003 3198 -4082 584 373 -5835 4153 2440 -3125 4396 753
1282G53o095R755j029n082Q757n317o139R208l327n499Q763l034n266P481k524
$$ 753 -5342 4413 3384 -1698 7059 1742 -4397 4811 1484 -4015 4748 1714 -3552 3929 1405
1297A405m844O212k725l335N052k138l692N321k713l635N502j893j155L714o88
$$ 1405 -3439 2773 48 -3287 1765 -373 -4065 1256 -1457 -5092 410 -1483 -2638 1076 388
1312C88l176J642o20l94L384L59n40L57j748K331J795k233J579J142n173P64L642
$$ 388 -2788 -1146 -1766 -2160 1224 1583 1043 1400 -348 1983 3778 1545 3124 4266 -907 -143 3499
1329C499k346N36L630m981k107L877k715j743M857l374k943K274r89j386L953
$$ 3499 1153 1689 5319 338 -1769 2108 -607 -2350 2507 -867 -3810 -1536 -2525 -3911 42
1344D2m76k679L150j968k266M084l28l553M356J203m463M647K644m929J923K905
$$ 42 -434 -3113 37 -1931 -4197 -113 -441 -3994 362 1565 -2898 1749 4393 -536 1387 4292
1360D292n219J260L847k840j009L021j611q26J625l63j022j455j275J506r19j164
$$ 4292 -927 333 4180 1340 331 3352 1741 915 2540 2177 1155 -300 -1575 -69 -988 -2152
1376b152K187j603k657K464M36j244K769o34k826R70j047K25L832r88l4L523l614
$$ -2152 35 -1568 -4225 -1761 -1325 -2569 200 -434 -3260 -2290 -3337 -3112 720 -268 -302 3221 -393
1393c93p26N334k740k825O153l402m089O504l53m513N022j26n463L136N38l588
$$ -393 -1119 4215 1475 -1350 4803 1401 -2688 3816 3463 -1050 3972 3846 -1617 1519 2057 -1531
1409a531K324k64k963J504p88m40K594r15k204K947j950k299K731k04j891K086
$$ -1531 793 529 -2434 -930 -1718 -2158 436 -479 -2683 264 -1686 -3985 -1254 -1458 -3349 -1263
1425a263J532r65J161J102n12j060l15J205k08r40K435N19l616K365K248l950
$$ -1263 269 -696 465 1567 1055 -5 -320 885 677 -263 2172 2691 -925 1440 3688 -262
1441b62J217L204m418j062L055j896k047L191q99k249K239K18j432J295r4l083
$$ -262 955 4159 -259 -1321 1734 -162 -2209 982 83 -2166 73 291 -1141 154 60 -3023
1457c023J406m85j721L668R55k581L227N89n069K696K830n405K173L782m520P89
$$ -3023 -1617 -2102 -3823 -155 800 -1781 1446 2035 -3034 -338 2492 -2913 -740 3042 -1478 -689
1473f89M720m061l77M202l151o22K791k743j80J319k607J441J830l128K782J087
$$ -689 4031 -30 -407 3795 644 22 2813 70 -110 1209 -1398 43 1873 -1255 1527 2614
1489B614m527K170O30m752K409J858l930L101J327l141K953k85l597L468j236
$$ 2614 -1913 257 887 -3865 -1456 402 -3528 -427 900 -2241 712 427 -3170 298 -938
1504i38l265N866j369m106O774j611m973P320j356n226P267j849n762O484j503
$$ -938 -4203 1663 294 -3812 2962 1351 -3622 3698 2342 -2884 4383 2534 -3228 3256 1753
1519A753n318P198j053m789P085k147n290N746l137n033O631k615l845P550k752
$$ 1753 -3565 3633 2580 -2209 4876 2729 -2561 3185 48 -4985 1646 -969 -4814 2736 -16
1534a6l504O069m119k870N873l848k098O223l934j113O580n404J27O748n738L03
$$ -16 -3520 2549 -1570 -4440 1433 -2415 -4513 1710 -2224 -3337 3243 -2161 -2034 4714 -1024 -721
1550g21O375o759j00O015o650R85O251n851J552N403o901J57M679p420P55M641
$$ -721 5654 -1105 -1205 4810 -1840 -855 5396 -455 1097 6500 -401 -244 4435 -2985 -2230 2411
1566B411o237K369M311n702K069K711o773L115K088n937M675K072o443M762J828
$$ 2411 -3826 -1457 2854 -2848 -779 1932 -4841 -1726 362 -5575 -900 1172 -5271 -509 1319
1581A319n303N195K032n721M545J292n521M212K1l960M366J55k927M788j222l395
$$ 1319 -3984 1211 3243 -2478 2067 3359 -2162 2050 2071 -1889 2477 2632 -295 4493 3271 -124
1597a24M149l997l682N217j965l043N899k031l173M195k294k276K773k005p07
$$ -124 4025 28 -3654 1563 -402 -3445 2454 423 -2750 1445 -849 -3125 -352 -2357 -3064
1612c064K888k346K98K440l023J790K770k846J932K623m590N89K102l446J823
$$ -3064 -176 -2522 -2224 216 -2807 -1017 1753 -1093 839 3462 -1128 -539 1563 -1883 -60
1627f0K421j818K425O98k870K019j179l182K792r80k994M211p9l364L790o67l883
$$ -60 2361 543 2968 3666 796 2815 1636 -1546 1246 266 -2728 1483 1404 -1960 1830 1163 -2720
1644b720J979o6k244K506n53q10J457k075J032K746k672J670K545l832O6K745
$$ -2720 -741 -807 -3051 -545 -1098 -1908 -451 -2526 -1494 1252 -1420 250 2795 -1037 -971 1774
1660A774m433R78M170l279J622L410l287Q40J097m629K107O71l825M044R29m227
$$ 1774 -2659 -1681 2489 -790 832 4242 955 1795 2892 -1737 370 1041 -2784 1260 2189 -2038
1676b038M224K09n646M178J069n529L381R25m427L265M71l220L741j111j894N230
$$ -2038 2186 2395 -3251 927 1996 -3533 -152 773 -3654 -389 82 -3138 603 -508 -2402 2828
1692B828k591k467M597m221l115O362k131j269O397k584k462M575m026k033M395
$$ 2828 237 -2230 2367 -1854 -4969 1393 -738 -2007 4390 1806 -656 3919 -107 -2140 2255
1707B255l514N55M508m838J026M699n780N95M522o214P87N485p105O12N289n756
$$ 2255 -1259 -704 3804 -1034 -8 4691 -1089 -494 4028 -2186 -1399 4086 -3019 -2407 2882 -2874
1723b874O24M723m801J936L408n752J471K222n741L091K294m844M956L188n560
$$ -2874 -2250 2473 -2328 -392 3016 -2736 -1265 957 -4784 -1693 601 -4243 713 3901 -1659
1738a659L620J310o561L296K099n536M727K296m735L852J07m607M801m31m606
$$ -1659 1961 3271 -3290 6 2105 -3431 1296 3592 -1143 2709 2816 -1791 3010 2579 -2027
1753b027M882j026n293N124j220m395N894o80m168N076j498l981L907k652l156
$$ -2027 2855 1829 -3464 1660 440 -3955 1939 1259 -2909 2167 669 -3312 595 -2057 -5213
1768e213M909j255j931N752j989j175M003l903k505N152k634j007N123k357r58
$$ -5213 -304 -1559 -3490 2262 273 -902 3101 -802 -3307 1845 -789 -1796 3327 970 12
1783A2M219l425j251L981k550n01K695l364m48K407l643O42K806k428J201J624
$$ 12 4231 806 -445 3536 986 485 3180 -184 -632 1775 -1868 -1226 1580 -848 353 1977
1799A977l991M05J376l355M34K121j836J861K306k411J074J715k948K97R12j597
$$ 1977 -2014 -1609 -233 -3588 -3154 -1033 -2869 -1008 1298 -1113 -39 1676 -1272 -975 -63 -1660
1815a660K354J010j439J336O56j570P95J70j137J954m80k154K96j74r44J138Q8
$$ -1660 694 1704 265 1601 2257 687 1482 1652 515 2469 1989 -165 131 -43 -987 151 239
1832B39M8J273p08j438r57q96q3M39j18J093O42L35L60l38j025L55M8n20N68O59
$$ 239 287 1560 852 -586 -1543 -2439 -2522 -2083 -2201 -1108 -466 -131 229 -109 -1134 -779 -731 -1251 -683 -24
1852b4P43P15p32j09R30l85L19M60j029K45N41k044r72J421j3M94J281q68l14
$$ -24 719 1434 702 593 1523 1138 1457 1917 888 1133 1674 -370 -1342 79 66 560 1841 973 659
1871F59k92j987p33O57n87J338J504j348P74J160k503q6Q87j138R00J369j554
$$ 659 367 -1620 -2353 -1696 -2283 -945 559 -789 -15 1145 -1358 -1444 -557 -1695 -795 574 -980
1888i80N29J273q55O44K74l75J048L7j672P97k54j489J494pj179K626Q58k154
$$ -980 -451 822 -33 611 885 510 1558 1595 -77 720 466 -1023 471 464 -715 1911 2769 615
1906F15N01m25k293K35K26q73K432P00r80L89q61j075J186p46j219J881J54j126
$$ 615 1116 691 -1602 -1367 -1141 -2014 418 1118 138 527 -334 -1409 -223 -969 -2188 -307 -153 -1279
1924a279P00L94q87J587O64j727J120Q31j173k99l16n96J219N70k53J427M25n82
$$ -1279 -579 -185 -1072 515 1179 -548 572 1403 230 -69 -385 -981 238 808 555 1982 2407 1825
1942A825N1j437j764P49Q28j222J172J357r04J6l10j819j35J141q23l20J135p99
$$ 1825 1876 439 -1325 -576 252 -970 202 1559 655 671 361 -1458 -1593 -452 -1275 -1595 -460 -1259
1960a259L82J2p71J180J313j237R91q9j661N71O25j535J371K149j007J163O69
$$ -1259 -877 -865 -1636 -456 857 -380 611 522 -1139 -568 57 -1478 -107 2042 1035 2198 2867
1977B867j712J92k86k295P65Q19m69J576M73j968J556n98l071J423O21k182J993
$$ 2867 1155 1347 1061 -1234 -469 350 -119 1457 1930 -38 1518 920 -2151 -728 -107 -2289 -296
1994b96M7k516K073N02k519K445P69j558J685n50k551K021j2j540L304L30j240
$$ -296 -249 -2765 -692 -190 -2709 -264 505 -1053 632 82 -2469 -448 -460 -2000 1304 1634 394
2011C94L073q23k920K150j262j883K494n99p75K767j071j485J883j981j490J981
$$ 394 3467 2644 -276 1874 612 -1271 1223 624 -151 2616 1545 60 1943 -38 -1528 453
2027D53k015l02K696k221j054K547k195n5L457k395J49K573l251m00J855k411
$$ 453 -1562 -1864 832 -1389 -2443 104 -2091 -2146 1311 -1084 -935 1638 -1613 -2013 -158 -2569
2043b569J406L414k114J417K153l297j16J581l316R73K714k856J584K185l155
$$ -2569 -1163 2251 137 1554 3707 410 294 1875 -1441 -468 2246 -610 974 3159 4
2058DQ03J400l471J166Q71k688J470Q21k594J690R6k320K625P35j903K295o63
$$ 4 807 2207 -1264 -98 773 -1915 -445 376 -2218 -528 -432 -2752 -127 608 -1295 1000 337
2075C37k907K041q24j546L147N73j071L224j386k131K252k088j210K809r83o47
$$ 337 -2570 -529 -1353 -2899 248 821 -250 2974 1588 -543 1709 -379 -1589 1220 237 -410
2091d10L277j854j255K635k222j049K636k192m04J953k160j62J586j771M43K127
$$ -410 2867 1013 -242 2393 171 -878 1758 -434 -838 1115 -1045 -1207 379 -1392 -949 1178
2107A178j970O53J396k944J26P34k203J719J997j461K018Q79k576Q95R4k815J878
$$ 1178 -792 -139 1257 -1687 -1561 -827 -3030 -1311 686 -775 1243 2122 -454 441 535 -2280 -402
2124d02Q58j670K898J96k112J871k43k277K154j97j736J819o03j842K042j022
$$ -402 456 -1214 1684 1880 -232 1639 1396 -881 1273 1076 -660 1159 556 -1286 756 -266
2140b66j007K420o27q67K125k156j353J438k113j06K677j247R24K148k198k32
$$ -266 -1273 1147 520 -347 1778 -378 -1731 -293 -2406 -2512 165 -1082 -158 1990 -208 -440
2156d40J143k687O60J643j754J416K009k145P27J185k666J722Q26k207K092L58
$$ -440 703 -1984 -1324 319 -1435 -19 1990 -155 572 1757 -909 813 1639 -568 1524 1882
2172A882l039K103k69k137K501Q11k316K297k60l289J769j046k465L150l01j238
$$ 1882 -1157 946 677 -1460 1041 1852 -464 1833 1573 -1716 53 -993 -3458 -308 -609 -1847
2188a847K941m95j745J992j922j516K669j394p79L586j507p58K909k159o97L039
$$ -1847 1094 599 -1146 846 -1076 -2592 77 -1317 -2096 1490 -17 -775 2134 -25 -722 2317
2204B317k068k25K800l100o1K480l148O09L101k229L88K442l916l01J658l630
$$ 2317 249 24 2824 -276 -337 2143 -1005 -396 2705 476 864 3306 -610 -911 747 -2883
2220b883J043K003j719J297J869l323J535P85l286J002J341k361K521J294k933
$$ -2883 -1840 163 -1556 -259 1610 -1713 -178 607 -2679 -1677 -336 -2697 -176 1118 -1815
$$ [...]
8191a56
##END NTUPLES=NMR FID
##END=
