##TITLE=1H_Ai2tSL20-f7-8
 200.13Hz,CDCl3.
 8 sc
 3.6.2026
##JCAMPDX= 6.0         $$ Bruker NMR JCAMP-DX V2.0
##DATA TYPE= NMR FID
##DATA CLASS= NTUPLES
##ORIGIN= UXNMR, Bruker Analytische Messtechnik GmbH
##OWNER= pz
$$ XWIN-NMR		Version 3.5
$$ Wed Jun  3 13:46:53 2026 Russian Standard Time (UT+4h)  she@DPX200
##.OBSERVE FREQUENCY= 200.131
##.OBSERVE NUCLEUS= ^1H
##.DELAY= (6, 6)
##.ACQUISITION MODE= SIMULTANEOUS
##.ACQUISITION SCHEME= undefined
##.AVERAGES= 8
##.DIGITISER RES= 18
##SPECTROMETER/DATA SYSTEM= spect
##.PULSE SEQUENCE= zg30
##.SOLVENT NAME= D2O
##.SHIFT REFERENCE= (INTERNAL, D2O, 0, 14.3821)
##AUDIT TRAIL= $$ (NUMBER, WHEN, WHO, WHERE, WHAT)
$$ ##TITLE= Audit trail, XWIN-NMR		Version 3.5
$$ ##JCAMPDX= 5.01
$$ ##ORIGIN= Bruker BioSpin GmbH
$$ ##OWNER= she
$$ F:/spectra/data/she/nmr/H-C/1/audita.txt
$$ ##AUDIT TRAIL=  $$ (NUMBER, WHEN, WHO, WHERE, WHAT)
(   1,<2026-06-03 13:44:30.17 +0400>,<she>,<DPX200>,
      <created by zg, POWCHK disabled, PULCHK disabled
       configuration hash MD5:
       00 E9 B6 7A A2 85 ED C7 34 08 36 98 17 FE 4E 26
       data hash MD5: 16K
       BF 31 7E 01 76 62 45 B4 F4 2B 84 52 B9 E8 78 C8>)
$$ ##END=
$$ 
$$ hash MD5
$$ AD AF E0 7A 43 A1 56 C0 9F 58 E6 DC FF F4 41 9F
##$RELAX= 
##$RELAX= 
##$RELAX= 
##$RELAX= 
##$RELAX= 
##$RELAX= 
$$ Bruker specific parameters
$$ --------------------------
##$DU= <F:/spectra>
##$EXPNO= 1
##$NAME= <H-C>
##$PROCNO= 1
##$TYPE= <nmr>
##$USER= <she>
##$AMP= (0..31)
100 100 100 100 100 100 100 100 100 100 100 100 100 100 100 100 100 100 
100 100 100 100 100 100 100 100 100 100 100 100 100 100 
##$AQSEQ= 0
##$AQ_mod= 1
##$AUNM= <au_zg>
##$AUTOPOS= <>
##$BF1= 200.13
##$BF2= 200.13
##$BF3= 200.13
##$BF4= 200.13
##$BF5= 200.13
##$BF6= 200.13
##$BF7= 200.13
##$BF8= 200.13
##$BYTORDA= 1
##$CFDGTYP= 0
##$CFRGTYP= 5
##$CHEMSTR= <none>
##$CNST= (0..31)
1 1 145 1 1 1 1 1 1 1 1 1 1 1 1 1 1 1 1 1 1 1 1 1 1 1 1 1 1 1 1 1 
##$CPDPRG= <>
##$CPDPRG1= <>
##$CPDPRG2= <>
##$CPDPRG3= <>
##$CPDPRG4= <mlev>
##$CPDPRG5= <mlev>
##$CPDPRG6= <mlev>
##$CPDPRG7= <mlev>
##$CPDPRG8= <mlev>
##$CPDPRGB= <>
##$CPDPRGT= <>
##$D= (0..31)
0 0.7 0 0 0 0 0 0 0 0 0 0.03 0 0 0 0 0 0 0 0 0 0 0 0 0 0 0 0 0 0 0 0 
##$DATE= 1780479869
##$DBL= (0..7)
120 120 120 120 120 120 120 120 
##$DBP= (0..7)
150 150 150 150 150 150 150 150 
##$DBP07= 0
##$DBPNAM0= <>
##$DBPNAM1= <>
##$DBPNAM2= <>
##$DBPNAM3= <>
##$DBPNAM4= <>
##$DBPNAM5= <>
##$DBPNAM6= <>
##$DBPNAM7= <>
##$DBPOAL= (0..7)
0.5 0.5 0.5 0.5 0.5 0.5 0.5 0.5 
##$DBPOFFS= (0..7)
0 0 0 0 0 0 0 0 
##$DE= 6
##$DECBNUC= <off>
##$DECIM= 32
##$DECNUC= <off>
##$DECSTAT= 4
##$DIGMOD= 1
##$DIGTYP= 9
##$DL= (0..7)
0 120 120 120 120 120 120 120 
##$DP= (0..7)
150 150 150 150 150 150 150 150 
##$DP07= 0
##$DPNAME0= <>
##$DPNAME1= <>
##$DPNAME2= <>
##$DPNAME3= <>
##$DPNAME4= <>
##$DPNAME5= <>
##$DPNAME6= <>
##$DPNAME7= <>
##$DPOAL= (0..7)
0.5 0.5 0.5 0.5 0.5 0.5 0.5 0.5 
##$DPOFFS= (0..7)
0 0 0 0 0 0 0 0 
##$DQDMODE= 0
##$DR= 18
##$DS= 0
##$DSLIST= <SSSSSSSSSSSSSSS>
##$DSPFIRM= 0
$$ [...]
##$SUBNAM0= <"">
##$SUBNAM1= <"">
##$SUBNAM2= <"">
##$SUBNAM3= <"">
##$SUBNAM4= <"">
##$SUBNAM5= <"">
##$SUBNAM6= <"">
##$SUBNAM7= <"">
##$SUBNAM8= <"">
##$SUBNAM9= <"">
##$SW= 18.0517599122864
##$SWIBOX= (0..15)
0 0 2 0 0 0 0 0 0 0 0 0 0 0 0 0 
##$SW_h= 3612.71676300578
##$TD= 16384
##$TD0= 1
##$TE= 0
##$TE2= 300
##$TE3= 300
##$TEG= 300
##$TL= (0..7)
0 120 120 120 120 120 120 120 
##$TP= (0..7)
150 150 150 150 150 150 150 150 
##$TP07= 0
##$TPNAME0= <>
##$TPNAME1= <>
##$TPNAME2= <>
##$TPNAME3= <>
##$TPNAME4= <>
##$TPNAME5= <>
##$TPNAME6= <>
##$TPNAME7= <>
##$TPOAL= (0..7)
0.5 0.5 0.5 0.5 0.5 0.5 0.5 0.5 
##$TPOFFS= (0..7)
0 0 0 0 0 0 0 0 
##$TUNHIN= 0
##$TUNHOUT= 0
##$TUNXOUT= 0
##$USERA1= <user>
##$USERA2= <user>
##$USERA3= <user>
##$USERA4= <user>
##$USERA5= <user>
##$V9= 5
##$VALIST= <valist>
##$VCLIST= <CCCCCCCCCCCCCCC>
##$VD= 0
##$VDLIST= <DDDDDDDDDDDDDDD>
##$VPLIST= <PPPPPPPPPPPPPPP>
##$VTLIST= <TTTTTTTTTTTTTTT>
##$WBST= 1024
##$WBSW= 4
##$XGAIN= (0..3)
0 0 0 0 
##$XL= 0
##$YL= 0
##$YMAX_a= 389285
##$YMIN_a= -295413
##$ZGOPTNS= <>
##$ZL1= 120
##$ZL2= 120
##$ZL3= 120
##$ZL4= 120
##$ABSF1= 10
##$ABSF2= 0
##$ABSG= 5
##$ABSL= 3
##$ALPHA= 0
##$AQORDER= 0
##$ASSFAC= 0
##$ASSFACI= 0
##$ASSFACX= 0
##$ASSWID= 0
##$AUNMP= <proc_1d>
##$AZFE= 0.1
##$AZFW= 0.1
##$BCFW= 1
##$BC_mod= 2
##$BYTORDP= 1
##$COROFFS= 0
##$CY= -3
##$DATMOD= 1
##$DC= 2
##$DFILT= <>
##$DTYPP= 0
##$F1P= 0
##$F2P= 0
##$FCOR= 0.5
##$FTSIZE= 0
##$FT_mod= 4
##$GAMMA= 1
##$GB= 0.15
##$INTBC= 1
##$INTSCL= 1
##$ISEN= 128
##$LB= 0.25
##$LEV0= 0
##$LPBIN= 0
##$MAXI= 10000
##$MC2= 0
##$MEAN= 0
##$ME_mod= 0
##$MI= 1.114404
##$NCOEF= 0
##$NC_proc= 0
##$NLEV= 6
##$NOISF1= 3.799351
##$NOISF2= 2.8
##$NSP= 1
##$NTH_PI= 0
##$NZP= 0
##$OFFSET= 14.38212
##$PC= 1
##$PHC0= -4219.978
##$PHC1= 15.59229
##$PH_mod= 1
##$PKNL= yes
##$PPARMOD= 0
##$PSCAL= 0
##$PSIGN= 0
##$REVERSE= no
##$SF= 200.129724274929
##$SI= 16384
##$SIGF1= 3
##$SIGF2= 2
##$SINO= 400
##$SIOLD= 16384
##$SREGLST= <1H.CDCl3>
##$SSB= 0
##$STSI= 0
##$STSR= 0
##$SW_p= 3205.1282051282
##$SYMM= 0
##$S_DEV= 0
##$TDeff= 0
##$TDoff= 0
##$TI= <>
##$TILT= no
##$TM1= 0
##$TM2= 0
##$TOPLEV= 0
##$USERP1= <user>
##$USERP2= <user>
##$USERP3= <user>
##$USERP4= <user>
##$USERP5= <user>
##$WDW= 1
##$XDIM= 8192
##$YMAX_p= 0
##$YMIN_p= 0
$$ End of Bruker specific parameters
$$ ---------------------------------
##NTUPLES= NMR FID
##VAR_NAME=  TIME,          FID/REAL,        FID/IMAG
##SYMBOL=    X,             R,               I
##VAR_TYPE=  INDEPENDENT,   DEPENDENT,       DEPENDENT
##VAR_FORM=  AFFN,          ASDF,            ASDF
##VAR_DIM=   8192,          8192,            8192
##UNITS=     SECONDS,       ARBITRARY UNITS, ARBITRARY UNITS
##FACTOR=    0.0002768,     1,               1
##FIRST=     0,             0,               0
##LAST=      2.2672688,     0,               0
##MIN=       0,             -295413,         0
##MAX=       2.2672688,     389285,          0
$$ Real data points
##PAGE= N=1
##DATA TABLE= (X++(R..R)), XYDATA
$$ [...]
$$ plain form
2076 -919 -1519 -727 794 1881 740 -487 -1480 -970 -183 825 1536 650 -503 -1423 -1258 72 1094
2093 1094 987 496 -538 -895 -295 448 402 347 -28 -952 -572 169 660 370 -443 -732 -368 477 819 627
2113 627 5 -972 -1242 -232 507 1452 717 -421 -1118 -834 -118 731 1348 457 -482 -901 -706 87 840
2132 840 869 189 -416 -681 -236 561 531 46 -191 -630 -374 474 605 572 -399 -1010 -636 186 1046 930 -167
2153 -167 -1423 -1042 -16 1089 1207 484 -565 -1151 -1342 -162 824 1203 424 -920 -1442 -868 334 866
2171 866 846 54 -613 -722 -272 638 784 -69 -499 -578 -95 416 733 129 -151 -876 -501 348 1276 740 -147
2192 -147 -1122 -1027 -64 465 1235 518 -471 -1223 -773 -395 743 1088 653 -845 -1085 -958 483 915 596
2211 596 -284 -546 -225 78 537 256 156 -708 -279 -75 604 699 99 -708 -720 -22 774 809 853 -182 -1295
$$ packed form
2076i19o00P92J521J087j141j227r93N10P87J008P11q86j153r20J65J330J022
2093A094j07m91j034l57O00P43m6n5l75r24L80P41M91k90q13k89L64Q45L42j92
2113F27o22r77k70J010P39R45p35j138o97K84P16Q49O17q91r39m19J95P93P53
2132H40K9o80o05k65M45P97l0m85k37m39K56Q48J31l3r71o11L74Q22Q60j16j097
2153a67j256L81J026J105J18p23j049n86j91J180R86L79p79j344n22N74J202N32
2171H66k0p92o67j09M50R10J46q53m30p9M83N11L17o04k80p25L75Q49R28n36q87
2192a47r75R5R63N29P70p17r89p52M50L78J138L45m35j498k40J27J441M32l19
2211E96q80k62L21L03M59k81j00q64M29K04O79R5o00q07j2O98P96L5M4j035j113
$$ plain form
2232 -1295 -851 13 981 1266 467 -863 -1060 -623 297 598 1248 449 -352 -991 -687 303 826 640 -198
2251 -198 -554 10 342 297 424 -324 -437 -285 400 812 780 -146 -614 -891 -308 650 812 665 -434 -745
2271 -745 -988 -201 850 1188 607 -897 -1109 -477 9 716 937 458 -270 -948 -534 321 1008 210 -321
2290 -321 -1160 -156 266 628 1 -202 -355 -468 165 846 774 144 -831 -978 -325 712 1040 462 -360 -950
2310 -950 -890 -203 738 1266 764 -613 -1134 -806 13 375 377 103 -365 -476 -220 224 582 21 -360 -699 -550
2331 -550 723 735 91 -634 -806 -362 126 709 521 -409 -913 -993 -473 703 944 583 -477 -800 -789 223
2351 223 470 808 298 -746 -862 -402 230 767 519 -185 -561 -330 3 262 235 109 -732 -569 -201 257
2371 257 684 85 -622 -685 -268 522 1028 656 -222 -942 -781 -666 634 1188 549 -491 -1077 -756 162 888
$$ packed form
2232a295M44Q64R68K85p99j330j97M37R20L01O50p99q01o39L04R90N23j86q38
2251a98l56N64L32m5J27p48j13J52O85M12l2r26m68k77N83R58J62j47j099l11
2271g45k43P87J051L38n81j504k12O32M86P07K21m79p28o78M14Q55O87p98n31
2290c21q39J004M22L62o27k03j53j13O33O81p2o30r75j47O53J037L28n78q22n90
2310i50O0O87R41N28n02j377n21L28Q19L62Kk74m68j11K56M44L58n61l81l39J49
2331e50J273J2o44p25j72M44M88N83j88r30n04q0N20J176K41l61j060l23J1J012
2351B23K47L38n10j044j16M60O32N37k48p04l76K31L33K59k7j26q41J63L68M58
2371B57M27n99p07o3M17P90N06l72q78p20J61J15J300N54o39j040n86L21R18P26
$$ plain form
2391 888 850 52 -201 -710 -292 163 527 120 -251 -482 -350 35 620 393 -32 -265 -484 -91 748 769 52
2412 52 -500 -720 -127 461 837 630 -456 -925 -819 -285 653 865 696 4 -604 -759 125 951 618 165
2432 165 -453 -582 -69 302 745 417 -84 -226 -288 231 348 493 -241 -558 -501 158 531 363 166 -796 -503
2453 -503 -100 874 1346 400 -186 -947 -453 93 759 1233 398 -524 -784 -760 154 744 535 6 -426 -497 -88
2474 -88 237 251 64 33 -315 -279 169 535 287 -104 -978 -281 773 828 347 -121 -751 -704 -143 268 437 227
2496 227 -257 -913 -597 140 764 654 379 -462 -706 -281 508 703 820 -53 -535 -575 -42 419 446 155 -473
2517 -473 -311 -193 224 207 -39 -366 -320 -299 204 418 503 -264 -706 -664 97 718 705 397 -328 -811 -492 358
2539 358 355 739 219 -508 -809 -500 193 819 547 150 -418 -445 314 264 66 -394 -320 -86 23 321 349 51
$$ packed form
2391H88l8p98k53n09M18M55L64m07l71k31J32L85N85k27m25k33k19L93Q39K1p17
2412E2n52k20N93N88L76k07j086m69J06N34R38K12j69o92o08j55Q84Q26l33m53
2432A65o18j29N13L71M43l28n01j42o2N19J17J45p34l17N7O59L73j68j97r62K93
2453e03M03R74M72r46n86p61M94N46O66M74q35r22k60K4R14N90k09n29m32p1M09
2474h8L25J4j87l1l48L6M48L66k48l91q74O97J054N5m81m68o30M7N61M11J69k10
2496B27m84o56L16P37O24j10k75q41k44M25P89J95J17q73m82m0N33M61K7k91o28
2517d73J62J18M17j7k46l27M6K1N03K14Q5p67m42M2P61O21j3l08p25m83L19Q50
2539C58lL84n20p27l01L09O93O26k72l97n68k7P59n0j98m60P4K34J09K98K8k98
$$ plain form
2561 51 -350 -575 -103 466 592 523 -460 -479 -546 -323 388 896 214 -510 -486 -556 234 445 807 368 -311 -652
2583 -652 -251 149 496 278 22 -476 -351 46 335 513 104 -302 -226 218 140 299 -26 -388 -478 -49 530
2604 530 841 223 -478 -722 -341 305 720 657 213 -431 -653 -428 13 703 451 166 -596 -694 -380 319 370
2625 370 121 -59 -563 -44 459 495 277 -2 -523 -642 273 186 503 -62 -747 -798 -227 624 663 147 -166
2646 -166 -703 -359 60 354 596 142 -472 -665 -183 302 852 491 -143 -222 -548 -18 12 721 188 -40 -402
2667 -402 205 310 216 -27 -149 -136 17 290 530 -61 -134 -622 -636 -228 621 913 328 -314 -458 -375 -65 506
2689 506 294 359 -276 -685 -370 386 445 210 146 -517 -340 -224 -10 419 202 -220 73 -141 286 -131 43
2710 43 -218 -508 -112 273 302 233 -266 -529 -485 73 699 505 166 -240 -503 -411 -24 477 563 -65 -239 -667
$$ packed form
2561E1m01k25M72N69J26o9r83j9o7K23P11N08o82p24K4p0P90K11L62m39o79l41
2583f52M01M00L47k18k56m98J25L97K89J78m09m06P6M44p8J59l25l62r0M29N79
2604E30L11o18p01k44L81O46M15o3m44o44k22K25M41O90k52k85p62r8L14O99N1
2625C70k49j80n04N19N03L6k18k79n21j19R15q7L17n65o85n1N71Q51L9n16l13
2646a66n37L44M19K94K42m54o14j93M82M85N50l61o34p9l26N30L0P09n33k28l62
2667d02O07J05r4k43j22J3J53K73K40n91p3m88j4M08Q49K92n85o42j44Q3L10N71
2689E06k12O5o35m09L15P56N9k35o4o63J77J16K14M29k17m22K93k14M27m17J74
2710D3k61k90L96L85K9o9m99k63M4N58O26j94l39m06k63R2L87N01Q6o28j74m28
$$ plain form
2732 -667 -295 295 279 578 61 -421 -108 34 26 453 85 -7 -348 -139 94 301 3 -401 -541 -179 48
2753 48 509 158 -417 -638 -477 52 437 696 196 -320 -586 -165 -6 453 500 -32 5 -460 -165 219 453
2774 453 307 -121 -376 -350 60 207 3 24 38 -70 168 170 264 -106 -449 -239 -36 199 764 146 -228 -262
2796 -262 -360 -14 449 682 109 -239 -557 -252 85 666 259 41 -356 -262 -29 216 358 103 -80 -278 -371
2817 -371 3 417 101 -251 -230 -262 220 207 269 -182 -303 -301 12 430 619 40 -451 -503 -417 75 436 425 17
2840 17 -299 -658 -158 98 218 433 52 -168 1 -126 130 300 48 -110 -340 -321 279 197 5 -72 51
2861 51 -235 26 517 67 1 -294 -550 74 328 358 33 -475 -349 -95 251 192 272 129 30 -633 -317 57
2883 57 471 359 -65 -384 -297 34 121 233 -62 -75 -500 4 114 164 35 -351 -354 -149 382 207 185 -88 -546
$$ packed form
2732f67L72N90j6K99n17m82L13J42qM27l68r2l41K09K33K07k98m04j40L62K27
2753D8M61l51n75k21J61N29L85K59n00n16k66M21J59M59M7n32L7m65K95L84K34
2774D53j46m28k55K6M10J47k04K1J4j08K38KR4l70l43K10K03K35N65o18l74l4
2796b62r8L46M63K33n73l48l18L05L37N81m07k18l97R4K33K45J42k55j83j98r3
2817c71L74M14l16l52K1l2M82j3O2m51j21KL13M18J89n79m91n2Q6M92L61j1m08
2840A7l16l59N00K56J20K15l81k20J69j27K56J70k52j58k30J9O00q2j92p7J23
2861E1k86K61M91m50o6k95k56O24K54L0l25n08J26K54L46n9Q0j43r9o63L16L74
2883E7M14j12m24l19Q7L31Q7J12k95j3m25N04J10N0j29l86lK05N31j75k2k73m58
$$ plain form
2906 -546 -443 252 13 452 -93 -151 -278 -170 21 673 577 148 -484 -230 -253 18 350 278 219 -408 -163 -75
2928 -75 329 374 194 -156 -169 156 155 113 391 -385 -87 -156 77 197 279 -121 -387 -270 146 373 478 -44 -388
2951 -388 -567 -414 287 287 492 203 -223 -149 130 172 188 137 -39 -467 -173 -17 313 -138 -135 -99 -256 -66 210
2974 210 234 217 -447 99 82 107 139 -36 -340 -337 -116 -210 422 341 121 -7 -621 -317 -1 309 304 304 -128 -147 -129
2999 -129 528 383 85 -244 -164 -302 -35 96 -5 -167 -40 -69 -411 261 9 187 26 -53 142 185 215 212
3021 212 -75 -329 -25 329 217 206 186 -243 -630 -112 89 366 294 -137 -216 -300 -101 75 -121 -105 -331 86
3043 86 -63 63 39 248 -50 -254 -108 75 84 -8 -37 -300 -362 23 233 -121 -124 -266 -553 -321 70 213 67
3066 67 156 -219 -338 -65 191 65 314 -14 -101 -103 46 221 47 179 6 -248 -176 299 119 162 -25 133
$$ packed form
2906e46J03O95k39M39n45n8j27J08J91O52r6m29o32K54k3K71L32p2n9o27K45Q8
2928g5M04M5j80l50j3L25jm2K78p76K98o9K33J20Q2m00k66J17M16K27J05n22l44
2951c88j79J53P01%K05k89m26P4K79M2J6n1j76m28K94J56L30m51LL6j57J90K76
2974B10K4j7o64N46j7K5L2j75l04LK21r4O32q1k20j28o14L04L16L10n%m32j9J8
2999a29O57j45k98l29Q0j38K67J31j01j62J27k9l42O72k52J78j61p9J95M3L0l
3021B12k87k54L04L54j12j1k0m29l87N18K01K77p2m31p9q4J99J76j96J6k26M17
3043H6j49J26k4K09k98k04J46J83Rr2k9k63o2L85K10l54lj42k87K32L91J43j46
3066F7Q9l75j19K73K56j26K49l28q7kJ49J75j74J32j73k54P2M75j80M3j87J58
$$ plain form
3088 133 -192 -131 256 61 -109 -397 -477 -37 1 -101 51 -198 -221 43 -123 308 340 42 -248 -285 77 236
3110 236 324 326 -231 -460 -309 -59 -127 181 274 -144 -206 -30 28 151 48 -384 -466 34 94 228 244 40 -347
3133 -347 -258 -11 74 92 41 -481 -438 -246 -82 583 160 77 -226 -153 -52 259 651 233 102 -260 -193 -180 195
3156 195 130 132 -161 -33 -169 53 -23 146 170 13 66 108 251 195 188 -43 9 -9 88 282 -157 -153 -81 -168 17 405
3182 405 322 35 -110 -431 364 188 250 -13 -35 -277 -263 85 460 47 40 -156 -213 -11 28 17 -82 -132 -124 -174 99
3207 99 248 -124 139 -338 -330 45 331 245 85 -269 -59 -110 251 438 106 7 -50 -288 -159 22 -71 17 335
3230 335 -94 4 -360 -120 275 343 -167 -55 186 53 112 -199 -127 -138 45 298 297 -160 57 -275 24 4 164
3253 164 177 168 -205 -387 -195 -3 180 17 245 -316 -3 -104 -8 244 198 -137 -53 91 96 485 124 306 -182
$$ packed form
3088A33l25O1L87j95j70k88q0M40L8j02J52k49k3K64j66M31L2k98k90l7L62J59
3110B36Q8Kn57k29J51K50o8L08R3m18o2J76N8J23j03m32q2N00O0J34J6k04l87
3133c47Q9K47Q5J8n1n22M3J92J64O65m23q3l03P3J01L11L92m18j31l62O7J3L75
3156A95o5Kk93J28j36K22p6J69K4j57N3M2J43n6pk31N2j8R7J94m39MP2q7J85L88
3182D05q3k87j45l21P95j76O2k63k2k42J4L48L75m13pj96n7K02L9j1r9n0Qn0K73
3207I9J49l72K63m77QL75K86q6j60l54K10n1L61J87l32r9n7k38J29J81r3Q8L18
3230C35m29R8l64K40L95O8n10J12K41j33N9l11P2j1J83K53jm57K17l32K99k0J60
3253A64J3rl73j82J92J92J83j63K28n61L13j01R6K52m6l35Q4J44NL89l61J82m88
$$ plain form
3276 -182 -181 -120 -54 -24 21 -391 -447 -104 -44 130 50 -450 15 -283 95 121 170 -6 -103 -319 41 298 319 434
3300 434 -89 -142 -328 -577 262 150 133 -356 -432 -5 -161 264 34 9 -193 -75 -102 317 68 102 -289 -147
3322 -147 -302 15 194 -137 -24 10 -11 -160 201 -53 320 -272 -301 -264 242 177 102 28 -28 -173 -37 30 449
3345 449 138 18 -69 -82 4 207 226 132 -391 -155 66 300 214 3 152 -340 -240 234 195 -78 -217 -250 -42
3368 -42 -102 221 263 186 -179 -448 -387 -160 313 367 -202 -67 -267 -75 -237 278 378 -174 -171 -284 -24 8 220
3391 220 55 23 34 89 265 138 49 -125 18 -94 -6 237 41 -107 -293 -128 93 -12 26 -41 -129 -179 -118
3414 -118 221 114 162 -5 -251 -62 240 131 53 -55 129 -112 24 -102 -81 179 -130 2 -99 35 -1
3435 -1 64 -147 -258 -242 -69 34 -23 73 -35 -38 38 -78 159 53 -11 -172 -164 -316 187 252 394 -12 -296 -231 27
$$ packed form
3276a82JO1O6L0M5m12n6L43O0J74q0n00M65k98L78K6M9j76r7k16L60K57K1J15
3300D34n23n3j86k49Q39j12j7m89p6M27j56M25k30k5k02J18k7M19k49L4l91J42
3322a47j55L17J79l31J13L4k1j49L61k54L73n92k9L7N06o5p5p4n6j45J36O7M19
3345D49l11j20q7j3Q6K03J9r4n23K36K21K34q6k11J49m92J00M74l9k73j39l3K08
3368d2o0L23M2p7l65k69O1K27M73N4n69J35k00J92j62N15J00n52Lj13K60L2K12
3391B20j65l2J1N5J76j27q9j74J43j12Q8K43j96j48j86J65K21j05L8o7q8n0O1
3414a18L39j07M8j67k46J89L02j09p8j08J84k41J36j26K1K60l09J32j01J34l6
3435aO5k11j11J6J73J03n7R6j08lP6j16K37j06o4j61Qj52N03O5J42m06k84O5K58
$$ plain form
3460 27 241 17 218 -53 -245 60 207 304 110 -50 -21 -165 -88 243 119 75 126 -295 30 244 303 36
3482 36 -125 -365 -43 -107 -48 564 -333 -52 -95 -48 -81 325 245 -141 -116 -209 -16 91 378 315 -20 -271 -304 310
3506 310 13 106 84 -271 -141 188 27 365 -177 -261 -2 -67 251 163 93 240 -389 -7 257 48 -58 -222
3528 -222 105 -253 -127 98 89 150 73 113 -65 136 273 374 63 27 -23 1 88 44 30 327 -106 -275 57 360
3552 360 265 -335 -187 -188 -58 297 103 249 -135 -305 -236 -99 127 272 40 10 -24 -202 45 307 -54 -21
3574 -21 -393 -545 -6 309 279 103 -50 -491 -99 192 133 -131 -81 -329 332 323 29 -166 -133 -119 -211 -122 45
3597 45 47 -126 -22 -24 -14 149 175 362 -34 -74 -261 -5 242 94 -18 113 -200 -145 108 324 140 -87 -169
3620 -169 21 6 -2 118 -6 24 -167 12 -60 395 173 -35 -180 52 86 146 367 -279 -119 -133 -225 160 337
$$ packed form
3460B7K14k24K01k71j92L05J47R7j94j60K9j44P7L31j24m4N1m21L25K14N9k67
3482C6j61k40L22o4N9O12q97K81m3M7l3M06q0l86K5r3J93J07K87o3l35k51l3O14
3506C10k97R3k2l55J30L29j61L38n42q4K59o5L18q8p0J47o29L82K64k09j06j64
3528b22L27l58J26K25rO1p7M0j78K01J37J01l11l6n0K4Q7m4j4K97m33j69L32L03
3552C60r5o00J48jJ30L55j94J46l84j70O9J37K26J45k32l0l4j78K47K62l61L3
3574b1l72j52N39L15l0j76j53m41L92K91n9k64N0k48O61rk94j95L3J4r2Q9J67
3597D5Kj73J04kJ0J63K6J87l96m0j87K56K47j48j12J31l13N5K53K16j84k27q2
3620a69J90j5qJ20j24L0j91J79p2M55k22k08j45K32L4O0K21o46J60j4r2L85J77
$$ plain form
3643 337 371 -314 -299 27 318 200 271 242 144 90 -208 -218 180 30 35 -70 -245 -106 -75 -2 -239 -199 -221 -93
3667 -93 101 220 86 -65 -313 -287 189 294 183 73 46 -400 -314 460 490 374 -333 -445 -143 37 246 107
3689 107 79 -176 -175 -18 -138 242 -136 -105 179 -182 -62 -77 111 -33 -53 -4 199 194 255 -46 -290 -200 57 85
3713 85 387 80 -33 -283 -238 -145 147 194 36 51 -143 -254 -78 326 184 306 -148 36 -290 50 125 91
3735 91 -72 -125 -162 147 180 -3 -62 -217 -338 16 242 122 8 -48 -593 -160 -48 303 409 123 -160 -333
3757 -333 -101 240 425 224 -115 -237 -245 -88 39 306 130 -261 -154 -224 174 128 96 -179 -119 -103 130 -3
3779 -3 290 96 -289 255 231 388 136 -20 -208 -376 -207 137 220 334 -389 -491 -376 32 84 275 347 -42
3801 -42 -294 -238 -125 111 164 32 74 -174 -230 201 145 -28 -277 -72 113 113 193 31 -152 -258 -104 250 207
$$ packed form
3643C37L4o85J5L26K91j18P1k9r8n4k98j0L98j50Nj05j75J39L1P3k37M0k2J28
3667i3J94J19j34j51k48K6M76J05j11j10k7m46Q6P74L0j16p07j12L02J80K09j39
3689A07k8k55JJ57j20L80l78L1K84l61J20j5J88j44k0M9K03nO1l01k44R0K57K8
3713H5L02l07j13k50M5R3K92M7j58J5j94j11J76M04j42J22m54J84l26L40P5l4
3735I1j63n3l7L09L3j83n9j55j21L54K26j20j14n6n45M33J12L51J06k86k83j73
3757c33K32L41J85k01l39j22qJ57J27K67j76l91J07p0L98m6l2k75O0J6K33j33
3779cK93j94l85N44k4J57k52j56j88j68J69L44Q3J14p23j02J15M08N2J91P2l89
3801d2k52N6J13K36N3j32M2k48n6M31n6j73k49K05J85%Q0j62j83j06J54L54m3
$$ plain form
3824 207 175 -193 -433 -126 -55 337 262 279 -70 -58 -343 -68 174 392 -12 -357 -215 -179 -44 171 34 56
3846 56 -122 -396 -251 185 -214 52 109 -308 160 -34 -47 206 -202 -228 -122 105 87 305 57 -4 -119 -260
3868 -260 -14 492 256 106 -202 -98 -27 -90 229 378 -185 -232 -193 -212 239 338 -221 -393 100 -261 74 113
3890 113 131 -153 69 -251 -37 170 162 -247 -170 -149 223 450 81 47 -407 -56 49 106 512 332 189 -326
3912 -326 -439 146 199 433 86 -204 -125 31 217 355 326 0 -177 -234 -129 155 90 62 -65 -35 -101 435 288
3935 288 153 -202 -125 -130 -12 165 194 -67 -282 -417 -16 347 351 253 94 -167 -324 -22 344 318 35 7 -196
3958 -196 -150 10 116 156 18 74 -172 6 12 12 151 -127 -254 -32 205 60 135 -88 -25 -258 153 223 227 -183
3982 -183 -70 -167 -177 80 280 -36 -106 -437 -409 -121 229 262 -181 -181 -133 32 182 205 146 -68 24 -71 -106 329
$$ packed form
3824B07l2l68k40L07P1L92p5J7l49J2k85K75K42K18m04l45J42L6J35K15j37K2
3846E6j78k74J45M36l99K66N7m17M68j94j3K53m08k6J06K27j8K18k48o1j15j41
3868b60K46N06k36j50l08J04P1o3L19J49n63m7L9j9M51R9n59j72M93l61L35L9
3890A13J8k84K22l20K14K07qm09P7K1L72K27l69l4m54L51J05N7M06j80j43n15
3912c26j13N85N3K34l47k90P9J56J86J38k9l26j77n7J05K84o5k8j27L0o6N36j47
3935B88j35l55P7nJ18J77K9k61k15j35M01L63Mr8j59k61j57L02L66k6k83k8k03
3958a96M6J60J06M0j38N6k46J78O%J39k78j27K22K37j45P5k23O3k33M11P0Mm10
3982a83J13r7j0K57K00l16p0l31K8K88L50L3m43%M8J65J50K3n9k14R2r5l5M35
$$ plain form
4006 329 344 27 -196 -54 50 231 346 -158 -471 -237 -57 161 200 427 -28 -375 -366 -397 287 226 319 -92
4028 -92 -131 -206 306 188 275 -102 -189 -155 -139 96 -10 133 -310 -315 55 227 444 -58 55 -54 4 79 436 238
4052 238 16 -486 -36 -114 372 267 93 -292 -283 -344 -368 141 368 97 -481 -475 40 -7 242 -120 -16 -82 -59
4075 -59 -182 -242 -77 189 21 -262 147 174 296 102 -137 -95 -15 390 326 364 -107 -395 -292 -306 314 559 249
4098 249 -192 -535 -368 -70 140 369 112 -91 -326 -176 195 175 -67 -193 -501 -452 93 284 87 223 -118
4119 -118 -89 276 496 294 -128 -332 -195 162 132 296 311 175 -434 -438 -84 115 533 52 -308 -683 -200 34
4141 34 495 359 176 -145 -500 -37 30 126 75 -7 -363 34 176 459 -67 -143 -216 -273 140 75 -40 -98 -155 -293
4165 -293 -60 434 359 225 10 -335 -328 -204 -36 289 7 -375 -236 -227 30 438 231 -110 -98 -446 147 -93
$$ packed form
4006C29J5l17k23J42J04J81J15n04l13K34J80K18L9K27m55l47Rl1O84o1R3m11
4028i2l9p5N12j18Q7l77q7L4J6K35j06J43m43nL70J72K17n02J13j09N8P5L57j98
4052B38k22n02M50p8M86j05j74l85Ro1k4N09K27k71n78ON15m7K49l62J04o6K3
4075e9j23o0J65K66j68k83M09K7J22j94k39M2Q0M05o4L8m71k88J03j4O20K45l10
4098B49m41l43J67K98K10K29k57k03k35J50L71k0k42j26l08M9N45J91j97J36l41
4119a18K9L65K20k02m22k04J37L57l0J64J5j36o09mL54J99M18m81l60l75M83K34
4141C4M61j36j83l21l55M63O7R6n1q2l56L97J42K83n26p6p3n7M13o5j15n8n7j38
4165b93K33M94p5j34k15l45PJ24J68L25k82l82J39RK57M08k07l41J2l48N93k40
$$ plain form
4187 -93 182 240 -75 -358 62 119 319 -8 -320 8 -184 -147 355 -68 -18 -280 -332 9 94 426 201 115 -443
4210 -443 -422 100 178 415 100 -143 -338 -164 -215 370 282 -50 135 -148 -108 -184 85 46 25 -260 209 160 193
4233 193 60 -314 -203 -287 164 317 236 -41 -421 -144 -155 190 443 346 -61 -178 -462 -187 265 430 352 -187
4255 -187 -454 -358 357 110 174 -71 -319 -500 -73 209 36 -72 -155 -249 -161 50 -156 224 -145 -327 -391 361
4277 361 497 -7 -12 -262 -356 32 516 356 329 17 -202 -535 -142 243 419 138 -202 -521 -160 -10 240
4298 240 165 22 -78 -235 -167 222 316 -240 -217 -378 192 135 402 -252 -159 -353 -165 484 373 277 -257 -341 -329
4321 -329 -49 144 491 -5 -226 -183 -261 -84 475 428 -109 -199 -313 -87 96 6 136 -90 -407 37 89 218
4343 218 -82 -70 -237 -164 -3 312 244 73 -473 -487 -48 308 413 -2 -114 -261 -325 49 197 344 158 -267
$$ packed form
4187i3K75N8l15k83M20N7K00l27l12L28j92L7N02m23N0k62n2L41Q5L32k25q6n58
4210d43K1N22P8K37l15k43j95J74n1N85q8l32J85k83M0p6K69l9k1k85M69m9L3
4233A93j33l74J11q4M51J53q1k77l80K77j1L45K53r7m07j17k84K75M52J65p8n39
4255a87k67R6P15k47O4k45k48j81M27K82j73j08q3r4Q8K11k06L80l69j82o4P52
4277C61J36n04nk50r4L88M84j60k7l12k19l33L93L85J76k81l40l19L61J50K50
4298B40p5j43j00j57O8L89R4n56K3j61N70n7K67o54R3j94J88O49j11r6n34q4J2
4321c29K80J93L47m96k21M3p8J77N59m7n37r0j14K26J83r0J30k26l17M44N2J29
4343B18l00J2j67P3J61L15o8j71n46j4M39L56J05m15j12j47o4L74J48J47j86m25
$$ plain form
4365 -267 -226 -142 -34 465 220 -37 97 -197 -2 104 9 -86 -4 -57 47 175 311 156 -178 21 -216 160
4387 160 569 293 305 -366 -65 -21 529 444 96 -163 -361 -351 211 332 635 131 143 -157 -512 170 186 339
4409 339 -193 -245 -286 -6 166 151 12 -182 -67 141 373 64 78 -234 -298 -281 24 361 336 -132 -600 -236
4431 -236 1 306 328 5 -594 -440 -473 76 81 226 -238 -580 -321 -322 180 325 -197 40 -183 -211 24 355
4453 355 415 -167 -368 -16 -63 254 262 104 -50 -388 -5 360 339 139 -249 -395 -496 48 202 245 20 -247
4475 -247 -453 -158 276 583 569 288 -404 -582 -143 211 233 -2 15 -123 -40 -82 241 19 -194 -205 -314 143
4497 143 288 276 54 -573 -367 234 123 404 130 35 -315 -371 146 387 296 41 -315 -235 -136 316 449 171
4519 171 151 -110 -275 54 136 379 136 -327 -244 -55 132 109 86 103 -217 151 52 377 413 -142 -177 -254 67
$$ packed form
4365b67M1Q4J08M99k45k57J34k94J95J06r5r5Q2n3J04J28J36j55l34J99k37L76
4387A60M09k76J2o71L01M4N50q5l48k59j98J0N62J21L03n04J2l00l55O82J6J53
4409C39n32n2m1K80J72j5j39j94J15K08K32l09J4l12o4J7L05L37k5m68m68L64
4431b36K37L05K2l23n99J54l3N49NJ45m64l42K59jN02J45n22K37k23k8K35L31
4453C55O0n82k01L52m7L17Qj58j54l38L83L65k1k00l88j46j01N44J54M3k25k67
4475b47k06K95M34L07j4k81o92j78M39L54K2k35J7j38Q3m2L23k22k13j1j09M57
4497A43J45j2k22o27K06O01j11K81k74r5l50n6N17K41r1k55l56Q0R9M52J33k78
4519A71k0k61j65L29Q2K43k43m63Q3J89J87k3k3J7l20L68r9L25L6n55l5p7L21
$$ plain form
4542 67 335 426 90 -206 -414 -203 64 399 406 119 -226 -309 -3 77 136 110 -33 -162 -198 16 90 133 -43 -205
4566 -205 -197 29 176 127 91 -214 -480 69 73 496 223 -116 -568 -257 -11 130 479 149 -1 -451 -209 233
4588 233 364 597 -25 -300 -153 13 107 -3 285 189 -390 -277 63 78 124 -9 -327 177 -81 270 174 99
4610 99 -339 -341 -236 338 260 325 -342 -277 -532 -55 482 433 263 -525 -187 -371 -114 244 418 -66 -308 -433
4632 -433 14 141 418 28 -367 -302 111 -47 198 100 110 -374 -400 -52 73 162 35 -358 -535 -12 198 469
4654 469 32 113 -217 -189 168 366 270 -174 -183 -693 -263 186 11 176 -156 -280 -126 -98 -59 558 -163 104
4676 104 -56 -221 86 163 174 -272 -185 -250 2 59 6 -53 -200 -383 -89 274 488 -62 -209 -463 -322 -20
4698 -20 286 486 90 -550 -272 -150 179 151 594 78 -619 -210 -190 192 159 -165 -367 17 -186 212 99
$$ packed form
4542F7K68R1l36k96k08K11K67L35Pk87l45q3L06Q0N9k6j43j29l6K14P4M3j76j62
4566b05QK26J47m9l6l05k66N49MM23k73l39m52L11K46J41L49l30j50m50K42M42
4588B33J31K33o22k75J47J66R4j10K88r6n79J13L40J5M6j33l18N04k58L51r6p5
4610I9m38kJ05N74p8O5o67O5k55M77N37m9j70p88L38j84K57L58J74m84k42j25
4632d33M47J27K77l90l95O5M13j58K45r8J0m84k6L48J25Q9j27l93j77N23K10K71
4654D69m37Q1l30K8L57J98r6m44rn10M30M49j75J65l32j24J54K8L9O17p21K67
4676A04j60j65L07P7J1m46Q7o5K52N7n3n9j47j83K94L63K14n50j47k54J41L02
4698b0L06K00l96o40K78J22L29k8M43n16o97M09K0L82l3l24k02L84k03L98j13
$$ plain form
4719 99 95 -197 -101 -166 265 189 234 4 -121 -17 33 98 333 110 -465 -392 -451 332 474 24 -26 -251 -294 53
4743 53 215 438 -44 -92 -168 -327 -190 165 255 -4 -12 62 111 132 282 -40 -169 -315 143 370 396 -168 -45
4766 -45 -433 -346 452 460 481 -101 -277 -693 45 -8 365 266 -223 -392 -375 -404 186 -157 -319 174 -288 -223 -5
4789 -5 216 191 -82 -184 -102 75 466 -21 90 -511 -234 -174 258 334 15 -62 -359 -100 186 279 335 -267 -350
4812 -350 -406 -62 -130 372 299 -105 -203 -259 116 60 56 3 -173 -69 -77 89 286 -9 -41 -85 -114 -173 414 35 -2
4837 -2 -353 -312 8 226 240 146 -347 -486 -274 -117 271 355 -157 -511 -451 61 271 571 245 136 -308 -376 -97
4860 -97 283 330 209 -143 -404 -128 325 416 153 -166 -131 -8 -11 285 173 -267 43 -267 248 215 196 81 -336
4883 -336 -561 -229 145 464 159 37 -165 -43 -270 59 479 289 -132 -370 -303 48 319 160 -1 -206
$$ packed form
4719I9mk92R6o5M31p6M5k30j25J04N0O5K35k23n75P3n9P83J42m50n0k25m3L47
4743E3J62K23m82m8p6j59J37L55R0k59qP4M9K1J50l22j29j46M58K27K6n64J23
4766d5l88Q7P98QK1n82j76m16P38n3L73r9m89j69J7k9N90l43j62M93m62O5K18
4789eK21k5k73j02Q2J77L91m87J11o01K77O0M32P6l19p7k97K59K86R3N6o02q3
4812c50n6L44o8N02p3m04r8n6L75n6mn3j76J04qJ66J97k95l2m4k9n9N87l79l7
4837bl51M1L20K18J4r4m93j39K12J57L88Q4n12l54O0N12K10L00l26j09m44o8K79
4860i7L80M7j21l52k61K76M53R1k63l19L5J23lK96j12m40L10l10N15l3j9j15m17
4883c36k25L32L74L19l05j22k02J22k27L29M20j90m21k38O7L51K71j59j61k05
$$ plain form
4903 -206 -178 -113 279 163 215 179 -395 -187 173 256 93 -27 -60 -274 35 283 446 244 -213 -451 -188 158
4925 158 586 156 176 -285 -290 -94 284 406 242 -169 -249 118 233 -66 219 -57 -124 -258 0 241 -152 -82
4947 -82 -339 86 -147 339 245 338 -98 -246 23 401 270 402 122 -123 -105 206 65 722 593 -127 -635
4968 -635 325 -104 -203 856 297 -138 -178 -575 1098 -143 1074 -321 462 -543 -667 1040 32 104
4986 104 223 -232 -568 124 113 405 -201 -265 332 475 408 677 -183 148 -362 -181 144 170 198 -154 -410 -327
5008 -327 -141 36 377 366 -393 -330 -231 206 266 253 -274 -194 353 -33 18 -94 -388 -219 -431 -195 269 610
5030 610 104 -398 -500 -270 143 65 40 16 -168 -241 -141 256 229 69 10 -297 -458 400 78 58 79 -253 -48
5053 -48 59 218 80 47 250 -101 -254 191 327 203 -104 -593 -216 28 481 390 47 -99 -659 -196 441
$$ packed form
4903b06K8O5L92j16N2l6n74K08L60Q3j63j20l3k14L09K48J63k02m57k38K63L46
4925A58M28m30K0m61nJ96L78J22j64m11q0L67J15k99K85k76o7j34K58K41l93P0
4947h2k57M25k33M86r4R3m36j48K69L78j31J32k80k45J8L11j41O57j29p20n08
4968f35R60m29r9J059n59m35m0l97J673j241J217j395P83j005j24J707j008P2
4986A04J19m55l36O92j1K92o06o4N97J43o7K69q60L31n10J81L25K6K8l52k56Q3
5008c27J86J77L41j1p59O3R9M37O0j3n27Q0N47l86N1j12k94J69k12K36M64L41
5030F10n06n02j02K30M13p8k5k4j84p3J00L97k7j60n9l07j61Q58l22k0K1l32K05
5053d8J07J59j38l3K03l51j53M45J36j24l07m89L77K44M53r1l43j46n60M63O37
$$ plain form
5074 441 343 416 -105 -299 -115 -337 331 421 200 -107 -486 -202 -82 211 203 -184 -71 -241 119 281 105 -165
5096 -165 -424 -103 166 216 310 98 -38 -129 -194 187 67 60 -227 -222 -278 -374 184 208 144 -237 -325 -291 251 104 226
5121 226 -54 -131 -9 -221 290 198 7 190 -252 -71 -111 371 120 -282 -217 -27 -147 -19 339 91 -61
5142 -61 -440 -249 158 153 13 -176 -494 -213 45 199 378 370 196 -466 -282 -142 77 149 -48 -141 -273 -204 325
5165 325 52 257 53 -277 -226 129 -189 -156 14 -128 -245 -245 678 441 40 9 -388 -510 250 343 -30 38
5187 38 -429 -464 -50 249 242 6 -143 -276 -279 -266 209 310 -132 -308 -146 -100 -83 168 39 -31 -164 -163 1 14
5211 14 -7 -122 -289 -209 84 413 191 -183 -225 -488 -175 132 315 47 -246 -669 -58 -126 160 554 169 47
5233 47 -454 -541 -133 264 56 -167 -177 84 -25 275 434 75 -181 42 -172 265 260 -248 -257 -439 -169 8
$$ packed form
5074D41r8P3n21j94J84k22O68R0k21l07l79K84J20K93ql87J13j70L60J62j76k70
5096a65k59L21K69N0R4k12j36r1o5L81j20pk87Nn6r6N58K4o4l81q8L4N42j47J22
5121B26k80p7J22k12N11r2j91J83m42J81m0M82k51m02O5J90j20J28L58k48j52
5142f1l79J91M07nj40j89l18K81K58J54J79qj74o62J84J40K19P2j97r3j32O9N29
5165C25k73K05k04l30N1L55l18L3J70j42j17%R23k37m01l1l97j22P60R3l73O8
5187C8m67l5M14K99pk36j49j33lJ3M75J01m42j76J62M6J7K51j29p0j33JJ64J3
5211A4k1j15j67Q0K93L29k22l74m2k63L13L07J83k68k93m23O11o8K86L94l85j22
5233D7n01q7M08L97k08k23j0K61j09L00J59l59k56K23k14M37nn08rj82K70J77
$$ plain form
5255 8 473 327 -36 -385 -269 -289 366 535 278 -224 -438 -405 26 151 354 -46 -220 -564 -105 267 376
5276 376 126 123 -132 -194 -154 96 -182 -26 -465 -193 -189 225 259 129 -134 -93 -8 140 354 286 173 -331 -409 -133
5300 -133 -42 92 399 -83 -202 -17 51 261 329 -88 -170 47 -282 2 16 210 -447 -338 -333 310 47 138 -176
5323 -176 -322 -107 329 364 291 166 -448 -133 -41 29 374 75 -92 -562 -70 -313 195 405 388 -244 -342 9
5345 9 125 489 373 -236 -53 -253 -113 371 302 114 -72 -132 61 161 295 -33 -154 -441 -237 275 200 187
5367 187 71 -505 -110 18 344 461 350 162 -311 -287 193 129 639 284 -213 -249 18 329 336 181 33 -201
5389 -201 20 -36 241 251 -79 -60 -231 101 120 242 172 17 -319 -74 131 352 220 113 240 -344 -166 142
5411 142 347 15 -277 -234 -218 188 148 142 78 -233 -195 4 -136 148 270 39 -130 -66 184 164 64 -212 -249
$$ packed form
5255HM65j46l63l49J16k0O55J69k57n02k14L3M31J25K03m00j74l44M59L72J09
5276C76k50lk55o2M0K50k78J56m39K72MM14L4j30k63M1Q5J48K14o8j13n04p8K76
5300a33R1J34L07m82j19J85O8K10O8m17q2K17l29K84J4J94o57J09NO43k63R1l14
5323a76j46K15M36L5p3j25o14L15R2P0L45k99j67m70M92k43N08K10j7o32r8L51
5345IJ16L64j16o09J83k00J40M84o9j88j86o0J93J00J34l28j21k87K04N12p5j3
5367A87j16n76L95J28L26J17j11j88m73K4M80o4N10l55m97l6K67L11Pj55j48k34
5389b01K21n6K77J0l30J9j71L32J9J22p0j55l36K45K05K21j32j07J27n84J78L08
5411A42K05l32k92M3J6M06m0oo4l11L8J99j40K84J22k31j69O4K50k0j00k76l7
$$ plain form
5434 -249 -56 -187 285 148 -47 -151 -327 -266 351 485 229 -343 -356 -223 -141 679 6 236 -15 -345 -297
5455 -297 -102 220 315 134 38 -224 -238 45 101 479 -61 -327 26 118 174 269 157 -520 -68 86 203 491
5477 491 -140 -111 -564 -133 181 417 330 16 -355 -489 31 243 403 -148 -137 -267 -206 -50 336 524 6
5498 6 -191 -398 -18 85 33 67 -37 -13 -190 353 218 189 -79 -431 136 139 160 210 -49 -253 -166 329 -60 553
5522 553 157 188 -258 -174 -140 469 430 226 -138 -101 -214 198 304 219 32 -348 -55 -248 238 134 106 -271
5544 -271 -1 -4 25 179 135 -150 -339 -212 195 615 105 251 -130 -200 -192 156 296 155 121 -326 -183 -37 147
5567 147 387 383 -336 -124 42 11 74 109 -36 33 -31 5 305 339 -15 -264 -177 -145 17 71 263 151 -119 -242
5591 -242 20 114 38 22 -504 -320 -113 113 228 328 -106 -162 15 -112 125 282 177 -155 -288 -236 193 236
$$ packed form
5434b49J93j31M72j37j95j04j76O1O17J34k56n72j3J33Q2Q20o73K30k51l30M8
5455b97J95L22R5j81r6k62j4K83N6L78n40k66L53R2N6R5j12o77M52J54J17K88
5477D91o31K9m53M31L14K36q7l14l71j34N20K12J60n51J1j30O1J56L86J88n18
5498Fj97k07L80J03n2L4j04K4j77N43j35k9k68l52N67LK1N0k59k04Q7M95l89O13
5522E53l96L1m46Q4L4O09l9k04l64L7j13M12J06q5j87l80K93j93M86j04k8l77
5544b71K70lK9J54m4k85j89J27M07M20n10J46l81p0QL48J40j41l4m47J43J46J84
5567A47K40mp19K12J66l1O3L5j45O9o4L6L00L4l54k49Q7L2J62N4J92j12k70j23
5591b42K62R4p6j6n26J84K07K26J15J00m34n6J77j27K37J57j05l32j33N2M29M3
$$ plain form
5613 236 106 -160 -243 -228 -63 109 7 259 -367 -47 -71 256 179 -254 -345 -311 -113 -83 176 -141 -16 -202
5635 -202 -116 -135 15 90 63 -192 -5 -77 -106 234 230 140 -66 -271 -487 387 129 63 -127 -107 -42 320 147 85
5659 85 -14 -498 -209 -145 342 237 -58 -100 -141 -10 35 314 392 115 -181 -251 130 160 220 139 -158 -83 -159 60
5683 60 270 478 -82 -217 -67 151 -54 278 -139 -190 -183 146 222 218 21 -92 -185 -132 30 98 59 -157 -20 -229
5707 -229 226 158 413 312 23 -433 -20 -10 253 399 102 -78 -187 -101 146 330 -151 9 -590 -244 33
5728 33 204 -42 68 -27 -93 145 139 81 -114 -217 -136 144 15 403 297 -165 -399 -658 -28 194 378 27
5750 27 -94 -310 -360 120 270 404 39 -350 -331 -34 142 158 71 -123 43 -111 210 302 238 -236 -280 -276 -44
5773 -44 264 119 147 103 -169 137 218 324 482 -97 -175 -307 107 376 347 -27 -84 -239 -93 16 126 254
$$ packed form
5613B36j30k66q3J5J65J72j02K52o26L20k4L27p7m33r1L4J98L0K59l17J25j86
5635b02Q6j9J50P5k7k55J87p2k9L40mr0k06k05k16Q74k58o6j90K0O5L62j73o2
5659H5r9m84K89O4M87j05k95m2m1J31M5K79P8k77k96p0L81L0O0q1k97P5p6K19
5683F0K10K08n60j35J50K18k05L32m17n1PL29P6mj97j13r3N3J62O8l9k16J37k09
5707b29M55o8K55j01k89m56M13J0K63J46k97j80j09Q6K47J84m81J60n99L46K77
5728C3J71k46J10r5o6K38on8j95j03Q1K80j29L88j06m62k34k59O30K22J84l51
5750B7j21k16n0M80J50J34l65l89J9K97J76J6q7j94J66j54L21R2o4m74m4MK32
5773d4L08j45K8m4k72L06Q1J06J58n79p8j32M14K69k9l74n7j55J46J09J10J28
$$ plain form
5795 254 184 -175 -9 -123 48 124 -119 -57 -81 -199 317 2 -33 96 -116 -129 -97 323 -78 -113 -248 -236 83
5818 83 321 399 212 76 -356 -245 88 235 142 235 -42 -297 -227 -222 103 273 51 -46 -81 -140 150 101 -204 -90
5842 -90 -81 -21 373 195 -48 -50 -244 -129 65 271 165 -301 -317 -153 -215 520 416 238 -26 -283 -235 -105 256
5865 256 125 107 -105 -271 -145 -48 157 347 -19 -241 -300 -171 52 371 167 51 -331 4 330 174 45
5886 45 53 -74 66 83 208 392 143 -205 203 82 321 -36 204 71 -227 -18 43 160 448 78 -295 -137
5908 -137 -138 103 216 150 210 -104 -269 135 129 64 -44 -308 -188 52 -43 190 36 -11 -167 84 328 340 82
5931 82 -299 -301 -327 -181 275 438 162 -260 -330 -166 194 384 92 -64 -267 -137 -17 -5 242 133 6 111
5953 111 -132 52 197 98 100 8 -49 270 332 239 -16 -156 -28 -149 127 307 358 -83 -199 -1 115 166 245
$$ packed form
5795B54p0l59J66j14J71P6k43O2k4j18N16l15l5J29k12j3L2M20m01l5j35J2L19
5818H3K38P8j87j36m32J11L33J47r3R3k77k55P0NL25J70k22r7l5n9K90m9l05J14
5842i0RO0L94j78k43kj94J15J94K06j06m66j6J64o2P35j04j78k64k57M8J30L61
5865B56j31j8k12j66J26R7K05J90l66k22n9J29K23L19k04j16l82L35L26j56j29
5886D5Qj27J40J7J25J84k49l48M08j21K39l57K40j33k98K09O1J17K88l70l73J58
5908a37jK41J13o6O0l14j65M04oo5j08k64J20K40r5K33j54m7j56K51K44J2k58
5931H2l81kk6J46M56J63k76m22p0J64L60J90k92j56k03J30J20J2K47j09j27J05
5953A11k43J84J45r9Kr2n7L19O2r3k55j40J28j21K76J80N1m41j16J98J16N1P9
$$ plain form
5976 245 138 -98 -302 -147 138 -52 108 -48 -104 -300 84 238 165 87 -101 -292 95 106 71 26 -211 -11
5998 -11 28 107 442 204 -66 -139 -502 127 -47 478 71 39 -325 -264 -4 78 280 36 -138 -40 -67 -49 254
6021 254 -169 203 -149 -154 131 389 34 144 268 -12 70 297 234 -109 -186 -71 -177 52 323 152 -14 -242
6043 -242 -253 -188 264 257 -169 -66 -61 -153 43 79 100 255 -47 -375 207 443 -38 -72 -147 70 -329 79 528 139
6067 139 277 -239 -97 337 69 327 -131 -394 -8 -110 264 82 89 -40 -282 -276 -41 214 107 203 1 -51
6089 -51 -149 142 302 157 -290 -266 -312 -280 417 399 -93 -102 -288 -159 165 37 161 108 -62 -227 5 -29 40 -42
6113 -42 -28 -12 437 366 324 173 -468 -136 1 11 294 144 87 -50 -143 -373 52 244 165 -1 53 -199 166
6136 166 4 127 20 99 207 -128 -84 88 419 -81 -146 -125 137 180 -10 -110 -109 -38 -31 10 297 100 -261 -90
$$ packed form
5976B45j07k36k04J55K85j90J60j56n6j96L84J54p3p8j88j91L87J1l5m5k37K00
5998a1L9P9L35k38k70p3l63O29j74N25m07l2l64O1K60Q2K02k44j74R8k7J8L03
6021B54m23L72l52nK85K58l55J10J24k80Q2K27o3l43p7J15j06K29K71j71j66k28
6043b42j1O5M52pm26J03Nr2J96L6K1J55l02l28N82K36m81l4p5K17l99M08M49l89
6067A39J38n16J42M34k68K58m58k63L86j02L74j82Pj29k42OK35K55j07R6k02n2
6089e1r8K91J60j45m47K4m6L2O97j8m92rj86J29L24j28J24n3j70j65K32l4O9q2
6113d2J4J6M49p1m2j51o41L32J37J0K83j50n7j37r3k30M25J92p9j66N4k52L65
6136A66j62J23j07P9J08l35M4J72L31n00o5K1K62M3j90j00JP1PM1K87j97l61J71
$$ plain form
6160 -90 80 -31 96 486 232 -291 -215 -82 362 231 281 -57 -53 -368 -74 146 157 88 24 -63 -126 178 210 64
6184 64 190 -50 -72 -57 335 140 47 -329 -14 -39 140 258 -3 -239 -393 -277 60 287 71 -112 -190 -39
6206 -39 -120 348 146 29 -24 -306 -117 -21 172 -42 11 -303 -363 -159 36 21 136 -176 -105 37 141 312 14
6229 14 -194 -300 -237 -106 514 44 82 -335 -367 -106 113 176 -25 107 -351 -451 -171 254 45 49 -102 -102 -142
6252 -142 300 142 21 -37 27 -130 -307 84 51 121 -89 -290 -159 35 394 -140 -424 -104 -394 41 353
6273 353 299 181 -193 -586 -8 172 451 307 168 -118 -422 43 88 296 317 -22 -191 -88 129 78 89 -220
6295 -220 -47 -111 152 322 59 -105 154 28 71 103 138 63 -4 5 -41 -41 237 324 39 -123 -136 252 230 245 191
6320 191 -166 -177 -220 -83 146 155 134 -153 -412 -109 74 4 176 -523 -355 -143 -215 154 126 13 -112 -58 15
$$ packed form
6160i0J70j11J27L90k54n23P6J33M44j31N0l38Ml15K94K20J1o9o4q7o3L04L2j46
6184F4J26k40k2J5L92j95r3l76L15k5J79J18k61k36j54J16L37K27k16j83p8J51
6206c9q1M68k02j17n3k82J89R6J93k14N3l14o0K04J95j5J15l12P1J42J04J71k98
6229A4k08j06O3J31O20m70L8m17l2K61K19O3k01J32m58j00K80M25k09Mj51%m0
6252a42M42j58j21n8O4j57j77L91l3P0k10k01J31J94L59n34k84L20k90M35L12
6273C53n4j18l74l93N78J80K79j44j39k86l04M65M5K08K1l39j69J03K17n1J1l09
6295b20J73o4K63J70k63j64K59j26M3L2L5p5o7Rm6%K78Q7k85j62j3L88k2J5n4
6320A91l57j1m3J37K29Rk1k87k59L03J83p0J72o99J68K12p2L69k8j13j25N4P3
$$ plain form
6343 15 122 292 -39 -134 -320 124 -30 51 339 -172 -216 -165 -397 189 392 -15 -206 -282 -101 164 38 33 -8
6366 -8 22 -134 63 -104 120 285 -115 -108 8 45 9 123 141 -194 -247 -80 179 239 -168 -112 -440 -51 -52 105
6390 105 136 -28 -512 -109 86 63 -56 -82 332 -486 -233 -102 112 297 -32 -24 173 164 -15 140 -57 28 -9
6413 -9 -100 133 112 -178 -334 -103 -46 -277 185 119 -18 -75 -332 18 141 178 10 -174 38 -105 3 188 292
6436 292 24 223 155 81 4 62 199 67 -44 -268 29 346 216 -201 -260 -190 -196 266 405 310 -85 -425 19
6459 19 133 50 299 -262 -69 -113 -136 226 312 289 -128 -4 79 200 192 241 54 -152 35 59 -118 85 -26 -104
6483 -104 15 62 307 110 11 -36 -109 -199 179 208 -94 39 -354 20 2 52 166 177 128 -143 -97 -76 -59 290
6507 290 144 -167 -285 -58 -241 -158 276 -90 -59 -79 -69 -212 216 246 19 -58 -61 54 273 -9 66 -112 -69
$$ packed form
6343A5J07J70l31r5j86M44j54Q1K88n11m4N1k32N86K03m07j91p6J81K65j26nm1
6366hL0j56J97j67K24J65m00PJ16L7l6J14J8l35n3J67K59O0m07N6l28L89jJ57
6390A05L1j64m84M03J95k3j19k6M14q18K53J31K14J85l29QJ97rj79J55j97Q5l7
6413ir1K33k1k90j56K31N7k31M62o6j37n7k57L50J23L7j68j84K12j43J08J85J04
6436B92k68J99o8p4p7N8J37j32j11k24K97L17j30m17n9P0oM62J39r5l95l40M44
6459A9J14q3K49n61J93m4k3L62Q6k3m17J24Q3J21qM9j87k06J87K4j77K03j11p8
6483a04J19M7K45j97r9m7p3r0L78K9l02J33l93L74j8N0J14J1m9k71M6K1J7L49
6507B90j46l11j18K27j83Q3M34l66L1k0J0j43M28L0k27p7lJ15K19k82P5j78M3
$$ plain form
6530 -69 151 174 77 365 -35 -228 -134 101 -32 410 -405 -156 70 -62 61 301 329 158 -42 -65 -49 19 303
6553 303 1 -112 24 -194 226 219 195 -70 -62 -294 137 59 206 -230 -167 132 -7 49 -37 -68 -158 -32 99 -8
6577 -8 435 45 -93 -241 -250 135 -104 127 17 -170 -74 -17 133 288 78 -42 -23 -105 -92 77 162 -72 2 179
6601 179 56 27 -17 154 -143 -35 180 78 68 178 -164 -304 -233 171 125 262 289 -105 -150 -240 66 -40 219
6624 219 117 -90 -66 -64 -49 194 61 -45 -221 -115 103 50 -255 1 -1 40 118 104 250 -86 -121 -278 -19 75
6648 75 70 383 150 -314 13 -227 111 231 138 25 -238 48 98 195 36 51 -124 -91 -107 141 128 -80 -245
6671 -245 -191 -129 71 492 63 -125 -500 -46 36 147 62 -228 -288 -132 -74 -95 181 282 -114 -300 76 94 245
6694 245 -6 117 -40 -422 -219 -30 271 60 -164 -164 -351 -66 12 -20 69 -322 -298 -71 402 57 14 104 -192
$$ packed form
6530f9K20K3r7K88m00j93R4K35j33M42q15K49K26j32J23K40K8j71k00k3J6O8K84
6553C03l02j13J36k18M20pk4k65Qk32M31p8J47m36O3K99j39N6q6l1r0J26J31j07
6577hM43l90j38j48rL85k39K31j10j87R6N7J50J55k10j20J9q2J3J69Q5k34P4J77
6601A79j23k9m4J71k97J08K15j02j0J10l42j40P1M04m6J37K7l94m5r0L06j06K59
6624B19j02k07K4KJ5K43j33j06j76J06K18n3l05K56kM1P8j4J46l36l5j57K59R4
6648G5nL13k33m64L27k40L38J20r3j13k63K86N0R7j59J5j75L3j6K48j3k08j65
6671b45N4O2K00M21m29j88l75M54Q2J11q5k90o0J56N8k1K76J01l96j86L76J8J51
6694B45k51J23j57l82K03J89L01k11k24%j87K85P8l2Q9l91K4K27M73l45m3R0k96
$$ plain form
6717 -192 72 194 306 7 -117 -33 -101 -201 236 117 291 -17 -325 -344 -16 149 295 44 -54 -412 219
6738 219 90 278 335 -188 -212 -216 5 179 154 -91 -127 -12 145 91 64 50 -102 -228 -395 202 118 179 -110 -74
6762 -74 -264 -40 22 -40 388 -175 95 42 -88 170 55 -159 155 56 -150 171 17 24 6 -223 170 -131 -340
6785 -340 130 -15 -131 -221 0 -246 138 -52 -65 159 -335 206 309 212 53 -6 -115 -72 64 312 -71 -225
6807 -225 -50 111 -52 322 106 197 -165 -38 10 274 86 70 -274 -127 -64 286 438 -169 -31 -123 -105 177
6829 177 161 159 -160 -134 -314 -6 67 -43 520 -212 -233 -69 54 204 545 128 -220 62 -78 20 -71 -46 -242
6852 -242 19 -37 55 -52 -86 -243 -199 -311 243 67 -107 6 -1 -85 140 80 362 348 -247 -58 -229 13 362
6875 362 -259 173 -180 -255 -182 -172 424 217 94 -126 -417 -25 -79 293 201 -38 -192 -207 8 162 -189 26
$$ packed form
6717a92K64J22J12k99j24Q4o8j00M37j19J74l08l08j9L28J65J46k51r8l58O31
6738B19j29J88N7n23k4mK21J74k5k45l6J15J57n4k7j4j52j26j67N97q4O1k89L6
6762g4j90K24O2o2M28n63K70n3j30K58j15k14L14r9k06L21j54Pj8k29L93l01k09
6785c40M70j45j16r0K21k46L84j90j3K24m94N41J03r7j59n9j09M3J36K48l83j54
6807b25J75J61j63L74k16R1l62J27M8K64j88j6l44J47O3L50J52o07J38r2J8K82
6829A77j6kl19K6j80L08P3j10N63p32k1J64J23J50L41m17l48K82j40R8r1K5j96
6852b42K61n6R2j07l4j57M4j12N54j76j74J13pq4K25o0K82j4n95J89j71K42L49
6875C62o21M32l53p5P3J0N96k07j23k20k91L92n4L72r2k39j54j5K15J54l51K15
$$ plain form
6897 26 -306 -413 175 -65 98 124 47 -198 -115 -72 200 -43 -76 37 -120 -315 107 207 289 -121 -430 -43
6919 -43 191 99 3 229 -77 -114 -217 -76 302 219 171 4 86 116 142 177 -46 -194 -64 305 -12 -62 -64 -274
6943 -274 23 -55 99 168 -95 -132 -58 -47 24 -47 82 47 -234 -183 -122 257 130 91 -74 121 -151 138 120 106
6967 106 -21 -108 -151 -84 147 131 112 111 -259 -130 -3 -53 150 136 -370 -213 67 173 67 181 226 -139 -263
6990 -263 212 45 -10 159 -155 -145 -64 65 168 59 -49 -163 -59 81 -124 245 175 -91 100 56 55 167
7012 167 278 -302 -126 -78 20 225 122 22 -81 106 -103 20 143 -16 -363 -110 -75 12 170 114 332 126
7034 126 -263 -17 -46 242 321 -255 -138 -73 244 31 11 0 -129 -366 56 -30 191 375 -268 -300 -58 -102 -19
7057 -19 350 -208 -354 -212 -27 -204 205 -14 17 -216 -46 -187 113 61 10 -100 -62 -283 39 -116 165 -2
$$ packed form
6897B6l32j07N88k40J63K6p7k45Q3M3K72k43l3J13j57j95M22J00Q2m10l09L87
6919d3K34r2r6K26l06l7j03J41L78q3m8j67Q2L0K6L5k23j48J30L69l17n0kk10
6943b74K97p8J54O9k63l7P4J1P1p1J29l5k81N1O1L79j27l9j65J95k72K89j8j4
6967A06j27q7m3O7K31j6j9jl70J29J27n0K03j4n06J57K80J06j06J14M5l65j24
6990b63M75j67n5J69l14J0Q1J29J03j09j08j14J04J40k05L69p0k66J91m4jJ12
7012A67J11n80J76M8R8K05j03j00j03J87k09J23J23j59l47K53L5Q7J58n6K18k06
7034A26l89K46k9K88P9n76J17O5L17k13k0j1j29k37M22q6K21J84o43l2K42m4Q3
7057a9L69n58j46J42J85j77M09k19L1k33J70j41L00n2n1j10L8k21L22j55K81j67
$$ plain form
7079 -2 -245 -48 -23 330 -128 -180 -198 -202 175 196 -179 -23 -43 -377 14 214 280 75 -91 82 20 72 58 200
7103 200 58 -113 -67 -5 49 246 176 172 -177 -180 -469 -139 288 91 -71 -130 -234 9 226 84 176 11 9 150
7127 150 -54 114 -228 -234 -144 -40 17 432 53 118 -136 38 -77 408 195 218 193 -9 15 -138 204 92 148
7150 148 -126 -221 -95 162 39 128 8 10 -70 188 180 -55 15 4 -412 -9 130 152 -160 -25 -246 200 292 187
7174 187 62 122 66 29 116 -154 185 86 118 -190 33 109 79 15 7 -195 21 -169 383 26 -138 92 58 -7
7198 -7 352 132 6 -72 -215 82 271 16 -19 -116 -26 36 -107 -97 4 82 201 -104 -154 328 422 4 -148 -11
7222 -11 2 92 -28 463 232 208 -145 112 -6 -91 307 -117 -294 -19 205 97 37 -52 -37 -92 -167 45 35 -107
7246 -107 -144 -172 -109 -10 352 -3 -125 -126 -251 -17 -85 487 72 70 -336 -194 -200 -170 -71 279 156 -79 -17 -32 -15
$$ packed form
7079bk43J97K5L53m58n2j8mL77K1l75J56k0l34L91K00O6k05j66J73o2N2j4J42
7103B00j42j71M6O2N4J97p0ml49lk89L30M27j97j62n9j04K43K17j42R2j65kJ41
7127A50k04J68l42oR0J04N7M15l79O5k54J74j15M85k13K3k5k02K4j53L42j12N6
7150A48k74r5J26K57j23Q9j20Kq0K58qk35P0j1m16M03J39K2l12J35k21M46R2j05
7174A87j25O0n6l7Q7k70L39r9L2l08K23P6l0o4qk02K16j90N52l57j64K30l4o5
7198gL59k20j26p8j43K97J89k55l5r7R0O2j43J0J01P8J19l05n0M82R4m18j52J37
7222a1J3R0j20M91k31k4l53K57j18q5L98m24j77K75K24j08o0q9J5n5p5K12j0j42
7246a07l7k8O3R9L62l55j22jj25K34o8N72m15km06J42oL0R9L50j23k35O2j5J7
$$ plain form
7271 -15 481 306 -76 101 184 40 19 224 57 -263 -141 111 121 97 -50 -238 -243 -61 214 86 -107 -106 -183
7294 -183 -211 60 177 64 -219 -113 -149 -258 -8 96 14 -69 -156 78 -28 94 -123 -31 -134 -183 -169 -142 -5
7317 -5 -284 258 -269 33 -15 122 -64 -11 -136 115 -142 -30 -183 -207 53 -278 -243 49 120 218 55 -333 -54
7340 -54 194 103 -217 106 6 -168 49 44 42 -238 43 86 36 -2 115 -18 -3 -206 -44 162 307 216 118 -131
7364 -131 -106 -113 89 -24 299 70 -94 -228 51 427 170 26 -164 -202 49 187 141 80 -194 51 -147 -271
7386 -271 -211 -93 -12 -247 -187 -77 403 123 46 54 53 -192 38 52 98 141 -117 -16 -187 -42 289 124 46 -120
7410 -120 -32 -199 -150 -62 67 -218 -154 -311 -11 -51 -118 -72 -48 -35 -82 257 145 94 172 -306 -69 193 -75 -40
7434 -40 -142 -164 194 -95 145 180 325 -235 -160 -52 -140 140 133 -257 -56 -32 83 199 -146 -201 22 -175 303
$$ packed form
7271a5M96j75l82J77Q3j44k1K05j67l20J22K52J0k4j47j88nJ82K75j28j93Jp7
7294a83k8K71J17j13k83J06l6j09K50J04q2q3q7K34j06J22k17R2j03m9J4K7J37
7317ek79N42n27L02m8J37j86N3j25K51k57J12j53k4K60l31L5K92P1R8j63l88K79
7340e4K48r1l20L23j00j74K17nkk80K81M3n0l8J17j33J5k03J62K06J45r1r8k49
7364a31K5pK02j13L23k29j64j34K79L76k57j44j90l8K51J38m6o1k74K45j98j24
7386b71O0J18Q1k35O0J10M80k80p7Qjk45K30J4M6M3k58J01j71J45L31j65p8j66
7410a20Q8j67M9Q8J29k85O4j57L00m0o7M6K4J3m7L39j12n1P8m78K37K62k68L5
7434d0j02k2L58k89K40L5J45n60P5J08q8K80pl90K01K4J15J16l45n5K23j97M78
$$ plain form
7457 303 125 84 -188 -90 -138 -203 251 -121 176 -99 -74 -187 3 173 -4 222 -23 -102 -210 33 70 17 -1
7480 -1 -163 -263 212 220 91 64 165 -157 89 193 3 94 -157 -77 -355 263 26 80 -21 115 -136 29 120
7503 120 68 -51 110 -42 -122 143 -386 317 59 151 -113 -98 175 -5 202 -118 -93 -82 -61 68 -133 -143 -136
7526 -136 -276 -122 81 -95 54 52 -53 -137 31 41 207 -84 -199 -189 47 121 58 173 -365 -29 -288 -28
7548 -28 296 11 171 -175 -36 -240 66 275 -31 165 -114 -6 -73 133 -95 145 34 -312 -298 210 -30
7569 -30 256 -62 -224 120 -62 98 9 -97 -171 -171 -183 -158 227 94 -90 -128 -89 150 -61 282 66 -99 -202
7592 -202 -238 36 11 47 -7 -249 -87 70 327 -34 16 -59 -95 -49 339 182 50 -40 -143 -11 -192 363 82
7615 82 -136 253 -55 93 189 90 297 39 -77 -342 -213 110 -130 0 27 -502 -141 52 41 122 -22 -69
$$ packed form
7457C03j78m1k72R8m8o5M54l72K97k75K5j13J90J70j77K26k45p9j08K43L7n3j8
7480aj62j00M75Qj29k7J01l22K46J04j90R1k51Q0k78O18k37N4j01J36k51J65R1
7503A20n2j19J61j52q0K65n29P03k58R2k64J5K73j80K07l20K5J1K1J29k01j0P
7526a36j40J54K03j76J49kj05q4J68J0J66k91j15J0K36P4o3J15n38L36k59K60
7548b8L24k85J60l46J39k04L06K09l06J96k79J08o7K06k28K40j11l46J4N08k40
7569c0K86l18j62L44j82J60q9j06p4%j2K5L85j33j84l8L9K39k11L43k16j65j03
7592b02l6K74k5L6n4k42J62J57K57l61N0p5l6M6L88j57j32r0j03J32j81N55k81
7615H2k18L89l08J48R6r9K07k58j16k65J29L23k40J30K7n29L61J93j1Q1j44m7
$$ plain form
7637 -69 -93 58 213 -26 78 -21 -166 -248 17 244 232 -259 -199 37 221 82 80 -474 -21 -248 130 376 116
7660 116 -183 -225 -90 -106 232 -79 315 -74 -264 -256 -102 410 321 14 298 -173 -63 -28 380 75 -74 -70 36
7683 36 -250 -83 22 -123 79 -172 202 199 147 152 -87 -241 -304 -74 255 -37 17 -224 -282 17 -53 33 268 -131
7707 -131 -287 -247 -39 131 74 2 157 -328 -85 58 -275 -82 2 -28 -121 -386 154 63 -236 105 -69 164
7729 164 235 94 84 -186 19 -159 123 331 47 -86 1 -424 -101 83 -167 214 -59 -431 125 104 -5
7750 -5 252 388 -142 65 -81 124 158 -112 -82 -398 -260 -39 168 -223 269 -73 -337 -9 142 33 201
7771 201 -59 -156 -78 -102 252 -268 -93 65 -289 72 -170 -145 111 97 -140 -164 -364 53 42 -181 106 -109
7793 -109 67 43 314 169 56 -123 -195 208 84 38 -190 -57 -150 283 85 5 -6 -107 77 -119 235 89
$$ packed form
7637f9k4J51J55k39J04r9j45q2K65K27j2m91O0K36J84j39kn54M53k27L78K46k60
7660A16k99m2J35j6L38l11L94l89j90QJ54N12q9l07K84m71J10L5M08l05j49MJ06
7683C6k86J67J05j45K02k51L74ln2Nk39j54o3K30L29k92N4k41n8K99p0Q6K35l99
7707a31j56M0K08J70n7p2J55m85K43J43l33J93Q4l0r3k65N40r1k99L41j74K33
7729A64P1j41j0k70K05j78K82K08k84j33Q7m25L23J84k50L81k73l72N56k1j09
7750eK57J36n30K07j46K05L4k70L0l16J38K21K07l91M92l42k64L28J51j09J68
7771B01k60r7P8k4L54n20J75J58l54L61k42K5K56j4k37k4k00M17j1k23K87k15
7793a09J76k4K71j45j13j79p2M03j24m6k28J33r3M33j98q0j1j01J84j96L54j46
$$ plain form
7815 89 243 -64 -100 -319 19 181 199 100 -195 -18 -87 -132 365 336 43 -37 -74 -132 -135 -58 61 117 109 95 131 233
7841 233 -139 -33 -321 -126 -26 -155 301 -41 15 225 -112 243 -90 6 -271 -284 -176 122 87 62 124 -401
7863 -401 -10 176 202 -7 -85 -54 155 14 -59 -151 -394 -36 -226 -121 -208 41 119 131 -247 -135 -133 116 45 -162
7887 -162 36 -164 -35 49 64 -8 -160 73 -339 158 -34 -78 156 122 -231 -205 -272 -52 -39 -49 -19 -28 -147 -4
7911 -4 102 162 229 39 13 -132 178 -26 -43 -212 -135 90 128 219 266 167 -163 -158 -76 63 195 340 33 238 -1
7936 -1 25 199 -2 -178 -4 -203 -170 254 77 24 116 -145 -19 -10 113 39 -73 -253 247 66 191 -93 51
7959 51 -110 34 -119 7 175 -31 -25 -154 6 0 -104 111 60 -92 176 198 -167 -138 199 -264 69 12 -84
7982 -84 -77 -2 187 -39 -118 -316 158 74 -21 -227 -47 135 184 52 162 144 -175 80 94 381 48 176 -223
$$ packed form
7815H9J54l07l6k19L38J62J8r9k95J77o9m5M97k9k93q0l7n8lP7J19N6qj4L6J02
7841B33l72J06k88J95J00j29M56l42N6K10l37L55l33R6k77j3J08K98l5k5O2n25
7863d01L91J86K6k09p8L1K09j41p3r2k43L58j90J05q7K49P8J2l78J12KK49p1k07
7887a62J98k00J29Q4J5p2j52K33m12M97j92m4K34l4l53K6o7K20J3j0L0rj19J43
7911dJ06O0O7j90k6j45L10k04j7j69P7K25L8R1M7r9l30NQ2J39J32J45l07K05k39
7936aK6J74k01j76J74j99L3M24j77n3R2k61J26RJ23p4j12j80N00j81J25k84J44
7959E1j61J44j53J26J68k06Oj29J60oj04K15n1j52K68K2l65K9L37m63L33n7r6
7982h4PP5J89k26p9j98M74q4r5k06J80J82M9j32J10j8l19K55J4K87l33J28l99
$$ plain form
8005 -223 28 -217 55 176 -93 50 102 -129 -124 -124 236 38 47 -20 219 65 32 79 142 7 -237 76 166 196
8029 196 158 -49 223 63 -94 82 -42 29 -263 9 -217 97 308 85 -272 81 114 11 165 116 -216
8050 -216 -37 120 -114 -23 -89 250 -33 -154 -135 -121 258 11 -252 -306 -177 -27 -55 255 -118 85 92 -330 -72
8073 -72 -146 75 -102 43 -125 -39 234 103 106 -218 -31 61 71 35 35 147 0 -318 -6 194 70 89 -286 -80
8097 -80 -213 220 184 -1 100 -138 43 -156 296 -237 -77 56 -21 37 236 -129 134 24 -136 -147 -393 -51
8119 -51 5 83 -69 58 -125 199 -71 142 -94 -110 -108 -310 -206 -49 -111 -178 37 -122 -26 83 -79 -118 -117 -243
8143 -243 286 -205 0 213 87 -240 127 -186 171 262 130 -9 -84 63 -87 34 -35 -263 -90 -22 -73 146
8165 146 -304 -98 87 -55 189 -244 123 -230 157 131 -1 -31 197 10 103 -211 -49 -33 13 450 60 -294
$$ packed form
8005b23K51k45K72J21k69J43N2k31N%L60j98Ro7K39j54l3M7O3j35k44L13R0L0
8029A96l8k07K72j60j57J76j24P1k92K72k26L14K11k23l57L53L3j03J54m9l32
8050b16J79J57k34R1o6L39k83j21J9J4L79k47k63n4J29J50k8L10l73K03Pm22K58
8073g2p4K21j77J45j68Q6K73j31Ll24J87R2J0l6%J12j47l18L12K00j24J9l75K06
8097h0j33M33l6j85J01k38J81j99M52n33J60J33p7N8J99l65K63j10j60j1k46L42
8119e1N6P8j52J27j83L24k70K13k36j6Kk02J04J57o2o7K15j59R6J09j62l9Jj26
8143b43N29m91K05K13j26l27L67l13L57R1j32j39p5J47j50J21o9k28J73O8n1K19
8165A46m50K06J85j42K44m33L67l53L87k6j32l0K28j87R3l14J62J6M6M37l90l54
$$ plain form
8187 -294 -123 51 -401 314
$$ packed form
8187b94J71J74m52P15
8191C14
$$ Imaginary data points
##PAGE= N=2
##DATA TABLE= (X++(I..I)), XYDATA
$$ plain form
0 0 0 0 0 0 0 0 0 0 0 4 -8 8 -8 8 -16 16 -24 24 -32 40 -48 56 -64 75 -88 104 -120 139 -160 184 -210 239
32 239 -273 307 -347 392 -439 490 -548 612 -683 756 -840 929 -1029 1133 -1253 1382 -1523
49 -1523 1676 -1847 2036 -2245 2475 -2738 3032 -3366 3753 -4201 4731 -5372 6159 -7154 8464
64 8464 -10264 12913 -17208 25363 -46401 223627 389285 -112764 -295413 -119624 186886
75 186886 168007 -13477 -100953 18437 80149 7586 -90194 -36568 67367 92481 7772
86 7772 -48237 -37101 4442 8550 3215 2270 8091 -855 -2251 6061 15465 6221 -3485 -3542 4490
101 4490 6454 10978 12753 -490 -32843 -43674 -8100 39687 40006 -3467 -30109 -9562 15253
114 15253 4221 -17479 -1767 36105 37901 -7303 -41623 -23983 15794 23465 1090 -9212
$$ packed form
0@%%%%%%%%%Mj2J6j6J6k4L2m0M8n6P2q8J04j20J39j63J92k24K59k99L44l94M49
32B39n12N80o54P39q31R29j038J160j295J439j596J769j958K162k386K635k905
49a523L199l523L883m281M720n213N770o398P119p954Q932j0103J1531j3313J5618
64H464j8728K3177l0121M2571p1764K70028J65658n02049j82649J75789L06510
75A86886j8879j81484q7476J19390O1712p2563r7780N3626J03935K5114q4709
86G772n6009J1136M1543M108n335r45N821q946j396Q312R404r244r706n7Q032
101D490J964M524J775j3243l2353j0831L5574M7787L19m3473k6642K0547K4815
114A5253j1032k1700J5712L7872J796m5204l4320J7640L9777P671k2375j0302
$$ plain form
126 -9212 7223 17275 -2750 -29009 -25665 4064 26599 22861 2451 -16789 -25942 -21741 -4690
139 -4690 12408 14478 1822 -9138 -8718 -4380 -2612 2751 14086 17340 1882 -15604 -11465 9649
153 9649 17771 2350 -12693 -6874 7401 8958 1663 3763 10029 536 -22517 -25860 2929 32005
167 32005 24335 -10963 -34382 -25936 -2182 14997 18284 10970 -3508 -16829 -16374 -1900 13020
180 13020 15725 6468 -6392 -16812 -18820 -4831 16539 22077 2320 -21095 -20780 1061 16650
193 16650 12591 1822 -1365 -2491 -9121 -11593 876 17346 15405 -4907 -19951 -12291 7260
206 7260 14140 3507 -6742 -4765 4063 5024 -1309 -4789 -56 4840 3230 -395 1848 7081 5190
221 5190 -4569 -9311 -94 13476 12863 -1808 -11916 -6583 4315 4661 -3269 -7335 -3596 -2001 -3929
$$ packed form
126i212J6435J0052k0025k6259L344K9729K2535l738k0410j9240r153M201J7051
139d690J7098K070j2656j0960M20M338J768N363J1335L254j5458j7486M139K1114
153I649Q122j5421j5043N819J4275J557p295K100O266r493k3053l343K8789K9076
167C2005p670l5298k3419Q446K3754J7179L287p314j4478j3321M55J4474J4920
180A3020K705r257j2860j0420k008J3989K1370N538j9757k3415L15K1841J5589
193A6650m059j0769l187j126o630k472J2469J6470j941k0312j5044P660J9551
206G260O880j0633j0249J977Q828R61o333l480M733M896j610l625K243N233j891
221E190r759m742R217J3570o13j4671j0108N333J0898L46p930m066L739J595j928
$$ plain form
236 -3929 -2488 4751 7467 264 -8630 -5157 8316 16256 9469 -5502 -14987 -12383 554 15524
250 15524 20276 8506 -9843 -18435 -9899 5505 15623 16005 7503 -8412 -22679 -22039 -857 22832
264 22832 26639 7570 -14336 -17991 -6158 7389 13196 11405 4048 -6776 -13735 -9372 3873
277 3873 13757 9911 -2214 -10071 -6564 4139 11068 7993 -2619 -10727 -9409 51 10405 13859
291 13859 8252 -3010 -11934 -10861 503 13091 15140 4400 -10182 -16474 -11029 2135 13217
304 13217 13498 3045 -9005 -10941 -3231 3655 2159 -882 1094 2650 -2514 -9067 -7579 2795
318 2795 7341 1670 -3656 -103 5001 -35 -9615 -10631 944 11172 7178 -5000 -11814 -8125
332 -8125 -1203 2659 3252 1800 -1005 -5048 -8007 -5435 179 5611 5537 -1180 -8650 -7927 2391 11450
$$ packed form
236c929J441P239K716p203q894L473J3473P940o787j4971r485K604J2937J4970
250A5524M752j1770j8349q592Q536J5404J0118L82q502j5915j4267O40K1182K3689
264B2832L807j9069k1906l655J1833J3547N807j791p357j0824o959M363J3245
277C873R884l846j2125p857L507J0703O929l075j0612q108J318R460J0354L454
291A3859n607j1262q924J073J1364J2588K049j0740j4582o292N445J3164J1082
304A3217K81j0453j2050j936P710O886j496l041J976J556n164o553J488J0374
318B795M546n671n326L553N104n036r580j016J1575J0228l994j2178o814L689
332h125O922L862N93j452k805m043k959K572N614N432p4o717p470P23J0318R059
$$ plain form
348 11450 8645 -4150 -12556 -6774 4739 9717 5159 -1160 -5917 -10761 -12248 -4088 11606 17880
362 17880 3518 -19977 -27017 -8444 15102 21342 6957 -9257 -14590 -9840 -2198 5839 13070
375 13070 13416 1205 -15521 -20064 -4335 14459 16408 32 -16222 -15493 -2462 7262 6247 458
389 458 -3838 -6224 -7774 -5403 2024 7539 4180 -5705 -12498 -7589 4775 13122 8901 -3911 -12216
404 -12216 -7480 2816 7699 3049 -2106 -2803 -2499 -5092 -5419 1131 8419 6475 -3554 -8554 -2808
419 -2808 3848 2387 -3083 -3605 837 2297 -723 -3313 -2129 90 383 1542 4054 3663 -1285 -5948
435 -5948 -3177 3969 7611 5420 58 -4519 -6879 -5651 2289 11314 10904 -1784 -13627 -11768 1569
450 1569 11459 9663 1415 -3812 -6988 -8759 -5330 5225 14452 9636 -5655 -14569 -6636 9341
$$ packed form
348A1450k805j2795q406N782J1513M978m558o319m757m844j487Q160J5694O274
362A7880j4362k3495p040J8573K3546O240j4385j6214n333M750P642Q037P231
375A3070L46j2211j6726m543J5729J8794J949j6376j6254P29J3031R724j015n789
389D58m296k386j550K371P427N515l359r885o793M909J2364Q347m221j2812q305
404a2216M736J0296M883m650n155o97L04k593l27O550P288j944j0029n000N746
419b808O656j461n470n22M442J460l020k590J184K219K93J159K512l91m948m663
435e948K771P146L642k191n362m577k360J228P940R025m10j2688j1843J859J3337
450A569R890j796q248n227l176j771L429J0555R227m816j5291q914P933J5977
$$ plain form
464 9341 15074 7152 -3361 -7175 -4258 -578 3618 6692 4231 -3599 -11182 -8209 4136 14130 11447
479 11447 -1268 -12961 -14708 -4725 9929 17450 10574 -6316 -17671 -13218 1608 13011 14289
492 14289 7905 -1274 -10800 -14402 -5846 10458 19124 9428 -8010 -14163 -5675 3206 2816 327 2445
507 2445 4830 -454 -8452 -6079 2910 5108 -3221 -7143 1828 11896 6816 -8697 -14742 -5980 5478
522 5478 7437 3857 2462 2308 -2902 -8428 -6630 3132 9192 4778 -3733 -6726 -3701 -1633 -3224
537 -3224 -5509 -3257 2277 7068 6109 -455 -8315 -12005 -6588 4788 13094 11373 544 -9874 -13697
552 -13697 -8915 1056 11269 16342 9468 -6091 -16579 -13238 1475 12840 12031 1908 -6693 -8083
566 -8083 -4821 -560 3091 4646 2926 -1282 -3795 -930 3886 5123 -171 -7503 -8882 -817 9727
$$ packed form
464I341N733p922j0513l814K917L680M196L074k461p830p583K973J2345R994k683
479A1447j2715j1693j747R983J4654P521o876j6890j1355M453J4826J1403J278
492A4289o384r179r526l602Q556J6304Q666r696j7438o153Q488Q881l90k489K118
507B445K385n284p998K373Q989K198q329l922Q971J0068n080j5513o045Q762J1458
522E478J959l580j395j54n210n526J798R762O060m414q511k993L025K068j591
537c224k285K252N534M791r59o564p860l690N417J1376Q306j721j0829j0418l823
552a3697M782R971J0213N073o874j5559j0488L341J4713J1365q09j0123q601j390
566h083L262M261L651J555j720m208k513K865M816J237n294p332j379Q065J0544
$$ plain form
581 9727 11922 2352 -10026 -14489 -6749 5784 13810 11484 2370 -7442 -13312 -9655 1679 12328
595 12328 13674 3305 -8163 -12084 -7418 315 6765 9153 6553 -1176 -8658 -8120 -743 5389 3988
610 3988 -439 -1389 1353 1954 -52 -2006 -1674 -802 164 2580 6354 5393 -2573 -9251 -6201 3257 7243
627 7243 2543 -2878 -2251 855 -321 -3432 -703 4016 3315 -2991 -4697 2604 8178 2741 -7887
642 -7887 -8956 2132 10517 6669 -2596 -5115 -1823 -704 -2117 2065 10486 10487 -2260 -14619 -10109
657 -10109 7321 16434 7987 -5587 -9565 -4001 1002 2593 5016 7212 2242 -8019 -11150 -987
671 -987 11552 13362 2409 -9210 -11371 -4149 5677 11551 8622 -645 -9414 -9585 -1597 7548 10153
686 10153 5919 -1492 -7556 -7981 -1802 6773 10201 3634 -6283 -8621 -2376 5189 5928 1949 -1739
$$ packed form
581I727K195r570j2378m463P740J2533Q026k326r114r812n870L657J1334J0649
595A2328J346j0369j1468l921M666P733O450K388k600p729p482N38P377O132j401
610C988m427r50K742O01k006j954L32Q72R66K416L774r61p966o678L050R458L986
627G243m700n421O27L106j176l111K729M719p01o306j706P301N574n437j0628
642g887j069J1088Q385l848r265k519L292J119j413M182Q421Jj2747j2359M510
657a0109J7430R113q447j3574l978N564N003J591K423K196m970j0261l131J0163
671i87J2539J810j0953j1619k161P222R826N874k929r267q769j71P988R145K605
686A0153m234p411o064m25O179Q575L428o567r917k338O245P565P39l979l688
$$ plain form
701 -1739 -1820 -1226 -860 1241 4341 4281 -1413 -6069 -3230 4429 7688 3429 -3816 -6633 -3155 1848 4413
718 4413 3884 567 -2125 -4070 -3240 -459 2131 1978 -94 -2501 -2396 -748 215 -900 -1955 -917
734 -917 2185 5455 4701 -199 -5434 -6028 -655 5495 6602 2965 -2345 -5230 -5588 -2704 3494 8421
750 8421 7601 -1372 -9828 -9815 -1002 6628 6153 229 -5235 -6233 -4090 911 5896 5970 139 -6346 -6505
767 -6505 779 6863 6254 471 -5475 -7274 -4072 3373 9588 8286 -616 -9953 -9253 -150 8360 9136
783 9136 3816 -2796 -8301 -9701 -3759 6974 12590 6060 -6910 -12361 -5859 4135 7877 4302 -38
798 -38 -2555 -3862 -3569 -323 3857 4418 80 -4930 -4563 1179 4847 1517 -3629 -4123 398 4046 2639
815 2639 -815 -1651 -1273 -2366 -2968 -247 3727 4297 -821 -5456 -4600 782 4797 3716 93 -2456
$$ packed form
701a739q1N94L66K101L100o0n694m656K839P659L259m259p245k817L478N003K565
718D413n29l317k692j945Q30K781K590j53k072k407J05J648R63j115j055J038
734i17L102L270p54m900n235n94N373O150J107l637n310k885l58K884O198M927
750H421q20q973q456J3Q813P630m75n924n464r98K143N001M985P4n831o485j59
767f505P284O084o09n783n946j799L202P445O215j302q902r337P00R103Q510P76
783I136n320o612n505j400N942J0733N616o530j2970n451O502R994L742l575m340
798c8k517j307K93L246M180N61m338n010L67N742L668l330n146m94M521L648j407
815B639l454q36L78j093o02K721L974N70n118m635Q56N382M015j081l623k549
$$ plain form
831 -2456 -1690 -316 548 375 -966 -1539 -339 1930 3596 2111 -1541 -3590 -2419 309 3681 4746
847 4746 2203 -4114 -9115 -6118 3254 10189 7354 -1111 -7020 -6232 -1717 3249 6910 7453 1701 -6613
863 -6613 -9295 -2292 6953 9321 3159 -3577 -6555 -4796 -446 4140 6096 2302 -4640 -8018 -3935
878 -3935 3751 7293 3549 -2204 -5770 -4896 -241 4450 6427 3167 -3373 -6695 -2592 5146 9222
893 9222 5203 -2627 -6841 -5286 -346 3803 4827 2667 -2007 -6172 -5854 -271 6544 7095 1736 -4800
909 -4800 -5792 -1886 1482 2098 1686 941 -870 -2888 -1984 1880 3616 1746 -1827 -1601 1369 2099 -461
926 -461 -2934 -3093 -1233 1245 2481 3217 558 -3658 -4884 -875 4167 4911 1310 -2867 -4072 -2923
942 -2923 -874 2324 4930 2566 -2725 -5559 -2070 3354 4966 621 -3575 -4057 -963 1949 3585
$$ packed form
831b456P66J374Q64j73j341n73J200K269J666j485l652k049J171K728L372J065
847D746k543o317n001K997R372O935k835q465n909P88M515M966L661N43n752q314
863f613k682P003R245K368o162o736k978J759M350M586J956l794o942l378M083
878c935P686L542l744n753l566Q74M655M691J977l260o540l322M103P738M076
893I222m019p830m214J555M940M149J024k160m674m165L18N583O815N51n359o536
909d800r92L906L368O16m12p45j811k018R04L864J736j870l573K26K970P30k560
926d61k473j59J860K478J236P36k659m216j226M009N042P44l601m177j205J149
942b923K049L198K606k364n291k834L489N424J612m345m196m82L094K912J636
$$ plain form
957 3585 2613 -920 -5636 -5979 325 6729 7778 1800 -6250 -8678 -5171 2118 7925 8254 2269 -6000
973 -6000 -10065 -5580 3321 8132 6315 78 -5987 -7999 -4281 2171 6886 5671 184 -4281 -3406
988 -3406 1203 3878 2308 -1174 -3053 -938 1251 2937 1809 -136 -2631 -3638 -2415 2435 6428
1003 6428 5087 -2031 -8526 -7751 -586 5820 6150 2348 -1688 -3270 -2910 -459 3054 5261 3006 -1349
1019 -1349 -3282 -2290 -100 223 121 538 834 529 175 56 -1421 -3291 -3205 522 4362 3679 -921 -3586
1037 -3586 -2806 3 1478 3440 4521 2294 -3091 -6496 -3607 2975 6420 3020 -1590 -3481 -2543
1052 -2543 -712 1696 2963 1299 -2526 -4770 -2055 2937 5038 1622 -2714 -3820 -1334 1673 3576
1067 3576 4612 1617 -3623 -6987 -3998 2890 7402 4689 -1736 -5680 -4560 -1227 2831 5329 4710
$$ packed form
957C585r72l533m716l43O304O404J049n978q050k428L507P289N807L29n985q269
973f000m065M485Q901M811j817o237o065k012L718O452M715j215n487m465Q75
988c406M609K675j570l482j879K115K189J686j128j945k495j007J223M850L993
1003F428j341p118o495P75P165O406L30l802m036j582L60K451L513K207k255m355
1019a349j933R92K190L23j02M17K96l05l54j19j477j870Q6L727L840o83m600k665
1037c586P80K809J475J962J081k227n385l405K889O582L445l400m610j891R38
1052b543J831K408J267j664l825k244K715M992K101l416m336j106K486L007J903
1067C576J036k995n240l364K989O888M512k713o425l944J120L333M058K498o19
$$ plain form
1082 4710 -1270 -7003 -6869 -344 6680 6287 -163 -5400 -4643 33 2764 2601 1945 642 -2740 -5180
1098 -5180 -2623 3636 6538 1928 -4853 -5645 -385 3572 2649 -308 -1024 -270 -841 -2431 97 3889
1114 3889 3518 -1168 -4442 -1993 3405 4135 284 -2975 -3249 -554 1840 2520 1177 -1442 -3041 -2111
1130 -2111 411 2126 1679 157 -1342 -2155 -1119 987 2702 1986 -1331 -3168 -437 3175 4348 1433
1146 1433 -2587 -3556 -1452 1238 3149 2584 -167 -3680 -4943 -2467 2503 5803 3981 -1090 -5287
1161 -5287 -5133 -671 4747 6719 3235 -2978 -6210 -3935 1738 5662 4880 1320 -2778 -4439 -2290
1176 -2290 1121 3141 1921 -1966 -4121 -3355 265 3410 3068 -439 -2761 -2922 73 3272 3923 1927
1192 1927 -1815 -4384 -3129 1066 5068 5274 1358 -3714 -5446 -2831 1260 3838 2830 256 -2714
$$ packed form
1082D710n980n733J34O525P024l93o450n237P57M676K731j63o56j303l382k440
1098e180K557O259K902m610o781p92N260L957r23k957p16P54n71j590K528L792
1114C889l71m686l274K449N398P30l851l259k74K695K394O80j343k619j599R30
1130b111K522J715m47j522j499q13J036K106J715p16l317j837K731L612J173k915
1146A433m020r69K104K690J911n65k751l513j263K476M970L300j822n071m197
1161e287J54M462N418J972l484o213l232K275N673L924p82l560m098j661K149
1176b290L411K020j220l887k155P66L620L145l42l507k322j61K995L199O51j996
1192A927l742k569J255M195M002K06l916n072j732K615M091K578j008k574k970
$$ plain form
1207 -2714 -4750 -3028 1390 4332 3309 354 -2412 -1617 -190 283 739 141 80 -362 -348 341 1086 -241
1225 -241 -2313 -1484 719 3007 1273 -2174 -3080 -2816 -359 1389 3358 3155 719 -3951 -4357 -399
1241 -399 3843 4235 319 -2687 -2081 -1035 993 1227 1505 132 -1212 -2088 -1047 1644 2276 -348 -3891
1258 -3891 -3428 734 4270 3526 -212 -3466 -4024 -2433 1530 4884 4796 297 -5083 -6348 -2123 4067
1274 4067 6508 3194 -1582 -4897 -4872 -1947 2523 4738 2956 -1623 -4461 -3060 1062 3383 2180
1289 2180 -289 -1612 -1732 -689 785 2708 1750 -1045 -2688 -1348 2508 4189 1987 -2021 -4334
1304 -4334 -2530 503 2773 2852 486 -2649 -4483 -2192 1612 3576 3052 503 -2085 -2538 -1705 1215
1320 1215 3109 2189 -334 -1591 -625 142 470 -107 -511 -179 -74 -30 250 51 -885 -2466 -1770 1107
$$ packed form
1207b714k036J722M418K942j023k955k766P95J427M73M56n98o1m42J4O89P45j327
1225b41k072Q29K203K288j734l447r06K64K457J748J969k03k436m670m06L958
1241c99M242L92l916l006O06J046K028K34K78j373j344q76J041K691O32k624l543
1258c891M63M162L536p44l738l254n58J591L963L354q8m499n380j265M225O190
1274D067K441l314m776l315K5K925M470K215j782m579k838J401M122K321j203
1289B180k469j323j20J043J474J923r58k795j643J340L856J681k202m008k313
1304d334J804L033K270P9k366l135j834K291L804J964n24k549k588m53Q33K920
1320A215J894r20k523j257R66P67L28n77m04L32J05M4K80j99r36j581O96K877
$$ plain form
1338 1107 3546 2899 -790 -3428 -2662 406 3171 3660 1841 -850 -3133 -3468 -986 2460 3825 1625
1354 1625 -1905 -3713 -2268 842 2489 2040 -482 -2231 -2610 -626 1849 2384 498 -1745 -2412 -598
1370 -598 1860 3069 1406 -1154 -2905 -2930 -917 2991 4435 1051 -3911 -5639 -2151 3132 5129 3238
1386 3238 -431 -3120 -3738 -2382 1306 4292 4127 108 -3673 -3847 -749 2579 2611 841 -957 -1784
1402 -1784 -1796 -496 934 1204 83 -1073 -633 1038 2021 943 -1264 -2131 -1406 791 2142 2567 650
1419 650 -2204 -3143 -999 2186 3232 1433 -357 -2062 -2058 -1092 646 2562 2380 -488 -2354 -1468 662
1436 662 1877 757 -1013 -1083 23 814 566 293 -449 -1375 -1121 577 3040 3130 848 -3158 -3984 -1070
1454 -1070 2722 4089 1848 -1323 -3295 -3315 -1156 2205 4006 2436 -1489 -3734 -3069 184 2719 3128
$$ packed form
1338A107K439o47l689k638P66L068K765M89j819k691k283l35K482L446J365k200
1354A625l530j808J445L110J647m49k522j749l79J984K475N35j886k243o67J814
1370e98K458J209j663k560j751k5K013L908J444l384m962j728L488N283J997j891
1386C238l669k689o18J356L688K986j65m019l781j74L098L328L2j770j798q27
1402a784j2J300J430K70j121j156M40J671R83j078k207q67P25K197J351M25j917
1419F50k854r39K144L185J046j799j790j705MR66J738J916j82k868j866Q86K130
1436F62J215j120j770p0J106P91k48k73p42r26K54J698K463R0k282m006q26K914
1454a070L792J367k241l171j972k0K159L361J801j570l925k245O65L253K535M09
$$ plain form
1470 3128 1252 -1231 -2196 -1388 1112 2724 1571 -1245 -2683 -1272 1127 2257 1460 -966 -2217 -2224
1486 -2224 -600 1564 2912 1859 -1291 -3894 -2786 654 3623 4079 813 -2187 -3499 -1381 1488
1501 1488 2724 1933 -327 -2093 -2154 -785 984 1528 1049 -376 -1854 -1196 215 1156 806 -104 -863
1518 -863 -237 497 1111 436 -800 -1012 -1050 128 974 1289 -31 -1478 -1998 -1240 1181 2274 1280 -269
1536 -269 -2220 -2049 -249 2063 2541 816 -1097 -1747 -648 851 1877 1069 -283 -1742 -1470 222
1552 222 1682 1300 -417 -1451 -1518 -325 1121 2121 1580 -767 -2722 -2427 153 3151 2843 -85 -3169
1569 -3169 -3120 -757 1854 3205 1745 -565 -2780 -2934 -794 2277 3530 1586 -1485 -3119 -2075 739
1585 739 2479 2079 110 -1893 -2295 -991 1471 2031 913 -1165 -1741 -828 1048 1814 816 -360 -1820
$$ packed form
1470C128j876k483r65Q08K500J612j153k816j438J411K399J130p97k426j251p
1486b224J624K164J348j053l150k603J108L440K969M56l266l000j312K118K869
1501A488J236p91k260j766o1J369J769N44m79j425j478O58J411R41l50r10p59
1518h63O26P34O14o75j236k12l8J178Q46L15j320j447n20P58K421J093r94j549
1536b69j951J71J800K312M78j725j913o50J099J499J026q08j352j459K72J692
1552B22J460l82j717j034o7J193J446J000n41k347j955K95K580K998l08k928l084
1569c169M9K363K611J351j460k310k215j54K140L071J253j944l071j634J044K814
1585G39J740m00j969k003m02J304K462N60j118k078n76R13J876P66r98j176j460
$$ plain form
1602 -1820 -1580 250 1880 2234 264 -2022 -2798 -1247 1231 2377 1627 -779 -2413 -2232 -260 1761
1618 1761 2194 957 -758 -1435 -713 -86 991 1180 437 -457 -868 -273 1088 1122 -325 -1735 -833 607
1636 607 1583 702 -883 -1286 -1283 -30 1377 2102 1464 -617 -2166 -1813 453 2168 2233 781 -1107 -1942
1654 -1942 -1445 297 2356 2086 126 -1842 -2080 -143 1100 1066 132 -431 -594 -153 407 1155 1554 197
1672 197 -1781 -1726 321 2220 1963 -154 -2206 -2323 -1074 1043 2551 2110 115 -2278 -3361 -1100
1688 -1100 1623 2885 1415 -993 -2312 -1708 6 1506 1936 794 -846 -2010 -1430 496 1771 921
1704 921 -701 -1061 -598 411 661 558 -229 -657 -770 70 1526 2230 243 -1349 -1463 -336 942 1697
1722 1697 1095 -20 -1664 -2147 -671 1682 2235 992 -1257 -1889 -725 373 1109 844 336 -634 -1155
$$ packed form
1602a820K40J830J630L54j970k286p76J551K478J146p50k406j634J81J972K021
1618A761M33j237j715o77P22O27J077J89p43q94m11N95J361L4j447j410R02J440
1636F07R76q81j585m03LJ253J407P25o38k081j549L53K266J715O5j452j888q35
1654a942M97J742K059k70j960j968k38J937J243l4r34n63j63M41N60P48L99j357
1672A97j978N5K047J899k57k117k052j17J249K117J508m41j995k393j083K261
1688a100K723J262j470k408j319O04J714J500M30j142j640j164N80J926J275q50
1704I21j622l60M63J009K50j03p87m28j13Q40J456P04j987j592j14J127J278P55
1722A697o02j115j644m83J476K353N53j243k249o32J164J098P36k65n08r70n21
$$ plain form
1739 -1155 -823 964 1102 -45 -1055 -931 100 993 1121 67 -1239 -1899 -1232 571 1971 1479 -10
1756 -10 -2115 -1994 -425 1646 2251 1148 -806 -1782 -1945 -454 1877 2276 884 -1580 -2099 -1060 1061
1773 1061 1762 851 -341 -966 -587 263 857 1118 705 -1153 -1330 -479 1278 1277 384 -1267 -1825 -1017 436
1792 436 1743 1360 188 -1766 -2157 -644 1629 2042 1317 -681 -1592 -1233 -505 813 1564 1295 -362
1809 -362 -1704 -1615 255 1277 1201 33 -753 -498 280 524 202 -33 -318 -637 -239 1018 1369 56 -1546
1828 -1546 -1661 -149 1291 1410 990 -9 -1147 -1441 -462 1290 1943 787 -972 -1771 -1173 583 1466
1845 1466 863 -263 -336 -915 -544 244 838 720 -547 -1336 -922 640 1288 810 -382 -1156 -439 632
1863 632 1558 1409 77 -1321 -1892 -903 1088 2096 1328 -417 -1851 -1662 -438 1236 2185 694 -951
$$ packed form
1739a155L32J787J38j147j010J24J031Q93J28j054j306o60O67J803J400m92j489
1756a0k105J21J569K071O05j103j954r76j63J491K331L99j392k464n19J039K121
1773A061P01r11j192o25L79Q50N94K61m13j858j77Q51J757jq93j651n58Q08J453
1792D36J307l83j172j954l91J513K273M13p25j998r11L59P28J318P51k69j657
1809c62j342Q9J870J022p6j168p86K55P78K44l22k35k85l19L98J257L51j313j602
1828a546j15J512J440J19m20r99j138k94R79J752O53j156j759p99N98J756Q83
1845A466o03j126p3n79L71P88N94j18j267p89M14J562O48m78j192p74P17J071
1863F32R26j49j332j398n71R89J991J008p68j745j434J89J224J674R49j491j645
$$ plain form
1880 -951 -2130 -1116 366 1271 1559 374 -1076 -1375 -447 322 1086 894 -21 -1259 -580 608 1026 560
1898 560 -814 -1431 -571 556 813 1056 -44 -921 -1549 -744 731 1846 1315 -479 -1661 -1314 92
1915 92 1011 1273 686 -422 -1372 -1137 -294 1237 1316 230 -871 -821 -135 343 507 -151 -257 -400 -133 762
1935 762 1005 256 -754 -1211 -486 1086 1456 380 -545 -1388 -897 162 946 1358 391 -742 -1553 -1208
1953 -1208 236 1553 1416 37 -1049 -1324 -616 501 994 579 -162 -911 -885 -7 702 1116 -92 -653
1971 -653 -1040 -250 728 681 427 -545 -1209 -813 423 1503 755 -313 -1557 -1449 -303 1091 1518 772
1989 772 -720 -1484 -1485 -263 1363 1781 400 -1226 -1501 -949 359 1016 791 163 -758 -889 -159 467 866
2008 866 -68 -749 -797 -68 771 1071 272 -589 -649 -492 242 1217 1233 -201 -1547 -1491 -255 1245 913 415
$$ packed form
1880i51j179J014J482R05K88j185j450k99R28P69P64j92r15j238O79J188M18m66
1898E60j374o17Q60J127K57K43j100q77o28Q05J475J115n31j794j182L47J406
1915I2R19K62n87j108r50K35Q43J531P9j086j101N0O86M78J64o58j06j43K67Q95
1935G62K43p49j010m57P25J572L70j076r25q43M91J059P84M12r67j133q11L45
1953a208J444J317j37j379j086k75P08J117M93m15p41p49K6Q78P09M14j208n61
1971f53l87P90R78m7k54r72o64L96J236J080p48j068j244J08J146J394M27p46
1989G72j492p64jJ222J626M18j381j626k75N52J308O57k25o28r21j31P30O26L99
2008H66r34o81m8P29Q39L00p99q61o0J57P34R75J6j434j346N6J236J500l32m98
$$ plain form
2028 415 -666 -1511 -964 246 976 1265 466 -828 -830 -341 546 952 549 -362 -444 -410 243 588 697 -40
2048 -40 -919 -461 394 856 672 -188 -805 -1017 329 1138 1447 620 -676 -1432 -961 267 1617 1689 515
2067 515 -901 -1522 -937 450 1358 972 157 -862 -1207 -754 809 970 480 -968 -811 -199 381 594
2085 594 502 -186 -671 -476 265 847 1108 -131 -1062 -1155 -152 1004 1213 480 -322 -1185 -867 -134 836 1641
2105 1641 989 -714 -1284 -785 187 939 1210 318 -627 -989 -447 672 522 255 -442 -522 -625 40 551
2124 551 39 -277 -690 -72 210 770 662 -63 -914 -926 -242 843 1093 334 -454 -1299 -463 83 1075 1241
2144 1241 221 -842 -1175 -946 438 1006 592 -367 -1038 -913 -161 666 563 292 -709 -387 -66 211
2162 211 790 265 -477 -773 -514 161 965 841 -387 -1067 -1126 -93 637 1360 440 -944 -1557 -882 106
$$ packed form
2028D15j081q45N47J210P30K89p99j294kM89Q87M06m03r11q2L4O53L45J09p37
2048d0q79M58Q55M62j84q60o17k12J346Q09L09q27j296p56M71J228J350P2j174
2067E15j416o21N85J387R08l86q15j019l45M53J563J61m90j448J57O12N80K13
2085E94r2o88m85J95P41N82K61j239r31r3J003J156K09p33q02q63L18P33R70Q05
2105A641o52j703n70M99R72P52K71q92r45l62N42J119j50k67o97q0j03O65N11
2124E51n12l16m13O18K82N60j08p25q51j2O84J085K50p59p88q45Q36N46R92J66
2144A241j020j063l33K29J384N68m14r59o71J25P52Q27j03k71j001L22L21K77
2162B11N79n25p42k96K59O75Q04j24j228o80n9J033P30P23r20j384o13O75R88
$$ plain form
2181 106 1050 1048 -1 -623 -1064 -578 451 1206 1111 -64 -779 -873 180 871 262 -130 -576 -192 -224 143
2201 143 639 318 -535 -593 -305 798 1077 353 -431 -1530 -730 -1 636 1191 420 -707 -1156 -632 166
2220 166 666 971 -26 -734 -853 -204 258 912 555 -266 -695 -336 128 514 -4 -350 -454 -257 355 644
2240 644 414 -64 -312 -551 74 339 1121 308 -337 -1239 -908 360 1158 854 149 -525 -994 -824 314
2259 314 1113 1048 -153 -758 -839 -213 514 541 593 108 -406 -528 280 377 714 -289 -609 -396 366 626 503
2280 503 -164 -726 -680 -330 693 1499 872 -390 -989 -970 201 1117 1041 -228 -628 -841 -696 -30 732 1008
2300 1008 336 -740 -834 -264 440 883 159 -108 -532 -248 31 554 36 -110 -301 -417 408 856 471 -226
2320 -226 -744 -833 137 666 1007 544 -708 -948 -991 37 970 932 179 -688 -1030 -414 412 773 718 166 -521
$$ packed form
2181A06R44kj049o22m41M86J029P55r5j175p15r4J053O91o09l92m46L84l2L67
2201A43M96l21q53n8K88J103K79p24p84j099Q00P29O37N55p71j127m49N24P98
2220A66N00L05r97p08j19O49M62O54l57q21m29L59M64L86n18l46j04J97O12K89
2240F44k30m78k48k39O25K65P82q13o45r02L31J268P98l04p05o74m69J70J138
2259C14P99o5j201o05q1O26P27K7N2m85n14j22Q08R7L37j003l20K13P62K60j23
2280E03o67n62M6L50J023Q06o27j262n99J9J171R16p6j269m00k13J45O66P62K76
2300A008o72j076r4N70P04M43p24k67m24K84K79N23n18j46j91j16Q25M48l85o97
2320b26n18q9R70N29L41m63j252k40m3J028R33l8p53q67l42O16Q26L61n5n52o87
$$ plain form
2341 -521 -766 0 536 207 -105 -464 -501 -55 641 244 -275 -600 -745 -202 412 850 336 -337 -1237 -858
2361 -858 -78 1095 1206 459 -402 -1060 -908 425 949 724 236 -767 -906 -285 501 417 20 -14 -532 -472
2381 -472 -27 523 377 -58 -519 -508 167 566 283 -190 -923 -691 -447 592 1045 188 -462 -810 -873 -15
2401 -15 504 919 144 -451 -893 -822 156 905 1133 166 -528 -680 -212 309 835 534 -71 -405 -146 208 171
2422 171 241 -197 -438 -104 50 467 153 -63 -1104 -930 -14 508 528 349 -216 -1178 -396 -17 837 674
2442 674 476 -445 -982 -544 52 826 832 48 -297 -795 -369 706 311 199 -349 -451 -131 536 631 107 -330
2463 -330 -530 -194 404 827 591 38 -814 -745 -42 796 783 472 -494 -970 -1024 245 857 881 -122 -711 -887
2484 -887 -324 312 856 554 -148 -300 -328 186 272 611 108 -306 -648 -286 395 721 148 -385 -352 -208 406
$$ packed form
2341e21k45P66N36l29l12l59l7M46O96l97n19l25j45N43O14M38n14o73r00L79
2361h58P80J173J11p47q61o58J52J333N24k25m88j003j39O21P86q4l97l4n18O0
2381d72M45N50j46m35m61J1O75L99k83m73p33K32K44J039M53q57o50l48o3Q58
2401a5N19M15p75n95m42P1R78P49K28r67o94j52M68N21N26l01o05l34K59L54l7
2422A71P0m38k41L34J54M17l14k16j041J74R16N22K0j79n65r62P82L79Q54j63
2442F74j98r21n37M38N96P74Op84l45m98M26J075l95j12n48j02L20O67R5n24m37
2463c30k00L36N98M23k36n53q52O9P03Q38j3l11r66m76n4J269O12K4j003n89j76
2484h87N63O36N44l02p02j52k8N14Q6L39n03m14l42L62O81L26n73n33L3J44O14
$$ plain form
2505 406 578 510 -498 -907 -933 35 562 691 312 -699 -835 -523 -44 913 821 257 -595 -464 -229 478
2525 478 830 205 -548 -740 -458 365 353 353 -18 -35 -403 43 335 484 212 -578 -337 -160 447 489 177 -369
2547 -369 -631 -740 419 798 426 107 -752 -658 -256 82 645 643 16 -554 -441 -206 275 608 590 -8 -514
2568 -514 -334 251 413 275 -445 -232 -184 -160 104 109 39 -329 -611 45 107 511 331 -530 -711 -450 218 792
2590 792 300 222 -532 -755 -509 273 617 759 311 -340 -694 -300 209 151 330 -182 -465 -369 -91 230 115
2611 115 -7 -259 -163 -69 386 290 -128 -372 -316 313 320 603 272 -672 -722 -52 174 687 709 53 -488 -847 -745
2634 -745 535 845 691 -58 -826 -220 -242 548 547 541 -117 -510 -340 49 352 21 33 -582 -96 -144 249 167
2656 167 -422 -658 -362 61 570 561 374 -467 -549 -488 522 768 549 -174 -328 -614 -297 192 737 361 -62
$$ packed form
2505D06J72o8j008m09k6R68N27J29l79j011j36L12M79R57r2n64q52J31K35P07
2525D78L52o25p53j92K82Q23j2%l71j7l68M46K92J49k72p90K41J77O07M2l12n46
2547c69k62j09J159L79l72l19q59R4M02L38N63ko27n70J13K35M81L33j8n98n06
2568e14J80N85J62j38p20K13M8K4K64Np0l68k82O56O2M04j80q61j81K61O68N74
2590G92m92p8p54k23K46P82L44J42m48o51l54L94N09n8J79n12k83R6K78L21j15
2611A15j22k52R6R4M55r6m18k44N6O29PK83l31r44n0O70K26N13K2o56n41l59J02
2634g45J280L10j54p49p68O06k2P90joo58l93J70L89L03l31J2o15M86m8L93q2
2656A67n89k36K96M23N09rj87q41q2O1J010K46k19p23j54k86L17M89N45l76m23
$$ plain form
2677 -62 -536 -419 -146 566 473 -15 -65 -404 -262 -73 182 71 -147 -172 -93 209 273 37 -377 -402 0 40 722
2700 722 303 2 -406 -715 -292 114 972 548 -205 -430 -497 -103 329 299 398 -186 -309 -500 -156 197 425
2721 425 93 -421 -220 -152 120 -12 157 -494 -105 257 402 443 358 -33 -432 -358 -98 615 491 181 -477
2742 -477 -469 -275 250 583 495 56 -445 -504 -441 437 276 284 25 -200 -323 -27 465 155 -279 -132 -333 253
2764 253 479 211 -152 -396 -282 -82 151 304 -15 -383 -426 -338 27 568 560 343 -512 -559 -118 115 393 282
2786 282 43 -558 -473 -295 2 610 170 -185 -165 -166 -52 266 250 -97 -387 -444 -256 356 502 -76 -254 -308
2808 -308 73 169 519 313 -164 -619 -179 -237 439 394 88 -465 -747 -303 250 652 383 -284 -206 -335 -114
2829 -114 195 617 194 -309 -156 -37 -57 97 31 151 -114 56 371 204 248 -95 -131 -487 109 135 178 116
$$ packed form
2677f2m74J17K73P12r3m88n0l39J42J89K55j11k18k5P9L02O4k36m14k5M02M0O82
2700G22m19l01m08l09M23M06Q58m24p53k25o7L94M32l0R9n84j23j91L44L53K28
2721D25l32n14K01O8K72j32J69o51L89L62J45M1q5l91l99P4K60P13j24l10o58
2742d77QJ94N25L33q8m39n01n9O3Q78j61Qk59k25j23K96M92l10m34J47k01N86
2764B53K26k68l63k44J14K00K33J53l19l68m3Q8L65N41qk17q55m7M41K33K78j11
2786B82k39o01Q5J78K97O08m40l55K0jJ14L18j6l47k90n7J88O12J46n78j78n4
2808c08L81R6L50k06m77m55M40n8O76m5l06n53k82M44N53M02k69o67P8j29K21
2829a14L09M22m23n03J53J19k0J54o6J20k65J70L15j67M4l43l6l56N96K6M3o2
$$ plain form
2851 116 -494 -275 -301 382 370 454 288 64 -625 -266 235 329 173 -36 -205 -353 -203 480 314 37 -165
2872 -165 -143 -567 342 -63 -5 57 -309 -21 -38 495 81 47 -467 -168 -181 226 671 166 -521 -560 -356 181
2894 181 272 315 -127 -479 -482 -212 -40 281 242 -227 -336 -262 -97 307 -82 -84 -316 -489 -119 119 359 95 -74
2917 -74 -559 14 383 339 306 -281 -496 -454 128 363 360 216 -257 -502 -214 17 557 268 -21 -521 -463 -240
2939 -240 282 554 369 -25 -178 -150 117 370 330 32 59 -78 -60 243 163 -65 10 -58 -54 -106 404 -6 -270
2962 -270 -329 -264 -118 21 610 416 -363 -506 -329 168 429 214 -240 -367 -550 -92 511 389 37 -226 -90
2983 -90 -221 -201 107 438 20 -199 -165 123 289 19 -148 -340 -231 3 263 -16 85 -302 -242 -136 143
3004 143 414 413 174 -84 -378 25 19 371 313 85 -376 -380 33 208 102 315 -12 -380 -412 -9 161 43 -249
$$ packed form
2851A16o10K19k6O83j2Q4j66k24o89L59N01R4j56k09j69j48J50O83j66k77k02
2872a65K2m24R09m05N8O2l66K88j7N33m14l4n14K99j3M07M45n05o87l9K04N37
2894A81R1M3m42l52lK70J72L21l9m69j09P4J65M04l89kk32j73L70K38K40k64j69
2917g4m85N73L69m4l3n87k15M2N82K35lj44m73k45K88K31N40k89k89n00N8K23
2939b40N22K72j85l94j53K8K67K53m0k98K7j37J8L03q0k28P5o8Mn2N10m10k64
2962b70n9O5J46J39N89j94p79j43J77M97K61k15m54j27j83M58O03j22l52k63J36
2983i0j31K0L08L31m18k19L4K88J66k70j67j92J09K34K60k79J01l87O0J06K79
3004A43K71jk39k58k94M03oL52n8k28m61mM13J75j06K13l27l68l2M03J70j18k92
$$ plain form
3027 -249 -267 -270 148 -54 36 128 -62 -166 64 278 237 74 -188 -282 -387 -82 344 363 -110 -432 -427 -53 78
3050 78 262 537 -17 -324 -292 -104 23 535 445 -186 -357 -156 25 171 3 149 -161 -327 -5 -66 380
3071 380 -251 -107 -129 91 78 -36 -17 -194 -207 -216 51 456 240 -154 -326 -399 -400 4 513 252 54 -272 -340
3094 -340 275 464 456 165 25 -117 -248 419 64 20 -119 -59 -276 242 279 204 -92 -188 -6 106 402 93
3116 93 400 -417 -199 -16 -99 414 64 -135 -224 -457 28 409 608 256 -225 -330 -163 74 2 368 -83
3137 -83 -47 -168 -133 98 18 336 -51 -245 -53 118 310 -80 -216 -258 -136 145 81 107 263 -236 -184 -375 47
3160 47 596 148 -79 -166 -514 -89 280 198 269 59 62 -239 99 99 126 -107 -135 -236 105 112 -12 160 -114 -132
3184 -132 -147 86 195 -211 -184 -266 -238 29 211 482 -157 -375 -66 0 -42 347 166 -36 31 -239 93 155 70
$$ packed form
3027b49j8lM18k02R0R2j90j04K30K14m1j63k62r4j05L05M26J9m73l22NL74J31
3050G8J84K75n54l07L2J88J27N12r0o31j71K01J81J46j68J46l10j66L22o1M46
3071C80o31J44k2K20j3j14J9j77j3rK67M05k16l94j72p3jM04N09k61j98l26o8
3094c40O15J89qk91j40j42j31O67l55m4j39O0k17N18L7p5k96r6J82J12K96l09
3116I3L07q17K18J83q3N13l50j99q9k33M85L81J99l52m81j05J67K37p2L66m51
3137h3L6j21L5K31q0L18l87j94J92J71J92l90j36m2J22K81o4K6J56m99N2j91M22
3160D7N49m48k27q7l48M25L69q2P1k10Ll01L38%K7k33k8j01L41Pj24J72k74j8
3184a32j5K33J09m06K7q2K8K67J82K71o39k18L09O6m2L89j81k02O7k70L32O2q5
$$ plain form
3207 70 187 -150 -425 -204 -148 181 5 -128 -129 99 -48 -75 -8 192 3 98 -54 -57 151 7 -431 -327 -60
3230 -60 192 65 155 120 -52 -204 -426 160 170 135 231 -89 34 -204 9 619 108 87 -211 -303 32 6 73
3253 73 -287 -40 -30 -108 -16 92 238 -91 -213 141 304 238 -136 -84 -439 -282 67 286 295 -226 -202 -305 -341
3276 -341 290 72 338 -215 -261 -247 177 161 180 244 -202 -267 -68 -45 285 95 -17 -101 92 127 120 36 -315 4
3300 4 -14 6 237 411 102 -87 -15 -121 123 389 236 272 -370 -252 -37 119 262 142 -155 -327 -118 -264
3322 -264 39 144 272 43 -163 -96 189 117 55 -53 -263 -29 151 85 48 -123 -158 -185 -193 -28 31 195 -70
3345 -70 -145 -430 -21 118 259 -31 -151 -169 14 -109 35 291 -114 -297 -245 59 200 344 279 65 -163 -240
3367 -240 272 12 -14 -5 -84 -350 109 244 166 -126 -275 -2 -16 105 -18 75 -97 42 -128 -270 179 -146
$$ packed form
3207G0J17l37k75K21N6L29j76j33jK28j47k7O7K00j89R5j52lK08j44m38J04K67
3230f0K52j27R0l5j72j52k22N86J0l5R6l20J23k38K13O10n11k1k98r2L35k6O7
3253G3l60K47J0p8R2J08J46l29j22L54J63o6l74N2l55J57L49K19Rn21K4j03l6
3276c41O31k18K66n53m6J4M24j6J9O4m46o5J99K3L30j90j12q4J93L5pq4l51L19
3300Dj8K0K31J74l09j89P2j06K44K66j53L6o42J18K15J56J43j20k97j72K09j46
3322b64L03J05J28k29k06O7K85p2o2j08k10K34J80o6l7j71l5k7qJ65N9J64k65
3345g0p5k85M09J39J41k90j20j8J83j23J44K56m05j83N2L04J41J44o5k14k28p7
3367b40N12k60k6Rp9k66M59J35p8k92j49K73j4J21j23R3j72J39j70j42M49l25
$$ plain form
3389 -146 202 -75 -192 -146 184 43 -110 143 -385 -162 -221 17 276 95 -155 6 -43 -9 315 130 -120
3410 -120 -417 -81 -17 208 -83 52 81 -317 -79 178 169 266 11 -314 -421 102 37 343 163 -181 -137 150
3432 150 206 329 -94 -217 -125 -388 -507 212 174 -103 87 -184 3 192 -15 142 -300 -8 -246 176 56
3453 56 134 -17 -110 -212 -103 350 -33 -6 -297 -63 -143 203 79 49 98 -243 -151 153 271 411 373 -323 65
3476 65 -208 145 280 155 94 -164 -38 -242 68 282 188 -135 -384 -79 95 393 -1 138 4 -143 169
3497 169 76 344 1 -83 -193 -254 22 278 15 181 -130 -121 -21 284 280 -31 -137 -268 -483 -167 24 71 94
3520 94 39 -418 -267 231 -142 250 -68 -172 -143 -85 69 59 261 -211 -26 -84 210 213 25 -161 -137 100 131
3543 131 441 426 -132 -295 -181 81 254 64 392 163 -210 -426 191 398 0 -129 -78 -121 60 49 50 52 95
$$ packed form
3389a46L48k77j17M6L30j41j53K53n28K23n9K38K59j81k50J61m9L4L24j85k50
3410a20k97L36O4K25k91J35K9l98K38K57rR7k55l25j07N23o5L06j80l44M4K87
3432A50N6J23m23j23R2k63j19P19l8k77J90k71J87J89k07J57m42K92k38M22j20
3453E6P8j51r3j02J09M53l83K7k91K34q0L46j24l0M9l41R2L04J18J40l8o96L88
3476F5k73L53J35j25o1k58J26k04L10K14r4l23k49L05J74K98l94J39j34j47L12
3497A69r3K68l43q4j10o1K76K56k63J66l11RJ00L05ml11j06j31k15L16J91M7K3
3520I4n5m57J51M98l73L92l18j04K9N8J54j0K02m72J85n8K94Lj88j86K4K37L1
3543A31L10j5n58j63J14K62J73j90L28k29l73k16O17K07l98j29N1m3J81j1JKM3
$$ plain form
3566 95 -121 -251 -58 124 8 -120 -231 -53 87 159 162 159 -137 -385 -57 248 21 -106 137 -258 -231 11
3588 11 165 125 217 -36 -241 100 -74 403 328 66 -127 -275 -55 102 194 12 -197 14 16 90 -5 89 -6 12
3612 12 -18 147 74 208 286 -384 -282 -74 164 454 212 -158 -282 48 -24 -1 252 118 47 -162 -214 -119 17
3635 17 124 144 -80 -59 -48 43 125 -80 67 -144 61 -12 -56 27 -351 -174 -55 139 -48 345 -38 -337 -231
3658 -231 194 112 241 247 -24 -246 -348 -267 288 363 145 -77 -60 -215 -41 361 279 10 -25 -169 -143 121 164
3681 164 -58 -53 209 307 174 312 172 80 -231 89 308 30 143 -102 -306 -362 -100 -29 284 169 -114 -258
3703 -258 -59 -215 179 306 300 -208 -141 -105 153 246 384 -9 10 -87 -17 185 85 124 137 -104 -74 171 -94 219
3727 219 -263 -290 -34 110 354 33 -141 -227 -287 -65 280 90 45 -277 -343 -166 -211 335 125 92 -118 -333
$$ packed form
3566I5k16j30J93J82j16j28j11J78J40P2Llk96k48L28L05k27j27K43l95K7K42
3588A1J54m0R2k53k05L41j74M77p5k62j93j48K20J57R2j82k09K11KP4r5R4r5J8
3612A2l0J65p3J34P8o70J02K08K38K90k42l70j24L30p2K3K53j34p1k09n2R5J36
3635A7J07K0k24K1J1R1Q2k05J47k11K05p3m4Q3l78J77J19J94j87L93l83k99J06
3658b31M25q2J29Ok71k22j02Q1N55P5k18k22J7j55J74M02q2k69l5j44K6K64M3
3681A64k22NK62R8j33J38j40r2l11L20K19k78J13k45k04n6K62P1L13j15k83j44
3703b58J99j56L94J27on08O7L6K58R3J38l93J9r7P0K02j00L9J3k41L0K45k65L13
3727B19m82k7K56J44K44l21j74q6o0K22L45j90m5l22o6J77m5N46k10l3k10k15
$$ plain form
3749 -333 102 189 158 78 37 80 -131 12 343 231 -97 -268 -110 -38 196 223 -86 -205 91 -237 -222 207 111
3772 111 -156 -215 -38 -215 199 214 281 -194 -290 -70 -126 232 324 119 -198 19 -77 86 -14 64 -1 -164 -5
3795 -5 123 80 58 -169 -155 -327 -58 225 89 -219 -220 -277 -182 357 386 298 -174 -266 -490 53 51 234 54 -225 -260
3820 -260 -104 149 273 -211 346 -29 -241 -2 183 411 -107 -75 -125 156 132 319 -59 -190 -165 116 160 130
3842 130 368 -220 -290 -526 7 339 335 406 -156 -150 -127 -60 255 63 32 34 -94 -402 281 634 459 -74 -254 -197
3866 -197 -239 51 218 39 -451 -163 181 50 173 -61 319 -202 -167 21 162 223 33 -48 -207 -20 236
3887 236 453 -71 -165 -358 -204 95 396 615 128 -165 -241 -226 -16 -47 193 91 -72 -112 59 214 51 56
3909 56 -159 -172 69 -352 23 -104 14 -195 -151 -180 205 171 199 -270 -160 179 146 443 167 -85 -484 -269
$$ packed form
3749c33M35Q7l1q0m1M3k11J43L31j12l28j71J58P2K34K7l09j19K96l28J5M29r6
3772A11k67n9J77j77M14J5O7m75r6K20n6L58R2k05l17K17r6J63j00P8o5j63J59
3795eJ28m3k2k27J4j72K69K83j36l08jn7R5N39K9q8m72r2k24N43kJ83j80k79l5
3820b60J56K53J24m84N57l75k12K39J85K28n18L2n0K81k4J87l78j31K5K81M4l0
3842A30K38n88p0k36N33L32mP1n62OK3O7L15j92l1Kj28l08O83L53j75n33j80N7
3866a97m2K90J67j79m90K88L44j31J23k34L80n21L5J88J41O1j90q1j59J87K56
3887B36K17n24r4j93J54K99L01K19m87k93p6J5K10l1K40j02j63m0J71J55j63N
3909E6k15j3K41m21L75j27J18k09M4k9L85l4K8m69J10L39l3K97k76k52l99K15
$$ plain form
3931 -269 257 92 327 124 -369 -157 -90 135 123 129 263 -28 -12 -52 100 38 142 -306 26 71 36 252 -77
3954 -77 -161 -259 21 336 514 -96 129 -255 -350 -266 265 225 203 -154 -720 -283 -123 20 341 -141 -354 -229
3976 -229 -117 203 117 345 -100 -346 81 -104 191 317 -283 -197 -126 164 186 280 -173 135 -126 103 126 403
3998 403 405 -191 -278 -299 -46 549 379 82 -64 -413 -158 114 240 578 -18 -387 -354 -139 32 100 -25 -216
4020 -216 -209 45 273 203 141 -60 32 -336 -58 180 358 190 -432 -402 226 395 480 97 10 -268 -298 -153 163
4043 163 164 -59 -15 -135 -82 43 194 562 -147 -513 -333 -102 321 391 109 -175 -219 88 13 28 -8 -102 -481
4066 -481 89 136 273 -157 -329 -464 -348 107 249 277 294 -112 -395 -16 -142 336 381 327 -150 -280 -115 -57
4088 -57 347 120 110 -115 -113 162 314 161 3 -47 -189 63 290 422 -147 -305 -449 -180 108 669 260 -112
$$ packed form
3931b69N26j65K35k03m93K12O7K25j2OJ34k91J6m0J52o2J04m48L32M5l5K16l29
3954g7q4r8K80L15J78o10K25l84r5Q4N31m0k2l57n66M37J60J43L21m82k13J25
3976b29J12L20q6K28m45k46M27j85K95J26o00Q6P1K90K2R4m53L08k61K29K3K77
3998D03Kn96q7k1K53N95j70k97j46l49K55K72J26L38n96l69L3K15J71O8j25j91
4020b16PK54K28p0o2k01R2l68K78K38J78j68o22L0O28J69Q5l83q7k78l0J45L16
4043A63Jk23M4j20N3J25J51L68p09l66J80K31M23P0k82k84m4L07p5J5l6r4l79
4066d81N70M7J37m30j72j35J16M55J42K8J7m06k83L79j26M78M5n4m77j30J65N8
4088e7M04k27j0k25KK75J52j53j58n0j42K52K27J32n69j58j44K69K88N61m09l72
$$ plain form
4110 -112 -84 -212 -97 287 288 177 -276 -202 -198 -128 310 363 239 -419 -326 -46 2 333 22 -379 -103 -478 -88
4133 -88 245 518 -5 -274 -484 117 364 308 -57 -253 -108 192 252 347 287 -22 -559 -341 0 507 359 131
4155 131 -451 -291 -320 -105 367 177 51 -375 -323 -147 440 -4 -6 5 -259 -141 37 -128 350 -299 -220 -118
4177 -118 58 317 334 109 -179 -487 -79 317 140 128 -54 -431 -115 188 129 546 59 -363 -271 -366 -55 76
4199 76 3 -10 -392 -163 224 46 -58 145 -217 -117 -265 205 261 216 -41 -457 -351 -26 336 -4 3 -321
4221 -321 -96 -83 269 406 141 -455 -289 -8 -183 323 431 25 -174 40 -345 12 134 -33 -198 -114 -275
4242 -275 28 133 9 53 -200 -323 12 -136 81 121 -64 -495 -109 78 224 166 -174 -376 -452 -170 270
4263 270 427 289 -61 -296 -177 174 326 565 -58 -287 -232 -91 453 381 218 -238 -156 -109 237 63 25 -271
$$ packed form
4110a12K8j28J15L84Jj11m53P4MP0M38N3j24o58R3K80M8L31l11m01K76l75L90
4133h8L33K73n23k69k10O01K47n6l65j96J45L00O0R5o0l09n37K18L41N07j48k28
4155A31n82J60k9K15M72j90j26m26N2J76N87m44kJ1k64J18J78j65M78o49P9J02
4177a18J76K59J7k25k88l08M08L96j77j2j82l77L16L03n9M17m87m22R2r5L11J31
4199G6p3j3l82K29L87j78j04K03l62J00j48M70N6m5k57m16J06L25L62l40Pl24
4221c21K25J3L52J37k65n96J66K81j75N06J08m06j99K14l85L57J22j67j65Q4j61
4242b75L03J05j24M4k53j23L35j48K17M0j85m31L86J87J46n8l40k02p6K82M40
4263B70J57j38l50k35J19L51J52K39o23k29N5J41N44p2j63m56Q2M7L46j74l8k96
$$ plain form
4285 -271 -74 50 -146 345 114 22 -36 -253 -329 343 246 68 103 -507 -112 111 375 310 80 -614 -255 -575
4307 -575 367 514 298 -2 -400 9 32 185 427 -11 -139 89 -235 21 -66 263 3 -349 -243 122 148
4328 148 327 72 -451 -394 -65 252 120 218 -188 -797 -127 43 230 404 84 -245 -405 -151 250 196 263
4349 263 -51 -350 -278 -142 324 244 100 -188 -93 -135 31 476 280 -235 1 -109 32 95 109 -151 -416 -312
4371 -312 23 107 221 144 -210 -212 -312 86 231 546 -89 -38 -346 -253 -62 442 176 -96 -259 -263 -34 29 247
4394 247 201 -220 -107 128 309 44 159 -24 -316 -315 -45 550 425 -296 -411 -270 30 100 332 -1 -214
4415 -214 -411 -428 190 167 406 164 190 -110 -416 168 579 117 125 -236 -115 -190 71 -102 40 5 -397 159
4437 159 213 -4 -132 -559 -421 -185 341 246 157 -396 -274 -221 374 297 605 -163 -238 -523 -349 32 397 486
$$ packed form
4285b71J97J24j96M91k31r2n8k17p6O72r7j78L5o10L95K23K64o5k30o94L59l20
4307e75R42J47k16l00l98M09K3J53K42m38j28K28l24K56q7L29k60l52J06L65K6
4328A48J79k55n23N7L29L17j32R8m06o09O70J70J87J74l20l29j60K54M01n4O7
4349B63l14k99P2J36M66q0j44k88R5m2J66M45j96n15K36j10J41O3J4k60k65J04
4371c12L35Q4J14p7l54kj00L98J45L15o35N1l08R3J91N04k66k72j63mK29O3K18
4394B47m6m21J13K35J81k65J15j83k92JK70N95j25p21j15J41L00P0K32l33k13
4415b14j97j7O18k3K39k42K6l00l06N84M11m62Ql61J21p5K61j73J42l5m02N56
4437A59N4k17j28m27J38K36N26r5q9n53J22N3N95p7L08p68p5k85J74L81L65Q9
$$ plain form
4459 486 -137 -253 -286 26 422 300 -182 -61 -456 -425 28 584 -8 -90 -39 -300 -48 266 139 -115 -213 -352
4481 -352 -354 177 427 107 -352 -554 54 -64 332 418 36 -223 -382 -330 109 61 184 -65 -117 -154 -51 91
4503 91 290 -177 107 -181 29 77 241 -80 -201 -210 -78 -146 243 125 -397 -407 104 22 58 632 -124 -47 -295
4526 -295 -327 246 334 318 -57 -325 -144 -161 98 374 29 -123 -84 -235 158 239 74 19 -309 -166 -109 202 93
4549 93 -61 -160 -154 -120 170 230 53 96 -253 -34 -86 497 392 112 -197 -219 -185 94 492 395 -48 -316 -321 -144
4573 -144 -10 431 48 72 -302 -382 100 125 172 -57 -280 -63 57 200 300 208 4 -229 -50 83 212 189
4595 189 4 -237 -279 -203 559 460 -44 -141 -381 -394 -35 391 569 -201 -477 -17 -67 320 195 167 -100 -182 -105
4618 -105 282 222 304 -186 -108 -8 167 55 158 -281 -223 -147 61 432 344 323 12 -397 -114 -190 264 362 16
$$ packed form
4459D86o23j16l3L12L96j22m82J21l95L1M53N56n92q2N1k61K52L14j27k54r8j39
4481c52kN31K50l20m59k02O08j18L96Q6l82k59j59N2M39m8J23k49n2l7J03J42
4503I1J99m67K84k88K10M8J64l21j21rJ32o8L89j18n22j0N11q2L6N74p56P7k48
4526b95l2N73Q8j6l75k68J81j7K59K76l45j52L9j51L93Q1j65n5l28J43N7L11j09
4549I3j54r9OL4K90O0j77M3l49K19n2N83j05k80l09k2L4K79L98r7m43k68nJ77
4573a44J34M41l83K4l74q0M82K5M7k29k23K17J20J43J00r2k04k33J79J33J29k3
4595A89j85k41m2P6P62r9n04r7k40j3L59M26J78p70k76M60n0L87j25k8k67q2P7
4618a05L87o0Q2m90P8J00J75j12J03m39N8P6K08L71q8k1l11m09K83p6M54R8l46
$$ plain form
4641 16 -293 -244 -89 -68 399 63 -123 -149 -339 216 146 231 -111 -193 -46 232 -36 543 361 24 -270 -165
4663 -165 -21 312 -52 -126 -268 -328 237 301 147 -26 -331 -690 -357 23 301 347 25 -337 -371 -336 264 490
4685 490 169 -1 -675 -29 356 322 208 12 -295 -57 -164 -81 106 -82 -117 -76 -190 17 187 18 -85
4706 -85 -226 -222 205 306 45 -256 -256 -445 -501 187 522 398 -118 -295 -494 -91 296 143 116 -267 -423 -294
4728 -294 43 353 301 143 -253 -181 -233 153 446 -24 -424 -483 184 239 343 -116 -338 -282 -336 90 346 157
4750 157 -164 -59 -293 16 344 217 666 -12 -297 -105 120 307 110 35 -92 -418 -405 5 173 -66 -12
4771 -12 -405 -322 246 413 71 -100 -158 -295 -125 268 129 142 -309 -236 -125 205 426 233 59 -187 -349 -205
4793 -205 177 86 230 -356 -273 -368 51 344 236 -21 -298 -122 -3 -66 238 356 -69 3 -267 -93 284 332
$$ packed form
4641A6l09M9J55K1M67l36j86k6j90N55p0Q5l42q2J47K78k68N79j82l37k94J05
4663a65J44L33l64p4j42o0N65O4j54j73l05l59L33L80K78M6l22l62l4L5O00K26
4685D90l21j70o74O46L85l4j14j96l07K38j07Q3J87j88l5M1j14K07J70j69j03
4706h5j41MM27J01k61l01%j89n6O88L35j24n16j77j99M03L87j53k7l83j56J29
4728b94L37L10n2j58l96P2n2L86K93m70m00n9O67N5J04m59k22N6n4M26K56j89
4750A57l21J05k34L09L28j27M49o78k85J92K25J87j97p5j27l26J3M10J68k39N4
4771a2l93Q3N68J67l42j71n8j37J70L93j39J3m51P3J11L30K21j93j74k46j62J44
4793b05L82r1J44n86Q3r5M19K93j08k57k77J76J19o3L04J18m25P2k70J74L77M8
$$ plain form
4815 332 -82 -282 -406 252 178 144 -257 -368 -341 -105 273 252 -25 -261 -733 -254 -205 5 287 183 -149 -262
4837 -262 -163 136 201 242 -86 -125 -377 -251 16 435 130 -372 -18 -309 160 -77 -24 -70 -163 -414 208 282 324
4860 324 -123 -227 -266 -71 476 407 356 -159 -207 -224 -262 121 297 29 -139 -325 -201 210 117 280 163 -333
4882 -333 -484 -293 244 250 191 -10 -167 196 206 45 357 -284 -273 -276 104 304 695 -61 -259 -608 -47 483
4904 483 415 447 -229 -528 -247 -309 64 412 201 20 156 -154 69 389 382 -142 -102 -386 -76 480 117 -241
4926 -241 -177 -204 88 194 195 150 -406 -415 -76 247 123 210 -345 -130 -272 -12 298 423 129 -31 -445 -139 -160
4949 -160 95 382 -83 -213 -375 -194 63 364 22 -256 -217 591 -228 182 86 495 -370 274 -86 235 893
4970 893 81 860 328 -765 -846 875 247 -375 -164 75 -148 460 709 245 86 -272 -204 537 -394 1138
$$ packed form
4815C32m14k00j24O58p4l4m01j11K7K36L78k1k77k36m72M79M9K10K82j04l32j13
4837b62R9K99O5M1l28l9k52J26K67M19l05n02L54k91M69k37N3m6r3k51O22P4M2
4860C24m47j04l9J95N47o9n1n15m8j7l8L83J76k68j68j86J24M11r3J63j17m96
4882c33j51J91N37On9k01j57L63J0j61L12o41J1lL80K00L91p56j98l49N61N30
4904D83o8L2o76k99K81o2L73L48k11j81J36l10K23L20pn24M0k84L10N56l63l58
4926b41O4k7K92J06Jm5n56rL39L23j24Q7n55K15j42K60L10J25k94j60m14L06k1
4949a60K55K87m65j30j62J81K57L01l42k78L9Q08q19M10r6M09q65O44l60L21O58
4970H93q12P79n32j093q1J721o28o22K11K39k23O08K49m64j59l58O8P41r31J532
$$ plain form
4990 1138 -82 1097 113 -602 364 -63 598 -654 -988 -155 -8 182 -130 -31 -342 51 192 307 417
5009 417 35 -411 -245 -171 211 524 452 -245 -441 -134 -135 359 305 260 -413 -313 -159 208 109 259 108 -211
5031 -211 -298 59 107 239 58 -292 -133 27 -150 281 2 52 -257 -54 218 531 422 -266 -268 -553 368 333
5053 333 355 219 -108 -312 -370 -45 451 539 134 -340 38 -131 46 95 -148 -244 -164 -358 -36 400 -43 20
5075 20 -217 -287 13 241 322 198 -83 -388 -343 296 196 277 77 -386 -254 -164 25 372 295 -275 -420 -245
5097 -245 -230 259 94 191 -18 -73 -391 257 398 -149 -102 -183 -190 81 364 49 -44 -155 -298 91 175 294 -41
5120 -41 -404 -430 6 94 257 354 -186 36 -297 130 195 343 328 -168 -279 -72 199 91 96 -36 -220 -291 49
5143 49 58 89 40 -247 -141 -249 290 164 286 45 -71 -186 -11 198 169 220 -189 -125 169 196 211 212 -183 -295
$$ packed form
4990A138j220J179r84p15R66m27O61j252l34Q33J47J90l12R9l11L93J41J15J10
5009D17l82m46J66P4L82L13p2o97j96L07jM94n4m5o73J00J54L67r9J50j51l19
5031b11q7L57M8J32j81l50J59J60j77M31k79N0l09K03K72L13j09o88kk85R21l5
5053C33K2j36l27k04n8L25M96Q8m05m74L78j69J77M9k43r6Q0j94L22M36m43O3
5075B0k37p0L00K28Q1j24k81l05M5O39j00Q1k00m63J32R0J89L47p7n70j45J75
5097b45J5M89j65R7k09n5l18O48J41n47M7q1pK71K83l15r3j11j43L89Q4J19l35
5120d1l63k6M36Q8J63R7n40K22l33M27O5J48j5m96j11K07K71j08Nj32j84p1L40
5143D9RL1m9k87J06j08N39j26J22k41j16j15J75K09k9N1m09O4K94K7J5Jl95j12
$$ plain form
5167 -295 -57 84 253 549 151 -87 -194 -260 66 251 325 -31 -208 -205 -117 116 277 12 -319 -215 -300 156
5189 156 -90 148 197 -210 -160 65 289 -12 -159 -222 -279 84 -50 258 257 -203 -221 -208 102 347 325 129 -55
5212 -55 -272 -28 -67 342 10 114 56 -146 -235 287 237 -31 28 -402 -128 262 79 11 -234 -161 -63 286 157
5235 157 155 -186 -343 -311 10 278 435 3 88 -300 -227 -124 284 376 335 -7 -177 77 -150 138 35 113 -315
5258 -315 -316 -48 145 83 -62 -290 -215 44 492 203 0 -259 -104 -172 16 65 24 139 -326 -310 -209 310 350
5281 350 67 -54 -281 -204 47 210 496 93 -184 -354 -101 259 143 291 94 -103 -7 27 166 194 -244
5302 -244 -165 -268 363 275 372 285 -125 -392 10 418 587 42 -161 -185 -254 -68 198 128 269 -198 -397 -105
5324 -105 125 255 104 52 -526 -254 168 234 -43 -179 -149 -6 122 236 321 324 -13 -579 -483 269 227 387 16
$$ packed form
5167b95K38J41J69K96l98k38j07o6L26J85P4l56j77LQ8K33J61k65l31J04q5M56
5189A56k46K38M9m07N0K25K24l01j47o3n7L63j34L08jm60j8J3L10K45k2j96j84
5212e5k17K44l9M09l32J04n8k02q9N22n0k68N9m30K74L90j83o8k45P3R8L49j29
5235A57kl41j57L2L21K68J57m32Q5l88P3J03M08R2m1l42j70K54k27K88j03P8m28
5258c15jK68J93o2j45k28P5K59M48k89k03k59J55o8J88M9m1J15m65J6J01N19M0
5281C50k83j21k27P7K51J63K86m03k77j70K53L60j16J48j97j97R6L4J39K8m38
5302b44P9j03O31q8R7q7m10k67M02M08J69n45k03k4o9J86K66p0J41m67j99K92
5324a05K30J30j51n2n78K72M22O6k77j36L0J43J28J14Q5Ll37n66R6P52m2J60l71
$$ plain form
5347 16 -147 -581 -78 -125 152 1 68 -210 -562 -40 234 361 55 -288 -106 34 222 224 170 -181 -181 -238 227
5370 227 179 337 68 -337 -48 82 278 249 42 -20 -394 -215 163 77 340 -269 -174 -443 -166 523 183 232
5392 232 -7 -92 -190 158 165 182 108 -289 -210 -202 1 127 141 38 -336 -129 -76 1 57 123 20 -179 24 25 -23 -171
5418 -171 -240 -252 -1 261 295 162 -335 -246 -183 87 139 153 137 -17 -418 -329 109 239 183 -8 -218 -350 86
5441 86 146 32 88 -238 -189 -250 79 260 206 -44 -121 -149 -56 325 249 44 -241 -321 -210 314 433 123 128 -401
5465 -401 -88 90 340 155 -78 -134 -287 -216 -163 526 143 75 -164 65 -121 309 330 184 61 -408 -125 31
$$ packed form
5347A6j63m34N03m7K77j51O7k78l52N22K74J27l06l43J82J40J88Kn4l51%n7M65
5370B27m8J58k69m05K89J30J96k9k07o2l74J79L78q6K63o09R5k69K77O89l40M9
5392B32k39q5r8L48PJ7p4l97P9QK03J26J4j03l74K07N3P7N6O6j03j99K03Jm8j48
5418a71o9j2K51K62L4j33m97Q9O3K70N2J4j6j54m01Q9M38J30n6j91k10j32M36
5441H6O0j14N6l26M9o1L29J81n4k50p7k8R3L81p6k05k85q0J11N24J19l10Nn29
5465d01L13J78K50j85k33n6j53P1N3O89l83o8k39K29j86M30K1j46j23m69K83J56
$$ [...]
8191F6
##END NTUPLES=NMR FID
##END=
