##TITLE=1H_AdMeOH(from Grignard)
 CDCl3
 8 sc, 
 17.3.2023
##JCAMPDX= 6.0         $$ Bruker NMR JCAMP-DX V2.0
##DATA TYPE= NMR FID
##DATA CLASS= NTUPLES
##ORIGIN= UXNMR, Bruker Analytische Messtechnik GmbH
##OWNER= root
$$ XWIN-NMR		Version 3.5
$$ Fri Mar 17 14:16:22 2023 Russian Standard Time (UT+4h)  she@DPX200
##.OBSERVE FREQUENCY= 200.13135
##.OBSERVE NUCLEUS= ^1H
##.DELAY= (6, 6)
##.ACQUISITION MODE= SIMULTANEOUS
##.ACQUISITION SCHEME= undefined
##.AVERAGES= 8
##.DIGITISER RES= 18
##SPECTROMETER/DATA SYSTEM= spect
##.PULSE SEQUENCE= zg30
##.SOLVENT NAME= DMSO
##.SHIFT REFERENCE= (INTERNAL, DMSO, 0, 15.7039)
##AUDIT TRAIL= $$ (NUMBER, WHEN, WHO, WHERE, WHAT)
$$ ##TITLE= Audit trail, XWIN-NMR		Version 3.5
$$ ##JCAMPDX= 5.01
$$ ##ORIGIN= Bruker BioSpin GmbH
$$ ##OWNER= she
$$ F:/spectra/data/she/nmr/H-F/1/audita.txt
$$ ##AUDIT TRAIL=  $$ (NUMBER, WHEN, WHO, WHERE, WHAT)
(   1,<2023-03-17 14:14:54.31 +0400>,<she>,<DPX200>,
      <created by zg, POWCHK disabled, PULCHK disabled
       configuration hash MD5:
       00 E9 B6 7A A2 85 ED C7 34 08 36 98 17 FE 4E 26
       data hash MD5: 16K
       40 DD EF AF 20 23 97 D0 4A 3C 09 98 41 EB 86 E6>)
$$ ##END=
$$ 
$$ hash MD5
$$ BB 94 79 33 E6 D7 AF F7 5E B4 6C 85 80 A6 23 1D
##$RELAX= 
##$RELAX= 
##$RELAX= 
##$RELAX= 
##$RELAX= 
##$RELAX= 
$$ Bruker specific parameters
$$ --------------------------
##$DU= <F:/spectra>
##$EXPNO= 1
##$NAME= <H-F>
##$PROCNO= 1
##$TYPE= <nmr>
##$USER= <she>
##$AMP= (0..31)
100 100 100 100 100 100 100 100 100 100 100 100 100 100 100 100 100 100 
100 100 100 100 100 100 100 100 100 100 100 100 100 100 
##$AQSEQ= 0
##$AQ_mod= 1
##$AUNM= <au_zg>
##$AUTOPOS= <>
##$BF1= 200.13
##$BF2= 200.13
##$BF3= 200.13
##$BF4= 200.13
##$BF5= 200.13
##$BF6= 200.13
##$BF7= 200.13
##$BF8= 200.13
##$BYTORDA= 1
##$CFDGTYP= 0
##$CFRGTYP= 5
##$CHEMSTR= <none>
##$CNST= (0..31)
1 1 145 1 1 1 1 1 1 1 1 1 1 1 1 1 1 1 1 1 1 1 1 1 1 1 1 1 1 1 1 1 
##$CPDPRG= <>
##$CPDPRG1= <>
##$CPDPRG2= <>
##$CPDPRG3= <>
##$CPDPRG4= <mlev>
##$CPDPRG5= <mlev>
##$CPDPRG6= <mlev>
##$CPDPRG7= <mlev>
##$CPDPRG8= <mlev>
##$CPDPRGB= <>
##$CPDPRGT= <>
##$D= (0..31)
0 1.2 0 0 0 0 0 0 0 0.06 0 0.03 0 0 0 0 0.0002 0 0 0 0 0 0 0 0 0 0 0 0 
0 0 0 
##$DATE= 1679048093
##$DBL= (0..7)
120 120 120 120 120 120 120 120 
##$DBP= (0..7)
150 150 150 150 150 150 150 150 
##$DBP07= 0
##$DBPNAM0= <>
##$DBPNAM1= <>
##$DBPNAM2= <>
##$DBPNAM3= <>
##$DBPNAM4= <>
##$DBPNAM5= <>
##$DBPNAM6= <>
##$DBPNAM7= <>
##$DBPOAL= (0..7)
0.5 0.5 0.5 0.5 0.5 0.5 0.5 0.5 
##$DBPOFFS= (0..7)
0 0 0 0 0 0 0 0 
##$DE= 6
##$DECBNUC= <off>
##$DECIM= 32
##$DECNUC= <off>
##$DECSTAT= 4
##$DIGMOD= 1
##$DIGTYP= 9
##$DL= (0..7)
0 120 120 120 120 120 120 120 
##$DP= (0..7)
150 150 150 150 150 150 150 150 
##$DP07= 0
##$DPNAME0= <>
##$DPNAME1= <>
##$DPNAME2= <>
##$DPNAME3= <>
##$DPNAME4= <>
##$DPNAME5= <>
##$DPNAME6= <>
##$DPNAME7= <>
##$DPOAL= (0..7)
0.5 0.5 0.5 0.5 0.5 0.5 0.5 0.5 
##$DPOFFS= (0..7)
0 0 0 0 0 0 0 0 
##$DQDMODE= 0
##$DR= 18
##$DS= 0
$$ [...]
##$SUBNAM2= <"">
##$SUBNAM3= <"">
##$SUBNAM4= <"">
##$SUBNAM5= <"">
##$SUBNAM6= <"">
##$SUBNAM7= <"">
##$SUBNAM8= <"">
##$SUBNAM9= <"">
##$SW= 18.05172834244
##$SWIBOX= (0..15)
0 0 2 0 0 0 0 0 0 0 0 0 0 0 0 0 
##$SW_h= 3612.71676300578
##$TD= 16384
##$TD0= 1
##$TE= 0
##$TE2= 300
##$TE3= 300
##$TEG= 300
##$TL= (0..7)
0 120 120 120 120 120 120 120 
##$TP= (0..7)
150 150 150 150 150 150 150 150 
##$TP07= 0
##$TPNAME0= <>
##$TPNAME1= <>
##$TPNAME2= <>
##$TPNAME3= <>
##$TPNAME4= <>
##$TPNAME5= <>
##$TPNAME6= <>
##$TPNAME7= <>
##$TPOAL= (0..7)
0.5 0.5 0.5 0.5 0.5 0.5 0.5 0.5 
##$TPOFFS= (0..7)
0 0 0 0 0 0 0 0 
##$TUNHIN= 0
##$TUNHOUT= 0
##$TUNXOUT= 0
##$USERA1= <user>
##$USERA2= <user>
##$USERA3= <user>
##$USERA4= <user>
##$USERA5= <user>
##$V9= 5
##$VALIST= <valist>
##$VCLIST= <CCCCCCCCCCCCCCC>
##$VD= 0
##$VDLIST= <DDDDDDDDDDDDDDD>
##$VPLIST= <PPPPPPPPPPPPPPP>
##$VTLIST= <TTTTTTTTTTTTTTT>
##$WBST= 1024
##$WBSW= 4
##$XGAIN= (0..3)
0 0 0 0 
##$XL= 0
##$YL= 0
##$YMAX_a= 276995
##$YMIN_a= -322806
##$ZGOPTNS= <>
##$ZL1= 120
##$ZL2= 120
##$ZL3= 120
##$ZL4= 120
##$ABSF1= 10
##$ABSF2= 0
##$ABSG= 5
##$ABSL= 3
##$ALPHA= 0
##$AQORDER= 0
##$ASSFAC= 0
##$ASSFACI= 0
##$ASSFACX= 0
##$ASSWID= 0
##$AUNMP= <proc_1d>
##$AZFE= 0.1
##$AZFW= 0.1
##$BCFW= 1
##$BC_mod= 2
##$BYTORDP= 1
##$COROFFS= 0
##$CY= 11.3945322036743
##$DATMOD= 1
##$DC= 2
##$DFILT= <>
##$DTYPP= 0
##$F1P= 2.36226072786647
##$F2P= -0.459571619588291
##$FCOR= 0.5
##$FTSIZE= 0
##$FT_mod= 4
##$GAMMA= 1
##$GB= 0.15
##$INTBC= 1
##$INTSCL= 1
##$ISEN= 128
##$LB= 0.24
##$LEV0= 0
##$LPBIN= 0
##$MAXI= 10000
##$MC2= 0
##$MEAN= 0
##$ME_mod= 0
##$MI= 1.114404
##$NCOEF= 0
##$NC_proc= 0
##$NLEV= 6
##$NOISF1= 3.799351
##$NOISF2= 2.8
##$NSP= 1
##$NTH_PI= 0
##$NZP= 0
##$OFFSET= 15.70392
##$PC= 1
##$PHC0= -19114.46
##$PHC1= 22.60075
##$PH_mod= 1
##$PKNL= yes
##$PPARMOD= 0
##$PSCAL= 0
##$PSIGN= 0
##$REVERSE= no
##$SF= 200.130013532006
##$SI= 16384
##$SIGF1= 3
##$SIGF2= 2
##$SINO= 400
##$SIOLD= 16384
##$SREGLST= <1H.CDCl3>
##$SSB= 0
##$STSI= 0
##$STSR= 0
##$SW_p= 3612.71676300578
##$SYMM= 0
##$S_DEV= 0
##$TDeff= 0
##$TDoff= 0
##$TI= <>
##$TILT= no
##$TM1= 0
##$TM2= 0
##$TOPLEV= 0
##$USERP1= <user>
##$USERP2= <user>
##$USERP3= <user>
##$USERP4= <user>
##$USERP5= <user>
##$WDW= 1
##$XDIM= 8192
##$YMAX_p= 0
##$YMIN_p= 0
$$ End of Bruker specific parameters
$$ ---------------------------------
##NTUPLES= NMR FID
##VAR_NAME=  TIME,          FID/REAL,        FID/IMAG
##SYMBOL=    X,             R,               I
##VAR_TYPE=  INDEPENDENT,   DEPENDENT,       DEPENDENT
##VAR_FORM=  AFFN,          ASDF,            ASDF
##VAR_DIM=   8192,          8192,            8192
##UNITS=     SECONDS,       ARBITRARY UNITS, ARBITRARY UNITS
##FACTOR=    0.0002768,     1,               1
##FIRST=     0,             0,               0
##LAST=      2.2672688,     0,               0
##MIN=       0,             -322806,         0
##MAX=       2.2672688,     276995,          0
$$ Real data points
##PAGE= N=1
##DATA TABLE= (X++(R..R)), XYDATA
0 0 0 0 0 0 0 0 0 0 0 0 0 8 -8 8 -9 16 -17 24 -30 33 -40 49 -57 72 -81 97 -113 129 -150 169 -195 223 -255
33 -255 287 -323 368 -410 460 -514 576 -640 711 -788 873 -965 1067 -1179 1299 -1429 1577
50 1577 -1737 1914 -2110 2326 -2569 2844 -3158 3514 -3929 4418 -5003 5719 -6613 7775 -9349
65 -9349 11610 -15148 21488 -36295 144193 -75722 -313044 222748 199356 -243470 -116348
76 -116348 276995 12772 -236768 50318 187690 -109168 -116489 118738 54689 -125643 -9018
87 -9018 92205 -23009 -69942 37627 35538 -43375 -20003 44530 7889 -37017 2139 39126
99 39126 -10912 -32992 30975 40469 -43758 -29853 62198 17544 -72414 9981 78112 -37447
111 -37447 -74749 57337 53510 -72660 -29760 70063 -2485 -64197 18564 41903 -28700 -19835
123 -19835 23278 -2073 -11754 14514 -479 -13050 15072 5260 -19563 11069 21355 -17729
135 -17729 -8418 22833 -5574 -16994 20765 7893 -25326 5511 18905 -19953 -7239 25560
147 25560 -9269 -23541 19187 7622 -27465 8578 24017 -24016 -13628 28532 -4183 -23933
159 -23933 21156 10180 -29604 10159 26467 -29464 -8464 45375 -14621 -47674 41510 38293
171 38293 -60092 -13167 71103 -15910 -67036 42956 49660 -59236 -22050 62346 -9773 -54828
183 -54828 32866 33944 -46566 -11358 43992 -14616 -35341 29323 17772 -35725 -1909 29837
195 29837 -12114 -18655 19709 8899 -18008 1107 14910 -1890 -6728 3661 7380 971 -9030
208 -9030 -1094 17839 97 -25786 6996 28136 -22439 -27902 35229 15885 -49362 -2808 48917
221 48917 -20193 -44221 37613 27389 -51263 -6860 54373 -14300 -43528 34725 29995 -42024
233 -42024 -8093 45407 -5447 -32490 18884 20350 -20701 -5006 17584 -4363 -9543 5429
245 5429 -2828 -6408 6121 -1605 -10631 3280 3342 -8569 -233 5035 -4552 390 3872 -7623 2651
260 2651 14718 -9158 -10356 22784 5363 -27170 11797 31636 -24980 -22672 38992 7282 -45689
273 -45689 11840 41649 -32362 -32080 41882 9442 -47633 9562 36941 -30166 -23205 37729 1017
286 1017 -36835 19525 26523 -33218 -8016 40310 -7534 -32898 24893 23394 -30613 -7003 32242
299 32242 -3301 -24040 11256 14233 -13311 -5421 8599 -682 -4381 -1974 -2868 3793 2277 -10652
313 -10652 -1006 12361 -7515 -12754 14403 7703 -18948 1595 19148 -10388 -12144 19290 3567
326 3567 -19983 9329 16311 -17791 -5432 24206 -6047 -22178 16713 14612 -23259 -4150 23235
339 23235 -7333 -18807 12957 8613 -14809 485 9233 -8514 -2096 8724 -7515 -4675 13900
352 13900 -4193 -15428 13608 11248 -19854 -1463 21849 -8692 -17105 17731 8853 -20006 3018
365 3018 17692 -11553 -8709 17414 -1265 -14757 11254 7108 -16928 2934 16283 -13689 -11432
378 -11432 18840 28 -21275 9166 15562 -17688 -7344 18707 -3266 -15232 11214 7623
390 7623 -14076 2658 12855 -8952 -4593 14956 -2442 -12710 11143 8277 -13842 1216 13690
403 13690 -8051 -8668 11476 639 -11412 5181 5203 -11165 -259 8060 -8631 -4668 10597
416 10597 -4195 -11067 10983 5633 -14602 3771 15152 -10253 -7982 17528 1640 -15345 9268
429 9268 12770 -14108 -2660 16607 -5900 -12723 13089 4124 -17488 3973 13362 -13831 -8585
442 -8585 15654 -2330 -16652 8976 9362 -15037 -1786 14664 -6483 -9528 13185 2862 -12200
455 -12200 7065 10450 -10529 -1179 13830 -4777 -9179 11727 3526 -12771 4042 9915 -11175
468 -11175 -4508 11390 -4309 -10612 8279 2799 -12364 2639 8415 -9629 -3485 11806 -4268
481 -4268 -9401 10926 4227 -12942 4913 12597 -10352 -5217 15587 -1439 -13359 9635 8922
494 8922 -14272 -1025 14275 -7546 -10596 11992 2296 -14504 4365 10191 -11293 -4941 12145
507 12145 -3403 -10465 9172 4230 -11644 2823 9715 -8612 -3671 12183 -2427 -9197 9372
520 9372 4918 -11272 2704 10806 -8412 -5307 12458 -1731 -11358 8272 6375 -12566 126
533 126 11697 -7316 -8272 11401 784 -12848 5858 8598 -11019 -2463 11869 -4697 -9504
546 -9504 10080 3777 -11457 3580 9382 -8826 -3435 11319 -2453 -8758 8586 4346 -10575
559 -10575 2700 9067 -7414 -4428 10603 -1775 -9819 7702 5156 -11354 735 9857 -7744
572 -7744 -6807 10894 -444 -12416 6043 7392 -11163 -1874 12362 -4821 -8992 10485 3909
585 3909 -11131 3827 10489 -7926 -3962 11440 -1163 -9034 7759 5016 -9438 1053 8467
598 8467 -6676 -5373 8370 -1498 -9100 5447 4120 -9616 105 7795 -6583 -5351 8711 -528
612 -528 -8578 6536 5816 -9030 713 10430 -4428 -5722 10656 1799 -9697 5769 8260 -9163
626 -9163 -2373 10631 -4120 -9377 8512 3232 -11838 1525 8869 -8555 -5893 9754 -1143
639 -1143 -10053 6365 5803 -9674 237 9839 -4929 -5527 9641 1459 -8050 5365 6743 -7360
653 -7360 -168 9277 -4012 -5919 8216 938 -9310 3812 5697 -8831 -2378 8862 -4601
666 -4601 -8023 7684 2441 -10073 2748 8021 -7504 -3612 9826 -1550 -8273 7052 5253
679 5253 -8460 1230 9591 -5226 -5082 8915 558 -8576 5094 5896 -8406 -1326 8328 -4430
693 -4430 -6772 7252 1060 -8994 3073 5809 -7417 -1925 8028 -3218 -6748 7032 2333 -8226
707 -8226 2882 6791 -6619 -2094 8846 -2320 -6541 7101 3346 -8323 2287 7913 -6393
720 -6393 -3971 8971 -1182 -8426 5808 4900 -8783 -186 8494 -4988 -6045 8148 849 -9105
734 -9105 3699 6281 -7780 -2177 8556 -2890 -6670 6685 3062 -8057 2121 6713 -5397
747 -5397 -2586 7734 -874 -6043 5482 3277 -6652 1860 6537 -5280 -2774 7398 -1484 -6768
761 -6768 5576 3246 -7964 607 7077 -5759 -5085 7561 -259 -8408 3976 5550 -7757 -1259
775 -1259 8274 -3186 -5483 7131 2666 -7485 2786 6928 -5733 -2391 7851 -1038 -6073 5338
789 5338 3248 -6888 447 5792 -5049 -3914 6320 -1446 -6565 3961 2778 -7075 477 5911
803 5911 -4440 -3734 6757 -222 -6116 4602 4722 -6149 238 7547 -3455 -4294 7220 1294
817 1294 -7311 3214 5698 -6277 -2094 7083 -2693 -6623 5160 2212 -7884 913 5588 -5590
831 -5590 -3518 6615 -764 -6344 4334 3488 -6156 681 6599 -3185 -3072 6530 448 -5342 3921
846 3921 4241 -5713 61 6465 -3426 -4386 5633 697 -6742 2330 4142 -5905 -1960 6039 -2787
861 -2787 -5128 4965 1565 -6531 2118 5386 -5144 -2115 6797 -903 -5301 5420 3530 -6267
875 -6267 964 6401 -3964 -3488 6196 -43 -6094 3363 3821 -6013 -797 5668 -3368 -4294 5213 438
891 438 -6140 2410 3942 -5320 -1330 5789 -2349 -4455 4838 1804 -5865 1945 4824 -4155 -1956
906 -1956 5922 -994 -4648 4521 2454 -5276 958 5013 -3767 -2222 5463 -754 -5325 3999 2919
921 2919 -5687 -134 5450 -3514 -3700 5554 255 -6015 2855 3754 -5608 -882 5668 -2308 -4281 5028
937 5028 1431 -5846 2108 4872 -4451 -1558 6112 -980 -4682 4122 2874 -5144 868 4791 -3528
952 -3528 -2639 4689 -596 -4855 2867 2027 -5030 135 4285 -3426 -2662 4447 -313 -4950 3309 3162
968 3162 -5033 165 5692 -2518 -3400 5594 1315 -5340 2630 4377 -4505 -1574 5809 -1556 -4544
983 -4544 4004 2144 -5924 367 4706 -4148 -3362 4548 -406 -5249 2553 2609 -4672 -599 4459 -2269
999 -2269 -2612 4237 311 -3756 3168 3148 -3768 622 4603 -2386 -2483 4375 368 -4666 2282 3067 -4745
1016 -4745 -1140 4512 -2784 -4061 3961 733 -5372 1511 4035 -4215 -2119 5219 -805 -4431 3807
1031 3807 3115 -4844 528 5108 -2484 -2713 4822 927 -4306 2594 3264 -4034 -600 4203 -2320 -3390
1047 -3390 3610 561 -4245 1424 2872 -3948 -1240 3989 -1716 -3385 3539 1252 -4241 1859 3609
1062 3609 -3584 -1318 4588 -1051 -3575 3825 2018 -4150 1066 4108 -3194 -2127 4562 -372 -4104
1077 -4104 2556 2532 -4421 -260 4504 -2351 -3092 3650 414 -4266 1828 3070 -3937 -773 4083 -1751
1093 -1751 -3319 3687 1381 -4231 1648 3459 -3124 -1195 4420 -649 -3530 3086 1808 -3814 811
1108 811 3656 -2643 -1900 4098 -466 -3717 2631 1763 -4065 31 3900 -2786 -2635 3928 -111 -4037
1124 -4037 2166 2468 -3761 -426 4051 -1775 -3117 3591 934 -4079 1818 3663 -2961 -1006 4226
1139 4226 -1131 -3106 3405 1715 -4060 897 3643 -2858 -1868 3801 -738 -3718 2291 1842 -4011
1154 -4011 -272 3277 -2695 -2246 3492 -118 -3537 2098 2372 -3068 102 3821 -1536 -2027 3578 766
1170 766 -3625 1980 3039 -3237 -766 3721 -1294 -2951 2934 980 -3976 804 2606 -3058 -1676
1185 -1676 3324 -1028 -3481 2683 1682 -3528 509 3427 -2459 -1682 3927 442 -3256 2221 2494
1200 2494 -2846 -53 3597 -1476 -2191 3014 472 -3592 1455 2281 -3070 -888 2684 -1744 -2732 2492
1216 2492 664 -3307 832 2691 -2699 -1058 3564 -788 -2683 2853 1115 -3032 1116 3161 -2371
1231 -2371 -1425 3646 -354 -3034 2491 1984 -3541 33 3152 -2112 -2409 2811 22 -3685 1551 2232
1247 2232 -3306 -760 3397 -1493 -2422 2817 696 -3126 1240 2846 -2429 -713 3321 -719 -2282
1262 -2282 2454 1524 -2777 627 2570 -2240 -1039 3183 -914 -2775 2275 1339 -3482 487 2871
1277 2871 -2296 -1831 3316 -307 -3291 1743 2178 -3162 -432 3338 -1774 -2280 2792 614 -3371 1242
1293 1242 2336 -2441 -1010 3039 -786 -2361 2251 924 -3044 943 2213 -2155 -1395 2710 -536
1308 -536 -2618 1923 982 -2877 421 2338 -2137 -1772 2892 -543 -2737 2059 1381 -3228 55 2885
1324 2885 -1574 -1912 2982 398 -2885 1523 2428 -2418 -680 3320 -735 -2437 2455 611 -2981
1339 -2981 765 2240 -2231 -1196 2213 -964 -2456 1731 864 -2673 618 2494 -2147 -1351 2545
1354 2545 -600 -2357 1945 1713 -2549 493 2816 -1586 -1487 2906 204 -2341 1669 1917 -2745 -604
1370 -604 2893 -1382 -2386 1999 279 -3060 498 1968 -2268 -1034 2408 -647 -1950 1817 790
1385 790 -2480 800 2427 -1480 -735 2396 -108 -1811 2064 1445 -2199 328 2258 -1616 -1272 2417
1401 2417 -458 -2517 1324 1188 -2714 -401 2236 -1497 -1923 2208 69 -2737 1184 1791 -2246 -913
1417 -913 2777 -587 -2030 2210 1106 -2351 823 2278 -1856 -1051 2312 -271 -2304 1563 1131 -2676
1433 -2676 51 2212 -1666 -1480 2035 -150 -2624 1402 1168 -2401 -293 2134 -1372 -1500 2046 502
1449 502 -2249 1052 1967 -1899 -430 2522 -1010 -1640 1849 529 -2280 606 2005 -1856 -1048 2480
1465 2480 -631 -2016 1468 663 -2441 273 2193 -1693 -1099 2137 -239 -2164 1551 1434 -2324 -151
1481 -151 2096 -1194 -1095 2134 148 -2090 1336 1780 -2270 -137 2467 -968 -1510 2222 561 -2178
1497 -2178 868 1695 -2047 -999 2064 -610 -1999 1729 796 -2222 288 1935 -1669 -1250 2083 -95
1513 -95 -1878 1345 1147 -2018 -124 1954 -1358 -1113 2287 48 -1698 1247 1180 -1503 -83 2297
1529 2297 -1035 -1237 1857 274 -2027 775 1315 -1948 -663 1883 -861 -1989 1469 532 -2490 237
1545 237 1659 -1670 -731 1991 -350 -1736 1457 934 -1716 484 2053 -1067 -832 1873 48 -1828
1561 -1828 956 1052 -2016 -206 1809 -1262 -1362 1439 7 -2318 891 1376 -1893 -419 1918 -738
1577 -738 -1553 1615 486 -1941 921 1678 -1156 -604 1758 -194 -1619 1674 895 -1726 2 1661
1593 1661 -1025 -766 1419 -149 -1795 952 874 -1966 -261 1343 -987 -1235 1644 -64 -1806 774
1609 774 1203 -1298 41 1893 -671 -1161 1693 592 -1664 758 1692 -1259 -397 1836 -418 -1527
1625 -1527 1458 313 -2076 218 1521 -1280 -903 1616 -426 -1836 1161 495 -1804 81 1715
1640 1715 -1070 -964 1994 241 -1699 1332 1197 -1384 -158 1866 -568 -980 1643 232 -1642 840
1656 840 1156 -1540 -418 1633 -394 -1343 1376 580 -1741 171 1353 -1336 -869 1692 -370 -1658
1672 -1658 1083 558 -1752 378 1312 -985 -845 1448 -109 -1386 1159 911 -1457 -171 1478 -685
1688 -685 -1053 1344 191 -1381 779 971 -1409 76 1371 -657 -1158 1492 594 -1690 407 1112
1704 1112 -1169 -485 1361 -539 -1363 1167 300 -1528 459 1280 -1031 -636 1492 124 -1587 1192
1720 1192 1052 -1673 -16 1574 -734 -823 1207 250 -1539 604 706 -1476 -538 1325 -676 -1287 1189
1737 1189 25 -1197 426 1090 -1107 -42 1587 -400 -1012 1451 559 -1202 529 1172 -1021 -439
1753 -439 1317 -280 -1184 771 718 -1690 218 1128 -1196 -1132 1264 -10 -1310 637 564 -1346 -11
1770 -11 1371 -563 -890 1082 391 -1403 514 787 -1340 -161 1418 -281 -914 999 171 -1196 640
1787 640 1017 -1198 -348 1129 -418 -1302 943 535 -1238 -117 1387 -862 -774 1191 -200 -1223 708
1804 708 684 -936 46 1441 -525 -726 1413 42 -998 669 831 -1046 -130 1280 -725 -848 1202
1821 1202 158 -1434 469 857 -1069 -435 1289 -376 -1041 929 410 -1474 303 1137 -880 -474
1837 -474 1218 -240 -1244 1049 335 -1282 19 1061 -782 -484 1324 167 -1082 835 728 -771
1853 -771 -28 1117 -907 -678 1078 -76 -1132 450 829 -1044 -331 1031 -493 -1163 1004 254 -1055
1870 -1055 449 916 -1003 -530 1210 -322 -906 1099 630 -1128 214 1133 -880 -670 999 14 -1302
1887 -1302 668 483 -1233 24 988 -444 -943 731 12 -1226 546 434 -933 180 992 -661
1903 -661 -881 865 420 -827 372 959 -845 -90 1057 -275 -883 996 580 -989 260 1223 -844
1920 -844 -476 992 -373 -850 513 451 -1276 95 616 -489 -662 994 -43 -1142 679 338 -1158
1937 -1158 100 878 -359 -380 859 512 -852 636 876 -894 -290 859 -7 -926 757 193 -989
1954 -989 195 362 -918 -552 918 -529 -798 590 215 -913 -96 881 -531 -405 999 -90 -965
1971 -965 630 797 -996 237 807 -600 -355 920 98 -1133 496 545 -974 -221 893 -708 -741
1988 -741 839 55 -1033 229 880 -767 -342 1046 -366 -541 942 131 -844 381 892 -633 -341
2005 -341 1077 -268 -982 740 309 -906 138 611 -545 -439 941 -197 -677 436 469 -814 -186
2022 -186 715 -615 -776 993 118 -1066 621 817 -940 -108 746 -314 -460 526 546 -817 203 718
2040 718 -868 -303 969 -202 -985 407 190 -708 160 730 -591 -609 782 182 -821 620 280 -984
2058 -984 176 522 -661 -591 746 20 -923 242 458 -802 -118 672 -214 -533 964 475 -826 456
2076 456 587 -596 -191 890 -340 -650 791 404 -647 235 898 -509 -355 783 -178 -605 319 417
2094 417 -765 38 716 -256 -378 580 -47 -339 564 506 -563 193 959 -52 -544 496 372 -775 270
2113 270 604 -671 -269 594 -435 -646 511 48 -852 162 466 -503 -541 712 -350 -571 313 471
2131 471 -779 112 751 -412 -142 871 -200 -731 648 593 -590 275 940 -568 -306 686 105 -691
2149 -691 266 167 -779 -213 507 -180 -468 601 208 -505 420 452 -686 -276 700 -255 -514 498 207 -485
2169 -485 501 583 -581 -289 650 38 -514 455 415 -701 71 536 -576 -502 601 -61 -804 271 467
2188 467 -362 63 406 -205 -465 529 169 -677 202 217 -506 -101 510 -185 -253 690 179 -552 211 512 -386
2209 -386 -154 532 -211 -497 544 262 -470 235 550 -639 -244 555 -232 -626 395 383 -786 -9 568
2228 568 -563 -364 489 12 -434 263 494 -631 -160 632 -185 -559 530 57 -713 175 354 -443 -101
2247 -101 746 -165 -324 326 115 -539 9 555 -558 -102 629 -303 -532 287 344 -660 -49 630 -477
2266 -477 -195 553 116 -398 130 431 -484 -31 556 -371 -478 600 -138 -729 -12 431 -630 13 507
2285 507 -308 -360 453 275 -255 55 408 -279 -308 598 -170 -443 436 215 -446 407 569 -347 -84 595 -186
2306 -186 -435 284 231 -583 -169 259 -336 -122 841 -286 -653 448 94 -423 -7 673 -479 -374 457
2325 457 20 -413 255 721 -196 77 523 -420 -302 494 159 -440 139 529 -323 13 478 -139 -600 437
2345 437 87 -396 142 324 -328 -142 397 29 -511 408 248 -668 154 530 -218 -433 391 222 -727 374
2365 374 389 -400 -42 467 -98 -328 532 281 -800 150 275 -310 -21 235 -84 -331 171 75 -326 196
2385 196 231 -291 -134 562 243 -378 537 328 -391 41 441 -515 -95 277 -64 -477 337 395 -778 -65
2405 -65 250 -265 -372 542 -117 -636 350 206 -456 -72 413 -360 -356 593 -122 -730 195 492 -168 -198 383
2426 383 -176 -601 259 173 -582 350 580 -335 -237 364 -54 -133 376 138 -497 109 224 -512 -235 40 -7
2447 -7 -402 86 338 -672 -49 232 -387 -303 279 2 -296 311 391 -189 -46 602 -109 -177 534 -252 -505
2468 -505 64 404 -397 -129 353 -245 -459 234 181 -278 -109 478 -190 -169 496 -15 -524 235 177 -227 48
2489 48 631 -220 -212 559 51 -204 225 413 -533 -124 598 -376 -392 233 216 -499 162 79 -435 79 536 -205
2511 -205 -445 70 -151 -547 -8 328 -280 3 407 -20 -460 211 190 -510 133 422 -120 -184 579 71 -339
2532 -339 167 237 -413 -70 201 -312 -425 158 -81 -640 225 152 -320 -373 279 -291 -46 348 222 -474 327
2553 327 206 -325 104 409 -156 -406 568 301 -432 167 313 -78 -265 169 32 -180 -60 102 -262 -169
2573 -169 293 -184 -353 482 113 -497 420 153 -397 -77 237 -378 -96 379 41 -100 87 146 -291 20
2593 20 353 -115 -179 288 -107 -395 209 355 -584 -322 344 -168 -28 229 269 -740 -61 47 -451 -254 661
2614 661 -11 -377 371 170 -323 70 400 -301 -146 294 86 -467 221 262 -155 31 230 182 -195 478 120
2635 120 -131 77 167 -84 -50 126 28 -566 -1 153 -191 171 220 -238 -211 291 -11 -481 199 2 -286 146
2657 146 289 -215 -263 235 92 -182 290 223 -399 141 351 -266 -450 409 18 -374 138 198 -318 56 272
2678 272 -78 -361 140 -65 -455 255 332 -321 73 617 -142 -132 289 269 65 -106 161 -258 -258 439 -81 -460
2700 -460 257 -107 -302 -84 143 -388 -263 425 -37 -395 303 191 -539 -15 339 83 -329 242 156 -233
2720 -233 65 571 -26 29 431 108 -148 281 77 -257 74 67 -514 -218 326 -62 -181 214 204 -241 41
2741 41 386 -253 -135 270 -18 -281 193 108 -204 38 391 -229 -213 340 78 -92 127 148 31 -145 242
2762 242 -90 -162 459 -134 -420 55 314 -93 -60 383 -332 -136 389 69 -327 132 194 -307 94 340 -60
2783 -60 -310 162 30 -280 32 412 -91 -307 360 87 -636 -21 319 -273 -24 388 -190 -49 334 -307
2803 -307 -302 -25 122 -277 -163 310 -130 -9 88 251 -163 0 392 -392 -167 392 114 -456 461 296 -264
2824 -264 128 540 -90 -60 352 133 -219 311 32 -238 -18 90 -203 -202 243 -27 -241 130 43 -447 255
2845 255 500 -223 -401 361 195 -329 230 345 -126 -126 217 -261 350 391 358 -116 45 342 -347 21 186
2866 186 -85 -184 183 -23 -401 -58 111 -337 102 342 -192 27 282 255 -96 49 339 72 -55 251 244
2887 244 -247 230 387 -491 -136 278 -185 -182 297 163 -536 112 382 -212 -107 265 -235 -264 19 95 -7
2908 -7 -43 293 -294 -215 309 215 4 683 237 -153 -76 391 -320 -261 259 -170 -349 118 24 38 -227 484 -247
2931 -247 -376 229 -205 -197 110 556 -356 -8 307 -133 -247 198 159 -273 104 423 48 274 -41 -174 -90
2952 -90 453 28 -353 -165 254 -287 -361 174 -268 -154 186 -58 -343 -41 301 -328 -340 187 349 -301 351
2973 351 169 -525 -118 529 -67 -129 106 28 -36 146 291 -274 -191 472 -45 -236 -82 -30 -514 4 205 -127
2995 -127 -286 140 -151 -340 76 382 -445 -84 421 -238 -32 223 -116 -257 265 25 -252 126 590 -448
3015 -448 -274 335 34 -214 27 429 -217 -318 391 -88 13 293 83 -410 -357 303 -564 -406 165 -89
3035 -89 -84 507 24 -195 160 125 -225 -172 716 72 -260 213 419 -355 38 314 -49 -159 27 124 -233 195
3057 195 132 -75 92 129 -97 -200 206 -26 -353 218 168 -301 -134 220 17 171 94 170 -258 112 182 6
3079 6 -227 287 79 -176 336 103 -272 -282 307 -355 -365 69 364 -310 -251 -2 -555 -412 212 -172 -230 667
3101 667 49 -351 185 333 -1 51 534 83 -96 265 42 -144 156 184 -355 -344 428 -156 -606 339 36
3122 36 -227 -49 199 -161 -260 359 -291 -605 162 18 -104 -161 408 -24 -44 361 -140 -129 119 411 -272 -195
3144 -195 197 -189 -230 -118 -206 105 299 349 -233 -85 82 205 -298 200 245 -32 -22 121 -270 -163 178 -57
3166 -57 -246 304 165 -207 156 134 -165 -363 379 132 -472 273 323 -229 -136 100 9 -308 408 372 -279 63
3188 63 404 -196 60 253 -238 -127 -78 5 -131 -3 275 -130 -187 318 99 -244 170 137 -296 -13 99 -8
3210 -8 -187 195 18 -289 21 194 -159 -149 88 -447 -90 350 -107 -413 -28 474 -327 -298 199 -263 -225 111
3232 111 185 -366 69 255 144 14 262 51 -284 264 196 -233 50 375 -500 -139 225 107 -213 -210 304
3253 304 -66 -141 141 -48 -240 47 65 -10 -36 234 -314 -185 287 25 -132 182 221 -161 339 333 -133 43
3275 43 230 132 -140 428 -58 -345 -1 175 -230 -119 206 -61 -129 -22 247 -15 169 290 -436 -261 438
3296 438 160 -314 167 254 -163 -128 371 120 -342 333 -70 -472 34 247 -243 -56 229 -79 -157 -20 190
3317 190 -283 297 153 -164 -230 328 -53 -206 219 375 -179 -64 194 -47 -46 145 33 28 406 130 -219 222
3339 222 236 -233 -254 -191 214 -81 40 160 -235 -316 311 -59 -376 -29 108 -148 -30 118 -74 -26 357 80
3361 80 -465 109 201 -345 -148 335 -102 -11 435 -111 -178 -67 358 -274 -168 -155 -244 -205 27 95 -416 112 7
3384 7 -168 -194 -12 -154 -256 148 -4 -149 -70 197 -55 157 181 163 -150 221 138 -236 -47 214 36 60 182
3407 182 207 -96 19 108 -188 131 248 -265 -49 151 -122 -350 -103 300 -288 -381 -63 -109 -99 13 232 -63
3429 -63 225 319 160 6 96 99 -100 25 27 -318 24 257 -311 -315 153 96 -297 383 233 -242 -69 91 -25
3452 -25 -80 219 -268 -3 -122 203 -168 -10 264 -130 60 168 197 -234 54 341 -100 -242 457 -118 -226
3473 -226 75 45 -213 -137 302 -430 -37 195 -36 -333 81 93 -165 94 184 -75 50 298 -23 -274 93
3494 93 423 -219 -73 55 -176 -188 338 57 -136 -52 -7 -501 3 164 -142 -171 125 142 -201 27 258 -331
3516 -331 69 67 -25 76 296 151 -45 -12 163 -49 -154 137 -228 -188 -94 484 -84 -212 -86 -232 -278 247
3538 247 195 -122 164 -78 -186 382 261 192 -193 368 40 -302 -4 7 -156 177 269 -97 -169 -16 239 -203
3560 -203 196 114 -160 -383 122 -165 -185 42 166 -306 -297 157 -283 -201 44 -106 -114 200 141 -199 -52 181 19
3583 19 -333 168 -247 -81 45 226 -198 27 373 121 -384 295 -23 -383 144 110 -149 -183 -26 -48 -330
3604 -330 24 27 -32 -61 17 -179 -93 -11 -13 -254 268 176 -107 -137 302 90 -333 194 215 -207 96 106 -229 -312 354
3629 354 -134 -147 149 4 -335 -5 44 -216 -68 350 -4 -284 -33 108 103 107 297 -236 -170 458 -70 -199
3651 -199 -109 528 -307 -20 116 -35 34 233 108 -191 74 -13 -50 -84 129 -74 -162 161 -103 -85 -104 198 -51
3674 -51 -326 83 -93 -166 -17 232 -265 71 230 -340 -330 463 -74 -426 142 158 8 -152 -41 -149 13
3695 13 185 -100 -167 -10 111 -109 -121 321 -72 148 87 -46 -257 -54 208 -109 -31 360 161 -188 418 200
3717 200 -275 -44 160 -119 -113 264 -82 -55 194 28 -86 50 260 -282 -42 216 -116 -391 -15 213 -72
3738 -72 -47 230 -75 -248 175 112 -196 219 136 183 -226 306 -32 -48 119 104 -104 -3 212 66 14 180 -52
3761 -52 -232 -34 -33 -119 -107 121 -47 74 -133 139 -286 10 -149 -50 -145 270 9 -62 146 23 -218 155 191
3784 191 23 -34 259 -120 -388 215 -1 -125 135 385 28 -218 325 192 -296 -151 160 -328 27 124 -291
3805 -291 -201 6 248 -85 -109 164 -319 -228 133 -80 -237 181 -83 -33 32 422 -211 -123 124 68 -169 75
3827 75 320 -129 404 138 -183 -104 230 -34 -515 -81 161 -11 235 -18 -3 14 212 -99 -219 166 249 -261
3849 -261 0 1 -19 2 330 223 -226 -46 282 -406 -147 184 -189 -281 181 -284 -343 8 -19 -166 -275 14
3871 14 278 -47 -3 -323 27 37 25 -194 -172 235 -102 -180 182 -1 -160 -261 521 -115 -373 66 -168 -227
3893 -227 -34 66 -91 -214 55 -85 -310 127 -5 -101 -184 35 -45 -58 -186 23 -194 309 206 -178 92
3914 92 68 -81 -336 53 148 -208 32 80 -327 -129 16 -120 55 358 87 -170 196 27 -160 171 -232
3935 -232 -389 35 -120 110 -50 141 -117 47 -83 207 21 -179 220 -44 -175 184 223 -106 -1 14 -35
3956 -35 -8 160 198 -227 204 174 -140 176 131 -207 50 -122 147 -385 -59 175 -29 -55 -177 114 -46 58
3978 58 121 50 66 -62 138 -170 109 132 -253 126 -236 197 -43 95 -171 -60 179 167 -397 174 -151 -42
4000 -42 -92 114 -8 -164 -5 -62 68 3 193 -231 -275 24 85 -207 -115 110 168 -199 219 30 -203 216 125
4023 125 -114 111 -290 -163 -232 282 94 -22 29 55 -160 197 178 -74 -199 354 297 -211 -11 169 -84 250
4045 250 216 -9 -82 96 108 97 140 -247 229 39 -84 69 -376 64 -160 -281 -54 126 -319 -45 -16 -166
4067 -166 -41 28 -19 -39 43 -88 -43 -92 174 -182 -96 22 -48 -273 -78 284 -118 -250 113 -209 -31 100 219
4090 219 -137 -49 -4 -208 62 165 191 -131 -62 156 -16 -10 21 11 51 266 345 -36 -12 -25 -259 -225 -33 168
4114 168 89 269 -30 43 114 120 -114 -28 -51 5 -123 -190 86 -177 210 289 -148 94 113 -41 -239 71 180 54
4138 54 136 67 23 -196 279 141 -240 -98 265 58 -160 194 191 -83 96 133 -153 111 117 -231 -158 51 43 -363
4162 -363 -52 10 -66 -19 109 38 18 77 -318 100 -100 -81 8 58 -84 -51 317 37 -72 24 -56 54 -54 177
4186 177 59 -140 -13 83 32 -175 -217 55 42 -71 77 -60 -309 114 -90 -165 -152 127 169 -184 325 233 -156
4209 -156 115 162 -132 43 116 152 -9 -11 -244 -247 -165 -152 -143 -66 144 -182 40 -9 27 182 -16 64 11 335 217
4234 217 -30 -126 159 200 -27 313 -1 281 -35 32 59 40 21 263 -84 63 129 -539 -136 -94 147 3 -102
4257 -102 176 -240 308 198 -5 -124 450 93 84 360 169 -171 -36 426 -84 35 -16 -44 -276 192 121 -104
4279 -104 80 27 20 -148 192 -103 180 -73 216 -60 61 4 -85 -32 -40 185 -137 66 -66 -184 105 -50 141
4302 141 -100 286 131 -99 -125 155 -49 -191 -160 -76 33 -151 57 -53 -201 -33 -138 71 281 200 -61
4323 -61 -12 159 -258 15 -4 -4 -159 -81 265 -58 -107 89 -184 -66 274 27 -83 83 98 -47 203 -27 1
4346 1 -39 284 -39 -268 148 175 -291 -9 352 -194 -252 -66 -77 -131 -352 271 -151 12 44 -57 47 251 -41
4369 -41 -84 87 257 18 -144 248 47 -58 -148 11 -15 113 202 -309 -168 79 -138 -102 112 294 -15 -217
4391 -217 221 -394 -190 309 -41 -349 233 -113 344 2 -26 -141 -221 231 -85 -69 -90 27 -14 136 -195 -62
4413 -62 -294 102 115 -93 50 48 -157 2 279 -39 74 2 275 13 316 280 55 -36 35 200 74 7 223
4436 223 124 -17 15 85 -210 146 -56 -112 109 49 -190 29 97 -314 85 -129 -209 16 -107 132 159 -118 6
4459 6 -89 26 -168 281 -52 -18 166 55 101 -78 241 -97 128 -26 94 -222 238 -53 -179 92 -190 -2
4481 -2 -81 123 -100 -152 108 -155 -36 50 134 88 35 130 -166 -136 205 18 -91 -111 72 41 177 147 -233 89
4505 89 136 -9 115 14 78 -24 9 12 -16 -381 10 -66 -351 73 87 -112 -109 118 208 -15 115 -162 47 -207
4529 -207 105 228 -50 337 -124 12 106 49 -185 -74 -16 13 62 -362 112 47 185 66 -96 34 181 -231
4551 -231 -57 223 -13 -48 362 -74 -209 22 77 272 27 86 -188 27 53 422 250 -194 56 53 -157 291
4573 291 -38 -164 -12 123 -224 -223 -20 94 -123 -2 74 -123 125 -122 253 -64 223 176 91 102 137 34
4595 34 -104 84 252 -46 61 85 -134 -23 165 -60 -89 186 -24 -45 112 -87 12 -205 -13 107 -214 286
4617 286 -51 131 193 281 -89 41 187 48 41 72 92 -65 -27 214 -111 -250 90 -260 -117 199 -176 100
4639 100 -278 8 5 -164 95 -32 56 102 -101 -224 -143 265 -21 11 -32 -186 296 87 137 -10 107 37 -9
4662 -9 -87 -34 -13 -19 92 140 5 111 107 -95 79 -59 116 -214 169 133 112 -120 273 126 221 31 164 69 42
4687 42 44 58 -94 146 133 -76 -3 166 105 209 217 16 64 -3 46 -107 -36 152 105 23 104 -122 90 231 177 -135
4713 -135 -125 132 -98 -5 -71 -34 167 -99 -52 17 -90 206 74 -198 65 38 -254 120 109 -138 -146 -242 -14 -80
4737 -80 214 -108 -76 38 -2 -149 -65 21 -116 -207 -199 -124 -191 243 310 108 -144 -118 52 22 -16 118 39 -268 246
4762 246 -66 91 31 98 -7 227 -68 -157 197 261 -184 32 155 229 -100 -117 -46 -133 -178 12 57 -113 101
4785 101 -56 23 333 -127 -40 -44 66 -74 81 -73 -41 -229 -56 20 -54 73 114 -17 -82 193 158 -207 209
4808 209 53 84 89 -31 -5 -85 259 193 -211 228 191 266 183 -136 -59 59 0 -89 -151 -87 228 152 11 2 -132 -28
4834 -28 86 50 80 -257 215 -28 98 29 -115 376 59 -9 -89 -173 -113 27 67 19 -114 -296 64 -105 -267
4857 -267 -12 139 200 -118 65 -94 -142 -32 173 -35 -123 -68 74 0 139 322 -80 -145 -49 63 -83 107
4879 107 83 -211 -48 -35 -263 1 190 20 -60 -27 -154 -156 43 66 -93 13 130 53 -256 94 303 -63 -3
4902 -3 166 -29 135 44 233 96 34 -164 -14 143 119 106 -139 49 70 13 251 -137 80 -42 46 -4 9 189
4926 189 -33 -176 160 227 -106 15 -29 -77 138 -58 -110 -86 85 31 169 -119 15 79 -83 74 -37 160
4948 160 -4 475 46 194 271 -318 -244 30 -247 -15 29 -83 -265 -256 14 138 -22 -70 26 70 -199 33 67
4971 67 111 -93 192 -75 -28 113 106 -120 113 45 168 20 142 -84 -159 -30 -61 87 -31 141 -91 -172 -91
4994 -91 -235 -205 122 -4 -251 -28 -32 60 102 -295 173 112 37 112 -215 52 -23 -35 -40 -6 -223 9 -49 67 -64
5019 -64 -112 -152 -166 -161 -84 12 -21 114 163 84 -60 124 -66 -28 69 -5 -59 -71 225 81 6 -100 37 -20 89 -45
5045 -45 -49 274 131 159 152 241 -114 -129 83 143 -149 74 206 -11 -15 -204 -22 8 18 118 -82 188 113 -122 -135
5070 -135 -153 -100 33 25 34 -146 175 -81 9 21 164 2 -38 -112 13 99 -54 -70 62 -238 -224 100 -164 -2
5094 -2 -28 -63 32 19 21 3 -85 -112 -115 57 -177 14 110 164 -182 -206 4 -70 58 131 17 15 -186 183 46 -207 -124
5121 -124 6 -9 168 38 -40 91 90 277 222 -84 -44 -95 -39 44 75 -31 63 138 -298 488 -18 -160 134 100
5145 100 37 -94 48 87 15 72 218 155 60 -20 -136 -250 -251 -27 111 9 -117 -350 -15 156 -128 163 155 58
5169 58 -113 215 -218 21 95 -224 157 -64 55 -185 11 -78 72 -46 53 9 118 -24 -1 -3 -56 -117 78
5192 78 -139 -126 19 -150 17 245 118 178 -165 57 75 -176 -229 96 153 22 -86 155 44 156 34 5
5214 5 180 -32 -170 -64 -6 -68 -107 136 123 -75 32 -30 74 -137 8 -114 129 -8 -89 291 -77 41 45
5237 45 4 145 -4 -92 -163 92 -160 46 -104 62 -16 73 105 4 72 353 -36 54 -162 -173 26 139 -69
5260 -69 9 -17 -59 -111 103 62 -52 -117 -126 227 -76 -35 90 -181 -66 70 192 11 -52 6 -187 -174 343 84
5284 84 97 -61 -33 -182 83 2 82 -118 81 99 -221 184 61 14 74 58 -80 94 -108 70 75 14 221 -165
5308 -165 -103 260 -23 -2 119 -57 8 -139 -16 38 -79 -32 -16 337 107 73 -164 -169 -61 97 -25 29 142
5331 142 -56 71 -243 282 69 -97 -109 -59 49 -101 194 -122 -262 -73 101 -52 -314 -50 120 -61 131
5352 131 106 -218 86 69 -4 -132 159 24 -58 31 210 76 -54 -30 15 -149 -18 25 31 161 -176 1 129
5375 129 15 -77 -258 54 -115 88 -1 -198 -40 -28 -60 77 151 -98 -172 -4 37 54 11 -274 48 198 -112
5398 -112 -35 -100 -32 50 50 -140 89 -139 -283 -2 68 -20 33 62 -80 -193 38 74 -164 94 116 55 166 152 -283
5423 -283 -199 -80 -102 266 -171 -143 10 -50 -10 -51 205 18 35 108 27 -11 47 -360 74 281 -77 71 88 -41
5447 -41 76 -1 6 -13 -20 -24 -43 -85 -51 -32 -18 26 -101 278 -205 -74 77 -108 131 14 28 156 176 354 1 54
5473 54 144 111 -157 58 147 104 -137 -5 12 12 -80 13 86 -136 139 -209 -57 -24 -27 -36 64 37 26 -184 185 -145
5499 -145 -54 -338 133 324 -117 -140 40 164 36 -37 42 112 176 -98 283 -158 56 -10 -81 175 -125 10 -148
5522 -148 -52 -97 195 145 8 52 -116 147 79 -97 393 64 50 -180 -127 225 3 -18 48 -63 -161 -25 -108 -99
5546 -99 76 -27 57 105 -232 34 -209 145 -127 133 188 54 -6 93 124 -38 131 66 -82 -103 61 28 271
5569 271 217 48 -41 -74 122 73 -31 -139 -73 115 21 -52 -67 156 87 -65 -50 -122 63 203 78 72 166 -45 -127
5594 -127 -66 183 289 -59 -57 -175 32 -20 -43 -165 20 -181 30 225 19 29 75 -215 119 -139 44 16 -52
5617 -52 31 -66 -33 38 -59 -29 210 281 -50 129 -88 121 132 -138 -161 -15 165 208 6 52 5 -198 210 60
5641 60 23 119 38 -73 -117 186 -90 -62 -82 49 30 -29 87 188 30 4 -208 85 -61 -1 164 165 130 25 47
5666 47 -120 -3 70 50 54 137 -72 -117 -147 19 -171 -77 -211 -130 -73 42 -83 -265 80 109 -152 -65 -58 -183 -15
5691 -15 145 34 134 -97 251 -75 -75 15 19 11 161 100 107 54 -179 -126 -92 -3 37 170 177 133 -84 109 51 33 65
5718 65 -24 -136 46 56 46 -73 -111 -71 186 255 -62 49 -76 -142 47 -102 -84 83 -16 186 38 129 -153 68
5742 68 205 48 177 -66 -37 153 186 -20 -29 -10 -297 307 58 -230 68 38 -210 -25 213 -224 -82 9 -215
5765 -215 116 148 22 -35 137 220 -24 216 -294 22 0 109 146 -300 59 80 85 197 -196 76 132 261 -57
5788 -57 101 118 124 32 195 -58 46 127 33 367 -80 75 157 -198 -22 -73 87 39 11 -157 22 -65 -106 -32 -393
5813 -393 39 -111 -9 17 241 49 130 216 18 210 83 3 -153 -36 -23 -12 -201 -92 102 -62 -78 94
5835 94 -309 29 -107 -162 -276 -144 -140 -15 -187 57 33 34 -251 42 70 -77 -52 173 70 -156 147 -134 -26
5858 -26 142 -17 -124 -124 -84 -116 -177 -276 136 -2 -103 -27 220 43 134 160 -17 137 -140 123 47 56 -19 190 86
5883 86 -180 28 -253 11 -20 -61 228 -159 -249 -119 43 146 -8 -41 27 152 20 -79 83 121 -216 44 49
5906 49 134 -119 20 -5 78 244 -214 97 0 37 43 143 137 177 4 63 -46 -61 37 -47 -6 -29 -77 -28 123 97 -46
5933 -46 -10 122 181 50 -35 104 -61 -178 7 -57 44 145 -77 -42 -98 -40 89 -13 -142 30 -63 7 -177
5956 -177 -46 142 20 111 -214 -151 -176 159 -68 -299 89 136 189 -65 -8 -146 246 133 157 105 200 63 -112
5979 -112 75 12 113 147 12 168 -130 11 -167 -242 -215 7 155 -149 105 129 90 -83 93 -114 49 103
6001 103 54 -97 -19 58 34 116 45 -37 46 49 -170 22 -292 225 121 4 -163 296 -108 -121 62 -36 -76 -90 45
6026 45 -182 -85 269 87 44 -322 -181 -182 54 159 -168 -101 -234 19 -25 -28 277 139 -183 -93 -67 -77 82 50
6050 50 59 22 -44 -185 62 -94 39 -228 263 -61 -193 -28 28 -126 125 53 1 49 27 42 121 113 41 -282 68
6075 68 204 105 -77 -261 44 117 173 -92 -99 -8 171 216 -2 77 -47 -66 121 268 -122 316 -14 -71 -203 14
6099 14 -101 -100 46 -207 30 3 -244 -200 28 48 51 12 79 -31 -19 153 83 -11 26 -136 -21 -38 111 148 -6
6124 -6 -73 -124 -94 -49 -366 -6 -38 -37 -187 -227 92 139 212 -61 -139 63 32 92 -89 45 126 -167 186 -235 283
6149 283 -8 -109 124 -151 144 49 85 27 164 -28 204 -185 155 -120 -44 -129 147 133 -172 -35 -162 128
6171 128 192 87 -47 -81 -211 138 -83 -96 114 -75 48 230 -166 -23 -97 -183 308 -65 -96 50 -240 141
6193 141 240 29 243 186 41 122 -4 106 182 128 85 211 -114 82 64 182 22 231 -76 -37 -51 178 -106
6216 -106 -34 -77 -25 41 6 -89 -240 -117 -180 -290 -76 -76 -75 84 90 -209 -303 79 -69 -132 191 79 51 -104 26
6241 26 -106 -64 29 140 -47 -82 88 -35 214 9 -233 -281 155 32 52 36 -122 -56 -14 46 -56 -285 -40
6264 -40 113 -13 -175 6 162 -102 -142 -106 -59 -251 103 -32 155 -198 220 -91 26 -53 130 75 78 -140 41
6287 41 -82 -211 156 -26 -30 -67 34 -67 -154 -93 -66 -160 -103 -29 46 -23 47 -27 152 -84 118 109 183 39 -143 -103
6313 -103 10 35 48 -22 -170 37 -47 148 -139 146 74 -12 -9 -115 -136 35 -200 37 151 -83 102 51 151
6336 151 108 155 50 22 -67 219 75 -21 -50 -200 -56 195 -214 46 -44 -99 98 165 -19 23 83 -64 -261 11
6360 11 94 106 153 163 -64 -88 204 175 -55 -22 -51 -34 -112 113 -299 94 15 -108 68 -2 83 221 -126 -114 -21
6385 -21 -47 45 10 46 30 271 115 4 155 -3 153 68 3 43 -124 -49 46 -74 52 53 157 106 14 229 -55
6410 -55 -82 -118 -60 19 218 -66 -86 -17 156 74 -112 67 -111 -169 -150 -161 95 -122 43 95 -264 -218 -223 134 -3
6435 -3 -168 -139 -126 23 32 6 43 97 96 108 -189 60 9 140 184 -160 102 97 -82 388 -149 446 -101 -168 223 127
6461 127 66 -10 83 -130 33 120 24 -63 125 452 -160 -46 47 74 131 -6 172 98 25 78 -104 2 194 201 10
6486 10 -130 131 33 85 -177 -207 193 30 -132 -24 142 189 -110 147 -33 -86 -75 -11 57 -4 -93 -162 -37 -21
6510 -21 -22 -35 -76 0 38 -95 -129 -64 -378 -16 -112 -63 39 -146 95 -110 -21 293 -64 120 83 -95 14 -112
6534 -112 81 136 -142 54 -22 -213 -45 -184 257 -253 69 53 -14 -235 10 -148 72 43 160 -101 133 -59
6556 -59 -84 -104 -195 36 -49 98 108 12 -159 -118 -142 -37 62 66 31 -164 154 -44 -39 41 -28 354 -73 -28 -118 85
6582 85 159 -148 -26 -83 -203 325 -7 1 -99 -15 267 -18 68 -199 -155 -283 -30 -246 -47 -148 -82 -93 -101 122
6606 122 219 -56 36 106 -66 127 102 -195 -55 228 -152 44 -116 -49 -44 200 -127 160 -43 -40 -7 179 -72
6629 -72 56 -70 -95 -103 -265 -39 231 102 38 209 -6 -12 -176 -158 -142 -90 120 21 -33 -10 37 31 107 -48 -68 -221
6655 -221 44 -7 -192 38 135 52 190 62 184 211 -104 139 -26 -186 -96 140 44 3 -16 61 -11 -187 -194 32
6679 32 -21 -63 -13 0 -203 -201 -93 46 55 137 242 -209 -125 -48 25 179 287 112 -115 78 49 90 -189 349 91
6704 91 -222 -170 13 228 142 76 -133 -73 139 -153 -163 -51 151 28 -9 -77 87 -7 -106 201 -224 -80 62
6727 62 185 -113 -94 15 77 -58 -118 12 -28 16 179 59 183 -241 28 163 166 -102 193 -58 204 211 -274
6750 -274 -4 -135 -273 32 -277 210 -40 -398 298 -136 -11 3 -5 274 81 -207 51 -25 -92 -98 22 -103
6772 -103 162 101 185 -83 -23 214 108 -140 -24 -208 9 34 -34 178 259 236 114 -23 -22 -49 -23 259 -66 -146
6796 -146 -284 222 126 6 -54 -49 -159 49 217 -140 100 125 -10 94 -133 -130 88 106 4 -202 -197 -88 -74 -170
6820 -170 -208 15 47 -65 143 -47 -154 -42 227 230 45 -37 26 25 -46 97 -41 22 80 -120 375 -18 -300 -108
6844 -108 111 -28 18 107 85 -55 -36 -136 -141 159 -44 -245 99 278 10 98 213 44 43 -130 24 -373 29
6867 29 131 -156 168 -106 54 11 -2 182 -32 253 60 -113 -114 260 -31 -366 143 -55 -32 -128 -125 -291 307
6890 307 -4 -18 -147 -124 327 138 76 29 -169 -128 -160 76 50 65 -3 117 -147 -133 142 58 177 -113 91 -96
6914 -96 79 64 4 32 47 84 -114 44 67 -140 27 55 -106 -108 -241 13 -162 26 -71 -112 -187 -153 49 35 72
6939 72 -132 128 -64 -162 -4 69 7 -23 -182 -79 16 -16 40 -47 124 108 -56 229 67 143 100 -111 -196 -123 -106
6964 -106 57 -15 146 -233 -70 -153 259 -104 -280 214 156 9 92 246 154 -64 -20 -294 -9 28 -5 -103 -120
6987 -120 198 -196 73 -229 16 -59 190 55 41 119 387 247 32 -17 -136 208 -134 7 -130 68 -99
7008 -99 -383 -45 -100 51 -83 77 43 86 -158 -142 -88 -128 -180 112 266 14 35 4 -73 -182 -74 -240 -14 -163
7032 -163 -164 107 -165 101 61 -33 79 -16 -200 -47 -122 14 71 -148 -156 -8 304 67 -173 -122 -86 -113 -18 28 -7
7057 -7 -230 383 -103 -104 -93 -106 -22 -151 90 -8 -96 160 -8 -103 298 -173 64 -18 210 -24 -46 90 -101 171
7081 171 -118 -120 -19 37 -65 -99 15 -48 27 106 -81 68 -81 81 138 -19 -102 -191 271 -32 125 28 97 225
7105 225 269 51 -34 -59 82 14 -9 -55 74 -123 -77 3 -109 148 87 33 89 170 36 -195 6 -31 -131 -248
7129 -248 192 21 334 57 31 39 14 25 -151 -93 -67 160 123 -99 -107 129 -58 -105 63 -55 -66 118 124 85 -105
7154 -105 8 -84 24 -257 140 -4 61 101 52 -172 -169 -175 90 -65 85 69 83 172 -11 -35 -103 -128 92 -233 -130
7179 -130 91 18 -32 -63 -197 153 144 -24 -132 -42 93 214 -126 67 -118 98 57 -258 175 68 -205 69
7201 69 304 -200 -144 3 -152 213 56 -78 -226 -334 58 -56 25 112 123 109 19 33 221 12 23 -34 144
7224 144 -130 -355 -87 202 -259 -75 -145 33 -231 -234 -58 -114 -25 116 -107 -87 360 42 -182 -74 115 -92
7246 -92 -19 106 205 34 82 -163 151 -25 -164 -45 -17 112 112 42 26 12 6 -18 206 15 -136 54 201 195 -71
7271 -71 -141 9 -82 -217 -65 34 -30 160 -49 3 17 -195 -8 66 -26 39 2 -49 -109 67 143 -18 -7 14 -46 -12
7297 -12 188 -68 65 49 -98 -130 -61 -119 -36 -161 -7 27 30 -52 24 28 -34 -174 27 255 18 3 133 16 -212
7322 -212 56 43 -8 134 -21 -30 -48 179 68 2 6 -135 -3 11 143 96 -254 -73 308 0 106 -44 -141 -65
7346 -65 9 36 151 -223 -20 -57 104 -27 66 102 -130 -109 -234 -44 50 -168 -75 -57 -198 -102 -86 -34 27 -41 -142
7371 -142 71 -118 124 45 8 165 -120 201 223 20 -127 14 170 122 233 34 -97 -111 99 120 342 -102
7393 -102 -152 -7 -40 72 235 -4 -45 31 -203 44 -97 -15 25 -139 86 -225 -45 -154 -167 38 125 -126 47
7416 47 99 85 16 34 -16 -17 -40 -100 121 -38 20 -152 299 162 151 -209 -31 -150 60 95 152 56 -70 -6 -212
7441 -212 -160 -254 85 -69 -25 -218 20 -109 -20 -264 -15 0 11 171 66 349 3 -118 -11 153 21 -122
7463 -122 -45 107 197 20 -7 -280 112 -122 28 14 -288 -89 -137 81 -153 -196 34 -231 -231 49 94 26 -142
7486 -142 127 147 -80 89 210 108 -69 189 -68 -204 -100 -110 -235 -199 55 -11 -198 -126 -140 -209 113 163 -69
7509 -69 101 179 -110 52 300 -187 333 -42 -75 -44 59 103 -28 176 182 136 90 26 -231 4 -25 76 -97 -52
7533 -52 -53 -90 -101 -80 -31 -189 26 -99 103 49 -66 -162 -62 -36 27 8 -47 -138 -202 -44 -69 -101 -59 -100 -65 185 51
7560 51 -103 -183 -166 1 -81 -153 337 337 -22 69 -75 1 22 -58 101 16 123 -9 -69 -99 -57 -249 -146 -80 57
7585 57 -29 -74 33 -97 41 -331 -76 147 -82 -86 -60 148 53 7 -134 76 169 76 172 83 110 452 7 -146
7609 -146 32 -80 -116 39 -46 -118 -173 183 21 -24 -48 -19 -46 -118 -61 16 -23 3 -176 -28 103 88 162 91 -257
7634 -257 -8 -34 -183 -176 29 273 162 214 -117 129 67 137 -207 -296 94 -46 -259 154 -185 31 -141 315
7656 315 127 -151 134 -78 127 169 -196 218 -30 -125 19 34 -4 -143 -46 59 -138 27 -41 -170 -17 -28
7678 -28 117 106 104 110 -30 209 63 -135 -1 18 41 143 105 95 206 196 59 34 63 -186 -157 291 -189 163 216
7703 216 -19 99 -112 49 137 -76 40 290 -4 41 128 -88 -41 -55 -53 -92 -129 -29 -46 41 67 58 177 45 -89
7728 -89 71 -74 52 -120 -6 115 -11 121 26 -222 39 71 112 -3 -8 -79 -35 -8 -107 -168 198 -34 95 -256
7752 -256 48 -12 -76 172 -65 -10 44 -139 -50 -142 181 364 243 139 184 -87 142 51 290 -75 -59 131 -30
7775 -30 39 45 77 51 105 57 117 48 248 -176 5 -231 -29 174 -24 -38 33 164 -166 -83 212 251 130 -119 53
7800 53 -25 -227 161 111 26 -133 135 11 -40 74 123 -181 164 -151 33 -155 -200 -14 -41 155 58 192 196 -62
7824 -62 -66 -165 276 -162 5 90 -105 70 183 108 -335 182 34 17 67 59 224 -200 -21 -155 55 186 -150
7847 -150 256 -56 -176 253 104 113 -147 -44 29 -156 109 138 25 192 115 92 38 156 53 148 -68 -112 -27
7870 -27 -63 -174 -99 3 237 -42 89 -157 85 395 36 39 -127 126 -146 261 144 99 -188 57 251 41
7892 41 -85 157 139 134 -59 72 -12 103 76 -218 213 8 -290 104 118 -200 21 -72 144 -301 -105 -123 -112
7915 -112 46 -116 -73 -141 179 197 -4 -14 -29 98 -40 171 -255 -106 -280 -35 107 -76 -211 -95 55 24
7937 24 42 -248 83 67 178 -151 86 55 -19 -29 -38 89 -22 7 257 139 -55 221 125 1 143 5 -81 -81
7961 -81 32 -86 -80 -15 31 -311 29 -12 82 138 -138 192 16 -117 -47 31 200 -49 206 123 -68 93 -97 -14
7985 -14 -50 99 390 -217 -22 -141 -36 377 -92 -101 241 -37 -68 -92 19 78 14 136 -72 -243 -5 -211 -155
8008 -155 53 -85 -52 218 260 2 32 -204 -80 87 -48 34 115 52 167 60 -142 -86 69 -331 139 -163
8030 -163 63 56 125 -15 -118 36 -12 146 100 182 -205 126 97 105 101 113 116 -138 -192 -24 -45 173 348 -177 -218 184
8056 184 80 -56 -117 17 -138 39 132 237 157 276 168 39 -27 18 82 207 78 146 138 15 117 -199 10
8079 10 -104 -32 89 138 65 -216 176 60 -55 -12 -21 -113 -89 228 -62 153 56 72 -2 10 -11 -34 203 36 12
8104 12 -284 -86 227 75 -287 -219 218 36 25 -108 -8 110 -27 141 55 120 20 107 29 69 -118 -14 4
8127 4 160 62 -261 122 -54 -57 58 -250 -58 -53 -122 12 69 47 67 158 20 61 -32 250 -83 27 162 -39 120
8152 120 -55 21 -48 36 75 48 -93 67 73 -177 -66 -125 -33 -125 26 206 63 131 95 32 -36 71 27 70 -310
8177 -310 -49 -210 -88 94 4 18 153 69 129 -62 -67 -79 103 53
8191E3
$$ Imaginary data points
##PAGE= N=2
##DATA TABLE= (X++(I..I)), XYDATA
0 0 0 0 0 0 0 0 0 0 0 0 0 0 0 0 8 -8 8 -8 8 -8 16 -16 16 -24 24 -31 32 -40 45 -49 56 -64 73 -85 93 -103 117
37 117 -133 146 -161 179 -198 219 -243 267 -295 326 -360 393 -434 477 -528 582 -642 712 -792
56 -792 882 -991 1116 -1270 1460 -1700 2015 -2445 3066 -4038 5722 -9206 19075 -98928 -322806
71 -322806 166072 253588 -231015 -158589 271312 64734 -255313 24027 219814 -80502
81 -80502 -147799 118941 86804 -124527 -28779 109703 -9689 -83571 29741 48631 -44404
92 -44404 -30225 41008 9170 -44154 -5709 35585 -7977 -36736 19976 37486 -36791 -34898
104 -34898 55123 27374 -65409 -1740 79128 -20908 -75402 50755 67835 -64522 -41198
115 -41198 73189 13114 -68976 10986 52202 -26660 -32721 25283 6117 -20664 7986 3686
127 3686 -16748 6787 8636 -18966 2819 21744 -14576 -15115 22049 2505 -19278 15259 14649
140 14649 -23249 -169 24442 -12178 -12202 24923 -408 -25591 14793 16740 -24562 -177 26332
153 26332 -17832 -20548 26669 4177 -28515 12659 17300 -27532 -1001 29247 -20523 -19383 37921
166 37921 -2819 -48286 28576 44959 -51775 -26392 67681 -644 -70130 30982 61027 -51576
178 -51576 -35954 63430 6732 -59216 23265 46260 -41113 -22623 47127 -2887 -41334 22691
190 22691 26317 -34703 -10674 32151 -7064 -26014 15617 12093 -20954 -4187 16384 -1908
202 -1908 -10637 3070 6999 -828 -6365 186 14978 3136 -20535 4302 29474 -12518 -27888
215 -27888 29600 23134 -42858 -10254 49734 -9316 -48890 27778 34913 -47900 -19384 52486
227 52486 -5596 -51875 23921 36401 -40633 -19520 45077 1245 -38842 14051 28214 -19222
239 -19222 -10573 22233 1949 -11898 7824 4877 -5180 5826 3177 -8734 2183 6661 -7339
252 -7339 -3339 5788 -4614 -4553 2704 -6008 -2849 9934 -7102 -14588 15561 8342 -25047 3242
266 3242 31754 -17141 -26817 34353 17744 -41370 3899 46909 -20929 -36661 39452 21996
278 21996 -46113 175 42885 -21926 -32147 33826 10507 -40238 7905 30847 -29244 -18847
290 -18847 37137 -588 -38215 16828 28671 -28407 -14642 33478 2330 -27701 9629 20685
302 20685 -11813 -8162 12741 2777 -5939 528 975 2659 2790 -7640 -2825 10926 -3916 -14065
316 -14065 10107 9895 -18517 -4535 19016 -6683 -16719 15023 8004 -20424 3165 19223 -13611
329 -13611 -11074 22348 433 -23382 12373 19975 -20038 -8848 24679 -1528 -21549 11233
341 11233 14339 -14517 -3801 12393 -5122 -5966 9118 -3592 -8036 11067 91 -15877 8515
354 8515 13528 -17624 -7180 21165 -4104 -20388 13909 13486 -19763 -3285 19628 -7488 -13304
367 -13304 15662 4496 -16193 7236 12531 -14161 -1663 18394 -7901 -14023 17343 6291
379 6291 -20868 4350 18907 -14283 -12493 18105 1269 -18753 6658 11169 -14676 -3714 13368
392 13368 -6608 -9605 12280 1072 -14239 7607 11391 -12169 -2845 15503 -3952 -10456 11340
405 11340 5992 -11273 3230 9340 -8074 -2277 10016 -5038 -7653 9446 -566 -12428 6584
418 6584 7562 -14785 -2452 14351 -8144 -13038 14052 4965 -17317 4223 15360 -11226 -7161
431 -7161 17239 -396 -14213 11144 10221 -14665 985 16764 -8593 -11130 15397 2845 -17508
444 -17508 5318 12484 -13806 -6911 14201 -4005 -13835 9031 5421 -14267 1634 11730 -9180
457 -9180 -6012 13229 -1212 -11140 9663 7612 -11639 1842 13005 -6976 -6415 12569 691
470 691 -11078 6907 6668 -11149 -674 10294 -7346 -7459 10090 -1730 -12413 7003 6691 -13295
484 -13295 -324 12681 -8021 -8981 13500 2416 -14568 6855 12349 -11567 -4098 15834 -2586
497 -2586 -12130 10713 7109 -13698 1436 13014 -8219 -8193 11610 -68 -12196 6029 6999 -11852
511 -11852 -1562 10575 -6762 -7382 10294 483 -11354 5983 7799 -10720 -1051 12143 -5616
524 -5616 -8274 11369 2360 -12165 5499 9682 -10451 -2690 13326 -3791 -10373 10156 4781
537 4781 -12540 2720 10949 -9110 -5986 11660 -1573 -11293 7458 6527 -11526 -488 10319
550 10319 -6877 -7147 10319 480 -10448 5663 6870 -9666 -659 10669 -5221 -6817 9946
563 9946 2031 -10134 5337 8314 -9451 -1821 11734 -4106 -8704 9898 3298 -12026 2963
576 2963 9834 -9563 -5544 11486 -2450 -11664 7480 6386 -11782 -605 10678 -6262 -7502
589 -7502 10303 1618 -9850 5330 8130 -8181 -1142 10413 -3191 -6429 8971 2595 -8686
602 -8686 3656 6933 -8109 -2493 8463 -4018 -7677 6928 1683 -10368 2753 6595 -8749
615 -8749 -3613 9675 -2840 -8634 8181 4188 -10264 2744 10087 -6970 -4390 11546 156
628 156 -9743 7243 7512 -10004 -446 10934 -5258 -7732 9158 1754 -11352 3333 7346 -9309
642 -9309 -4038 8923 -3310 -8690 7060 2989 -9238 2179 7850 -6551 -3211 9409 -1429
655 -1429 -6734 7360 4539 -8061 2193 8670 -6201 -3926 9493 -867 -8855 5763 5042 -10038
669 -10038 -403 8813 -6061 -6808 8427 486 -9888 3614 6494 -8285 -2179 9405 -3180
682 -3180 -7055 7916 3443 -8619 2904 8154 -6230 -3227 9040 -1168 -7527 6382 4303
695 4303 -7995 845 7699 -5598 -4722 7795 -905 -8080 4812 4110 -8206 236 7588 -5538
709 -5538 -4732 8118 -175 -7910 4893 5537 -8020 -284 8818 -4138 -5899 8348 1864 -8524
723 -8524 3823 7361 -7395 -2673 9047 -2616 -7674 6711 3652 -8885 1367 7768 -6174
736 -6174 -4432 8241 -572 -8178 4725 4738 -7734 -684 7285 -4353 -5189 6846 671 -7060 3426
751 3426 4954 -6269 -584 7119 -3311 -4671 7119 1161 -6841 3973 5567 -6747 -1341 7951
765 7951 -3208 -6583 6854 2321 -8649 1940 6550 -7008 -4185 7833 -1619 -7916 5084
778 5084 3976 -7829 96 7381 -4048 -4463 7507 938 -6481 4216 5437 -5832 -588 7238
792 7238 -2484 -4476 6324 1414 -6243 2718 4542 -5717 -1986 6286 -3113 -5750 5185 1213
806 1213 -7378 2102 5371 -6072 -2352 7153 -1786 -6095 5777 3334 -6794 1507 7189 -4299
820 -4299 -3271 7791 608 -6707 4666 4693 -6686 -742 6735 -3797 -5124 5651 781 -7252
834 -7252 2220 4175 -6147 -2172 6149 -2681 -5432 5154 1738 -6365 2154 5550 -4698 -1757
848 -1757 6763 -829 -5193 5260 3162 -5865 1465 5714 -4256 -3044 6210 -754 -6137 3872 2993
863 2993 -6407 -341 5603 -4097 -4365 5740 64 -6733 3134 4312 -6206 -936 6655 -2470 -4846
878 -4846 5696 2068 -5986 2498 5607 -4432 -2116 6433 -1032 -5109 4661 2382 -5962 819 5230
893 5230 -4353 -2764 5557 -819 -6069 3529 3173 -5972 -43 5577 -3422 -3661 5270 383 -5307 2951
909 2951 3476 -5050 -342 5579 -2191 -3884 5082 1185 -5545 2556 4391 -4829 -1456 5923 -1544
924 -1544 -4954 4811 2054 -5784 1185 5119 -4551 -2746 5681 -687 -5811 3733 2903 -5907 9
939 9 5558 -3304 -3573 5412 371 -5526 2819 4021 -4559 -697 5529 -1600 -3546 4727 1254 -4434
955 -4434 2051 4038 -4170 -815 4998 -1722 -3862 4096 1067 -5508 1381 3886 -4873 -2105 5157
970 5157 -1744 -5058 3898 2408 -5686 978 5166 -3418 -2674 5874 600 -5325 3455 4074 -4522 -555
986 -555 5577 -2075 -4075 4507 1440 -5286 1459 3447 -4151 -2088 4109 -1850 -4274 2843 1204
1001 1204 -4910 1156 3573 -3697 -1322 4480 -1056 -3335 3970 2181 -4179 1619 4485 -3299 -1661
1016 -1661 4987 -377 -4312 3218 2382 -4981 159 4510 -3399 -3601 4465 219 -5685 1727 3367
1031 3367 -4771 -1425 5032 -1523 -3999 3994 1879 -4756 1573 4507 -3052 -1495 4804 -569 -3589
1046 -3589 3457 2211 -3898 741 4092 -3206 -2493 3855 -645 -4056 2476 1827 -4687 -155 3867
1061 3867 -2988 -2855 4236 20 -4348 2426 2985 -4087 -240 4664 -1680 -3303 4440 1247 -4204
1076 -4204 1927 3818 -3632 -1231 4514 -1327 -3926 3194 1628 -4279 650 3515 -3223 -2294 3868
1091 3868 -557 -3977 2852 2186 -4194 121 3834 -2419 -2677 4095 97 -3908 2268 2750 -3569 -295
1107 -295 4023 -1711 -2732 3495 876 -3892 1992 2909 -3398 -997 3946 -1386 -3037 3470 1158
1122 1158 -4352 942 3487 -3315 -1826 3790 -779 -3726 2661 1742 -4154 189 3804 -2428 -2305
1137 -2305 3608 117 -3838 2242 2694 -3399 -125 4245 -1856 -2468 3530 594 -3589 1463 3116
1152 3116 -3200 -774 3487 -1442 -3193 2615 539 -3799 624 2804 -3128 -1782 3555 -1008 -3272
1167 -3272 2609 1596 -3526 594 3577 -2227 -1625 4100 99 -3114 2719 2287 -3444 99 3661
1182 3661 -1772 -2316 3387 68 -3928 1357 2457 -3660 -1123 3410 -1974 -3198 2784 765 -3963
1197 -3963 927 2985 -2660 -1205 3420 -461 -2591 2600 1907 -3128 720 3515 -1987 -1194 3405
1212 3405 -122 -3142 2139 1544 -3290 -326 2950 -2332 -2352 3103 -332 -3481 1599 1769 -3096 -296
1228 -296 3282 -1846 -2110 3346 817 -3538 1941 2891 -2825 -697 3651 -926 -2746 3064 1525 -3260
1244 -3260 803 3077 -2815 -1744 3084 -652 -3426 1737 1557 -3442 -92 2805 -2178 -1783 2872
1259 2872 194 -2981 1812 2068 -2952 -59 3033 -1106 -1758 3011 440 -2885 1533 2130 -3102 -272
1275 -272 3060 -1315 -2495 2935 951 -3455 1164 2834 -2851 -1300 3217 -786 -2974 2210 1499
1290 1499 -3083 192 2942 -2116 -1570 3126 84 -2589 1710 1743 -2605 -132 2950 -1459 -1859 2534
1306 2534 407 -2471 1352 1991 -2443 -117 2654 -1200 -1651 2511 544 -2975 946 2263 -2723
1321 -2723 -692 2947 -1366 -2644 2111 1023 -3076 496 2552 -2060 -1356 3141 -66 -2686 2112
1336 2112 2074 -2826 -12 2891 -1556 -1402 2628 322 -2484 1542 1542 -2555 -479 2516 -1553 -2020 2415
1353 2415 173 -3049 842 1734 -2627 -726 2957 -919 -2259 2345 945 -2640 835 2749 -2004
1368 -2004 -992 2821 -222 -2267 2040 1679 -2674 60 2703 -1431 -1660 2393 -333 -2702 1350
1383 1350 1321 -2513 -401 1995 -1327 -1845 1998 434 -2390 1323 2264 -2328 -226 2560 -895 -1687
1399 -1687 2586 837 -2155 1443 2415 -1828 -959 2658 -564 -2467 1846 1012 -2971 284 2393 -2129
1415 -2129 -1775 2198 -452 -2589 1559 1482 -2372 -109 2412 -1082 -1429 2501 542 -2042 1295 2086
1431 2086 -1982 -490 2455 -806 -1756 2187 779 -2461 525 1890 -1916 -962 2092 -880 -1979
1446 -1979 1679 837 -2410 512 2225 -1807 -1182 2184 50 -2124 1503 1083 -2115 419 2289 -1237
1462 -1237 -1284 2279 485 -2127 1301 1607 -1822 -182 2201 -974 -1608 1992 238 -2129 776 1909
1478 1909 -1890 -491 1909 -745 -2019 1764 830 -2520 656 1985 -1770 -1013 2174 -437 -2056
1493 -2056 1639 1022 -2226 277 2124 -1304 -1200 2150 305 -2102 1114 1386 -2032 -227 1824 -1326
1509 -1326 -1995 1689 358 -2369 796 1449 -1794 -614 2157 -660 -1964 1546 721 -2013 591 1694
1525 1694 -1420 -685 2066 -164 -1576 1582 1009 -1882 860 2174 -1316 -1121 2096 -15 -1849 1177
1541 1177 1058 -2195 -548 1918 -1315 -1672 1771 93 -2047 628 1357 -1887 -442 1722 -831 -1548
1557 -1548 1893 479 -1866 633 1710 -1269 -246 2155 -362 -1469 1651 789 -1657 357 1718
1572 1718 -1482 -1193 1799 -334 -2089 1355 1083 -1889 -187 1854 -1179 -1415 1574 137 -1954 859
1588 859 1572 -1654 -317 2026 -569 -1351 1848 447 -1782 554 1646 -1276 -653 1417 -672 -1610
1604 -1610 1077 404 -1775 273 1319 -1374 -793 1571 -350 -1759 1224 990 -1867 348 1888 -1127
1620 -1127 -896 1927 126 -1442 1159 1329 -1539 58 1839 -986 -1248 1592 440 -1996 696 1415
1636 1415 -1586 -436 1433 -820 -1347 1408 513 -1547 360 1318 -1314 -611 1575 -150 -1196 1442
1652 1442 1058 -1440 616 1556 -853 -675 1597 -59 -1652 1112 878 -1588 68 1536 -880 -1149
1668 -1149 1453 175 -1609 716 1087 -1534 -277 1604 -440 -1265 1277 377 -1611 585 1307 -1410
1684 -1410 -481 1464 -663 -1202 1171 721 -1418 616 1527 -931 -640 1642 -352 -1282 1156 746 -1761
1701 -1761 111 1260 -1190 -955 1207 -69 -1389 913 844 -1678 -462 1363 -947 -896 1507 275
1717 275 -1584 362 1208 -1078 -402 1667 -206 -1431 1065 556 -1510 392 1527 -805 -629 1569
1733 1569 -381 -1248 1208 555 -1775 -155 1276 -932 -778 1052 -179 -1389 819 928 -1503 -57
1749 -57 1156 -547 -926 1307 267 -1289 711 940 -828 -36 1540 -418 -654 1203 592 -1366 203
1766 203 977 -1267 -587 1257 -765 -1455 922 217 -1403 31 1052 -1172 -659 1417 -189 -1143 1016
1783 1016 545 -935 592 1357 -457 -753 1598 410 -1266 470 1035 -1190 -290 1250 -669 -1064
1799 -1064 970 7 -1334 329 646 -1343 -363 1300 -688 -1186 935 445 -1214 496 1115 -760
1815 -760 -278 1537 -182 -759 1084 625 -1143 464 1101 -637 -723 886 -174 -1291 713 778 -1183
1832 -1183 -349 994 -655 -882 1057 189 -1263 417 1096 -1209 -195 1196 -591 -756 1212 246
1848 246 -1001 444 993 -805 -536 1123 -293 -801 1158 534 -1325 303 979 -828 -630 1079 -151
1865 -151 -1158 791 586 -1039 138 1144 -563 -739 860 -28 -1120 519 795 -1099 66 1024
1881 1024 -304 -865 953 295 -985 405 954 -929 -290 1369 -26 -970 1013 404 -1275 36
1897 36 904 -783 -641 837 -367 -1009 715 576 -1393 186 1005 -604 -451 902 -7 -1129 709
1914 709 548 -1180 -59 1071 -440 -408 1140 114 -951 341 643 -927 -265 1207 -424 -790 729
1931 729 385 -1377 311 713 -826 -326 921 -440 -1183 565 413 -950 9 769 -788 -422 935
1948 935 160 -708 820 622 -808 215 1103 -333 -546 1079 -6 -1023 298 210 -757 -367 988
1965 988 -769 -758 876 35 -1011 391 836 -789 -344 852 -65 -757 778 569 -981 518 879
1982 879 -787 -302 773 77 -792 579 204 -1084 170 623 -619 -613 1018 -94 -847 361 656 -599
2000 -599 -204 874 -579 -397 635 82 -809 382 628 -824 -132 1182 -498 -619 552 289 -926
2017 -926 87 801 -666 -237 909 -241 -827 540 277 -775 214 500 -750 -582 958 -74 -477
2034 -477 583 578 -841 -249 1069 -806 -481 744 150 -799 447 557 -768 -119 695 -304 -427 732
2052 732 234 -578 436 809 -795 -183 758 -291 -537 646 240 -897 108 346 -439 -309 641 -28
2070 -28 -814 445 483 -1005 -40 534 -246 -378 859 -5 -678 528 577 -601 52 664 -351 -592 533
2089 533 357 -850 232 450 -684 -274 952 -256 -773 440 58 -729 238 375 -513 -203 611 -286
2107 -286 -625 540 509 -535 357 738 -500 -139 620 -9 -331 608 300 -714 18 697 -462 -434 447
2126 447 137 -867 343 308 -783 -223 790 -298 -453 550 302 -513 112 640 -477 -126 627 -186
2144 -186 -363 489 136 -661 285 555 -468 -40 546 -215 -383 455 199 -833 64 559 -737 -425 335
2163 335 212 -630 286 277 -677 62 712 -274 -372 681 66 -411 363 739 -487 -98 808 -52 -642 659
2183 659 213 -643 107 463 -523 -139 771 -264 -673 335 300 -567 65 482 -555 -196 675 -5 -457
2202 -457 404 472 -210 145 691 -301 -129 676 171 -586 174 408 -682 69 790 -597 -366 505 41 -1008
2222 -1008 128 744 -468 7 539 -404 -405 497 274 -788 79 369 -410 5 721 -121 -681 625 304
2241 304 -554 306 208 -430 -399 729 -136 -482 475 251 -675 -81 524 -465 -137 462 -33 -493 137 60 -328
2262 -328 -227 614 -266 -499 647 87 -618 626 362 -494 -153 666 -20 -497 462 276 -719 168 481
2281 481 -247 -93 555 -7 -464 263 129 -428 109 265 -514 -188 467 88 -528 181 372 -356 -51 443
2301 443 -215 -472 624 296 -381 594 409 -198 -45 446 -320 -633 599 63 -696 222 449 -467 -109
2320 -109 394 -254 -138 269 213 -586 -15 508 -619 -159 421 67 -238 426 342 -249 -88 700 -383 -146
2340 -146 540 248 -598 300 258 -465 151 385 -362 -540 534 24 -519 33 227 -370 -533 667 -14 -477
2360 -477 192 146 -547 -156 596 -578 -183 593 -254 -277 302 96 -526 80 370 -251 37 234 -153 -430
2380 -430 465 155 -253 -75 292 -292 -434 535 90 -542 390 297 -330 -269 691 -110 -479 462 -6 -405 99
2401 99 382 -353 -41 571 -475 -410 514 56 -425 271 272 -314 -255 467 -107 -385 339 242 -91 -134 622 -372
2423 -372 -327 295 121 -266 339 318 -372 -312 454 -69 -512 577 38 -191 240 185 -302 -342 429 -192 -561
2444 -561 354 542 -414 50 31 -238 -175 452 -96 -288 334 294 -330 -9 397 -383 -303 593 81 -274 415
2465 415 257 -212 61 169 -50 -68 308 -12 -450 340 424 -495 -22 692 -312 -229 302 34 -646 -44 389
2486 389 -258 -354 569 -255 -222 456 142 -387 173 331 -382 -109 549 71 -419 326 472 -158 132 393 -199
2507 -199 37 367 -135 -432 303 389 -387 157 224 -283 -74 239 50 -373 222 352 -412 -103 91 -174 -155
2528 -155 467 -110 -383 306 13 -384 -183 481 -15 -323 258 74 -213 -78 259 -284 -193 339 -102 -532
2548 -532 202 263 -299 103 260 -110 -320 398 5 -511 160 359 -220 74 721 -127 -135 141 -86 -439 82
2569 82 267 -295 -152 721 -11 -150 388 -164 -709 119 237 -450 -73 461 -248 -288 92 122 -293 98 379
2590 379 -68 -113 568 23 -72 266 278 -388 212 547 -15 -56 338 -245 -521 342 9 -419 -313 299 -97
2611 -97 -208 497 95 -432 330 278 -475 -271 334 -112 -621 192 -48 -201 94 216 -298 -289 423 -119 -389
2632 -389 119 360 -427 10 484 -374 -57 522 -121 -421 150 310 -197 68 342 -193 -469 398 -48 -424
2652 -424 -21 265 -463 -130 317 -305 -410 87 -7 -56 251 465 -312 -157 191 -25 -35 149 39 -176 171
2673 171 305 -212 -41 386 -50 -254 126 155 -322 -93 206 -253 108 256 -99 -164 87 170 -560 6 329
2694 329 -225 -109 365 219 -410 184 380 -77 -14 297 -48 -314 24 -180 -356 172 103 -459 -216 318 -290
2715 -290 -226 121 44 -321 -42 318 18 -335 161 20 -246 527 299 -309 -29 199 -322 -150 520 308 -373
2736 -373 92 320 -293 30 278 0 -266 226 -20 -184 171 73 -174 -144 389 -302 -257 409 140 -81 25
2757 25 254 21 213 248 220 -331 173 264 -219 60 357 -243 -330 108 -239 15 213 136 -179 67 361 -18
2779 -18 -180 229 -25 -169 194 285 -462 -17 431 -323 -256 287 178 -511 281 285 17 -48 206 -134 -262 149
2801 149 203 -409 172 470 -298 -183 83 13 -136 342 -9 -546 -6 278 -60 -98 507 134 -344 393 101
2822 101 -527 -118 343 -288 -135 292 -319 -63 140 217 -270 219 415 -143 -444 281 42 -229 165 378
2842 378 -160 -28 442 -78 -434 44 159 -207 -24 432 -28 -319 289 115 -309 237 302 -390 -80 262
2862 262 -16 -59 56 206 -297 193 54 -235 47 114 -171 -54 210 71 -411 194 189 -515 -290 227 -42
2883 -42 -90 280 17 -457 106 118 51 -80 309 -18 -310 276 292 -314 -83 24 -176 -446 162 159 -417 363
2905 363 -193 -264 -321 248 -148 -405 244 -67 -143 183 426 -396 -72 526 189 -275 346 8 -173 158 230
2926 230 -226 -11 388 -106 -235 213 361 -243 71 124 -167 -341 209 -112 -524 -59 252 -323 50 452
2946 452 -103 -557 332 155 -245 -15 306 -151 -91 366 -147 -216 212 30 -151 -165 -114 -28 -234 399 -108 -406
2968 -406 302 132 -138 126 393 -44 80 269 5 -199 447 209 -138 -56 209 -5 -146 518 -87 35
2988 35 318 169 -170 28 -41 -164 -351 269 48 -274 -106 -6 -215 -4 147 -161 -241 -17 266 -408 99
3009 99 -48 -315 -17 -26 30 -337 160 184 -124 100 672 -174 -224 217 -13 -156 29 103 -291 -70 284 -38
3031 -38 -108 93 164 -358 -6 39 -277 -189 246 -5 -579 228 138 -164 106 331 -230 -249 82 201 -287 304
3053 304 10 -140 23 587 -2 -138 309 -31 -202 154 121 -418 -115 118 -160 -82 291 -260 -297 -37 269
3074 269 -149 -11 381 -116 -34 318 112 -501 413 523 -253 -6 546 26 -148 319 -49 -288 226 294 -55
3095 -55 -170 194 -12 -584 92 301 -171 117 260 -75 -148 439 243 -219 296 408 -160 12 361 260 -31
3116 -31 370 181 -95 359 242 -144 -65 372 -273 -453 321 -79 -361 -141 325 -273 -265 225 -246 -189 -33 -92
3138 -92 -261 -70 161 -224 -242 250 -28 -438 195 216 -331 91 262 -135 -98 14 59 -557 -5 125 -205 108
3160 108 -29 -184 -205 440 66 -76 167 425 -153 -170 180 39 26 222 -128 -435 -65 199 -8 -283 525
3181 525 313 -222 129 43 -345 42 143 22 -155 129 89 -237 176 303 -298 128 222 -135 -254 255 299
3202 299 -148 199 396 -139 2 165 -109 -7 517 197 -328 -196 155 -99 -72 269 -164 -22 164 -59
3222 -59 -181 -38 322 -262 -133 301 -152 -250 103 109 -249 -69 41 -110 -273 277 148 -291 161 283 102
3243 102 223 323 44 -126 222 275 -416 142 140 -184 -318 141 -120 -460 229 79 -548 178 288 -332 -180
3264 -180 374 -201 -342 267 438 -316 71 407 -207 -359 194 -4 -162 170 -32 -270 91 317 -185 -236
3284 -236 137 200 -454 -443 234 -137 -246 365 35 -372 76 84 -492 -35 26 -209 97 432 -175 -182 402 292
3306 292 -91 48 281 -106 -287 445 -97 -109 272 264 -285 -42 194 -121 -380 -2 -62 -419 98 318 -488
3327 -488 -240 170 -70 8 178 129 -272 -99 68 -158 -452 331 -105 -85 135 255 -38 112 65 -27 -50 177
3349 177 316 -423 145 45 -189 188 458 26 -7 221 287 -299 203 137 -99 23 104 -56 -151 314 -177 -255
3371 -255 142 460 -415 -20 356 127 -437 234 230 -59 -112 138 -397 -204 421 8 -404 93 154 -163 -128 86
3393 86 -54 -98 86 241 -217 344 324 -332 -230 252 -62 -130 308 101 -157 112 16 -251 -100 384 66 -514
3415 -514 -4 219 -191 173 121 -149 -92 83 240 -245 -155 197 -324 -182 279 -127 -294 362 1 -288 161
3436 161 231 -290 -115 342 164 -123 230 338 -243 -123 293 -167 143 225 -17 -375 141 11 -204 62 79
3457 79 -144 -26 224 89 -223 17 97 -44 -105 80 -31 218 523 -14 70 -3 70 -158 -112 154 -197 -253 43
3480 43 -201 -459 74 115 -171 90 299 94 -285 202 -37 -194 -235 239 -31 -190 235 203 -115 98 361
3501 361 -96 -11 420 -108 -129 291 162 -346 348 242 -250 -75 134 -217 -244 254 37 -294 -16 209 -70
3522 -70 -201 156 46 -363 142 130 -138 232 300 26 -30 319 -101 -204 263 138 -5 87 364 -178 -271 263
3544 263 -156 -327 45 114 -216 -37 -93 -141 -33 -76 -54 -212 68 301 -197 -48 82 10 -140 319 -60 -108
3566 -108 128 178 -162 31 -2 -162 2 303 -49 -107 137 467 -76 -74 157 -206 -192 90 129 -270 58 370
3588 370 -69 -14 242 -155 -177 84 60 -69 -86 240 14 -173 285 111 -191 152 132 296 35 537 161 -395
3610 -395 -89 165 -278 30 163 24 116 162 -135 -321 125 369 51 1 27 4 -189 221 -62 -18 -185 282
3632 282 -150 12 195 -44 -120 131 109 -333 13 272 -173 -4 170 36 -287 448 195 -67 -71 36 30 -14
3654 -14 287 27 -63 312 129 -317 160 82 -254 48 110 14 18 161 240 -375 -43 87 -75 -286 182 -109 -412
3677 -412 95 -165 -238 -143 172 -6 -26 68 36 -121 -30 161 34 -68 74 73 -192 326 41 -230 60 312 -279
3700 -279 -382 282 -4 -171 -254 152 -95 -321 270 -205 -23 329 -94 -290 427 335 -336 204 153 136 267
3721 267 236 -24 -260 158 72 -354 3 320 -81 -266 237 159 -105 61 -87 -22 -115 201 58 -386 224 179
3743 179 -130 -3 222 -336 78 129 267 -106 225 90 10 -133 -18 75 -41 261 -83 -212 53 281 -259
3764 -259 168 316 24 53 -3 -73 -19 9 189 94 132 280 -36 22 130 101 -235 -13 13 -262 -188 318 -68 -228
3788 -228 96 178 -182 34 360 63 -11 52 -57 -302 -89 231 -68 29 273 102 -176 260 -89 -395 80
3809 80 83 -60 -142 70 28 -294 219 -45 -321 -219 85 192 67 100 69 -291 220 101 -179 -29 254 -24
3831 -24 128 352 70 -134 -130 254 -254 -13 -101 -317 -133 364 146 -48 129 -35 -171 125 -200 -166 18 127
3853 127 101 -108 57 176 64 95 140 -58 -264 105 182 -188 -36 243 211 -264 122 -83 -240 174 240 -264
3875 -264 39 279 -326 -390 -90 29 -65 -66 139 -15 -47 111 1 -61 192 -96 41 53 229 -10 45 338 294
3898 294 -276 86 110 -247 -99 -81 -259 -16 -55 133 -444 97 175 -288 51 121 -320 -174 276 97 -164 373
3920 373 167 -171 -234 -5 53 -94 241 54 -358 103 336 -276 34 198 131 -153 205 83 -117 -122 -43 -401
3942 -401 4 199 -150 -202 11 138 -65 -143 -65 83 107 -18 -217 -270 68 48 36 100 226 -17 -19 -30 60 -268
3966 -268 140 309 -77 28 5 -219 -262 -42 -140 -130 68 -120 133 117 56 139 -130 68 110 -23 -94 202 -113
3989 -113 -19 240 -85 246 85 53 -251 111 163 125 -46 104 160 -119 -113 88 -153 -187 172 66 63 -83 227
4012 227 34 -25 -15 -119 -72 95 -17 -35 103 146 -140 166 112 -109 -112 122 80 -7 -274 21 -378 -48 22 -239
4036 -239 -278 72 -210 89 -96 144 -179 -38 83 -32 91 -13 -41 -68 120 301 -65 221 213 51 -282 -187
4058 -187 120 -210 46 131 -171 -151 227 -64 59 -160 -163 -88 -86 -127 -11 -72 320 8 10 95 309 -59 -233 196
4082 196 185 -93 154 105 -84 26 291 -112 15 -35 36 -184 332 16 -252 -260 9 -306 -366 134 -3 -420
4104 -420 104 238 -312 -127 81 95 -181 200 -227 252 122 40 -148 -60 -44 60 -151 420 -227 -294 -42 183
4126 183 -217 95 40 -2 -163 187 -193 -162 113 -68 -73 -207 3 123 -304 -52 102 -57 -30 404 77 -287
4148 -287 133 -74 -147 1 12 -142 195 33 62 48 231 138 -383 -45 83 -126 69 -3 -135 -179 -128 1 -254
4171 -254 25 73 66 -32 5 65 -212 167 -51 -82 -200 309 -176 -64 55 40 -173 9 17 -74 -151 167 -104 -337
4195 -337 52 33 -108 184 28 -195 -230 -46 -334 -151 51 34 -389 167 246 -157 118 132 85 69 170 189 -282
4218 -282 108 164 -156 130 103 53 -54 68 -83 -35 -99 -102 -138 142 37 60 -97 -185 122 -112 23 114 -61 318
4242 318 189 -197 -1 215 41 -95 -48 -54 -2 -52 279 123 216 186 -22 -209 -213 333 -222 -137 70 -238 -72
4265 -72 -84 259 22 -80 123 -14 68 14 207 -414 -63 124 27 -110 102 -167 -135 165 191 266 3 238 -37
4288 -37 82 78 116 -199 85 -12 -183 -80 27 169 -110 -18 36 -215 38 174 88 -239 187 21 85 226 101
4311 101 -267 3 -88 -120 125 121 -79 -319 207 -202 88 -332 -111 -33 -105 73 5 26 353 139 -85 -218 167
4334 167 -9 -297 -13 -15 -119 114 194 -291 -39 174 129 -195 22 -41 21 -67 114 100 130 -182 -236 58 122 213
4358 213 -152 -113 69 53 -272 -147 -47 -358 -1 -61 -32 27 223 -63 214 346 252 159 56 161 132 17 186
4381 186 -86 16 50 -66 176 6 92 -78 -98 71 -88 -132 -46 -13 -35 51 67 -202 -71 62 21 -166 -38
4404 -38 63 13 101 18 -133 -5 195 41 -55 -33 -115 12 51 100 -254 -47 -16 -14 -83 -364 58 -359 -135 130
4428 130 -481 -233 -85 96 -75 195 9 -78 224 227 78 -36 207 -84 124 37 -66 190 -46 112 22 -274
4450 -274 -14 348 -116 150 161 -161 -316 -168 -56 -302 176 288 0 106 -33 241 45 61 31 -112 126
4471 126 197 -189 -140 171 -69 -276 69 18 104 52 149 46 42 170 -200 -109 -26 327 -180 149 28 12 -95 24
4495 24 -59 -38 -283 117 6 -206 293 -229 -96 44 37 -16 -29 191 29 116 8 74 149 -56 124 -191 -138 -187
4519 -187 136 -9 242 -23 -5 7 -325 35 -149 220 -111 -343 159 -110 -189 319 -223 111 11 -90 165
4540 165 -345 204 136 -85 -54 104 273 -95 34 76 -235 -138 13 -215 -58 132 69 -224 -23 105 -275 -26
4562 -26 221 -118 -294 32 -76 5 6 -17 -125 -226 46 198 -17 107 104 -132 175 -199 -128 -69 97 -128 49
4585 49 29 69 -45 174 223 53 -111 144 61 50 105 118 -44 165 84 -148 -3 11 7 -183 357 83 -167 -59
4609 -59 147 17 141 52 122 -130 194 -350 -145 -96 -30 -140 -65 142 54 -35 168 -25 99 -192 207 252 134
4632 134 27 76 66 113 -17 -127 95 257 -33 -488 126 51 -214 -8 138 -162 60 -29 148 139 21 -73 -105
4655 -105 203 236 -143 14 -81 -2 -120 120 -45 176 225 81 -250 101 305 -119 81 -197 143 -125 27
4676 27 297 -175 -121 -10 -90 -63 74 34 90 -127 -120 150 -77 -44 0 -140 192 90 -197 -26 -183 -68 17 5
4700 5 251 -113 -146 170 -202 -96 169 0 -45 -157 120 38 -43 112 -161 73 66 90 -176 -329 25 -183 268
4723 268 127 -14 112 -65 73 -7 123 41 -79 98 106 70 -115 232 97 217 222 213 -10 -47 17 -140 40 28
4747 28 24 -159 54 -116 -106 138 92 -43 -35 3 -5 -58 -49 181 172 -243 -160 67 210 281 -19 -15 -25 -119 77 -7 72 -139
4775 -139 -105 -147 250 247 -282 -148 -110 -181 86 7 80 -29 -91 -33 -29 79 -93 -218 -35 -125 87 -99 276 227 -323
4800 -323 206 -66 253 -125 -41 -8 85 -114 43 -45 125 94 -73 11 -142 207 -111 320 -2 -103 164 222
4822 222 -82 162 24 193 -68 -99 -6 -49 -110 158 4 -6 -19 -71 -43 351 -211 -377 -151 1 136 -269 179
4845 179 -231 98 -254 89 55 -11 148 7 172 67 -150 -109 91 90 -147 107 42 72 -43 -89 -36 -47 46 -31
4869 -31 -157 160 -159 -159 21 -37 78 16 -77 56 85 84 96 135 123 111 -50 -156 348 54 12 -177 87 296 -83
4894 -83 109 152 69 86 180 0 -13 -48 79 97 303 -61 -111 -78 177 80 -49 287 -15 -63 300 95 36 -207
4918 -207 174 172 -89 85 129 113 -54 -62 233 -113 136 76 322 80 -98 15 65 60 258 -257 -158 -236 -46 155
4942 155 35 -67 52 34 -86 -19 -140 34 32 -149 -247 18 -21 82 59 59 133 130 80 25 -132 -113 -118 166 -92 -69
4968 -69 -19 -21 47 -134 -64 4 -236 4 -110 135 34 213 -39 58 -95 -6 -264 -27 162 211 -34 -210 76
4991 76 -78 15 47 224 123 84 -322 33 -86 245 155 87 -177 22 -139 -32 -37 -226 136 54 -391 -90 156
5014 156 107 180 160 -92 -295 169 -40 -61 96 164 -78 147 -56 27 -19 -34 161 -112 31 103 -95 -410 -100
5037 -100 54 86 19 -239 14 -124 -36 -108 10 -11 178 120 267 145 -38 133 266 -2 120 74 -210 -187 202
5060 202 -33 -45 179 -233 -115 75 154 -163 -171 132 -80 -142 -36 69 -180 163 -15 -39 -116 112 95 149 116
5083 116 -229 -57 69 -52 -78 -214 -238 -110 -270 144 101 36 120 -163 -64 -24 27 -103 -319 -43 -88 111 38
5106 38 42 37 -55 145 44 -245 93 -212 -78 12 52 -56 68 130 200 -96 -127 65 74 -215 -102 141 24 -29 100
5131 100 2 2 -38 -196 -229 -65 -17 128 -183 -176 285 263 -30 36 -59 -24 90 -221 40 31 156 159 -54 -34 41 11
5157 11 108 4 -178 77 32 142 -38 -5 9 40 -29 47 -84 60 -101 197 -180 181 127 -94 31 -219 -54
5180 -54 113 131 37 102 109 -68 -99 78 76 252 29 -71 116 211 -208 -92 -14 -82 186 -200 14 201 177 -57
5204 -57 71 -19 94 194 -242 105 156 -129 15 221 -67 197 120 24 -115 -120 -302 -60 70 -33 213 -167
5226 -167 -208 205 -43 -39 -15 -16 -94 -308 -291 28 -159 -36 83 109 -184 -152 -56 172 219 40 57 -27 116 -195 -4
5251 -4 98 -235 -368 -55 -64 -2 168 67 342 -74 83 -131 88 -88 -172 64 -8 -12 -174 139 -152 -49 96
5274 96 123 46 -133 75 15 -69 8 177 111 -27 -30 -32 -156 -60 26 -252 -62 -55 -55 -31 130 65 -144 -122 -170 -142 -23
5301 -23 179 37 185 137 -63 2 -2 67 -262 220 298 122 43 181 -46 73 200 -28 15 -8 155 -101 235
5324 235 294 15 113 -121 -276 -185 -179 -103 38 5 -24 13 19 -95 219 -81 11 -91 27 86 22 -27 -175 -200 34
5349 34 -8 8 167 33 -147 -1 252 48 -92 157 -84 -142 86 -144 -5 103 371 -63 -130 240 -142 82
5371 82 158 214 183 204 11 33 -149 29 -47 10 1 11 -110 110 -327 -168 -44 134 121 -83 -258 151 -304 -111
5395 -111 -143 -228 74 -262 59 85 -71 134 270 182 149 13 185 -236 7 -108 225 -24 104 -58 -98 -161
5417 -161 -74 -1 -101 -113 129 -56 -103 -99 122 -139 -157 -234 49 226 -2 116 52 109 38 -58 135 27 57 225
5441 225 58 80 -154 52 230 298 37 -91 1 84 -37 -15 -61 -165 -186 215 285 32 144 209 141 -27 -214
5464 -214 41 -72 -55 30 257 110 10 23 -37 -36 -56 71 -32 1 -38 -28 -36 -1 -19 8 -152 -6 21 186 -141
5489 -141 -52 155 -306 -338 78 -111 -108 -71 -245 -128 52 -215 -138 -15 157 22 -206 -165 290 8 -25 -107 -26
5512 -26 -8 26 -44 75 27 107 -10 -40 95 -167 -226 99 -97 -221 99 -191 116 -191 13 -221 122 222 -268
5535 -268 -204 52 23 136 76 -59 73 390 -101 -21 -7 -55 -131 -103 -30 27 11 71 -32 187 -119 -54 -167 -14
5559 -14 -1 -371 -113 177 36 315 188 -11 233 12 197 -233 -114 -103 -44 -20 77 -215 -92 -17 -49 127 -96
5582 -96 221 29 32 -59 114 -198 -10 76 261 -43 28 97 82 51 -4 105 -164 -48 61 -26 -60 103 -60 454
5606 454 207 -18 -149 37 71 -123 53 110 -41 -20 -215 32 199 -60 -80 -27 119 142 167 -76 -18 -331 56
5629 56 -220 -86 41 29 78 22 107 72 -209 -104 94 -49 -78 89 -230 -186 104 -152 94 9 -17 100 8 -25
5653 -25 112 -168 18 5 -101 8 234 -74 -199 48 59 -41 -13 75 196 124 56 -43 204 58 -14 57 164
5676 164 -88 55 28 -79 -49 -251 108 -9 -132 196 -241 26 -23 -58 -194 111 -141 182 -16 257 44
5697 44 -195 -50 -54 238 -16 231 -107 -162 -123 -84 -175 30 83 77 -31 -73 45 70 10 173 -40 254 69 -146
5721 -146 96 -94 76 85 133 100 -89 -90 65 66 114 119 139 -41 -38 191 109 -73 173 19 -48 -19 65 -5 61 -10 -111
5748 -111 -123 -88 -132 307 66 -280 128 -79 -121 -19 -164 131 31 -49 108 -72 38 37 -110 131 -123 44
5770 44 -52 -152 -68 148 -135 18 -190 -199 26 57 -91 -17 59 -46 -54 92 111 31 181 -28 198 70 -89 69
5794 69 -117 240 36 -98 -60 -34 240 -33 -97 -68 82 10 35 22 137 -42 130 73 38 -36 20 29 -24 -145 -89
5819 -89 -102 126 -3 -150 -96 -90 44 119 -56 230 75 42 54 109 -73 106 12 1 69 -84 166 -32 140 -81
5843 -81 -35 -178 131 -6 -103 80 -41 32 1 128 6 -307 -149 120 88 125 -37 -70 -75 52 -144 274 -105
5866 -105 94 -207 -26 146 60 15 -130 -227 158 -140 84 82 150 171 44 84 -80 -69 -53 -52 -12 -228 -20 -221
5890 -221 38 25 28 157 -79 59 129 55 50 -14 2 -127 -31 -30 -163 -260 -39 -82 14 -111 255 -200 -19 -81 -97 17
5916 17 -36 28 155 232 -128 64 -53 -107 44 119 386 45 154 122 96 85 180 196 -12 -6 176 50 -102 -64 -13
5941 -13 -101 -194 -142 -56 -152 -64 -88 -11 114 -114 11 30 21 206 -38 -83 -35 238 58 -96 162 -20 -5 87 62 -59
5967 -59 -168 -320 99 87 18 27 -122 -15 -6 -106 -224 -116 -25 -196 -170 64 -57 189 -140 41 -107 174 19
5990 19 219 -235 122 35 -82 242 90 149 54 57 -247 -62 -3 -20 -81 -80 -24 -355 -135 248 -19 53 -121 -94 102
6015 102 -178 81 92 273 32 176 245 -233 116 -90 -95 16 -107 212 -137 -30 -99 -81 35 105 -54 -101 127
6038 127 -55 -16 -210 -147 65 -128 28 186 34 111 -57 -35 -67 -302 51 -215 78 -255 -80 -64 -21 12 -61
6061 -61 -17 -115 -8 -130 77 -135 105 8 94 -265 -131 -97 53 -162 -141 88 -8 -204 64 -31 -70 -10 65 -179
6085 -179 68 -138 67 -130 -26 135 43 127 259 -211 -227 256 51 169 91 -19 99 -123 -17 -168 37
6106 37 -30 -58 110 38 142 -91 -46 114 -69 215 -75 127 37 -183 -23 -26 76 27 93 -269 9 56 4 -40
6130 -40 -166 64 14 64 -146 27 -104 30 36 253 -38 254 -302 61 199 -96 -33 -47 107 -81 -60 46 -165
6153 -165 -206 66 -105 -2 159 179 -86 19 123 -176 -56 86 -134 -12 -112 -223 94 -29 -24 -150 52
6174 52 24 340 30 -25 -220 -56 66 141 -69 69 -44 323 -5 108 28 -428 -197 328 115 357 -98 -66
6196 -66 17 -80 -143 28 -171 -22 -292 -88 -62 -279 -37 131 -44 127 -64 -121 -33 21 -69 -148 -157 280 -177 279
6220 279 -262 57 119 -14 191 123 155 -86 -11 -153 42 -183 -92 -359 117 216 247 131 -41 -105 105 -177 -55
6243 -55 -110 160 -18 -234 296 -14 -128 -43 -205 242 168 291 -60 -5 31 128 221 232 -185 -11 -281 -152 61
6266 61 161 79 -147 165 88 50 85 318 -58 -112 136 230 -33 -134 -207 35 297 -51 -35 -72 220 44 -77
6289 -77 129 -116 21 -49 -25 68 32 158 104 -167 28 7 -328 78 3 105 15 -53 269 269 -237 -146 -48 -82 -81 -50
6315 -50 208 -30 -67 34 45 52 -27 -7 -84 -3 102 -151 -123 -87 -60 -120 -39 9 -57 -144 -132 -98 -4 42 114 -49 27 -42
6343 -42 28 116 -95 -28 -166 -184 18 -74 368 -103 205 -165 40 -86 -77 -96 163 -85 -72 -13 -297 -76 -93 62
6367 62 -76 -227 -66 39 -101 120 -73 7 62 -118 -59 16 182 27 -285 12 -104 172 -60 -148 421 50
6389 50 -152 79 -199 158 45 -168 -10 181 159 60 -10 142 29 -52 -49 62 -210 -51 -235 191 126 185 194 -23
6413 -23 47 -70 -220 -125 -20 156 -13 107 -177 171 34 -74 60 -1 -28 -60 -1 -97 -220 -10 -294 -285 195
6436 195 48 -346 -195 -82 151 -199 46 8 123 -20 -160 39 -140 -18 85 43 67 -88 -65 153 -170
6457 -170 55 -51 -52 -52 85 -3 78 -47 18 -258 39 -184 95 -70 -81 -118 -47 24 -112 123 -186 -210 146 51
6481 51 -93 108 -207 159 -123 -117 -26 -24 109 89 -179 -112 -142 65 167 -15 -132 -155 -118 -320 80 209 -43 108
6505 108 -2 -150 263 -25 -97 -32 -70 76 -25 69 -246 -97 86 -75 -40 -165 -37 -67 -110 -81 -85 82 35 -20
6529 -20 79 -132 -4 -246 88 -52 -9 167 222 -119 202 -58 80 42 -98 -49 -26 -90 -269 16 117 12 14
6552 14 68 -94 -99 -156 -21 -22 -87 -79 -131 101 237 -234 -86 62 290 -306 -169 393 -4 -52 94 197 -121 149
6576 149 222 -132 -94 94 -166 10 40 44 -7 -96 97 -107 77 74 -145 -103 24 -9 51 92 140 94 79 -59 94
6601 94 138 -21 139 -87 75 -15 -88 -14 -151 112 -60 -226 80 56 480 1 -136 -165 5 223 26 332
6623 332 166 -14 56 -73 109 -27 74 96 -309 -25 162 151 96 104 16 161 -3 -88 -130 43 121 66 -49 125
6647 125 72 -16 -46 -56 33 -127 73 -15 -62 38 -233 64 114 -121 -50 -84 73 -141 -53 20 84 13 4 -168 108
6672 108 68 107 75 -120 128 -31 -5 12 124 -21 159 -34 187 49 -350 -292 -173 137 33 77 123 63 -70
6695 -70 161 -6 -177 -26 35 -206 75 123 100 90 -30 132 254 72 -106 -29 56 144 58 142 -19 -171 72
6718 72 -22 -179 -53 51 263 -75 -152 91 -59 -24 231 54 -25 -54 -149 6 91 102 112 69 11 25 43 234 49
6743 49 -86 227 37 -279 -12 -95 112 -38 41 -181 -57 103 16 52 -7 75 -65 124 61 -175 170 131 30
6766 30 -29 154 -67 -66 -37 45 178 4 88 8 -122 -26 113 256 -24 52 165 -107 -67 93 -80 -18 -76 108
6790 108 -260 -71 -138 -172 -194 244 25 8 -56 -29 -25 84 -109 245 3 3 -61 105 136 -14 -63 110 -75 142
6814 142 31 289 325 160 -111 -237 63 168 -16 190 -167 115 -244 13 -116 282 231 -103 167 -77 5
6835 5 216 -32 -55 -210 -187 18 112 -128 -297 -74 -89 225 -101 -77 -78 329 -114 50 -65 15 -129 -25 207
6858 207 -63 -23 -109 -226 152 70 59 13 127 271 29 265 195 -87 -76 127 -12 -70 0 75 -194 53 109 -110
6882 -110 -87 83 -75 -39 -44 -148 -15 21 303 -69 96 -59 -176 -237 55 93 -17 130 192 -59 -170 -60 4
6905 4 73 -5 83 -42 90 24 10 -123 180 238 194 -128 155 215 -209 189 -196 100 205 -111 260 -206 -281 148
6929 148 118 12 -8 168 109 41 114 -34 -37 -18 -6 230 294 -72 -177 -13 47 25 -133 231 -132 119 112 97 -157
6954 -157 51 -161 230 168 -46 -147 -11 -134 -31 -48 206 62 -154 212 -238 104 -274 -144 20 362 -73
6975 -73 -216 117 99 126 21 187 149 -18 -128 -180 -213 -5 -365 -24 -97 -24 -344 -20 -212 40 48 0 361 190
6999 190 165 -47 259 -12 -61 -66 42 -30 9 79 -104 -247 98 -131 -155 166 169 38 -121 119 28 3 118 -57
7023 -57 124 50 -8 5 -10 -59 -39 -70 95 -354 86 -38 22 -48 -25 60 -186 -286 -303 69 134 -154 -41 259 203
7048 203 -63 -129 -98 -38 -147 -1 -15 3 -85 -20 -153 -198 -127 56 -56 193 5 -89 -23 -52 -134 -92 123 -82 -235
7073 -235 134 160 190 190 -178 12 -10 7 141 85 50 -191 -102 164 -265 105 -185 93 2 89 -39 -134 -22 -136
7097 -136 -158 -153 -25 243 -49 -88 29 -83 -48 27 55 5 156 -108 60 136 14 -42 103 19 -100 -103 -165 226 1
7122 1 62 123 -127 34 -88 137 -51 62 105 113 -198 -87 -77 13 147 -77 -120 -74 -245 38 2 -14 -132 -101 -149
7147 -149 131 -23 -109 35 -71 182 -5 -63 29 26 -188 44 -76 108 149 -183 -127 -193 169 135 -82 13 -88
7170 -88 150 -84 -136 -51 -177 -204 -114 -96 -106 -123 147 -69 -59 -145 59 6 -68 -33 -101 -84 -102 30 -2 187 -24 146
7196 146 49 9 144 165 -109 -181 -187 41 200 160 32 94 14 -101 226 4 71 38 -31 217 37 -115 93 -22
7220 -22 9 47 345 243 8 84 -60 -85 -183 -38 131 176 18 82 17 -212 -104 -101 -67 -14 219 85 -177 -161 78
7245 78 -85 117 -99 -84 30 -115 45 117 62 -9 100 -125 283 403 50 -134 167 46 42 33 -153 111 -197
7268 -197 -22 -86 31 -124 232 24 131 167 51 217 -28 -84 -7 6 -4 126 -28 -130 -15 -148 -191 -129 242
7291 242 192 149 -104 214 -122 112 -26 -386 2 -122 260 -248 220 84 -210 -25 225 176 -35 1 -190
7312 -190 159 45 264 -149 -290 46 -133 68 -127 89 -30 7 -89 136 175 193 43 -26 33 -119 -132 70
7334 70 38 144 -32 67 30 -53 -175 -235 -49 150 251 156 -200 -222 -43 118 112 -40 -208 6 26 160 -248 227
7358 227 -274 -12 -93 -84 -134 -121 160 -171 84 191 18 -122 -26 -10 -11 45 135 -8 -98 -37 79 148 -147 -40 128
7383 128 31 153 -212 7 48 28 97 30 -175 -22 -89 -237 222 -158 -98 -146 67 44 -127 91 202 41 -29
7406 -29 -114 -90 260 102 286 -154 -112 0 69 -29 73 151 55 137 50 20 -102 -37 46 -29 116 -7 -70 142 -42
7431 -42 -81 101 -253 91 121 61 -111 39 -166 -35 10 -99 -15 -131 107 161 -99 110 159 -373 -158 -276 51
7454 51 -45 -56 -168 164 37 -166 50 62 -13 -92 -25 -48 56 -7 26 -365 193 274 -49 20 0 114 -42 -174
7478 -174 45 -8 -26 -109 15 259 -262 -55 -3 -224 -13 -103 -17 25 -83 72 278 48 157 143 108 90 57 -120
7502 -120 85 102 -146 -25 -9 -98 174 158 41 134 -125 118 74 133 140 121 -97 95 97 94 -10 -314 -25 -144 -160
7527 -160 -63 -89 141 -444 -294 14 -8 -185 45 -65 -27 1 111 6 107 199 -11 77 -285 -28 -149 77
7549 77 21 -80 2 -119 175 -111 142 13 21 210 55 346 9 14 107 23 -64 -43 105 -129 229 -134 -84 180
7573 180 -56 26 -19 39 221 -9 20 149 -161 -51 256 232 54 -152 -142 -139 56 -40 -117 -116 -172 -157 -123 -136 269
7598 269 24 -45 -8 26 20 96 125 -188 111 -89 113 120 -189 -160 18 71 -110 -181 49 -87 -90 205 32 -320 -177
7623 -177 258 -27 -32 18 150 -96 134 113 120 -37 -215 64 -8 -188 -156 156 238 -29 -107 -175 97 11 -3 55 -15
7648 -15 18 234 27 -19 -167 -169 -98 -208 -3 33 -11 -1 342 -163 -87 130 -49 -166 245 210 88 85 -14 0 117
7673 117 -74 135 -106 4 -66 79 89 18 175 -135 225 -106 -87 -176 215 -145 279 -10 20 19 -51 92 21
7696 21 446 24 -72 -190 -78 -150 -87 -88 -33 -78 2 -21 -77 -78 -98 -9 -41 20 -12 -58 -75 138 -306 11 -91 100 46
7723 46 -58 -157 36 -241 90 337 294 -230 267 -225 -161 48 -115 43 360 -134 273 150 -178 199 83
7744 83 114 -205 -240 30 -360 -29 -50 -329 -69 64 -26 -32 -239 102 341 -55 243 61 -224 -5 196 -49
7766 -49 98 72 -28 106 76 66 -135 -270 49 -109 -15 263 -22 -16 85 -119 -50 17 -259 43 -108 69 137
7789 137 -26 60 -102 20 -30 124 208 -163 -19 -75 84 79 -36 123 141 244 -38 -33 20 171 -125 71 28 -1
7813 -1 -156 98 101 -98 -41 -53 67 45 99 -52 28 -76 326 -74 -229 264 166 112 27 -93 -101 -244 65 -48 -250
7838 -250 -25 0 -95 62 126 -133 250 -3 0 6 273 -134 -57 -85 -12 -30 35 87 -253 78 -250 170 63 -39
7862 -39 426 228 79 266 38 -1 -118 -122 227 81 74 3 -38 -89 185 -79 -29 133 -126 -28 -149 183 -134 67
7886 67 43 -213 1 -140 142 -66 51 -178 188 16 39 -97 69 23 115 177 -56 -134 -149 70 -7 81 -271
7909 -271 -73 -51 29 4 355 -146 155 -161 -153 -146 -76 -3 -72 216 4 194 -236 200 190 56 44 15 133 218 264
7934 264 25 84 -36 46 100 3 -235 34 133 6 -179 25 -93 -118 -137 128 -5 -221 -125 -89 24 17 -58 -175
7958 -175 -73 -86 168 43 263 -239 107 49 49 122 -42 150 -82 -212 -203 -7 215 45 -4 -59 102 9 26 -87
7982 -87 2 -121 234 -245 -62 6 -229 44 -66 -133 -190 8 132 -256 -23 185 240 -255 22 66 93 -98 46
8005 46 -59 54 209 129 -153 -193 51 -15 141 -258 136 24 -200 -136 185 48 -80 -221 41 -58 132 -154
8027 -154 76 73 143 -98 -139 -153 -165 -163 87 45 -125 -230 38 -136 -135 -71 107 -35 96 -22 237 -301 32 58
8051 58 -116 251 -86 -12 -121 291 198 -12 -62 73 79 47 8 326 -202 -406 44 51 43 65 156 -110 -129 42 41 11
8077 11 -43 24 100 -72 -8 -12 -83 76 -71 206 -225 -197 83 -5 -7 32 -81 -57 -133 -112 23 27 107 21 -200 5 -20
8104 -20 -74 -311 48 -82 -251 -93 -54 -80 4 65 207 -37 153 -8 184 40 35 -240 -127 268 73 90 46
8127 46 -171 -25 63 135 -141 -30 -219 -207 317 -28 0 -43 -55 93 17 -132 -10 126 -4 -53 134 -19 -135
8150 -135 44 -324 -118 239 -66 -52 -92 18 -355 125 89 -139 31 -137 41 192 135 -163 -406 65 81 236
8172 236 -229 291 -189 110 -5 143 181 -3 76 1 -35 -94 -65 -30 5 31 -56 72 185
8191A85
##END NTUPLES=NMR FID
##END=
