##TITLE=1H_Ad=o(bat2)-PE-part
 CDCl3
 8 sc, 
 22.12.2022
##JCAMPDX= 6.0         $$ Bruker NMR JCAMP-DX V2.0
##DATA TYPE= NMR FID
##DATA CLASS= NTUPLES
##ORIGIN= UXNMR, Bruker Analytische Messtechnik GmbH
##OWNER= root
$$ XWIN-NMR		Version 3.5
$$ Thu Dec 22 13:49:31 2022 Russian Standard Time (UT+4h)  she@DPX200
##.OBSERVE FREQUENCY= 200.13135
##.OBSERVE NUCLEUS= ^1H
##.DELAY= (6, 6)
##.ACQUISITION MODE= SIMULTANEOUS
##.ACQUISITION SCHEME= undefined
##.AVERAGES= 8
##.DIGITISER RES= 18
##SPECTROMETER/DATA SYSTEM= spect
##.PULSE SEQUENCE= zg30
##.SOLVENT NAME= CDCl3
##.SHIFT REFERENCE= (INTERNAL, CDCl3, 0, 15.7039)
##AUDIT TRAIL= $$ (NUMBER, WHEN, WHO, WHERE, WHAT)
$$ ##TITLE= Audit trail, XWIN-NMR		Version 3.5
$$ ##JCAMPDX= 5.01
$$ ##ORIGIN= Bruker BioSpin GmbH
$$ ##OWNER= she
$$ F:/spectra/data/she/nmr/H-F/1/audita.txt
$$ ##AUDIT TRAIL=  $$ (NUMBER, WHEN, WHO, WHERE, WHAT)
(   1,<2022-12-22 13:48:21.81 +0400>,<she>,<DPX200>,
      <created by zg, POWCHK disabled, PULCHK disabled
       configuration hash MD5:
       00 E9 B6 7A A2 85 ED C7 34 08 36 98 17 FE 4E 26
       data hash MD5: 16K
       DA CA 6D 06 EE 0A 16 8A 75 21 C6 06 B1 42 A6 CD>)
$$ ##END=
$$ 
$$ hash MD5
$$ 17 05 0A 0F 96 FC B6 5E 38 80 79 D1 DF 55 C5 AF
##$RELAX= 
##$RELAX= 
##$RELAX= 
##$RELAX= 
##$RELAX= 
##$RELAX= 
$$ Bruker specific parameters
$$ --------------------------
##$DU= <F:/spectra>
##$EXPNO= 1
##$NAME= <H-F>
##$PROCNO= 1
##$TYPE= <nmr>
##$USER= <she>
##$AMP= (0..31)
100 100 100 100 100 100 100 100 100 100 100 100 100 100 100 100 100 100 
100 100 100 100 100 100 100 100 100 100 100 100 100 100 
##$AQSEQ= 0
##$AQ_mod= 1
##$AUNM= <au_zg>
##$AUTOPOS= <>
##$BF1= 200.13
##$BF2= 200.13
##$BF3= 200.13
##$BF4= 200.13
##$BF5= 200.13
##$BF6= 200.13
##$BF7= 200.13
##$BF8= 200.13
##$BYTORDA= 1
##$CFDGTYP= 0
##$CFRGTYP= 5
##$CHEMSTR= <none>
##$CNST= (0..31)
1 1 145 1 1 1 1 1 1 1 1 1 1 1 1 1 1 1 1 1 1 1 1 1 1 1 1 1 1 1 1 1 
##$CPDPRG= <>
##$CPDPRG1= <>
##$CPDPRG2= <>
##$CPDPRG3= <>
##$CPDPRG4= <mlev>
##$CPDPRG5= <mlev>
##$CPDPRG6= <mlev>
##$CPDPRG7= <mlev>
##$CPDPRG8= <mlev>
##$CPDPRGB= <>
##$CPDPRGT= <>
##$D= (0..31)
0 1.2 0 0 0 0 0 0 0 0.06 0 0.03 0 0 0 0 0.0002 0 0 0 0 0 0 0 0 0 0 0 0 
0 0 0 
##$DATE= 1671702501
##$DBL= (0..7)
120 120 120 120 120 120 120 120 
##$DBP= (0..7)
150 150 150 150 150 150 150 150 
##$DBP07= 0
##$DBPNAM0= <>
##$DBPNAM1= <>
##$DBPNAM2= <>
##$DBPNAM3= <>
##$DBPNAM4= <>
##$DBPNAM5= <>
##$DBPNAM6= <>
##$DBPNAM7= <>
##$DBPOAL= (0..7)
0.5 0.5 0.5 0.5 0.5 0.5 0.5 0.5 
##$DBPOFFS= (0..7)
0 0 0 0 0 0 0 0 
##$DE= 6
##$DECBNUC= <off>
##$DECIM= 32
##$DECNUC= <off>
##$DECSTAT= 4
##$DIGMOD= 1
##$DIGTYP= 9
##$DL= (0..7)
0 120 120 120 120 120 120 120 
##$DP= (0..7)
150 150 150 150 150 150 150 150 
##$DP07= 0
##$DPNAME0= <>
##$DPNAME1= <>
##$DPNAME2= <>
##$DPNAME3= <>
##$DPNAME4= <>
##$DPNAME5= <>
##$DPNAME6= <>
##$DPNAME7= <>
##$DPOAL= (0..7)
0.5 0.5 0.5 0.5 0.5 0.5 0.5 0.5 
##$DPOFFS= (0..7)
0 0 0 0 0 0 0 0 
##$DQDMODE= 0
##$DR= 18
##$DS= 0
$$ [...]
##$SUBNAM2= <"">
##$SUBNAM3= <"">
##$SUBNAM4= <"">
##$SUBNAM5= <"">
##$SUBNAM6= <"">
##$SUBNAM7= <"">
##$SUBNAM8= <"">
##$SUBNAM9= <"">
##$SW= 18.05172834244
##$SWIBOX= (0..15)
0 0 2 0 0 0 0 0 0 0 0 0 0 0 0 0 
##$SW_h= 3612.71676300578
##$TD= 16384
##$TD0= 1
##$TE= 0
##$TE2= 300
##$TE3= 300
##$TEG= 300
##$TL= (0..7)
0 120 120 120 120 120 120 120 
##$TP= (0..7)
150 150 150 150 150 150 150 150 
##$TP07= 0
##$TPNAME0= <>
##$TPNAME1= <>
##$TPNAME2= <>
##$TPNAME3= <>
##$TPNAME4= <>
##$TPNAME5= <>
##$TPNAME6= <>
##$TPNAME7= <>
##$TPOAL= (0..7)
0.5 0.5 0.5 0.5 0.5 0.5 0.5 0.5 
##$TPOFFS= (0..7)
0 0 0 0 0 0 0 0 
##$TUNHIN= 0
##$TUNHOUT= 0
##$TUNXOUT= 0
##$USERA1= <user>
##$USERA2= <user>
##$USERA3= <user>
##$USERA4= <user>
##$USERA5= <user>
##$V9= 5
##$VALIST= <valist>
##$VCLIST= <CCCCCCCCCCCCCCC>
##$VD= 0
##$VDLIST= <DDDDDDDDDDDDDDD>
##$VPLIST= <PPPPPPPPPPPPPPP>
##$VTLIST= <TTTTTTTTTTTTTTT>
##$WBST= 1024
##$WBSW= 4
##$XGAIN= (0..3)
0 0 0 0 
##$XL= 0
##$YL= 0
##$YMAX_a= 301033
##$YMIN_a= -344260
##$ZGOPTNS= <>
##$ZL1= 120
##$ZL2= 120
##$ZL3= 120
##$ZL4= 120
##$ABSF1= 10
##$ABSF2= 0
##$ABSG= 5
##$ABSL= 3
##$ALPHA= 0
##$AQORDER= 0
##$ASSFAC= 0
##$ASSFACI= 0
##$ASSFACX= 0
##$ASSWID= 0
##$AUNMP= <proc_1d>
##$AZFE= 0.1
##$AZFW= 0.1
##$BCFW= 1
##$BC_mod= 2
##$BYTORDP= 1
##$COROFFS= 0
##$CY= 11.3945322036743
##$DATMOD= 1
##$DC= 2
##$DFILT= <>
##$DTYPP= 0
##$F1P= 2.36226072786647
##$F2P= -0.459571619588291
##$FCOR= 0.5
##$FTSIZE= 0
##$FT_mod= 4
##$GAMMA= 1
##$GB= 0.15
##$INTBC= 1
##$INTSCL= 1
##$ISEN= 128
##$LB= 0.24
##$LEV0= 0
##$LPBIN= 0
##$MAXI= 10000
##$MC2= 0
##$MEAN= 0
##$ME_mod= 0
##$MI= 1.114404
##$NCOEF= 0
##$NC_proc= 0
##$NLEV= 6
##$NOISF1= 3.799351
##$NOISF2= 2.8
##$NSP= 1
##$NTH_PI= 0
##$NZP= 0
##$OFFSET= 15.70392
##$PC= 1
##$PHC0= -19112.57
##$PHC1= 23.60072
##$PH_mod= 1
##$PKNL= yes
##$PPARMOD= 0
##$PSCAL= 0
##$PSIGN= 0
##$REVERSE= no
##$SF= 200.130013532006
##$SI= 16384
##$SIGF1= 3
##$SIGF2= 2
##$SINO= 400
##$SIOLD= 16384
##$SREGLST= <1H.CDCl3>
##$SSB= 0
##$STSI= 0
##$STSR= 0
##$SW_p= 3612.71676300578
##$SYMM= 0
##$S_DEV= 0
##$TDeff= 0
##$TDoff= 0
##$TI= <>
##$TILT= no
##$TM1= 0
##$TM2= 0
##$TOPLEV= 0
##$USERP1= <user>
##$USERP2= <user>
##$USERP3= <user>
##$USERP4= <user>
##$USERP5= <user>
##$WDW= 1
##$XDIM= 8192
##$YMAX_p= 0
##$YMIN_p= 0
$$ End of Bruker specific parameters
$$ ---------------------------------
##NTUPLES= NMR FID
##VAR_NAME=  TIME,          FID/REAL,        FID/IMAG
##SYMBOL=    X,             R,               I
##VAR_TYPE=  INDEPENDENT,   DEPENDENT,       DEPENDENT
##VAR_FORM=  AFFN,          ASDF,            ASDF
##VAR_DIM=   8192,          8192,            8192
##UNITS=     SECONDS,       ARBITRARY UNITS, ARBITRARY UNITS
##FACTOR=    0.0002768,     1,               1
##FIRST=     0,             0,               0
##LAST=      2.2672688,     0,               0
##MIN=       0,             -344260,         0
##MAX=       2.2672688,     301033,          0
$$ Real data points
##PAGE= N=1
##DATA TABLE= (X++(R..R)), XYDATA
0 0 0 0 0 0 0 0 0 0 0 0 -6 8 -8 8 -10 16 -17 24 -31 33 -41 49 -57 72 -81 97 -113 129 -152 173 -197 225 -257
33 -257 290 -327 367 -414 464 -519 579 -643 716 -795 878 -972 1075 -1185 1306 -1443 1588
50 1588 -1748 1928 -2123 2344 -2587 2864 -3181 3541 -3958 4452 -5043 5766 -6675 7854 -9456
65 -9456 11762 -15391 21936 -37419 151848 -45345 -344260 165199 264939 -172713 -222665
76 -222665 210225 150869 -200104 -107050 201221 48890 -183621 -15925 169634 -30238
86 -30238 -148599 50996 124770 -78787 -103095 81364 84401 -86533 -70837 80857 66587
97 66587 -76256 -59998 72327 63093 -63348 -57377 57798 62826 -45331 -62082 40264 70338
109 70338 -34409 -73485 35200 74042 -42083 -72053 45574 59598 -54989 -50017 55199
120 55199 32289 -63048 -20587 64782 2581 -71414 13258 74523 -32005 -74921 52359 74317
132 74317 -65478 -63864 81103 57696 -83697 -42657 87864 34268 -82317 -21657 75493
143 75493 11972 -64468 -3898 49489 -4100 -36526 3779 18340 -7120 -9879 1321 -1520
155 -1520 -1537 3776 -1198 -5657 1324 5666 1467 -1172 -1418 -319 5432 8688 -4665 -13596 11185
170 11185 24764 -13311 -31294 21611 39721 -28448 -44405 35292 44302 -44374 -45617 46996
182 46996 37828 -54174 -33471 54156 20691 -56143 -10252 51557 -3964 -46482 16497 38419
194 38419 -26567 -27304 37848 20558 -41830 -7748 50052 2219 -50510 8018 53473 -13696
206 -13696 -51226 20285 46926 -24436 -41071 24419 31279 -24238 -25951 17316 16180 -14543 -13651
219 -13651 6203 7821 -2346 -6367 -2029 5696 5568 -4984 -5413 8038 6573 -8650 -765 13704
233 13704 -3039 -12884 13154 15612 -20068 -13293 29631 10753 -38399 -8145 43650 1004 -51560
246 -51560 3007 52952 -12692 -55869 19253 51899 -29111 -46814 35129 36824 -40231 -25657
258 -25657 43213 15005 -41217 -995 41268 -7526 -35098 19448 32136 -25981 -24859 33465
270 33465 19163 -36416 -12153 37751 5367 -37694 -1239 32875 -4800 -30334 4866 21856
282 21856 -8389 -17622 6356 9987 -5389 -4734 2712 1020 1426 2865 -3145 -2132 7368 3113 -6236
297 -6236 718 7819 -792 -3995 4349 2022 -4994 1890 5805 -6165 -6978 7917 4775 -12881 -6030
312 -6030 12896 2925 -16056 -3391 15138 179 -15731 1134 14033 -3447 -11207 6205 8889
325 8889 -5800 -3130 9000 578 -6962 5905 7572 -8725 -5010 12823 2862 -14931 -199
338 -199 15929 -3342 -16673 4764 13820 -9000 -13402 8716 8327 -12188 -6371 11542 913
351 913 -11784 3283 10905 -7357 -8108 11675 6498 -13028 -1740 15712 70 -13683 4385
364 4385 14185 -5258 -10365 7064 8500 -7628 -5683 6102 1756 -6225 -385 3211 -3432 -2654
378 -2654 3322 -860 -5789 1650 5079 -4425 -5563 5489 5171 -6128 -3044 8316 2696 -6796 1185
393 1185 8096 -2169 -4783 5930 4377 -6468 -1353 8279 -1061 -8864 3118 7834 -6317 -8235
407 -8235 6437 5007 -9038 -5535 7486 2243 -8418 -1994 6843 210 -6019 885 5436 -1178
421 -1178 -2875 3238 2554 -2266 324 3801 -222 -1516 2758 2012 -2557 -417 2756 -1008 -2610 1126
437 1126 740 -2893 -532 1724 -2428 -3304 2480 1501 -5591 -1362 5814 -920 -6906 2813 7428 -3777
453 -3777 -5981 6144 6455 -6107 -3280 8196 2990 -7606 141 8268 -1655 -7043 4159 5767
467 5767 -6023 -4391 6661 1083 -8627 -533 6619 -2800 -7489 2960 4938 -5038 -4363 4776 2577
482 2577 -5143 -995 5229 351 -3633 1706 3894 -1131 -1579 2817 2194 -2107 -62 3203 1 -2768
498 -2768 888 1873 -1922 -2177 1434 472 -2374 -838 1047 -841 -1667 67 37 -805 -110 483 -1165
515 -1165 -69 1705 239 -1185 1497 2273 -914 -867 2430 1500 -1770 252 2446 -375 -1922 1439
531 1439 1549 -1752 -1851 1480 512 -3321 -1273 2382 -758 -4015 526 2470 -1942 -2866 2508 1840 -2399
548 -2399 -628 3346 853 -2223 723 2992 -114 -1658 1777 2651 -1092 -1099 2217 1066 -2268 -931
564 -931 2091 -328 -2809 10 1531 -1701 -2459 824 898 -2159 -1484 1352 374 -1931 -353 1889 64
581 64 -1223 1153 1758 -274 -468 1719 993 -568 502 1574 305 -619 264 948 166 -767 -54 623
599 623 -1011 -1320 287 36 -1476 -700 475 -624 -1155 726 189 -734 242 641 103 138 469 294 419
618 419 700 594 453 451 717 417 -28 337 455 -51 -484 215 83 -1032 -449 263 -872 -1026 -378 -85
638 -85 -686 -713 106 37 -434 -683 1049 605 -646 156 1564 516 -814 906 1270 -460 -81 1243 329
657 329 -780 178 668 -27 -766 -93 593 -607 -1056 -466 193 -918 -938 105 -328 -922 50 348 -447
676 -447 -51 279 -23 139 302 74 339 717 420 294 164 752 294 -448 241 683 -421 -842 255 -12
696 -12 -1327 -668 248 198 -1009 -246 87 -538 -862 -161 262 -217 -446 302 636 93 -102 728 852 -225
716 -225 107 668 593 28 130 730 391 -35 -81 43 -33 -468 -570 -135 31 -731 -800 -66 -183 -866 -910 536
738 536 138 -917 47 722 -18 -595 724 1149 111 -175 888 1039 -268 -291 992 605 -552 -403
756 -403 886 -57 -1001 -193 322 -401 -826 -464 75 -479 -903 -437 256 23 -847 84 460 -283 -197 323
776 323 999 107 -364 465 564 -94 -515 826 1126 -815 -242 884 128 -838 -111 341 -217 -1153 -283 302
796 302 -145 -1093 -405 417 -393 -1146 358 469 -612 -734 684 685 -332 -242 1178 397 -336 10 1092
815 1092 432 -416 123 836 53 -719 141 355 -565 -677 135 123 -601 -814 117 -16 -1085 -555 413 -190
835 -190 -987 5 600 -264 -446 708 326 -502 250 932 164 -207 584 282 -3 225 588 225 -147 148
855 148 172 -200 -287 -270 -290 -1006 -186 78 -954 -448 331 92 -658 8 519 -438 -508 596 828 -233 -430
876 -430 1121 610 -658 384 1392 -97 -635 544 745 -766 -579 1071 142 -1218 -150 675 -647
893 -647 -1497 147 574 -956 -1191 411 394 -1478 175 1100 -467 -653 895 702 -557 67 1014 274
911 274 -418 558 927 -263 122 623 237 -733 40 747 -577 -711 393 129 -1430 -393 590 -583
929 -583 -1316 358 477 -880 -648 743 401 -871 -108 1308 -11 -587 749 1108 -574 -544 1165 382
947 382 -836 21 1153 -184 -788 520 550 -888 -875 705 -86 -1059 56 302 -552 -958 323 408 -475
966 -475 -511 799 486 -677 581 1004 -454 -502 1105 561 -664 111 1134 -171 -659 683 733 -892
984 -892 -589 689 -41 -1357 -379 966 -653 -1409 352 424 -1233 -760 805 93 -993 16 888 -102
1002 -102 -723 775 1206 -365 -262 1318 912 -721 238 1204 -110 -688 557 659 -930 -414 839
1019 839 -211 -1143 151 714 -727 -1241 638 -76 -1033 -232 609 -221 -728 594 747 -397 -361 1029
1037 1029 563 -790 294 1276 90 -991 865 1166 -959 -601 1170 199 -1351 68 907 -529
1053 -529 -1040 647 655 -1068 -874 1141 130 -1415 -86 1177 -550 -1240 492 1007 -702 -244 1380
1070 1380 251 -920 292 1130 5 -683 705 739 -971 -140 917 -345 -1303 123 715 -854 -721
1087 -721 702 -263 -1366 65 1117 -491 -940 737 436 -1185 -172 1291 45 -1064 376 1092
1103 1092 -451 -746 1331 1034 -1165 -49 1728 225 -1346 467 1219 -797 -1347 1004 655 -1461
1119 -1461 -599 963 -176 -1481 107 924 -795 -1101 1154 363 -1348 -68 1247 -70 -647 801
1135 801 933 -607 45 1088 301 -498 286 769 -43 -260 271 319 -724 5 646 -249 -1273 474 562
1154 562 -904 -680 890 23 -1031 375 1037 -560 -900 645 787 -1040 -251 1320 545 -829 301
1171 301 1403 -299 -1072 1113 721 -1005 -417 1098 106 -1307 89 805 -632 -1058 349 517 -856
1188 -856 -585 667 127 -937 -16 815 -642 -667 935 576 -594 67 1015 252 -593 700 914 -399
1206 -399 -203 673 497 -863 219 529 -553 -757 298 354 -808 -439 312 -23 -819 166 566 -346 -871
1225 -871 691 713 -881 -500 1038 -78 -858 441 996 -370 -964 814 875 -510 -379 1112 -8
1242 -8 -915 66 843 -828 -589 444 597 -817 -370 621 -483 -971 -89 504 -648 -694 363 559 -344
1261 -344 -6 697 202 -571 204 967 -229 -242 791 296 -572 62 529 -318 -476 290 178 -716 -280 558
1281 558 -187 -626 -125 554 -526 -659 736 436 -521 -338 1023 -81 -753 577 814 -365 -315 956
1299 956 497 -790 81 911 165 -461 332 789 -658 -627 641 106 -1035 -160 633 -271 -729 350 724
1318 724 -701 -466 526 55 -492 182 657 -156 -405 387 263 -323 157 673 257 -310 205 591 -477
1337 -477 -63 422 224 -575 85 497 -480 -634 -120 -2 -648 -457 167 72 -635 33 509 -238 -514 297
1357 297 568 -565 -152 511 41 -464 308 657 -155 -258 693 259 -218 100 193 157 -351 92 75 -317 -345
1378 -345 113 118 -774 -205 247 -157 -467 317 -17 -278 151 365 148 -405 438 573 -43 -160 376 511 -230
1399 -230 -22 588 61 -296 84 206 -135 -508 138 31 -117 -516 302 -154 -418 141 103 -303 -174 45
1419 45 390 -317 -20 509 475 -117 66 371 55 45 236 275 95 325 364 62 -251 139 121 -217 -155 187
1441 187 -108 -347 -73 42 -317 -581 90 172 -323 -431 488 -108 -14 124 634 -169 -382 366 489 178 -329
1462 -329 421 382 -194 -94 417 301 -386 -204 90 -357 -24 -243 -152 -301 -53 -103 156 -181 -87 -262 -250 95
1484 95 327 -162 -8 155 -109 49 89 340 367 99 148 267 -82 -240 163 213 -321 -89 354 91 -327 -265
1506 -265 84 -342 -699 54 -2 -402 -264 58 106 -110 -199 320 -76 -353 254 358 97 -100 17 -8 114
1527 114 -102 269 204 -286 -21 -5 76 -79 -29 -166 -333 65 -153 -372 -77 -3 -8 -296 77 -142 53 -237
1549 -237 19 140 -62 -55 -4 2 -182 102 327 136 377 272 51 -110 -34 308 -220 -224 118 -269 59 180 14
1572 14 291 -212 -79 41 -137 -130 -31 -89 39 32 103 318 96 51 98 192 70 78 129 30 -115 -78 108 -39 -17 43
1598 43 -45 10 -53 -166 27 -286 -265 -47 -140 -274 19 65 53 -199 -44 -323 133 84 -20 204 -143 447 156
1621 156 -73 62 57 247 -151 215 78 77 -68 -127 214 -151 -110 -56 -2 -378 -58 -13 -128 -563 -71 -3 -375
1644 -375 -169 99 55 -311 105 385 180 -43 -72 206 -37 -104 -37 29 46 -59 122 -102 -155 91 43 -238 -37
1667 -37 -122 -182 -211 -234 -331 -49 -13 -148 -124 69 288 -222 88 206 24 -72 64 282 317 -46 -226 73 -49
1690 -49 -188 53 143 116 -120 24 193 -29 -253 -176 186 -111 -301 -64 149 -9 127 288 70 -91 201
1711 201 86 71 252 -197 -88 6 39 74 12 -183 -5 -18 169 108 -167 70 -31 11 14 -54 -89 -63 -297 -342 141
1736 141 -260 -45 -150 -211 -178 8 21 11 398 -14 29 209 88 -169 261 102 -12 144 133 83 104 219 113
1759 113 -67 71 -32 -85 75 -309 -152 -137 -287 -348 124 -106 -214 25 -72 -142 -194 95 -79 -85 -156 12 -17
1782 -17 150 26 66 -152 331 99 74 -191 -109 229 74 -167 -17 -22 51 -403 94 -268 -351 -60 -72 -214 -105
1805 -105 25 -305 -79 168 13 -112 21 -127 287 52 -9 174 217 -1 11 -53 341 -27 -2 287 -137 19
1827 19 114 80 -461 -37 42 -225 -14 152 131 102 63 65 81 141 -151 351 17 -22 380 189 264 159 129 251 -113
1852 -113 53 -36 -119 95 36 109 61 -65 -116 -66 -35 6 -122 80 -113 -83 235 -78 15 105 -4 -56 134 -38
1876 -38 135 -64 -64 -63 87 -124 185 -69 81 56 151 78 34 -28 -91 -287 -35 160 -149 -161 -231 -326 -54 -29 -31 -49
1902 -49 99 -337 -60 -38 -125 223 264 215 -220 -60 39 44 -188 -130 101 287 -28 128 172 73 -27 68 -51 -169
1926 -169 9 22 53 -192 -74 -51 84 -36 -370 -57 198 251 -52 154 -4 -171 26 90 41 207 5 -48
1948 -48 157 81 35 209 84 -169 22 -60 30 -119 -63 -72 107 -52 -124 -12 -134 -36 -18 11 -68 81 -73 148
1972 148 90 153 -7 43 60 -48 13 169 -182 -238 246 -74 -5 -29 -285 -62 -45 -160 -66 21 -94 -87 -88 -228 -197
1997 -197 66 -56 -64 -125 53 11 100 76 -25 174 112 -107 30 -178 443 170 -151 4 170 -88 173 -33
2019 -33 -27 -15 141 -85 -87 54 28 32 -406 -31 -180 -72 -17 34 -25 126 205 -126 -72 13 65 37 230 172 143 309
2045 309 149 31 121 157 128 -9 -61 33 -135 114 -36 84 -227 -24 -86 162 181 283 -134 -12 5 -97 8
2068 8 49 116 109 178 -47 93 46 78 -60 118 -106 41 -152 -57 -61 4 124 -29 -219 4 -52 -22 -22 244 96 -154
2094 -154 2 15 -67 161 140 137 -180 258 133 191 -113 83 32 -48 -194 280 88 -102 176 13 121 -268 156
2117 156 96 18 -328 -143 -186 -120 -18 16 -84 89 200 -203 -180 20 166 -57 -182 104 119 -45 107 -8
2139 -8 -42 171 -92 46 23 77 148 -137 -108 60 134 227 -113 31 193 -179 -31 -40 121 -1 -96 -91 -17 -58 -146 24
2165 24 -55 -125 304 13 -11 -200 52 -192 24 0 106 169 -43 80 -172 -155 -102 -267 -72 -236 -388 -146 132
2188 132 -172 -115 -45 29 -4 0 18 26 251 -48 61 -20 293 22 -40 130 39 -42 14 169 83 -67 389 59 -6
2213 -6 -12 352 77 -254 -154 108 -25 -96 53 103 5 -27 101 -57 -68 -76 33 1 34 58 -15 -41 -25 -57 -55 -127 2
2240 2 136 111 141 -112 -69 -78 41 -240 26 73 94 -12 -92 160 150 -35 -183 -170 283 71 130 -87 86 285
2264 285 -51 51 -8 -19 48 -82 -201 155 2 18 235 360 -56 -182 88 -82 -135 -181 52 -223 14 -19
2286 -19 -53 76 221 -265 -152 261 -4 -78 -32 115 -193 -26 261 64 73 -131 -164 -60 43 47 149 19 -169
2309 -169 -31 -105 -131 65 182 76 14 -20 68 -117 -232 48 -193 10 13 81 -232 -169 -142 48 97 -194 83 79
2333 79 173 -165 269 -3 -71 226 189 184 -34 239 0 123 -76 77 -47 68 -210 -84 48 -85 23 104
2355 104 20 -341 -5 -52 28 99 54 -154 -184 68 91 -23 -94 170 322 16 262 -60 74 171 209 -55 137
2378 137 82 -62 -181 -159 29 31 -148 -84 -246 -9 33 -87 -37 -109 74 131 -9 62 -32 -48 -4 -85 9 112 302
2403 302 184 162 -27 91 71 30 -73 38 33 5 110 13 71 91 -225 -270 42 -126 153 153 -106 55 -125 -81
2427 -81 207 -41 -62 285 57 -15 -106 -91 68 -105 54 -30 -156 105 146 51 -189 233 -116 44 57 226 252
2450 252 94 -25 -26 142 0 37 -344 101 328 112 12 -44 -103 28 173 141 -9 -23 -94 -8 4 -158 -211 -91
2474 -91 26 -260 43 -119 244 -14 92 -33 -20 -32 -98 -108 263 59 54 -38 -12 36 135 116 89 -84 288 30
2498 30 -157 -3 -96 -166 48 -117 -74 -100 -215 -76 -57 87 -141 62 -126 -167 25 -17 159 -115 155 110 -124
2521 -124 10 64 45 -119 42 116 226 -294 357 -144 -121 22 32 -69 44 144 240 -177 -50 -9 118 -52
2543 -52 -71 47 -22 21 70 5 -32 -22 14 -148 14 258 63 140 93 89 -90 46 6 -131 -134 117 135 -21 -108 53
2569 53 251 -46 270 187 -215 85 146 -85 41 122 104 -52 188 312 -52 231 172 -163 -58 131 -59 190
2591 190 -82 -171 -38 172 -56 -177 23 167 -36 -263 -70 -62 106 -224 51 2 -62 167 86 -62 -136 147
2613 147 205 -114 -238 94 82 265 172 446 99 -68 -69 109 -298 35 -135 9 -27 -108 14 120 45 -43 -102
2636 -102 9 -47 -170 -170 -158 -27 -93 62 -188 -32 -114 48 12 101 -9 -91 5 20 208 16 133 6 -126 3
2660 3 162 9 -20 87 -204 -6 -170 55 38 46 45 -231 -141 -146 253 -239 173 -86 -84 168 -41 -14 -98 -43 -205
2685 -205 164 -87 64 -191 -98 31 37 -46 195 151 6 160 153 -26 -96 140 76 -129 41 -31 -46 88 75 162
2709 162 112 182 76 30 193 118 189 -80 125 135 28 95 -93 -171 -14 34 -103 90 -11 -80 -95 -89 -213 222
2733 222 155 317 -81 -224 -111 -278 -80 -38 110 33 -144 80 -109 -240 146 -12 -164 168 122 -119 127
2754 127 138 -185 103 170 151 -47 -168 249 -43 -29 160 -121 50 312 89 -217 -186 -175 13 133 -106 -187
2776 -187 121 141 -47 11 -77 -16 173 -2 109 -162 62 -209 52 8 -112 130 -109 -6 -53 107 -101 15
2798 15 233 -73 -58 137 30 -21 -11 -84 -107 15 -89 -166 -244 184 116 141 131 192 90 -151 52 -131 101 -4
2822 -4 -15 288 -3 47 -66 -29 147 -164 88 35 -32 109 -44 -31 0 -147 159 93 305 -62 -131 -58 218 -41
2846 -41 -3 -125 -68 37 9 55 -205 -96 103 -38 29 -206 45 -181 191 -75 55 230 207 105 -192 -60
2868 -60 18 133 14 78 -147 -10 -455 -169 61 110 18 -30 16 -65 -323 148 187 32 -59 -120 -388 -76 95 19
2892 19 -100 60 217 168 134 117 85 -93 -148 -87 48 198 196 8 2 -67 -217 -31 90 -100 -36 81 17 163 42
2917 42 -140 211 -196 66 -48 120 -210 -164 -230 142 -182 -110 -23 -3 172 -16 63 0 154 27 76 176 43
2940 43 190 41 -76 201 -104 371 315 -49 -195 -138 0 -97 93 -92 171 -301 51 -235 -74 20 -33 -15
2962 -15 0 -68 245 -2 -63 88 -7 96 -24 232 332 196 74 179 -180 -72 -69 -157 170 -177 -20 -113 -59
2985 -59 290 95 -356 63 264 134 -8 60 -246 -94 -164 -71 20 79 -190 144 -38 -54 48 108 -314 -14 281
3008 281 -159 -2 109 -234 -201 40 -2 -71 1 -29 -133 100 -60 -31 -44 134 80 -57 -200 176 125 -12 2
3031 2 120 -112 -15 33 34 82 -1 -32 -11 -99 -44 -31 -7 16 -263 -80 109 69 -49 174 -94 -7 241 -20 161 60
3057 60 68 -173 -61 -23 -193 -103 -87 -135 -86 -143 228 -134 147 -166 -61 -131 -85 -45 -34 115 -153 -61 47 -218 -72
3082 -72 -71 -137 -104 97 -254 -184 -23 -58 70 144 -73 141 64 131 148 -131 22 -47 30 183 51 340 -138 -15
3106 -15 138 -114 120 -22 -48 225 7 -101 -61 -54 111 -224 -257 -19 22 186 180 -9 192 7 -102 -173 -98 -82
3130 -82 210 -139 -257 -91 14 40 -22 53 110 -281 -59 23 -114 31 68 20 -183 2 -202 -127 24 -117 -109 -205
3154 -205 126 17 -179 -9 286 -96 -61 216 -68 -81 -131 -60 58 -58 1 284 -34 -140 -102 61 36 -118
3176 -118 151 -170 83 5 -54 -28 -210 -132 109 -132 -116 114 -26 134 227 -90 27 79 -222 -55 -35 4 102
3199 102 -49 -2 55 -207 -107 -76 124 60 -9 90 11 -292 -151 -210 68 299 -65 -108 -34 -178 -146 -40 135 16
3223 16 -58 83 -83 131 123 -41 -186 64 278 -148 -210 48 181 -43 82 -59 -262 136 -155 -37 -344 57
3245 57 -50 -36 -176 207 214 -18 -37 23 273 -12 28 -82 8 -14 -49 192 73 96 -115 9 321 -141 -128 -82
3269 -82 169 69 117 -175 184 -227 -58 2 -234 33 -368 -314 158 -3 17 -139 184 88 -203 159 -310 282
3291 282 39 16 -277 -10 -132 56 22 -185 -172 33 272 83 69 182 -127 127 -88 99 -255 -26 148
3312 148 76 232 142 6 46 154 -27 -10 -183 -120 -420 -83 74 248 223 -217 261 -77 157 27 -108 140
3334 140 -71 -185 237 119 160 181 172 -53 -159 -229 -128 118 5 -114 -22 141 -52 158 -120 -112 15 -65 69
3357 69 81 179 -149 108 161 335 -289 21 176 -76 21 -45 -89 -257 -97 -252 288 -119 9 -77 -73 -168 -176 -159 267
3382 267 26 -13 62 -281 25 292 2 -69 -6 -152 51 -37 4 11 -55 212 147 101 -133 11 230 -217 -58 -24
3406 -24 10 -127 -268 -90 -145 -92 176 -76 36 23 59 110 171 87 29 31 -97 69 -14 39 -61 36 118 -66 8 80
3432 80 -80 12 4 78 -79 137 -34 -97 -110 -239 -9 -96 -143 -223 135 -295 -69 -78 -2 53 133 142 -24 -169 34 -86
3458 -86 -232 -221 110 -64 -81 -394 -42 -47 128 297 -105 22 -150 -247 -144 101 -41 -93 -77 136 -56 -43 -51 46
3482 46 82 -72 85 153 1 175 123 -131 -14 19 -73 104 255 335 -61 134 -124 -60 57 135 -36 -12 138
3505 138 -252 221 -132 -83 -141 97 103 -269 -150 86 186 -31 86 88 190 118 228 12 192 59 77 -244 -167
3528 -167 5 215 201 -149 -125 218 -55 -153 40 -273 43 -168 35 -173 119 -93 100 -149 18 -130 -166
3549 -166 97 -14 98 -139 -222 -106 7 162 -121 238 -37 223 -101 -372 194 -116 132 81 17 -37 80
3570 80 -62 -173 -132 -2 -129 -27 -110 -4 15 123 5 -39 -42 88 -10 -314 38 72 53 26 -45 213 -85 -139
3594 -139 -185 -170 -106 209 -47 264 3 68 118 213 -62 -93 47 -271 120 -260 172 217 -49 -113 156 -159 141
3617 141 -153 -44 20 -223 -138 -10 85 172 143 -83 -45 138 -197 -123 -13 31 -29 -335 177 62 -11 14 110 247
3641 247 -51 167 49 12 -248 9 -160 -79 34 -272 -64 -53 58 -66 275 77 -50 -88 -99 -15 -53 -232
3663 -232 -82 88 -173 -185 -251 -214 200 -78 -148 411 -27 75 -34 -34 44 -114 219 31 94 -66 205 -49 260
3686 260 44 -93 133 196 -54 19 114 110 -353 -38 -185 114 -7 -318 -120 -92 78 -96 -153 -29 -58 41 401
3709 401 164 279 22 -167 140 101 107 208 -53 166 15 -61 -57 46 214 -29 24 -45 -54 11 -198 57 189 -32
3733 -32 43 16 -334 163 -208 193 163 124 -21 488 -185 -204 -72 192 -187 25 -141 -78 60 -50 -103 78 -158
3756 -158 -87 17 10 -96 39 -90 -109 69 -119 -143 -78 -78 -180 -94 -64 25 47 -32 6 5 -72 21 183 1 231 146
3782 146 80 77 -26 -139 -6 -89 -31 -76 -73 141 -3 -144 4 -152 -157 127 -123 101 57 -80 -34 -175 -304 38
3806 38 243 11 40 77 145 -146 -24 -43 68 105 -28 137 127 -60 59 -245 -310 -160 -156 84 60 -207 -48 46
3830 46 48 -62 -110 42 -13 -210 147 212 8 -160 -12 -27 16 294 227 -26 -17 72 -144 -314 -65 -78 -57 70 1
3855 1 33 98 -65 -222 -30 38 3 -163 -48 -6 -126 -246 19 237 -102 -56 -30 93 -8 -63 -104 -54 3 -41 -81
3880 -81 -34 16 -256 -128 -69 124 13 -3 -330 -182 217 -52 -75 -247 52 -91 9 -14 211 -4 -85 50 44
3903 44 -250 -145 15 -258 -96 -67 -210 60 131 36 -329 243 74 43 -169 -136 -47 -82 137 61 -24 -58 40 41 -72
3928 -72 -90 24 236 -77 -50 -42 66 -148 62 -47 -22 15 -49 16 -37 48 -146 -241 33 -172 28 -21 -23 -24 86 52
3954 52 -117 -136 118 -218 30 -186 -20 -19 18 194 -99 -38 94 -99 62 196 79 100 -207 -243 -211 -192 46
3977 46 -52 56 -44 -56 190 74 -162 67 300 24 -81 24 81 111 0 110 -64 -213 127 -161 108 74
3999 74 -129 -226 -199 -4 92 -243 -227 185 -49 62 -123 -192 -130 -126 105 -115 -137 -163 190 27 113 -39 153 169
4023 169 -268 237 -54 -132 61 228 207 275 167 -27 46 78 -60 158 -155 2 134 207 -23 -55 -9 29 -147
4046 -147 36 -259 -350 11 16 -69 -138 92 -71 -44 -123 -47 -16 -115 137 228 -29 140 125 -101 75 81 -26 140 -67
4071 -67 -96 16 44 0 -196 204 -80 19 -288 27 18 -89 139 -87 108 172 -78 -156 -182 -54 99 -303 -47
4094 -47 -102 57 39 10 12 -117 149 -297 208 12 -141 -176 -97 113 77 -61 76 134 -4 50 75 -156 -27 -37
4118 -37 95 0 -282 -20 -14 181 -129 -72 2 -170 19 -43 -40 93 88 -131 67 -20 178 -82 -68 -62 -107 -19 -37 173
4144 173 54 -254 67 -84 -423 126 -28 30 170 75 214 48 -201 113 119 -264 145 124 114 85 215 -1
4166 -1 31 -113 -27 -61 -3 5 191 -152 -83 -149 -158 -159 6 -84 -24 2 76 -305 -65 -98 236 -124 12 139 133 59 24 223
4194 223 2 293 -36 14 50 35 193 -142 296 -33 180 81 -28 -17 47 106 -225 -1 -71 -98 -193 262 -8
4217 -8 -54 -95 195 71 90 437 107 85 67 -138 -21 -193 -132 -12 105 -218 -98 29 203 199 -29 -79 -44 -72
4241 -72 -84 213 16 -49 -114 -50 2 8 201 -188 53 -140 -52 85 -71 -32 205 196 118 -82 5 109 16 -136 70
4266 70 -71 -114 -211 -50 48 -160 82 -256 200 259 -5 -10 62 186 -90 117 257 209 56 -185 160 -120 -151
4289 -151 -78 217 156 -39 -90 -349 -58 -61 202 68 288 -89 -268 -76 153 13 30 135 -104 -150 55 4 61
4312 61 172 3 -50 -75 50 15 -82 110 60 28 -59 12 96 147 -80 39 42 60 152 356 128 18 -67 30 -102 141
4338 141 -109 -191 -53 -201 -27 -47 -309 206 30 -102 274 19 -47 -93 -227 175 -235 162 437 11 123
4359 123 32 -106 165 -68 148 -2 25 -46 -155 63 -96 -150 280 55 -186 71 -144 161 -26 -136 -22
4380 -22 226 325 -7 -75 181 164 -1 104 162 206 74 256 -124 -27 -78 37 4 81 -175 121 152 -86 71 -211
4404 -211 -9 105 11 -278 -143 6 -69 -44 -115 73 275 26 114 -134 -139 -189 -43 -107 15 -143 46 216 140
4427 140 -121 22 -99 -142 47 56 -3 -97 43 -39 -145 -168 84 206 265 -53 53 -188 -27 -166 -7 170 -96
4450 -96 -160 19 55 -140 -189 -44 216 47 -20 26 -206 -84 -132 88 -293 23 -123 -142 141 -232 56 -64 -268
4473 -268 -131 186 -81 210 -114 91 -68 54 -293 -16 -13 286 -54 78 121 -192 199 111 153 77 153 51
4495 51 16 -25 45 -103 -75 152 146 -142 96 -122 151 87 13 146 204 34 61 -101 -71 46 -126 287 88 -133
4519 -133 -29 -186 131 47 187 316 237 92 -103 88 -180 174 18 -127 73 -6 33 50 -137 21 -75 -54
4541 -54 -71 -19 -52 -195 -91 -7 -86 -10 63 90 -90 61 -19 -96 38 153 301 129 -49 -177 97 -35 -49 162
4565 162 88 98 -15 61 -28 109 -1 -61 118 -123 92 -86 -30 -47 35 -53 -191 61 188 -134 23 63 -44
4588 -44 6 13 73 42 -128 -380 -161 -24 -100 -152 -24 148 254 143 -126 -43 -162 41 -10 -258 89 -2 -59 -112
4612 -112 -70 -1 -180 140 75 -72 183 -294 95 34 10 2 -12 53 3 137 -50 -153 -201 -138 5 -112 -131 112
4636 112 -66 -65 -89 84 291 109 -83 -17 236 -100 -32 82 -215 25 -43 -83 177 77 60 -29 -97 -223 -100
4659 -100 -208 -147 83 57 108 40 -119 -132 -221 60 50 -151 -72 171 137 111 28 161 101 -52 -125 -52 -105 -221 122
4684 122 193 70 110 34 -167 -73 -60 -123 -137 224 -29 25 56 -140 -205 -126 33 -41 29 -167 139 465 38 -45 67
4709 67 245 35 91 68 15 165 82 -10 -145 235 41 -235 -32 17 16 -45 213 121 -108 -110 40 75 -184 -142 -1
4734 -1 -112 -152 75 83 -23 -153 -74 31 16 -190 -140 -148 206 -124 197 -62 -65 -8 -83 -134 -42 108 25 69 135 15
4760 15 -100 80 173 12 -163 -100 -54 -2 -145 -288 -305 150 22 -83 22 83 104 16 -234 -104 51 -23 43 24
4784 24 -133 -53 -35 -30 109 235 -34 223 42 -44 -167 143 67 11 -39 49 -46 22 -41 -106 194 -215 113 32 -238
4809 -238 17 -175 -68 84 180 -58 -133 162 85 -165 -167 73 -68 57 67 -7 154 -20 14 -156 -30 -111 -6
4832 -6 -36 25 -172 -34 220 49 60 15 130 -73 4 -208 94 70 28 -33 27 91 33 130 74 -145 -382 210 13
4857 13 112 84 -236 -106 -138 148 337 259 -121 -120 51 -273 99 126 187 -195 -71 133 31 -99 -71 153 6
4880 6 192 124 -133 -131 134 51 -46 79 -1 -208 -80 131 148 52 63 23 23 24 -88 184 80 -31 -47 -12 52 -92
4906 -92 -248 321 29 303 59 -242 274 145 -335 -10 -207 107 -45 -134 -125 -80 21 -167 24 71 386 126
4928 126 48 -272 72 76 -176 -60 -71 157 -109 139 -26 -68 26 92 69 36 100 -173 293 114 232 12 116
4951 116 -12 0 78 267 -46 -181 50 -119 -21 -32 -86 -266 -69 -54 117 10 109 -138 -19 41 -12 -201 41
4974 41 -43 116 59 -97 75 -14 -50 -148 109 -210 93 14 165 153 -146 102 93 45 68 19 -115 73 53 -200 -185
4999 -185 -74 -64 200 19 4 155 43 -44 59 -60 89 131 103 36 95 -195 51 -316 127 51 3 58 137 116
5023 116 131 -92 122 -226 246 170 128 19 -132 132 92 -92 -186 10 18 -246 189 220 -52 -88 4 -79 247 -90
5047 -90 261 -110 8 268 34 268 9 -106 -15 65 -13 -59 147 156 354 -59 -263 -44 411 -53 277 31
5069 31 35 329 -46 -9 -197 104 290 145 -23 9 45 -142 -213 -224 -7 230 150 -52 74 155 195 -56 -58 -148 -130
5094 -130 -180 -122 -23 84 -26 57 86 -76 -161 -170 49 7 -24 -74 118 -290 19 -66 243 109 129 -37 148 184 14
5119 14 -95 115 -78 83 141 -65 9 37 142 17 -76 74 -1 14 20 -110 -115 120 243 -7 -39 -140 42 -178
5143 -178 79 -51 95 -56 270 -278 61 -38 -127 -30 117 71 -47 28 212 -5 74 -10 -121 -5 -31 198 -64
5166 -64 -10 52 -200 193 81 -43 -81 -193 56 -320 -168 46 -5 -73 -28 -121 -215 31 44 -1 -257 58 -311 119
5190 119 -84 82 -31 48 75 -361 -11 130 -33 10 -229 -223 58 49 139 -253 -12 113 -12 -123 15 128 34
5213 34 -160 -266 -76 126 -90 152 -19 -134 -1 105 152 34 -112 47 44 59 88 0 -7 277 -137 -348 170
5236 170 29 -88 40 -85 96 -72 -123 -52 72 -94 240 -202 102 -43 -137 122 38 90 -328 -141 -75 117
5258 117 -33 24 -114 -151 -283 -50 -99 142 -36 4 53 35 -70 -82 -166 32 40 -21 -50 -46 -15 -120 -1 12 -2 -67
5284 -67 256 280 265 -13 -2 -186 222 -13 78 -34 91 222 156 73 148 -131 -166 48 139 127 -32 104 98 33 71
5309 71 55 236 64 -192 -53 -66 -121 21 -96 321 22 261 193 -250 53 55 56 -115 41 -175 330 -95 -15
5332 -15 278 -127 -173 -91 -97 -13 92 9 -24 -145 -195 100 91 -37 132 125 -48 160 -246 -56 133 -74 157 197 79
5357 79 160 -95 -72 230 32 -87 -122 -43 -92 185 -74 123 87 -71 -110 -11 48 173 181 -265 42 -80 222 23
5381 23 -220 271 192 -32 39 25 -69 -166 127 -144 -46 204 -114 73 236 267 195 25 198 -131 63 -39 -250
5404 -250 3 19 -186 189 -184 -48 50 -51 90 -11 41 -21 -112 -55 161 -33 275 -14 22 173 66 0 34
5427 34 161 -110 35 -99 -222 304 -37 -159 76 -130 -111 96 58 77 112 -135 -207 -156 -88 149 -103 70 66
5450 66 -243 215 -137 311 96 264 74 90 288 135 44 99 111 99 48 50 210 -11 142 -30 196 120 -9
5473 -9 -150 63 194 -5 174 48 337 6 -17 36 -233 171 -271 116 -9 -61 482 125 -150 6 -239 -14
5495 -14 99 -218 173 20 37 139 -155 -38 108 -159 -76 -68 -19 176 -221 -378 -143 200 3 -109 -324 -92
5517 -92 130 67 57 201 -103 -111 253 74 108 144 98 -142 15 -59 201 50 117 149 348 -13 25 -19 -191 8
5541 8 49 46 182 -12 -295 207 133 35 -193 202 -60 50 -39 -39 -200 72 -38 52 -198 -312 114 -70 -101 -99 -44
5566 -44 -133 44 201 -120 -75 -267 52 -99 -237 -125 -212 60 -136 118 5 -40 145 101 -8 371 -134 -163
5588 -163 -81 105 -173 140 -64 74 8 -122 -122 30 72 -59 160 14 84 -67 -100 -40 18 22 -4 20 -219 -32
5612 -32 -160 152 -284 -37 27 -81 -260 -31 108 -58 112 -91 -85 -26 64 -52 -40 84 375 78 -328 -66
5634 -66 -18 -90 -187 154 -110 -17 136 -145 12 207 -21 -77 -92 77 -291 161 -247 -188 -61 -38 -200 -13 -110
5657 -110 17 9 83 61 11 129 -24 16 -176 -13 133 79 125 95 71 -262 15 287 -61 115 80 270 139 328
5681 328 202 95 193 79 51 79 109 -150 -42 -162 69 -113 43 -148 -101 175 -108 199 -137 -238 -78 101
5703 101 -125 -93 123 -34 -304 -164 -83 -22 78 -75 -29 -1 13 -41 -73 58 109 175 -111 18 -64 -102 312 -87
5727 -87 31 -116 20 68 -42 -94 126 71 -16 33 0 -289 89 -69 133 132 -218 131 5 -179 -58 215 -151
5750 -151 -59 -209 3 -37 110 35 -23 161 -125 276 290 -37 -226 -37 32 269 45 -78 -315 -147 -243 -8
5772 -8 -142 -249 137 -116 -325 -54 76 -76 -41 -98 162 -71 -71 -126 -155 -126 265 -285 -153 -44 -39 -258 306 -277
5796 -277 -72 -16 -139 249 -241 -58 198 55 5 -31 71 18 199 -21 -46 20 6 35 65 -330 56 167 -229
5819 -229 25 -99 77 -41 6 12 4 69 210 -280 167 -199 9 -42 -165 127 170 267 -64 23 142 -155 -61 112
5843 112 -109 153 -140 -100 -145 235 -284 34 -88 89 -42 -125 -122 -136 62 172 52 211 58 -150 -21 1
5865 1 -44 172 2 134 109 -36 -57 -21 21 150 197 -231 157 23 -90 -85 84 -274 -59 1 -107 22 -171 11
5889 11 -59 95 -128 47 -6 -185 -218 -53 -165 -81 -36 -34 -158 161 9 -201 47 7 200 -4 80 -25 -120 0
5913 0 41 -55 -44 140 99 16 -23 -55 -170 123 136 -60 -104 -21 100 54 151 -161 77 -87 -201 -8 177 -45 -60
5938 -60 -187 36 -143 33 -40 26 37 -62 444 126 133 63 -115 23 147 -393 17 47 -6 -10 6 86 10 106 54 76
5964 76 -27 153 -100 -50 -151 16 -53 -127 249 -23 -9 90 45 -17 -129 -200 -173 -72 124 -55 -115 92 169 -242
5988 -242 47 103 -197 -175 251 -16 42 76 -68 -108 -84 49 -92 -70 98 191 -42 -46 -97 -97 135 -45 9 -21 -151
6013 -151 -79 44 235 12 127 -15 10 197 9 -96 -397 -20 78 -80 11 14 105 -284 268 33 -135 -225 -27
6036 -27 138 -58 61 -50 -109 1 74 -126 46 -107 73 52 158 200 79 62 36 326 -198 44 -118 27
6058 27 19 55 277 135 -108 318 185 -87 -211 32 49 186 -327 112 245 -115 -128 83 9 -48 46 29 -169
6081 -169 99 163 -48 -65 -120 191 29 165 29 373 118 306 12 -116 49 119 -110 83 -75 174 311
6102 311 101 100 -42 -154 128 165 -54 104 45 -34 -209 -353 59 -86 57 -25 41 41 -132 143 35 -240 -112
6125 -112 53 192 34 -194 265 -104 -141 -74 -190 -41 -29 36 -143 129 16 152 286 231 -173 -285 -154 -48
6147 -48 144 -59 -280 151 -52 -72 -277 -77 -37 -249 -162 -56 128 181 21 -64 72 254 278 103 -66 1 54
6170 54 -60 14 52 63 134 164 -75 -147 104 44 -8 -122 67 -154 174 87 282 52 -64 111 77 265 -118 71
6194 71 85 68 -99 99 75 175 34 -44 -83 -364 5 -20 -147 -96 214 187 34 8 -27 -131 312 -268 -63 -84
6218 -84 -105 264 -232 -291 26 -178 -34 13 48 15 -4 70 177 161 185 -2 -223 -138 -66 -22 -8 -131 55 7 139
6243 139 209 283 13 -186 132 80 33 -61 141 127 -63 -114 -82 -153 103 -105 61 216 93 117 -13 306 -44
6266 -44 -57 -57 100 -233 -31 20 10 -144 104 7 117 182 184 -88 135 -84 -25 293 -27 -83 -65 -162 91 192 -86
6291 -86 3 102 -74 -88 75 59 -90 -104 193 -60 128 74 63 -119 -114 39 -114 -109 114 -158 -92 -149 104 -134 40
6316 40 -240 -1 71 -60 35 -59 -206 53 0 -26 296 -19 -179 6 -72 14 -53 -137 -80 155 93 -84 -52 -98 197
6341 197 -37 46 -24 11 -48 13 236 1 107 84 -100 98 76 -149 125 -2 -132 -183 -12 34 132 -112 -236
6364 -236 15 88 183 22 -230 -23 10 -14 -286 -149 -116 -61 -9 119 -12 74 188 -31 -38 62 -22 9 -204 -157
6388 -157 -24 121 169 20 -79 265 -59 -163 -11 -126 61 -70 -143 312 5 -105 164 60 -14 146 45
6409 45 196 36 74 44 48 -178 -254 -58 -74 -3 130 -56 -14 -7 138 63 -102 70 172 57 90 -80 21 64 -108
6434 -108 -108 -66 -49 -200 -91 -57 -43 307 122 1 -108 -16 4 -277 -102 50 34 -160 -67 -210 227 -173 4
6457 4 22 -11 113 107 169 -46 -12 32 -11 -65 217 -90 -10 -15 -73 136 -165 -22 -7 -125 -231 -123 16 -202 -17
6482 -17 262 -186 -132 -23 -21 -206 123 50 299 57 -115 -23 -167 253 -182 -25 -90 -55 176 62 -50 55 -97
6505 -97 88 254 134 158 11 -58 -76 -211 162 207 -84 131 114 -144 23 -79 186 192 168 54 -105 107 -36
6528 -36 123 85 116 -2 -37 -148 46 67 130 7 260 152 -77 -21 -280 -109 -50 63 -100 181 -83 -127 167
6551 167 -56 -112 70 -102 188 186 -304 -140 235 137 -106 341 -89 35 -84 81 186 -98 78 111 11 -210
6573 -210 209 -180 210 171 127 64 22 90 -38 -90 -42 -154 -156 360 23 61 368 -29 -20 68 -221 52 -101 -142 -53
6598 -53 325 -12 70 -16 0 227 114 29 -70 112 116 49 -174 -237 137 266 -71 -175 -44 -46 -16 -181 -30 57 -55
6623 -55 -10 209 67 -97 -160 -107 -147 -75 -51 34 -25 11 61 -341 -139 -151 30 2 252 130 -198 299 -68 89
6647 89 101 159 307 -102 -44 -19 -97 -140 124 52 156 -28 182 127 -3 155 -102 170 18 190 -1 -189 77
6670 77 65 -60 9 140 66 -308 -73 -217 52 -182 107 -37 -213 24 77 -156 -58 -17 125 205 -53 182 58
6693 58 -57 -109 148 91 -149 79 38 41 -55 -115 210 91 193 -5 -113 -128 -80 182 -233 -31 -103 166 120 7
6717 7 42 22 4 66 2 34 -28 30 118 111 -197 7 71 -33 -5 140 -178 -220 -51 70 -94 75 317 -30 -144
6742 -144 90 -15 -22 114 -225 -116 -30 26 46 62 147 -22 5 66 133 -266 -151 206 163 -114 14 -168 -248 79
6766 79 211 149 67 118 -8 200 -148 121 40 -133 20 -147 -24 206 104 -41 111 -64 -274 -41 59 348
6788 348 180 -10 -65 206 183 -102 -261 -116 -184 210 -101 -86 74 27 -30 -192 31 -230 93 17 195 -65
6810 -65 63 140 226 -238 238 133 -93 -164 282 136 208 -105 81 -44 -65 -134 123 -170 1 156 -268 -76
6832 -76 132 131 -104 -27 24 207 -76 123 -117 34 -15 9 205 389 137 99 -133 141 23 -209 -84 -101 -204
6855 -204 -21 234 -173 226 -133 -3 -17 -94 -265 -57 34 -175 -222 175 83 129 35 109 -123 11 288 183 201
6878 201 -9 108 -106 -136 72 80 154 -69 79 143 153 175 18 -21 6 96 67 -31 -260 -180 89 -7 -124 153 164
6903 164 48 113 -115 -16 133 4 -121 -142 244 -16 123 8 -80 131 152 -70 -132 -111 -13 72 26 -45 141 135
6927 135 70 -82 170 -305 10 32 -102 -95 112 84 -98 99 -275 153 49 113 -12 184 -61 318 -17 -115
6949 -115 126 70 -54 -125 -17 129 232 -90 -80 4 -16 -10 53 -50 -29 -281 -105 -58 160 66 -51 -29 114 63
6973 63 -131 170 256 233 -56 -86 -246 203 41 -133 -27 58 -95 -44 -81 -243 -67 358 -207 19 14 79 59 -55
6997 -55 147 -36 111 -78 -33 53 65 79 -30 245 0 -145 -187 -61 128 -21 127 -249 -33 -167 -73 187
7019 187 -33 259 -3 -57 141 -31 -51 -123 -124 102 93 130 -88 50 -138 -99 249 23 5 141 -180 262 -54
7042 -54 117 25 -74 128 -99 -105 21 42 0 120 103 -249 70 -129 -88 25 65 -62 -148 246 -54 -109 -55 70
7066 70 28 -115 -142 27 -4 -85 194 23 85 149 -135 -131 -204 -69 -461 150 -4 -45 -32 83 -6 192 101 42 189
7091 189 -290 -211 -266 49 -128 118 -47 48 -267 177 -149 -55 -54 -87 47 61 214 273 48 145 -112 -183 -58 -12
7115 -12 159 37 112 74 -90 -40 -220 169 -197 -93 17 34 -24 15 -247 89 -48 66 -59 -8 -52 -68 -126 -54
7139 -54 85 240 35 73 -46 -2 -6 63 -108 -219 -9 81 7 183 105 -198 88 21 -56 -100 17 -59 -152 62 -101
7164 -101 -93 53 86 0 -125 -5 12 -33 -137 109 297 -120 43 200 -131 -48 180 -73 -247 -146 -87 -130 0
7187 0 20 -29 293 63 130 27 -57 -176 -167 80 -97 -29 -110 -168 -142 53 -102 -45 201 269 -208 -65 -114 387 0
7212 0 -99 -113 -152 54 -7 -150 -174 230 258 -35 262 40 6 71 -19 -78 10 -72 3 158 27 -102 -39 -109 -30 -45
7238 -45 286 160 5 -103 86 34 17 -251 209 62 -39 -34 178 -213 382 -166 -162 275 -48 -132 -244 -123 72
7261 72 2 -167 72 -256 44 84 190 -169 -151 -16 -24 132 -42 -60 -107 -63 -225 -239 -24 -122 58 -122 385 -138
7285 -138 78 288 -144 226 -68 92 141 172 87 -46 -48 -305 135 165 -96 192 -169 15 -179 -54 188 -343
7307 -343 38 66 -211 93 -131 -12 -109 231 -203 189 -224 -91 -289 213 194 22 -9 -53 -161 -14 -153 -150
7329 -150 75 185 -167 -70 35 105 -8 -97 -41 -50 -82 -200 99 -76 -13 139 -250 116 -100 -79 -119 -154 -35 -75
7353 -75 -33 -16 -171 -7 -42 -92 210 -57 -315 -198 102 -14 17 -356 2 -47 132 -44 123 34 -75 48 61
7376 61 52 -201 -251 -27 -33 109 -18 -116 -19 -144 222 16 103 -68 -19 -229 120 143 159 -86 -236 -52 -24 28 52
7401 52 32 189 -187 183 -48 -233 240 -113 -121 -106 -150 14 -81 71 -127 31 -231 -36 238 42 -16 -103 33
7424 33 186 41 -181 -9 90 98 270 367 -77 -94 -187 -128 170 -137 20 -100 22 -30 16 1 -56 -198 -52 -36
7448 -36 -28 128 178 13 -209 299 -203 -91 -233 26 23 157 19 73 -32 99 -87 17 -23 152 -63 -43 -82
7471 -82 -10 -26 -60 79 99 -24 214 -130 20 118 67 -199 161 -53 275 -130 -4 -101 21 145 -173 15 130
7494 130 -144 -121 252 -125 59 74 155 -118 21 22 74 -16 -123 32 -225 99 170 -59 18 -7 141 47 50 194
7518 194 152 -112 -244 35 -213 -71 52 -168 36 -89 33 -10 123 -68 -93 -25 25 -70 106 -188 41 167
7540 167 114 -61 48 22 57 -36 -59 50 62 27 -139 55 -24 49 181 -37 -58 121 -191 -26 143 -90 179
7563 179 -29 151 173 -191 -7 -53 -124 -375 -26 59 116 -188 -250 114 128 21 22 -29 26 -114 -119 148 -126 -96 -28
7588 -28 116 -114 175 33 37 -84 -34 -52 143 -13 -67 79 -30 -3 -6 -28 -388 -249 -65 -186 48 -105 63
7611 63 -66 221 233 15 -121 -110 293 -262 152 -105 47 -256 -55 -46 -74 32 72 -116 15 163 -10 32 39
7634 39 -22 -35 59 -116 -141 -29 -94 -386 19 -2 -139 210 -8 -304 62 -160 147 -240 -180 -97 43 221 -52
7657 -52 147 50 206 41 228 -110 -343 -128 -163 90 -46 258 48 159 92 -208 -14 -128 241 99 298
7678 298 239 268 80 171 94 -84 194 -177 -115 -26 -161 -132 189 139 -226 -15 -58 143 -55 22 5 -27 91 175
7702 175 92 51 -33 -9 -67 -138 82 -91 -59 -109 -149 36 -38 99 -107 -18 14 -91 112 -189 116 -300 -14 -174
7726 -174 -40 -44 113 31 -257 134 -72 -28 -318 -63 -105 -243 -244 -293 1 -173 -19 -54 -87 67 -69 46 -79
7749 -79 -8 143 -68 241 -112 263 120 -28 1 60 45 -152 -4 19 136 -121 -220 -323 -147 -59 164 46 -137
7772 -137 56 -46 -77 50 -22 -347 65 66 -89 -92 25 -32 6 162 -153 8 82 62 -97 -81 87 -80 -134 106
7796 106 83 15 130 -24 225 474 149 193 114 4 236 -294 -308 58 -62 -1 -359 -82 175 -48 -42 -117 -6
7819 -6 -390 63 10 196 -44 96 -311 -101 -1 82 -113 78 -71 -68 -56 -2 190 -40 -38 197 -26 144 223 226
7843 226 56 -201 76 -196 -37 275 -29 -98 -276 -152 11 238 -41 -64 -63 -220 81 -117 -47 -116 171 -36
7865 -36 15 11 90 358 -141 -21 158 -182 154 -24 -31 66 10 62 41 -123 -348 -27 85 85 -45 -34 24 -66 200
7890 200 40 -30 -268 172 235 101 64 324 60 85 48 -132 -212 197 -53 -54 -104 122 155 -15 88 -8 -161 108
7914 108 39 28 147 174 93 188 108 -124 -76 93 121 -15 159 -167 -114 7 -244 -159 -103 97 80 104 164 -52 62
7939 62 105 42 -41 29 -61 29 114 105 -46 136 57 259 119 60 185 96 -105 88 -65 9 81 48 -19 21 19 87 162
7966 162 -278 100 83 33 -23 42 274 -119 48 -75 73 -255 61 -117 171 -14 -121 147 4 -32 29 -11
7988 -11 -269 155 -60 76 -28 43 -24 -89 -238 -119 200 185 -47 -266 2 31 108 109 43 -18 -98 -162 55 283
8012 283 146 -99 144 110 -114 95 40 -113 8 -81 -86 132 1 -63 21 161 -38 -145 45 19 -21 -121 48
8035 48 -39 120 172 -76 -65 187 141 114 -246 22 78 -185 27 115 87 -55 20 -112 193 23 136 -266 -212 -83
8059 -83 3 11 76 -69 155 -64 128 -181 36 -85 -55 -145 -52 88 -118 223 -64 18 86 131 -130 -56 152 -282
8083 -282 161 -47 -35 -7 97 19 14 29 92 -107 -152 -12 -163 261 -416 11 188 -73 -14 246 6 125 -248
8106 -248 -165 -94 5 48 -17 10 -8 124 -79 30 -19 99 40 -73 15 -207 -210 -31 131 -42 -21 -62 -62 354 142
8131 142 -198 -119 50 -153 -162 58 149 46 -50 -63 6 -17 106 39 -223 201 -88 25 -9 -246 120 -69 46
8154 46 111 208 -133 -225 2 -161 29 17 89 -137 -174 123 213 88 -10 68 8 -22 143 -4 -65 -79 -25 59 100 1
8180 1 230 -14 -92 -96 -40 -117 32 199 -237 -128 -78
8191g8
$$ Imaginary data points
##PAGE= N=2
##DATA TABLE= (X++(I..I)), XYDATA
0 0 0 0 0 0 0 0 0 0 0 0 0 0 0 0 6 -8 8 -8 8 -8 8 -16 16 -16 23 -24 28 -32 38 -41 48 -54 62 -68 77 -86 96
37 96 -107 120 -133 147 -163 179 -198 219 -241 266 -293 322 -354 391 -431 476 -527 585 -649 724
57 724 -813 920 -1048 1207 -1411 1678 -2045 2582 -3427 4915 -8038 17081 -92323 -339258
71 -339258 120370 301033 -165722 -245607 198714 187923 -201743 -126010 205968 79425 -189839
82 -189839 -30116 179499 -7831 -158435 41158 137168 -67341 -114896 79597 91472 -87288
93 -87288 -79296 81261 65655 -81613 -65456 72298 59924 -69248 -60757 60568 60168 -50565
105 -50565 -60754 44016 68041 -34567 -69777 36459 76917 -36114 -71604 45462 67749
116 67749 -49233 -54268 55654 41208 -60008 -27499 61864 9894 -70091 2900 71088 -24940
128 -24940 -77325 40369 73821 -60960 -70915 73383 60626 -82968 -49916 87671 39921
139 39921 -84041 -25786 81743 19231 -68215 -5376 59322 973 -41356 5474 27640 -5619
151 -5619 -13813 3823 2749 -2901 1591 -1649 -6753 -495 3734 -1835 -5150 -2669 -618 2487 3741
166 3741 -4934 -10608 8512 20160 -10550 -26907 18882 37632 -23011 -40562 33674 46216 -38339
179 -38339 -43933 46823 42574 -50630 -36052 53813 26813 -56646 -17509 52734 1859 -51251
191 -51251 8694 41423 -23527 -34538 31500 22885 -40878 -14583 46236 5230 -49712 3912
203 3912 53610 -9526 -51037 19069 51241 -21124 -42625 26238 37095 -23685 -27931 21205
215 21205 20825 -16550 -15635 9578 9512 -5691 -8795 -1316 4084 2418 -6845 -7246 5510 5387 -8938
230 -8938 -4176 11155 -406 -13022 8946 15653 -15341 -13388 26055 13716 -32310 -8366 42302
243 42302 6132 -47319 1624 53213 -7753 -55540 15376 53388 -25528 -50966 31167 40789
255 40789 -39423 -32871 40705 19227 -43431 -8554 41030 -3849 -38417 13876 34229 -22266
267 -22266 -27852 30942 23230 -33862 -14053 39059 10254 -36582 -2034 36488 -1357 -31279
279 -31279 5171 25988 -7368 -20575 6632 12645 -7026 -8563 2849 1097 -1922 -35 -3534
292 -3534 -3280 4688 2383 -7176 -1271 7385 -134 -5114 3774 3935 -3726 993 6571 -2827 -5478 8253
308 8253 6908 -9911 -5201 13244 4716 -14912 -3817 15059 707 -16501 -493 13889 -3296
321 -3296 -13799 3605 9097 -6899 -6732 6974 1695 -8154 2945 8023 -6808 -5322 11667 5046
335 5046 -12744 -432 16642 -394 -15645 4773 15713 -6601 -13571 8862 10801 -10741 -7868
348 -7868 11425 2738 -12769 172 10457 -6315 -10900 8670 6467 -13104 -4846 14075 849
361 849 -14754 2631 14732 -4037 -11737 7129 10453 -6407 -5925 8147 4597 -5427 -217 5259
375 5259 -1374 -2611 3352 607 -5202 600 4548 -3704 -6359 3802 4464 -6756 -4863 6639 2270
390 2270 -8190 -1043 7476 -1589 -6468 4547 5530 -5581 -1840 8494 1122 -7704 3182 9388
404 9388 -4145 -7502 6812 7131 -7737 -5514 8009 3565 -8445 -3032 7069 9 -7550 -672
418 -672 4793 -1856 -5309 1345 2308 -2865 -1138 3014 -132 -2067 2158 2344 -2110 -217 3606 515
434 515 -2110 1939 2820 -1496 -219 2783 -838 -2502 2327 2104 -4644 -2410 4873 -492 -7018 488
450 488 6276 -3832 -7332 4448 5630 -6462 -5259 7030 3409 -7772 -981 8527 -90 -6818
464 -6818 3951 7604 -4425 -4411 7153 3240 -7518 -220 7882 -1228 -7054 2751 5713 -4695
478 -4695 -5514 4469 2424 -5804 -2753 4223 -55 -5039 89 3312 -1469 -2888 2064 2579 -2001 -584
494 -584 3397 688 -2142 1363 2995 -457 -1327 2320 1842 -1537 -442 1766 128 -1630 -4 219
510 219 -1157 -696 -42 -1230 -1426 458 -83 -2392 -30 1356 -1492 -1887 1909 1249 -1960 86 2757
527 2757 435 -1276 1646 2228 -687 -1071 2361 1705 -2169 -663 3189 113 -2995 82 2850 -1827
543 -1827 -3257 1761 1668 -3372 -2188 2480 109 -3400 -572 2552 -495 -2375 1068 2517 -1159 -1638
559 -1638 2265 1768 -1602 -154 2724 873 -1670 704 2646 -310 -2054 1225 1707 -1635 -1648 1213
575 1213 190 -2504 -978 1250 -442 -2297 154 790 -1062 -1363 1025 483 -1299 -75 1378 487
591 487 -283 684 1477 594 -294 345 1400 358 -1013 1081 1006 -950 -603 1250 -149 -1262 124 165
609 165 -1237 -516 195 -733 -641 -248 -492 -260 -171 56 147 244 115 240 218 286 851 487 62 569 880 -86
631 -86 123 1096 182 -812 408 290 -731 -794 183 -74 -923 -1224 176 -43 -1406 -747 505 -7 -1636
650 -1636 64 1211 -770 -402 1192 782 -244 528 1162 255 -454 267 964 515 -589 645 768 -346
668 -346 -650 383 222 -1099 -242 -27 -795 -847 -174 -315 -66 -239 -404 -301 33 271 -327 76 460 333
688 333 83 311 1000 298 -156 953 986 -91 18 911 251 -941 -263 352 -422 -917 -34 112 -915
707 -915 -493 -150 120 -403 -850 92 294 -652 -469 359 358 132 349 545 625 256 226 602 607 185 -2 506
729 506 438 36 -3 269 350 -755 -764 296 12 -1397 -515 397 -656 -1231 -134 439 -549 -661 504 665
749 665 -273 -612 730 786 -295 12 1248 690 -180 343 998 350 -260 201 188 80 -662 -286 190 -231
769 -231 -833 -361 418 -567 -859 -396 -2 -649 -907 -151 571 -462 -833 508 757 -280 -267 1099 697
788 697 -174 2 1259 612 -406 208 776 325 -711 56 690 -320 -1003 120 639 -775 -1176 149
806 149 370 -1236 -760 525 23 -931 -314 676 222 -476 315 891 121 -536 537 954 -46 -182 620
825 620 1010 -328 -553 419 558 -817 -432 460 -328 -1001 -189 542 -655 -975 11 66 -863 -536 468
844 468 -113 -278 229 509 -109 227 470 724 357 276 554 27 85 590 128 -262 110 545 -430 -71 464
865 464 42 -888 -162 352 -790 -930 118 496 -806 -375 384 248 -934 143 1057 -87 -866 652
883 652 1442 -363 -402 1515 845 -964 111 1450 127 -790 337 904 -637 -1016 860 473 -1240
900 -1240 -345 754 -548 -1407 241 433 -924 -510 916 115 -985 564 894 -248 -380 908 590
917 590 -655 322 841 153 -426 923 379 -580 6 938 -183 -1000 148 572 -864 -990 295 -98
935 -98 -1367 -370 761 -168 -1264 228 814 -627 -697 1029 818 -907 -154 1456 -36 -695 914 1049
953 1049 -478 -473 788 417 -1108 -67 759 -92 -703 47 482 -933 -900 274 -51 -1389 -18 763
971 763 -717 -1009 876 431 -923 347 894 235 -535 645 1164 -476 -448 1117 846 -701 45 1175
989 1175 -194 -1190 480 1184 -677 -727 691 -10 -1176 -308 758 -471 -953 171 806 -635 -874
1006 -874 562 531 -1049 -47 1287 -85 -732 468 1001 -553 -233 1070 309 -761 176 913 -288
1023 -288 -1025 757 456 -929 -381 886 -172 -1124 83 470 -963 -969 760 131 -938 -274 905 -249
1041 -249 -1016 791 955 -425 -655 1262 618 -838 263 1523 -24 -963 619 1066 -820 -1043 1026
1058 1026 556 -1264 -307 979 -406 -1425 43 751 -1068 -933 859 406 -1141 -29 830 -118 -847
1075 -847 674 1024 -661 -421 1230 745 -626 319 914 -382 -654 941 476 -1209 -79 1057 -729
1092 -729 -1021 281 505 -1283 -456 1049 1 -1332 -198 916 -430 -1041 890 1050 -1198 -359 1477
1109 1477 559 -1435 374 1600 -525 -1028 1131 1119 -1084 -431 1329 324 -1251 212 1250 -890
1125 -890 -1300 729 489 -1356 -657 819 -176 -1232 368 793 -929 -479 746 246 -680 322 851
1142 851 76 -370 687 640 -472 29 818 76 -544 657 797 -771 -777 1050 71 -1138 -168 1068 -339
1161 -339 -1137 235 392 -734 -834 1097 180 -991 -2 1350 -311 -1000 626 914 -953 -353 1290
1178 1290 572 -680 196 1285 -70 -642 619 784 -598 -471 522 215 -1218 -336 899 -505 -994
1195 -994 299 647 -800 -444 726 -166 -769 97 621 -245 -354 539 473 -807 125 843 -53 -629 426
1214 426 756 -486 -229 678 151 -823 23 961 -387 -915 338 520 -885 -863 539 -133 -909 187
1232 187 947 -202 -951 732 707 -625 -536 1213 178 -879 498 1135 -267 -797 790 841 -482 -611
1250 -611 821 179 -999 -43 566 -648 -731 306 210 -634 -252 576 51 -762 29 483 -97 -703 633
1269 633 566 -621 53 955 -147 -279 563 800 -396 -44 773 153 -622 191 953 -457 -762 337 511
1288 511 -903 -673 664 -208 -1044 438 704 -651 -678 563 585 -827 -72 654 127 -703 229 866 -287
1307 -287 -438 724 513 -574 -11 793 131 -790 278 337 -603 -523 283 149 -628 -133 211 -189 -439 270
1327 270 157 -536 -609 484 227 -660 170 573 -244 -233 519 389 -381 152 862 -234 -146 165 521 -351
1347 -351 -349 449 304 -652 8 404 -305 -922 247 413 -629 -486 570 -101 -485 96 512 -259 -283 312
1367 312 277 -173 195 566 47 -110 10 593 -104 -337 275 353 -395 39 111 -184 -631 -160 222 -284 -357
1388 -357 292 -289 -749 -23 234 -270 -328 138 250 -185 -133 414 390 -157 197 552 266 -22 177 324 -213
1409 -213 28 568 206 -347 -256 266 -174 -276 34 -9 -378 -417 166 -42 -234 -156 96 -26 -233 202 259 -322
1431 -322 -70 5 32 -179 66 206 -71 -78 230 448 101 97 247 -16 -329 76 77 -428 -330 -39 197 -642 -44
1454 -44 39 -102 -543 -28 317 -488 47 121 338 -350 55 187 -34 -296 32 -4 39 204 322 150 -160 -107
1476 -107 226 142 -407 -98 197 101 -134 -180 -80 -105 -177 -144 -235 -78 -57 240 -212 -197 58 35 -166 165 427
1499 427 -171 105 242 400 -41 192 149 -55 -232 189 -37 -233 -227 131 -120 -27 -14 49 -247 -264 -205 106 -334
1522 -334 -307 83 10 -62 -46 334 46 -30 124 224 -127 67 213 155 -24 26 -34 -152 171 274 -77 -101 -167
1545 -167 -21 -97 -492 -197 -199 -280 -236 -177 236 -245 28 319 20 -389 181 186 134 257 447 281 -34 236 417
1568 417 62 59 198 185 -212 -41 382 -206 -277 -231 224 -178 -168 21 -116 -239 32 -90 36 -122 -58 -213
1590 -213 10 155 69 263 91 267 34 136 85 203 72 139 -8 34 85 -95 96 -226 -157 -183 -268 -154 -47
1613 -47 -27 -161 90 24 -52 147 -46 -312 118 83 93 106 37 268 -160 -310 253 237 -209 90 148 129 160 30
1637 30 211 57 -31 191 -127 -96 0 -2 -38 -8 210 -99 4 -80 -21 79 -206 94 131 176 -120 176 231 24
1661 24 -5 5 151 -86 -48 56 -264 -95 31 94 32 -4 -100 -109 82 -139 -164 -190 -329 -125 -201 -126 13 -167 97
1686 97 -80 -321 259 241 -160 64 328 127 62 132 287 8 -9 144 -251 -201 -87 -240 -128 -138 -17 -67 -305
1709 -305 3 -212 -151 -124 -131 -36 -31 -85 141 -147 10 85 -174 163 -97 36 171 -195 -53 66 -21 3 189 44
1733 44 -264 106 159 -132 -105 61 -267 -71 -79 -100 10 -159 10 -159 81 -383 35 -143 -124 -138 -57 178 -47
1756 -47 -363 -197 97 70 68 199 206 234 -247 -277 47 -31 192 310 -177 -97 72 -316 -45 -132 33 -320 -183 200
1780 200 -295 -36 -11 -77 28 54 1 268 -24 119 89 168 192 -194 64 -199 -28 127 -78 -286 71 -28 39
1803 39 -127 -562 -85 216 -2 12 104 206 -347 106 21 79 -57 -20 80 155 -129 46 95 104 184 -212 18 102
1827 102 86 -80 -88 -14 -26 355 69 160 -200 -5 169 -8 -1 74 -171 -26 -231 -47 -122 -62 -86 -10 71 157 210
1852 210 80 -101 -152 86 254 -133 -6 141 139 -137 -268 8 59 286 66 47 5 -61 165 -360 45 251
1874 251 -50 -100 -154 -99 28 -208 -221 -106 -158 -29 -9 6 -374 -43 85 130 3 45 25 -110 84 -116 -39 -62
1898 -62 270 -20 161 153 -93 -10 -206 -37 -209 -161 -23 329 -65 62 123 -71 -231 177 11 68 43 222 203
1921 203 249 183 -36 -217 -152 -7 -59 210 178 94 158 -112 30 -159 -628 -83 -69 -335 -374 -113 17 350 -296
1944 -296 226 -95 -186 234 85 158 32 256 100 -89 134 86 59 -169 32 -63 -42 -73 -231 -267 44 -28 -51
1967 -51 40 -82 -27 -94 -399 -75 57 -44 -106 32 35 27 -43 -97 -60 -39 32 322 372 -321 128 212 174 -198 -117 -20
1993 -20 85 16 -58 64 -95 -226 -44 -69 -43 -108 85 -141 160 -44 96 186 5 65 107 -143 106 -27 191
2016 191 162 148 269 -176 28 -121 -118 300 279 -265 -151 328 21 -83 -62 60 -53 -217 181 80 141 104 9
2039 9 161 345 56 -31 151 -221 44 310 59 -189 1 -125 201 -25 69 72 -100 -49 -27 78 62 -81 -88 115
2063 115 1 40 33 -16 -50 27 -96 -78 145 -42 44 -92 251 146 -35 55 89 86 -65 233 140 101 -119 266 -119
2088 -119 -315 -53 -125 -335 -336 152 53 -39 -171 -9 228 -91 -178 -55 118 -2 -244 78 231 122 157 16
2110 16 -224 -98 132 -252 -13 -86 -20 73 -3 238 -85 -153 -29 -34 35 -140 440 63 94 -274 276 -48 -100 -23
2134 -23 119 -198 -5 199 -20 -9 -280 178 176 -33 211 38 -109 -41 -7 151 -100 92 179 88 4 -49 -44 -57
2158 -57 -76 101 75 -126 68 -139 9 -275 169 162 42 -2 -229 -212 -257 -182 147 118 -235 -14 -17 63 -45 278
2182 278 -53 -110 263 90 -38 -127 122 -25 -137 -209 -29 17 -66 -22 -78 -304 -27 -132 25 -14 -201 -24 0
2205 0 -164 110 143 6 19 97 -103 -215 -11 121 -225 100 -136 259 146 -84 -202 -110 -97 -71 -308 97 114
2228 114 -13 15 116 66 -67 -34 -46 14 -6 106 224 14 -123 -142 -32 106 414 211 43 -235 117 -85
2250 -85 -382 -30 168 -140 -180 -3 -269 -68 -78 47 -2 68 87 -1 -135 -26 90 -5 -19 53 -378 299 0
2273 0 64 -20 -241 219 -39 261 109 144 -220 -158 31 194 32 -85 244 100 81 -55 -166 -29 -27 -6 -7 24
2297 24 71 -48 26 109 75 -14 -24 -91 -165 -53 -66 208 -22 179 -72 -106 -205 132 20 26 116 -77 -134 -129 -255 17
2323 17 -51 120 -194 -317 71 -228 -185 238 205 -241 38 39 68 -56 100 89 8 -188 -32 21 -154 25 287
2346 287 163 46 180 -23 19 -64 -131 -166 -260 -3 67 87 -45 -110 -21 -202 -63 57 82 -28 43 -18 83 75 118
2371 118 109 -32 -246 10 -55 -73 118 205 3 21 179 -124 -157 -53 -99 141 -189 87 46 -159 -11 169 129
2394 129 290 -70 29 134 -168 110 81 -23 192 10 43 299 -135 19 240 264 53 -132 187 103 194 29
2416 29 -152 -36 -152 -148 -252 196 -61 34 15 248 111 50 99 -142 191 26 -137 -118 -13 238 -78 -133 18
2439 18 -75 -277 -130 132 96 92 -209 -93 -167 118 -137 128 27 -48 10 -11 56 91 -152 11 50 104 -1 -185
2463 -185 -136 -215 14 183 -110 86 73 -124 322 48 49 -159 -84 -5 -178 81 -62 6 -360 -68 -52 -301 43
2486 43 117 -120 -154 267 20 -47 -52 121 -213 47 16 83 -287 150 -112 58 -114 8 -123 111 -95 199 15
2509 15 15 76 -145 -122 -59 -145 46 347 -170 0 -10 -226 90 174 -51 -102 36 80 36 219 -251 18 -151 4
2533 4 -2 313 -124 135 -76 13 24 -104 1 -23 -79 93 -121 43 -78 114 110 -151 211 167 -53 -59 -84 48 183
2558 183 93 -133 -28 84 113 -113 95 -165 -349 42 204 -29 77 -14 96 -160 79 68 -282 84 -182
2579 -182 -38 -336 -53 -208 -62 31 -205 138 -18 -123 166 -78 125 -238 -69 -118 52 218 204 30 -197
2600 -197 2 116 -89 -33 -68 141 51 -7 4 85 105 -231 -172 137 -133 59 119 -279 208 88 119 -248 12
2623 12 -11 -216 9 -110 195 253 -118 -158 132 165 243 -58 26 2 167 -106 251 217 -186 -78 154 272 -136
2646 -136 -78 79 -191 -30 -105 -3 -37 49 -25 144 200 192 320 -54 51 -5 -125 -15 -23 8 366 46 32 7 -58
2671 -58 14 110 223 -310 -166 -151 17 -103 -123 -88 -144 -76 83 -50 -100 369 125 53 -201 61 -120 97 97 316
2695 316 -31 -41 -6 -100 132 204 -229 179 157 33 36 -129 -64 -149 -144 -4 -255 186 -91 22 64 106 -90 -44 6
2720 6 -31 45 -12 109 74 -70 -157 -34 124 80 94 109 127 59 118 -110 19 167 -254 -183 69 255 -186 -87 80
2745 80 180 223 -14 11 15 -41 22 -24 -66 54 -124 103 -322 198 113 -112 -44 -10 17 -97 202 132 98 33 61 -104
2771 -104 78 27 -234 63 -74 191 39 -326 -120 233 70 -49 60 93 -46 -156 2 -150 -270 147 -182
2792 -182 91 109 -107 -94 238 -42 0 66 -8 -75 -146 -59 268 -93 -222 132 -207 -40 19 9 78 54 -52 97
2816 97 -220 86 -174 -110 15 -56 231 -67 167 -85 78 189 79 -50 89 -269 -99 74 -216 -153 -196 186
2838 186 298 7 27 -21 229 228 31 174 -220 -241 -119 -95 135 -36 208 -101 -31 80 169 -93 -80 -148 146
2861 146 130 -31 142 148 67 -129 -14 43 64 -145 153 -233 -236 25 80 -2 -94 -87 74 -68 125 -112 34 109 -7
2886 -7 -151 52 159 270 152 145 -94 -62 43 27 -152 -166 -36 60 145 -256 -20 75 -109 -184 -157 155 -19 -242
2910 -242 -36 3 -108 37 286 -167 40 -88 -29 140 56 -11 -31 181 -25 137 -15 -44 35 32 10 44 -171 31
2934 31 -184 44 186 -1 29 -336 100 -105 -187 -120 -128 -3 -132 177 -246 22 58 169 55 -235 -34 8 140
2957 140 -84 47 -70 -22 -115 -60 131 112 -18 -117 82 4 -13 -24 97 -99 322 218 -250 134 23 25 252
2980 252 -122 127 -46 -12 359 107 233 -212 -148 -87 -21 137 68 -197 -109 36 -25 -93 -318 121 48 -122 58
3003 58 -239 -108 -258 90 123 164 142 74 -20 82 146 -6 78 -225 -112 -153 -88 7 133 -85 -257 -60 -126 -207
3027 -207 -286 -21 -8 -55 -125 82 162 19 45 109 -225 -74 -3 15 -23 -13 53 273 74 -41 -202 -7 76 149 24
3052 24 -72 53 -12 112 -91 271 -175 152 -109 39 -89 -41 -181 128 -99 -57 -135 89 15 11 -49 146 -472
3075 -472 84 -21 -234 20 -246 130 120 -49 103 -57 32 30 27 118 53 17 -46 40 201 174 -60 -331 -151 280
3099 280 -25 -54 -147 -34 -78 -186 -57 48 -73 -61 131 -215 256 -132 -107 151 -224 -68 -120 15 -51 -44 154
3122 154 -125 155 -163 12 -66 -13 -397 -190 -275 62 175 119 -94 31 109 31 171 149 306 168 -252 -287 63
3145 63 -292 107 75 12 -200 -48 -16 -25 107 102 -104 -50 27 100 25 -212 -150 -192 -196 -189 141 -57 67 -177 99 -79
3171 -79 -217 -56 49 -241 27 -206 -34 -209 130 3 134 -60 -68 36 10 57 123 -47 1 67 -64 -9 237
3194 237 -29 -253 85 361 -141 107 7 -209 87 -13 -186 43 -347 220 70 218 237 -152 315 -172
3214 -172 102 56 212 21 283 -130 47 -140 66 150 -42 254 82 -14 -34 186 68 -102 -39 12 -66 -82 206
3237 206 68 -140 89 -88 -99 -112 79 99 -142 296 -164 -14 12 67 134 -150 64 6 106 35 -205 26 -43
3260 -43 36 59 24 -208 154 -227 -70 -20 69 -41 225 -30 -85 173 -182 137 69 -193 261 47 270 18 -169
3283 -169 95 88 305 170 173 -3 92 -139 54 145 -9 75 -88 117 114 -21 152 17 244 135 0 -208 -9
3306 -9 24 -27 16 -42 -78 -93 -47 -92 149 156 -30 86 -370 67 22 -37 -217 144 22 -93 -126 173 -37 67 62 -10
3332 -10 -188 -43 336 11 -95 92 160 -54 -116 -91 -135 -36 -51 -53 12 38 -156 -154 44 -197 263 -35 -32 -181 -127
3357 -127 -45 214 138 -80 -114 46 190 191 -148 -83 103 -42 9 50 178 -80 24 132 -164 114 -292 -43 -50
3380 -50 22 -24 -156 245 0 -196 30 -173 175 45 -17 59 64 34 147 160 -43 273 -259 181 -30 323 46
3403 46 65 96 222 36 2 -114 -104 -27 72 167 -266 -276 -17 -158 67 161 -80 181 223 101 42 -82 -230 145
3427 145 155 262 180 -165 14 -279 -189 -118 -137 -7 137 45 -28 50 -28 25 123 -65 -98 66 147 127 107 -18 24
3452 24 255 -86 -54 4 145 321 -18 -74 74 -129 -272 -42 -118 14 -61 125 -12 90 -134 117 -31 188
3474 188 -21 -74 -47 121 86 273 274 2 35 -10 168 -13 -40 -60 28 99 38 85 245 -86 69 22 -127 186 127
3499 127 5 2 -34 51 -149 -248 136 120 -322 246 135 14 59 -158 148 119 -131 128 44 -39 -102 123 29 25 70
3524 70 31 -68 -28 118 195 -166 92 38 82 122 -111 234 -104 131 196 -128 169 -65 -304 -205 -30 -170 -105 88
3548 88 230 -8 -192 6 -310 -130 167 -96 102 174 7 -219 -268 121 153 70 -103 -9 34 -95 94 -125
3570 -125 -262 -30 78 -91 7 405 -140 -217 49 -12 112 116 -59 159 143 -278 -97 110 243 70 215 88
3592 88 -8 -38 148 -34 58 -138 -313 -88 -108 120 -226 227 108 -179 -70 48 33 41 20 -155 157 13 -12
3615 -12 31 -241 255 225 -205 124 31 -255 -205 167 87 -49 181 -223 71 207 230 460 99 87 113 -247 -114
3638 -114 -206 -3 -38 56 -144 -3 -174 -113 28 254 -293 73 73 -87 330 -44 -192 125 1 -178 132 96
3660 96 -25 61 -59 -79 -72 -111 25 -24 -40 185 -200 -179 99 3 184 -58 157 -225 108 83 -8 89 -158 -202 25
3685 25 39 135 -76 120 -6 23 39 -1 -25 221 79 -129 -128 -22 -26 85 -66 -199 15 -58 117 -46 251 -23
3709 -23 147 189 238 -61 112 -15 373 11 -129 117 3 166 69 378 76 37 -29 164 -129 -221 442 9
3731 9 -1 -169 -45 18 -70 -102 -106 83 40 146 184 69 113 -207 -168 -281 94 202 -109 35 106 96 -126 -5 -141
3756 -141 118 300 165 -25 -59 17 -42 33 -19 155 174 -37 -16 7 122 329 -270 -46 84 -118 90 -62 -113
3779 -113 -171 -45 -51 130 285 -103 179 72 -275 -182 37 125 -77 -42 14 -50 38 -61 81 -159 103 14 -81 69
3803 69 -76 110 -170 -127 -94 20 292 -168 -95 75 -110 -113 -296 -51 -49 -19 -129 -8 -81 -9 -188 170 254 190
3827 190 72 95 42 34 0 32 100 -4 179 152 74 -3 -49 -117 177 151 118 -49 31 -238 -189 97 48 -99 74 12
3853 12 -113 -37 214 61 -250 -143 7 245 -71 -119 79 -265 -150 -330 -233 96 192 -98 -73 19 -147 -70 21
3876 21 192 -13 -128 -21 0 -82 -146 130 -39 115 -122 -92 95 127 72 60 -140 92 -241 -45 160 37 229
3899 229 35 -140 -46 150 -67 257 187 52 -188 -85 158 -72 204 17 -229 252 -194 -66 -174 131 323
3920 323 -17 -112 56 15 128 -129 -36 171 52 -157 -42 -84 -67 -93 -63 103 -46 15 -37 -70 181 -70 -97 -119
3944 -119 48 161 -43 108 -100 38 101 -53 232 -36 -246 245 -44 49 159 -87 -138 198 -241 -33 31
3965 31 -156 73 -185 19 14 134 220 79 138 169 177 257 144 -260 37 -15 -259 88 105 -18 -215 -7 -16 -37 -214
3990 -214 -155 4 32 -92 -45 15 209 -240 -99 11 -65 206 -66 3 -153 -77 -12 151 105 -20 -96 40 -17 -152
4014 -152 1 -97 57 17 -127 97 103 111 -31 106 35 110 -82 28 -335 28 -241 -70 -237 174 -40 217 -188
4037 -188 -259 -46 54 164 0 181 -34 220 -62 -202 -101 320 206 -184 -127 32 -181 20 156 -277 95
4058 95 204 52 -1 114 2 212 36 72 220 -30 -136 30 21 159 -56 -23 19 130 252 -59 92 -158
4080 -158 296 -140 108 21 -30 -161 39 -166 -136 76 -33 -147 -82 5 268 -41 -121 117 -128 102 -18 193
4102 193 -143 38 -226 52 -44 -20 -86 166 221 32 98 -14 260 15 67 58 -65 8 -115 101 -34 146 45
4125 45 -128 138 -62 70 27 -91 -123 -366 -245 -107 128 76 20 -47 98 -36 -10 288 -74 -7 55 143 141 75
4149 75 201 -124 56 -44 45 -278 228 45 -34 -96 -185 303 -55 -152 105 -55 56 -42 -92 -51 46 -61 41
4172 41 91 52 -11 -11 127 124 -103 36 -16 65 -64 19 318 -152 128 -35 16 -196 133 52 -10 274 104 50 69
4197 69 -111 54 -213 -11 112 121 186 -120 238 114 -311 -65 82 -350 64 93 -140 -92 55 -34 -85 208 145
4220 145 -36 -38 -73 -227 -147 -27 117 -285 -149 -2 73 -19 167 -312 18 255 7 34 219 112 84 -111 -435
4243 -435 -5 151 -64 -228 -57 5 -198 39 -87 -171 133 -112 -335 -110 -38 13 124 -154 -64 -1 24 204
4265 204 -22 160 137 171 -43 -205 300 20 -25 -29 -8 -141 125 -114 57 -109 -76 209 -66 -240 198 -146
4287 -146 -105 101 -21 190 235 106 -37 209 84 -13 86 129 -119 -31 66 -15 212 108 333 -206 -5 -28 80
4310 80 -105 21 81 11 -57 -255 -118 -88 162 -172 -56 126 -261 -256 336 -159 8 -94 -10 -116 171 -131 -32
4333 -32 288 1 -45 -7 114 -62 -22 -95 125 -294 -7 -8 -171 32 235 -63 88 43 102 -37 -71 -51 -54 -54 30
4358 30 -47 41 37 362 -211 14 -46 -205 -115 -13 -37 13 101 106 215 -40 121 138 109 170 244 169 -14 123 125 149 24
4385 24 80 -155 -223 -8 140 -95 -110 -79 -24 71 -127 -60 53 68 -292 136 -54 -20 -168 23 -100 -62 -2 -48
4409 -48 -11 15 -155 -61 -37 -114 -68 179 172 -116 121 -184 298 88 99 -230 -68 -142 -302 5 -39 147 127 121 -132
4434 -132 -143 -83 2 -36 -57 57 -155 5 105 13 -55 261 -99 -234 64 -346 -196 -213 9 -19 122 -7 -105
4457 -105 -215 -23 -250 33 1 226 126 -142 -287 -14 -22 25 -141 -3 267 205 -107 -72 114 -109 18 -30
4479 -30 -186 141 29 -81 -144 -67 -46 31 135 28 -257 -92 -72 12 93 164 -274 27 73 110 313 -79 89 -5
4503 -5 103 -30 -127 -190 -52 120 28 3 -117 67 -294 -102 -93 22 -67 -157 171 285 -37 -8 198 49 -374 223
4527 223 -151 -15 108 149 -131 -28 64 23 128 9 152 112 138 -119 -26 127 34 -115 30 -144 86 260
4549 260 116 -83 -315 -158 -4 -192 -387 73 149 63 134 -85 12 -56 -240 72 115 81 216 -203 70 79 -26
4572 -26 113 -1 -175 108 16 189 -32 47 131 -6 -187 -47 -58 -191 274 234 181 118 226 -232 5 137 -52
4595 -52 29 168 -149 72 -128 -136 3 -67 -174 -95 -315 44 -59 18 -83 -60 60 -155 114 -69 70 -147 111
4618 111 -110 -85 -72 18 132 49 69 -88 15 53 -145 -128 -90 -38 3 -57 125 72 37 -164 -207 -208 -114 -52 227 72
4644 72 2 -259 282 -186 -28 -53 54 8 -9 -12 -154 33 161 21 -111 91 31 -129 250 -52 -129 33 -64
4667 -64 -58 -54 -4 -117 -46 -20 -101 -257 75 -79 53 -111 42 -1 119 -167 169 -350 74 96 308 294 -34 -10
4691 -10 144 239 -83 -55 197 130 41 40 190 -14 -135 -370 112 -59 -84 -157 170 -9 25 -90 73 -259 144
4714 144 -32 -79 127 75 -229 -140 39 15 61 -74 270 -46 90 44 -81 -124 58 -74 -59 1 -67 30 -60 64
4738 64 90 145 -180 -125 -92 -127 44 -50 -102 81 -243 -25 -49 67 129 -55 193 90 35 -24 6 49 -241 -137 -171
4763 -171 -225 97 41 -78 -30 61 -115 -171 57 -160 -135 61 -181 65 -135 104 88 7 -107 158 202 -153 -175
4786 -175 25 144 -44 -147 -80 165 -3 74 -90 -108 -51 -39 212 -10 -83 138 321 53 14 63 -141 -160 130
4809 130 -2 -140 -279 -112 245 -88 -94 -24 357 -74 21 133 73 56 -25 21 -89 271 -139 54 94 47 76 -134
4833 -134 -53 -138 -101 18 -46 -171 -83 23 107 -38 1 -113 -75 245 -61 32 43 203 -192 22 -72 158 182 -61
4857 -61 -134 -110 -90 -206 -115 -93 36 -116 -187 -99 -259 -76 86 -154 4 -206 -54 183 28 1 90 -9 -39 71
4881 71 44 31 129 -27 -28 61 101 109 122 38 141 114 -171 -237 191 61 -194 -212 -107 47 -238 -84 -102 -15 25 -64
4907 -64 -104 -28 -84 -129 103 91 9 43 -172 -17 -112 143 -39 73 -161 -212 21 170 -66 -30 26 -53 -170 -160 -19
4932 -19 -13 -274 -342 -58 -6 -318 18 122 -71 -182 -136 -19 -15 68 -65 -117 13 93 -93 -217 50 119 -117 224
4956 224 85 105 123 -36 348 -74 157 23 -43 -46 78 176 1 -158 -174 -218 -95 -130 10 163 -47 -6 -71 100
4980 100 195 22 -16 151 40 40 -300 165 -22 -32 43 101 170 -42 107 174 123 -8 -30 -85 82 -8 -9 108 134
5005 134 -25 416 112 264 87 -36 156 25 54 73 62 141 88 144 336 59 240 32 45 -35 -62 -173 25
5028 25 33 -16 -248 269 -233 -5 78 65 50 -26 -120 -254 226 88 -102 -89 -89 -141 -152 94 126 155 165 -15 -174 -295
5054 -295 118 -135 42 225 27 -63 178 150 -152 171 -106 -61 154 -286 -32 -135 -237 309 113 -226 73
5075 73 40 36 -38 -349 199 47 -2 -227 -15 97 49 31 217 205 251 117 13 150 -17 26 100 -134 -35 -5 28
5100 28 -176 85 -28 -119 -13 43 -6 -101 77 101 96 -42 -136 -109 -71 129 102 -97 -176 163 68 118 -63 -32 146
5125 146 -100 15 -82 -110 171 137 244 178 -148 -59 -49 -134 207 2 -208 313 10 95 45 103 -25 -17 -24 31 9
5150 9 -125 -5 80 -164 61 -253 -164 -76 75 59 21 -135 -179 103 -247 12 100 -126 1 -2 -197 191 -96 51
5174 51 -83 126 -13 0 203 60 3 -99 -135 101 149 -67 -122 -109 -161 -56 -165 105 -19 112 36 -1 -154
5197 -154 -211 -68 -127 78 97 33 249 89 18 -47 22 3 152 123 -203 -157 -264 157 -38 -233 -1 -128 -42 195
5221 195 173 -183 153 -13 -59 -225 -159 -50 29 141 7 27 44 -269 240 268 186 425 202 195 20 199 88
5244 88 -319 152 144 85 15 153 190 -315 180 -422 -180 -80 -207 -65 121 299 171 -95 -149 -188 35 124 62
5267 62 92 5 -214 160 184 75 91 -123 48 183 127 -47 146 -15 -81 140 -54 434 -67 -354 63 -5 96
5290 96 24 -141 40 -69 187 -44 -5 149 120 -54 350 -11 57 193 64 39 -49 22 48 193 -247 -122 109
5313 109 275 -249 91 -68 -177 202 -156 82 -148 17 -20 139 -147 110 33 68 -120 -114 -88 31 3 208
5335 208 248 -126 -79 172 147 108 121 113 116 -46 -96 -222 -105 108 -122 228 -61 -20 -146 33 143 -93 123 35
5359 35 -349 -277 -117 -134 307 233 -178 90 14 -395 -118 -111 -65 -99 -118 149 -3 258 -152 38 160 -66 190
5382 190 -120 54 -51 245 -10 9 -4 0 -356 140 249 -111 342 -123 -175 -3 88 -117 -59 -90 0 -13 138
5405 138 -43 51 -52 -23 125 -34 102 -333 93 -1 -79 -203 258 -16 187 128 -64 96 -50 112 -236 -67
5427 -67 -156 45 -109 31 66 78 166 59 58 -65 -77 -152 -138 101 201 40 -109 -69 -44 142 100 -5 -12 -94 -83 -300
5453 -300 -127 -170 -266 155 83 -14 19 -225 81 -44 -61 -87 48 72 38 -303 27 -15 32 -4 157 41 -168 -58
5477 -58 31 -84 93 117 136 16 -9 -55 34 107 -165 51 -43 -146 31 48 43 -24 88 85 -88 67 87 31 -200 -108
5503 -108 52 -73 63 10 -130 192 -108 -166 196 85 -94 151 24 -90 62 -189 -42 139 8 -208 -42
5524 -42 25 -67 19 -84 -8 -114 -33 -171 -128 28 -93 -323 146 12 53 119 91 226 137 199 -178 -146 -288 45
5548 45 -72 -297 63 130 -76 -111 282 -163 -83 -102 67 114 -265 -134 -142 43 -272 256 84 143 -9 -149 -33
5571 -33 -137 -65 142 91 23 64 -128 -162 64 -213 -284 65 92 140 143 242 19 -110 -111 -192 -117 -42 129 124 212 -76 182
5598 182 -120 -76 143 5 4 40 180 -187 101 -145 150 -196 -78 -19 129 343 -112 -226 -118 -92 157 145
5620 145 172 -71 318 -59 -149 -143 -56 -132 -123 -52 29 -44 89 -19 -328 -373 -280 -42 49 44 -90 16 89 82 105 -89 -306
5647 -306 36 -76 209 -63 6 94 -91 73 203 -55 197 -170 -340 28 -221 97 14 -38 50 -182 16 -53
5669 -53 -122 -47 91 -242 -37 -30 42 4 -34 123 -143 -45 -11 -71 -113 67 -21 142 29 181 -37 -72 -65 32 85 -188
5695 -188 -6 18 -231 -100 -19 -36 46 169 -48 -157 -56 86 257 12 121 92 -200 -87 141 137 4 -244
5717 -244 -27 -248 -149 26 133 231 17 325 -74 -91 -24 15 224 -7 -57 -67 -143 91 -53 -68 249 73 9
5740 9 63 -38 176 65 -53 -15 -89 249 110 -118 58 94 19 -118 -56 -222 -80 79 4 221 -97 72 -76
5763 -76 28 -52 -292 -7 -107 38 167 71 248 -117 -212 -298 88 149 -6 72 21 71 58 -37 15 -69 -18 186 -73
5788 -73 90 20 6 81 218 23 -204 200 46 253 186 -237 117 48 145 -302 -22 52 76 -56 249 54 164
5811 164 169 120 -118 -6 -128 -31 -67 -301 -184 -16 140 -126 -51 300 204 -198 -31 -20 104 -63 -57 -77 -102 195
5835 195 -115 -211 101 36 -83 -100 -42 -292 272 81 82 330 129 -89 261 97 266 18 -218 -2 85 160 91
5858 91 74 37 117 48 -269 44 128 -300 -22 -77 145 53 38 72 82 209 -175 -231 102 -217 -236 -97 -84 1 -208
5883 -208 -117 27 -289 22 -59 106 44 198 -128 -70 -24 72 88 11 43 137 -9 -11 158 -177 147 -233 133 -128
5907 -128 -30 -96 110 -4 178 16 -189 85 71 71 193 -4 122 -35 -118 83 25 67 104 36 -217 -41 -17 -10
5931 -10 17 36 -99 16 8 111 -1 91 1 -115 53 89 98 102 -66 39 -152 -125 24 -20 -79 -121 219 -119 -156 -77
5957 -77 -5 101 -77 -162 -239 -137 11 -27 12 92 60 58 -71 -124 19 24 80 96 34 137 -66 28 -130 20 -18 87
5983 87 -154 149 135 41 -37 185 8 -109 -69 -304 184 42 229 91 83 38 59 -5 102 -36 -179 -218 117 125
6007 125 -70 -59 -213 -62 145 -20 74 85 176 137 -246 -140 -223 68 -18 113 295 -40 -121 57 -262 121 148
6030 148 -50 -135 -113 107 -95 32 -149 115 -134 -11 -127 -220 -280 214 39 -137 -58 93 -140 56 -40 -93
6052 -93 52 -45 -15 -49 -15 130 -73 163 70 92 43 -51 -75 243 21 40 -108 -91 132 -162 185 -95 100 172
6076 172 -87 -40 -13 5 -117 -86 -325 -57 -89 70 30 4 -12 -316 30 -150 112 11 48 -119 72 -260 87
6099 87 72 79 -35 -138 -430 133 269 -134 11 61 40 200 132 -59 191 55 -4 108 286 6 69 -147 -102
6122 -102 -74 -177 -267 -155 147 44 -63 -55 -97 103 -138 253 78 -40 -20 61 -142 214 -34 -314 159 -58
6144 -58 89 -159 -65 -21 68 -173 58 116 20 -35 222 8 102 -214 -122 -4 -96 -33 67 72 -46 -71 -242 -54 -53
6169 -53 -170 162 -2 19 143 -40 309 11 -154 185 -131 182 43 274 224 202 53 158 1 -209 284
6190 284 -208 -183 141 43 128 -86 192 180 212 -135 126 -46 155 -127 58 51 347 151 -32 -94 -65 73 -89
6213 -89 163 -62 128 -28 -153 8 -34 -140 41 90 -22 97 -104 -194 -151 -90 -231 -118 19 338 -87 127
6235 127 -54 -126 200 -69 64 -84 -157 92 -76 -106 -5 24 142 105 -282 -16 30 -1 -63 42 60 85 198
6258 198 -211 -114 -158 -159 190 -62 -66 152 167 95 -82 233 90 92 -14 -12 -175 61 131 119 130 125 147 134 -74 54
6284 54 -79 322 22 11 189 -33 -109 -156 73 -109 25 87 43 42 -7 17 -216 -168 -36 43 -199 49 -93 -101 47
6309 47 320 129 -166 -10 411 -79 132 -92 89 -175 131 -51 -23 21 -16 29 96 -223 -55 34 37 -169 -54
6332 -54 -77 -46 33 122 47 -1 -92 -80 72 101 283 65 -19 258 9 247 86 -73 242 -91 -178 -60 26 -8 209
6357 209 169 34 -3 291 122 -142 -63 -6 -59 -73 32 140 158 135 -24 254 -174 -136 -116 -26 -176 42 125 -168
6381 -168 -317 -47 91 -140 31 -111 -164 37 229 290 -1 147 -123 150 -47 -263 -27 28 145 82 20 -25
6403 -25 294 150 -241 128 -32 12 -139 247 128 -179 26 21 229 -1 -71 -18 204 15 -2 142 26 -116
6425 -116 156 37 -27 47 -164 209 220 56 91 11 -86 -210 149 36 116 -131 71 111 -47 145 88 -20 199
6448 199 65 198 -199 -150 -199 109 -199 -47 -110 -71 2 -13 83 80 0 34 194 -27 -69 -232 -99 -54 35 175 60
6473 60 312 9 -161 103 -60 -67 58 -167 -351 -107 86 254 140 -2 72 -142 -61 -45 -21 -447 -178 89
6495 89 19 103 -440 137 -157 -9 -167 286 329 191 21 15 120 -121 34 -57 65 -238 72 -122 60 17 17
6518 17 31 95 -50 125 -161 -136 -82 -120 -34 -136 -18 170 23 -24 -78 6 -19 100 56 -117 5 -195 -43 148
6542 148 -94 -141 79 121 48 -107 -11 142 105 19 -340 -163 137 116 61 -18 46 -219 -69 -130 11 149 234 -36
6566 -36 -177 234 -148 -84 -87 137 -21 -124 -265 -241 -169 23 -3 -73 -122 84 -61 -202 -239 118 -127 -38 43 26
6590 26 84 62 100 53 -128 -186 -27 -194 145 -88 33 -4 -71 -306 103 -213 -72 111 252 62 43 -188 -246
6613 -246 232 109 -179 -79 -45 -147 161 255 -271 83 -89 -127 -155 208 0 109 -13 -13 -35 25 56 -4 75 -113
6637 -113 -179 -228 -108 -232 -129 -163 69 -309 -126 -144 39 241 128 -269 53 269 208 -146 268 -131 1 -196
6659 -196 -174 -49 -141 40 -268 -60 -155 -6 -27 48 134 -140 55 -57 135 -100 -180 157 77 -149 21 28 -96
6682 -96 185 -131 127 -79 -77 -25 -104 7 22 -183 142 171 -14 28 81 66 -179 55 -134 -125 -331 -62 -255 59
6706 59 29 -159 47 -34 -61 141 -24 34 -51 -94 -7 72 284 184 14 98 -122 153 63 -86 -125 179 99 -232
6730 -232 -26 131 192 -80 -168 -445 215 -81 -30 -100 155 -86 -20 2 275 -1 -19 168 -134 -149 -333 -2 96
6753 96 -154 167 -75 187 122 57 127 -78 9 119 151 75 5 -13 32 -104 110 -263 -166 -169 103 -10 -150 33
6777 33 -100 201 248 -185 -157 38 -263 82 -219 -9 197 -37 -240 -161 31 -53 -169 -160 -192 -102 42 -21 -14 301
6801 301 -33 -4 58 -74 -78 40 183 -106 -192 -3 19 -44 44 5 31 94 224 -282 -119 37 -1 -20 -247 8
6825 8 -50 -178 60 -12 93 207 -34 -220 -220 187 55 117 24 53 28 209 35 -235 77 -271 66 -133 -175 -152
6849 -152 -119 -235 -51 -13 -103 -124 -80 -25 -150 127 -33 44 43 130 120 -199 19 139 -178 56 -144 -284 -126 -112
6873 -112 -30 117 386 -150 52 -136 -53 -228 121 103 51 -34 62 61 60 -146 76 -117 -4 -77 -35 15 -83 -15 194
6898 194 -223 -84 143 -258 -158 152 138 -30 192 -94 -41 -68 150 -101 63 -150 169 -112 18 47 -243
6919 -243 -16 5 132 37 -22 -1 12 -260 -135 -223 175 1 -88 51 63 -50 -167 -15 -102 -206 0 219 -176
6942 -176 -158 26 -13 -3 51 -192 66 75 176 -18 -11 -206 -56 123 98 0 26 -42 -87 118 115 -184 -25 -148 -27
6967 -27 41 263 -127 162 -197 154 -113 -48 154 -125 357 -248 126 237 11 -5 119 136 187 -202 15 -130
6989 -130 -316 -224 146 -166 -37 -87 34 151 198 -47 -1 -14 112 18 182 -53 111 339 208 -165 148 9
7011 9 31 99 62 287 51 182 221 322 -262 -61 -87 -56 14 70 -41 181 92 -156 253 -16 127 7 -70 51
7035 51 -117 -50 195 313 18 144 126 -124 57 -54 94 -224 118 143 -124 110 143 231 -39 40 -223 21
7057 21 -72 -75 83 -108 -27 115 53 113 -172 -128 5 -189 254 -110 -56 -233 131 192 -109 -111 1 60 -85 86
7081 86 172 -168 248 133 -3 -40 130 -14 -185 -203 -35 134 245 -277 -150 -15 3 106 -24 73 61 216
7103 216 -62 -95 -356 -156 119 -203 -116 287 258 -64 -112 -33 85 -130 -153 123 -441 -33 -87 51 -97 -30 85
7126 85 330 -160 192 60 -66 -27 -89 -5 36 67 -174 -144 202 -24 112 -9 132 -81 -63 -121 35 21 -17 52
7150 52 -69 -126 28 70 120 -144 -12 -176 -68 48 -107 -98 -59 -264 -65 -12 -77 -26 -68 -144 82 -5 4 66 -261
7175 -261 -35 89 207 86 -168 169 10 33 407 12 91 87 -174 56 227 -386 270 196 39 7 188 -36
7197 -36 47 -20 -31 -1 199 -306 -175 -20 164 -20 22 78 -14 -128 -96 -16 330 62 -20 269 49 -198 37 31
7221 31 74 -85 -21 15 -19 60 -214 -15 -26 162 245 -64 -55 194 278 35 64 -153 26 -81 -360 98 -46 -174
7245 -174 -80 208 68 -177 -21 -100 -55 -4 41 151 142 35 -70 137 113 155 132 85 -48 -150 75 -1 -43 72
7269 72 183 184 -10 -171 121 -144 53 85 -39 111 50 174 -76 -96 95 10 -117 129 -50 -95 106 39 -26
7292 -26 5 -36 96 290 183 -37 215 -173 -104 -66 -74 -33 48 -28 -116 103 -59 -60 -106 -62 -67 -95 -27 -251 9 -80 6
7319 6 87 183 -1 -57 22 22 42 -45 -27 130 -214 250 22 40 33 -305 -68 -94 -54 54 -68 118 3 276 -233
7344 -233 -46 21 -3 36 158 -144 -13 -148 -137 -127 -185 65 166 47 53 68 -85 163 14 -125 -56 85 -104
7367 -104 198 -159 21 -19 30 123 209 45 -158 -26 209 222 77 -2 147 30 -181 42 154 -112 46 -33
7389 -33 125 53 101 -25 -86 -39 -32 -161 116 49 -73 -131 127 69 54 16 -280 59 19 -97 -11 31 138 50 123 145
7415 145 162 -131 -103 190 -9 -255 203 126 145 -154 -6 159 -35 -39 -264 26 -45 -145 -7 -46 -268 -131 -112
7438 -112 142 204 139 157 99 267 -49 -46 -103 70 229 -138 -108 7 -156 89 -145 24 18 -122 -93 4 10 132 -26
7463 -26 26 136 79 35 -157 -1 -4 -52 -40 -128 -154 121 -43 -143 -73 -175 97 111 200 144 -147 80 68 -77 132
7488 132 85 -50 -57 -59 2 153 21 72 200 -102 -83 -232 289 46 -7 86 17 52 -113 64 -63 49 168 42
7512 42 -8 -217 107 -80 -33 158 -158 80 -3 -12 -78 247 80 -70 20 11 119 -8 74 -87 -63 237 -224 35
7536 35 92 -129 -64 -3 69 -79 -79 335 -57 275 108 294 -93 83 213 -51 -113 -39 -65 -52 6 -226 -3 73
7560 73 -271 -67 -207 -21 -11 -43 -27 -83 20 23 -84 -230 221 6 112 -35 177 4 5 47 -326 -63 44
7583 44 -16 22 132 -316 10 -210 81 -24 -228 -73 135 -102 -47 177 189 60 -346 52 -159 -112 15 171
7605 171 214 -73 77 -452 81 6 -119 22 163 31 99 55 -111 -21 92 -112 44 148 -40 98 63 229
7627 229 -56 100 57 -96 307 -208 -60 -130 21 263 92 86 252 32 -418 -193 -261 51 -51 41 -11 -58 -25
7650 -25 -245 142 -189 59 404 -178 18 -316 -222 371 245 -16 56 -26 -53 24 67 -93 46 -273 103 180 304
7673 304 30 24 3 69 -151 -38 -27 15 132 10 -157 26 259 173 23 -16 -148 11 131 -7 19 146 -5
7696 -5 -10 158 -52 -38 -201 390 39 16 -125 129 -40 204 103 37 227 179 269 239 70 -88 42 50 -30 268
7720 268 58 -29 41 -194 107 42 24 164 -115 168 -40 -298 -135 198 3 -148 97 -137 215 -110 -213
7741 -213 272 170 4 21 92 -160 224 -58 -189 179 208 -146 -95 155 -59 233 132 -93 121 -8 65 124
7763 124 246 -108 153 236 -77 -47 -21 -84 -308 237 -146 -181 2 118 70 -12 -260 -17 57 -78 72 -19 -48
7786 -48 8 -167 -65 210 -23 -138 347 258 107 -288 -36 24 19 274 -164 -32 -82 -11 -22 126 -188 -38 -6
7809 -6 19 -233 -130 -43 -97 -127 287 134 -135 77 39 -194 -61 132 38 152 -60 113 -4 -89 20 -174 55
7832 55 -105 -149 81 45 -103 16 -16 -197 47 386 -156 106 -134 220 56 -71 90 -107 110 -140 236
7853 236 20 32 -18 -164 211 20 -117 12 159 -185 71 99 74 -208 -195 -278 30 -298 -20 -368 125 182
7875 182 -20 20 -90 -42 -47 -26 -40 207 -81 65 -209 -55 209 -11 59 -112 313 216 -50 84 -168 -157 64
7898 64 24 -176 -10 43 -19 -176 -31 -63 205 -43 -140 -12 214 -80 159 196 -150 93 -214 -101 118 -162
7920 -162 83 -32 -183 -110 18 -61 112 -108 161 195 -47 149 -73 23 -62 -232 -47 6 29 81 21 -20 78 47
7944 47 -347 -104 -220 -296 53 -74 183 299 120 98 -154 -237 50 -253 -34 -76 95 -15 -281 85 -95 140
7966 140 119 95 170 336 53 -89 16 38 167 -167 -114 -50 -50 73 2 -12 94 11 83 -1 -3 -154 133 -229 -255
7991 -255 -168 -2 9 15 -64 -43 -77 -26 100 82 66 208 314 388 -86 -32 8 -48 2 -149 -127 -103 -40 -114 110 -14
8017 -14 39 -114 201 -121 -89 77 -311 -114 41 -36 130 139 113 184 -117 23 38 198 22 153 -66 -139 -71 -31
8041 -31 264 -217 61 152 218 -12 -137 59 290 150 -89 90 173 30 34 78 125 125 344 226 152 134 218 51
8065 51 48 -93 87 149 12 192 10 99 -116 -137 198 -262 -8 -150 9 222 200 -116 -223 -92 -77 65 206
8088 206 -139 -113 121 -84 36 -101 1 51 67 23 -71 30 -140 38 243 -153 -124 200 30 211 41 -274
8110 -274 52 39 -104 83 28 95 -14 -201 -248 -431 -70 148 -111 -82 27 -145 60 -60 -200 57 41 -67
8132 -67 -72 -24 -16 72 -122 -127 23 -33 44 -18 57 -201 99 162 -55 -113 -30 157 167 -30 -148 90 84 228 141 -18 92
8159 92 -41 -33 -62 -42 170 -301 -143 9 -137 134 -2 -174 122 -135 -59 21 27 113 30 109 -86 -11 -94 96 59
8184 59 -52 12 -47 -17 185 63 40
8191D0
##END NTUPLES=NMR FID
##END=
