##TITLE=1H_Ad=o(bat2)-ACN-part
 CDCl3
 8 sc, 
 22.12.2022
##JCAMPDX= 6.0         $$ Bruker NMR JCAMP-DX V2.0
##DATA TYPE= NMR FID
##DATA CLASS= NTUPLES
##ORIGIN= UXNMR, Bruker Analytische Messtechnik GmbH
##OWNER= root
$$ XWIN-NMR		Version 3.5
$$ Thu Dec 22 14:03:10 2022 Russian Standard Time (UT+4h)  she@DPX200
##.OBSERVE FREQUENCY= 200.13135
##.OBSERVE NUCLEUS= ^1H
##.DELAY= (6, 6)
##.ACQUISITION MODE= SIMULTANEOUS
##.ACQUISITION SCHEME= undefined
##.AVERAGES= 8
##.DIGITISER RES= 18
##SPECTROMETER/DATA SYSTEM= spect
##.PULSE SEQUENCE= zg30
##.SOLVENT NAME= CDCl3
##.SHIFT REFERENCE= (INTERNAL, CDCl3, 0, 15.7039)
##AUDIT TRAIL= $$ (NUMBER, WHEN, WHO, WHERE, WHAT)
$$ ##TITLE= Audit trail, XWIN-NMR		Version 3.5
$$ ##JCAMPDX= 5.01
$$ ##ORIGIN= Bruker BioSpin GmbH
$$ ##OWNER= she
$$ F:/spectra/data/she/nmr/H-F/1/audita.txt
$$ ##AUDIT TRAIL=  $$ (NUMBER, WHEN, WHO, WHERE, WHAT)
(   1,<2022-12-22 14:01:14.26 +0400>,<she>,<DPX200>,
      <created by zg, POWCHK disabled, PULCHK disabled
       configuration hash MD5:
       00 E9 B6 7A A2 85 ED C7 34 08 36 98 17 FE 4E 26
       data hash MD5: 16K
       0E C8 3B 31 97 7D 9A AD C2 8C 1A 73 54 6C 32 AC>)
$$ ##END=
$$ 
$$ hash MD5
$$ 17 3A 9C D7 C1 A0 DA 35 04 62 CA 2C CC 7C DA F7
##$RELAX= 
##$RELAX= 
##$RELAX= 
##$RELAX= 
##$RELAX= 
##$RELAX= 
$$ Bruker specific parameters
$$ --------------------------
##$DU= <F:/spectra>
##$EXPNO= 1
##$NAME= <H-F>
##$PROCNO= 1
##$TYPE= <nmr>
##$USER= <she>
##$AMP= (0..31)
100 100 100 100 100 100 100 100 100 100 100 100 100 100 100 100 100 100 
100 100 100 100 100 100 100 100 100 100 100 100 100 100 
##$AQSEQ= 0
##$AQ_mod= 1
##$AUNM= <au_zg>
##$AUTOPOS= <>
##$BF1= 200.13
##$BF2= 200.13
##$BF3= 200.13
##$BF4= 200.13
##$BF5= 200.13
##$BF6= 200.13
##$BF7= 200.13
##$BF8= 200.13
##$BYTORDA= 1
##$CFDGTYP= 0
##$CFRGTYP= 5
##$CHEMSTR= <none>
##$CNST= (0..31)
1 1 145 1 1 1 1 1 1 1 1 1 1 1 1 1 1 1 1 1 1 1 1 1 1 1 1 1 1 1 1 1 
##$CPDPRG= <>
##$CPDPRG1= <>
##$CPDPRG2= <>
##$CPDPRG3= <>
##$CPDPRG4= <mlev>
##$CPDPRG5= <mlev>
##$CPDPRG6= <mlev>
##$CPDPRG7= <mlev>
##$CPDPRG8= <mlev>
##$CPDPRGB= <>
##$CPDPRGT= <>
##$D= (0..31)
0 1.2 0 0 0 0 0 0 0 0.06 0 0.03 0 0 0 0 0.0002 0 0 0 0 0 0 0 0 0 0 0 0 
0 0 0 
##$DATE= 1671703273
##$DBL= (0..7)
120 120 120 120 120 120 120 120 
##$DBP= (0..7)
150 150 150 150 150 150 150 150 
##$DBP07= 0
##$DBPNAM0= <>
##$DBPNAM1= <>
##$DBPNAM2= <>
##$DBPNAM3= <>
##$DBPNAM4= <>
##$DBPNAM5= <>
##$DBPNAM6= <>
##$DBPNAM7= <>
##$DBPOAL= (0..7)
0.5 0.5 0.5 0.5 0.5 0.5 0.5 0.5 
##$DBPOFFS= (0..7)
0 0 0 0 0 0 0 0 
##$DE= 6
##$DECBNUC= <off>
##$DECIM= 32
##$DECNUC= <off>
##$DECSTAT= 4
##$DIGMOD= 1
##$DIGTYP= 9
##$DL= (0..7)
0 120 120 120 120 120 120 120 
##$DP= (0..7)
150 150 150 150 150 150 150 150 
##$DP07= 0
##$DPNAME0= <>
##$DPNAME1= <>
##$DPNAME2= <>
##$DPNAME3= <>
##$DPNAME4= <>
##$DPNAME5= <>
##$DPNAME6= <>
##$DPNAME7= <>
##$DPOAL= (0..7)
0.5 0.5 0.5 0.5 0.5 0.5 0.5 0.5 
##$DPOFFS= (0..7)
0 0 0 0 0 0 0 0 
##$DQDMODE= 0
##$DR= 18
##$DS= 0
$$ [...]
##$SUBNAM2= <"">
##$SUBNAM3= <"">
##$SUBNAM4= <"">
##$SUBNAM5= <"">
##$SUBNAM6= <"">
##$SUBNAM7= <"">
##$SUBNAM8= <"">
##$SUBNAM9= <"">
##$SW= 18.05172834244
##$SWIBOX= (0..15)
0 0 2 0 0 0 0 0 0 0 0 0 0 0 0 0 
##$SW_h= 3612.71676300578
##$TD= 16384
##$TD0= 1
##$TE= 0
##$TE2= 300
##$TE3= 300
##$TEG= 300
##$TL= (0..7)
0 120 120 120 120 120 120 120 
##$TP= (0..7)
150 150 150 150 150 150 150 150 
##$TP07= 0
##$TPNAME0= <>
##$TPNAME1= <>
##$TPNAME2= <>
##$TPNAME3= <>
##$TPNAME4= <>
##$TPNAME5= <>
##$TPNAME6= <>
##$TPNAME7= <>
##$TPOAL= (0..7)
0.5 0.5 0.5 0.5 0.5 0.5 0.5 0.5 
##$TPOFFS= (0..7)
0 0 0 0 0 0 0 0 
##$TUNHIN= 0
##$TUNHOUT= 0
##$TUNXOUT= 0
##$USERA1= <user>
##$USERA2= <user>
##$USERA3= <user>
##$USERA4= <user>
##$USERA5= <user>
##$V9= 5
##$VALIST= <valist>
##$VCLIST= <CCCCCCCCCCCCCCC>
##$VD= 0
##$VDLIST= <DDDDDDDDDDDDDDD>
##$VPLIST= <PPPPPPPPPPPPPPP>
##$VTLIST= <TTTTTTTTTTTTTTT>
##$WBST= 1024
##$WBSW= 4
##$XGAIN= (0..3)
0 0 0 0 
##$XL= 0
##$YL= 0
##$YMAX_a= 150090
##$YMIN_a= -164726
##$ZGOPTNS= <>
##$ZL1= 120
##$ZL2= 120
##$ZL3= 120
##$ZL4= 120
##$ABSF1= 10
##$ABSF2= 0
##$ABSG= 5
##$ABSL= 3
##$ALPHA= 0
##$AQORDER= 0
##$ASSFAC= 0
##$ASSFACI= 0
##$ASSFACX= 0
##$ASSWID= 0
##$AUNMP= <proc_1d>
##$AZFE= 0.1
##$AZFW= 0.1
##$BCFW= 1
##$BC_mod= 2
##$BYTORDP= 1
##$COROFFS= 0
##$CY= 11.3945322036743
##$DATMOD= 1
##$DC= 2
##$DFILT= <>
##$DTYPP= 0
##$F1P= 2.36226072786647
##$F2P= -0.459571619588291
##$FCOR= 0.5
##$FTSIZE= 0
##$FT_mod= 4
##$GAMMA= 1
##$GB= 0.15
##$INTBC= 1
##$INTSCL= 1
##$ISEN= 128
##$LB= 0.24
##$LEV0= 0
##$LPBIN= 0
##$MAXI= 10000
##$MC2= 0
##$MEAN= 0
##$ME_mod= 0
##$MI= 1.114404
##$NCOEF= 0
##$NC_proc= 0
##$NLEV= 6
##$NOISF1= 3.799351
##$NOISF2= 2.8
##$NSP= 1
##$NTH_PI= 0
##$NZP= 0
##$OFFSET= 15.70392
##$PC= 1
##$PHC0= -19099.46
##$PHC1= 2.400721
##$PH_mod= 1
##$PKNL= yes
##$PPARMOD= 0
##$PSCAL= 0
##$PSIGN= 0
##$REVERSE= no
##$SF= 200.130013532006
##$SI= 16384
##$SIGF1= 3
##$SIGF2= 2
##$SINO= 400
##$SIOLD= 16384
##$SREGLST= <1H.CDCl3>
##$SSB= 0
##$STSI= 0
##$STSR= 0
##$SW_p= 3612.71676300578
##$SYMM= 0
##$S_DEV= 0
##$TDeff= 0
##$TDoff= 0
##$TI= <>
##$TILT= no
##$TM1= 0
##$TM2= 0
##$TOPLEV= 0
##$USERP1= <user>
##$USERP2= <user>
##$USERP3= <user>
##$USERP4= <user>
##$USERP5= <user>
##$WDW= 1
##$XDIM= 8192
##$YMAX_p= 0
##$YMIN_p= 0
$$ End of Bruker specific parameters
$$ ---------------------------------
##NTUPLES= NMR FID
##VAR_NAME=  TIME,          FID/REAL,        FID/IMAG
##SYMBOL=    X,             R,               I
##VAR_TYPE=  INDEPENDENT,   DEPENDENT,       DEPENDENT
##VAR_FORM=  AFFN,          ASDF,            ASDF
##VAR_DIM=   8192,          8192,            8192
##UNITS=     SECONDS,       ARBITRARY UNITS, ARBITRARY UNITS
##FACTOR=    0.0002768,     1,               1
##FIRST=     0,             0,               0
##LAST=      2.2672688,     0,               0
##MIN=       0,             -164726,         0
##MAX=       2.2672688,     150090,          0
$$ Real data points
##PAGE= N=1
##DATA TABLE= (X++(R..R)), XYDATA
$$ [...]
1821A86r6M3r6m12J32Q8M3K03j23p6j32J06M2m4L03l85j44L63O6K04k10J01J56
1844C18r8l3J1k52L7L7J90k14K24j40k88j0K82l18j96J53L16j68k06J01Q9o4J50
1867g9n8m3L72L0j47Mj10L19j25K05k56J16j82J11j35K52j10O4k69k7n0L5R6J0
1891B3k15L6J70k18j26O4N5q1M7K2K27l0j5n2J85K81k14J50m07J35Q3j10j88K0
1915a58K32J05k86J30R3k31R7r2J16l0k09N6q0j13Q5L6K99p8nJ71j48Q9k8j9K19
1940B51J10k24J08j53J9o6J73j3j22l6l76J30L50m62J49J31l06K23K73m34Q3k3
1962b15J93J16j93J93j75J67k20K04j12Q1j16L35j60Q8l4N9j3k28j00J82j06K26
1984A72j28m7L6j53P0p9j50J78l00R9K83R7O9n5l6J18j71N4q4K47j47K63j68q
$$ y = [186, 90, 133, 37, -375, -243, -155, -112, 91, -32, -108, -240, -134, -92, -136, 167, -218, -362, 1, 67, 271, 61, 162, 318, 220, 187, 198, -54, -17, 20, 210, -4, 220, 80, -208, -218, 64, -254, -450, -297, 19, -149, -355, -254, -165, -229, -79, -137, -180, 192, 222, 75, 79, -31, 288, 163, 368, 112, 228, 46, 157, 22, 274, 164, 228, -41, -68, -118, -83, 13, 23, -192, -156, 14, -204, -330, -266, -211, -292, -245, -223, 4, -26, -41, -93, 92, 373, 159, 309, -98, 37, 120, 10, -178, -158, 74, 179, -107, 23, 116, -115, -18, -110, 6, -24, -233, -177, -257, -370, -285, -249, 50, -28, -33, 138, -10, 79, 51, 32, 251, 361, 137, 245, 92, 111, 45, 218, 205, 83, 47, -329, -199, 151, -311, -162, -31, -337, -114, 159, -275, -192, -215, -22, 94, -99, 94, -81, 86, -134, 70, -42, 39, -77, 258, 98, 186, 152, 211, 198, -30, -130, 52, -54, 172, 44, -3, 33, -120, -50, -129, -279, -101, -401, -302, -19, 78, 147, 92, 56, 174, 3, 57, -27, 220, 73, 336, 168, 160]
2008A60J32K0l47K46j24J32k43J13j83j06MK75j64q4J47N7p8n6j55J90J1j0L10
2031B47Rj72j43ML87l03L25R8l64l04L89O5Pj68J22j77JJ31l55J80M9l50K68o1
2055a15l18J25J18L58k81k07L94J79k49P8k6J41k39Q7K43l57J40J55J5O0m3J12
2077C70j03M5l55J09k33O2J90j75m7k44N17k69Qm1Q1Q7J03j67j01J63j14N7L46
2100B89j99J41j35N0j36n9J98r3Q2k05M25l93m7M3L18m29o8j76M31o3j10j60J99
2123i7K01k83OK03n7j45K7L09M4N2l91N43p5j63k4j44J14j66L98j63l55Q5J35
2146E4n1Pk66J45P1J33j75p5M3O0P9j97J36k99L41M7K8O6j26K43K89p04K73PP6
2171B05l23J64j02J20mj16K98k45p7j43J69p2R0j16K53k80j47K97j86K8o4L18
$$ y = [160, 292, 312, -35, 211, 87, 219, -24, 89, -94, -200, -196, 79, -85, -169, -22, 35, -43, -99, -254, -64, -53, -63, 247, 256, 84, -59, -55, 332, 29, 354, 452, 88, -216, 173, 238, 245, 77, 199, 22, 23, 154, -201, -21, 28, -322, -54, -115, -433, -308, -190, 168, -113, -320, 74, 253, 4, 82, 56, 197, -42, 45, 288, -69, 71, 226, 241, 301, 258, 370, 267, 312, -43, 66, -167, -105, 85, -90, -137, -381, 136, -133, -125, -166, -85, 2, 105, -62, -163, 0, -114, -57, 289, 90, 231, 96, 146, 10, -49, 149, 56, 138, -67, 358, -35, -82, -39, 279, -150, -218, -394, 37, -26, -136, -296, -97, 104, -179, -173, 30, -27, -172, -145, 164, 208, 260, -131, 412, 337, 174, 150, 6, 120, -46, 352, 189, -166, -81, 54, 3, 10, -256, -111, -40, 93, -82, -157, -114, -54, 25, -172, -36, -335, 6, 53, 81, 147, 21, 264, 553, -151, 122, 129, 205, -118, 46, -56, 64, 60, -56, 242, -3, -80, -223, -54, -126, -36, -152, 101, -179, -326, -29, -215, -187, -251, 67]
2193F7K0J14m5j64M0P2L5j10Pr1J52Q6j32l41K28o1N3j50J22K34m00J32R2j25
2217a65q1K31M63o29l3k3K01J45k04J77kJ00l43M69k06k14K41M9k92L55q0j22
2239C7j18L8K71Pk96j44J53l7j75K34J66l60J92J16J70j05j82k78N94j97j03K46
2261B29p9j57j68K27M0j14L39j57j32K46k62j84J21o2j72J15K3k6l7q2K91j92
2283a93J91j29J95k31O8M2r4J01j05K68j53P2m6L5K14k31R0J19j79j8l8J16l47
2306b53R1J61j76L17p6l23%K78l76Q4J27L3j16P3Q3M9m8l6M8J6J00J20K1j20K92
2331C69k34M8k48M9p4J16J11Ok18j32K22k78K94j85M9Q0j68P0Q4k8LJ17J27l69
2355a89L21r1L14l65K67l26J0L39j92n7J16j53J65k12m8K69k48K76j01j98P2j50
$$ y = [67, 87, 201, 156, -8, 32, 104, 139, 29, 36, -55, 97, 183, 51, -290, -62, -123, -70, -220, -98, 136, -264, -132, -40, -165, -246, -15, 448, -181, -214, -237, -36, 109, -95, 82, 80, 180, -163, 306, 100, -114, 127, 176, -116, 239, 159, 37, -81, -43, 228, 235, -61, -205, -52, -89, -264, -30, 136, -224, -32, 84, 254, 149, -33, -311, 283, 86, -17, 229, 150, -7, -175, 52, 92, -22, 317, 160, 28, 274, 12, -172, -51, -113, -285, -170, -147, -173, -210, -292, -1, -193, -2, -131, 64, -167, -99, -57, -151, -50, -155, 113, -40, 32, -14, 21, 235, 4, 94, 213, 34, 16, -22, 94, -253, -162, -1, -177, 140, 64, -259, -259, 19, -357, -273, -146, -113, -229, -156, -73, -24, -72, -108, -60, -44, 56, 176, 197, 77, 369, 135, 183, -65, -16, -90, 26, 137, 143, -75, -207, 15, -263, 31, -154, -105, -25, -193, -123, -39, -67, -64, 53, 180, -189, 132, 41, 355, -10, 257, -69, -59, 280, 88, 31, 147, -6, 159, -53, -101, 168, -80, 196, 95, -103, -31, -181]
2377a81K07j34j9J1J88q9J40k61R3J39L8L3p4j14KK82k87k3K29pm9K3n2j96J04
2402CJ24K3Nr4j37j24K23qj84R2q9J19PJ8j14K28J62k10R8O2J17k94qQk8K09l13
2429a05K02jo0L6j04K38l75J03M9L7j71p6J01k4l7J76j7J36k44L3J9Kp8K07k88
2454b41K03Q2j89O0K18O8k14K22j78m8J8J6J44l40L38k9j68k30L3J86R3pk10J92
2478A9k25qL13k37J61J30j56k56M40j97j72P3K7K5j19M8K22Q4k06J85k20k26J87
2501a08N2L3j87J21j7J11J19p9k33J55Q0M7j50j8L10k46K68n56L61J38k47l9J81
2524I6j3m1K11l14J00k39K88O1p1j94RJ52n7P6k6l11r1L52q1J66j52L1q5j88L07
2549a4J71k2m8J98l47M53l16J0J08j64K47l43N7j4J83j51l0k29J43K00P5j3k20
$$ y = [-181, 26, -108, -127, -116, 72, -17, 123, -138, -45, 94, 132, 165, 91, -23, -21, 261, -26, -49, 180, 173, 124, 147, 95, -101, 3, 127, 150, 155, 61, -76, -200, 23, 15, -169, -77, -166, -47, -40, -22, -136, 92, 254, 44, 142, 204, 321, 27, 19, 27, -1, 208, -105, 97, 96, 36, 72, -32, 206, -169, -66, -17, 20, -151, -227, -126, -150, -187, -11, -28, 108, -136, -103, -84, -82, -160, 47, -241, -38, 44, -145, -85, 133, 201, -13, 209, 31, -17, 1, 17, 161, -179, 159, 130, -38, -268, -235, -49, 44, 37, -173, 19, -206, -214, 99, -138, 23, 153, -3, -259, 181, -16, -188, -115, -88, -63, -182, -134, 88, 172, -34, 151, -69, -295, -108, -56, -23, -210, -89, -106, 5, 124, 45, -188, -33, 47, 94, -56, -74, 236, -10, 258, -298, 63, 201, -46, -85, 96, 83, 42, 253, -61, 39, -200, 88, 149, 78, -116, -107, 45, -12, 64, 38, -273, -364, -12, -93, 73, -79, -48, -133, -321, -14, 157, 135, 87, 285, -62, 391, 75, 85, 193, 29, 276, -67, -10, -24, 159, 8, -22, -251, -108, 92, 167, 154, -66]
2572f6O8k10R5K18j94J50m09M13r7O4J30j53J85k79K40p6J25j27j66K81k98Q3
2594b3K51J7k91K30j34k75M34j71r3P1J04l26K06J11k94L03k53K51k14R2k3K16
2616A89j44n3J12J57k18K73PL2m43j07J18j28P5K87k07K85l83K54j34r7J4J53
2638D2J31j71l4J27n0k34L02m09K74NJ99n2j13j79K27j3oRj16j38L28k19k02K46
2662d6n3n6J15J07j76P2m9j21l1J41Jq3J94j30J38o9o5J99j75J90qk81J58K53
2686B25k15J0p4O9j25J92K26m02J71N7k06Q4Rr0j18qj08p0M27M4j43J2j62J59
2710c6k9M6J1M2j75K34J30n1j56R8k72J05k6K4N1k46M76m22K02L5K7o5pk84L3
2735b55J63K17l87R3K52k42L1P6L9Qo6M6j16Q4L37j83q4J2J22l97K09J00j16k94
$$ y = [-66, 2, -208, -113, 105, -89, 61, -348, 65, -32, 32, 162, 9, 194, -85, 155, 79, 204, 77, -89, 192, -106, -23, 228, 245, -46, 184, 50, -225, 209, 38, -55, 16, 120, -206, 0, 111, -183, 120, -133, 118, -96, -4, -27, 189, 45, -8, 104, 261, 43, 316, 323, 355, -88, -195, -77, -205, -130, 157, -50, 235, -148, 106, -28, -125, -111, 42, 173, 2, -32, 95, 45, -189, 113, -296, -22, -17, 182, 130, 17, -162, 65, 52, 46, 55, -61, -199, 129, -90, -292, -46, -99, -155, -40, 67, -109, -37, -86, -207, -238, -97, -96, -179, 15, -115, 23, -46, -111, 88, -87, 103, 95, -186, -28, 225, 10, 20, -54, 15, -110, 82, 308, -94, 77, 134, -72, 12, 21, -69, -187, -195, -303, -373, 54, 98, -45, -33, -195, -36, -65, -19, -8, 34, -141, 93, 223, 172, 16, 114, -158, -53, -79, -55, -4, -250, 226, -196, 6, 41, 68, 3, -4, -288, -255, -92, 125, -262, -169, 83, -159, -128, -52, -13, -5, -71, -25, -141, -57, 280, 97, 13, 25, 147, -250, -41, 59, -57, -351]
2759c51M37j83K01k58N1J83l79M99k63o5N1J2j2O5ml43J04J27L03j01J18j97M
2782aQ7j51K10j11M3m61O21m15J91K80l64o9mM7NK8j19L94j68K2j55J01j65J69
2806A5j33J24P5P8k49J76l3n2J10j58J6K41l04R7J63j57j18J68mj03j73J03M4
2829g4M7j04J10r3J34j37K14j13O0q4J54j29k1j01jK46K48j83l0K7R4l78K09j88
2853i3K05l2j26k19K20lj68K46J2p8K0l57K62L6j41L64ok32j31J77Q8J12l9o5
2877E2L7j22L09n04Q1K59N5k80L82j24k60J16J35j81j51J40Q0j33J15l2j79J60
2899d5J35rp4O8j2k49j17K03J3j86M44J8k85Q6K03l46L7J63K5r3J24j34N8n8j19
2924a50K04j91QN2J71m83O68l50L44l14m0K3j07M12j44l30K70Q7kKk79J59R4J47
$$ y = [-351, 86, -97, 104, -154, -103, 80, -299, 200, -63, -128, -77, -65, -77, -12, -16, -359, -255, -128, 175, 74, 192, -5, -1, 86, -65, 145, 34, 77, -384, 237, -178, 13, 293, -71, -140, -144, -97, -92, -64, -183, 211, 43, 65, -90, 11, -154, 15, -118, 6, 81, 159, -90, 86, 53, 1, 111, -47, -31, 210, -94, 3, 166, 9, -109, 59, 55, -48, -221, -118, -74, -27, -131, -21, -114, 20, -117, 97, -16, 44, -40, 114, -15, -36, -137, -138, 108, 356, 173, 143, 170, 264, -114, 95, -93, 112, 80, -46, -265, -45, -48, -216, 30, 42, -36, -16, -373, -111, -75, -216, 148, 142, -90, -221, -44, 44, 156, 117, 52, 89, -33, 276, -228, -147, 112, 167, -113, 269, 145, -115, 1, 136, -45, -196, -56, 24, -109, 6, -26, -205, -45, 90, 81, 7, 75, 63, -186, -303, -100, -87, -273, 171, 189, -96, -10, 193, -153, -116, 47, 72, -21, 103, -31, 27, -31, -150, 54, -137, -129, -77, 94, -389, 279, -71, 273, -41, -81, -58, -165, 247, 103, -227, 43, 130, 128, 130, -149, 10, 104, 251]
2948B51l83P0k58j7K84j67p9K1M19K6l14M14l46J73n21N12j80J45r1j61J64O8
2970C0P1n8k9k2R1k38J79N0N2n2J34j29k3K05l28J48j25k06J42M1rm3j48J02K08
2995D3K03l29M3J40o7J35l55L96j84q6JJ12N9k27L78j91K1p5J77l41Jj07L22M4
3019A13j08p8R4M2j52L9j9K57l4j45J41k66q7n8K39j8n7K56p2J28k44K98j42r6
3043C1j2K22k87nK64m31L21k61L20l99n3K76M8K0K4j30J20l82J64M39j31j3J14
3066B59l14K55j18j59J48K8J9R8j04J15q0k53K64J0j05m3o2J36j76M4j37J37k
3089d0k56J88m8P4l3l2o0O3K93j56K17m64M0M81j50k61O4m4n2M16k97K2n0N3k2
3114e4j82L42NJ62k84j02J67j91J50j8M65m21k05J56q2p4L72l51K52r2P2n0K59
$$ y = [251, -132, -62, -320, -337, -53, -220, -299, -278, 141, 167, -147, 267, -79, 94, -427, 85, -95, 50, -41, -202, -38, 30, 101, 43, 14, -8, 83, -155, 24, 74, 126, 74, 208, 79, 56, 261, -67, 81, -44, -250, -108, -67, -76, -119, -267, -165, 43, 246, -83, -40, 100, 33, 168, -187, 209, 25, -61, -60, 52, 111, -116, 262, 71, 92, 17, 194, -147, -146, -253, 69, 113, 5, -73, 21, 63, -89, -50, -69, 188, 154, 9, 150, -116, -203, -261, -22, -40, -97, 159, 87, 215, -29, 269, 127, 31, 19, 241, -46, -51, 213, -218, 103, -158, 162, -237, -290, -14, 34, 54, 78, -52, 68, -314, -150, 289, 158, 145, 259, -55, 200, 82, -77, 71, 99, 118, 216, 112, 227, 147, -106, 158, 168, 63, 20, -42, 94, -82, -38, -175, -38, -40, -296, -108, -156, -82, -115, -147, -207, -144, 149, -7, 210, -254, -214, 267, 117, -144, -80, -124, -176, 240, -57, -35, -85, -32, -54, -236, 106, 111, 273, -11, -113, 54, -137, 13, -5, 460, 39, -166, -10, -92, -166, 206, -145, 107, 15, 87, 37, 296]
3137B96k15k3M2J37k04n5J21j26o8R7n0k27M12l96M4K77%p8j24R3K05n6j67J11
3161D6M6K45l87j42K63J28r9o3k75L55k09K68k23l4R0J55m6j62R9j42J10J2M6
3184H1p2J4j33k14K91J57l9Q5k25N7J00m4l55K87J23j33p8J95j29K98L4l38J01
3207F3m5Oq6J78k56m3J13J48Jj69K84j88k06K64j24j0J30j53r1M59j30k07L42
3230B80n25L34m25N28q9J75k14R4p3j76J62j95mJ10n0J20n9M1j86O8J95Q3k84
3253i0J74k07J14J14l7k05K2J29R9k40J20K61k61mK55k35k0M0p3N0J52l33Q5J28
3277C8r8j9L4P0k9k67J87j43J26K35k38K65k77J53j86K71J8m5l9J57k64K89M7
3300B85r3k45K3L5p7k9L64J3l67P5j02n1mL13l1j40P6J90j41j99K20l20K95O5
$$ y = [296, 81, 58, 100, 237, 33, -22, 99, -27, -95, 2, -48, -275, 137, -259, -215, 62, 62, -16, -140, -47, 158, 102, -65, 46, 92, 337, -50, -192, 71, 199, 100, 37, -238, 117, -92, 176, -47, -81, 9, 164, 118, -44, 55, -87, 23, 35, 81, 9, 23, -110, -324, -33, 124, 85, 170, -55, 2, 102, 58, -297, -10, 113, -20, -98, 97, -32, 266, 300, -38, 63, 18, 24, -62, 116, -140, -183, -70, 78, 79, -90, 194, 6, -200, 64, -60, -70, 60, -93, -184, 275, 145, -62, 280, -245, 89, -336, 192, 103, 278, 64, 158, 85, -91, 71, -124, -128, -18, -68, 52, -7, 34, -152, -84, 111, 194, -90, 84, -123, -9, 105, 68, -137, -115, 14, 113, -127, -7, 254, -7, -11, 244, 9, -11, 29, -44, 6, 158, -175, -90, 38, -60, -79, -45, 25, -4, -271, -84, -227, -101, 134, -104, 161, -116, 37, -149, 122, 140, 95, 56, 213, -51, 238, 285, 192, -53, -30, 5, -72, -101, 263, 276, -91, -16, -118, -169, -173, 140, 109, -31, 45, 235, 94, -105, 115, -205, 90, 155]
3324A55j91O0j37J25j74K51J33j61J62k23k25L27k57J21n3M83l20j08Q4J04l0
3345A26k54N7k91J47K91k2j60J02Q6O1p4o5J22l7j60J58L2j47J29q4K56j97j63
3368h7o2K1N4l8K29n8K6O3l18J48j52J08J4j72K42J00j98M8N2K49j79l0o1o8L29
3393B60k24k17J81J85j02k2L71m03l4J3mj29K26j69m6K9L08M9m09J8K20k35J2
3416a22r5N19m71L12j55Rj10rn9K63j75R3j8k01K74J7r1M6K43k5q6k50k8K40M2
3441A63l55LL06k27m6J9K51j04K64l61P4j3j2o1l8K45p0q0j0J4K40q2n4j16j21
3466a71J63l5J50k67L43J7j46o8L8k12K29p3j7j78K70k37km3K11J26r9j69K54
3489H4k05K68l32M81l92L08P9l73K66l85K02O2o4N5k9L4k64K04Pj07J44j89K94
$$ y = [155, -36, 24, -113, 12, -162, 89, 222, 61, 223, 0, -225, 102, -155, -34, -87, 396, 76, -32, 52, 156, 126, -128, -71, -362, -215, 76, 54, -106, -4, 82, 143, 69, 4, 126, 89, -71, 87, 119, -28, 101, 17, 273, 76, -87, -149, -128, -74, -112, 117, 59, 85, 148, -170, -22, -174, -66, -52, -224, 18, 118, -80, -32, 20, 269, 90, 60, -1, -69, 260, 36, -181, 0, 185, 83, 61, 432, 29, -5, 8, 4, -125, 101, -68, -114, -85, 223, 272, -137, -119, 101, -134, -122, -217, 302, -169, 143, -12, -3, -113, -122, -181, 82, -93, 0, -18, -219, 55, 72, -19, 27, 270, 245, 159, -91, -119, 121, 163, -192, -189, 117, -110, -156, -137, 114, 10, 274, -87, -13, -26, -38, -99, -137, 108, 38, -42, -52, -38, 202, 120, 66, -50, -171, -8, -43, 107, -160, 183, 200, 54, -14, 24, -188, 41, -32, -49, -227, 43, -194, -196, -239, -28, 98, -1, -170, 84, -121, 147, -185, 296, -96, 212, 291, -82, 184, -201, 1, 63, -1, 54, 25, 59, -205, -1, 6, -101, 43, -146, 148]
3512A48l12N0N4Kj50J01P4j80M7J30m8J22k5J52r7j17K95l37n3J98N3p3k7j97
3536a90J79L74n29L3Q5M8K31j34R9m20J03Q6K1J88l27J77O3J8l9j12L2j61L48
3559A73q8J18l78K91m4j66K02j2P1l38J16Q7J1k84M86m19K66L2k36J57R6R4k06
3582B9p2l3K30k16J33k60J2K09ko3j33P5K16K7j62j11J52j21m2L32l06l51L95
3605f2J00k40K50l8j77J67j31K34K6m04N00j65j28K24j83pr0K99j36K35l19j43
3627a88L53k76J11O2M9l1l3r3J77k00R1J96j50o1P1q8Lj05K3K14n0K7M7j96K28
3652A81k17j6j63J76j21K02j17K59k13l7J8o9K98m14K73J96k13k55J25j5M5L04
3674B27k46O6m7k20L22n2j48O0M5j50K06j77N4P1K03k43J10K00j23k88J12j92
$$ y = [148, -164, -114, -60, -58, -208, -107, -33, -213, -166, -36, -84, 38, 13, 165, 68, -49, 246, -91, -144, 54, 107, 34, 7, -190, -11, 363, -166, -133, -48, 0, 231, 97, 196, -224, -121, -35, -14, 174, -153, 24, 87, 105, 66, -46, -14, -175, 173, 85, 203, -175, 116, 72, -94, 108, 96, 167, -171, -55, 32, 43, -241, 245, -174, 92, 124, -112, 45, 141, 235, 29, -43, -76, 154, -62, 71, -189, -177, 32, 30, -33, -166, -91, 125, 152, -10, -121, 31, -90, -132, 200, -106, -457, -62, 38, -202, 48, 10, -167, 0, -131, 103, 129, -275, 225, 60, -68, 156, -27, -34, -124, 175, 39, 274, -45, -188, 165, -111, 0, 62, 111, 80, 47, -46, 131, -69, 22, 218, 68, 7, 78, -10, -7, -112, -89, 125, 75, 102, 149, -47, 181, -36, -52, -215, -39, -160, 42, -75, 184, -29, -66, -48, -117, 181, -233, 40, 236, 23, -232, -107, -122, -77, 227, -19, 47, 0, -220, 102, 50, -98, -38, 7, -143, 63, -114, -60, 11, 214, -29, 81, 281, 158, -130, -18, -210]
3696b10N42j49j84k71J93K20j66J69l37K33k68N13l98K46j96n1r6M62l05l8P2
3717a9K07k34J13K20n43L01Lk07L14ql54KQ0N7J96j43j24K09Mj04J8j33l5J6P5
3742h9k43J07N98m28p0j3m3J40K20j94k24J79O8l0R6P9l19J8L05l93Q9pM06j86
3766F6k5J23j83J03k88Q5oJ04j5j29J62O4M8j39j67K84j00J23J55l73k08M27P3
3789A84l1j41j23K31p0K01k81J36k05L56r9k23K07o8j31l1K32k19P6k27L13j40
3811e3m5K59J71l36K06k36J45n7N9po7p5j18R1O2k16K80k4p7P6r3l5n7L4P0L7
3837fK31l05L3J47Jj58J95N2L4j41o5N1K6j02o3R7J19j59O2J28l74K68Q4M8k12
3862iK01k87K78j98r5j17J2L39L6j21l16M99j01j94J65o1j9P4j25L78m63J54m5
$$ y = [-210, 332, 183, -1, -272, -79, 141, -25, 144, -193, 40, -228, 285, -113, 133, -63, -114, -210, 252, -53, -91, -19, 188, -46, 67, 287, -256, 45, 48, -159, 155, 147, -207, -205, -125, -68, 128, -15, -139, 70, 74, -30, -12, -145, -180, -164, -89, -332, -225, 373, -55, -125, -138, -181, -41, 179, -15, -239, -60, 8, -22, 74, 153, -166, -148, 157, -236, -147, -154, 252, 66, 41, 164, -19, 84, -204, -119, -125, -21, -36, -165, -3, 61, 109, -30, -197, 87, -13, 110, 265, -108, -316, 111, 184, 153, 12, -111, 120, 50, 251, -30, 106, -99, 257, 158, -65, 142, 74, -57, -88, 144, -75, 1, -226, 87, -53, -98, 161, 332, -4, 202, -34, 111, 54, 113, 106, 39, -36, -154, -63, -1, -217, 63, 39, -38, 38, -55, -90, -147, -113, -43, -6, 225, -80, -47, 100, 101, -57, 138, 190, 224, 83, 18, 69, 95, -7, -70, 27, 146, -13, 49, 177, -197, 71, 155, 203, -9, 192, -95, 183, -15, -110, -227, -215, 124, 160, 39, -277, 222, 121, -73, 92, 31, 12, 86, -39, 339, -124, 30, -15]
3885a5r5lJ05q1J11L3k77Q2J59q7J26j2J38o8q1K82o09L44nM7k73J02o2l2L05
3910A34k78K89O5k26M8J42j80J4r4m3N6R7K21l17l07L13OM7Ok0J3j18J12m9M43
3935C74o25K16J85j02l2K15k87L2j4ML04m35K06K3L8lq7l2J32J22l19J75k65K49
3959G4Mj2K02j62r9j7k48L15j42K85l09J44L18m73K15n9M3o1j42m3ql0L09j20
3983a6j25Q3P0k91L81j26o1K10l40J32m2J69n8Q6j00l91L53r6L54k18K4J28k64
4006a38Q5J45j09j03J37O8kj98k3Q7N12m60j48K95k12J90Q3m92K53J20k65N4J40
4029A9oR9j43lr7OL54j70q5j22L43k22J2KJ03m86K84Q6K20l69M00R7m00J89m55
4054c44L62j22n8P3J02j26J68q4P4j45J50J77l09Q7j52l1K29j35J32J24j97K20
$$ y = [-15, -110, -113, -8, -89, 22, 55, -222, -140, 19, -68, 58, 46, 184, 116, 35, 317, -292, 52, 47, 94, -179, -77, -139, -171, 134, -144, 145, 210, -16, 32, 174, -6, 8, -86, -129, -73, 24, 245, -72, -379, -66, -60, -13, -7, -27, -14, -132, -20, -69, 374, -251, -35, 150, 48, 16, 231, -56, -24, -38, -34, 270, -165, 41, 64, 102, 99, 12, -20, 112, 234, -85, 90, -175, 74, 78, 66, 268, 106, 7, -10, -258, 57, -85, 200, -109, 35, 353, -120, 95, 36, 79, 18, -124, -167, -175, -205, 104, -16, -141, -58, 12, -279, 102, -24, -85, 125, -215, -83, -125, 44, -14, 72, -28, -419, -66, -162, 192, -26, -2, 126, -138, -53, 92, -17, -120, 17, 85, 83, -115, -138, -51, 461, 1, -147, 148, -64, 126, 209, -283, -30, 90, -175, -121, 19, 13, 112, -31, -34, -131, -125, 229, 59, -26, -148, 195, -27, -15, -13, 90, -396, -112, -26, 194, -175, 225, 322, -78, 111, -344, 18, -104, -162, -89, 13, -113, 55, -29, 45, -100, 50, 227, -82, 5, -147, -178, 51, -84, 48, 172, -25, 195]
4076A95J2j11o0n5r3J07L15j60l36K19L8j39K39Lj31j8K74j88q5q3J23j00n2j16
4100b02K58K13l39J46j01k3nK0j00P4N3J72k10m1J50o2PJ26q6Pr1J51j40j49J31
4125d1j03K86k48K07k37J09J06j59L69l2j06j84Q8K9k32J84Pj20Q0J31j70mj05
4148a45J2K54k89J80R4k16L58k39j70m3K39k4n8Q3J24l36L20Pm69K32J30M2j65
4171g9j0N6J06q1j1J90j95J23J16l55J68m7j2o7J43j74P1j54K10O7P2J37l19J34
4195H9q5l6Q8j05k73J65J73o9K13j71M5j42J3R8O0p1J25k4j57j5N4J89k46j25
4219b07K42j53l6K45l77J95J08K15k91J64k8k61J99R3M4k10O4Q2l15Q3N7L34k94
4242d7O1J43r2o8m5j61J50K07nl04K27l8rO6Kj88j10L63k69K08j82K39n7r1j5
$$ y = [195, 207, 96, 36, -19, -112, -5, 310, 150, -186, 33, 71, -68, 171, 174, 43, 25, 299, 111, 26, -57, 66, -34, -86, -202, 56, 269, -70, 76, -25, -48, -53, -33, -133, -59, -6, 166, -44, -85, 65, 3, 10, 136, 50, 57, -34, 117, -23, -172, -41, -144, 142, -106, 101, -136, -27, 79, -80, 289, 257, 151, -33, 55, 84, -148, 36, 43, -77, 3, 134, -36, -40, -145, -133, 121, -168, 12, 106, -110, 248, 9, -161, -204, 35, 11, -47, 36, 160, -176, 144, 151, -318, -86, 44, 86, -79, -89, -33, 73, -8, -19, 171, -24, 99, 215, -140, 28, -19, -31, -98, 45, -129, -58, -212, -2, 65, 137, 274, -45, 89, 4, -32, 56, -49, -322, -157, 16, -53, 160, -11, 34, -108, -95, 3, 63, -8, 117, 93, -64, -79, -25, 164, -82, -207, 35, -118, -154, 91, -286, -91, 17, 232, -59, 105, 77, -184, 15, 108, 152, -58, 6, 88, -227, -144, -87, 247, -47, 14, 157, 65, -3, -48, -209, -59, 148, 143, -161, 66, 28, 19, 85, 87, -101, -211, 152, -117, 91, -91, 148, 91, 0, -15]
4267a5q7j1J13j46K19k1N8J9q5r1l4m4K03l40J36J64j75O3L6L8pj2j9N3Pj11Q
4294h1K87L0k29m8J18k4J49l59N3p0O3K21q6P2J67j44j70M7J96j74J26r9p1o2
4318h8J47j93J48N1k81M27k08k86o8L23R0k42j76M52j00p4J29j57M04k39r9kq5
4341a27k5R0p9J79J27k93J20J44l6q1p4J41J3j56J16j29K21k04K06m88K71M8m2
4364e8K07k2J38m85K53n6J23n6j18p3O7j67M45m63K16J48j54K74m43J69l3K57
4386A69j21j97k8M40l43P1R7L9N2j52q5M2J67J62l11L4K4l8o8Q2N1J1k6j64j8
4411a10m7L44r0l1l6n4j4K12l00r4L29j87K6J85j20O5j59l9j6K00J61k58P4n0
4435iO2K14l48k4J37J20k87J08J46Kl74J29J97j37J94j37k6K65j67J06j32m9J72
$$ y = [-15, -102, -113, 0, -146, 73, 52, 110, 129, 44, -47, -81, -125, 78, -262, -126, 38, -137, -74, -38, 0, -7, -19, -38, 15, 22, -89, -81, 206, 236, 7, -41, 77, 53, 202, -157, -104, -174, -111, 110, 24, 96, 263, 119, -51, -4, 192, 18, 144, 45, -26, -88, 59, -134, 14, 65, -216, 211, 3, -283, -351, -28, 62, -180, -356, 96, -4, -78, 51, -106, 298, 59, -40, -42, -127, -152, -62, -141, 38, 165, -128, -8, 136, 100, 19, -55, 86, 99, -57, 59, -70, 151, -53, 153, -335, -64, -16, -58, 149, 127, 265, -220, 33, -23, 100, 44, -74, -147, -80, -247, 198, -265, -49, 99, -55, 219, -224, -55, -88, 169, 48, -149, -177, 263, -80, -9, 88, 127, 179, 27, -58, -16, 151, 313, 2, 36, 60, 22, -46, 36, 87, 98, 72, -92, -110, -157, 187, 97, 66, 30, -24, -38, 174, -126, -220, 109, -78, -52, 133, 13, 78, -81, -120, -136, 64, 225, -33, 41, -9, 53, 267, -81, -105, 32, 152, -135, -27, 119, 121, -253, -124, 73, -64, 130, -7, -33, 232, 65, 171, 39, -10, 162]
4458A62j87L5j68M06l14J41k0ro3l7K19l3j23O3j66J81J7j14l9QL18k23k0Q9r6
4483B7k70L24J3j69K60j47nQ6l29L65k44m0n4K68k43J98p4n1k4J34k3K40l30P0
4507a8o6RK89k78K32k21K46k39N5j09J05J63j21j92J66J37K62o16J88O1m0K1k45
4530b11J26J93k2l4j17K32l50L68k35J87k27R1j72J81L8m7K33j89N4j80Q6J69
4552A74j94j20K46k82L44j01j00M4j87K79o4j53J51P2k24j59K87k25J99J74l89
4573b28J41p9J84J9k38L84k48L0J09rJ99j74J70k43j47L37p1p2J49j24k34K58
4595A13M2J8q4j3k30N5l5M11k34j02P3o7N8j06K05J54l43p1K16l38J13K35k84
4618b14K60L5J57j97K67l84J20N0K35l07l23K28Q9l5L16l38J35n1j98j37M03k25
$$ y = [162, -25, 10, -158, 248, -66, 75, 55, 46, -17, -54, 165, 132, 9, 72, -94, 87, 104, -10, -49, -41, 277, 54, 34, 123, 27, -243, 81, 94, -75, 185, 38, 33, 119, -210, 155, -89, -129, -183, 85, -158, 40, -34, -85, -109, 25, 2, 242, -88, -18, -84, -75, 214, -64, 168, -53, 193, -46, 9, -100, 5, 168, 47, -145, 21, 158, 420, -196, -8, 53, 13, 34, -211, -85, 108, 86, 52, -65, 167, -183, 185, -50, 137, -90, 1, -171, 10, 48, 1, 234, 45, 99, -81, 5, 174, -20, -140, 106, -176, 168, 67, -33, 11, -176, 103, 39, -114, 37, 109, -115, -274, 13, -212, -13, 161, -228, -87, -166, 18, 37, -201, 183, -65, -35, 74, 65, 264, 90, 260, 17, -130, 207, 136, 64, 213, 89, -145, 113, 155, 173, 89, 76, -154, -99, -134, 277, 43, -59, 14, -53, 5, -101, 104, 258, -85, -156, 60, -278, -165, 70, -214, 46, 81, 238, 41, 308, -76, 44, 94, 329, 22, -301, -73, 16, -19, 297, -41, 94, 43, -155, -292, 111, -114]
4640a14o7J98m8k07N21l35l22L22m6J96J91l47K0K79q2j61o7J93J61j7k23j09
4662f4kq5M7j3J06q7oO3Q4k56J41j69K07j48L65m18L95r7j90L83l26k10L06PJ39
4687A72j29k07J93P5j22N5n1k76L07L0mJ05j05J08l98L12j05J04O7k79oRl6K89
4711A08k09J89p2j81m3L31p2q9K69n08J11M24K3k38J7M5j75K53J57k58m3k73Q7
4734a47O9L6KP8K8rj43L3J04K10j19j90j75M14L5l28K0j17j3P0J96J23J0r0j35
4759c8Q6N6j68J91j24R7O8Q2m34R3L72l62Qj24J23K13l75O5N7M3J22q2j04L9K95
4784A99k28o2J36j20M0J94mj45K5L8j87L07L3j26j3j1q0m28J96L31j29j06L8L85
4808B83l16j38K29j95k4p8L07n3J17R0k95j00L13l39J97L24n19L16J80o59K66
$$ y = [-114, -181, 17, -31, -238, 283, -52, -374, -52, -98, 98, 289, -58, -38, 241, 159, -2, -69, 124, 285, 268, 45, -64, -66, -151, -104, -117, -11, -98, -104, -41, 43, -213, -72, -241, -34, -182, 183, -235, 160, 63, -127, 256, -70, -280, 26, 33, 172, 43, -164, 29, 104, -18, 37, -14, -290, 17, 47, 43, 148, 43, 151, -247, 65, -40, 64, 131, -148, -154, -145, -181, 108, -101, 88, 16, -165, -208, 123, 51, -38, 231, -277, -166, 258, 281, 43, 60, 105, -70, 183, 340, 82, 39, -234, -147, -78, -42, -40, 38, 66, 57, -86, -53, 51, 261, 142, -48, -223, 191, 226, -102, -82, -199, -212, -142, 54, 177, 187, 97, -38, 48, 104, -64, 127, 3, 100, 168, 250, -184, -91, 281, -81, -73, -197, -74, 139, -236, -171, -114, -71, 51, -31, -135, -96, 199, -29, -91, 45, -75, -35, 159, 155, 10, 35, 73, -114, 193, 226, 100, 87, 76, -4, -432, -236, 95, -34, -140, -102, 283, -33, -171, 58, -137, -161, -239, 68, 15, 132, 222, -73, -173, 140, -199, -2, 322, -197, 119, 299, -360, -94]
4829i4L9J82l12J29r6K35n0j68Q3k8M8J10r5q0M2j27K48q1p4M10k48k63P7R4J83
4854A64k04N4r7k6L3j06L32j77J55l34K63l8M9j08K77r1k06J92j08j94L41j61
4876A0O4K52k87j16K14k32P6j2k0j38L14k51J27o3j40N32m85J72j24L37m82J50
4898a02L21k24k4p2K39j12o2kj74Q6K08m0j38nj63K93L7J32QJ7j81P2j44r6J37
4923A1J13J22m46R0K0L0J68o4j07L2M5j74J57L6QJ1j92k4L15k73R1J16k8j58K2
4948g9k3J82Q1L0j41k04K86l02J00o5M27k34M4r9m3J23k07N0k5L12j99jj02N63
4972D74n42q9L76j98J3j47P6n8J52J2o5k70K57j31K37k37J67q0J5k6j37R2k0o
4996a35P5J60k3k48LN0J38L3j42K07k28j36R6kmp5L47j51J71J7j41j53J18J52
$$ y = [-94, -55, 127, -185, -56, -152, 83, 33, -135, -52, -80, -32, 78, -17, -97, -55, -182, 66, -15, -89, 321, 73, -190, -113, -19, 164, -40, 14, -83, -109, -76, -182, 150, -27, 128, -206, 57, 19, 68, -40, 237, 146, -60, 132, 24, -170, 171, 10, 74, 326, 39, -77, 137, -95, -19, -31, -51, -189, 125, -126, 1, -62, -202, 330, -155, 17, -107, 230, -252, -102, 219, -5, -29, -101, 138, 26, -36, -38, -212, -126, 82, 42, -96, -101, -264, 29, 66, 198, 206, 223, 42, 114, -30, -126, 11, 124, 246, -200, -110, -90, -60, 108, 44, -63, -31, 14, -160, -3, 33, 41, 52, -140, -164, 151, -122, -31, 85, 57, -101, -79, -102, 80, 161, 191, 50, -154, 132, -170, -70, -135, 292, 58, 102, 3, -40, 83, -124, -74, -99, 213, 14, 13, -89, 474, -68, -157, 219, 21, 34, -113, -37, -95, 57, 69, 4, -266, -9, -140, 97, -140, 27, -53, -38, -64, -201, -109, -129, -135, -60, 100, 77, -171, -168, -118, 20, 53, -89, 118, -110, -246, -150, -152, -156, -231, 116, -35, 136, 153, 12, -141, -23, 129]
5020A29l86L22L7q5J12L4k31Pj45K66k26J07j9L12l31k35L51l9K57j52j97R7p
5043b2L35k59K8J29k73J16k0M1l18J66K44l84J57N9O5j90N6K42j1k08j4j45R5
5066a11M4j14Q8K37k87J81J45l71K74k23J29J43k35P9O6J2o7L6j23J11K4j43J68
5089F3J4j05j8J62k45J66k40L27j64j96K73j06J33j06J03R9j41J09j80j64K15
5110ak1OO2k1l47M33kN5j57k1jK15l19j26J63K6J41L3j89L7l4L19k16J97j37l44
5136b49K97j63K28l12L38k74r1J95o8o2L48k40P4j5j82J32j6K04l17K95p0P5k13
5159h6K8j01Q0nJ46l08J13K15k08J33Q1j53O7R5k56P1J82m0L0r1Ok5k28M21j93
5184b6J97m26m9L57q9n2J1J12k29K66j48J20q2K7j90J10J04j28P5K23Q1k71R2
$$ y = [129, -257, 65, 102, 17, 129, 163, -68, -61, -206, 60, -166, -59, -78, 234, -97, -332, 19, -20, 237, 85, -112, -15, -22, 313, 54, 82, 211, -62, 54, 34, 75, -243, -77, 167, -217, -60, -1, 64, -126, -70, 172, 161, -47, -61, -206, -111, -67, -181, -93, 144, -143, 38, 183, -188, 86, -137, -8, 135, -100, -21, 45, 57, -10, 26, -97, 14, 38, -105, 63, 77, -28, -46, 116, -129, 37, -203, 124, -40, -236, 37, -69, 64, -42, 61, 160, 19, 128, -52, -216, -1, -22, -16, 46, 25, -322, 111, 109, 164, 7, -14, -15, 200, -119, -245, -82, -56, 85, 118, -71, -34, -68, 251, 35, 232, 95, -249, 48, -115, 113, -199, 139, -135, -226, -31, -99, -161, 187, -53, 21, 6, -176, -44, -60, 144, -173, 122, 52, 127, -86, -58, -159, -79, -84, 62, -246, -133, 82, -126, 7, 88, -65, 2, 97, -159, -88, 94, 54, 84, -7, -1, -26, -254, 167, -26, 171, -255, -304, 53, -36, -88, -77, 35, -194, 72, -76, 44, -38, -11, -201, -91, 13, -115, -40, 183, 264, -7, 85]
5207H5l87L35K8L5N8j61j93K65jj99J96j1j62J65k04M02j88J20j84k4J81N2j09
5230I9j68J03k75L84j15J69k53J28k9j55J27j96J66L35l81k24M56k59J6J40r4
5251b6%k4J57q6K1l9r2M4K19l27J65J44k20k1J59o7J09k42K52r9KN7O2k10n3P3
5277d2Kj53N13k60k3k3j4j1O0j60J70k01J3k7m2Q1o9L87k36r0J85l05J40P8J23
5302I6l80M63l8O4K6k11m9M9j8M08j99k77N0N6O3j75L4Qm4O6j06K21n9j79L54
5327B23k09j10N7K49j23q7L8J6l23K86q7L11o19J85K77j13jK00j17J5K3j73J65
5350H3j40k81J84K17R8o1m6o2j69J51P9l13L00K01j16q1j12L8K7l31K64P6k21
5373b15OK17n2J11Q8j18q9j6L1L5n1O3m9J8j35K94j93p0M4kJ35j39J27ql4l7J70
$$ y = [85, -302, 33, 61, 96, 154, -7, -200, 65, 64, -135, 61, 50, -112, 53, -151, 251, 63, 183, -1, -25, 156, 208, 99, -69, 34, -241, 143, 28, 197, -56, 72, 43, -112, 15, -181, -15, 320, -61, -285, 171, -88, -72, 68, -26, -26, -50, 107, 21, 42, 3, -89, -45, 174, -153, 12, 156, -64, -85, 74, 7, 116, -126, 126, 27, 29, 86, 148, -62, -115, -42, -40, -193, 320, 60, 37, 14, 0, -11, 49, -111, 59, -142, -129, -156, -198, -117, -186, 201, -35, -125, 60, -245, -105, -27, 96, -284, 179, 141, 205, 231, 20, -29, 20, 2, 410, 211, -66, -16, 40, 103, -72, -38, -30, -74, -8, -114, 107, 48, -131, 223, 14, -96, -39, 210, 87, 0, 38, 54, -269, 17, -70, 241, -378, -193, 84, -29, -30, 170, 53, 68, 91, -82, 83, -57, -338, -154, 63, 161, 100, 54, -8, -177, -26, 53, -260, 40, 241, 125, 44, -68, -30, -3, -334, -70, 6, -215, -209, 8, -44, 67, 155, 37, -52, -68, -37, -2, -53, 10, -39, -21, -156, 138, -55, -125, -81, -83, 52, -87, 40, 32, -2, -39, 131]
5400A31k85K80j30K04k61K99j80l7j54J57K28m46L00l6k28L2J72k53L42j94J29
5421G0ok54J77O9k45K23L34j68k37J58k66J44Q1j09K09o7l8j17m4L11k14j1l3
5444c3p4J59j60j54K91j09J93p6j18J79n1J14j92p6K40o8j78L96l42m4K45l82
5466b40K23K15l98K03J35j33M9l8J94j25l01K23o1J3p1R8Q3j56N50m51J16p1j36
5489g9K99j62n6O3K2On6o2R3J50o2j38j56r9K40J49r0k30J97j57M2j89L69k30
5513a36J06P4L2r3p2P0O0o9P9q5rP5J81r1j90Q9J2n9p7J86J3k18%J0Q4j50J28
5540e0m4J68k27j11K00J65k51K5K70m01K88Q8m1n0P4m6L15m51j45J92ml05L24
5563a7l6K54k26J20J23m35Q3J20J26k48K81n9j94J96j98p4K26j24K0l6J22k96
$$ y = [131, -154, 126, -4, 200, -61, 238, 58, 21, -133, 24, 252, -194, 106, 70, -158, -126, 46, -207, 135, -59, 70, 64, -190, -13, 56, -189, 34, 368, 200, -37, 121, -145, -1, 80, -29, 180, 113, 75, -42, -86, 225, 11, 0, -33, -107, 52, -108, -262, 29, -80, 113, 37, -81, 98, 47, 161, -31, -107, 133, 65, -113, 283, -59, -103, 142, -240, -17, 198, -200, 3, 138, 5, 54, 16, 210, 85, -216, 7, -54, -41, -112, -14, 69, -87, 463, 12, 128, 57, -79, 220, 58, 2, 65, 87, 93, 37, -25, 68, 218, 156, 18, -138, -237, 3, 152, 62, -168, 29, -128, -86, -275, 94, -136, -30, 44, 76, -17, -89, -19, 41, -28, 51, -34, -43, 32, 213, 122, -68, 21, 33, -26, -103, 83, 96, -122, -122, -112, -28, -178, -50, -94, 74, -153, -264, -64, 101, -150, -125, 145, -256, 32, 120, 79, 29, 103, 57, 372, -79, -224, -32, -36, -341, -17, -53, 201, -25, 95, 218, -217, -134, -14, 112, -136, 145, 86, -108, 88, -110, -184, 42, -82, -62, -98, 24, -272]
5585b72O0L08J07j19j38q0K09l7o0j10K65j06P3n5j11j49O3J94o8O6j73P1r3J70
5609A5k7M02l43Q0k89J88M1p0o6N0J18Q6J24m95O5J14J34J5j56P8J4m33N02k34
5633h7L4J42k24Q9j56J76O2k44K19K68m15K6L72k77k98L78J76k41k00L02N7k70
5655a11j75J77n8K39j48O1q9K9K17m6j5N0k27J40L0k32K05l7j24L6k5K41m08L29
5679E9k92K40NM8Om6K02l82J95O8Lpj40K38j42n2K05l35j19J24J95p9Q3K2J76
5704B75k84J7l05M56j35j90o2J47K16l43K3J67K1j35M02m23K43j12J16q0J5p6
5726d7K3J0J85l06N1K21j6M9k66J40J9r1k16J80K6J40R2j96n4o5J98Rr6r2k1M1
5752h2K51r9R4j41N4j95J65o3lJ27P9j46J16L6j05l7k82qJ84k34J80O1R7j67j24
$$ y = [-272, -212, 96, 203, 84, -54, -134, 75, 38, -22, -132, 133, 27, 100, 45, -66, -215, -152, 42, -26, 40, -133, -62, -155, 15, -12, 390, 47, 127, -162, 26, 67, -3, -69, -19, 99, 185, 309, -186, -121, -7, 127, 142, -14, 64, 78, -355, 147, -87, -53, 89, -135, -46, -202, -26, 36, -208, 11, 279, -136, -110, 262, -15, -313, 65, 241, 0, -200, 102, 159, -111, -286, -109, -167, 72, -76, -15, -104, -75, 142, 96, 81, 131, -96, 44, 74, -158, 47, 10, -114, -78, -103, 138, -270, 59, -233, 7, 12, 60, 66, 20, 222, -160, 35, 103, 106, 99, -41, 197, 55, 3, 208, -127, -246, -122, 73, -6, 77, 99, 275, -9, 8, -297, 159, 24, -166, -228, -81, 135, -208, -185, -18, 3, -132, 270, -153, 90, -22, 94, 14, 29, -47, -24, -14, 171, -135, -84, 137, 121, 170, -96, 44, 63, -28, -244, -64, -38, 102, 194, -2, -56, -121, 77, 86, -10, -102, -123, -82, 169, 70, 164, 23, 77, -118, 47, -16, -19, 108, 187, 41, 157, 193, 88, 51, -231, -239, -55, -289, -109, -48, 49, -118, -242]
5777b42J82J11L3M3l07l2K03K2j1J76k12PJ12j65K74j27j9P5k38j03J40K6J4k5
5801f3k56J42L18l80J66k9J4j24K59k88K02m3r1n5J69qp6J92j83K00o7K0j08K29
5825A40j92J46L0j45M8RL5r8P8q4M8J01n7m5J15O0k30k48K87O4k08J28R3o2J45
5850A58k02K96j91n1J07J7j18O8N5j82J98j87J36o4k34P1j22K40R1o0j3m00L62
5873b5N6PJ31j38p8L5J26j28j21K08l37L10M08m58J59k94J82M6Q1k01K4K9L6J
5897E9j17K08l2j45m9K85m07L26j75q7L51j22j2Jk19l6M85m57L55q0l23K28j3
5920B4J57k77L6k3k7J13J36j58l2q2J85J27k37J60L2n6j93K82k01J84j60J84j00
5943G4N4r9j72k31M30L0k01M8j05K23l8j39R5L46k85O2m0k21K24k1j70%K47j98
$$ y = [-242, -60, 51, 84, 127, -180, -212, -9, 13, 2, 178, -34, -27, 85, -80, 194, 67, 48, 123, -115, -218, -78, -52, -38, -63, -319, -177, 141, -239, -73, -102, -88, -212, 47, -241, -39, -82, -173, -228, -59, -67, -143, 49, -134, 66, -1, 19, -89, 140, -52, 94, 124, -21, 27, 36, 71, -27, 51, -33, 15, 116, 59, 14, 129, 189, -41, -289, -2, 62, -146, -18, 75, 13, 158, -44, 252, 61, 10, 117, 134, 16, 84, 139, -43, 155, -32, 104, 40, -194, -123, -245, -5, 86, 26, 13, -387, -25, 31, 38, 169, 31, -47, -12, 114, -14, -135, 73, -264, 46, 454, -4, 155, -139, 43, 89, 170, -31, -7, 22, 58, 59, -58, 150, 118, -27, -76, 209, -198, 128, -47, -134, 217, 95, 83, 84, -135, -171, 314, -143, 212, 132, -191, 37, 24, 181, -96, -60, -83, -110, 3, 139, -19, -51, -133, 52, 179, -58, 102, 134, 78, -115, 167, -34, 150, -10, 174, 74, 128, 29, -143, -374, 56, 86, -115, -67, -172, 51, 13, -126, -31, 315, 30, 92, 52, -169, 55, 34, -136, -136, 111, -87]
5967h7J84j8o4k03j48L93j1j78J23K25j38j04M8N2j19M8k26pL67K7l18J4L17m43
5991b66K55NJ42J14m69j8J05L53j21N4l35J50O2k33J60k46O29l30J82j62pO4p7
6014A1j8O2J28p0N3m11L23o4l07M67P5l78k8Q7J46p3J7j96J37l3k85N60q7j07
6038Io1l8L3K11l05R4L19m62MK54j58K76m7k6n7j16K81j68j62L63l70J00J83k84
6062a27j2L1L14k11K20l52K53k59l3K37K20l65J08L27k76k25J26L82k22O1j33
6083F4n0J5n4j67M35m50K61J7J10n7J9l32L64k61K86p5j91K50k92M1m8K5K29l57
6107b18M9J24j54K38q3K23m74K34J6j01oL03j49M9R9l34L35k44J92o4j06j91K18
6130d4j2n3J64k63K72N4o3lm27K21K40J86l64K01Kk68J65j59K8K7J73l52L84j16
$$ y = [-87, 97, 79, 15, -188, -336, 57, 46, -132, -9, 216, 78, -26, 22, 74, -45, 3, -223, -230, 137, 164, -154, -140, 177, -266, -11, -6, 136, 250, -219, -237, -132, 221, 100, 154, -181, -31, 31, -202, -42, -288, 341, 11, 193, 31, 24, 88, 11, -7, 55, 183, 113, 166, -245, 78, 14, -293, 174, 249, -129, -157, -70, 76, 3, 20, -176, -39, -72, -357, 203, 116, 9, -52, -90, -57, 154, -151, -57, 262, -200, -196, 58, -100, 176, 129, 103, 46, -70, 211, 43, -119, 244, -126, -26, 157, -127, -139, -108, 206, -5, 215, -137, 116, -143, -176, 61, 281, -84, 24, 351, 75, -150, -24, 358, 136, 197, 64, 14, 29, -25, -192, 243, -207, 54, 71, 181, 124, 143, -189, 175, -86, 200, 125, -66, 184, -108, -67, -115, -90, 139, -218, -169, -45, -199, 39, -44, 179, -295, -61, -45, -146, -152, 151, 2, 51, 150, -184, 151, -93, 99, 35, -71, -262, -44, -56, -109, 55, -208, 64, 118, 55, 52, -375, -154, 86, 272, -92, 109, 111, -157, 8, -151, -123, -96, 77, -275, 109, -7]
6154gl7J60m3K9K1k93K76J93m86J36J44r4j0p4J2R8j32J49j44L05q1M0q0r5j22
6179a35p9O04l96R9j64j37N7N7K89j83N0lM7j04J50j92qPK25k15on9P4j02K77
6204A53k03K10j07m1j06J30j5k54M05k06K23l94M07q0k06K34j38P9m5q1M8k26
6226b13K06j75K66j1k18r5M30r5n4J27k28jl8J26o5j76M22k78P9k9j2Q1J32j1
6250A70j7k07RQ4j83O4J58j57R7j19K17k11P4j33J65j23j89K34P1K53j89m5L4
6273E7K04j65n3r5K59j46j19R2k48L04j16J39j17k8m6M1j60j2K38p5N9j24j0K69
6297A48j58j55p1L82j99k5j24J70L49l70J09J71l42L9N8K7k5r2j37J80O1n7j22
6320a83J07j05n9N86j08k49J28k32J17j8l4j31N7J86Jj36M6j59K47o3RM5J4N3
$$ y = [-7, -44, 116, 73, 102, 123, -170, 106, 299, -187, -51, 93, -1, -11, -85, -73, 25, -107, 42, -102, 203, 122, 162, 82, -13, -135, -214, 390, -6, 93, -71, -208, -151, -94, 195, 12, 62, 59, 106, 2, 152, -40, -48, -41, 184, -31, -37, -96, -22, -124, 153, -50, 160, 53, 12, -94, 36, 21, -233, 172, -34, 189, -205, 202, 122, -84, 150, 12, 91, 46, -35, 13, -213, -7, -182, 84, 73, -145, -240, 190, 95, 41, 168, -60, -61, -99, 27, -38, -214, 208, -70, 9, -20, -32, 49, 181, 170, 153, -54, -45, 39, -144, -80, 78, -79, 18, -101, 116, -95, -21, -154, 11, -112, -301, -67, 4, 257, 68, 23, 57, 261, 96, 43, -52, 207, 61, -58, 34, -214, 90, -26, 113, -4, -32, -78, -37, -197, -209, 29, -46, 13, -111, -121, 148, -10, -165, -236, 146, -53, -78, -202, -32, 317, -53, 56, 227, -115, -76, -18, 9, -16, -108, -245, -65, -4, -61, -183, -76, -181, -240, 346, 238, -11, 117, -115, 2, -16, -50, -181, -124, 62, 63, -73, -27, -186, 61, -2, 7, 52, 66, 119]
6344A19k93J02J34j75L6J44j28K53l07K91l96J7K48J64o4k1J2k30K20k54M22k36
6366E8j82K92p9J08m2k31J33lK7J5L7j71m6J35p4K98m77J26m2J23l3R6k24K28
6390G2j94J88j36J30l65M04k03J89NP0j44j80J71j28Q6J65j36j53P7m4J45R8n0
6413F7l83L95r9R2j84J78k22J48J01k29J76J24j25j64J04J50J97k93J12L6l2R3
6435B42k2k98K12k32K86k0K0mj45j33J59Pl36M15K9r0k3L1j9l35K73J08l4r4O
6460Ck0l03M48m2p2j02J89j42J86Jq2J41j45P4k11N8Q4j44K8J0j58J68J29k37
6484a39J14k20j24M26J14j21k7R9r7l02L13n0J60j12J24k18J52m48L26J0M6n4
6506b8j67J05Q3j32L1J79j33J74k62K6j2J52J09n22O55k6k43j20L16j83j46K40
$$ y = [119, -174, -72, 62, -113, -77, 67, -61, 192, -115, 176, -220, -203, 45, 209, 145, 124, 136, -94, 126, -128, 294, 58, -124, 168, 89, 197, 155, -76, 57, 54, 81, 96, 133, -38, -84, 51, -23, 275, -202, -76, -118, 5, -28, 68, -156, 72, -122, 66, -70, 60, -305, 99, -104, 85, 90, 160, 16, -164, 7, -121, -35, 130, -6, -159, -82, -126, 19, 117, 67, -316, 79, -20, 72, -112, 66, -156, -8, 93, -136, 40, 164, 39, -125, -21, 129, 326, 33, 145, 181, 149, 242, 220, -78, 134, -98, 188, 168, 188, 184, 39, -94, 65, 72, -264, 151, 180, 90, 67, 98, 79, -256, 17, 125, 91, -3, 3, -17, -320, 128, 86, 14, -88, 101, -41, 145, 146, 64, 205, 60, 134, -77, -19, 65, -79, -51, -41, -199, -31, 98, -139, -25, -245, -369, 57, 171, 50, 23, 122, 25, -277, 36, -14, 146, 34, 158, -60, 92, -356, -30, -20, 26, -28, -195, -90, -7, -139, -108, 71, -62, 112, -150, -124, -136, 16, 125, -397, 258, 232, -11, -131, 185, 2, -144, 96]
6528I6k70L10P3n7l25m8L32j39r0j86K93k31L4K54j27L3j58K59j39K20j05p2M8
6551Ek05K99j63J68K7m63N30n8J22m66P9L92l20K43k41j93K10J62j76J36j45L2
6573b5p3K60j16j64n7N4K21r0j45R1j40J7K16k4P8j84K21j59j10j03K02K28l50
6596a52K54q9J5O9l64K23Q1j7o6q4J91p9r5K52l6k72J13q3M48l07j21pJ41J50
6620A65k39K01N1r0o2P0o1oR6p4R3l7L64m39K08l9l09L82l12J18j62J99j06k86
6644b75M03p6J37k41N6K9n2K02l14J06N5P8j85k0J76N3ml52N5J22J19K5k08L2
6668g9N5K21k13J13q4K59l20L9j21J04J42j97K60k33J30j68L57l01l1K15r4p0
6690a6J20K9Kj53O9j80J49o1M7j69K49j95R5K45l30Lj80L78r0K4j31N9q9L5o4
$$ y = [96, -174, 136, 209, 152, -173, -221, 111, -28, -118, -304, -11, -242, -208, 46, -81, -48, -206, 53, -86, 134, 29, -43, 5, -200, 99, -64, 104, 131, -332, 198, 140, 262, -204, -125, 267, -53, 190, -51, -244, -34, 128, -48, 88, -57, -25, -98, 162, 46, -118, -175, -121, 100, 10, -135, -44, -184, -167, 49, 25, 103, -81, 140, -19, -129, -232, -30, 198, -152, 102, 13, 28, 97, -267, -44, 37, 20, -46, -130, 61, -18, -113, 139, 103, -169, -56, -139, 309, 2, -119, -126, 15, 165, -74, 127, 178, 88, 26, 96, 35, 29, 125, 51, 144, 107, 471, 32, 240, 201, -108, 274, -38, 80, -82, 117, 11, -275, 128, 52, 189, -52, 4, 33, -19, 183, -131, -25, 30, 108, -77, -97, 79, 132, 128, -224, -169, -47, 72, 97, -111, -79, -24, 197, -16, 97, 13, 272, -48, -9, -130, -26, 116, -81, 179, -54, 76, -92, 265, -36, -67, 148, 54, -16, 104, 133, 135, -18, 51, -129, 20, -41, 6, -163, 86, -109, -14, 231, -99, -96, -276, 102, 12, 36, -95, -36, -125, -90, -154]
6715a54r3K62j2o1r5J09L26l62K43j38K88j56l82j0L49k37J80rkJ35k25R2j25
6738g7O3r2M9J04k00J83r1O6J44j36j05K93k97K91k03j00J19j41K66k41m1J05
6760d1K57k64K30r7N5j28mN0l15M73k01k06J95J51j48RO0J44l64M31l00J58j48
6783cJ03j76j15Q4K91l50K60j33K25O0m18J81j18J4l6L9o0K05QO7k21O2L40m33
6807a24J91r7K26k65P6j83Q2J82j39qO3r8J97j51J24P1l81R6k4K52Q3j66k40J80
6831e3P4k16K12j30Q7j55K15J71m32R5L7K4J97j79J64k11j26L14k79J49J64j24
6853bj03J45k17L95p6k3j97P9r0L54j22n1j52J56J12k17K1j37L19k46Q6K5ln9
6877cj4j70r1J67J56P1q5P9J43l55J36J42m9k23J5m0J49k42K24K06k77J19k75
$$ y = [-154, -247, 15, 3, -58, -153, -44, 282, -80, 163, 25, 313, 157, -225, -235, 114, -123, 57, 48, 46, 181, -44, 48, -77, -14, -106, -57, 47, -153, 30, -61, 5, 149, 13, -92, 201, -96, 195, -8, -108, 11, -130, 136, -105, -146, -41, 216, -48, 182, 85, 140, 12, 8, 58, -257, 216, 15, -191, 4, 155, 7, 16, 76, 220, -144, 287, -13, 145, -3, 100, -76, -191, -107, 184, -166, 94, -39, 186, 246, -172, 9, -109, -95, -131, -92, -152, 53, 61, 128, -93, -31, 309, -124, 67, -30, 196, -69, 7, -176, -94, 88, -51, -59, 4, -94, 103, -48, 76, 147, -234, -138, -162, 90, 173, 7, -233, -53, 21, -195, 17, -113, -26, -181, 34, 205, -227, -132, -95, -71, 126, -53, 111, -100, -226, 88, -191, -42, 122, -2, -105, 40, -177, 218, 142, 119, -78, 1, -89, 265, 143, 92, -60, 96, 208, -9, 12, -125, 194, -52, 34, 59, 56, -3, -17, -187, -278, -111, 45, 116, 31, 110, 253, -102, 34, 176, 127, -96, -81, -121, 28, -214, 10, 216, -61, 58, -217]
6900b17N42m68K39j85j0K52p0k6j25K72j67j87J21k43K67J14k05J90p8j22K62
6921A56j22j14K5j19O6Q1j57J11N4p7K45rj14J22j52k49K79j88K24j66P7j13J30
6944a0q4K17k08j25L97j75Q5j08k2l5J55j71K10p0k84N58o07M29k50K23o6k3l2
6967Dk50K13R4r0M8j0P6j24k2j20J66Q1l67K62K75m15J11J55J4j10j60J56j40
6990a53J21L8l1J47k05J61j6Oq5Q7m2m6J6j0M01n22K27j85RJ03J33l30M2K51k28
7015a11J70L0K22n86K10J51j42K93j89k23K63qk50O0M6J74j99n3j08L34j36J18
7037F6K25m8n4j09k41L96j94J57j79k74K24j36K03kj62P2QJ09J6q8k69L95j89
7060g4m8j3p5OK41Q5j76j20O1O5K4m5J28o6K68l81J33M3j05K69l87J46K15k18
$$ y = [-217, 325, -143, 96, -89, -99, 153, 83, 57, -68, 204, 37, -150, -29, -272, -5, 109, -96, 94, 16, -106, 156, 34, -80, -55, -174, -108, -27, -184, -73, -19, -96, 149, 140, 26, 148, -4, -253, 26, -162, 62, -104, -27, -140, -10, -94, 123, -85, -210, 187, 12, 97, -11, -33, -68, 87, -84, 126, 56, -228, 330, -277, 152, -98, 125, 59, 36, 4, -246, -33, 61, -29, 19, 9, 85, -39, -61, -181, -15, 66, -301, -39, 236, -179, -68, 87, 101, -9, -169, -13, -153, -32, 6, -25, 122, -83, 78, 62, 68, -17, 70, 28, -18, -2, -12, 389, -133, 94, -91, -82, 21, 154, -176, -134, 117, -111, 59, 89, 311, -275, -65, 86, -56, 237, 48, -175, 88, 80, -170, -110, -64, 110, -89, -142, -250, 84, -52, 66, 291, 243, 189, 80, -161, 235, 41, 198, 19, -255, -31, -167, 36, 34, -128, -56, -48, 61, 77, -11, -280, 115, -74, -122, -135, -210, -204, 37, 122, -54, -174, -113, -48, -24, -69, 59, -7, 261, -120, 13, 56, -49, 220, -167, -21, 194, -24]
7084b4J50j56j49L40k12l5K06P6j48j35J9L8j65R5r1N4K63j36J65j22R6k95J44
7107b2j10K04J23p8kO0j59k0o7K73k55K57l87M02m3k29j2J2J19J39k00l29K12
7130a12O1j24J37M3k6N4j00l6R0q1J12J86l98M21J1k94O7Q0J02j87rj17J60J19
7154A59J2j08pk18K29j97K72j10M0j08R8R4m74Q8L1L42n9P1k43L17l46N6O0j48
7178a49q0J58Nk29L03N7K8l49J41j56L84j15j34oJ91Kk39K47k5q7J89l11K81r7
7202Ip5m1O1j82L46q6pM0mK31l77J03k33J00Q5J03n4j43RL32l85l1J78k3r0J59
7228B5j84J59J1p2J27j85J28M3o7j5O4j85K31K6j17m3N4J31p3k38K28J34l82J28
7252g2M9J64j35l5J73rr6J84j87P2j27N7K6p7P0n8j65K16l2j10P9k24M35l90J90
$$ y = [-24, 126, -30, -179, 161, -51, -86, 120, 196, 48, -87, -68, -30, -195, -100, -191, -137, 126, -10, 155, 33, 129, -166, -22, -132, 72, 195, 117, 115, 175, 16, -4, -71, 202, -53, 204, -183, 219, 176, -53, -65, -53, 66, 205, 5, -324, -112, -51, -175, -38, 5, -21, 33, -67, -103, -13, -94, 18, 204, -194, 227, 238, -56, 11, 91, 193, 6, -3, -120, 40, 159, 171, 63, 56, -162, 67, -130, 142, 32, 72, -36, 62, 156, -318, -230, -199, 143, 84, 155, -88, 229, -117, -61, -1, -149, -229, -71, -66, -295, 8, 65, 93, -256, -115, -271, 113, -2, -136, -142, 49, 51, -188, 59, 34, -53, 136, -175, 106, 9, -66, -107, -46, -228, 118, 32, 25, 65, 61, 292, -85, 18, -215, -115, -30, 73, 19, -124, -115, 217, -168, -199, -21, -44, -134, 25, -159, 0, 11, -61, 66, -119, 9, 52, -15, -30, 34, -151, 80, 106, -11, -54, 0, 131, 58, -180, 48, 182, -200, -72, -23, 141, 6, -29, 144, 135, 39, 223, 36, 108, -19, 38, 64, -13, 57, -1, -166, 50, 18, -92, -13, -237, 198, -192, -2]
7277bp1K2J84k5O4j24l68O62l86k22N0L28o4J06j85J43p8J29m47J00M60l92j34
7300b50M2J23K42m21M29k51j75K45j02K56j20o6K54j43q6J84l86J47r0J2j03L17
7322E8o4j11J92J62j47J22m32PK87k75L06j05Qk8K06j08j32M8r2L73k23j14J78
7345A16j10Q4N4j43J4j88K40n5O4j12N1R2oJ91j22k00K8n6k90M06K6P0k08n4J68
7370F0n7m%l04K80O2r8j1j63R3K20k03N8J56Jk26K20J1o3N9j50j0N0r0J96j35
7396d8O0l78L83Q6k93L02k08J12l5j07M43k90j51J18J69q3J77j74l02L73k3l06
7418a75K54J3l02K76N0k20J06R1j84r4r1K46j8L34k74j04m1K09M0j53l5K78l24
7441a18J16K00k70R2k15K23j75o7K16j63Q6K27l00K5MK64j89P1l09M02j43j02
$$ y = [-2, -73, -51, 133, 108, 172, 48, -320, 342, -44, -266, -216, 112, 48, 154, -31, 112, 34, 163, -284, -184, 276, -116, -250, -208, -85, 157, -264, 165, -86, -261, -16, -118, 138, 18, -48, 206, 63, -23, 161, -225, -78, -168, -156, -259, 58, -6, -117, 75, 237, 90, 212, -220, -213, 74, -201, 105, 0, 8, -20, 186, 78, -54, -6, -98, 275, 52, -62, 116, 6, 90, 144, 1, 15, -173, 67, 12, 76, -36, 15, 107, 101, 292, 170, -30, -2, -58, -348, 58, 84, 154, -54, -108, 60, 3, -1, -1, -305, -25, 37, -61, -72, -235, -142, 78, -125, -67, 89, 90, -136, 84, 95, 32, 91, -59, -69, -19, -109, 87, -48, 12, -366, 17, 103, -190, 112, -96, 16, -19, -126, 317, 27, -124, -6, 163, 80, 257, 83, -219, 154, 131, -175, 79, 92, -210, 66, 116, -104, 2, 93, -91, -185, -276, -30, -48, 286, 12, -92, -133, 76, 116, -37, -72, 206, -118, -2, 198, -72, 20, -195, 28, -147, -214, 2, -161, -75, 152, -148, -123, -119, 145, -44, 27, -282, 120, -23, -125]
7463a25J61k8J50l90K48O8n1k55M97k99K6J7J5j83J22K93l79J12N4j02K67j85
7485C3J60J1k77%m9J23j06k04J99J26M3J46n7j87L5N9l52L47j20K42K7N8m6j74
7509C7j07K57k41Q3l7M6L9l7p3Q4k4J31n3j9j14N4Q4l29L56k77Q8j88L0L75j18
7534D7l2r5O1j39K3n6Q2J34j13P6j23J59J56j02k56K38l94L96j79L37l25J2K25
7557A32oj43K7K04k42k30L2L30O7m94K02J60K4j56M8K33m7p5l22K52j61j56L52
7580C1M8Q4Q5l30J28m6L20m32K88l43L42k27J04n7j95K39J00k12J5N6m3J15n3
7603A7l8Q4K55m43K59l20P4k9K08J4kk69K80k01p6K75j38Pm4j07J42J57j19p8
7627i2j7K51m21M37r7m09N37L8k25o0L0k10p6rL21PN1p0K74k10m28L59Q3Q9nJ0
$$ y = [-125, 36, 8, 158, -232, 16, 84, 33, -222, 275, -24, 2, 19, 34, -149, -27, 266, -113, -1, 53, -49, 218, 33, 193, 204, -73, -73, -122, 1, -105, -309, -110, 16, 59, 205, 148, -39, -4, 55, -297, 50, -70, 172, 199, 257, 211, 37, -70, 187, -54, 29, -8, 38, 77, 40, -33, 51, 27, 158, 105, 86, -28, 26, 110, -219, 137, -140, -52, -240, -210, 165, 47, 15, -80, -19, -158, -135, -191, -109, 25, -88, -12, -135, 24, 180, 78, -178, 60, -334, 62, -117, 220, -105, -93, 132, 126, -17, 10, 214, -28, -258, -226, 104, 171, -323, -121, 39, 63, -93, -45, 188, 141, 66, -256, -4, -165, -321, 31, 79, 163, 248, -82, 46, 0, 320, -112, 176, -167, 175, -52, 52, -5, -200, 39, 139, -73, -58, -2, -45, 70, 17, -21, 63, 318, -125, 134, -186, -112, -141, 67, 81, 79, -190, 90, -111, -187, 88, -50, -43, -87, -194, -52, 105, -14, -92, -109, 142, -279, 158, 61, -348, 189, 227, 2, -58, -28, -238, -314, -323, -2, 5, 56, -14, 260, 50, -378, -19, 64, 153, 148, 158]
7653A58l49Q7L26j82m9k35N48k18J07l22J51q0j23J27j25j80N70k17p9k8o5K14
7675C6j66J77j06P1k25J00L6PN4M0r8K69j76j2j69K96k50J44j03j76J44J19n4
7698d2OJ65p3n5j88K59N4j84K80k80K20k19p6N7K34j39j66J76l8J79J11j27j6
7721A38l38J15K44J8q3p5l6k59L19k43K81j27K86l76J02P4K0o1Q0k52R7M10k63
7744G1k48K65q3J09j25J10j65J08k10K67Q8k66K15k06j09J68O9Nk0j19j9J12J19
7767A36k74J1O5m7L26k17j72K72M4N5l10rJ14j6l6l4K5pK47l82J82k8j10Q7J04
7792B6j56J18j46K35j78k43N16j74J2k20K87lj0r4K31j98o4J30r3J40j48r7MK63
7816A38l26K72K05l93R6Q2ok7P8j33j82O4j15%L57r4k17J90J57k13pK28k38Q3
$$ y = [158, -191, -104, 222, 40, -9, -244, 304, 86, 193, -129, 22, -58, -181, -54, -179, -359, 211, -6, -85, -113, -178, 36, -130, 47, -59, 12, -213, -113, -77, -70, -16, 24, -74, 195, 19, 7, -162, 134, -116, 28, -75, -251, -107, 12, -42, -36, 129, 56, 1, -187, 72, 126, -58, 222, -58, 162, -57, -133, -76, 158, 19, -147, 29, -9, 170, 281, 154, 138, -200, -85, 159, 177, 94, 19, -17, -276, 43, -200, 81, -46, 240, -136, -34, 40, 60, -1, 79, -173, -76, 334, 71, -177, 88, 5, 114, -11, 99, -66, 42, -168, 99, 187, -79, 136, -70, -179, -11, 58, 63, 43, -76, -95, 17, 136, -138, -127, -62, -109, 217, 0, -172, 100, 144, 199, -111, -120, -6, -22, -58, -92, -67, -74, 173, -209, -27, -55, -165, -78, 26, -130, -12, -158, 77, -101, -344, 172, -2, 10, -210, 77, 74, 64, -30, 201, 3, -61, 69, -24, 116, -32, -129, -125, 138, -188, 84, 289, -104, -8, 74, 68, 41, 119, -14, -196, -132, -247, -247, 110, 16, -201, -11, 146, -67, -74, 154, -84, -1]
7840aJ80m28o7L36j21j51M5J09L57n10J09J67l73L09o7p2J6K35ml85K05K31j24
7863dJ93j45n8M7j43k2K74j65l7n3K53k75MJ25J59j07j8r5N9m9j49J61M3J45k09
7888f6j35K27J05j91j2J63o7k08M93l74K0q7j45K74p2o4J85k26J70j95L5L44j36
7911C8P7k48J48J41j93J05jJ62q1k00K05k07Q1L55k26m0k21Q6j38K07J46k77O3
7934a8q1J52K29m99J79J68l9Q0j54q1n2K13j72L7L03m51J20j43J86M1k17M49o5
7957A85k05R0k46K38q7J31k91J36J34j37J96j55M9o4n7j7J10j5J12k30n5J97m4
7980b5q2J87j19J92k46j27K39r3K95l05J50j32J98q9N3k29K36j64r6K53n31N05
8002G0j57K15j16j18k20M27j03P2J74J8k96J47j4j26k88N53k27l20J69L3N1N8
$$ y = [-1, 179, -249, -316, 20, -101, -252, -207, -98, 259, -251, -142, 25, -348, -39, -106, -178, -162, 73, 69, -316, -111, 120, -4, 189, 44, -14, 33, -110, -132, 142, -23, -60, -113, 140, -135, -131, -6, 153, 46, 28, -67, -8, -57, -206, -45, -2, 143, -66, -201, 26, 131, -60, -72, 91, 24, -184, 309, -65, -45, -132, -277, -3, -75, -139, 46, -180, -10, -205, -170, 174, 38, 115, -133, 15, 156, -37, 68, 67, 229, 148, -52, 153, -54, 27, 382, 156, 116, -105, -19, -157, 50, 196, -81, -18, -99, 53, 282, -217, -38, 130, 91, 171, 17, -64, -116, 97, -75, -38, 265, -186, -66, -209, -23, 18, -199, 250, 185, -20, 70, -176, 62, -25, 106, -185, -49, 85, -52, 144, -11, 38, -26, -83, -100, 10, -5, 107, -123, -178, 19, -25, -107, 80, -39, 153, -93, -220, 19, -74, 221, -84, 66, -66, 132, 43, 96, -133, 103, -61, -157, 96, -435, 70, -87, 128, 12, -106, -326, 101, -2, 70, 244, 262, -34, 113, 99, -27, -315, 238, 11, -309, -140, -107, -56, 2]
8024BJ34n4K21j57mk26n8K62j41r0K5J73Q8j99j3J5Pj87J50K46j65p1q4J14k9
8049d1j01J70o3l50L21k1J08m4O2n5R8Q2k6j05j9j23L46l97M9n4Q6k17K70J23
8073I9J49k82K2p2N6M27k89l48K78j28Q0k37L9K07J88j91R6P9k54K18k25l7K86
8096A61Jn8q4P9k68J76J22Oj67Q1P3K8m89L74N7n2j05j10K1K30k27M7Q7J62l76
8121b31K82K81l53n2M9nQ6n7k48J22J95j56K17j66j16L54P7l14J6P7j06J19m19
8144c48O16j47j83N4N2p8K06k52J06Mj95J68k4k8J45J99j19k91M3K2M5Np9l34
8168d13L48L09k80J23j11K31l17J13Q2j17P5J54k20j07J57j0oj12J93P3j69n0
8190e4p2
$$ y = [2, 136, 82, 303, 146, 142, -84, -142, 120, -21, -111, -86, 87, 175, -24, -37, -22, -15, -202, -52, 194, 29, -42, -126, -12, -41, -142, 28, -35, -385, -64, -85, 23, -21, 41, -14, 84, 166, 140, 35, 16, -107, 239, -158, -109, -163, -77, -294, -24, 99, 248, -34, -12, -84, -28, 399, 110, -238, 40, -88, -8, -245, -206, 1, 189, -2, 94, 173, -81, 137, -88, -125, 161, 162, 104, 20, 99, -169, 7, 129, 135, -32, 49, 122, 150, -339, 35, 92, 40, -65, -175, -154, 76, -151, -104, -17, 145, -231, 51, 332, -21, -73, -24, -29, 57, 0, -248, -126, 69, -87, 130, -36, -152, 202, 279, -35, -19, 58, -48, 71, -348, 268, 121, -62, -8, 44, -34, 172, -80, 26, 30, -165, 3, -21, -49, 96, 295, 176, -115, -72, -50, -5, 0, -79, -413, -65, 244, -36, 87, -24, 207, -110, 3, 85, -32, 43, 197, -23, -130, 27, 17, 11, -101, 92, 165, -4, -54, -126]
8191a26
$$ Imaginary data points
##PAGE= N=2
##DATA TABLE= (X++(I..I)), XYDATA
0@%%%%%%%%%%%%%%%%%%Qj6J6j6J6j6J6k4L2l2L3m1M8n3O1o8P7q9R9j08J22j37
40g2J51j66J83k04K26k49K73l00L31l65M02m43M90n40N97o63P39q26R27j051J201
61F41j387J627j951K410l099M247o493J2356n2800j17138K05423J06254k03766
74e3676q3520K04738N6391j93717l2995J84426P227j69703J4350J54739l9121
85D9139j39010N9666J22442q0767j06804R8181R2519j15680p8247J27671O5708
96I4818j39906n3997J48864M3711j53872l1833J57118K3391j55574j2876J52153
107G1997L885j45614N961J35776j5729j23457K5952J09013l5789r3295M4914P5668
119E9282n4862n8889O1290M1339o9217k5897P3874J1922p7969L67Q1374r357q2751
$$ y = [0, 0, 0, 0, 0, 0, 0, 0, 0, 0, 0, 0, 0, 0, 0, 0, 0, 0, 0, 8, -8, 8, -8, 8, -8, 8, -16, 16, -16, 17, -24, 24, -29, 32, -36, 41, -48, 51, -57, 65, -72, 79, -87, 96, -108, 118, -131, 142, -158, 173, -192, 210, -233, 257, -283, 314, -349, 390, -436, 491, -560, 641, -746, 881, -1070, 1340, -1759, 2488, -4005, 8351, -44449, -161587, 43836, 150090, -53676, -137196, 67542, 123933, -69784, -102779, 81647, 88874, -80829, -66479, 88260, 49139, -89871, -30205, 92237, 11470, -95334, 2847, 95366, -20314, -98561, 29110, 94818, -45088, -99085, 49779, 93490, -60382, -92215, 64903, 88294, -67280, -80156, 71997, 75882, -69732, -63771, 72005, 56276, -67181, -41229, 67784, 31995, -61300, -16386, 59282, 4420, -54469, 6821, 48160, -21057, -46954, 26920, 38842, -39127, -38760, 42614, 33257, -49494]
132d9494J6937Q3211k1596q1232K4108Q0056k4542p5889K4826P1979k2584o6473
144d0693K0892O0012j9294n3962J6843M5939j6408l8635J5182L0434j5648k3137
156a8475J7342J4784j9978q258K2699J275k6297N134L0299r052l3271J3915L7602
169B7719j5961m0054J7475M3176j7852m4921J7042M6507j6305m6879J5151M6429
181C1527j4231m5469J2940M2077j3649l9042J2942L4179j4905k8557J6778K2454
193A7044j9149j5355K3082Q386k6677o60L0016n987l3046J3180L7542j9032l9492
206c0148K5293M1613l0380m2134L3738M1500l7073m0823L8596L7471l9622l3948
218c5917L9024K8893l8424k3969L7116J7182l6048j0377L4607K871l2393N387
$$ y = [-49494, -32557, 50654, 29058, -52174, -28066, 51990, 27448, -48441, -23615, 48364, 25780, -40693, -19801, 40211, 20917, -33045, -16202, 29737, 13329, -25306, -10124, 20310, 4662, -18475, -1133, 13651, -6327, -14585, 8114, 9389, -16908, -11774, 18525, 9473, -23798, -9883, 27719, 11758, -28296, -10821, 32355, 14503, -30418, -13376, 33131, 16826, -30053, -14902, 31527, 17296, -28173, -15233, 26844, 13195, -25847, -12905, 21274, 6369, -22188, -5410, 17044, -2105, -17460, 5622, 14008, -12669, -13329, 16687, 10700, -22346, -9166, 28376, 9344, -30148, -4855, 36758, 6378, -35756, -2018, 39482, 2409, -38414, 182, 37653, -1969, -35917, 3107, 32000, -6424, -30393, 6723, 23905, -12143, -22520, 12087, 14958, -17435, -12048]
230a2048L1163j2172k9066K0565K7889k7513k5960L4354K3934l9934k1439M3985
242A3758J9575m7627j6817M9334J3773n0871j0350M9247N800m8020k580M4793
254B0015k252m0501P262L5665j1470k9454J5428K3791j9247j7414K3020J1753
266A6596k5448o091K9031J761l0733K945L2061o566l2746R181L1707j1165l1799
279b1266J2218L0056j3344k8125J3376K4998j3718k1602J2673J7857j2575j4213
291a3665J2092J0201j0780n138J0681J890r961K708R691o351q645R177Q034j1033
305a099p543J2883O810j3691o160J3345N058j3318m800J1325L481r863l592P716
319E52K824n375j930L078J274j65p18j569n2M071N50n183o38O999J631p009j926
$$ y = [-12048, 19115, 6943, -22123, -1558, 26331, -1182, -27142, 7212, 31146, -8788, -30227, 13758, 33333, -14294, -31111, 18223, 31996, -18875, -29225, 20022, 25822, -22198, -24778, 20015, 17763, -22738, -15476, 20189, 8719, -20735, -5307, 18484, -763, -18177, 4843, 16596, -8852, -14943, 14088, 15849, -14884, -11939, 20122, 13556, -19190, -10009, 21698, 10533, -21266, -9048, 21008, 7664, -20461, -7085, 17913, 4195, -17407, -4734, 13123, 548, -13665, -1573, 8628, -2152, -7290, 3391, 5281, -4680, -1972, 7719, 1368, -7277, 1900, 9934, -1099, -8642, 4241, 11051, -2640, -8800, 4545, 9603, -3715, -8515, 2810, 6291, -3572, -7164, 552, 3376, -1999, -3929, -851, 423, 258, -460, -2029, -2081, 1990, 2540, -2643, -3281, 3718, 5349, -1660, -3586]
336c586P667K523q212k168O476K454o985k244N548J556m477j470L342N20k711
351a767M39Q63j362k47K701m62l957K308N104k369n567L519O229l342o447L363
367i94P134l761o486L102O645k807o560K494N501k258n162J062L571r39k659l95
383b512K235L50j150m55O07Q39N2o38RO37rk0O18p55L91J622M86k427m90L161
403B551N20m313j081M845P67n140j651N662J097n980j693N899J527o291j605N967
419A081J183n617n17N700P13m709l9M707j86m267J522L568j911l262K727L252
435C945l824k559M529J886n261j864N694P60o743p83P104k26p537P90P604j629
451A886o738J829O872k684n611K985N289l447l646L849L470m057j992M478R43
$$ y = [-3586, 4081, 6604, -1608, -3776, 2700, 5154, -1831, -4075, 1473, 3029, -1448, -2918, 424, 944, -1767, -1328, -465, -1827, -2074, 627, 165, -3792, -1484, 3620, 1251, -4316, -797, 5432, 2090, -4357, -994, 6140, 2379, -4107, -1005, 5640, 2833, -3727, -1233, 4268, 2010, -3152, -2090, 1481, 542, -2117, -2512, -277, 73, -1077, -1532, -925, -86, -34, -672, -663, -26, -35, -55, 563, -192, 199, 1821, 2307, -120, -610, 2551, 3071, -1242, -2323, 2522, 3289, -1851, -3502, 2160, 3257, -2723, -4416, 1483, 3010, -3281, -4886, 1081, 2264, -3353, -3870, 1830, 2543, -2166, -2205, 2502, 2316, -1951, -429, 3139, 1228, -2034, 693, 3945, 121, -2438, 2091, 3977, -1284, -3148, 2546, 3306, -3437, -4220, 2884, 2658, -4879, -4089, 3515, 1886, -4852, -3023, 3849, 1165, -4446, -1461, 3828, 381, -3265, 584, 4054, -3, -1995, 2483, 3426]
466C426m501j81M575j011m869J591L767j947m103K556L603l173l346K838L077
481B302l482k727L616J903k989j610L607J464l227l62L306O2k845Q22K390j519
497G11j720J915J518k586n21K546Q6l375L4K916q91l219J255K662j495k992K117
514a039K638k125j965K667R26k414o21K741L24k368M70K824q87j874J372J866
530B535j620j634J822R13k178j252K298P77k456o86K052M08k650r6K446m25k613
547b359M00K698r82j953J517K189j138j944J949J666j923q74J813P09j904l49
563d85K385nk538L95K120r42j824N61J289j386j287J075P25j065q61J620L00j027
581i50j84J228k75o37L15R36l03m72Q67O82p12j84O32L55p27j43P7P8n88J68N60
$$ y = [3426, -1075, -1256, 3319, 2308, -2561, -970, 2797, 850, -3253, -697, 2906, -267, -3613, -775, 2302, -1180, -3907, -291, 1612, -1377, -2987, 620, 2084, -1143, -1505, 1801, 1863, -982, -160, 2230, 711, -1009, 906, 2424, -162, -683, 1863, 1949, -1426, -1392, 1524, 633, -2586, -1331, 1331, -164, -3156, -1039, 1599, -526, -2491, 176, 1102, -1312, -1933, 808, 1132, -1236, -766, 2058, 1171, -703, 669, 2535, 915, -719, 1103, 2016, -162, -1414, 884, 1661, -795, -1481, 571, 979, -1671, -1767, 679, 254, -2359, -1959, 739, -243, -2196, -679, 1510, 372, -1572, 377, 2043, 120, -754, 1059, 1768, -136, -485, 1900, 1895, -643, -248, 1872, 930, -894, -333, 956, -430, -1717, -642, 83, -982, -1843, -223, 77, -950, -1134, 94, -181, -818, -503, 433, 130, -342, 525, 1207, 495, 311, 943, 1298, 571, 428, 505, 583, -5, 163, 723]
602G23m27p88K09M22n62p52P93Mn03k36N28R7m87J50J015R2p29M64P54k61r20
623d14R00R03j048m77J082M59j377R0J127k39j139l44J107q50r64M11P71o68o70
642a340R52P14r81m47P44N25r75j16R10O58q63K24R52J31m69l79P98J87q61RK53
663F26O5p41R4N98m72p45L77K84m71o90L58O78q01o49P93P56p21QP85K51k46j34
685CO84k1m58j62N03K28p5k38M14Nl19l01K19K46j051k02M63q9n08l25Q54o6r62
708a158K69O95k95n44M97P79l19o68N63R61m59n07Q30P06p44n96Q76K24r62l08
728a60P40J64q92k21N35J37q90j15M77j16o51j81J002L9j147K33J253l20n60M98
748a75O35j54p06O30P45q87l55Q73O61j052m17J104L13j400j15J156n39j240j
$$ y = [723, 296, -492, -283, 139, -423, -1175, -382, -378, -881, -1117, -589, -492, -979, -829, 186, 278, -451, 13, 767, 506, -414, 486, 1389, 341, -136, 946, 1405, 28, 118, 1245, 1006, -133, -477, 630, -220, -1184, -773, -2, -670, -1340, -388, 326, -655, -1102, -358, 167, -808, -924, -14, 644, -219, 5, 957, 1088, 619, 240, 1038, 1225, 364, 373, 626, 691, -50, 44, 642, 170, -575, -198, 86, -385, -1075, -717, -39, -840, -1489, -696, 60, -661, -653, 132, 383, 137, 3, 687, 666, 208, 46, 549, 777, 702, 464, 878, 883, 564, 263, 482, 728, -323, -525, -62, -151, -659, -984, -130, -196, -1158, -889, -194, -489, -1033, -536, 243, -76, -744, -181, 780, 321, -186, 644, 1350, 606, 10, 886, 1110, 148, -160, 580, 744, -148, -369, 166, 303, -587, -702, -225, -341, -992, -1173, -171, -132, -1279, -1046, 207, -113, -673, -175, 460, 306, -400, 230, 975, 88, -267, 606, 1267, 215, -202, 902, 1215, -185, -300, 856, 317, -923, -924]
767i24J311o34j065P06P85m27j042J019N10q36k76P03P00o75l55J093M97p84k12
786I4J270J6j157k31J216o08q62P0J255q33q82M92P89r97j050J065R62j462p35
805a588J221L09r07l11J297N98j060L3J042J8j270M44J353p83o08O60N30m15n83
824b0L13J210j301q72Q48K97j159n50J039O24j138k55R73o0j009J34J018j38n04
843e50j23J012J40j052N92Q94o02l68O33O41q33n71M26O83q32m09O92K26r49k72
863f22R94o1j366P5J049l83p29Q0J120l91l80P1R26p7p51O03K88j18o88R00M8
884E88k04l51N73L72p68m6N01M5j070r2N83j5j127J95O57N3m83QL78k8n55K39
906e47P70l70l12L61K47m9J47J90K34j74k71L74L3m64J22P5K62n98j90K68J3l74
$$ y = [-924, 387, -247, -1312, -606, 179, -248, -1290, -271, 239, -597, -873, -170, 530, -145, -500, 593, 1090, 306, 94, 1364, 1380, 223, -8, 1208, 600, -262, -192, 1063, 230, -652, -160, 629, -368, -1418, -353, 609, -853, -1588, -367, -58, -965, -1276, 21, 619, -441, -408, 634, 652, -618, -174, 1179, 396, -212, 448, 978, 563, -20, 293, 1503, 202, -670, 178, 475, -684, -1234, -195, 429, -709, -964, 9, -51, -1060, -926, 92, -46, -550, -673, 339, 479, -573, 19, 913, 311, -57, 576, 1217, 384, -187, 239, 922, 90, -319, 373, 599, -350, -622, 372, 311, -1055, -980, 69, -314, -1043, -963, 157, -234, -614, -543, 383, 306, -445, 158, 446, 328, -360, 540, 588, 384, 33, 606, 978, 210, 164, 665, 710, -360, -452, 131, 116, -1011, -816, -159, -106, -589, -581, -203, -231, -786, -547, 223, -147, -459, -98, 149, 100, 247, 437, 671, 497, 226, 600, 633, 169, 291, 366, 628, 30, -160, 108, 121, -253]
928b53O8J35j08l85j03K75l27j97L45L66L8n6p0M04lk22K32L85k90P7K52L00k87
951E76k07M50k91n83J43K49m94Q4m2j31Ok79J3L00k01j79K36m7L8N6k8L64j19
974h6k15K76L08K00k8J4J87j2l14l7Q6n0j39K4l49K1l3K56K6n14j53L39m67q3
998g43K27L11j43l16M10M4J45k89M41L51kl22J6J72J08O2k69M45k21r9KL0m21
1021f1n3J31j45k45o0K04j08k52J13L34k38j10N9L60k09j57K54M38J34l0j78L34
1043E15K15k60l95O72l60j04o6K21j68l27k4L91l67k57L69j22m24J15N0J49n01
1064f78j51O93K17k82j19O02P3m38M3N79l02l67K60N92l21j8j72L96q8m80l0M02
1086D11l58m32J04rK76m89K91J21l83N3J91J95m91L3L08O1l81L60O28j47j69N2
$$ y = [-253, -185, -50, -158, -543, -646, -371, -698, -895, -550, -184, -146, -202, -272, 132, 129, -93, 139, 524, 234, 311, 563, 863, 576, 369, 819, 528, -55, 88, 337, -157, -73, -115, -246, -240, -519, -506, -206, -407, -586, -350, -397, -359, -303, -331, 33, -86, -301, -25, 283, 483, 455, 469, 656, 644, 330, 293, 379, 329, 190, 214, -135, -114, -147, 109, 135, -379, -532, -193, -660, -743, -516, -205, -348, -664, -254, -210, -65, -354, 87, 438, 436, 114, 130, 302, 410, 472, 203, 648, 427, 328, 330, 360, -61, -114, 17, -128, -373, -433, -229, -337, -589, -476, -142, -380, -490, -431, -71, -280, -437, -183, 255, 389, 359, 181, 515, 730, 470, 75, 747, 387, 283, 217, 438, 270, -57, -81, 310, -57, -314, 55, -67, -491, -376, -326, -177, -678, -829, -136, 81, -201, -320, 282, 355, -83, -40, 539, 237, -130, 130, 722, 401, 383, 211, 607, 519, 39, 9, 411, 53, -379, -275, -284, -8, -497, -206, -85, -468, -415, -224, -29, -520, -487, -179, -118, -499, -139, 489, 342, 173, 225]
1108B25O84m44l98K01L44j25n96J42N85l40l61J25L28k78l40M8L57p80j33M92
1128b64j42p1r2Q46j11j28l95P63l03k27m4O42k00l20L02O22l50m38R7M63l02
1149C48o36N44j95l62k90L08K61l93k19L28J89k31k51K16M81o35J06L19O7j5J57
1170I7M75k93J46K96j49j64k4p2K79l91p0j03J31j38k9l5R3n69J32L51o4l99j69
1193f69K96N1j29J13K07J3j02K68J01k38O5J30K41j31l4L49K10m41j93J23N9k97
1215ho28N30J06l06Q3J09R6k15m0q3L96o70M16J17j44j24J91K06J91k21N24k09
1237C17j81R8J41J29l83j65J74l8j29J59J51l75k10Q4K63Rn05L0J90n1l85K04
1259d73L23Pj29M08j6k65O6J97J57o0j75L23K14l13k51N29j94l37J50R4j11m49
$$ y = [225, 909, 465, 67, 268, 612, 487, -109, 33, 618, 278, -83, 42, 370, 92, -248, -200, 157, -623, -756, -264, -406, -477, -569, 277, 166, 38, -357, 406, 103, -124, -168, 474, 274, -46, 256, 878, 528, 90, 187, 650, 348, -288, 256, 61, -301, -591, -283, -22, -415, -634, -306, -117, -348, -599, -383, 98, -537, -431, -112, -45, -60, 97, 572, 279, 425, 721, 572, 408, 384, 312, 591, 200, 130, 27, 158, 20, -9, -44, 49, -520, -388, -37, -101, -500, -669, -373, -322, -451, -338, -131, -118, -220, 48, 149, -89, -24, 106, 347, 216, 182, 531, 741, 300, 107, 230, 289, -8, -636, -106, 0, -306, -223, -114, -18, -233, -273, -356, 40, -630, -214, -97, -241, -365, -174, 32, 223, 2, 526, 317, 136, 234, 375, 504, 121, -44, 130, 92, -37, 122, 273, -102, -312, -228, 35, 44, -461, -431, -241, -292, -677, -473, -150, -143, -272, 136, 120, -145, -79, 118, 275, 215, 40, 363, 577, 264, 13, 542, 348, 11, 161, 255, 144, -305]
1281c05Q5L7j29k14L72J48j07l51N2R3J01k92J94L74j01j81L64K25k41j45K83
1302B62L47k78j12L90j93n80L99K07j63l39q0K90j57k48R1M9j97K5l23O57m46
1323c99k1K35L35n9m38L17L25m28K8L67Q4j40p3n4M47j56l46L83k98j78l7j10
1345b16K88m66J26L38j83J3j80K73j71k52P9M25k95j12J84J46M0K1J86J8L0J5
1367C07N2o3j44O4j27J34J44k63n3K73m66J68j00j16j37o7K10j75k87M76q0lJ61
1390i2J34l7k1q0J15L18k36j56p4M85J07k07k3O1m3K30o07J26P0j83N6k92K83
1413f6k70P4K25l58L02j71q6m5K9J44r5P1J13L78j26K77k55J48k24J89j93N6Q8
1436B05r8J10k8J00j33q5J17l48O9R8k11J49n57L09j16O43l57k2n9L68k82J55
$$ y = [-305, -220, -183, -312, -526, -154, -6, -113, -464, -412, -319, -218, -510, -316, 58, -43, -224, 140, 365, 124, -21, 262, 609, 331, 219, 609, 416, -164, 235, 442, 279, -60, -140, 150, -7, -255, -164, -115, -312, -287, -610, 47, -399, -420, -185, 150, 91, -347, -30, 295, -133, -105, 262, 346, 206, 133, 79, 526, 370, 24, 407, 109, -69, -106, -216, 72, -394, -268, 70, -113, -100, -280, -7, -178, -430, -351, 74, -221, -333, -149, -3, 37, 58, 244, 262, 292, 307, 359, 296, 152, 216, 89, 223, 367, 104, 51, 324, -142, 26, -74, -190, -327, -394, -184, -359, -646, -170, -250, -253, -92, 42, 5, -16, -96, 19, 337, 101, -55, -129, 356, 463, 256, 233, 294, 251, 481, -126, 0, 70, -113, -57, -349, -66, -336, -262, -37, -395, -93, -264, -350, -395, -366, -222, -317, -246, -133, 245, 119, 396, 141, 289, 65, 254, 61, 117, 205, 107, 217, 189, 289, 156, 71, 188, -160, -91, 7, -204, -55, -612, -303, -419, 224, -133, -155, -214, 154, -128, 27]
1458B7j76K35Q1n5m5L57J74m74L78j76k45j9K55p0j44J4L4l21J12J4J51m11j94
1481d98K09J94l55q6M5L02J40j49P8K48q5K75m30L73Q5k75K24L29o33O1J75k15
1503A2R9K7J68k25j00Qj34j36R0j99J60j50J40L3J27j73M1k6K83m7j46Q0J79r8
1527A3L0L51Mj17j98J03O9j18J9q9k03N4L33j99k66N9k79J64J04l18J13Q9r6j33
1551e11K72k5L3J68l1M51J10n21L56J03l64L1J37p8L9L9j70J46o5q0k8J41l16
1574a63k44K01L47p09K53K41k46J97L2J79j16j6N5l0q7M2L8L46j66J22K98o4m14
1597I6J14M0Q0M8n47L19j70k11jK27K1j26j00M2p6p6P0o1p4j53P52R2k42Q1Q1
1622B26K16l04m2M0K84m10L8K88N9k53M4l9j23L6j82Q9j31j08j1J55n8j05q5K08
$$ y = [27, -149, 86, 167, 112, 67, 424, 598, 124, 502, 326, 81, 62, 317, 247, 103, 117, 151, -170, -58, -44, 107, -304, -498, -289, -95, -450, -536, -491, -189, -49, -198, -120, 128, 43, 318, -112, 261, 346, 71, 295, 624, -9, 52, 227, 12, 111, 138, 306, 81, -19, -11, -145, -281, -191, -390, -230, -380, -240, -207, -80, -253, -212, -238, 45, -2, -148, -68, 111, 13, 43, 394, 398, 281, 83, 186, 255, 137, 156, 67, -136, -82, 251, 52, -214, -155, -434, -270, -166, -484, -371, -282, -378, -511, -239, -264, -231, -63, -94, 357, 467, -54, 302, 405, 41, 72, 209, 131, 170, 209, 39, 185, 120, 40, 12, 153, -163, -407, -206, 141, -568, -315, -74, -320, -123, -91, 88, -28, -44, 11, -19, -106, -64, -26, 320, 154, 276, 574, 510, 96, 210, 250, 330, 378, -169, 150, -20, -231, -232, -5, 16, -110, -210, -168, -244, -320, -250, -311, -385, -538, 214, 306, 64, 145, 226, 442, 138, 96, 136, 420, 10, 48, 336, 395, 142, 186, 147, 24, 60, -122, -33, -164, -272, -283, -128, -186, -291, -376, -168]
1646a68K98j30k6k14K97m7J05Q6L8j40K26r9n8L52m72L06k70P3O3k93L5L8J62
1669A62k45n1N5M6l87J80P1K78l53J62j23K2K18j7J17K18l80o2J89k9j86O9N10
1692D64l17k3l6K51l2k65p7K08j76r0J0j84j36RK34J19k22J65J12q2j51J94p1
1715i6L60k69o3J33j44N2N04l18J07j84K10K5k57kj08j0k00J66k3L00j0k56j50
1738b33r4N7J27l51L26p4J2J39NJ32o2K08o4j21J19J56J5j37o5M2m2k04L64L3
1762B88k69J70j7n9k69O8L9m4k75J02LL58r2n5J7o9K12k87J27K67k48L07J63l06
1786A31O5J45M9j5k66j23J61m8j84O0j53J77K7K48l88k36J66O5J2j52P1L6J76
1809B4m9pJ46j45K34p1m6j5K06J24j6j29m0j58J89k12k12M21j05j62N4j06j58
$$ y = [-168, 130, 0, -26, -240, 57, 10, 115, 201, 239, 99, 325, 226, 168, 520, 48, 354, 84, 157, 220, -73, -38, 0, 162, -83, -134, -79, -33, -420, -240, -169, 109, -244, -82, -205, -183, 35, 18, 135, 353, -27, -89, 100, 71, -115, -46, 464, 147, 124, 88, 339, 307, 42, -35, 173, -3, -93, -83, -267, -403, -394, -160, -41, -263, -98, 14, -68, -219, -25, -96, 264, -5, -68, 65, -79, -27, 477, 159, 266, 82, 292, 317, 60, 58, -50, -60, -260, -94, -117, 183, 173, -83, -233, -327, -270, -143, -494, -168, -242, -230, -91, -86, 46, -16, 192, 128, 7, 126, 282, 297, 160, 95, 137, 95, -109, 255, 288, 19, 189, 172, 113, -156, -88, -49, -93, -368, -266, -263, 95, 3, -52, -35, -104, 108, -179, -52, 215, -33, 274, 437, 131, 196, 341, 390, 375, 109, -14, 147, 99, -85, -25, -178, -1, 26, 274, -114, -350, -184, -119, -107, -259, -188, -152, 24, -25, -32, 114, -31, 203, 132, 86, 71, 277, 401, 385, 256, 216, 58, 247, 35, -177, 244, 139, -23, 31, -75, -233]
1832b33J12q7J18m5r7J13J49j70k7L08k84JQ8k59Q4K65k0K56j71J88k42K7J50
1855B24J41n32K85o4m8K6m8j1r1K12l00K82R3n22O2J29m21L49N5J96j34J26K79
1878B88l20K04j16N6L0M6l0J70l56K72M4Lk42n4M17o7m05O1j65K59n22J93Q2P9
1902g3n8J6j60J01j54K68M4J94k14J4K11r3j72J22J18k9j05P0J19j08J6j01K03
1925B29m82J85j93J86o6J60j4j7k21o9Q7P9NR7l4j53K65j60J02K6J14P2j42m8
1949HL8J8M3N0L5j53k4L4j79lk62J99K53j6k57j00J41J23r2PJ31k84J96n6L7J06
1975gJ44J17j49N2jj13J9j51L34j05p8m8J97r5qJ2k00r3n0n1J05ll94M92j11o7
2001b52p8J41J79m28L56K15k8j11K39k16J28pN8j17m6K37k71K2K6p6K10j64L2
$$ y = [-233, -121, -208, -90, -135, -232, -119, 30, -140, -167, 141, -143, -142, -54, -313, -229, 36, 16, 272, 101, 289, 47, 74, 224, 365, -167, 118, 54, 6, 32, -16, -27, -118, 94, -206, 76, 169, -353, -291, -162, -583, -234, -179, 17, -117, 9, 288, -32, 172, 56, 112, 142, 188, 158, 328, -28, 244, 288, 291, 49, -5, 412, 345, -60, 1, -164, 95, -427, -234, -152, -73, -131, -115, -275, -174, -328, -60, -16, 178, -36, -22, 189, 96, -76, 46, 164, 135, 30, 100, 219, 111, 127, 26, 229, -253, -68, -261, -75, -141, 19, 5, -12, -233, -302, -215, -136, -131, -34, -68, -221, 44, -116, -14, 12, 126, 198, 56, 8, 46, 64, 107, 157, 192, 39, 15, 49, -130, -133, -395, -196, 57, 41, -216, -316, -175, -52, -144, -137, -6, -290, -94, -150, -113, -7, 137, 254, 105, 157, 156, 43, 62, -89, 245, 140, 62, 14, 211, 116, 108, 120, -80, -173, -223, -274, -169, -172, -566, -74, -185, -252, -330, -189, -10, -438, -82, 133, 105, -6, 233, 17, 145, 138, 196, 79, 33, 270, -1, 21, 47, -29, 181, 17, 49]
2024D9j77J59l50k8J21K71o14O40j50k68r8M11j16J38n4j19N79k36k74L4L24j90
2046E2R2l7m5o2J08J03j9m55J27K9K11j27N6k21J41l32K6K60j39J19j13R4m1J29
2070d4lK37l1j43J65J36j26k70R4L21j42j61K20j84Q0k3l05P3K09k42j08J81k3
2093h9K8K34k75j76J66j0k46J89L6J79J36J0j94K01l62L26J34k20M8K21n6j45
2115A35j61k09N32k62p5P7j8j85j34J0M9L8P5j56P7O5K1K2j4K26j28j1j2MK25
2140A91p4k88J81L02j51J22k57RJ63j60P6K3k00r7r1J15J45j60J3J96n9k20O6
2163a55k30K89J24k67L1K56J38l39L49j2j19J28J7J29n52K97J44k33J0J83l98
2184b10K75r7j93L12r0r3J28k38J76p8O7J54r3j04J42L5l17K88j19K06j37R0J7
$$ y = [49, -128, 31, -319, -347, -226, 45, -569, 71, -79, -347, -445, -34, -150, -12, -66, -185, 394, 158, -116, -82, 242, 52, 144, 107, 62, 0, 108, 211, 192, -263, -136, -107, 104, -23, 33, -188, -47, -379, -353, -93, -232, -113, -226, -132, -173, -44, -47, 190, 159, 16, 181, 317, 191, -79, 15, 336, 194, 33, 253, 69, 149, 126, -179, -106, 103, -139, -247, -66, -89, -61, 173, -102, -278, -112, -122, -368, -179, -143, 36, 172, 182, -12, 189, -173, 153, 287, 67, 115, 336, 280, 135, -26, -235, 297, 35, -40, 37, 19, -166, -300, -290, -241, -203, -128, -284, -207, -142, -121, -99, -113, 113, -15, -26, -38, -34, 191, 117, -171, 10, 312, 161, 283, 26, 35, 198, 38, 114, 137, -63, -160, -251, -136, 9, -151, -138, 58, -1, -221, -155, -385, -96, 28, -239, -208, 48, 186, -153, 196, 184, 65, 193, 210, 339, -213, 84, 228, -5, 5, 188, -210, 65, -32, -225, 87, -3, -96, 32, -206, -30, -108, -41, 113, 20, -84, 58, 93, -224, 64, -55, 151, 14, 104, 121]
2207A21k01L75l57J90R8J39j73k37J45o9k4J8L11m37j26L35l35NM6l4R4J93L0
2230A07P9j03k35J97PJ66j51KJ69l1j69M77m62K49m48M10r9j88K47K4l80j29J42
2253a19o0K00k21o6j40J46J13L3K13L6l01K6K79q2p9K52r6j9k82K72j45J83j82
2276c9J19K86r8k17PL8J4k06pN6Nj16J32L4l61MJ68J68j7K59j85p6L3Q3l46M80
2302B18j62nK27K7r2j82N3j09K63k78J63l90M00l15M81m04J01l58J9l1M19l31
2324b86N03m91L60j64O8P7P4r0j10M9R6N8j01Q0n0K56p9l46K45j15L4lP9p6k16
2349a48Q5N4r0J68p4j1l26L38j59J6K16k05L93l32J8J20J08j75J09J69k98p8K63
2372A61K0k89R5O5R2l1k26M9Jj58Q1N63k80k72Q1j05M4n7J31o7n2L12k07L7j13
$$ y = [121, -80, 295, -62, 128, 226, 365, 192, -45, 100, 31, 7, 25, 336, -101, -227, 108, -227, -222, -176, -210, -116, 77, 107, 186, 83, -152, 45, 52, 218, 67, 69, 238, 207, 38, 515, 53, 302, -146, 264, 165, -23, 224, 248, -132, -261, -119, -179, 21, -200, -266, -406, -260, -147, -114, 99, 135, -166, -140, 139, 57, -22, 230, 134, 115, -167, 105, -40, 143, -39, 80, 366, 268, 51, 58, 96, 110, -96, -103, -47, -42, -158, -26, 8, -353, -349, -181, -13, -30, 229, 44, -32, 1, 84, -262, 218, 56, 51, 278, 305, 213, 31, 84, -25, 238, -40, 123, -267, 133, -182, 299, -105, -4, -362, -343, -374, 45, -286, 217, -274, 86, -78, -10, 67, 141, 51, -59, -10, 86, 144, 43, 123, 73, 329, 250, -96, 149, 34, 68, 65, 144, 68, -148, -63, -9, -99, 69, -5, -16, -342, -4, -163, -147, 69, -136, 257, -75, -57, 63, 171, -4, 105, 274, -24, -102, 161, 181, -108, -13, 52, 144, 113, -113, -64, -63, -221, -140, 423, 143, -129, -48, -153, -109, -166, -35, -102, -154, 158, -49, -12, -125]
2397a25M24k90R9l97L98n2J05j40J75J37n47K33Q8k50RJ85m2j20o3J31K21k15
2419c6P2m2J99j87q4J75l34J62r1L90nj79Q5p4j08J86j1m4L1K3k55M26l04M1p5
2444c9Q3j93Q3j7L8Mp0J14o5J69k90J47P9K6m3R4R7k91J28N9o5o4K14K6j55m1
2470B8J36L7k86L5M5l24J32J22P0P3j53k5J76j51Q2j9n1N7l33K65j79N53j81q1
2494B8m2L59l17j1k2J44k97L24l36J44K09m0k21Q9j1L4R1k16l2k01J10m1J15j17
2518b57K65Q1R6k23R6j74N7J48L3l8K20l48L11k87j7J53j71J09J32j8k29k67K59
2541f9j93J52k3J48M3j28k1K47j38j56o2PL05j92J64l20K93O5R3r9o3JJ9J25k42
2566d4N1j73K57r9L9l7j52J10j0J37l1p7J05n38K23K92k88K25P7J5k26M5K3M0
$$ y = [-125, 299, 9, 108, -289, 109, 57, 162, 22, 197, 334, -213, 20, 108, -142, -133, 52, 10, -110, -173, -42, 179, -36, 36, -6, 193, 6, -78, 97, -237, -75, -166, 224, 219, 40, 125, 51, -57, 129, 118, 74, 105, 128, -127, 299, -5, 36, -39, 44, -149, -66, -83, -45, -41, -111, 3, -62, 107, -183, -36, 43, 69, 26, 120, 217, -74, 54, 113, 48, -16, 198, 224, 69, 28, 164, 201, -85, -50, -5, -329, -197, -75, -5, 68, -85, -110, 66, -85, -3, -22, -73, -16, -349, -84, -263, 290, 109, 28, -14, 345, 28, 17, -5, 139, -158, 166, -170, -26, 183, 143, -78, 11, 0, 34, 125, -91, -123, -324, -214, -255, -140, -257, 8, 89, 185, -38, 58, -116, -59, 89, 122, 84, 304, -44, 267, -20, -37, 116, -55, 54, 186, 168, -61, -328, -69, -262, -110, -133, 15, 58, -70, -91, 156, 18, -138, -200, -193, 112, -80, 84, -236, 57, 122, 215, 116, 53, 54, 73, 198, -44, 7, -166, 91, -8, 31, -6, -158, -48, -58, 79, 48, -29, 76, -462, -239, 53, -235, -10, 67, 82, -144, -99, -76, -36]
2590c6K32qk29N0K05m91K38Q1Jp6L26r4k50J05R0m07J84j87K84j47J86j38m9J4
2614a16K06k93P2J91j42L6O9m6J4J38j88J83k20L21j04j6K24l16J21j46Q5k05
2636a32J95q1m69J86L41K97m12q5K62q4m02M30J3p1P2r9K0L3k87L63J87k15J73
2659B35k34J51J19k90J74o1m3j21O4K58j12k72n6K40J5j82o3J35n6J25k47J49
2681g2L08k35J96k94O6J13k52K77k66K82p3J70j67n8J49l6l7j69J31P3j80J02
2703B8R6k85M1J95k69R8l0K86j2m69o9K00K38k85J67K76m8m62N23k00N0j13L2
2726a2J91k64L4K01k2j36J53k10p3K46j44j73L88l9j98J50j46j36J75m9P3k78
2748b69K32M1J36R3n18K92m7J15P8k00K54j81j05j36L13k22J56n2L06k00Mq7J08
$$ y = [-36, 196, 188, -41, 9, 214, -277, -39, 42, 43, -33, 293, 199, -51, 54, 144, -263, -79, -266, 18, -129, 57, -81, -130, -116, 90, -203, -131, 60, -82, -46, 23, -23, -9, 129, -59, 124, -96, 225, 121, 105, 329, 13, 134, -12, 73, -132, 63, -18, -487, -301, 40, 337, -75, -160, 102, 18, -384, 46, 59, -12, 60, -39, -19, 14, -273, 90, 277, 62, 235, 1, 152, 271, -19, 155, 94, 51, -70, -6, 252, 140, -132, -188, 52, 67, -115, -178, -43, -99, 26, -221, -72, 236, 1, 197, -97, -31, 82, -170, 107, -159, 123, 50, 220, 53, -5, 144, 108, 71, -98, 33, 106, -74, 28, 124, -161, -120, 75, -194, -96, -126, 160, 148, -321, -390, -190, 48, -237, -70, 206, 158, -304, 219, 19, 69, -44, -12, 179, -85, -51, 150, 128, -8, 145, -65, -138, 108, -36, -209, 179, 140, -58, 92, -54, -190, -15, -64, 9, -269, -37, 4, 140, 233, -285, 7, -40, 75, 153, -47, 207, 26, -79, -215, 98, -124, 32, -20, 286, 86, 90, 3, 111]
2771A11m94K94k26L08K04j04m9j02N3p1j47K98L06k06j03J52j92k0j68M08o0k51
2793e9O1L80n11r4M70k45k94K01n5K69j68j59N2R2L04k09j6j00l8j54K94J77j89
2816Ij25L33L1k43J48p8kN4J64k21j73J2L87k37O9l37J95k15K59M6k88K36n9J87
2840A52l55K37O7L69n52O1L52l40J45Q7j72K3m0J34l21K53J00M2k65J8K95n4k36
2863@P2J6k09R6j01L88l02l4n5K8q0l1j19K32N3K40j88J26j2O6j8o8J34r2l8p3
2889C1J84k51l6K1K41o0L5j58K62k62j38k4J75Pl76L89j02K1Jr4J04k46K97n5
2913c4n7K1J84j05o7J91O2k69qJ54l7j67L30j73k50N2R2K07M8m15K62k79j9L91
2937A14J69k62j94J75J40p2K5j55J41J9l0jk31L04m7O9j07m0j34J7L5p8K04j73
$$ y = [111, -383, -89, -315, -7, 197, 93, 44, -58, -5, -76, -223, 75, 381, 175, 72, 224, 32, 12, -156, 252, 192, -59, 2, 382, -129, -223, 247, 2, -292, -91, -146, 123, -45, -204, -152, -60, 244, 35, 19, -81, -119, -273, 21, 198, 9, -116, 217, 248, 5, 153, 75, 73, 127, 291, 70, -103, -91, 296, 59, 128, -209, -14, -229, 30, 76, -212, 24, -35, 152, -203, 34, 101, 470, -82, -21, 331, -9, 136, 223, 51, 74, 34, 168, -153, 100, 200, 242, -23, -5, 290, 236, 0, 72, 88, -121, -25, -126, 262, -40, -74, -129, -101, -181, -212, -331, -99, -46, 194, 6, 132, 120, 186, 168, 100, 234, 142, 104, 31, 215, -36, -72, -51, 190, 130, 165, 7, 269, 7, -131, -155, 20, 27, -349, 40, -62, -41, -40, -134, -30, -276, 21, -34, -91, -70, 114, 9, -58, 133, 195, -74, -82, 72, 35, -132, 198, 25, -225, -173, -81, 126, 174, -241, 21, -258, -277, 114, 283, 21, -173, 2, 142, 70, 95, -60, 81, 100, 70, 69, -162, 142, 95, 164, 57, 17, -117, -100, -65, -143, 61, -112]
2961a12O7j05J24J54k97K13k37K66R2k77L14l60J87M3m7J11k50P4J94J8k27J56
2983A01J28k28N3J22j38j82Q5q3L46l52J93j30J11K66m38K0K23j61J01j51J12
3004bk65J75L1l2K8J8k8K81q2j33r2m3N3J22j9k64L48o9j80J52NMl3J81j93N4
3030A7j82J24m2k39K40m4J65l39L09J09n41M62j07o8J29r5L8J08N6n1M3Q6J4j83
3054ILJ09j54o0J74m8K07j33j48R0L6l1J16k16O9j29K39n9R3k9K1k58K79k05m4
3079f9P8N8J27k44l2R0j34J93J05m0k00L16n12L43J14K8k0m47K03M4l1J46Rr9
3103B6q1p6M2M7O3J19o3L5q9m91P94j68l44K69J66r5k36J5J80k79J36P8j60L38
3127B26j97O3oj30j95L71l23J89n8oj5J46k41J61J62j68L8J5J24j02j37RJ48L7
$$ y = [-112, -45, -150, -26, 128, -169, 44, -193, 73, 165, -112, 202, -158, 29, 72, 25, 136, -114, -40, 154, 172, -55, 101, 229, 1, 54, 176, 38, -144, -59, -142, 204, -148, 45, -85, 26, 292, -146, -126, 97, -64, 37, -114, -2, -267, -92, -61, -93, -65, -47, -75, 206, 124, -9, -101, -144, -91, 31, 12, -252, 96, 27, -153, -1, 4, 8, -25, 156, -37, 17, -165, -41, -83, -322, -82, -126, 39, -300, 9, 118, -423, 39, -68, -136, -7, -102, -64, 44, 100, 49, 92, 178, 192, 9, 12, 121, -33, -93, 81, 33, 240, 107, -41, 49, 85, 54, 170, -46, 23, -106, 133, 74, 167, 138, 159, -99, 180, -25, -69, 9, 67, 194, -50, -82, 8, -126, 67, 172, 132, -68, 248, -264, 79, 193, 221, 201, -246, -43, 1, -30, 116, 125, 26, -55, -131, -89, -42, 21, 140, 77, 112, 23, -468, 326, 158, -186, 83, 249, 154, -82, -67, 113, -166, -30, 48, -112, 226, 29, 92, 86, -44, -239, 132, -191, -2, -60, -66, -81, 65, -176, -15, 147, -21, 17, 32, 156, 54, -83, -74, 74, 111]
3151A11L5j12k71J2M65k96k60L66j62J10M9j03J60j49l04K22M6kM2oo2j9L31j41
3175F2mK5j09r7m4J03k29L48K01j53m5n2o9J72K6j09J57l27M39l02l7Q9j30m0
3199a25Q2j14N2J05k73J57J40l8J85j13p2L7k14N8N2J62j25m8K01j12J1J24k59
3222a27m2K2P5l1L1M9K70m39J14J7L4N4j13J44j67K50k63K7J16N3k10J33j26O4
3246f5Q1j97L22j96n7R0n6q4K25K3j35QJ40K00k56j21m8J38J59j80R0n9O3j69
3270h4L6J46p4r1Q7Q9j55J2J56p1r0K30j74N0N0m0m3j85J30j17J41J16j89P5j8
3295a3m3M3o0J81j46O7o3J77J43l71J87l13L41n5k21J62o4K70n4j47n5P5N0J18
3319B09n62J25K43kj58J39J58q2j13J4J40j04%n6r9J98j2k14K05NN7j81j47P4
$$ y = [111, 146, 34, -237, -225, 240, -56, -316, 50, -112, -2, 47, -56, 104, -45, -349, -127, -81, -83, -41, -47, -109, -128, 203, 62, 58, 83, -26, -123, -167, -64, -293, 55, 256, 103, 58, 6, -63, 109, 135, 26, 183, -144, 295, -7, -44, 45, -85, -125, -43, -157, -105, 0, -273, -116, 24, -14, 171, 58, -14, 23, -191, -133, -81, 81, -44, -92, 109, -3, 8, 132, -127, -169, -147, -72, -103, -72, -23, 247, -192, -78, -61, -27, 27, -86, 58, -109, 141, -122, -95, 21, 74, -136, -3, -129, -65, 16, -181, 141, -55, -112, -22, -78, -162, 63, 86, -49, -41, 99, 299, 43, -78, -126, 12, 171, -9, 81, 22, 85, -84, -48, 98, 24, -67, 20, 109, -46, -34, 122, 51, -39, 191, 17, 67, 117, 77, 34, -151, -21, -138, 3, 119, -70, 5, -13, -56, -13, -73, 108, -38, 29, -34, 143, 286, -85, 102, -211, 130, 75, -146, 16, -48, 222, 168, 21, -34, 41, 91, 209, -353, -228, 15, 13, -145, -6, 152, 70, -43, -29, 111, 7, 7, -49, -148, 50, 38, -176, 29, 34, 91, -90, -237, -163]
3343a63R8L0J06J85j05K8o1K4j79JK29Kj61R3j75L6J03n2Q9N2k33K17kj96K68
3368B34l20J06N0j77J58p0L5r3k34N25J02m77J16kQ3j47J2J11M1j20j56K69m3
3391Cp9K7J9p2L8K13j49J14NQ3q6J5%p4K3J30k45J52o8o9j51J50m6j72M14k28
3417e3J13m1K6k41K85j14k38O1K50k13L50k15l4N5L9J23k1j74L3r2J76M7j02j44
3441a24N1m5K46M3j63J09j20m4l3j01J87m4P3k34J29J63j68R0k14K56P2j17j57
3464a45M1J22j36M9O3Q9j4l0J37j42J47j22n6L2J3r5l0J59l1kn1Jj36J55r6K4
3490e4J82R5k26K32j34j4j5k26L08k31M3l8J05J9L19j54j59r3J77l48J34K1j73
3513b30J99J1L8m81M96j8m6Q8k17q5K86k53j1L65l3o3j48R6R3j49K06q6J10j84
$$ y = [-163, -65, -35, 71, 256, 151, 179, 118, 142, -37, -36, 193, 195, 34, 127, -48, -12, 91, 39, 128, 180, -53, 164, 162, -34, 234, -86, 20, 70, -107, 51, -19, 16, -77, -311, 214, 316, -161, -45, -47, 36, -111, -99, 12, 53, -67, -223, 46, 3, -76, -49, -30, -102, -64, 149, 0, 114, 119, 202, 116, 131, 131, 57, 80, 210, -35, 117, 49, -20, -171, -21, -67, -239, 175, -53, 60, 19, 45, -196, 89, -25, -263, -202, 48, -165, 185, -30, -64, -9, 30, 153, 132, -42, -9, -101, 75, 122, 20, -124, -73, -118, 128, 171, 8, 117, -3, -47, -80, -181, 6, -38, 35, -199, -70, 93, -75, 15, -199, 57, 129, 12, -145, -104, 18, -118, -69, -6, 83, 69, 39, 176, 34, 181, 59, 3, 35, 48, -47, -77, 82, 51, 49, -2, -1, -137, 18, -78, -54, 128, 223, -3, 229, 95, 81, 66, -160, 148, -83, -40, -78, 27, 46, 365, 211, 52, -41, 136, -212, -78, -57, -230, -31, -20, 18, -463, 33, 15, -31, 57, -160, -245, 41, -212, -223, 142, 109, 46, -102, -6, 87, -62, 144, 58, 168, -16]
3537a6k8J50j85Q9q8J45L0k00K85l97K90k31K40K7j66j2k38L59Q0j89k09L71k80
3560a73O2J64O2k36O0Ro8K49j24j66NJ48k04K82J79k98j35O1J34J11j44J9m1N0
3584FJ38l01j1J52k28K25K39m0l9k84J66K9j46lJ73J9j13P5r7k33L16L6q4J2J66
3609A73k6l7m4q3J66k81K3K07n4P3k51l5J29L7N8q7K49J2k25J75k9l90K89J41
3633A90l73KL48k42j92K45J50r7j15J61j63o3J58l2M2nq3j49L62j02k4k29N10
3656B99m07J27R9k1j60j9L98l21j21J97J01j6k27j36L53l76L91j76J19k99Q3n0
3678a62jK5j3j40K25P3M4Mk23J87k03K01J67j26oJ55j49j2j4L61j93j66J02p1
3702F5j53K7L1J45l2R1p2k61Q3J18l06K94N5o4p9O3o9J2N3RO8r8M0L81n83K03
$$ y = [-16, -44, 106, -79, 10, -78, 67, 97, -103, 182, -215, 75, -156, 84, 111, -55, -67, -305, 54, 134, -55, -264, 107, -173, -111, 53, 115, -121, -61, -52, -120, 129, 5, -161, -156, -8, -212, 70, 249, -49, -184, -123, 11, 122, -22, -3, -44, 6, 144, -157, -168, -16, -244, -19, 220, 180, 141, -143, 23, 52, -94, -97, 76, 95, -18, 57, -40, -273, 43, 79, -5, 7, 173, 147, 110, 66, -17, 149, -132, -109, 98, 44, 117, -134, -169, -40, -3, 55, -32, 217, 229, 4, 179, 150, -240, 49, 190, -183, -181, 167, -75, -267, -22, 128, 31, -84, 77, -86, -149, 9, -23, 19, 14, -69, -218, 144, 42, 18, -211, 299, -108, 19, 118, 97, -63, -82, 316, -5, -126, 71, 172, 156, -71, -207, 146, -230, 161, -15, 104, -195, -112, -162, -163, -138, -151, -291, -66, 7, 51, 55, -168, 19, -184, 17, 184, 58, 52, 207, 58, 46, 32, 393, 200, 34, 136, 65, -88, -61, -30, 115, 83, 174, 102, -159, -76, 42, -264, 30, 85, 21, -58, 5, -64, -52, 1, 10, 78, -20, 20, 401, -182, 21]
3728B1J74k00M6j00K62k86J4J31k9k4j21j5j81N48l59L0p6l3K23r4K68l68r8L13
3752D6k41l6L48q0j45K1J5J74j95j1l7L0j6K5J24k8J75j56L0k26Q9KJ07k98K09
3777g4p2P0L8K25j37M9j24K05k55J5N7J40j48L4J8J49j80K79l04r0J08R8j49n3
3801a01Q7K16P5l60J32l46L36m2k2PK54k57l6K31l17J24J20lr8J96l26J85k49
3824a94P1J78r7l8K9J36J31k66J35j60K32p7q5o3R2N2N6j75k34K61R6o1l3J5j92
3849a91M07k20R6j27P7N9k73n0K39k9j84J32L68m52l3K61o7J75M6j45m7r2L3%
3873a7J84m43K05j55L66j09o0N8k76K23oJ27k54M39k23rK05j18k71l1J67r6m5
3896a39O6K40j72K4O4l08K6j78L98k00J13J51O2l5l08K09m9J36k16J51k7l8J80
$$ y = [21, 195, -5, 41, -59, 203, -83, -69, 62, 33, 9, -112, -127, -308, 240, -119, -89, -165, -198, 25, -69, 199, -169, -267, 46, -195, -231, 117, 37, -108, -87, -72, 102, -93, -104, -141, -111, -127, -102, 22, -6, 169, 13, 43, -183, -94, -92, 15, -283, -74, -146, -76, -38, 187, 50, 99, -25, 180, -75, -60, -3, 137, -11, 23, 41, 190, 10, 289, -15, -105, 3, 101, -48, -101, -14, 202, 277, -83, 49, -297, 39, -3, -25, -18, 236, -21, -57, 174, -143, -19, 101, 98, 0, 196, -130, 55, -194, -123, 55, -42, -80, -51, 85, 216, -50, 85, -75, 157, 80, -5, -68, 24, 76, 132, -43, -277, -16, 80, 19, -14, 1, -191, 216, -4, 92, -35, 42, 101, -172, -222, 17, -12, -196, -64, 304, -148, -181, 80, 13, 188, 234, 89, 42, -50, -17, -17, 167, -276, -71, -226, 140, 31, -29, 29, -247, -24, -30, 97, -157, 282, 59, 50, 255, 137, -134, -165, 2, -94, -139, -73, 167, -5, 19, 83, -225, -199, -377, 21, -179, -66, 85, 147, 112, -196, 13, -36, 100, -116, 35, 8, -30, 150]
3919A50k4o6k22J22k6P1p9o1P0J14j07k9K88k80J82N5l14J02qK57n68L57m6J03
3943D1m0n4k7K28q2R2j20l25L16K59m54J34J39M48m71m98L53q6P4n6L04R8l24
3966e1R1m9m0l2K87k38M4j2j59j08J96R5m1Q9j07J03j03N6J34rn6l4R8j27l9m7
3992e9r9K72j20J6j55j0K79J46n83N48r3q8oJ8j62J20k5J35k41j29M57j07J5l91
4016b62J70J97q7op1M9%kJ13j17Q2j37R7j24Q6P2m3r2j10K15J88j97P2q8J99j88
4042A6p9k69N53o3l34N2L05l10J58j85J4o7M8J78m1R5Nl0k98K36k5j70J44O6j80
4067a81K32N4j67K59k31L8M2q8J77p4k13j04L27j72J05J77j70p4J54K16j49l54
4089a96O0K01m28L17P6j13K14k36J82L7K10l07l9J58j76J82k63J43m4J88j70P0
$$ y = [150, 126, 60, -162, -40, -66, 5, -74, -135, -65, 49, -58, -87, 201, -79, 103, 158, -156, -54, -62, 195, -373, -16, -62, 41, 1, -53, -80, 148, 66, 158, 38, -287, 29, 288, -166, -32, 107, 555, 84, -414, -61, -147, -73, -129, 175, 273, -51, 40, -9, -49, -81, 206, -32, 12, 0, -159, -267, -71, 24, -17, 72, -35, 68, -35, 21, 155, 146, 90, 56, 154, 27, -12, -59, -158, 114, -6, 10, -145, -155, 124, 270, -313, 235, 142, 54, 48, 66, -96, 24, -1, 134, -107, -236, 221, 114, 129, -262, -92, 105, 18, 12, -59, -10, -10, -12, 101, -16, 66, -71, 26, -98, -12, 60, 17, -75, -185, 30, 218, 21, 93, 5, 204, 16, -63, -332, 221, 158, -176, -124, 181, -129, 29, -156, -142, -209, -161, 17, -24, 71, 76, 46, -252, -16, -41, -211, -67, -1, -181, 51, 105, -62, 197, -34, 4, 46, -42, 135, 61, -152, -256, 71, -101, 4, 181, 11, -63, 91, 307, 158, -196, -136, 65, -363, -46, 30, -83, 131, -105, 77, 114, 324, 17, -22, 136, -40, 142, -121, 22, -22, 166, -4, 66]
4111F6j9j48k0R6K04k91j14M02o7j86O7k88K94k17J51k32L04j36M3J01j2k5J44
4134A17n0l0j82J42J77l26J3m1P4L99o6j54l8L4j54k0J84J3j45J74k05R2r3m3
4158a28K00k68M42k87O1j23J34p7Q7O0j82J07p6K02o9q2P2p0M0M9ok36L01m6j38
4183c3L6L9j29N0q8J59m4j06Q1k88K4M17m3j1j31J85J35m27J07m4L05qj90J69
4207A65l08L5p7k4K20r9M17l01k16J82m3J69nk37J12J81k81l1N2K54k8k64J64
4230C7j29O7j77J71m9J92j51J38k25J94p8P0k4q1Rr3oK44j11K40k6k54J55N7l50
4255a80M31l23q5J09o3O5Q4j03j67M47j11j20j37J09j86J96j85K38l3n0J2Q2O0
4278I0o2k2k31K6K28J47j81O7r0l6l5o0q9K09q2J75o2P2J39k85n8N6L4P4k33K50
$$ y = [66, 47, -101, -121, -25, 179, -112, -226, 176, 109, -77, -10, -298, -4, -221, -70, -302, 2, -134, -91, 10, -2, -27, 117, 67, 37, -145, -3, 174, -152, -139, -180, -106, 293, 227, 73, 35, 69, -85, -105, 79, 92, -53, 121, -84, 8, -85, -128, 72, -196, 246, -41, 20, -103, 31, -46, 41, 101, -81, 26, -50, 152, 83, 1, 73, 3, 43, 92, 86, -150, 151, 105, -33, 3, 42, -87, -37, -125, 34, -10, -116, -35, -323, -299, 118, 75, 64, -67, 118, 253, -174, -67, -111, 194, 186, -4, 165, -143, -108, -185, -209, 11, -88, 329, 28, -188, -6, -49, 120, 115, -122, -10, 171, -110, -141, -89, 165, 137, -127, 37, -92, -25, -202, -31, -80, 112, -39, 99, -126, 68, -10, 60, 36, -45, -36, -129, -135, 109, -2, 238, 212, -42, 113, 170, -180, 251, -72, -157, -48, -111, -46, 38, -65, -232, 215, 104, -16, -153, -44, -230, -34, -219, 19, -14, -64, -52, 30, 90, 28, 6, -225, -199, 29, 176, -5, 62, -28, -64, -99, -159, -248, -39, -121, 54, -8, 64, 203, -82, -140, -84, -50, 24, -209, 41]
4304D1l07K36Nk3J98j61P2J69j01l14J71K00j39o9j90Q8J10K50k10l29L52J80
4326B29j48l23J0M63j90l0J44j88m8K4J2L5N6l24K99k0q7K19k2J6k37K24k75J61
4350@qj20j44J46K70j72j04J0K57J14m68K40J5j09M1K0j82K95m1j82M03m05J17
4373gr0J42N8j34o4O4O9l5N5k14Q2J39op9n4Q8l93K72NK10k69N2O1J68J3l40P4
4400a33N8j4K08j06j07L90l61j67L84k96m6M73k58j5j3j31K49Nl20K55k69J52
4422f2p7J05q4J37k25K90j71m7K43j53M6k13J03J30p4J5M8k74K77k33J91J16k00
4445a12J81m89J55K78L8J83j98k3j98K58M5jl7k84K81j66J23O9K65n31Q9J84j38
4468b8M5j07J63J47k04l6p1k61N20lJ8n5j32m5J44N3j62L27l84L40k41j80K87
$$ y = [41, -266, -30, -25, -48, 150, -11, 61, 230, 129, -185, -14, 186, 47, -22, -212, -124, -14, 236, 26, -303, 49, 229, 81, -242, -232, 231, 41, 11, 155, -33, -81, -57, -45, -10, 46, -278, 21, 1, -86, 133, 111, 127, -110, 114, -161, 0, -8, -128, -272, -126, 144, -28, -132, -122, 135, 249, -219, 21, 36, -73, -32, -12, -194, 101, 60, -122, 281, -124, -7, -97, 45, 103, -31, -95, -31, 38, 3, 58, -156, -74, 65, 59, -20, -74, 14, -379, -107, -102, 108, -161, -109, -48, 120, 133, -207, -133, -75, -89, 119, 13, -94, 296, -65, -232, 152, -144, -190, 283, 25, 10, -3, -134, 115, 120, -200, 55, -214, -62, -139, -34, -118, 19, -206, 84, -87, -134, 109, -44, 2, -211, -108, 22, -52, -37, 11, -263, 14, -219, -28, 88, -112, 69, -420, -265, 13, 51, 234, 36, 13, -185, 73, 118, 117, 80, -204, 77, -89, 34, 103, 368, -163, -74, 110, -28, 17, -90, 73, 220, 16, -20, -91, -352, 168, 165, 183, 128, -4, -49, 95, 148, -14, 313, -71, 269, 28, -152, 135]
4491A35N7l17K45l04K65k8j77K07j12J01J60J8k37m9J73j0r3k%L27o14J83L9L9
4515Fm2J48j22J77k61J72J11l89K64k23n3J14J03o6j1J27jm5m5J41K9n6O5l2k30
4540a19M6J52jMk47L26jj51l2J15N4k17O5N6R1L0k78K29l47M02m27L44l82L89
4564A01k44K8Q2j83M65m84K34Q5N8J41k74j19k5Q4R3p8Q2J15l46K38n6N0Mk04
4588a53m2K23n5J1j92L81k54k0K98l55K16k1j77O3J46j19L42n90L25L0p6P7q2
4611b4k9K5p9O5j08K1K59j02j8j88K27j47J47j3J26j17q2p0j01R4K97k10K3O9
4635F5j28J21J14j75J78l1q6J56m18M33l05N5P4Q4o7l75L39j46K3P2J5j21N8j8
4659h3j5J3k1R9J52j07K76m04K50J06j98k04K04J40r5l28K8K72k46K28j56o5K59
$$ y = [135, 192, -125, 120, -184, 81, 53, -124, 83, -29, 72, 232, 250, 13, -36, 137, 127, 34, 32, 32, 359, -255, -72, -33, 6, -36, 112, -10, 167, -94, 78, 189, -200, 64, -159, -212, -98, 5, -61, -72, 55, 54, 9, -36, 105, 134, 78, 143, 111, -119, -73, 79, 78, 82, -165, 161, 160, 9, -23, 92, 146, -71, -6, 50, 141, 171, -107, 122, -225, 177, -250, 94, -288, 101, -143, -115, -33, -216, 249, -235, -1, 84, 142, 283, 9, -110, -135, -51, 42, -36, 46, 161, -185, 53, -3, 47, 51, -153, -195, 28, -27, -16, -208, 173, -81, -101, 197, -158, 58, 37, -140, -77, 69, -50, 292, -298, 27, 57, -19, 58, -24, -53, -28, -107, -42, -150, -129, 130, 28, 10, -178, 49, -98, 49, 36, 162, 45, -37, -107, -208, -114, 183, -27, -4, 65, -63, 58, 172, -3, 175, 144, 58, 214, -204, 229, -76, -21, 53, 137, 70, -305, 34, -112, -89, -17, -2, -123, -65, -83, -98, -85, -106, -7, 145, 38, 314, -90, 160, 266, 68, -136, 68, 208, 113, -215, -187, 85, -161, 67, -89, -154, 105]
4682A05J10k51j02rJ90j45j87L69rj21K35l16J60l7N0p3J78k28R5J00P2q4p4n2
4706b4M1m0k53L26J24K2l08J94J03j82j36K82l52M20k07k34L30q0R6p3l6J09k37
4729a15N9K79r4j39M4k84K42K6Pm7L1J76l69J9J8K05L29j18j15j39k21M53l17
4752g0L27o9m63K51n7j21L96k30Ok9k0o3K25m8k39J85K5j03J35j42o3L6KJ0l5
4777a54J08L29l74L86l48j62L25l40K36j51P3j01K11N4k0R9m40J59K87k39K77
4798B15m50L03m2J05j60j3M6J06J87j70r3L7l70N22k92J42j18L5j1J72l74M02
4820A79k10L41k62k19K95K6Q6j60l3O4k2q7J12Q7k93J08n6J14l08l8L95k87M1
4843a27K51j87J17j77Q4P9k49K89o6P4j0k34R0L05l27J68K09k38m4j32K29k16
$$ y = [105, 215, -36, -138, -147, 43, -102, -289, 80, 71, -50, 185, -131, 29, -8, 42, -31, 147, -81, 14, 114, 186, 102, 28, -24, 17, -23, -276, 50, 174, 196, -112, 82, 185, 3, -133, 149, -203, 217, 10, -224, 106, 26, 122, 49, 13, 122, -115, -56, 223, 129, -10, 34, -250, -8, 18, 25, -22, 9, 185, -184, -165, -147, 58, 387, 269, 154, 15, -206, 247, -70, 257, 188, -275, -24, -81, -202, 194, -36, -30, -59, -79, -142, 83, 35, -204, -19, 6, -97, 38, -104, -167, -131, -129, -119, -154, -46, 283, -91, 295, -53, -215, 110, -230, 6, -145, -72, -173, 38, 92, 72, 171, -269, -110, 177, -62, 215, -235, 68, 26, 131, -29, -42, 4, 110, 297, 127, 34, 71, -299, 223, -69, 73, -45, -10, -21, 151, -223, 179, -31, 310, 48, -171, 124, 150, 236, 76, 43, 107, 85, -2, 110, 197, -96, 12, -44, 70, -238, -276, 119, -168, -127, 124, -63, 54, -123, -39, 40, -209, 80, 14, 88, 78, -156, -66, 239, -88, 80, 289, 51, 7, -125, 104, -112]
4865a12LK26j94j00R8Q0O4O4k50J62k36R5N8m4K98l74J98M0l1J55l10J97k27K71
4889A31m88L91k09J63L30k19j60k3L26q9k30J89j61J54j26J07R4k33J05j84M24
4910B92l14J92j87K7N6k86M19j50j97J59j18K20l5j16J22j54OL1K27m03J61L9
4932iJ02K04k78j97M07k1Jp4Jm2O6l10K96q5k53K02j62j6J55J51j1l07M40k24
4956C6J18j31J45k04Q9j14K51j06m4j99J08kk2K19p3j7P5J87n17K17k0j28K84
4979A52m5k03qN7L5J1r9J00O2J9k86M36k27R6j27K18k13Q1j55L44m38N5L76k77
5003c6o0J4K16J98k58l09M28j23j40J64J38o0j19n3l68M75j29O4J19j22n1o5J75
5026I8j10J75j08m9K66j94J6j00M8R8m65K62ml5Q6J99k10R1J77m59J82K74k13
$$ y = [-112, -109, 117, -77, -177, -79, 1, 65, 129, -121, 41, -195, -100, -42, -86, 212, -162, 36, 76, 45, 200, -110, 87, -140, 131, -357, 34, -175, -12, 318, 99, -61, -84, 242, 153, -77, 112, -49, 105, -21, 86, 180, -53, 52, -132, 292, -22, 170, -17, 10, 66, -220, 199, 49, -148, 11, -107, 113, 78, -38, 84, -70, -64, -33, 194, -209, -48, -9, 93, 297, 19, -178, 229, 208, 209, 135, 136, 94, 160, -150, 146, 61, -192, 10, -152, -168, -13, 138, 127, -180, 260, 36, 154, 23, 168, -36, 53, -61, 190, 84, 40, -159, -51, -53, -75, 144, 71, 54, 129, 316, -201, 16, -4, -132, 152, 107, -96, -104, -47, -12, -1, -100, 0, 62, 81, -205, 231, 4, 100, -27, 191, -22, 59, -96, 248, -190, -135, 241, -36, -96, -82, 134, 332, 74, -235, 193, 70, -70, 94, 232, 172, 53, 0, -368, 107, -22, 42, 161, 39, -12, -77, 98, -12, 163, 55, 6, 272, 78, 94, -6, 42, 140, -325, -63, -67, -102, -16, 183, -27, 64, 241, -218, -36, 238, 25]
5049B5O3JK04l63L5K29l43L02j18j41N9J68n2K4k1p1Q0j06K64l82L07l98K21K10
5073A97k92J14J23m3J2j85l6j43N08k54j71o1K21n6K81k03Rk90M93j15j89P5M4
5096C9k68K54p0j40L77p6j34n3l2K71k15j6J62k26J5P9K31l03J81m2j06n3J18
5119gQ1j65o2J96L6l91K47J9lj35J53R7k35P0mR8o6R8N5j90J80l0j56j24M67m8
5145A81j46q3J26j58j56L7J39N4k19L49j81k46K53O5k24K06J02j24M2r3M9J70
5167A43j43r7o1M37l47J14L3k42L69l76L08J63j08k37r1J31o9j06J93j4qP3j62
5190i7j40M21r3j17L10k51r2K64m78N31j62m7n9J20k33J63k20R3J04k24l9J67
5212g9L6j32J86k22N0J24K78k61N6o9Q8P9l08o1M53l03J06j34j24J88Jk2J75l79
$$ y = [25, 88, 89, 293, -70, -35, 194, -149, 153, 35, -106, -47, 121, 69, 93, 72, 1, 81, -25, 239, -143, 164, -234, -13, 197, -95, 19, 142, 99, 111, -74, -110, -253, 255, 1, -170, -231, -10, -66, 215, 12, 21, -269, 224, 109, -80, -5, 39, -229, 25, -45, -185, 192, 116, -18, -71, -103, 168, -47, -63, 99, -127, -112, -33, 198, -105, 76, 34, -72, -125, -7, 74, -91, -153, 43, 79, -312, -65, -46, -49, -184, -31, 66, -169, -99, -103, -5, -71, 27, 82, -108, 72, 42, -114, -238, 229, 181, 35, -48, 78, -80, -236, -199, -60, -6, -225, 124, -57, -303, -50, 15, -209, -3, 99, -25, 17, -76, -27, 143, 0, -97, -158, 279, -68, 46, 79, -163, 206, -170, 138, 301, 193, -44, -135, -4, -73, -179, 14, 0, -8, 65, -97, -237, 184, 91, -26, 284, 33, -59, 205, -273, 258, 96, 49, -10, 110, -123, 40, -180, -87, 17, -207, -246, -79, -43, -175, 11, -211, -161, -37, 241, -20, 36, -33, 55, 134, -174, -235, 218, -85, 21, -113, -237, -49, -48, -70, 105, -274]
5236b74L48J4M4j78J05j45J6k0J52J1k11K9P0Ml8J50pm1q7J90l8j14J09j00k1
5261c2pp7K00j12k04J78n4mJ62J74j29k19N6J70k66J24r1J79L3O8j82O6O5P1k2
5286A47p8J01j61L5j07N5J5r1K33J1r0J26k19k91K20K26m8m7R5j06k22Q1L34m00
5310a81L28j65J21l9l71M51k96Q0K36l32L66k21J22m47J92P4nJ05j63K63n20L80
5332b2P8j23k7L07l40L97k20l9M1L7j83K37l97J10K16Q6k16R1Q6j49J69j91P8
5355B6r1j19J57lK37j85o8J11K4j57J48jp5k5r1L36k56j24J66K88l38p1K20k38
5379a29K93j50O6M5Ql7Rk21J47k10j29M56j03j08J23j68j22K02J21m7L7l2J27
5402A78k77J59J78k52j9K04j08qj84N2J96o1J7K2N9j60j43K27k21K09k56P1j7
$$ y = [-274, 74, 88, 132, -46, 59, -86, -70, -90, 62, 73, -138, -109, -39, -35, -73, 77, 70, 29, -58, 132, 94, -20, 89, -11, -32, -39, -116, 84, -28, -232, -54, -108, -112, 50, 224, 95, -124, -68, 102, -164, -40, -131, 48, 81, 149, -33, 33, 98, 169, 147, 69, 170, 9, 44, -63, -8, 7, -84, 149, 160, 70, 196, -23, -314, -94, 132, 84, 37, 132, 26, -196, -115, 219, -181, 147, -18, 103, 64, -307, 144, -152, -72, 164, -168, 198, -23, 99, -348, -156, -82, -87, 18, -145, 118, -402, -22, 56, -67, -94, 213, -127, 270, 50, 11, 52, 89, -94, 143, -254, -144, 72, 158, -58, 33, 119, -30, 139, -52, 26, -65, -184, -27, -30, 207, 22, -46, 65, 89, -68, 80, 79, 4, -21, -112, 224, -32, -156, 10, 298, -40, -111, 109, -129, 164, 14, 80, 125, 133, 96, 105, -116, 31, -179, -308, 148, 45, -63, 60, -108, -230, -28, 93, 46, 83, 51, 178, -99, 60, 238, -14, -33, 171, 63, 55, -129, -77, 119, 58, 75, 97, 156, -4, -147, 80, -141, 68, -188, -117, -134]
5425a34K57k13Q3p2m2J10j54K10l1l07K90j17L59l83L15j09j02M21o39J68J71
5446H1K8K1k2L7Mj67j39j37J78P5j03L19k62J9J5r5K85PL0j27pol9jlm5J66j58
5474d6K77K92n29J37l24K02KJ28m8j8Kl35L16J64l20o3J58J36k87J11L9j26O5
5497f7L18k82P2M3%k35N6J68R9j9j75Q6M4ln8j41J1J35J19k12K21k55J72k29K8
5522a04J76k50k6K35Q3j01j85J71J58k9j23R1j39P7J14q4l04M02k39K81l83J63
5544a6J6K65l64K14r1j50J02j24K9N1K9Q6k77M2p3R7J15k8J45m9K19k32Q5j16
5568b5O6j08kJ19k82K13M1m4K03q2k02K02K26l77j27K15k06L20k39k17N23k85
5590f8J11q2l8LR4J22k37L43k80J08j78O4M9P3k09j05J90Q5M0Q3p0Q7j85R5j33
$$ y = [-134, 123, -90, -7, -79, -121, -11, -165, 45, 14, -293, -3, -120, 239, -144, 171, 62, -40, 381, -258, -90, 81, 109, 130, 108, 145, 149, -18, -157, -294, -116, -41, -144, 175, -87, -68, -53, -148, 137, 144, 174, 47, 40, 34, -5, -6, -9, -54, 112, -46, 231, 523, -6, 131, -193, 9, 11, 139, 91, 73, 75, -260, 56, 220, -100, -163, -5, 131, -156, -45, -6, -132, -67, 251, -31, 41, 84, 84, -151, -95, 73, 172, 153, -22, 64, 108, 105, 47, -94, -83, 52, 171, -41, 180, -75, 97, -132, -104, 72, -178, -204, 31, 114, 13, -172, -1, 157, 128, 5, 96, -43, 34, 148, 64, -240, 162, -77, 204, -179, -16, 0, 265, -99, 115, 24, -126, -24, -148, -119, -68, -39, 47, -230, -188, -261, -164, -49, -77, 68, 19, 238, 6, 91, -25, 41, -67, -69, 50, -232, -19, 22, -22, 181, 99, -103, 99, 325, -52, -179, 36, -170, 150, -89, -306, 217, -68, 43, -39, -77, -74, 20, 142, -95, 248, -32, 76, -102, -38, 11, 84, -125, -230, -40, 45, 85, 168, 98, 185, 0, 95, -38]
5615c8O3r4K94k08Q7M3j43J64l49L22j62J13P2k66L40k81K59j22j98K98l83K40
5637E1J3j7q4q5K54j77K7o0P2l4J05K0j81O2mQ7K20p3j41l44L23J1M7m7l53K88
5663b0O5j79O7L96k1j84q7P6j40J86K1o0k4j90J40j08j50K07J52j05k27K16l1
5686@k2j26K31j44M0K2J19k41K98l3k62J02N5L3j60n6J07M2J17j57n3K52m93O6
5710b63M02o8k38k1J46P1K24j41j48J23l25K67j56J4K63k64J47R4O2j26J9j84
5732a02K25j21p6P8l5N6k3j63n0j6P3R9pJ43k18J38l2J29k78K34P0j53j84L88
5756A75k82J59L3j57M3J57J25l60J32r0K46k02Q1o5Q8l18L38k98R5k72L30Q4j06
5779f4N4j7R5j6J30j42J9l65jK06J13J02M5k46J00K08l96J97j58L23j39o2k7J72
$$ y = [-38, 25, -69, 225, 17, 104, 147, 4, 168, -181, 141, -21, 92, 164, -102, 238, -43, 216, 94, -104, 194, -189, 51, 64, 47, -37, -122, 132, -45, -18, -78, -6, -40, 65, 85, -96, -34, -38, 49, 269, 196, 55, -289, 34, 45, 92, 45, -308, -20, 45, -134, -67, 329, 308, 124, 37, 113, -27, 159, 180, 120, 96, -94, 46, -62, -212, -5, 147, 42, -185, 31, 0, -22, -148, 83, -61, -21, 1, 120, -121, 177, 144, -118, -16, 39, 72, -88, -144, -37, 5, 122, -35, -88, 164, -329, -263, 139, 71, -167, -188, -42, 29, 253, 112, -36, 87, -238, 29, -127, -113, 150, -114, 33, 127, 189, 63, 82, -102, 123, 2, -74, 4, -31, 25, 2, -161, -211, -227, -154, -55, -62, 81, -137, 1, -31, 98, -180, 54, 124, -29, -213, 175, -107, 52, 85, -72, -29, 128, 253, -107, 25, -65, 181, -21, 60, -5, 83, -235, 103, -195, -100, -372, -42, 42, -64, -10, -27, 68, 52, 182, 40, 59, -306, -307, -101, 12, 114, 159, -87, 13, 221, -175, 22, -136, 187, 48, -14, -41, 131]
5803A31k08J71n9j46j65L21L2l8k80L43n1o7N9J08j52n7Q9j63J20K13k29P0J06
5826A48N8k01j57J73l4q1N8J1P3J06j09p2q5J05J30k20R6j86l3J58P4M2k7j36
5850a09J15O3j68K45k57J90nj90j11LK41j73J12p5K51j33K3R4j39j06J88k88L18
5873H9j77NK35l34K58k26J48M8J55J02k37k67J96J45O9k55K15O5m44K60L2j64
5895h2J42M8o9O7m3j48K63j63PJ16l9K17k94j93J86OJ30k09o4RJ63k29J63J11
5919I5j21J96j57j35K42L6j81J12k51K22K25k48J07r2k83L79q6l19L19m2K4K9
5941G1j81J44J45k44o7K04K6j12J4j90Q8R8K7J65K2j72r8J32n1L4r0J20m21J81
5965a55J59k32L81Rr1Nn8P8k95J44P6J0j61J12o3P7kp7l1J33P5m6m61M42J51j2
$$ y = [131, -77, 94, 35, -111, -276, 45, 77, 39, -241, 102, 51, -16, 43, 151, -1, -58, 31, -132, -12, 201, -28, 42, 148, 206, 5, -152, 21, -13, -94, -36, -25, 48, 154, 45, -27, -112, -7, 123, -97, -1, -187, -220, -62, 12, 54, 27, -109, 6, 69, -99, 146, -111, 79, 74, -116, -227, -224, 17, -156, -44, -119, 132, -1, 22, 116, -23, -129, 59, -229, 89, -88, -83, 152, -182, 76, -150, -2, 46, 201, 303, 66, -201, -5, 140, 209, -46, 169, 234, -210, 50, 82, -82, 60, 108, 39, 106, 63, -85, 178, 15, 22, 138, 99, 316, 22, -171, 15, 21, 151, -58, -122, -113, 50, -179, -16, 95, -26, 170, 13, -122, 120, 156, -25, 87, -164, 58, 283, 35, 142, 50, -233, 146, 60, -259, 60, 18, 42, 71, -110, 34, 179, -65, -132, 72, 98, -14, 0, -190, -102, -4, 23, 188, 210, 38, -60, 72, 21, 55, -35, 85, -336, -155, 4, -228, 153, 162, 71, 76, 18, 96, -199, -55, 21, 31, -130, -18, -81, -4, -6, -83, -114, 19, 94, 48, -413, 29, 180, 168]
5991A68j12j22j51O1n3j00M52k68J99q3R2J17n4m56K95k46K44j08J50J7r2L4j10
6014a26J4j13L87k33k5k4K78l20Q9L60k56k35r8L54k44K93j37P5K27k53K78m03
6036a12L6J27k46L18j06r4RP9l2q1K0P3n1K65j03k2o1j04N9p6K14j28K2k22M14
6061A98k49q7K14j19R6L9k08J23Q2j17J55j95N4l7r0r5K41j33J32j21J77j70L
6084a07K46j75K51j29j56l7P2P2q5j38K82k47L17O6n45L65K9q3M5N4k13R6J51
6107A31l99O2N2K93r8k4n4J02M1q5K59l24J57Kk75R4mj21J73k15K77J13k33O3
6131a3O4j13l1K10m2n04M34Q8N8k28J58k2J0j24J91J76l60l7j28J87j08K40j41
6154c5J11k9k56K74j35q4N7J45k20Q6j45J39K84j82k51J56oJ42m5k8p5j48K17
$$ y = [168, 56, -66, -217, -156, -209, -309, 143, -125, 74, -9, 83, 200, 146, -310, -15, -261, -17, -125, 25, 42, -50, -16, -126, -112, -225, 162, -71, -96, -120, 158, -162, -73, 287, 31, -204, -302, 52, -192, 101, -36, 39, 266, 13, 291, -112, -76, 51, -195, 123, 17, -77, -68, 11, -21, -102, -82, -9, -60, 205, 102, 80, 19, -85, -26, -102, 112, -16, 6, -216, 198, -51, -138, 76, -43, 53, 92, -116, 7, 89, -28, 127, -68, -14, -51, -141, -236, 5, -128, 4, -117, 60, -110, -107, 139, -36, 215, 86, -70, -107, -35, 37, -48, -186, 96, -151, 166, 232, -313, 52, 81, -2, 43, 97, -116, -20, 131, -268, -206, -154, 139, 41, 17, -37, 65, 106, 21, 280, -44, 113, 115, -160, -66, -70, -191, -18, -233, 44, 157, -76, -13, 51, -62, -93, 117, 75, -429, 5, 93, 151, -77, 81, 59, 69, -55, 136, 312, -48, -85, -213, -26, -134, 106, -35, 76, 47, -209, 65, -70, -154, -97, 48, -172, -86, -231, -92, 192, 10, -241, -85, -91, 51, 6, -22, -97, -245, -28]
6177b8J31P4j02j33P8L6r7r3n7J11L01k39qOk8J14P2j19P8r1O8J37l33J71j77
6202a28J97j79K68j6l35J75k64J08J67KK47l84n8J72J50k47QJ07J79k36K48k51
6224g0J0J41k7k92k9K73J26k14J97j57j05L44j75o0j4P3Q1j24j82K63n6O9j09
6247c7J15k25K38k50J92J75l51L35r5l37K52r1K44j08j21j2N3l8LJ9K2j71J58
6270c0M0J31k76L6O3k39L87k0mk91Q8J34p7K13k45K07N6j55l46N39k60k09K90
6293C2Pr6R8j5j8N0q8M11l17L10n45k08M37lJ37k82J17l23K88J94l28J77M1J31
6317B07N6m23J91M9j93K90n42L59m0O0q7J11J5k03J22j75J32J00p4J27j99r5R5
$$ y = [-28, 103, 177, 75, -58, 20, 56, -41, -134, -191, -80, 221, -18, -26, -20, -48, 66, 138, 19, 97, 6, 74, 211, -122, 49, -128, 69, -110, 158, 142, -193, -18, -282, -174, -7, -5, 242, -142, -200, -28, 122, -125, -117, -10, 169, -67, 181, -70, -60, 81, 54, -238, -267, 6, 132, -82, 115, -42, -147, 197, 22, -38, -52, 21, 102, -22, -204, 59, 3, 72, -37, 78, -147, 91, -159, 33, 208, -143, 192, 97, -240, 12, -79, 165, 57, -64, -76, -23, -61, -58, -39, -17, -188, -30, 10, 141, -135, -99, -36, -275, 112, 92, 88, -203, -115, 19, -58, 155, -90, 117, 173, 18, -328, 211, -49, -258, 32, 39, -57, 41, 26, 8, 58, -30, 381, 64, 374, -171, -379, 58, 55, 192, -90, 27, -296, -8, 186, -142, 35, 76, 207, 263, -160, 31, 80, -113, 177, -365, -6, -46, 14, -73, 38, 53, -150, -28, -203, -71, 29, -45, 82, -117, -212, -117]
$$ [...]
8191D1
##END NTUPLES=NMR FID
##END=
