##TITLE=1H_Ad=o(bat2)-90mLH20
 CCl4
 8 sc, 
 22.12.2022
##JCAMPDX= 6.0         $$ Bruker NMR JCAMP-DX V2.0
##DATA TYPE= NMR FID
##DATA CLASS= NTUPLES
##ORIGIN= UXNMR, Bruker Analytische Messtechnik GmbH
##OWNER= root
$$ XWIN-NMR		Version 3.5
$$ Thu Dec 22 13:45:58 2022 Russian Standard Time (UT+4h)  she@DPX200
##.OBSERVE FREQUENCY= 200.13135
##.OBSERVE NUCLEUS= ^1H
##.DELAY= (6, 6)
##.ACQUISITION MODE= SIMULTANEOUS
##.ACQUISITION SCHEME= undefined
##.AVERAGES= 8
##.DIGITISER RES= 18
##SPECTROMETER/DATA SYSTEM= spect
##.PULSE SEQUENCE= zg30
##.SOLVENT NAME= CDCl3
##.SHIFT REFERENCE= (INTERNAL, CDCl3, 0, 15.7039)
##AUDIT TRAIL= $$ (NUMBER, WHEN, WHO, WHERE, WHAT)
$$ ##TITLE= Audit trail, XWIN-NMR		Version 3.5
$$ ##JCAMPDX= 5.01
$$ ##ORIGIN= Bruker BioSpin GmbH
$$ ##OWNER= she
$$ F:/spectra/data/she/nmr/H-F/1/audita.txt
$$ ##AUDIT TRAIL=  $$ (NUMBER, WHEN, WHO, WHERE, WHAT)
(   1,<2022-12-22 13:44:30.51 +0400>,<she>,<DPX200>,
      <created by zg, POWCHK disabled, PULCHK disabled
       configuration hash MD5:
       00 E9 B6 7A A2 85 ED C7 34 08 36 98 17 FE 4E 26
       data hash MD5: 16K
       70 A0 8D 47 63 01 20 E2 6F 79 99 A5 F3 59 85 FC>)
$$ ##END=
$$ 
$$ hash MD5
$$ 12 9A 54 E5 F2 94 0E 8D 1B 8A 65 93 4A 23 19 52
##$RELAX= 
##$RELAX= 
##$RELAX= 
##$RELAX= 
##$RELAX= 
##$RELAX= 
$$ Bruker specific parameters
$$ --------------------------
##$DU= <F:/spectra>
##$EXPNO= 1
##$NAME= <H-F>
##$PROCNO= 1
##$TYPE= <nmr>
##$USER= <she>
##$AMP= (0..31)
100 100 100 100 100 100 100 100 100 100 100 100 100 100 100 100 100 100 
100 100 100 100 100 100 100 100 100 100 100 100 100 100 
##$AQSEQ= 0
##$AQ_mod= 1
##$AUNM= <au_zg>
##$AUTOPOS= <>
##$BF1= 200.13
##$BF2= 200.13
##$BF3= 200.13
##$BF4= 200.13
##$BF5= 200.13
##$BF6= 200.13
##$BF7= 200.13
##$BF8= 200.13
##$BYTORDA= 1
##$CFDGTYP= 0
##$CFRGTYP= 5
##$CHEMSTR= <none>
##$CNST= (0..31)
1 1 145 1 1 1 1 1 1 1 1 1 1 1 1 1 1 1 1 1 1 1 1 1 1 1 1 1 1 1 1 1 
##$CPDPRG= <>
##$CPDPRG1= <>
##$CPDPRG2= <>
##$CPDPRG3= <>
##$CPDPRG4= <mlev>
##$CPDPRG5= <mlev>
##$CPDPRG6= <mlev>
##$CPDPRG7= <mlev>
##$CPDPRG8= <mlev>
##$CPDPRGB= <>
##$CPDPRGT= <>
##$D= (0..31)
0 1.2 0 0 0 0 0 0 0 0.06 0 0.03 0 0 0 0 0.0002 0 0 0 0 0 0 0 0 0 0 0 0 
0 0 0 
##$DATE= 1671702270
##$DBL= (0..7)
120 120 120 120 120 120 120 120 
##$DBP= (0..7)
150 150 150 150 150 150 150 150 
##$DBP07= 0
##$DBPNAM0= <>
##$DBPNAM1= <>
##$DBPNAM2= <>
##$DBPNAM3= <>
##$DBPNAM4= <>
##$DBPNAM5= <>
##$DBPNAM6= <>
##$DBPNAM7= <>
##$DBPOAL= (0..7)
0.5 0.5 0.5 0.5 0.5 0.5 0.5 0.5 
##$DBPOFFS= (0..7)
0 0 0 0 0 0 0 0 
##$DE= 6
##$DECBNUC= <off>
##$DECIM= 32
##$DECNUC= <off>
##$DECSTAT= 4
##$DIGMOD= 1
##$DIGTYP= 9
##$DL= (0..7)
0 120 120 120 120 120 120 120 
##$DP= (0..7)
150 150 150 150 150 150 150 150 
##$DP07= 0
##$DPNAME0= <>
##$DPNAME1= <>
##$DPNAME2= <>
##$DPNAME3= <>
##$DPNAME4= <>
##$DPNAME5= <>
##$DPNAME6= <>
##$DPNAME7= <>
##$DPOAL= (0..7)
0.5 0.5 0.5 0.5 0.5 0.5 0.5 0.5 
##$DPOFFS= (0..7)
0 0 0 0 0 0 0 0 
##$DQDMODE= 0
##$DR= 18
##$DS= 0
$$ [...]
##$SUBNAM2= <"">
##$SUBNAM3= <"">
##$SUBNAM4= <"">
##$SUBNAM5= <"">
##$SUBNAM6= <"">
##$SUBNAM7= <"">
##$SUBNAM8= <"">
##$SUBNAM9= <"">
##$SW= 18.05172834244
##$SWIBOX= (0..15)
0 0 2 0 0 0 0 0 0 0 0 0 0 0 0 0 
##$SW_h= 3612.71676300578
##$TD= 16384
##$TD0= 1
##$TE= 0
##$TE2= 300
##$TE3= 300
##$TEG= 300
##$TL= (0..7)
0 120 120 120 120 120 120 120 
##$TP= (0..7)
150 150 150 150 150 150 150 150 
##$TP07= 0
##$TPNAME0= <>
##$TPNAME1= <>
##$TPNAME2= <>
##$TPNAME3= <>
##$TPNAME4= <>
##$TPNAME5= <>
##$TPNAME6= <>
##$TPNAME7= <>
##$TPOAL= (0..7)
0.5 0.5 0.5 0.5 0.5 0.5 0.5 0.5 
##$TPOFFS= (0..7)
0 0 0 0 0 0 0 0 
##$TUNHIN= 0
##$TUNHOUT= 0
##$TUNXOUT= 0
##$USERA1= <user>
##$USERA2= <user>
##$USERA3= <user>
##$USERA4= <user>
##$USERA5= <user>
##$V9= 5
##$VALIST= <valist>
##$VCLIST= <CCCCCCCCCCCCCCC>
##$VD= 0
##$VDLIST= <DDDDDDDDDDDDDDD>
##$VPLIST= <PPPPPPPPPPPPPPP>
##$VTLIST= <TTTTTTTTTTTTTTT>
##$WBST= 1024
##$WBSW= 4
##$XGAIN= (0..3)
0 0 0 0 
##$XL= 0
##$YL= 0
##$YMAX_a= 159932
##$YMIN_a= -174063
##$ZGOPTNS= <>
##$ZL1= 120
##$ZL2= 120
##$ZL3= 120
##$ZL4= 120
##$ABSF1= 10
##$ABSF2= 0
##$ABSG= 5
##$ABSL= 3
##$ALPHA= 0
##$AQORDER= 0
##$ASSFAC= 0
##$ASSFACI= 0
##$ASSFACX= 0
##$ASSWID= 0
##$AUNMP= <proc_1d>
##$AZFE= 0.1
##$AZFW= 0.1
##$BCFW= 1
##$BC_mod= 2
##$BYTORDP= 1
##$COROFFS= 0
##$CY= 11.3945322036743
##$DATMOD= 1
##$DC= 2
##$DFILT= <>
##$DTYPP= 0
##$F1P= 2.36226072786647
##$F2P= -0.459571619588291
##$FCOR= 0.5
##$FTSIZE= 0
##$FT_mod= 4
##$GAMMA= 1
##$GB= 0.15
##$INTBC= 1
##$INTSCL= 1
##$ISEN= 128
##$LB= 0.24
##$LEV0= 0
##$LPBIN= 0
##$MAXI= 10000
##$MC2= 0
##$MEAN= 0
##$ME_mod= 0
##$MI= 1.114404
##$NCOEF= 0
##$NC_proc= 0
##$NLEV= 6
##$NOISF1= 3.799351
##$NOISF2= 2.8
##$NSP= 1
##$NTH_PI= 0
##$NZP= 0
##$OFFSET= 15.70392
##$PC= 1
##$PHC0= -19108.7
##$PHC1= 19.00072
##$PH_mod= 1
##$PKNL= yes
##$PPARMOD= 0
##$PSCAL= 0
##$PSIGN= 0
##$REVERSE= no
##$SF= 200.130013532006
##$SI= 16384
##$SIGF1= 3
##$SIGF2= 2
##$SINO= 400
##$SIOLD= 16384
##$SREGLST= <1H.CDCl3>
##$SSB= 0
##$STSI= 0
##$STSR= 0
##$SW_p= 3612.71676300578
##$SYMM= 0
##$S_DEV= 0
##$TDeff= 0
##$TDoff= 0
##$TI= <>
##$TILT= no
##$TM1= 0
##$TM2= 0
##$TOPLEV= 0
##$USERP1= <user>
##$USERP2= <user>
##$USERP3= <user>
##$USERP4= <user>
##$USERP5= <user>
##$WDW= 1
##$XDIM= 8192
##$YMAX_p= 0
##$YMIN_p= 0
$$ End of Bruker specific parameters
$$ ---------------------------------
##NTUPLES= NMR FID
##VAR_NAME=  TIME,          FID/REAL,        FID/IMAG
##SYMBOL=    X,             R,               I
##VAR_TYPE=  INDEPENDENT,   DEPENDENT,       DEPENDENT
##VAR_FORM=  AFFN,          ASDF,            ASDF
##VAR_DIM=   8192,          8192,            8192
##UNITS=     SECONDS,       ARBITRARY UNITS, ARBITRARY UNITS
##FACTOR=    0.0002768,     1,               1
##FIRST=     0,             0,               0
##LAST=      2.2672688,     0,               0
##MIN=       0,             -174063,         0
##MAX=       2.2672688,     159932,          0
$$ Real data points
##PAGE= N=1
##DATA TABLE= (X++(R..R)), XYDATA
0@%%%%%%%%%%%%qJ6j6J6j6K4l2L3m1N0n8P2q6R9j14J32j52J74j99K27k59K94l34
35a78L77m23M74n30N92o57P30q12R01r98J104j220J343j480J634j799J980k184
53a146K408k659K943l263L625m042M534n119N827o705P829r325J1427j4615K0076
68A1795l1894J01652j07371j47928K78582K5697k50001J9537K53123j02481k05310
79a54599J43347J65795j92348r9300K04895M2761k14445K3769J95480p4060j70183
90a28888J21898J27018j47928q0976J65544K9655j61990J7833J49136o0796j20402
101h9896R3225Q5723j16381m3518J24630P59j22512L9367J06313p3445q3752R8867
113A9380N1451j14136j7484J17357j7496j09992M9642R2747p5856o6886R4519
$$ y = [0, 0, 0, 0, 0, 0, 0, 0, 0, 0, 0, 0, 0, -8, 8, -8, 8, -8, 16, -16, 17, -24, 26, -32, 40, -46, 53, -61, 71, -81, 93, -106, 121, -138, 156, -178, 199, -224, 250, -280, 312, -345, 385, -427, 474, -524, 580, -640, 703, -777, 857, -942, 1038, -1146, 1262, -1397, 1546, -1717, 1908, -2134, 2400, -2719, 3108, -3597, 4232, -5093, 6334, -8281, 11795, -20099, 81553, -25818, -173746, 104836, 130533, -119468, -99931, 153192, 50711, -154599, -11252, 154543, -37805, -137105, 67790, 110551, -103894, -80125, 115355, 41295, -128888, -6990, 120028, -27900, -108876, 56668, 86323, -75667, -57834, 91302, 30506, -89896, 3329, 89052, -27329, -70847, 53783, 54542, -67970, -28603, 77710, 4265, -79487, 19380, 70831, -43305, -60789, 56568, 39072, -70920, -21278, 71469, -4387, -71273, 23246]
124B3246L6797j02938k699J02712k9462r2000N9055P3701q1243m8152R5475J8695
136E3187r9374J0329R4311l8220q0622O0260N8805p6758l2487Q2872L349q1070
148d5418K4206P0197m8735n2071O7628K8469p8160j487P9943k5511p1980N0325
160b594N7153o9081l4691Q1630Q331q4210J9217P9509m6810o4905O9770M3336
172E6655q7251j6268R5494j4111r5320M3352Q5180p0831o7296R1504M1632j04454
184d1714j2622J08513j7781j03269M7848Q8994p2973o6687R2165M0000j02957
195d0483r168J05980k0969r9207M9574Q5083p3126o4150Q9633L8594r9103j1267
207d8609R9568j7077r2502M1774P7973o3734n7959P8764L2460q6904n984Q7275
$$ y = [23246, 60043, -42895, -45594, 57118, 27656, -64344, -5289, 68412, -12831, -60983, 34492, 53187, -46187, -35858, 58453, 20233, -60389, -129, 58676, -18082, -50569, 32303, 35652, -45418, -21212, 48985, 250, -51821, 15807, 44276, -33884, -35371, 44572, 19061, -52919, -2594, 54559, -14522, -49213, 32417, 40748, -43462, -24245, 55264, 8454, -56451, 13319, 56655, -30596, -46864, 48630, 34519, -60801, -17449, 67731, -3100, -70396, 21108, 62740, -41714, -54336, 54177, 36396, -66873, -19025, 69969, -3004, -69691, 22474, 62474, -40483, -49651, 56329, 35360, -63847, -14273, 70810, -2316, -66466, 23167, 61761, -37342, -48609, 50959, 33882, -58620, -16846, 61127, -2607, -60566, 18198, 50658, -36246, -42230, 45045]
219D5045k0364p9734M4642O6780o4278m6661P8382K4225q4382Q84Q4040k4909
231B3670p5510M6597O1220o4616m0924P5410J7303q0477O748P7515l0935o8569
243e2568N1442N2362o7416l3312P7236J0543p9801J2564P5620l3662o4279N1494
255B23M9014o3677k8520P0414P214o9719J4075O4000l2916n2399M8223L5828n7798
268a6038j7940O1508j292n9993J8202N2452l3550m1317M4224K5479m9798r793
280b7856N1260p024m6459K2045L7683l3537k4566M1487J0578m3674M255M2372
292B6564j7751l6105K9506K6333l7574j4010M1292M61m0929J2017L6188k3648
304B344k8571L2169J7824l8497n601M0088p424l8060J9070L2603k8844k4043L6199
$$ y = [45045, 24681, -55053, -10411, 56369, -7909, -54570, 23812, 48037, -36345, -35461, 48579, 23670, -51840, -5243, 55977, -8639, -49563, 25847, 43150, -37327, -30579, 46936, 16001, -52568, -1126, 51236, -16180, -49492, 27744, 38287, -41514, -28950, 46670, 13008, -51271, 223, 49237, -14440, -42960, 27454, 34668, -35051, -20976, 43024, 10108, -42291, 5932, 41760, -16038, -33978, 27530, 26238, -33755, -15553, 36899, 3349, -37968, 6256, 31735, -18063, -27856, 23404, 16380, -30079, -8034, 29649, -3888, -28454, 13033, 23611, -20063, -15808, 26564, 8813, -27292, 2214, 28547, -9027, -23037, 18255, 18716, -22213, -10196, 25992, 2344, -26227, 5942, 23766, -14731, -20332, 19756, 12332, -25728, -6658, 25945, -2899, -26942, 9257]
317I257J3745l9899j925M0823r683l7059K0478L1099k9276k1777L5867J0584l8901
330a6667J232L8489j2992l4904K3607K7731l2661j8265L7761O839m0433M899L8838
343B3474j6563l3867K6160K5803l4050j5013L8673L339l9075Q566L6836j9465
355D818l0602K9117K2249l5700j0930L8886k75l8521J1808L4465k1888k7797K9593
368E223J7986l3965q154L5080l273l3563J3193K8082k1752k0952K7705J2052l0875
381a3213k080L1033o889k8183J5368K3639k1479j6143K6558Q001k8091O92K7249
394A6462q661k3862J5595J8316k1001j2043K3901M230k5262K918K3837j0269k0879
407a6718J5809J5589k0091r528K1817L621k2251L232K1032q559j7394J3692J3252
$$ y = [9257, 23002, -16897, -18822, 22001, 12318, -24741, -4263, 26836, -2440, -24217, 11650, 22234, -16667, -15435, 23054, 10062, -24842, -1235, 26496, -6165, -24430, 13331, 20170, -20263, -15364, 23474, 6911, -26956, -796, 25007, -9043, -24056, 14617, 17956, -21119, -12553, 24283, 4818, -25784, 3333, 25582, -10118, -21048, 17838, 17563, -20958, -9150, 25315, 3427, -24370, 5223, 23209, -10756, -18910, 16170, 12897, -20666, -7473, 20609, -1143, -22095, 5610, 17662, -13213, -15293, 15740, 8851, -19332, -3964, 19675, -1804, -17947, 8611, 16612, -11479, -10787, 16462, 7801, -16061, -466, 17850, -3151, -15194, 8707, 12937, -12325, -9407, 14430, 4161, -16718, -909, 14680, -5411, -14939, 6878, 10499, -11752, -8520, 12512, 3953, -13441, 251, 13503]
420A3503j6900p429J8877K092j9366M000J7829r559j4341J3516J0007j6851n295
433i917J7688n64j7716N661J5592j0942j1897J4107P342j6612k032J7577l507
446D780j5350Q010J3616j2353r386J5878M816j6689J70J6898n253j4942R850J1729
460A1774j3428p860J5244L070j6364K048J4682o890j2605J0096R375j3280m993
473i131J4360L46j4180M294J2669p627r762J0629O399j1641k686J2299r55j1363
487f349M524R602o901p370Q974M252r974j321R557j607r317M290P566o027o198
502f299P397L370q000j127Q357j580p360L557O121n007m383O429K466o701J56
517b604O428j545o026L540N330n098l650O047J984o883j09O605j925o184L429
$$ y = [13503, -3397, -10826, 8051, 10143, -9223, -5223, 12606, 3047, -11294, 2222, 12229, -4622, -9917, 7771, 7207, -10509, -4848, 10744, -198, -12095, 2012, 9354, -7258, -9290, 8287, 4780, -10570, -2560, 11056, -1297, -10683, 5195, 10011, -6678, -6508, 10390, 5137, -9805, 45, 11774, -1654, -9514, 5730, 8800, -7564, -5516, 9166, 2276, -10329, -233, 9142, -4138, -9131, 5229, 5575, -8605, -4311, 8358, 731, -9031, 1598, 7997, -3644, -6330, 5969, 5014, -6349, -1825, 7777, 876, -6494, 2480, 6732, -3242, -4563, 4994, 3387, -5930, -1640, 5926, -101, -6299, 1098, 4468, -3532, -4659, 3698, 2118, -5242, -1685, 4436, -571, -4954, 1475, 3941, -2760, -2604, 3824, 2279, -3747, -207, 5123, 25, -3625, 2422, 4406, -2477, -2586, 4019, 2094, -4090, -661]
532f61M906n540l293O030J832p060K26O842k481n842M123M974n596k801O513J120
548C292o599J575O041k781n001M411L730n379k000N867q6n687J269N309l872l980
564c891M562K441n470q46N036o27m827K003L957l502k134L830J555m278L48L921
580B078r77l067K315K501k438j599K911P46l158O9K767q32k512J387J208j688
596b89j297J840K97j805p0J478m06j654R52J085r33p24J732L29j344k2J862q4
614I47j270M32J432o71j440J375R44j724o71J635N3j985L09J984j034j942J450
631a76J066k018o24K103j32j764N15J661r41j118J667O92j281o06K221o12j466
648h13J163J378j516q83J894n4j945O96J517j077j564J762M38k127R8J441k98
$$ y = [-661, 4245, -1295, -4588, 1442, 3274, -3786, -3560, 3282, 801, -5041, -918, 4056, -1540, -4341, 2172, 3292, -3307, -1732, 4309, 1528, -3473, 938, 4668, -711, -2711, 3156, 3070, -2617, -1348, 3961, 89, -3891, 671, 3112, -2358, -3204, 1832, 1205, -3622, -1619, 2338, -1164, -3298, 532, 2087, -2191, -1843, 2078, 1101, -1966, 349, 2850, 412, -1187, 1724, 2470, -688, -619, 2148, 1316, -1196, 191, 1399, -289, -1586, 254, 551, -1254, -1324, 154, -252, -1906, -954, 131, -802, -1526, 206, 535, -809, -831, 1031, 947, -323, 109, 1541, 870, -570, 805, 1749, 25, -646, 989, 1042, -943, -634, 1350, 316, -1626, -176, 890, -1128, -1752, 351, 219, -1545, -1030, 631, -310, -1428, 239, 931, -350, -956, 1265, 653, -813, 350, 1728, 212, -671, 1223, 1169, -776, -80, 1437, 360, -1204, 558, 996, -1131, -1033, 408, 110]
665A10j484Q48Q61j049n53J162L16r52K20J157o53j18M87J59m12L03L27j88m79
684F2M36J28k77P7N9m33l02N47O1n33j58L26m73k06J50M9q1J07R2K1J27p9r9k7
708d26P67k89l64Q06J1j91k70Q39l4q82N88N56o82o32P22k8p06pL52m56l93K36
730d83N90p34m73P95o74M80J95J38k64N7N66j35l5N66n3n21K77Q78p24l98R45
751I93J9r92J6J123j086p75P07K35r65l54J227n24q65N16N53o59k00J207m75o12
771i11O01J167j063n43J515K08j082L12J454j036r49J116N59j694N1J299o88j427
789a111P89J063j138n81P09K67j294N66R92o03r77J016N97j077K35J273K4j345
807e95P33J067r43o33J218L00j123j23J169n53j139N06R42o58j365J041Q27j291
$$ y = [110, -1374, -526, 335, -714, -1267, -105, 211, -741, -521, 636, -17, -135, 352, 511, 99, 402, 729, 541, 62, 498, 626, 349, 426, 485, 52, -250, 297, 358, -175, -333, -7, -480, -686, -536, -487, -568, -461, -369, -348, -221, -300, -399, -426, 341, 52, -312, 494, 505, 314, 44, 883, 849, -33, 555, 1111, 429, -203, 519, 491, -215, -222, 130, -326, -719, -483, 107, -627, -1100, -305, -979, -499, -304, -166, -430, -373, 193, 58, 23, 589, 536, 15, 292, 1170, 446, 48, 993, 1012, 20, 36, 1159, 73, -702, 5, 240, -725, -1079, 148, -376, -1241, -725, -172, -831, -1031, 176, -299, -911, -310, 857, -206, -749, 766, 974, -108, 204, 1658, 622, -327, 789, 1348, -346, -295, 1004, 316, -1111, -322, 741, -397, -978, -269, -2, -1296, -730, 262, -341, -1318, -302, 295, -782, -547, 726, 750, -595, 138, 1205, 262, -371, 847, 1147, 24, -99, 1070, 517, -622, -116, 826, 168, -1197, -156, 671, -620]
825f20n05J160K09j148M3J428o48j378J341Q98o71r53J221Q81j648J18J284k21
843G91j432P67J515j668o87J549K79j894M27J648j027j794J533J381k342p31K590
860I05l37k486J157K253k026j896L127J041k907m44L326p36k976K086K187k470
876a96j493L195N16l478O43K929j470k625K380J578k898j078L163j15l090Q38
892a201K766j750k220K475J503l220m82L381n47k504J205K544j941j592K684Q83
908A984k892p3L248p76k981J615K085j873j948K182J363l114m68K982p46k770
924b182J238K470k182j594K532R67k893J75L056m49l193J952K489k492j592L142
940A444Q63l666N52L293j317l215K106K783l398j942M040K37m202N79L671j760
$$ y = [-620, -1125, 35, 244, -904, -861, 567, -81, -1459, -118, 780, 109, -844, 377, 1258, -390, -272, 1012, 791, -641, 126, 1641, -27, -714, 835, 1114, -780, -353, 1295, 268, -1526, 7, 1388, -954, -1685, 905, 568, -1918, -761, 1492, -534, -2430, 697, 1738, -1169, -1613, 1713, 977, -1999, 87, 2274, -196, -1689, 1506, 2022, -1456, -813, 2116, 646, -1979, 401, 1979, -919, -1997, 1166, 1051, -2039, -1201, 1565, -185, -2405, 70, 1573, -1647, -2129, 1252, 705, -1799, -594, 1950, 9, -1583, 1101, 1984, -908, -981, 2267, 1491, -1490, 125, 2210, 337, -1611, 571, 1934, -1180, -1648, 1334, 588, -2182, -944, 1526, -656, -2250, 282, 1249, -1644, -1469, 1587, 1138, -2055, -103, 2386, -106, -1698, 1444, 2307, -1359, -807, 2486, 1169, -2046, 60, 2843, -555, -2497, 1543, 1780, -2422, -1843, 1828, 68]
956F8k945K716K544m016j262M450J52m158J341L772k088l349L600K098m050q17
972a944M422m47m300J939L563l136k763M164Q70m478N06L903j384m099K702L097
988B615l656k166M572N77m474Q25M146j941l600L163K844l937j129M069L50m332
1004b074R73M062k387k856L086J850l480j260M361n78l932J205L471k641k796
1019b996L262K004l828p29M040p44l660J796L325k741k375L614J482m079k68M419
1035B522o88m566K286L868l272k742M202J133m268n96M898j234m669K855L030
1050B759l550k261M276J080m786K76M993j970m187L012L352m196j784N037J78
1065B229m787J196M986l093l669M059K619m890j050N168l77m912J759M060l115
$$ y = [68, -2877, -161, 2383, -1633, -2895, 1555, 1707, -2451, -1110, 2662, 574, -2775, 825, 2923, -1127, -1944, 2478, 2031, -2269, -330, 3233, 97, -2666, 1498, 2368, -2110, -1604, 2299, 915, -3184, -482, 2615, -1041, -3207, 1365, 1942, -2532, -1707, 2439, 498, -3102, 61, 2905, -1032, -2161, 1908, 2258, -2074, -1101, 2961, 574, -2282, 804, 2654, -826, -2086, 2275, 1697, -2235, -1030, 2441, -200, -2996, 266, 2270, -1558, -2287, 1753, 1009, -2651, -855, 2470, -271, -2646, 968, 2450, -1629, -1897, 2522, 1834, -2732, -446, 3422, 150, -2592, 1610, 2743, -1525, -2121, 2777, 1543, -3126, -271, 2759, -791, -3052, 1224, 2304, -2482, -2206, 2787, 817, -3370, -358, 2994, -1202, -2986, 2051, 2229, -2558, -1362, 3624, 531, -3138, 921, 3540, -1350, -2400, 2768, 2391, -2521, -762, 3298, 183]
1080A83l465M366J769m909o10M874j391m420K609L807l421k968M857J548n130
1095b301J52M912j784l814K791L376l840k092M700P17m882P69M307j850l865K995
1111B91K691m018j469M165N1m475Q70M325k428l493L365K761l775j805M542M19
1127B017m291R39L969j699l850L445K683m183j002M208j60m397J524L762k384
1142E81l191L074K206m274q18M174m36m384K114L574l280k651M320J364m390j02
1158b119M770j509m021K673L531l765k135M721L48m389L15M563k023m014L639
1173E85K410m087j297M104O3m261J282L737k434l265L224K643m248o26M126n68
1189A388m114J956L348k707k552L560J695m219J39M025j297l359J819L128l173
$$ y = [183, -3282, 1084, 2853, -2056, -2666, 2208, 817, -3603, -994, 2813, -608, -3576, 1281, 2829, -2301, -2149, 2763, 979, -2835, -44, 3332, -508, -2600, 2100, 2817, -2065, -1296, 3011, 1161, -2704, 291, 2982, -1036, -2505, 1660, 1711, -2764, -1894, 2431, 3, -3490, -125, 2636, -1139, -2944, 1598, 2017, -2274, -1335, 2634, 935, -2915, 530, 3213, -970, -1972, 2236, 2076, -2321, -797, 2965, 581, -2610, 464, 2670, -1604, -2422, 1752, 1316, -3068, -954, 2620, -660, -3311, 1009, 2373, -2017, -2119, 2651, 1142, -2879, -206, 3325, -440, -2575, 2146, 2494, -1895, -1580, 2983, 960, -3054, 585, 2995, -1092, -2389, 1715, 1778, -2483, -1201, 2536, 102, -3163, 61, 2704, -1544, -2170, 1956, 1388, -2726, -770, 2578, -129, -2681, 879, 2574, -1645, -1506, 2519, 1222, -2137, -318, 2810, -363]
1204c63j788L272Q95l929K90L737j200l569K517K488l175j911L747O47l672N51
1220a463L419j502k984K232K544k673j756L597N13l373M96L538j691l125K535
1235C07K522l438j504L724N36m283J033L469k058l092L128J850l624r24L924k88
1251A282l916J231L735k350k843L255J850l297j074M149m67l422J292L073k505
1266gj787K731J339l381k89L435j238l107K197K112k597j430L106K38l250N45
1282a383L004j350k766K579J929l151o72L220j0k884O65K995j696k088K411J357
1298B160k708o53K757j74k874J049K344j930j612K129R30k551m84K498l80k101
1314a600Q69J953j488j592K089R95k213P8K039l69j943J296J756j975j291K263
$$ y = [-363, -2151, 1121, 2016, -1913, -1623, 2114, 914, -2655, -138, 2350, -825, -2736, 1011, 1658, -2014, -1463, 1956, 454, -2530, -298, 2246, -427, -2183, 1414, 1927, -1446, -950, 2588, 897, -2228, 307, 2829, -609, -2113, 1611, 2147, -2136, -1103, 2366, 308, -2784, 344, 2194, -1430, -2354, 1570, 1282, -2634, -1403, 2332, -18, -2861, 394, 2244, -1053, -2127, 2022, 1555, -1867, -575, 2498, -7, -1794, 937, 2276, -1105, -1394, 2041, 803, -2304, -107, 2005, -592, -2022, 1084, 1322, -1928, -1383, 1621, 271, -2495, 84, 2013, -1138, -1810, 1410, 1400, -1484, -819, 2176, 480, -1608, 803, 2160, -548, -1201, 1556, 1382, -1492, -443, 1901, -29, -1641, 488, 1418, -1133, -1617, 881, 501, -1600, -731, 1222, -266, -1858, 231, 1226, -987, -909, 1130, 761, -1182, 114, 1870, -105, -1396, 867]
1330H67Q98k345l66K625j033k247J343J835k194j215K549K32k406K77K233p89
1346B64k154J735J510j771j066K024N60k271N44J816p09j766J798J199k135n51
1362i73K288l11k302Q46K176j721j127J545P91k207n3K183o68k069J358J714k075
1379f05r43K125K69k085L94K021n36k131J440J551j529p32J417K53j444K01J525
1396A191r04j327R25J405j675m71J358J87j444L12J285q61r45Q41R04j476j68
1413h63Q83K37j422P02J208n61j187J151Q76j003n94J382oj331J72J393o80j080
1431g23R94J006j422m27J142k2j232L05J249o98j261J154O51j844K48J468k11
1448C77j258N50J169q10j149J675K45j066r7J317m61j183P16J185r80q19J238
$$ y = [867, 1765, -580, -946, 1679, 646, -1601, -258, 1577, -617, -1832, 717, 949, -1457, -1180, 1053, 264, -1890, -155, 1355, -416, -1482, 542, 1102, -1169, -625, 1191, 482, -1284, 514, 1713, -422, -973, 1315, 1004, -1298, -452, 1724, 3, -1124, 421, 1212, -995, -1048, 1135, 467, -1602, -244, 1470, -605, -1548, 577, 846, -1239, -845, 1176, 640, -1491, -51, 1500, -29, -761, 656, 909, -535, -334, 1191, 287, -1040, -115, 1290, -385, -856, 502, 689, -755, -443, 842, -19, -964, -123, 781, -695, -863, 20, 257, -1165, -463, 745, 184, -1003, 148, 1024, 21, -573, 809, 803, -528, -356, 1037, 357, -723, 271, 1277, -145, -572, 570, 548, -684, -379, 870, 172, -1089, 65, 716, -1128, -880, 588, 377, -881, -331, 838, 28, -1121, 554, 799, -267, -364, 953, 492, -691, 25, 1210, 230, -589, 649]
1465F49J18j186k13J479q99r18Q28N94q39l68N74M14r39K49Q40p12q5O97L00p39
1485a56j80Q77l3q70N44O52p10l81N35K48o10kN75m16l29q7P29l18p55O69R8n58
1507d78k20P45K3m27K07L69j9o74M42M68l47l52N67L69p91j93Q82l80k46N0L89
1528C84n34j8K29N26q58qM12L7n59L23L70o18j64N09L78q04K91L75m04m18P71
1549B20K93o41j73P47r5m07j11P25m74o25R24L74q28k92P68J0p22O2N80o22j00
1570c87M06n4l93M9P32p26k7M63J04J18n24L17J64m56K15L67m4m88M36Q2k56j83
1592h5K28J69l20Pj39M28o69J22L27j53j48kM35l98j12J05K35j77j54L69K25l94
1614a01L00L67m67k33L49K07j29k91N36j58q05O52K34o29J60L14k1o31J76J84
$$ y = [649, 767, -419, -632, 847, -52, -970, -142, 452, -387, -755, -181, 233, -706, -457, 383, -329, -414, 283, 583, -156, -336, 541, 508, -362, 182, 834, 124, -257, 278, 526, -84, -86, 489, 73, -256, -343, 386, 68, -687, -18, 80, -478, -698, 47, 70, -357, -150, 219, 200, -474, -32, 436, 89, -263, 304, 673, -118, -311, 571, 191, -55, -5, 384, -150, -168, 61, 587, -271, -279, 133, 170, -389, -66, 304, -314, -478, 31, 409, -395, -104, 271, -133, -551, 220, 513, -128, -301, 446, 351, -56, -167, 558, 84, -541, 383, 757, -71, -363, 405, 415, -307, -245, 335, -287, -387, 19, -35, -428, -379, 353, -373, -400, 63, 167, 285, -239, 78, 242, -214, 1, 368, 324, -164, 272, 354, 98, -85, 143, 312, -8, -1, -140, 288, -381, -259, 68, -85, -233, -235, 200, -198, -310, -205, 30, -147, -301, 68, 293, -101, 199, 566, 99, -134, 215, 422, 293, 2, 538, 380, -425, 227, 461, -168, -8, 306, 285, -346, -170, 14]
1634A4qm43K10O2k27j26O12k61l71M51K37k59j77M40M19o62MN06j98k74K39K92
1656D80k84k81J56J13n44K44L91l07l84M34O5k39l02M80j4l72R6K31k49N5J49
1677h2K57k50m0L01L7r0o4L06k36k35J64K38k07m68K17M23l66l7l7K07j86j83
1699c31K43j8l02J28L32p3k96M65j2o35M31M81n19P3j72N54n22O8M92k77k56K84
1721A38K02n76j4O03Lq36K87M82l00k18m7N20p15m6N49n6m93L97K95j11k22L48
1743A90rk91j49L88m5L4P9L79n29j23N52l42k44j53L30o5k07pL60l47j22P4J29
1766a18j44N2O9j65k66L22M84l30p2Q0J71L4q5K40j35k54J56M68j58j96p2L01
1788C82m14k08J88j44L4J57O1n5j95l5L20m20jM06q1l76L66J12K0m81M34K35k53
$$ y = [14, 6, -437, -227, -165, -392, -518, 94, -167, -538, -87, 150, -109, -286, 154, 573, -89, -85, 421, 223, -51, 188, 480, 196, -85, 71, 184, -360, -116, 275, -32, -416, 18, 83, -156, -458, 22, 8, -364, -268, -37, -286, -231, -82, 175, -75, -115, 186, 223, 133, 69, 375, 139, -96, 68, 306, 99, -369, -152, 271, -95, -132, -169, 38, -148, -331, -88, -106, -408, -280, 52, -21, -317, 148, 136, -499, -68, 413, -106, -33, -205, 349, -173, -105, 387, 110, -146, 138, 340, -236, -250, 353, 356, -480, -193, 289, -11, -229, -276, 244, -471, -517, 32, -24, -517, -120, 175, 64, -158, 190, 181, -110, -259, 129, 84, 118, 197, 576, 47, -76, 476, 134, -110, -263, 67, 2, -205, -212, 148, -199, -321, -247, -118, -262, -210, -141, -306, -572, -250, 234, -96, -168, -88, 83, 117, 32, 272, 137, -117, 39, 507, 349, 153, 81, 382, -32, -240, -52, -196, -162, -5, 56, 1, -194, -229, 91, -329, -330, 76, -5, -381, -15, 97, 117, -364, 70, 305, 52]
1811E2k08O17r2n11M93J83m99L4k7K62l18J73k77L0k04R6J47k88K1K29q5k18K19
1834a71n5Jj2N08j87l2L7J37l53L00k3l9l61J19L63oK5k7L1k43j18N4L59k97k83
1859b73L06r9k0N6L6j65J91l59J83K20p0j81K51j01K12k21K67k02k15M27r5k33
1881h5J46L09o6m94L77J14m47j38K95k05k17K64K97j89l36L40M74o96K41K08l60
1902a68J30j7j00L62k58K71Q2l27L77l02N6m9J02p6j47J6L76k37k02MN4k8m7k45
1926c73K11L3r6JN3L28m65M06N9J91m06J04MPn1l4K28J96j97p7K04j87q6L62l47
1951F8l79L57l2k57J18J42n5k79K22Q8j68l30P45l20j24k0K38R3j41L56m5l79
1973a02n1O54k39k48O9M11n28m5J35lk98J54L72l99k59M58N0m67J31M59n94p7
$$ y = [52, -156, 461, 369, -142, 351, 534, 35, 69, 42, 304, -14, 159, -118, -88, -292, -196, -49, -337, -316, -87, -172, -390, -171, -226, -225, -237, 271, 84, 52, 89, 226, -127, 173, 150, 111, -250, -131, 232, 226, 251, 224, 255, 12, -106, -52, 307, 10, -273, 33, -66, -86, -30, 6, -159, 32, -327, -144, 76, 6, -175, 76, -25, 187, -34, 233, 31, -184, 243, 148, -85, 61, 370, 304, -190, 187, 301, -146, -284, 11, -194, -411, -147, 150, -39, -375, -35, 439, -257, -16, 192, -168, -38, -55, -155, 207, -51, 220, 302, -25, 352, 50, 106, 57, 159, 83, -64, -48, 328, 91, -111, -107, -53, -81, -128, -373, -162, -129, -225, -224, -171, 157, -308, 98, 157, 348, -58, 46, 50, 57, 6, -28, 200, 396, 199, 122, 326, 139, 53, 415, 68, -311, 46, 14, -243, -125, 17, -38, -317, -95, -7, -175, -505, 240, -80, -204, -224, 14, 107, -34, 322, 277, -102, -153, 501, 262, 14, 83, 494, -34, -79, 56, 53, -245, -91, 281, -118, -377, 81, 131, -336, -205, 254, -340, -417]
1995d17K52L42k77J3L35j15k23K73J86l19l16L07N18n71R1J99j71o6K1K03p4l25
2017a34K79mm05lK03K21k28k0j76N16o38K26N54l72k53M65kj03j40L43k63K04
2039B70j42J52j49j92N06k53l80J2O29l34l62M4L26k65j97L20R3m61Q6M52k02
2060d7n97O49J52l33J26J01L34n85K77L87j82l43J91J36n24K60L61j70m60L04
2080C7M0j44k54N86p5p74M63M52l96l98K95N06q60J08O24j05l59K45K56k02k52
2101b07L19m9l27j2N19q0n51L77M18m11l71M03L54m71L3K36l82j11K44K45j63
2122A3k79J06L49k25m44M45J52j68r3O05m53o2R1K29k71j16N07J6o04M49J07m84
2144a30k40M16Q9k97J39K69m7o22J29M12k00l18N63q6l94J51L78l22l92Q21K5
$$ y = [-417, -165, 177, -100, -87, 248, 133, -90, 183, 369, 50, -266, 41, 559, -12, 79, 278, 107, 41, 62, 265, 191, -134, 145, 141, -264, -267, -64, 157, -71, -91, -267, 249, -389, -163, 391, 19, -234, 231, 229, 126, -14, 329, 66, 270, 128, 280, 131, -61, 445, 192, -188, -176, 453, 119, -243, -199, 127, -138, -335, -15, 78, -383, -297, 155, -47, -644, 5, 157, -176, -50, 51, 385, -200, 77, 464, 282, -61, 130, 266, -258, 2, 363, 193, -267, 37, 77, -67, -321, 265, 190, -584, -121, 331, -65, -463, -168, 338, -522, -414, 210, 105, -254, -9, 247, 45, -207, 112, 63, -264, -276, 243, 163, -388, -11, 407, -4, -375, 28, 382, -89, -56, 180, -202, -313, -69, 176, 13, -266, -160, 189, -36, -480, -35, 117, -51, -144, 461, 8, -54, 37, 266, -5, -121, 386, 402, -202, 247, 354, -130, -370, 46, 135, -162, -23, 246, 199, -423, -294, 118, -82, -400, 163, 77, -317, -166, 212, -110, -502, 319, 344]
2165C44o88J35N86O7m57J74M73p14l13N46M15q30Q1M52p1o41J02O43l65l92N78
2186A25l1j59l33M25P6k03K08M56p57j50N55j78j33n2M37j64j84Q4K44l74L23
2207B15J77k59k44k1K63j28k57K59J18j46l53K98p2K14j13J34q7k26J51N05l14
2228A14m03L61L64m01k15M29mn29N77K15m89k76M18J03m95l0K51k73o8K17J79
2249D5k40q7M21o1m50M80K93n37k69N05R2l93q5N36J21m51L70L12n10j98L49J93
2271D36o44J72M24k19m70L89K90l73m14N33k56j56j4M16k41j54J67L06k24L4K68
2292B70n0j03j3J88k11k11L36K2l09M0N47l21l97l8M67j85l43N38k49k47J58K27
2314A16Kk27j84L71j07j88J43m0j83nN33j58j71J57K62n09m0L93N13p12q3K37
$$ y = [344, -344, -209, 377, 444, -13, 161, 634, -80, -393, 153, 568, -262, -181, 271, 200, -441, -339, 304, -61, -453, 125, 94, -65, -398, 27, 103, -100, 108, 564, -193, -343, 212, 34, -99, -151, 286, 122, -62, 22, 266, -108, 215, 392, 133, -111, -132, 131, 3, -254, 5, 123, -23, -376, -78, -150, 64, -49, 85, -2, -228, -77, 428, 114, -289, 72, 436, 35, -180, 249, 245, -284, 293, 508, 19, -257, 161, 264, -231, -261, -10, -283, -351, -134, 45, -195, -282, 139, 78, -372, 108, 401, -136, -405, 100, 192, -201, -286, 250, 371, -80, 290, 602, 92, -106, 243, 436, -208, -36, 388, 169, -301, 88, 378, 5, -409, 124, -132, -288, -302, 114, -127, -281, -114, 192, -32, 2, 270, 220, 117, 104, 292, 81, -130, 206, 228, -81, -41, 506, 185, -212, -250, 217, 32, -311, 227, -22, -269, -111, 116, 118, -109, -293, 78, -29, -217, -74, -114, -297, -302, 231, 73, -98, 59, 321, -188, -228, 165, 678, -34, -117, 120]
2336A20J90p01L95K76k65l45M75O6l23j40K96R6n96M73L22o00J4L75P1l24o8N98
2358D05l14j88J59K47l23Q5L22p7p71M94J15j1o58O03j82J09l29N69l41j52K3
2379b15N19m39k88L04K28m19L58K81j04j59J26J09l70J37L09l6l60J82J08j59
2399A12k53p4K38J15k82N31k03m02K74O5l50n8J07J69R3m11J35J98q1K4J64J94
2421C05n34L31J49N0m06M27Ln15L86j31N11p61J75M16n74r5M59P1l50j01M57k81
2443hk87K22J99R2n83N81l26q7K8N10k02l77M65j22k63J45L39l28j75L61N1m86
2465b51K78L36l91j59K98J08j1l67j3O9m85J90L91J46k63j2J11l34L15K45j4k00
2487a3j56J93j29J84j36K43j2o5k83K81p6j0q0O7M8j71K13j10k32J41J84j52j95
$$ y = [120, 310, -391, 4, 280, 15, -330, 145, 211, -112, -252, 44, 140, -456, 17, 339, -261, -247, 128, 199, -125, -193, 405, 91, -97, 62, 309, -14, 71, 393, 316, -455, 39, 154, 143, -515, 88, -94, 15, -314, 255, -86, -238, -215, 304, -135, -423, -119, 109, -310, 48, 329, 225, 66, 192, 301, -69, 68, 377, 341, -19, 163, 271, 112, -141, -215, 23, 138, -144, 387, 184, -218, 56, 121, -229, -287, -180, -11, 82, -329, -194, 4, -77, -53, 111, 305, -229, 102, 251, 301, -105, 322, 325, -190, 196, 65, 576, -185, -10, 406, -168, -263, 196, 267, -83, -184, 273, -8, -295, -73, 126, 218, -365, 216, -110, -197, -169, 341, 139, -238, 227, 105, -158, -13, 326, -2, -177, 184, 235, -251, 27, 363, -28, -187, 111, 219, 208, -159, -172, -103, -588, -398, -7, 139, -124, -136, -25, -359, -44, 201, 187, -13, -169, 24, -105, 79, -57, 186, 174, 109, -174, 107, 31, 21, -59, 8, 56, -115, 98, -12, -244, -103, 81, -71, -266]
2510b66L23L8k86p0J13J99l59J85L00q3j26J36L39k83o4n0Q0m19M04k0J49k99
2532e9K65J3l47k64K89K07m50L33K4q7k65L26Rk09j9N35j97j71j73N38k31m6L40
2555C61k32k67J41L21k45r2Q4N2k37k4L16p9k94K12Om5k25k4rK63o9Q8J04k40
2579a34m5K41L0k63M56n5k90lJ34J94l55K78q2j49J76k46J15J26k74K00j81j11
2601b38O8J87m4j32n6K28Kl51K20J30k04J78J32j06j64J04K24j29j69J58L45m02
2623a9l0K28n4m7q2K20j15k29J80L6m25K61L54l62J01n2J53j01k30L78k08j75
2645b18N5K55j77j32L18K26l78J88R0K1l27L40L1l20p1J54K04l22k28K49Q3j14
2667g3o9M9K06n55K77K09k02L55k14P8p0j78R9r0PK66k17P7J7L5J72l72K43K70
$$ y = [-266, 57, 95, -191, -261, -148, 51, -308, -123, 177, 94, -32, 104, 443, 160, 96, 46, 126, -293, 111, 91, 240, -59, 206, 219, -128, -392, -103, 104, -346, -13, 11, -76, -341, -15, -6, -215, -234, 301, 104, -67, -240, 298, 67, 21, 361, 129, -138, 3, 324, 79, -13, 71, 123, -114, -138, 178, 99, -195, 17, 23, -22, -247, -271, -280, -17, -86, 2, 106, -134, -179, 62, 92, -171, 285, 230, -60, -63, 71, 265, -90, 188, 106, -43, 133, -113, 2, 128, -146, 54, -127, -238, -170, 17, -27, -159, -215, 13, 15, -336, -116, 14, -190, -12, 120, 14, -150, -46, 178, 49, -120, 38, 383, -19, -49, 179, 125, 78, -4, 216, 101, -128, 52, 88, -337, -76, 278, -84, 17, -35, 118, 17, -213, 165, -43, -218, -163, 92, -85, -217, 101, 327, -51, 137, 227, 248, -79, 261, 292, -28, -99, 55, 259, -63, -291, -42, 41, -73, -142, -93, 113, -442, -165, 44, -158, 197, -17, 61, -9, -187, -88, -178, -171, 95, -122, -45, -28, 7, 179, -193, 50, 320]
2691C20q0l53L80l57l41L08L69n34K37r8K0Q5j84Q6M01l34l12K00J46Q5k9j56
2713a41J07k43O06k50lN9K5j3l09L41n3Ml68K6J58K8j04J93K08o27L90j20k59
2736c45M19j6n1l46J11K83J50m42K15L56m60q3K80R9k72L72J66m67K2k7R7j15
2758e4j05K28N2k41m4J60m5j37J45J40j51l30N48pm24J70J52J35k09K59j45nl36
2781b44K27K43l64K74j79J28r3O4qj11pK28L3Mn00K73o9L7J96O8l04L5P9J54j59
2806Eq8M45k97j84K63j56L0J2J61K52n35M39k19%m13L21o7k21L36k8k9l03K79
2829CO8k10r9M52m15M7j36K76j32o1L57k36j88K58J49j6j78L7K20j59k22J08J54
2852G7n2J69k40J90j27L18m22L1j99J22J23l4j21J00r0kl4K35j66O2L3O7N9j66
$$ y = [320, 240, -113, 267, -90, -431, -123, 246, -288, -51, -149, -129, -44, -228, -142, 259, -75, -387, -187, -41, 44, 15, -141, -34, -277, 329, 79, 76, 135, 160, 147, -162, 179, 126, 130, -238, -212, -54, -26, -130, 63, 271, -356, 34, -86, -345, 74, 58, 7, -339, -228, 55, 205, -237, -22, 334, -126, -209, 71, 170, -102, 270, 436, -31, -9, -36, 61, -54, -159, 69, 121, -120, -164, -4, -49, -186, -41, 99, -52, -382, 166, 159, -265, -95, 57, 192, -17, 242, 97, 92, -244, -17, 226, -138, 136, -43, 85, -8, 56, 48, -63, -70, 158, 191, 195, -305, -32, -101, -64, 132, 200, -104, -69, 10, 164, 5, -83, 362, 65, -119, 144, -12, 18, 30, 191, 443, -92, 347, 128, 128, -285, 36, -31, -252, 84, 56, 27, -276, 3, 71, -139, -238, 214, -201, -154, -290, -14, -146, -207, 150, -86, -274, -16, 133, 117, -61, -24, 196, 37, -185, -77, 77, 25, 194, -46, 144, 17, 335, -87, -56, -255, -133, -10, -44, -165, -65, -155, -157, -191, 44, -122, -60, -27, 40, 99, -67]
2876f7J99N0l37K93K51nl44J21q9r2J2j61M45l38o3J94j79P2l8m5j5o2J04L38
2900B44m55L88j26J50k54K34j64J93k25K66l9k64M74m06L82k58j00p1j59N7K67
2921A34j96l84L66J20k89M8Q7j22j30K78K46j67k36j8L54m6K45j7l42K04Q6k24
2943cK0j45K97l11R6J76l25J12lRp1K06j88L82k38m3p8J05N0r1j46P9R0J53j45
2968a2R0Q2l20L86r7N8k58J15p8J79L5r4J06k83K86j13P0k35J93K5k37K10n8J63
2992B13l20N8J59l51J55o8Q7m9L4K83J1m18J43j2o9J08J62q2j13K48L3Q3j79J18
3016B34l45J4j64j6j07M31l7j19j93J30J75n6J44J95n76L06n9P3p1J02L7R4k68
3039g6L9QJ63L7l62L75p8r8k73K39L47m00J52K04n06K04k85L16J56k32K67l7l33
$$ y = [-67, 132, 182, -155, 138, 389, 384, 40, 161, 72, -20, -8, -169, 276, -62, -125, 69, -110, -38, -76, -121, -136, -198, -94, 244, -211, 177, 51, 201, -53, 181, 17, 210, -15, 251, 212, -52, 422, 16, 398, 140, 40, -31, -190, -133, 134, -62, -446, -80, 40, -249, -201, -114, -236, -366, -88, 158, -9, -245, -263, 91, 45, 290, 273, -69, 135, 221, -3, 17, -128, 169, -142, -46, 130, -195, -83, -86, -77, -148, 58, -130, 252, 14, -29, -107, -2, 48, -43, -189, -110, -20, 133, -12, 78, 160, -160, 226, 129, 187, -71, 44, -34, 145, 180, 86, 192, -91, 195, 82, 152, -83, 110, 135, -102, 108, 50, 213, -107, -49, 110, -241, -86, -154, -67, -116, -82, 201, 212, -206, -63, -75, -144, -36, 126, 44, -69, 179, 212, 295, 116, 234, -111, -97, -261, -277, -384, 47, 10, -109, -302, -172, 3, -53, 91, 286, -290, 16, -43, 30, -41, 61, 98, 192, -76, -37, -29, 134, 171, -191, 184, 106, 8, -265, -26, 321, -79, 73, 277, -229, -25, -310, 6, 162, -70, 197, 160, -173]
3062a73O2K85j1m29N97l31J32j47M0J92k65J67J56k06k14O2K2J12J13L31l65k08
3084g8P4J81k15j11K05j48P1j12J60k46J94K16j82Jp8L01j54l46M41j72Q1MNO3
3108A55N9l26J23j41K13k38K61r8j54J46k71K69Ql86L33j57K01l22L65p2O2K51
3130B81j65m3O2l7QJ86m2k42p3J3O1J3j5j9J92p1j82M77k14j52j81J32k39r3J02
3155b41L82L1m60M61j90k15J08J78k92J45M10k9l43J63J45p6j90K1J55J05m98
3176b30M86k61j03M32k21j68P3L4J39l50K18N2l01J06J13J09m94J08M08k19k33
3197c02K51J47k1p4L94l47j26L85l26J60j30k3J04q9j99K65j59L2J61N7m5j87
3219g2l51K10n7L64r1p7N2J37j85J23P6N0l7j0j42j52M22j01n8J75l1l91l3K70
$$ y = [-173, -111, 174, 163, -266, 331, 0, 132, -15, 25, 217, -48, 119, 275, 69, -145, -83, -61, 51, 164, 495, 130, -78, -4, 177, -38, -149, 56, -92, -21, -133, 27, -219, -25, 191, 9, 10, -68, 233, 79, -267, 174, 2, 83, 87, 92, 155, 214, -112, 11, -130, 83, -155, 106, 8, -146, 0, -271, -2, 6, -380, -47, -204, -3, -325, 40, -32, 30, 281, 116, 73, 135, 98, 106, 292, 250, 8, -65, -52, 9, 22, 7, -12, 180, 109, -73, 404, 190, 38, -143, -11, -250, -343, -241, 141, 172, -288, 173, -17, -232, -124, 54, -238, -93, 317, 288, -55, 108, 253, 177, -13, 8, 163, 268, -230, 256, -5, -108, 324, 103, -65, 8, 42, 181, -169, 49, 101, -200, -94, 19, 128, -366, -258, 150, -69, -302, -51, 96, 75, 1, 395, 48, -78, 307, -19, 141, 11, -12, 92, 3, -196, 69, -90, -58, 103, 160, 115, -72, -423, -213, -270, 94, 3, -74, -22, 115, -70, 53, 129, 179, 142, 132, -10, -162, 260, 159, 101, 276, 245, -146, -179, 91]
3243I1Kl17L15R4n30M72m24J61K2N6l7j83J91J53n3j31N2J55K1j50R1J16j30J87
3267B24l14J44k17R7L86m83K7P0J06j11KM37n10j8J22J08l16J12K1K61j02j6j36
3290a06K93o25M73J11r3J2P5j26j33j08N01R7j14j65J7M7J39k33k5k06O5K65j59
3313Bl51L99o1j86O1J00Q0j70J12J85j30k80K48K26M9l41L24o67J67J68J56j08
3335a7P6j91J58o8J5J33PL4l27K54j2k97K19Q1k80o6M20j37m9j01J73J6k99L79
3359A21q9P9j84J78qm11N2L80k2O1K03j96m02K78J44k44j33N04M9o17J7K9mK5
3383a90J79K6N9k38K24j64p8K45Q1l26L47j90K00o8J48l08L64m96L76k06O2m2
3405Ek3J32j47J29j66J49k67J16Q1j17L3on6K07j52N4m1M2J96p5q0j35NK49m7
$$ y = [91, 93, -224, 91, 185, -345, 127, -297, -136, -114, -58, -95, -278, -87, 66, 13, -118, -66, 89, 110, -40, 51, 167, 37, 224, -90, 54, -163, -66, 320, -163, -136, -66, 40, -71, -69, 368, -142, -160, -38, 70, -246, -134, -113, 148, 46, 30, -106, 187, -438, 35, 146, 53, 65, 140, 14, -119, -227, 274, 371, 257, 92, 109, 156, 295, 62, 37, -169, -104, 161, 2, -349, 50, -11, -197, -136, -36, 44, -126, -14, 171, 41, -239, 9, 235, 284, -57, 267, -400, -233, -65, 91, -17, 59, -132, 26, -42, -27, 106, 113, 147, -180, 74, 62, -235, -16, 65, -215, -281, 139, 2, -47, -148, 25, 41, -258, 121, 32, 111, -73, 105, 97, -314, -262, 118, 96, 157, 360, 164, -238, 40, 184, -60, -193, 311, 360, -257, -240, -211, -215, -190, -11, 15, 74, -164, 60, -104, -182, 63, 144, -182, 165, -25, 175, 107, 255, -53, 311, -185, 191, -15, 47, 5, -18, 114, -33, 96, -70, 79, -188, -72, 9, -108, -75, -81, -137, 70, -82, -28, -69, -27, 169, 94, 14, -121, -116, 133, 86]
3430H6r7l3K34j10n5J05j02k11K21k93K16P7L5J5j21p8J31J24k90J60L17k43k52
3453a64K72j72K01k06k0Rj36L08qj79J76k31K41k55K31J18j03j94J77J23l05k
3475a19n0K53k08P0P7j91n7K89J9j94j23L98k14n3L47j69N4l83L31j03J50L4k05
3498d7J42k8J61l74J40n3K08k17m7K11j98k5l12K87l3K39k5J22j26j58K95o2k82
3521a82L39L37l58l94L1L46o3J74m32L9L34l94O5Q9Q6j3J18J1l60K18N5K5k71
3544b00J69o2o0K23o1m4J31k0m6l7J42J49m09K42j40J76j5j07rj12J11m0j30R8
3568e1q7K16j30K70l94K13M0k55J69j88K85j92nL75k14k52J52j42J43o4N8J06
3590E3l7j07K88j1j28K60m04J57J11k52lj69J83j98L03m29J07O9n2J32J7p5P4
$$ y = [86, -11, -44, 190, 80, 25, 130, 28, -183, 38, -255, -39, 38, 73, 88, -33, -111, 20, 144, -146, 14, 331, 88, -164, 108, -64, 137, -69, -89, -80, -216, 92, 84, -95, 81, -150, 91, -164, 67, 185, 82, -112, 65, 188, -117, -119, -169, 84, -124, -54, 23, -168, -225, 64, 83, -111, -234, 164, -50, -103, 244, 75, 129, -254, 77, -26, 124, 158, -47, 95, 67, 228, -146, -6, -59, 149, -68, -115, 96, -102, -127, -439, -152, -185, 54, 29, 151, 25, -133, 162, 100, -182, 157, 494, 136, -258, -227, 119, 56, 230, -202, -163, 171, -223, -158, -69, 17, 4, 122, 133, -227, -9, 46, 71, -200, -31, -93, -153, 70, 9, -35, 96, 76, 30, -7, 135, 284, -125, 117, -23, 153, 138, 31, 22, -90, 21, -19, -149, -51, -138, 78, -52, 218, -176, 37, 77, -178, -9, -197, 88, -104, -109, 266, 52, -200, -48, -190, -47, -111, -53, 53, 16, -91, 197, 186, 58, 318, -86, 71, 182, -70, -73, -242, -59, -257, 46, -383, -276, -207, -259, -127, -110, -185, -111]
3613a11L78l87K55m1j99L17k19K53k35J46Q3pk2j88j48J24P6J38m18L29k08j30
3635b14M00k77N0M6m8l7K09l49L37Pk25K97k33n7O3q4J76k73J09K34j61o7N8J55
3659A16J6j91J59j40ON6J78l01J36n3L00l53o2M2n1rJ99j6J34r1J10n2M2j42r0
3684e7J39P4l16K60k66L8K08P7m02K33K64l77L18j48pj81J68k66K36j80M10k07
3706A8oR5j67O0k82K92L62k78j97L64j99k23K33k76N17l70k5k3K65l65P6K58j68
3729c9q4L12j84j23k76M11K08l79j42J58K03l20M58l30J06o3n6J51Q9o8l1Km9
3752d6O2K09k67j1k8n6J0K06kl37K35m6p7l7L53r6n0j09K99m36K13k54K68J4j01
3777h4J88j26O4j41L9L05l71L39k72j69K74k20K01j40j73M21j71J9j81M99m54
$$ y = [-111, 267, -120, 135, 94, -105, 212, -7, 246, 11, 157, 240, 233, 211, 23, -125, -1, 75, 213, -205, 124, -84, -214, 186, -91, -41, 5, -43, -80, 129, -220, 117, 124, -101, 196, -37, -94, -31, -115, 61, -212, -103, 131, -30, -97, -39, 116, 132, -59, 100, -40, -34, 22, 200, -101, 35, -18, 282, -71, -133, -91, -142, -151, 48, 32, 166, 75, 185, 133, 175, 33, -57, 82, 156, -160, 100, -166, -128, 80, 157, -245, -12, 252, -125, 193, 45, 38, -143, 25, -241, -5, -185, 225, 18, 12, 107, -60, 0, -282, 10, 372, 94, -103, 261, 62, -161, 72, -204, 313, -57, -82, -105, 160, -205, -129, 129, -39, -123, 189, 5, -118, -394, 17, 225, -154, -296, -138, 65, -255, 203, -127, -21, -84, -140, 11, 100, 32, 1, 3, -46, 16, 225, -42, -53, -81, -137, -127, 79, 77, -260, -25, -71, -148, -185, 168, 72, 22, -87, 212, -224, -11, -265, 3, 17, -84, 104, -22, 42, -99, -60, 245, -126, 213, -59, -228, 46, -174, 27, -113, -286, 135, -36, -17, -198, 301, -153]
3798a53K90j67L0j94K10j19L02m76L23j3J7j56K78o9J67j51r4J51m73N45k48L8
3820C8J86j24j90R5r6K90l11N1K92k84k7j82K57o3n8J54j45J58l27J76R2O1P9
3843A22j4k11q6L41L6m64K35J70j43o0J15pj20j45J63J47J85k16P9j46q0N2k6
3866g3K7K0J8l6n9pK65j38l9k62K57L3K12r6j16j86O2K2J36m6l1j60L12n9l61
3891c05L27k20L35k74K94j67J55j26j09Q7k53QK59k20L36j54K71l75J90k4j1M0
3913F4l2J08j36j45L00J6Jj84L20k65M5k49J40j40K73j36J05k2k20L79n62J34
3935b06L64j67J61j36j24J57j00K90k18PJ71j69j40K61l01M11k75K1k20K58k2
3956B3o9l8p2j55K86jr5j85K61k4J68l8j52L51k50j38M5J31O1k53K51r5K4j4K18
$$ y = [-153, 137, -30, 0, -194, 16, -103, 199, -277, 46, 33, 50, -106, 172, 103, 270, 119, 25, 176, -297, 248, 0, 38, 224, 100, -90, 5, -91, 199, -112, -61, 231, -53, -80, -262, -5, -68, -126, 28, -117, 41, -286, -110, -18, 43, 122, 108, -103, -189, 152, 188, -276, -41, 129, -14, -74, 41, 34, -86, -231, -68, 79, 264, 48, 127, -19, -99, -47, -73, -46, -26, -8, -44, -103, -110, 155, 17, -22, -284, -27, 6, 218, 122, 6, -180, -118, -96, 40, -6, -37, -197, 115, 56, -305, 22, -198, 137, -137, 157, -10, 145, 19, -90, -3, -256, -248, 11, -209, 127, -27, 244, -131, 59, 35, 24, 64, 32, 140, 4, -141, 159, 175, 176, -8, 312, 47, 92, -157, -17, -157, 116, -20, 85, 63, -157, 222, -340, -206, 158, -9, 152, 16, -108, 49, -51, 239, 21, 28, 199, 30, -110, 151, -150, 261, -14, 7, -213, 45, 23, -46, -84, -156, -311, -25, -26, -121, -306, -45, -69, 99, 61, -91, 260, 10, -128, -83, 48, 109, -144, 107, 12, 36, 22, 240]
3981B40j21J09k90k9K35j16J47l89J17O2K2Ql4K6j8J71j45m1J59j50j1j8k9J84
4005H9j20J74q8P1j6n7k61M4J17J38J51l04jQ9p1k19L99j22J40O0n02O3J09j7
4029a34J70N1j2j2n6mj46J91N9k49K17l4k4J52j24J59m11J31K15k17P7K8J27l61
4053b07K64m5K53k70K31p4j84m1J80q8M4K70l72J8k12Q3K56k46J72M4%j50KK25
4077A53J4K7j42J32l21J50J04k5j16j67P8J49j2o8J0j92J15J94J56m53J15N0P1
4100B2R9k50R1J06j88K49l12K84K04m17J84J57j01n0m3K98l23p7P9k0Q2P5kk27
4124h0j20L09m9j37l1j81J26L09n2p0j01qk30K65M4J84j04j12J16m4j24Q1J19
4147A10l3j08q6J31j62k5J85k9j39J75M8p9j00J87k22K30J4l52L62K5k43j18L12
$$ y = [240, 119, 228, -62, -91, 144, 28, 175, -214, -97, -35, -13, -5, -39, -13, -31, 140, -5, -46, 113, -37, -48, -66, -95, 89, -31, 143, 55, 126, 110, 53, -208, -164, -47, 91, 242, -62, -63, 26, -45, -264, 135, 13, 153, 213, -289, -226, -117, -134, 36, 87, 75, 63, 7, 3, -143, 48, 107, -142, 75, 41, 17, 169, 45, 204, -207, -76, 139, -78, -1, 27, 154, -207, 57, 12, 265, -5, 226, 152, -32, -73, 107, 19, 63, 333, -39, -21, -233, -150, 106, -140, 32, 76, 76, -74, -72, 153, 167, 194, 52, 184, -137, 13, 117, 92, -24, -191, -113, 36, 24, -44, -34, -226, -111, 83, 239, -214, -99, -49, 22, 121, -129, -38, 68, -120, 129, -183, 101, 305, -112, 72, 229, 128, 78, 35, 333, 10, -67, 12, -8, 74, 149, 147, -80, -200, 109, 60, -77, -108, -289, -163, 146, 94, 24, -77, -85, -315, -50, -6, 178, 74, -38, 78, 34, -90, -9, 110, 77, -31, -117, 14, -148, -173, 12, -17, -156, 19, 67, -12, -112, 75, -147, 83, 97, -255, 107, 132, -111, -229, 83]
4170H3l5mq0K08n3j75j29L51j18j75K63m30K19J07L00m91K03j37L66j01q5r9k04
4193b16L01l73L13M8k18K0K37j52K50m36M01o4p8K19k43j57J81l3o2J14j49Q0
4215a7J32k32L51j59j56k31M07l3m6J59j61o0K74j16j39j0o5L07k88k18K56J21
4237G6k12j22R9K01N3m5p4j50n5L20J2L1k12O3j75K92J41n96M12k76J52Q3M3k72
4261b11K72k03J20j55J68L5J53j72J84l01j35K88j74K84k21K46k21j73J25K26
4281A35K5k86K88l02J71l55J90K23M3j34j74K47j16J30j79L79m32M7J44Q2J11
4302B37J50l51j74J98L5m23K37J32k25K47J93k76l0K56j44p4J0J50m7k17L59j36
4324A07k16m4L09k91K18j59K01M6l33J48J43k35K07m90L48M69m01j08K25j35q9
$$ y = [83, 48, 44, -36, 172, 119, -56, -185, 166, 48, -127, 136, -294, -75, 32, 332, -159, 44, -93, 273, 172, 87, -12, -216, 85, -288, 25, 73, -145, -125, 112, -40, 210, -226, 175, 111, 33, 252, 9, -148, 33, 0, -62, 52, -97, -17, 115, -117, 234, 75, -81, -312, 95, 62, 16, 175, 14, -46, 228, 112, -27, -37, -102, 205, -83, -301, -45, 76, -136, -258, -159, 42, 95, 50, -24, -174, -229, 91, 103, 134, -78, -15, -190, 102, 243, -353, 59, -217, -65, 18, 61, -211, 61, -142, -22, -177, -9, 26, 179, 7, 191, -110, -245, 43, -131, 153, -68, 178, -43, -216, -91, 135, 160, -126, 162, -140, 31, -324, -134, 89, 132, -2, -176, 71, -45, 85, -94, 285, -147, -100, 44, 126, 237, 387, 36, -138, 60, 95, -328, -91, 41, -184, 63, 256, -20, -50, 206, 62, -12, -2, 148, 101, -116, 243, 107, -109, -153, 156, -135, 83, -76, 125, 171, -162, -14, 129, -106, 101, -389, -41, 428, 27, -81, 144, 9, -80]
4345h0J11R8m4Nj14P9q1j07J53J1NJ74k34j28J60Qqk47K67J83k52N5J97j76Q5
4370A20l69K87Q5j06J67j89r4N6J4K40k48k4JJ6lJ15J07q3k58n8O6K25q0n9L8
4395c4J21J86m47J66r9L16k85J16J78N0k32K88j23j58J92m6j51j09n5LK19o2l20
4418b86J39L8NL50l62K03k38J62m0q1K38n3k37J03J79L9j72m1K98m96K21K49J38
4441C56k82k77M4K19k68K43j10K69m80M68l01P2J97J7P3l92P1L9K26j52M5J1j74
4464h6K61P8r0k73k86M89M2j35j03J00k19K99l0j22r9J17k00J81m0kK07j08J51
4487A32j31Q6o2J23j76j46J56m0m1K13j87P5O0l15K37rj0L9o1K9m0j59K33j0j1
4512a5N2j15K00j06j54K43r7J49k42J35K5j13J23j17l5L89j29J24l61n9r1K78
$$ y = [-80, 31, 129, 85, 90, -24, 55, -26, -133, 20, 31, 36, 210, -24, -152, 8, 16, 8, -239, 28, 211, -41, 14, 211, 35, 120, -249, 38, 123, 17, 184, -5, -99, -43, -29, 211, -37, -61, -60, -44, -47, 68, 175, 92, -166, -224, -158, 67, -13, -72, -34, 87, 273, -174, -8, -107, 209, -76, 40, 218, 268, 36, 324, 201, 43, 235, 189, 38, -71, -126, -123, 96, 34, -286, -147, -109, -104, 246, -116, 87, -151, 11, -29, -110, 128, 75, -162, -59, 120, 159, -13, -54, 244, -252, -31, 218, 356, 74, -203, -159, 60, -208, 35, -75, 194, -286, 182, -119, -47, 150, 167, 240, -152, -81, -42, 184, 32, 77, 88, -86, 175, 253, 163, -110, -396, 93, 135, 0, -103, -3, -222, 77, 47, -75, -174, -57, -257, -76, -116, -118, 89, -19, 132, 1, 87, 25, 148, -28, -174, -18, -58, -99, 114, -73, 2, 62, -253, -16, -25, -35, 4, -57, -28, -68, -227, 6, -4, -15, 37, -78, 122, 16, -138, 105, 8, 157, -85, 50, 75, -38, 85, -32, -67, 322, 193, 317, -44, -103, -194, 84]
4534H4j71Q5pl31J46J60m6K6J18k89K37o1J2Kj83J19P3K48j91N3O8l16N14k42
4558A08j86P0J59j13j97K0M4K14J08k16K56j94n9O0N2k72K72j78L7l5M2k70K72
4581fL0k38K63K27k73j5L0Jn2K2p9J21p7O1j02q7K87k06j4L2J27j41MN6K12k80
4607i7j08K28J64k33P9m0j41L5J0m8J73j87o3L36k41J33J3l5m2K21q3k78K41R1
4631A28k08p7J92r3J87k15J4J19j02k02J6J57k4k62L36L07j43l54L91k32n5K33
4653A13M9m5k05R9l5J02o2J74j81k5Ol6K7m1J00k07L32j96p9j0K31o7j69J23J49
4678A47k49N1O8j88k34M84o0k7J01l00M59k40K39k05j82J07p0K96j32K1n1q8k09
4701b62K88n0j37K3J33q9K81j93q4j50J90K46k45K1JJ77o9k2k37K76J93m35K55
$$ y = [84, -87, -2, -9, -340, -194, -34, -80, -54, 64, -225, 12, -49, -37, -35, -218, -99, -26, 222, 31, 84, 152, -164, 350, 108, -78, -8, 151, 38, -159, -139, -95, 119, 227, 11, 267, 73, 14, 74, 126, -146, 126, -52, -15, -50, -8, -278, -6, 24, -214, 49, 276, 3, -12, 18, 19, -33, -11, -90, 31, -46, 15, -87, -174, 113, -93, -107, -75, 52, -89, -85, -29, 183, -97, -205, 23, 187, -46, 33, -7, -148, -113, -103, -151, 22, -165, -228, 108, -133, 0, 13, -22, -64, 157, 74, -204, 37, 128, -80, -157, 35, -58, 129, -86, -72, 47, -55, -257, -241, -84, -108, -370, -34, 273, 130, -224, 167, -65, -120, 113, 162, 117, -88, 11, -24, 78, 16, 190, 9, -16, -10, -46, -19, -60, 40, -167, 165, -31, -110, -120, 111, 44, -125, -2, 147, -102, -51, 17, -171, -405, 79, 19, -8, 93, -207, 252, 12, 251, 46, -136, -29, -99, 197, 65, 86, 35, -53, -262, 26, -24, -161, -138, -5, -94, 187, -6, -90, -240, -50, 196, -49, -28, -27, 150, 81, 59, -178, 98, 291, -144, 111]
4724A11rj33J09j4M2J88l26J4j44P9N8j94L73k59k01K87j34J86k43P1J60j94L24
4747A51j03j63K06j35J01q1p1K8P2L80o25J38k3K82k84M7j04J31q2J5j7L54j71
4770D6p8M9J0J44l08JK01j14Q7k55L18m24L18J32j77k65K90q5p3k4K12M8k51J97
4794aJ30j41l61K63L52j89l0J15J25n17J89J65j43j84R1L31q1j07J83k6j16j67
4816a19L8J34j35K78k3k59J05o5j63J93M4m2M1r7J52o9K0j3L0j00j28K34J37k7
4840A66k53K95O6m53J59K08k73J77j0j97P8j48L03j58J53q3j84Q4K07l60J54R7
4862B8O1k38O2J33M6j05l3j5O0n1m5j8K31Q7k18j8J50L9m46N39k58j9N7l3rQ3
4888G0n2q2p9J72p6K50k48r7J43M1n7m8k2L29k62j97J51p6J33J04m33L44n0J74
$$ y = [111, 102, -31, 78, 64, 106, 294, -32, -18, -162, -83, -25, -219, 154, -105, -306, -19, -153, 33, -210, -139, 21, -173, 151, 48, -115, 91, -44, 57, -24, -95, -67, 5, 385, -240, -102, -125, 157, -127, -80, -184, -53, -135, -120, -137, 217, 46, -32, 17, 27, 171, -137, -136, 65, -49, 38, -217, 101, -323, -5, 127, -50, -315, -25, -110, -183, -207, 5, 53, -198, -1, 129, -12, -373, -110, 242, 53, 23, 138, 263, -254, -65, 100, -43, -227, -136, 195, 114, 7, 190, 164, 48, -119, -81, 53, -82, 196, 173, -86, 19, -46, -209, -16, 28, -14, 27, -70, 82, 13, 33, 20, 50, -50, -178, 56, 193, 166, -87, 208, 274, -179, -20, 188, -85, 92, 82, -115, -37, -185, 118, -40, 113, 30, -154, -70, 137, -223, -69, 28, 89, -149, -87, 46, 92, -13, -46, -61, -1, -52, -97, -115, 116, 203, -15, -33, 117, 156, -290, 249, -9, -28, 29, -4, -13, 70, 18, -64, -143, 29, -47, 203, -45, -142, 1, 42, -15, -63, -85, 244, -18, -215, -64, -140, -7, 97, -336, 8, -42, 132]
4912A32j63Q9J32m49L18k5mj21Q2Nr2K26j71K34j78n7j4j09J21r6l21L07j0L66
4936B02j63K53j57k78K92l0j43P1j64k05L42j80K39j84j65J53jj81N8K64J8j28
4958h7Q1j09J35R2r0jr8r7J12J40j80K4j18L10K2k26J8J14l9q9JN4o7Nk24K16
4984a01O2N1j31K38j29q1JJ63o8o5q0J58j75J38M4J15l95K12j74K78l7q8J59k00
5008a05JK82j5l04M02l08J05jJ34k26j9J24j60L6J39k24l6R6J94ML7j57j17K24
5032A06l17M25k18J01L0j37K35m27J54qr8L22m85M62k87M35j76M9l47K99l4j50
5054f6j34J89L1J88n4k04J35r9J89l4r8k49K66R2j06LM4k4j12l9K45j81p9K21
5078A24k36Q9m3N4K6p1J85l69K92k93J86R4M7l22M40k9k78M5J39k73J01N8j4j27
$$ y = [132, -31, 58, 190, -259, 59, 34, 30, -91, -9, -4, -96, 130, -41, 193, 15, -42, -56, -165, -44, -140, -461, -154, -164, 202, 39, 292, 135, -143, 149, 119, -24, 47, -117, -322, 20, -160, 79, -105, -270, -117, -118, -299, -241, 23, 41, -87, -6, -115, 20, 112, 22, 21, -77, -174, -62, 78, -102, -78, -196, 114, 136, -90, -72, 42, 3, -86, -85, -31, -98, -93, -317, -101, -39, 12, -119, 119, -10, -91, -90, 73, 5, -60, -140, 18, -157, -19, 25, 140, -255, -43, -217, 61, 24, -64, 95, -105, -104, 178, 163, -141, 261, -47, 58, 57, 191, -35, -54, 70, -90, -54, 85, -139, -175, -79, 115, 119, 156, -1, -118, 106, -211, 214, -4, 97, 127, -10, 225, -202, -48, -56, -154, 168, -317, 145, -142, 293, 117, 166, -181, 118, 84, -66, -200, -11, 20, 208, 154, -50, 85, -14, 175, 141, 43, -206, 60, 152, 46, 49, 93, 69, -43, -82, 163, -18, -97, 124, -112, -23, -66, -12, 14, -57, 128, -241, 51, -242, -56, 38, 85, -237, 203, 174, -104, -59, 80, -193, -92, -34, -48, -175]
5102a75N8M90m33j8J15K08j64J13k05j52R3j07L6J30jk73K28k44L16K23m05L20
5124A53l25O9P7n4J67L4j57J8No2J97l80J52K71l57J87m9k05O56l97L3p9j9l8
5148a03R7j9j8J44k39K70l18m5K67j08k1J9q6m1K59k09K04p6j84L46m4j53L17
5171B59n9l76M44m79K74k57MK18Ook42o3K22M1J58m09N17k1n1l07J35R8m77N88
5195B17l08J57j02N0O2L0j39K79m54K38k64k4K59K42k92m07M64J18J18k95m4P0
5217b5l1N6o8j30K59N0o0K0L5k27K29k66J9Q5l7J14L2k62J09jO8m0NL20j03k50
5243i9L01m73M38l09Q2L3J12j41J97r4l34L19j47K43J2j18j19O4k06N9J56o0R2
5266HJ76k06R4j86L7L3k8J49j52L6J73q9J69j62k67J20M1k8l5L02k39M2j86K66
$$ y = [-175, -117, 373, -60, -78, 37, 245, 81, 194, -11, -163, -70, -177, -141, -11, -12, -285, -57, -301, 15, 238, -167, 153, -172, -103, -26, -80, 87, 121, -36, -18, -13, -75, 122, -258, -106, 165, -192, -5, -54, -259, 397, 0, 33, -46, -65, -103, -6, -25, -43, 101, -138, 132, -186, -231, 36, -72, -93, -74, -160, -201, 58, -151, 53, -23, -207, 139, 95, -58, 259, 200, -176, 268, -211, 63, -194, -190, 28, 34, 28, -214, -277, -55, -14, 144, -265, 252, 231, 180, -127, 8, 106, -371, 217, -91, 66, -36, 14, 76, 106, -33, 246, -208, 30, -234, -258, 1, 243, -49, -456, 8, 126, 244, -51, -95, -25, -56, 0, -68, -198, 61, 111, 51, 71, 106, -121, 108, -158, -139, -54, -91, 23, 55, -207, -98, -99, -31, -71, -66, 254, 151, -99, 202, -271, 167, -142, -60, -27, 85, -56, 141, 47, -287, 32, -115, 128, 140, 22, -97, -33, -239, -180, -24, -84, 8, 184, -22, 72, -114, -77, -44, -72, 77, -75, -39, 134, 45, 214, 52, -215, -95, -54, -82, -117, 185, -54, -12, -198, 68]
5290F8j31M8p9P9o8K75k36K9l8k22K47p4K17k51K61l7Nk22J96J67q5J13j31l17
5314a86K05K61l34K4M3k02J90N8j19j48P9K17n8r3N8q9Q7j79J61Q7K6R8k92M95
5338C89n23K03L7j48l2j28J99j82J90j71j55J55o7J90J58p8j1j68J51o8J64j42
5360c7J78R1q7j24P2j54J63N5l24K02L1j66J25K48l70J06j88Q6K79j28n6j00K4
5383g4OJ29K27j95o8j92K77j65L05K0j64j3j93J08r8J19j68K45n4m2p1K01j49
5406im7j13J64q9J66k47K48K36l37j64K57j62J8N3j7j17L08j59j37L01m34K08
5428g3j79K47j97K56j18O2j05K89m24Q7L71J9o7j75j95K15N2j46m4K65M9j79j78
5451a68J21M1j7j4K9k96K34J57l24J01K65r2N7j81K00K67n57j4K38j2q5J74j05
$$ y = [68, -63, -15, -94, -15, -83, 192, -44, -15, -53, -275, -28, -102, 115, -136, 125, 88, 93, -129, 67, 234, 149, 262, 131, -186, 19, 280, -54, -30, 13, -189, 1, 59, -60, -208, -129, 88, 30, -63, -5, -94, -7, -186, -25, 62, 88, 186, -106, 389, -134, 69, 106, -42, -74, -202, -3, -185, 5, -166, -321, -166, -233, -43, 115, 37, 26, -142, 9, -59, 105, -37, 141, 232, 145, 21, 93, -61, 102, 157, -167, 35, 66, -100, 25, 273, -97, 9, -179, -93, 186, 58, 2, -98, -74, -68, 61, 288, 93, 25, -167, 110, -55, 250, 270, 106, 93, -100, 8, -90, 29, -139, 106, 52, 10, -61, 140, -9, -56, -169, -5, -94, 72, -175, 73, 309, -28, -192, 65, -97, -79, -26, -43, -160, 148, -11, -148, 153, -281, -73, -252, -5, -202, 54, -64, -2, -107, 182, -242, -155, 216, 235, 168, -7, -202, 13, 65, -81, -125, 140, 189, 10, -168, -47, -6, -23, -37, -8, -304, -70, 87, -237, -136, 129, 37, 94, -87, 113, 380, -177, -191, 47, 35, -50, 124, 19]
5474A9j31J83j66l0P3J78k70M1J75M8p7k00J23N4N7j09K2n1Q6k76M55k69J51j75
5498h9M6q1J87m89N24n4r2J48m2J9j83L91l59J46r7j14K52j06m0m0O8N0m4M5j38
5523i2L3J68j61J2L7J63k47K9j9K39J22l32K5k7K13L8r7j79J59p8Q7o7J35k64
5547a03j0p7R7L7P8J04p0r9j06M19j7l37J72m8j34K33k03n2l4L19j89n9J79k10
5571a10P0j76L52k43l9J65K2n5O4q2K3Pj97K23p5O6J17Qj42r9m4K11N2k46Q8n
5597d5R2j5J09n42P5J23N40m68m1j49R1J21m7K15k70K39j26L1j03K6J29L31k43
5620G3l66K24L2n9J53O0p3J2O3r6j1k09K29P8j82J85P1j34J40k47j41K25J35j42
5644B0l33K88MJ43r6J18m3n3O5n67N77j72m7k8PK24k00J19q6L0j17L59j4j08j3
$$ y = [19, -112, 71, -95, -125, -52, 126, -144, -103, 72, 120, 43, -157, -34, 20, 77, -32, -10, -61, 25, -251, 204, -65, 86, -89, -43, -124, 63, -426, 98, 44, -48, 100, 58, 77, -106, 285, -74, 72, -25, -139, 113, 7, -33, -73, -5, 45, 1, 46, -92, -59, 109, -52, -40, -3, 160, -87, -58, -77, 162, 284, -48, -23, -50, 163, 201, 104, -75, 84, 6, 93, 26, 161, -103, -113, -190, -93, -56, 22, 126, 56, -43, -149, 270, 253, -84, 88, 40, -94, 139, -64, -116, -150, 169, -20, -79, 100, -110, -40, -216, 136, -107, -146, 19, 41, -14, 50, -32, -9, -2, -199, 24, -51, 15, 132, 140, -2, -101, -145, 66, 118, -128, -40, -45, 47, 32, 141, -401, -326, -203, 337, -131, -172, -321, -230, -109, -156, 59, -211, 28, -98, -67, -170, -144, -15, 316, 73, -293, -69, -37, -96, 57, 117, 44, 56, 119, 23, 12, -197, 32, 110, -72, 113, 184, 50, 190, -57, -198, 27, 162, 20, -313, -25, -21, 122, 26, 144, 101, 48, 113, -454, 123, -49, -96, -124, -117, 107, -93, 26, -60, -30, -147, 212, 198, 90, 77]
5669G7k22J11j0q7J76j3k73J65%P5r6J75j19K4P8p3K95l65J9o6Q3n9O6J14j0j39
5695g4N8J67Qm3Q1p0k36J67q4N9j07K05k17m5P9o8M05k59K38j78j59J06Lj54J83
5720F5j43J07j59K83j35J47N8m54J61jP9JM9l2j44ol2K9R7J31Q0k27o4N7J23O6
5746A36r0p1oK34j13j05Nn5k2Q4o3J31k01L23n3k51J31m4r9O1J74l4j25J77l51
5771b27K1K02k39m8J95J48j21J23m6J05j43J20K2p8K5k80L15j75P3qj06K92%k18
5795d8K57n5j81K04k86kM01j65j5j40J66n0r2J3j83L4n4N0K77k62L64l38j9J68
5819D4m1n9M56p13K49K09k19JK01J52l80L11k00J2r0k12Q4J55k72J46P7L34m2
5842B03k18O1n9R2n8o0J52q3P6j15N3k53K78j07l3K81j96R8j69N1L9n8m2R4nJ16
$$ y = [77, -145, -34, -44, -131, 45, 32, -241, -76, -76, -1, -97, 78, -41, -17, 61, -12, 283, -82, -63, -129, -46, -105, -39, 75, 65, -74, -16, 151, 159, 116, 197, 127, -109, 58, -26, 33, -74, 131, -86, -131, -52, -120, 285, 26, 264, 86, -73, 33, 36, -118, 65, -78, 29, -130, 153, 18, 165, 223, -231, -70, -71, 8, 9, 58, 26, -118, -124, -156, -127, -30, 101, 181, -46, -110, -53, 70, 136, 46, -25, -31, 203, 90, -15, -10, -65, -87, -3, -66, 65, -136, 187, 134, -117, 14, -30, -129, -68, 106, 72, -53, 124, -227, -206, -4, -243, -291, -96, 52, -69, 54, 8, 113, -30, 90, 112, 34, 59, -221, 94, -81, -8, -16, -122, 170, 170, -48, 209, 154, -27, 177, -109, -111, 290, 125, 110, -30, 136, 86, -6, 7, -176, -142, -196, -146, 131, -131, 233, -105, -124, 44, 3, -56, 400, -313, -64, 145, -74, -73, 128, 280, -100, 211, 11, 23, -67, -279, -195, -40, -312, -166, -89, 245, 203, -15, 46, -13, 79, 21, -39, 113, 30, 106, -9, 44, -209, 69, -38, -71, 210, 14, 112, -57, -6, 33, -25, -67, 27, 22, 138]
5868A38j19J26k58R3j97K61J41p2j96R0r2l2j00J26N2j10P4K66k24M6J57k14K57
5891B13n33K06L8p8L46k22J70j98n5Q2j03J09j33K52J6k04R9j26M85m42L7J90
5913A49j80R6R6k52j48K28Q0k3N4j32Q6j31kL13j61j67oj08J63l3nJ83k57K08
5937E1j44J25k60K71J09k95L05l54m4M39l40J29J90j9j62l21K99J10Q3j73J74
5958A73l72J51J77k23L2oK36l16P5L73j98k35J04O8j67K34k64K45k11j05L51l25
5980b03L20m64K94m8J29J72n6O0l08L22k99r6J48J03k39L37j85J03j46J53r4K59
6002B62l25j92J12K59k28Q1J3K63k53K05j58j63K9o2J60P1J21k69K49k6j60J91
6024A80l5m29J34J80O6L5k40J56q7l1J48Q7k28K18n7L6k26J05j13LK30l29L95
$$ y = [138, 19, 145, -113, -20, -217, 44, 185, 113, -83, 7, -85, -117, -217, -91, -39, -149, -75, 191, -33, 13, 170, -44, 213, -320, -114, -76, -154, 192, -30, 140, -58, -113, -31, -134, -25, -158, 94, 110, -94, 5, -121, 364, -78, -41, 149, -31, 65, 161, -91, -239, -11, 69, 46, 100, -32, 54, -77, -79, 234, 73, -94, -100, -208, -45, -78, -83, 100, -157, 51, -93, 32, -228, 43, 152, -143, 162, -192, -236, 203, -137, -8, 182, 163, 1, -320, -21, 89, 172, -1, 173, -199, -48, 129, -94, -62, -68, 168, -148, -73, 300, 102, -133, -29, 39, -128, 106, -158, 87, -124, -229, 122, -203, 117, -347, -53, -101, 28, 200, 144, 204, -104, 218, -81, -177, -29, 74, -165, 172, -13, 90, -56, 97, 3, 262, -63, -255, -143, 116, -112, -31, -18, 245, -8, 197, 39, -124, -95, -157, 3, 74, 195, -74, 175, 149, -11, 180, 145, -284, -150, 30, 96, 131, -109, 47, -40, -71, 77, 164, -64, 154, 97, 133, -93, 12, -101, -98, 132, -197, 198]
6047A98l34K21j37J09k07M35k63j44L98k57J51l09L54k78O4q9J24p4jk56J97O4
6069c4q2J06j35J63L6j7j51P1j82K61M8j62K24j66J25j21J18k71L10j12k02Q3
6091i0K4jK23q1j87J77Kj71K39j06l28L47o8J4j31J30J05k09n2J54J25k29P5K26
6115A88j16L1k72K81m56J69o2K48j17Mk28J85L37k43j47O9J52n5o9J64j92K08
6137G9l73L13nr5O1J68J00j67k25j46K95q6Q9L3j34k8J58j24J05k78K82j20K12
6160A14j5k21Q7K43k20j89J79K66r6m03L09q5Q2j1J57r5O9K6j79N2j58J36R2L6
6184A76m7k03K1P6plP4j15k74K15J36j0j21K26R6j70o3k01p1L55j40l2K1K71m12
6209b02L67l02K9m5K25L0l24M15l82M35l20n9J57k1k32L4J09k7J0J42J46k37L20
$$ y = [198, -136, 85, -52, 57, -150, 285, 22, -122, 276, 19, 170, -139, 215, -63, 1, -88, 36, -38, -39, -295, -98, -34, -116, -10, -145, 18, 54, 37, -114, -43, -225, 36, 84, -78, 146, -20, 105, -16, 102, -169, 141, 29, -173, -90, -66, -67, 156, 75, -112, 65, 67, -104, 135, 29, -299, 48, -20, -6, -137, -7, 98, -111, -163, -9, 116, -113, -38, 188, 72, 103, -169, 112, -344, -175, -237, 11, -106, -102, -330, -145, 192, -51, -198, -129, 23, -32, -101, 63, -129, 79, -294, 19, 14, -81, -20, 148, 248, 81, -144, -290, 5, -81, 8, 41, -93, -121, 37, -87, 18, -260, 22, -98, 114, 99, -122, -35, 208, -12, -201, -22, 244, 148, -255, 54, -31, 51, 40, 197, 102, 171, 197, 18, 70, -88, 48, 140, 176, 129, -74, -53, 23, 16, 13, 87, -28, -302, -87, 49, 39, -82, 144, 240, 70, 7, -194, -265, 90, -50, -82, -61, 210, -202, 165, -137, -108, -153, 72, 102, -222, 193, -189, 246, -74, -133, 24, 3, -229, -195, -86, -113, -103, 39, 185, -52, 268]
6232B68k52K41l66J6K22j40p8N4P5oK0p1J34k06J68j53q9M2J85k6Q8j39o3j24
6256b00M3K60k52J35QK5n2J99j84J80j29m2n4K82j78j73J33j1k11J14J02j08L12
6279A99j5l73K17n2l60K77R0M5o2K02k98R9K0q1j37j65K49L30j66J23r9k78L68
6302A33L08l20n8J15m93L31j80J19j11J8L12j7j88J91j32n2M8k9K94l35J78r7
6324C5m1K8N3k7m2J40k60P3N5n3k5J27j08r4Q0OJ81k20L14j77M5p9J99k24J6j30
6350a28M07j3m99J97j48K90K70l65K1O7j27j97K24M0k0J4j5O8j30J27k61K76k17
6373a19p7L42j97N5j37k9K55j08J23J6r0l6k7JJ4k59N1L19j0l0L85l65j20m9R5
6398Cq0P0K10j87J29m33K46P9r9J09j49J75K5rN3l5k07K39o9j06J98k22k2L20
$$ y = [268, 16, 257, -109, -93, 129, -11, -89, -35, 40, 34, 54, -17, 117, -89, 79, -74, -163, -121, 64, 38, 126, -13, -76, -200, -157, 103, -149, -14, -6, 19, -33, 166, -18, 162, 33, -9, -63, 219, 41, -132, 1, -10, -221, -107, -5, -113, 199, 184, -189, 28, -24, -384, -107, -17, 28, -34, 168, -130, -31, -11, -92, -229, -394, -145, 185, 19, 142, 43, -235, 133, 441, 121, 63, 178, -315, 16, -164, -45, -156, -138, 174, 157, -31, 160, 28, -24, 24, -5, 289, -46, 132, 35, -6, 22, 75, 48, 6, 146, -114, -41, 14, -39, -64, 63, -45, -139, -59, -53, 128, -92, 222, 45, 90, 11, 210, -14, 2, -128, 279, 266, -233, -36, -184, 106, 376, 11, 32, 99, -28, -225, -1, 39, 19, 33, 18, 86, -44, 83, -178, 98, -119, -196, 146, -51, 4, -133, -162, 93, -15, 108, 124, 34, -2, -29, -28, -14, -273, -222, 97, 87, 57, 442, 77, -43, -92, 3, -77, -7, 203, 16, 145, -288, -42, 37, -62, 47, -102, 73, 98, 89, 142, 107, -100, 139, 70, -36, 162, -60, -82, 238]
6422B38k5k91L6R8k21K50j28J14J11k10j43K29j53QL75l54J55j57j37J85j70K26
6444C6q8N3M2j44J11p1l34K34K20p4q6J41Q6k23L12j91l1M8J08K4j06j08Lp7L20
6469B05k23r2j4oK06J3m6j09P7O7R7k64J87j36J72j73l3l15L38J19p6K16p0j33
6493Gp4J06o9J4Ko9K52J2j46l5kJ5j48l0K53j42k8Q0j18K72k96J35j03J09j13
6518a16L50k07m9j28O8L05j62J00j34L3k24J47%M0j63P1K5K80j48j7Rr6k93K83
6542b6j02L40l46K14k36j22M35k57J63j53K68l24M09m58K34P5k9j46n3L54j45
6563I5k9J89k25q5j33jL9J22LN9O6j54J11K3K75l94PJ74k00K1J01j47pj75Q8L7
6589a40J70K3l9j9n3m7L68j99k5J4j19l6J28n8NQQ8q9J52j77J04j43m10N46k11
$$ y = [238, 213, -78, -42, 56, -165, 85, -43, 71, 182, -28, -171, 58, -95, -87, 288, -66, 89, -68, -205, -20, -190, 36, -52, 1, 43, -101, 10, -61, -395, -161, 59, -15, -101, 40, 126, -97, 215, 24, -7, 41, 149, 173, 67, -41, -38, -115, 205, -18, -110, -124, -130, 76, 89, 43, -66, 11, 78, 175, -89, 98, -38, 134, -39, -72, -387, -49, 70, -6, 210, 140, 7, -67, 39, -30, -16, -14, -83, 169, 181, 35, 0, -2, 13, -135, -165, 88, -54, -82, -2, -120, 152, -144, -9, -112, -3, -116, 234, 27, -22, -150, -82, 223, 61, 161, 27, 60, -164, -17, -17, 23, -140, -69, -44, 236, 88, 71, 80, -16, -309, -26, -128, 212, -134, 80, -156, -278, 157, -100, 63, -90, 178, -146, 263, -195, 39, 114, 85, -61, -114, 240, 95, 66, 255, 30, -55, -188, -189, -150, -28, -25, 34, 100, -54, 57, 80, 355, -39, -32, 142, -58, -37, 64, -83, -90, -265, -177, -140, 30, 53, 14, -5, -58, -105, 263, 64, 39, 53, -66, -102, 26, -32, -27, -19, 69, -20, 132, -45, 59, -84, -494, 52, -159]
6614a59L59l87O7Q9J93J67n1k82P7l65K75j97M35k77j40Q6M1j11J73o8j04kL88
6637B07k02nm2k6J91p9m3j97L28j7m57K91nL0N8j28J95j93J48M9k3K7J0O3k15
6662c5n1J47Qj41j55K83j49K6K0l9M7LK2NJ07ko4M0q7L0J64l38L39l02K65j75
6688c2J1J34k7j69N0J17j67O0j57J48j26N4n2J50j00L67l41J32l2j7J15L7p6l6
6712D3O6j62J67k06K0J7J18k6J18N4J31j77N7k99K07j54J99r7j90N4J19j49k16
6735c06J03J16J1k44K79m3j49L07N4j2J29k91J79j31j23K51k76P8j59l0L95j04
6757C4O0j51Kl03M92j26%J04r6j49R5j94K12j26L61p9l2j55J70O6jj94m4j76J85
6782d5K18k53J60k40K44r3j85J4K50l6j6n2J62o5k55j58M30m8O4j8k05J99j5j88
$$ y = [-159, 200, -187, -120, -31, 162, 329, 278, -4, 73, -292, -17, -214, 221, -56, -196, -110, -69, -180, -7, -75, -179, -181, 207, 5, 0, -42, -68, 123, 44, 1, -196, 132, 115, -342, -51, -56, -26, 32, -96, 99, -94, 54, 103, 80, 107, 117, 180, -35, -86, 61, 69, -72, -227, 56, -93, -67, -47, -86, -39, -36, -14, -9, 98, 96, 32, 72, -15, 15, 179, -159, 180, -122, 143, -32, -21, 113, 86, -83, -33, 84, -83, -23, -180, -32, -158, -104, -156, -6, -106, 261, -80, 52, 20, 3, 118, 155, 79, 43, 109, -53, 114, -92, -72, -55, 63, 37, 155, 209, 340, 163, 220, -79, 128, -26, 173, 76, -114, -60, 59, -90, -306, -203, -87, -76, -320, -41, -84, -233, 74, 128, 116, 245, -46, 133, 2, -121, 130, -146, -68, -227, -257, 138, 34, 94, -57, -55, -358, 134, 8, 8, 112, 16, -133, -38, -232, -20, -146, 215, 136, 104, -51, 119, 185, 184, -10, -54, -230, -45, 173, -80, 80, -160, 84, -9, -194, -180, 70, 34, 18, -34, 128, 63, -192, -350, 80, 32, 96, 78, -127, 72, 57, -131]
6806a31R8l3Q6m0N4n8J05j53m4J42nN0o3lJ19q8j37m6L18j84K20k56m5K5j32J52
6832d9q0J12J62L2j14n3k26J38P8j27K67j63j43J87j0j27N3k77N09J12k07K75
6854C49l18J36k47J1N0q2J04LJ39k90L42k5j94k6K91j84l42K33J24k28J09j42
6876a87K14k01R6M5M1J45K9l45J43j42L13J67j80n0J1k5k19R9J19j75%L49m02
6899a55L11j56j00J74j24qR8J85l13R2J65k59P8j1p4J90m4j44K72k83J92k30K43
6922I9j77l7P8J24j58J38P6k60J28j0Q4k96R2J15K02j97Q5M0Kj8k97J19n9R6k33
6947b64L49l6Jo8J7R8j41m0K42m02J05k74L42K13k30P5j14m2L25k4k77J20J28
6970A03rJ06l41L2J22k31K39J36j00j43J92K8o0j27j30J88qk4o2Pk1L18j76j0
$$ y = [-131, -33, -66, 20, -20, 34, -24, 81, -72, -116, 26, 21, 71, 8, 5, 124, 36, -101, -147, 171, -13, 207, -49, -94, -69, -201, -49, -129, -17, 145, 177, 63, 10, -216, -78, 0, -127, 140, -23, -166, 21, 11, -116, -63, -340, 169, 281, 74, 349, 31, 167, -80, -69, -19, -101, 3, 6, 145, -145, 197, 172, -22, -48, 243, 59, -283, -50, 74, -154, -45, -187, 27, -174, -78, -33, 8, 153, 182, -163, -20, -162, 151, 318, 138, 88, 99, 74, -145, -46, 73, -102, -102, 247, -155, 156, 0, -100, 74, -50, -58, 40, 225, -88, 4, 169, -90, -12, -23, -97, 93, 49, -95, 177, -106, 86, -144, 99, -78, -115, -37, 87, -71, 67, 143, -117, 11, 1, 85, -211, -119, -4, 198, 1, 86, 126, 128, 110, -187, -68, -127, -31, -264, 85, 49, 50, -18, -1, 97, -44, -84, 158, -244, -139, -413, -71, 142, -88, -13, -127, -169, 156, 132, -145, -25, 103, 94, 200, -141, -109, 13, -218, 21, 157, 57, -86, 106, 134, 74, -53, -183, 5, -3, -27, -89, -82, -103, 215, 39, 29]
6994B9j4J53o0lj47q0L1O0p4K76j30k78J17l04L87N5j22M56l66j82J66L4R0k76
7018a82L52j64N0O4p1J77k45o6J15J76l17J22l44L97l6j71KK24j3k39j13J72J07
7041cQ9j88M66o25L07j17q2L54m5j67J74p3J14k99J1Q4k14K54k45L16j03Rlp1
7065e7m10L13P8l35L54o2p7K29j90L3K03k81J32P5r2L18k44RK02j01k19J84j41
7088g9K19k22J07K41k97J98l14L93k20R3N0k07J25k72L92k46j25K29N5l51L04
7109G3j04m5M7L1J17N7m34R4J04J16j68J01n2J69j65J09k38K18r4k6L53l04K61
7132B20l95K46o1n8J06k01K95m29L62j63K8K8j76M70o5r1j96r4L36j92o7K08J40
7155B51j31K35m71N0J26j95J46k7j55J86L01k50L3j57k7j33M56l40J46j37N7l3
$$ y = [29, 15, 168, 108, 105, -42, -122, -91, -31, -105, 171, 41, -237, -120, -424, -37, 18, -104, 352, -14, -196, -30, 4, 94, -182, 170, 6, 56, 120, 49, 226, -19, -85, 30, 206, -111, 11, -333, 64, 28, -143, -141, 83, 70, -169, -282, -110, -3, 86, -102, 364, -261, 46, -71, -153, 201, 156, -11, 163, 90, 204, -95, -84, 0, -214, 40, -205, 111, 8, 17, 14, -57, -467, -154, -76, -411, -57, -119, -196, 33, -157, -124, 79, -202, -70, 5, -87, 231, -13, -4, 198, 97, -122, 62, -79, 140, -82, 25, 266, -31, 167, -147, 246, 26, 119, 169, -38, 87, -185, 207, -39, -164, 65, 120, -231, 73, -31, -76, -29, 2, 119, 176, -258, -164, -60, 56, -112, -11, -63, 106, -59, 50, -188, 30, -64, -90, 263, -41, 220, -175, 71, 10, -48, 58, -143, 152, -277, 85, -78, -50, -22, -198, 272, 207, 116, -80, -174, 162, -30, -97, 111, 251, 120, 355, -116, -66, 60, -135, 11, -16, -171, 15, 316, 66, 99, -58, -85, -218, 238, -102, 44, -93, -36, -69]
7177f9pQK9k0M4j24J26q0n5K83m01M35l03K94j28K5nQ8j51j2K91l51mQ8N6K01
7203B58l59l3K49Ll16L8L25Pj92k44M36j06k68J99O8j63J40j10J48j88m4J42J43
7226A33j56j74j18N19n6r1j72M2k03R9J69j94J3J01O0JL19m47J79J37k74J94m
7249G7Q7nj08l3k03J90J93j52k35L71l46K26p9k54M53k94O9q3J83j52l3M1K56
7272A69k40K16j46k13J81m2M5J7J60r2PKk38K20O0r8l9k08L63K9j18Q2j75J27
7296F9j1n9O6m4j80K40r1kJ56j43M2j73M6N0j03l6K34l44K16J07k47M62n2k81
7320g8j04L88k19l4Q2N3q9K25J2N6k55j47J94l05J12J89k35K7Q8j67J02J12j60
7343a53L1P6P4K01K2j74J19m11M25k38J81k63K7K61l39P1M0J82R8k12j50jJ59
$$ y = [-69, -76, -68, -39, -59, -15, -139, -13, -93, -148, 135, -266, 169, -134, 160, 32, 57, 52, 140, -11, -23, 268, -83, -87, 1, 57, 258, -101, -134, 115, 118, -198, -160, 165, 172, -20, -264, 172, 66, -202, -3, 65, -98, 42, -68, 80, -108, -152, -10, 133, -23, -197, -315, 204, 148, 57, -115, -73, -276, -177, -8, -202, -189, -88, -28, -27, 292, -155, 24, 161, -113, 81, 77, 164, 159, 51, 18, -185, 5, 198, 46, -189, 182, -164, 62, -17, -271, 182, -112, -43, -126, 57, -95, -128, -87, 169, -71, 145, -1, -214, -33, -75, -30, -13, 147, 55, 62, 64, -174, 46, 106, 8, -31, -239, 124, 153, 35, 117, -58, 69, 58, -1, 65, 21, -159, 81, -10, -12, 144, 1, 43, -130, -84, -34, -137, -173, 61, -283, -67, 40, -207, 255, 203, -78, -182, 206, -13, -47, 35, 88, -1, 224, 236, 292, 37, -110, 84, -221, -109, 80, -155, -128, -40, -207, -105, 7, -153, -122, -46, 28, 229, 251, 77, 196, -215, 210, -28, 153, -110, -83, 178, -161, -90, -50, 132, 230, 18, -132, -133, 26]
7366B6l5J24j04p9j30L3O9k7K16O8p0K0J0j70j20j14J86j69K90J23l08J7J87k77
7390b34P8K47J1k65L31O7l77k01K30K64kp5j52J27m3k7M6R2k79J16L17k6l79J32
7414bJ16j57K79j98j73J34J66k02n4n0lK15nJ5l33K31Q0n4J4J04o2j49M5j34K58
7439H1r8N2M3k5j51K79k35J40l22K31p2m9J92q8m9JL42l31J3K70j57N5r5j72J55
7464A0j32L41m07N21l22K7K75j67k94J06O5j86L00j43l51M90j77p3J17j34K50
7485A16j81R2p6m6Q3N1j67J06K63j60k10J51M5k74J08J7K81l06l6Q0k7P0k98L49
7509C1j03J32l98K58K11j93J01j31L4r5N7J37l7L7J62k84M5k9n4P9O6M4k38j2
7533a80L20j04J2j49J05R1n8l1l08L96l0m4j03N5O8k40K60j36J55j3j9L8j54L3
$$ y = [26, -9, 115, 11, -68, -198, -165, -96, -123, 93, 161, 91, 111, 121, -49, -169, -283, -97, -266, 24, 147, -161, -144, 43, -234, -156, 91, 102, -163, 168, 235, -142, -343, -113, 151, 149, 74, -78, 49, 6, -21, 25, 117, -162, -46, 271, 245, -134, -2, 114, -43, 236, 38, -135, -1, 165, -37, -91, -141, -144, 71, 66, 81, -252, -21, 59, 5, 19, 123, 61, -88, -43, -177, 81, -17, 35, 78, 53, -98, 181, -54, 86, -236, -5, -77, -126, 66, -22, -71, -70, 272, -59, -46, 224, 67, 122, 27, -145, 10, -122, 219, -188, 333, 11, 38, 313, 146, -148, -42, 23, -163, 137, -6, -357, 133, -44, -117, 0, -134, 116, -65, 27, -49, -95, -12, 39, -128, -22, 241, 81, -129, 22, 67, -207, -99, -82, 199, -107, -143, -63, -90, -20, -318, 31, -72, 60, -338, -80, 131, -62, 39, -92, -58, -153, -96, 41, 4, 41, 203, -81, -36, -65, -119, -40, 26, 70, -168, -180, 140, 36, 48, -101, 4, 95, 37, 6, -302, 94, 64, 20, -83, -28, 40, -200, 60, -76, 79, 66, 47, 85, -69, -36]
7557c6k5K67j43po1JL7o1J18L2k16j62K57K45m81Q1J47K14j23o4j87lQ4K26q8
7582E2o4j27O9l1J90Mm3q6J39k57J64J37j1j83l37M15N5j06o8j03K45j12r8J00
7606e6p3N2Lj08Q3Q1j82J86J04k12J74j54M50m6m33m1J18Q3j01K14j28l1J82j47
7630A8J42m3j77K50j32k04J31Q7R2n7R6l9j69r1%K84k30J38m10L87N9j76k5J18
7654D9k5l7K13j09r8J42k05J13N4j59O3K6P5lJ53k43j35J70j16J1N0J18p2k23
7678a88L53j96L1J7j0m56P97k83J75k73L7k49N4J38N3O0N3j69K8l9L0k41K15J04
7702D1MO9k10L2l57L54J33j96J56j5j77m2J70o7R4K0RR8j87L75m38K28p7k29K44
7727C2K81m91K24j46K03N7k17L8R8N9j56o1m2J50K2j09O1l05J07m0L09N5k53L28
$$ y = [-36, -61, 206, 63, 56, -5, -4, 33, -28, 90, 122, -94, -256, 1, 246, -235, -154, -7, 207, 84, 20, -167, -170, -86, 140, 52, -12, -139, -70, -101, 89, 93, 50, -36, 103, -154, 10, 147, 136, -47, -384, 31, 86, -20, -88, -191, 54, -58, -156, -56, -129, -77, -74, -182, -99, -18, -200, -14, 90, -122, 52, -102, 348, 302, -131, -172, -54, 29, -72, 142, 14, -17, 165, 18, 160, 117, -60, 190, 58, -146, -15, 72, 164, 107, 203, 164, -5, -96, -96, 188, -42, 96, -314, 73, 132, -44, -69, 49, 24, -13, 200, 91, -7, 135, -70, 43, 97, -62, 1, 27, 102, 99, 252, 9, -126, 44, -72, -61, -11, 107, 35, -188, 165, -31, 0, 17, 7, -449, 348, 65, 240, -33, 4, -245, -191, -53, 0, 60, 113, -56, -28, -67, -37, -278, -63, 41, 45, 114, -96, -64, -421, -67, 66, -130, 26, 11, -166, -208, -38, -105, -11, 9, 18, 116, -71, 304, -134, 94, 17, -212, 32, 313, -178, 46, -100, 103, 160, -57, -19, 79, 138, -18, -79, -121, 29, 51, -58, 3, -302, -195, -235, 74, 129, -124, 204]
7751B04m29O0J61j02q0L67m23K30j56J48J23j72Q5j37Q7Q8j55j99K93J04k05q6
7773a94L98o5r3q2p0N7j60J66K9k22L88k80J18nj42L08l14Q0n8K68j78L5K21j53
7797E2O3l71L80j52j57K21O3j97k45K29J12K06P3O8l52J29j15r3j0J59Q8k28P0
7820gj5k15K38J45j70J04k49L8J66J31l35K18K08k96J39j14J31l7J46j7l71J14
7842d8J9j62J07N9j21K06j09p6J87l46R0L33l3j08OL3Qk66J54J57k25K4R1R3j75
7867a02R3J91k89L21m09K26J7k57Q6L63j49J28k69Jo6K69j50R5j21j24J31k37
7889b52L99l16J13N5k84L68k5m07L47J35j26j86K08R7M8r8k36M48o3l45K48J17
7911B45k29M1j91K81n6l24K88l04L45l60L64k1j30K89l43O5J06j3L19l84m2oJ42
$$ y = [204, -225, -165, -4, -106, -186, 181, -242, -12, -168, -20, 103, -69, 16, -121, -34, 54, -101, -300, -7, 97, -108, -194, 204, 139, 46, -36, -106, -49, -209, -43, -14, -236, 152, -128, -10, -15, -157, 151, -163, -83, -141, 127, -51, -16, 205, 52, 115, -256, 124, -28, -185, 36, 99, -98, -343, -114, -2, 204, 277, 345, -7, 122, 7, -86, -96, 63, 151, -77, -7, -22, -237, 1, 146, -24, 80, -169, -131, 35, 166, -169, 49, 257, -39, 100, -14, 117, 80, 226, 209, -162, -48, -29, -191, -84, -25, -146, 60, -49, -125, 62, -284, -194, 139, 106, -2, 4, 37, 45, -221, -67, 90, -135, -111, -20, 73, -102, -9, 182, -107, 214, -195, 31, 48, -209, -123, 240, 91, 219, -50, -49, -115, 154, 4, 99, -22, -146, -15, -252, 147, -169, -56, -1, -285, 83, 58, -349, -2, 133, 7, -179, 29, 126, 174, 76, -160, 288, 225, -120, 128, 245, 16, 57, -134, 147, 91, -233, 55, -249, 96, -264, 100, 79, -51, 238, -105, -40, 66, 53, 372, -12, -54, -60, 82]
7934H2o7J89l37L80m9l62j07M9J42P1P7J23k04l0j28l0j27M41j28R1r1l56K78
7957i3K23j22l8J60M5j75p7K38j95J43j14J32l33J7K64n1P4R0j75K55L5k68j02
7980f7n7Q0j95J76j21J22O0k8k52K80p1R4MR2j68n8J99jQ0j64J33k53j39K95J12
8005A53n15K22K80n9Mj2J94n38L13j81Q8M0K01m06K91p7J07J3j55J76k32J96m9
8028E4r3j28J07Q3r1J38k78K44j85K06j16L05l6n9r7j81%oPJ36j06J20k60O0K89
8053A13j63r1Q6o0J28l9k04K74O8o2M5n3q3J56k71j24L67l56J84j78L24j07K6
8076b0j80K42m7l14K78j76n5K24p1O1P6L5j62j22L70q2m6k7j23l9L41M3k80J63
8100H9k69o1K61L7k87J07O4l29M37J21k77J46k05L22l49L80o2k57M31L1J0n25
$$ y = [82, 15, 204, -133, 247, 198, -164, -271, -222, -80, -9, 68, 191, -13, -43, -171, -201, -328, 113, -15, 76, -15, -371, -93, 130, 8, -30, 130, 175, 0, -77, 161, -34, 109, -5, 127, -206, -189, 75, 24, 98, 188, 13, 268, 303, 35, -67, -124, -44, -239, -63, -184, -62, -2, -30, -282, -2, -73, 21, 25, 117, -51, -109, 90, 89, 169, 5, 138, -115, -254, 41, 153, -362, -140, 140, 81, 85, 73, 267, -271, 42, -139, -51, -11, 190, -216, 75, -2, 105, 118, -37, 139, -93, 103, 54, -39, -167, -60, 23, -68, 70, -208, 36, -149, 57, -59, 246, 210, 151, 54, -127, -127, -133, -126, 10, -96, 24, -236, -176, 113, -50, -141, -55, -115, 13, -26, -230, 44, 112, 50, 95, 42, -41, 115, -156, -280, 87, -269, -85, -263, 61, -46, -20, -200, 42, -5, -319, -41, -217, -272, -48, -119, -58, 18, 53, -109, -231, 139, 57, 11, -16, -139, -178, 163, 206, -74, 89, -180, -241, 20, 57, -230, -123, -59, -388, 49, 170, -107, 39, -166, 156, -193, 187, 125, -132, 299, 330, 340, -185]
8122a85l3L12N2lk75Q1L2o0J42j22K44j03J0k00K27r7j51J04q0J24q8K1o1%o3
8147a72J82J25j8j30m1L7k16J71K16j28q6K08o8j17j64K40k42K90j4j24K32J17
8169B98l68j01N6q9L06j57P7q3L04K4m05J67Jk62L34j72J41j76J05K32l03p1
$$ y = [-185, -218, 94, 146, 143, -132, -51, -19, -79, 63, -59, 185, 82, 92, -108, 119, 22, -129, -25, -105, 19, -69, -48, -109, -109, -172, 10, 135, 117, -13, -54, -17, -233, -62, 154, 26, -60, 148, 80, -37, -201, 39, -203, 87, 73, -51, 181, 298, -70, -171, -115, -204, 102, -55, 22, -61, 243, 267, -138, 29, 30, -232, 102, -70, 71, -105, 0, 232, -71, -142]
8191a42
$$ Imaginary data points
##PAGE= N=2
##DATA TABLE= (X++(I..I)), XYDATA
0@%%%%%%%%%%%%%%%%%%Oj4J6j6J6j6J8k5L1l2L6m4N0n6O4p2Q0q8R8j10J23j37
40g2J52j68J86k07K30k53K78l07L37l72M11m52M99n51O09o76P53q44R50j078J237
61F62j432J686k032K521l266M520o988J3473n7507j25700K47645P7971k61065
74a09512o227K57450o4041k29400J22939J88723j71270j32765J99510P1492k13160
85h6261r099K06295n0156j85630R9164J49029j36613j05076J58896N4787j65247
96f9911n329J57650l9898j35476P9031J03994j05556o4243J22009K2783j24837
107e9783J9912J15708n6939r6197Q7354O8042j08293l4796J16634m24j15546L3643
119c0685J01994o3838q0738Q5704N2181j00389j9828J04179j3232r8539M4731
$$ y = [0, 0, 0, 0, 0, 0, 0, 0, 0, 0, 0, 0, 0, 0, 0, 0, 0, 0, 0, 6, -8, 8, -8, 8, -8, 10, -15, 16, -16, 20, -24, 26, -30, 34, -38, 42, -46, 52, -58, 65, -72, 80, -88, 98, -109, 121, -132, 146, -161, 176, -196, 215, -237, 262, -289, 320, -356, 397, -447, 503, -575, 662, -770, 916, -1116, 1405, -1861, 2659, -4329, 9144, -48363, -174063, 73582, 151553, -109512, -115739, 141711, 77670, -151730, -28791, 159932, -11338, -144103, 55407, 126899, -86261, -95360, 110935, 60779, -124851, -25687, 123342, -13271, -118347, 40549, 95336, -69911, -75240, 82410, 42512, -92964, -13933, 90061, -15495, -79738, 42271, 65054, -59783, -39871, 75837, 18898, -77299, 10055, 78097, -30196, -64992, 51642, 51218, -64328, -30685, 71309, 7471, -73267, 12437, 64618, -35771, -55599, 48580, 35348, -63191, -18460]
130a8460Q4097p0386o0963Q9224L4107r8012l911R8273k4423q7999M9794P0414
142F1755o9168m5801Q0206J7971q3161J0383P6835l8036o2237N9251M0146p3987
154b5843j5114P9861j2743p7218L8362O5648o0602m6432P6531K1922q3367N370
166c3625Q3290l3302p2864N9301N5108p9381k9814R2706J190r6344K8836R1184
178F6285n7430p7212Q1515N5051r9351k7991J07626l019j07267L2785R7019o1159
190F852p8945Q3525N3876r8696k4485J05178n749j03256L5804R3414o1582p4738
202f8802Q2285N2219r5238k4708J00409k908r7380K9997Q6149n3560o8567P1525
214A1421M5343q3985j9528Q7453p251q5215L2551P3905n4912n7438P2034L5961
$$ y = [-18460, 65637, -4749, -65712, 23512, 57619, -40393, -44304, 53969, 29546, -58453, -8659, 61755, -7413, -53214, 26992, 44963, -38198, -27815, 49020, 10984, -51253, 7998, 48144, -25843, -40957, 38904, 26161, -51057, -12695, 52953, -7649, -54081, 22450, 44372, -38995, -33625, 49665, 16363, -56501, 2800, 57908, -21473, -51287, 41419, 42609, -53735, -24899, 66285, 8855, -68357, 13158, 68209, -31142, -59133, 48493, 45474, -61793, -29008, 68011, 6852, -72093, 11432, 65308, -33388, -57873, 47305, 41556, -61700, -25896, 67518, 5936, -68802, 13483, 65702, -29536, -54244, 46165, 43257, -54123, -24126, 62023, 8463, -60104, 11421, 56764, -27221, -46749, 40704, 33453, -51762, -19211, 54694, -218, -57656, 14378, 50339]
226E0339q2488j1488Q5246j2501q0379L6509O9511n5802n1258P0597K9940p8506
238c0280n443P9883j9028p4061M1737O0967o0184m3676P2887K1715p9805N77P8560
251D3849k3621p0822M2531N7040n7969l9146O7837J8244p0656L479O8018k3660
263A5124n8230M1222M4614n3052k7188O0422R063o1540J0072N6957k6682m7319
275c6537L9081L3397m7840j8048N0794J069m9191J4138M2139k8140l1609L7912
287G165J7986m3040l034M3674j1226l9530K4409L1601l3756k0256M0081P873m1476
300a9529N860L9098j8033l2718K8291K3286l5998j1315L9013p89l9686J2883L5585
313B5948k4117k9158L2920J9046l8778p952M0533l522l9570J5097L4773k4772
$$ y = [50339, -32149, -43637, 41609, 29108, -51271, -14762, 54749, -1053, -52311, 18286, 48226, -30280, -35723, 44160, 25132, -48929, -7192, 53775, -6409, -50085, 22802, 44517, -35288, -34711, 43849, 20228, -50594, -8063, 48977, -8992, -48138, 19699, 37943, -32713, -29234, 38784, 15124, -43106, -1884, 42730, -10322, -37510, 22912, 31975, -29565, -19493, 37464, 10782, -36537, 2544, 35941, -11899, -29947, 20847, 21916, -27275, -13137, 29002, 862, -30747, 7165, 25151, -17889, -20923, 22751, 11525, -28005, -3596, 28005, -5751, -26007, 14074, 21947, -19529, -13669, 25429, 7396, -25322, 2969, 26255, -9743, -21058, 17955, 17166, -22520, -9637, 25948, 1831, -27327, 5593, 24639, -14139, -22091, 18442, 14920, -24650, -9553, 25220, 448]
325D48k6850L3134J6520l7522m532L9146p114l6892J8882L1530k8259k3321L5747
338A0917J2576l9466j413M0253j1000l7231K1690L0234l0730k1045L6391R778
350B0954l9591K113L8685j4364l4172K4682K6883l2763j6468L7680N485l8990
362a9866O564L6739j6696l0975K5670K3247l1846j2847L4979K017l4593Q382L1039
375B1814j8088k4964K4846J6485l0053p165L0893k505l0084J1476K5966j8907
387b86j9749K4032J2400k7029l557K8120m639k5800J2701K1544j8205j5328K2903
400G107Q074k4517j002K4700o414k2650J2810J8169j7958j3008K0472O600k2540
413a0157k38K1588o038j9642J1574J5589j5459j0683J8309M842j8763J463J8632
$$ y = [448, -26402, 6732, 23252, -14270, -18802, 20344, 13230, -23662, -4780, 26750, -1509, -24830, 10917, 23493, -15973, -17386, 22867, 11867, -25364, -3674, 26560, -4170, -25215, 11176, 20954, -18637, -16524, 22161, 7797, -26375, -1693, 25190, -7573, -24041, 13639, 19124, -19866, -13302, 23437, 6741, -24234, 1436, 24683, -7163, -20010, 14969, 16986, -17607, -9225, 21814, 3726, -21238, 3608, 20093, -9960, -17125, 13768, 11263, -18821, -7345, 18621, -286, -20035, 3997, 16397, -10632, -14189, 13931, 9292, -16508, -3807, 17737, -468, -15796, 7107, 15181, -9336, -10338, 14362, 7948, -14702, -1892, 16277, -1681, -14689, 5783, 12383, -10157, -10395, 11193, 5155, -14487, -2913, 12676, -2783, -13466, 4843, 9685, -9078, -7615, 11017]
426A1017o540j6030J1672J2603j5264p043J7175J937j7709L456J6202q514j4008
439a1046J2785R301j5598n049J6653j006j6512N882J4899j0869j1723J4576P300
452I593j6454k221J7251k278j6106P333J4026j1455r990J4814N543j6093k21J5995
466I737m993j3762Q528J0713j1976p294J3965K547j4693J773J3456o060j1436
479i495Q949Q563j1469m471J1998R59j1926L118J0553n716q644Q702N984r678
493b573k658J0085J47r734K706Q585n211o791O910M543q164k246Q100m39p892
508d632K576O841m828n097N424L489o785j259P148r12o560K606O087m365m047
523d314N529K863n997j099O743o19o348K375N789m617l907N362K706o764p96O961
$$ y = [11017, 4477, -11553, 119, 12722, -2542, -9585, 7590, 9527, -8182, -4726, 11476, 2962, -11046, 1739, 11040, -4558, -9607, 7046, 6040, -10472, -4590, 10309, -560, -12283, 2293, 9593, -6861, -9082, 8169, 5891, -10215, -2882, 11144, -311, -10301, 4513, 10056, -6037, -6258, 9737, 4744, -9018, -490, 10223, -1753, -9047, 4918, 7465, -7228, -5455, 8001, 1941, -9495, -546, 8017, -3452, -7923, 4075, 5034, -6892, -3774, 6779, 1063, -7581, 1121, 7105, -2573, -5231, 4854, 5001, -4733, -2027, 6558, 1347, -5444, 1466, 6009, -2155, -4401, 3699, 3260, -4632, -2056, 4785, -43, -5140, 284, 3773, -3012, -4271, 2877, 1965, -4595, -1989, 4098, -267, -4314, 1215, 4078, -1919, -3018, 3725, 3106, -3242, -867, 4922, 305, -3602, 1760, 4466, -2298, -3094, 3867]
539C867j825o292L228N063m794l963N698K187o946K54O523j959n566L930M536
554C941n041k681N812J140n695J008N697k714m688M328L142m900j597N179l16
569B615n197J448M469l400l438L815J902m233p52M306q13l926J819L294k443k005
585b539L127J265k926JL003n41k343J365J851j674j030J707L50j832l84J829o61
602E68j465N13J119j166j023J195O97j705k16J322K91j531N13J307n40r94J097
619a8J199j412m80J949L51j896L54J747q08j561J149J170j519j136J846kk214
636a281K50J841j167j084R74J194j822n46K071n18j399J245J187j284q91J862
652F32K12j532K34J926q11j289J358R47j663q53J936k73j659N53J162j041q43
$$ y = [3867, 2042, -4250, -1022, 4041, -753, -4716, 982, 3169, -3777, -3523, 3000, 1041, -4525, -595, 3941, -1100, -3781, 2031, 3171, -2524, -1516, 4181, 1467, -3221, 1107, 4249, -651, -2248, 2931, 2615, -2582, -1134, 3335, -65, -3503, 312, 2214, -2019, -2771, 1535, 722, -3204, -1385, 1909, -534, -2539, 588, 1853, -1073, -1072, 1931, 1390, -953, 412, 2263, 589, -441, 1266, 1616, -216, -600, 1229, 568, -897, -384, 735, -431, -1454, -259, 438, -1267, -1483, -161, 130, -1401, -888, 419, -121, -1115, -18, 1181, -231, -711, 1238, 1589, -307, 47, 1794, 986, -575, 574, 1744, 225, -911, 935, 933, -1281, -1031, 810, -357, -1441, -467, 727, -1095, -1641, 430, -88, -1487, -242, 945, -339, -1230, 632, 844, -688, -454, 1472, 661, -628, 730, 1677, 14, -839, 1097, 824, -835, -282, 880, -161, -1004]
669a004J114L85j335O0P85M3j011M65L86k87k26L33N5k57N49l0r6J12N23k64J30
690D30L15l03j75O8K42j35k38M14l49k71j47J49o9k97j1p5q6K28l7j79Q6L02l75
713e13k86P41L3l58J63Q46j06p31P69N14r04p4P11J22q84L21M64p01k68K9M44
734C32m58j76K71n75K08n7j43k29M53K24m21j92Q99m79r3M85P44r31J54J059l22
755G53p52N64P45j035k90R67l28j013M97N98r68o16J137l94q80K19J063p99o39
774a171J007K73j278N44J308p72q91J024J016j043l56J576k94j287P85J071q86
791F26j155J479K04j784J27J416q33j093R80J69q00m70J057J79j309M79J058p00
809c70r09J307O48j040k09J315L8j071K82J222m99j086O43J148j529l58J381R
$$ y = [-1004, 110, 495, -840, -780, 5, 48, -963, -498, -112, -399, -625, -292, -237, -494, 55, 25, -71, 41, 564, 300, 430, 745, 442, 267, 335, 577, 442, 204, 618, 269, -2, -149, 0, -69, -366, -377, -452, -538, -310, -347, -526, -440, -138, -513, -799, -58, -25, -383, -220, 626, 520, -211, 558, 1072, 168, 94, 805, 927, 43, 364, 828, 127, -141, -112, 332, -126, -302, -31, -606, -398, -455, -598, -827, -374, -150, -571, -763, 136, -343, -436, 49, 793, -138, 16, 1075, 753, 1, 565, 1310, 275, -15, 952, 624, -389, 108, 706, -262, -878, 259, -135, -1015, -796, 267, -532, -1171, -164, 109, -1169, -625, 683, -89, -980, 44, 1060, 17, -339, 1237, 943, -344, 441, 1512, 626, -529, 950, 1154, -630, -503, 913, 80, -1013, -33, 136, -664, -1134, -77, 102, -1207, -728, 330, -370, -1279, 28, 676, -364, -573, 742, 780, -291, -9, 1213, 714, -372, 271, 1419, -110, -468, 913, 922]
827I22j236m31J514l49j451O82J248j132j113J252P75j482o81J945n5j686J179
844i9J118j193j042J923N22j605q9J883o28j932J473J402k026j085K654L7k774
861a461P13K505j878j870K010J433k865m55K998p52k490J625K289k332k093L260
877F37J334l350K13L160j117k593J771K692k758j554L009M53l064M30K901j634
893E30k480K123J703k722j139L018R0l261Q41K915j984k114K513J654k827o46
909a786L089j28k709J130K720k032j865K316J726l128m31K879k71k893J018K453
925B088k131j868K284J735l391o22L077k49l376J299K980k173k200K972J266l432
941a741r7L775p16l424K002K963k578k145L405J219m044Q1M142j519l964K335
$$ y = [922, -314, -745, 769, 420, -1031, -349, 899, -233, -1346, -94, 681, -801, -1482, 463, 408, -1278, -99, 1019, -174, -1216, 707, 1229, -376, -465, 1418, 790, -1142, 331, 1733, -293, -1378, 1276, 1313, -1461, -748, 1757, -121, -1991, 19, 1452, -1413, -1868, 1130, 378, -2112, -487, 1802, -530, -2623, 637, 1971, -1379, -1166, 1994, 877, -1716, 55, 2747, -11, -1565, 1444, 1897, -1167, -737, 2164, 530, -1950, 173, 1876, -846, -1985, 1033, 1123, -2138, -1297, 1618, -366, -2480, 33, 1687, -1140, -1786, 1303, 1175, -1534, -404, 2316, 284, -1581, 735, 2461, -667, -1098, 1781, 1510, -1383, -365, 2088, -43, -1911, 373, 2108, -1283, -1905, 1172, 923, -2453, -1154, 1826, -347, -2547, 425, 1691, -1741, -1838, 1937, 1221, -2203, -201, 2762, 184, -1961, 1444, 2663, -1381, -1300, 2842, 1323, -2641, -306]
957c06L391l865j892L948N80m239L55M296j864l560K798L071m027j367M352M4
973A715m166J644L770k545l203L932J720m076n21M343o54m454K349L426l526k302
989b548L781J099m445Q9M513j615m260K571L854l941j820L876J018m464P11L874
1005B293j657l250K847K707l545j820M141M63l871Q19L546j760l302K735K329
1020B675l545j421M020J21m311J265L606k416l113L239K552m134j094M387R2m549
1036b626J250M354k986k992L666K194m338j086N260o67m275J539M208l167l232
1051b898M107J817m911k13M632j102m743K603L938l892k561M392J049m750O5N258
1067B791j920m482L397L352m158k031M978N32n101J361M878k575m359L968K876
$$ y = [-306, 3085, -780, -2672, 1276, 1856, -2383, -2028, 2268, 404, -3156, -358, 2713, -1314, -2681, 1671, 1715, -2451, -807, 2963, 418, -2785, 1147, 2867, -1209, -1730, 2613, 1959, -2495, -146, 3280, -246, -2548, 1233, 2332, -2113, -2024, 2489, 874, -3386, -815, 3039, -902, -2722, 1154, 2172, -2292, -1581, 2293, 636, -2614, 233, 2940, -605, -2425, 1716, 2179, -1692, -873, 2673, 913, -2389, 346, 2675, -870, -2291, 1729, 1850, -2461, -1196, 2410, -6, -3119, 120, 2672, -1462, -2556, 1831, 1923, -2626, -1376, 2978, -8, -3000, 666, 2860, -1478, -2564, 2696, 2029, -2246, -707, 3501, 334, -2898, 1209, 3026, -1885, -2098, 2534, 1432, -3311, -708, 3230, -662, -3223, 1169, 2218, -2532, -2467, 2791, 871, -3611, -214, 3138, -1020, -3051, 1927, 2459, -2642, -1281, 3597, 1022, -3337, 631, 3507]
1082C507m683j282M760j71n073J851M454l403l130L666K209m879m56M847j015
1097A202m307J998L986l352k678M193J420m349M1M237q09m179K459L563l463k327
1113b365M148Q35m263J38M030j325m056K482L121l401k297M015R46m464M62L997
1129B003j379l703K769K898l354j881M158Q91m264P52L866j896l544L323K606
1144C245m020j229M099J27m501J383L504k163l523L855J819m507o79M644r98l838
1160b782K049L490l218k790M289J194m415K72M562j538m020K818L231l767j868
1175b493M426M44m423P98M156k197l518L127K415l696j468L956J56m173J235L638
1191B383k181l034L248J782l679q69M370m50m087J648L604k775k279L415J363
$$ y = [3507, -1176, -2458, 2302, 2131, -2942, -1091, 3363, -40, -3170, 496, 2705, -2174, -2630, 2217, 1202, -3105, -1107, 2879, -473, -3151, 1042, 2462, -1887, -1846, 2391, 1582, -2597, -138, 3425, -38, -2365, 1783, 2618, -1645, -1507, 2523, 1198, -2858, -376, 2745, -656, -2953, 1062, 2008, -2456, -1994, 2003, 624, -3079, -310, 2588, -766, -2647, 1511, 2402, -1862, -1110, 2756, 860, -2684, 639, 3245, -775, -2004, 2095, 2222, -2279, -896, 2608, 445, -3078, 777, 2596, -1911, -2590, 2054, 1056, -2782, -733, 2757, -461, -3251, 1038, 2232, -2183, -1911, 2651, 1113, -2907, -89, 3142, -625, -2493, 1933, 2377, -2046, -1248, 2908, 711, -2807, 320, 2735, -961, -2429, 1527, 1683, -2490, -1255, 2383, 202, -2832, 416, 2198, -1481, -2350, 2020, 1570, -2517, -869, 2735, -40, -2319, 1096, 2459]
1206B459m151j47L955o53l662J927L013k535k814L671J103l602j80L413p23l501
1222b427J702K819k310k634L583J007l518K21L641j397l032K243K584k985j620
1237b123L635N19l740P2M055j387l344K774K242l403j592L813N28m144O93L703
1253B301j861l454K985J969k928j349L816J44l851J132L385k367k252L012J448
1268B130l180n43L543l44l527J890K641k773j699L104J024l364j9L092j285l421
1284b731K601K043k800j297L157M0k915M18K954j248k330J975J899k534o47K821
1300A406J66l069R03K390j078k172J831J422k151n98K388m78k361Q71J967j382
1316E5j934K065J153k383k75J953j81k137J093J940j294j490J706J308k498j32
$$ y = [2459, -1692, -1839, 2116, 1463, -2199, -272, 2741, 206, -2608, 1063, 2166, -1436, -1616, 1797, 1074, -2427, -725, 2094, -216, -2850, 733, 1740, -1778, -1557, 2084, 687, -2345, -102, 2482, -503, -2123, 1512, 2031, -1709, -1637, 2418, 1031, -2313, 461, 2703, -700, -2292, 1521, 2049, -2095, -1402, 2301, 440, -3014, -29, 1940, -988, -2337, 1479, 1623, -2228, -1096, 2289, -78, -2330, 682, 2130, -1050, -1593, 1950, 1606, -1921, -31, 2610, -163, -1862, 1242, 2266, -1098, -1117, 1975, 690, -2731, -130, 1913, -887, -2184, 973, 1013, -1902, -1484, 1470, 222, -2108, -133, 1766, -768, -1415, 1406, 1572, -1497, -594, 1796, 718, -1454, 377, 1799, -352, -950, 1438, 960, -1401, -530, 1437, 55, -1879, 186, 1339, -1044, -1319, 634, 453, -1684, -591, 1349, 55, -1435, 271, 1579, -919, -1051]
1332a051K324o7k465J339J634j556j757K263Q55k624N2K284l73k475J315J549
1348A247j734j167J965N81k163J43K385r19k046J566J699j921j141K396P6k074
1364a107P35J659q17k014K027J171k110o88K258j7k371Q54J854j591j111J497
1380B29J084k366j97K137l57j696P17J603j545j073J812O94k142K8J987n51j461
1397a097R64J338j106o87J520J56j658K76J288p71j030R06J105j180q06J139L22
1414F79j530j2J360m87j287P14J188j033q13J292O11j315O7J573m66j198O81J115
1432A139j203o02J421N0j262J09J117k10j184R31O60j110o38J219J4j016n4J050
1450D31m14j218J223O01j324l35J585oj268M06J141o53j069J437L25j167j42J269
$$ y = [-1051, 1273, 1206, -1259, 80, 1714, 158, -1599, 664, 1519, -1105, -1053, 1231, 858, -1617, -302, 1247, -487, -1654, 311, 892, -1271, -1128, 1257, 338, -1708, -142, 1557, -364, -1505, 891, 967, -1107, -372, 1287, 470, -1544, 483, 1654, -456, -1144, 1114, 1097, -1274, -420, 1434, -157, -1268, 229, 1313, -1053, -1250, 887, 530, -1166, -449, 1154, -391, -1464, 348, 1042, -1100, -1072, 915, 364, -1097, -133, 1205, 99, -588, 932, 1088, -570, -294, 994, 223, -807, 99, 1204, 24, -782, 357, 679, -851, -863, 497, 10, -1277, -563, 625, -408, -1221, 71, 682, -633, -566, 1007, 541, -657, 24, 1139, -64, -666, 755, 805, -457, -348, 769, 559, -625, 306, 966, -144, -782, 437, 451, -565, -619, 431, 17, -1201, 22, 623, -701, -1036, 549, 543, -725, -319, 822, 169, -900, 537, 862, -305, -447, 822]
1468H22k31r82K73R45q86p01R29J47p57J1Q30k47j114R45L13q25J3L59K03o48
1488f01N21N14o70l5L07N38q96J6Q10j29n57L04M98l67m67L03K49n01j47N24r0
1509A24n46P2L15J56p35K87M80n18k89O18N37q83K17K12L10o72L77L85k50j95
1529BN07J53p44J8O28j03p32K83L54n42j89N92K87j122J50P98m54l57N49K47m05
1550h0o38J020k38o09L70O07n53n22R70K4m26j73J000n78j53K56M63m89l54M81
1570C78k07m30K23K35k18p5N4m2P1l69M15J2n32J72L21o8j93k0M74n1k10K21l4
1593A27o7q5K99P3k26Q5m1K45m62j0N84n12l82M24J15k21k65Q2L20l30J18J19
1615a0k03k03L95K27n26PO46m7m26K02K72j48l33M07K69p84J56M84k57l46M20
$$ y = [822, 591, -391, -118, 827, -59, -760, 169, 316, -441, -430, 400, 153, -961, -16, 297, -528, -515, -156, 47, -601, -80, 434, -236, -271, 36, 574, -322, -306, 504, 375, -182, 122, 620, 253, -214, 89, 338, -163, -310, 214, 124, -422, -350, -35, 121, -614, -327, 153, -365, -654, -36, 501, -382, -165, 47, 357, -315, 62, 447, 197, 2, 509, 662, -82, -64, 564, 461, -271, 12, 366, -176, -365, 227, 514, -608, -458, 340, -114, -471, 78, 325, -80, -718, 302, 64, -545, -175, 432, -121, -643, 327, 351, -75, -248, 752, 174, 21, 277, 740, 251, -103, 378, 171, -259, -36, 199, -19, -94, -40, -82, -11, -380, 35, 47, -485, -313, 8, -60, -253, -273, 201, 150, -60, 161, 127, 60, -25, 274, 347, 121, 206, 165, 410, -52, -62, 522, 10, -372, 52, 167, -54, -319, -237, 83, -247, -129, -10, -213, -416, -21, 206, -320, -313, 333, 286, -140, 62, 334, 186, -147, 260, 529, -255, -99, 385, 128, -218, 202]
1636B02L02p31k33M93J4o63L77M84l51m88M16M19p52K34L60J29n70K32L99j84
1656H9k21K47o5k52N03J84np29O41j43l20k36J45K52l06j49M20J24m36J08j44
1677b93L22k71k8J99j70J95j3N6jl2L70k27l53N33K38m01j83L97l3n19J75L82
1699C43K7o63M98j23l13J82J19J93n37N7N8K9k26RM77K0k51O17l60n38N99K08
1721D25l03m33N82K25p00L82O12n06n38J70L92n06k33P87l83l10K26O28n87m20
1741d90M46L01m60r4O95k65o27J81K48P8k08M69m4j74L0P7N4l19L87J6l03K47
1763B45j06o8j23J79j80L14n48L55j44j25Q3l0J73k26m1J80J14l32K1J67L82n18
1785b28L26N16l94k56K97j2j05j46K82p8m33M87K6r4j26nM2m00o1K60j61k26K69
$$ y = [202, 504, -227, -460, 33, 47, -616, -239, 245, -106, -594, -178, 241, -511, -277, 83, 212, -358, -126, 273, 89, -132, 115, 50, -202, 301, 485, 480, -249, 392, 249, -71, -307, -162, 90, -216, -365, 55, 179, -257, -149, -293, 29, -242, -270, -71, -241, -46, -59, -3, -4, -36, 334, 107, -246, 287, 525, 124, -59, 338, 305, -214, -39, 343, 370, -293, 205, 82, -231, -49, 70, 263, -274, -217, -159, -130, -356, -347, 130, 150, -101, 516, 156, -382, 217, 425, 122, -311, 271, 496, -204, 178, 790, 284, -254, -84, 308, -198, -431, 356, -27, -337, -111, 517, -70, -490, -44, 257, -203, -297, 398, 133, -494, -313, -65, 13, -195, 274, 230, 56, 86, 163, 217, -102, 285, 301, -2, 245, 139, 71, -52, 127, -53, 261, -287, 68, -76, -201, -118, -148, 25, -201, -242, -62, 52, -280, -259, -92, 290, -228, 98, 614, 220, -36, 261, 249, 144, -2, 280, 202, -231, 256, 282, 188, 62, 57, 99, -301, -362, -102, -263, -489, -220]
1808b20K80l47j31N13j83l81M52K59J1k59K13k5l39J33M93j7k71j37L64l75k1
1829A2J20K9j24k80L19k07j0K59j66k53L04nj45R2m2J05N2n9J53j29j9L10J0k70
1853E6J52J02j2j55M0m4l7j83K9P2P6j05j28L3j2l0m9M7J44m73J88L92k60q7K91
1878D7L5j21k04M08j78N5K2Q8oo6p6%J10l23M17j55k14J30J98m52l4J10L14l08
1902b03j24L02j34m1K54O6r5j83L61k31r8K98J22o6l64Q1J96l1j5J57j41M7q7
1925G1J96j59k6J57l10J74J24j30k4j55n6m4j29m5K21n6Q6p4P8o3J64K00j90J63
1949A73J0j13K03j39m12L65J64k81M4J11O5k78n6K0K77l87J06j91n1o8J92L81
1971A35n62R8M76j20j69l1M87k85j91N17l75j28J26O36n59k25L80J29o29R7M32
$$ y = [-220, 60, -287, -418, 95, -88, -469, -17, 242, 253, -6, 207, 182, -157, -24, 469, 452, 181, 44, 408, 33, 12, 132, 161, 37, -243, 76, -131, -141, 118, -48, -301, 3, -2, -147, -55, -97, 8, 60, 1, 154, 25, 6, 316, 326, 56, 208, 310, 298, 143, 183, 139, 102, -81, -52, 20, 96, -9, -137, -104, -116, -146, -195, -148, -4, -477, -289, 103, -157, -244, 47, 82, -39, -243, 165, -13, 42, 64, 152, 146, 80, 4, 4, 114, -209, 208, 53, -161, -31, 167, -285, -319, -209, 105, -203, -327, -25, -159, -200, 54, 120, 25, -158, 203, -28, -126, 172, 294, 228, -136, -55, 141, 110, 95, 252, 111, 158, 71, 267, 108, 82, 239, -71, 103, 227, 97, 73, -82, -138, -182, -311, -356, -135, -191, -105, -179, -101, -164, 0, 200, 10, 173, 183, 70, 273, 134, -278, 87, 251, -30, 14, 125, 190, -88, -144, -124, 153, -234, -128, -319, -370, -438, -246, 135, -427, -329, 147, 27, -142, -173, 314, 29, -162, 355, -20, -148, -22, 614, 55, -170, 210, 339, -290, -193, 239]
1992B39k05n2m0J45j25l92K74K06n96J24L27m6l76K94L17j1m41M45K95m13J29
2013I8N52k72k77l8N3Ol16M50o8l8k28M7R9l33Q5L86m06j08M11l0m22K16K97k63
2037i9j73L89L83k48l08M72R4q53K10M45j93l29L61M01l63n13P83l80l18q4N07
2058A84n06k70L97M15m23k18P85m4n27j42O09k99j83K93L96n70k8O0J61l18L74
2079A46K49o42j5N29l1n04J41O18l60k73J80L80p82q9N04M4k03j99O88n27n9L45
2101A40n5l42J29L94j87l90L31K58m8l16J44L81j89j61J87O0l85j17M45j38o14
2122d73K24O63n06l23L75j32l6k47P12m00k44M97m6k37qK17J11n03K21L37k40
2143c8k15L50L37l44l89N06j94j21K70J57m42k84L11L27p65K92M92k57n47M57
$$ y = [239, 34, -18, -58, 87, -38, -430, -156, 50, -546, -422, -95, -141, -517, -223, 94, 83, -358, 87, 382, -31, 98, 650, 378, 101, 63, 116, 122, -194, 256, 188, 150, -78, -31, 68, -265, -180, 206, -200, -308, 103, 73, -349, -133, 164, -99, -272, 117, 500, 252, -56, 416, 510, -343, -133, 312, 119, -210, 151, 552, 189, -324, 459, 79, -239, -323, 184, -322, -592, -195, 220, -203, -421, 364, 320, -207, -349, 260, -39, -222, 71, 467, -103, -131, -71, 90, -228, 146, 395, -247, -262, 267, 236, -268, -127, 491, 131, -142, 38, 418, -364, -453, 51, 95, -108, -307, 381, -146, -205, 140, 85, -257, -128, 266, 79, -311, 20, 278, 230, -86, 58, 439, 250, 89, 276, 336, -49, -166, 279, 141, -473, -249, 414, -92, -415, -40, -172, -208, -455, 257, -143, -387, 110, 64, -173, -181, 36, 147, -356, -135, 202, -38, -253, 97, 434, 90, -299, 207, 13, -108, 162, 319, -123, -407, -96, 231, -534, -242, 250, -7, -554, -97]
2163i7M29o02p2M74J05k82j23M86k25o47P47J53o28k6O16m6l51M2N92l80o52M90
2185CL30m66l9L98j81n14L18J27k85L0J41L17n61J12N79o7n19J61O04o27O2L54
2207B77K33o30P4L93lm33n2M25o05K78L24j54m03J62L1K06l90m7N27n31N9M95
2229B36J81m96j46L54J40m42P6K54j07k91L48K30m07j95O65l67k82N34J43q01
2249c73J06N31j89l64R7J97r4l42M61L25n72l31M94J78k77p5L82k95l57R53j45
2270C10n86M3R80l59n76M67J15o16J2K47K20l77k6N85j27o26n1P92m61k51K11
2291g4J85k70K16K23l33m98N42M34m79j13M45j54j66j25M34j20k61K57K07l94
2311d4j1L93l8k51K0J05l04l1K54m6k23Q3K60m3n86K81J53j86m7M05oMl68L20
$$ y = [-97, 332, -270, -342, 132, 237, -45, -168, 318, 93, -554, 193, 346, -282, -308, 308, 262, -89, -47, 545, 165, -487, 3, 333, -133, -172, 226, 45, -469, -151, -24, -309, -279, -138, 179, -382, -270, 309, 242, -277, -116, 488, -139, -77, 277, 510, -120, -46, 347, 344, -89, -141, 284, -321, -43, 281, 127, -276, -114, -83, 123, -267, -314, 213, -318, -259, 236, 417, -79, -225, 129, 269, -173, -97, 157, 50, -241, 107, 337, -70, -265, 400, 33, -249, 285, 428, -373, -267, 264, 75, -289, -192, 5, -89, -431, 30, 355, -217, -548, -54, 124, -153, -228, 154, -141, -498, 455, 310, -276, -233, 747, 388, -188, 279, 394, -222, -210, 37, 257, -120, -146, 439, 312, -314, -365, 427, -34, -285, -74, 111, -159, 57, 280, -53, -551, -9, 425, -54, -167, 278, 124, -42, -167, 267, 147, -114, 143, 350, -44, -55, 338, 300, 49, 69, 174, -130, -161, 93, 47, -176, -93, 167, 124, -462, -181, -28, -214, -261, 144, 138, 142, -226, 94]
2335I4Q6k86k7K20nm9M8J48m11K27K79j61n33O2M41j70m04M78L20q26R2O15m14
2358a76j36K46M48m43k37L97J69k50k72O13k25k08K24p8j9rN3J62n25J70J41k75
2380b30R3JK68n26J44L64k29o4K80j7l5m80O01J33j69l87L74j65MP3M60l86j1
2403I6R4J10k11j16j37L08l14K2L62j99k03O4J81m10J11L45k78j27K87Q7j36j25
2425a89J30J18L49o23M22q9l52M42K03j14l76L01P3k99k44M08J87l70P4J95k08
2446C8l50J10M31l89k3J40N2m27K67N74p18O4L12j07j77j23O20l54l2M73r2l26
2468c7J03J70l62LJ62nk78L26L58k38l01k65N38m12k9m3L64j63k29O3O9o4K64
2491fO5Pj11l1L27o2j97K67L4k41m4p1J98J19k41j95K12j81J79j14oj00j36K76
$$ y = [94, 180, -106, -133, 87, 82, 33, 81, 229, -182, 45, 324, 163, -370, -308, 133, -37, -441, 37, 357, -469, -377, 238, -176, -312, -66, 382, -61, -298, 99, 268, 18, -254, 359, 134, -74, 150, 72, 53, 44, 97, 259, -266, -96, 45, -230, -137, -136, 132, -394, -250, 114, -115, -179, 101, 84, 49, -431, 170, 303, 134, -253, 121, -44, -40, 33, 493, 107, 96, 190, 300, 89, -27, -164, 144, -170, -148, 214, 15, -188, -124, 57, -353, -242, 103, -175, -302, -15, 72, -64, -189, -59, 59, 408, -215, 207, 118, -234, 208, 411, 297, -79, 222, 295, -4, -248, 160, 347, -23, 51, 246, 38, -312, -202, 229, -160, -183, -43, 9, -418, -151, 423, -295, -231, 81, -26, -203, -326, 294, -60, -92, 381, 289, -37, 66, 236, -126, -123, 39, 34, -244, 82, 440, 202, -99, -364, 174, -238, -267, -310, 54, -109, -338, -275, -206, -270, -6, 59, 66, -45, -76, 251, 189, -8, 259, 293, 52, 8, -63, 135, 254, 13, -182, 30, -151, 28, -86, -92, -192, -328, -52]
2515e2m25K00N1M33n04K38J6k77J63L17P8l34K01K5o0j32J45J17o0l50M94k86
2537bk6J23q8j14j42K0L78l62L1K55k78M2o6K7J23R1J54p4m25O6M75j61j82K21
2561H6N9q7j56J30L70o60K19K20j41q4K47k46l56L69K5j81J69k00J18Q4j57p7
2583b49K39q2k84N33q2m4K0j44j5m8J04K26j73J23Km3K73k85N3Q2j80P0j0q7l66
2608c67L79m3j91J81n1nj46J20L42k05k37p1M54k29k78N48n1q4m9J12o1k59M76
2631B85p9k98K3J16K1k14R1L11l56N5K43J8m26K89P3l40O6n1R3oJ89l2l7l22M25
2656A37L0l82R5qL50j04J25r0P7n98O80k88K7jn5j85J57O3j01N6J12k69J48J86
2680A62k66J21J65l65J15K20p4k7Q4j14J26K26j8J8n04J75J04J17j00l76N14k17
$$ y = [-52, -477, -277, -226, 207, -297, -59, -43, -320, -157, 160, 238, -96, 105, 130, 70, -62, 83, 200, 140, -210, 284, -2, -28, 95, 7, -107, -249, -229, 149, -213, -182, 73, -205, -163, -229, -202, -79, 12, 166, 92, -333, -267, 208, 47, -135, 86, 145, 58, -98, 32, 402, -258, -39, 181, 40, -44, 203, -43, -399, -30, -5, -186, -17, -217, -99, -15, -172, -249, -10, -92, -376, 157, 75, 31, 51, -93, -108, -156, -52, 174, 1, 124, 126, 83, 356, 71, 124, 206, 26, 96, 86, -1, -367, 12, -31, -222, -41, -92, -97, -243, -123, 219, 14, -223, -294, 160, -69, -347, 201, 150, 66, 17, 129, 68, -191, 285, 206, -92, -69, 47, 68, -146, -55, 256, -100, -45, 198, 216, -210, 79, 152, -188, -122, -173, -80, -86, 103, 71, 34, -288, 137, 167, -215, -120, -128, 222, 118, 243, 153, 230, -368, 312, 24, 51, 50, -5, -190, -33, 30, -71, -15, 97, -172, -24, 162, -104, 17, 182, -183, -68, 152, 78, 51, 135, 21, 147, 373, 355, 373, -131, 44, 148, 265, 165, -211, 303, 86]
2702H6l05Q7K50p39L01M84l60Q7M0J55k30J72o4nK49k97R0j14j32l3L66j41K3
2725c0Kjj6J63J66k19M8r8M2p2j15L61l71k16J89K16l2l06P4K88k38P4J99r1J09
2750A26k19K02R5k58J65j36J54j39N1J09l47J87K99m22J28%o1J06J90j14k15j31
2772b30J88j06J90j5k05J90o5N9lr9j23L6P4K01j29Q9Kj95J6J29J26p8L5p3K3
2797C7j51kJ83Mm45N56l69j0K11K67j48k51K20k63J72k37N44k89k32J26J68O0
2819A51k79M35nl40K61J97j63l52K74j11J14l58L83Q3m41L36l13K2OJ96j75m2
2841a21o8K41j61j03L8K34m5k5l9j22J68j34O7l2L91k78j09P0Jj22K10l54L14
2864B1O4Kj20j31K81j65l8J6l1j56J36J04j58j9K39RO4k71K55J12j19q8q1L39
$$ y = [86, -219, -132, 118, -621, -320, 164, -196, -109, -69, 86, -144, 28, -36, -41, 208, -89, 1, -113, -245, -278, 88, -53, -30, -28, -29, -45, 118, 284, 65, 113, 15, 57, -15, -130, 231, -140, -356, -167, 49, 17, -289, -215, 73, -165, -91, 108, 17, 126, -93, 109, 204, -54, 111, -25, 129, -10, 41, 150, -197, -10, 289, -133, -5, -5, -66, 40, 230, 116, -99, -230, -42, -148, 42, 27, -178, 12, -53, 6, 3, -96, -219, -183, -109, 92, -37, 52, 54, -141, -125, 4, 130, 52, 87, 14, 37, -114, -116, 67, 71, -374, 182, -187, -197, 14, 281, 133, -118, 102, -161, 11, -226, 318, 29, -203, -77, 91, 151, -128, 307, 302, -38, 223, 420, 257, -95, 179, 68, 182, -176, 207, 290, -151, 185, -128, -106, -100, 96, -79, -121, -189, 52, -109, -212, -174, 60, 15, -10, -49, -171, -3, -137, -70, -102, 289, 11, -98, -28, -27, -149, 61, -293, 21, 85, 87, -33, -164, 117, -48, -86, -70, -101, -257, -121, -17, -175, -194, 45, 54, 118, -153, 102, 214, 95, 7, -74, 265]
2888B65kj91m9r3N4J02K29k25j46J21J18k42j62R0M3j28L66k88J38K3Q3j78m2
2911a14j63L10K3k71M31k97q3l5K51j62J69j27K4k7O5K75k42J19j40l7j8R4Lr0
2935d2m8k37L31P1j5k62L36l88M14L5r6p0j40J80J20j76k8L06j35n6j02K39N7
2958B94l14J85m42K06%k57M47k80J72N4j14j56R1O8L6q3N2L16l13R9p2J17k93
2981a87O5L38j11j95L12l49L8J61j51J5J10J05j96j97M65j02j88k0L9Pj58J19
3003h0oK45m22K44J69k15K25J26l01J4K1J4J92k70M06k81j56K4J30k10K78j01
3025D6j27k9J44k14K73j43k6J32o5l2j39J76K3o2mQ3Oj80K47j05j20R2j97K71
3049E0k32K77J36l85K31j87mj00J44j81L09m04K28M0o3j90J73K94k19q9K63j76
$$ y = [265, 263, 72, 23, -70, -16, 86, 315, 90, -56, 65, 183, -59, -221, -131, -88, -216, 150, -138, 0, 23, 106, -72, -114, -277, 33, 56, -215, 216, -81, -164, -199, 52, -110, 59, -68, -44, -71, -6, 269, 27, 146, 6, -31, -49, 45, 48, -42, -90, -327, 4, 75, 60, -202, 134, -254, 160, 195, 99, 29, -111, 69, 189, 13, -15, 291, 156, 100, -2, 237, 294, -20, 165, -277, -71, -71, -328, 119, -161, 11, 65, -49, -205, -114, -46, -10, -93, -41, 275, -38, 61, -11, 106, -187, -122, 216, 105, -90, 222, -127, -89, 72, -79, -64, 46, 151, -45, -242, 223, 121, -67, -87, -48, -41, -199, -80, -86, 159, -263, -19, 150, -65, 160, 286, -15, -1, 20, 34, 226, -44, 362, 81, -75, -51, 79, -131, 147, 46, -81, -110, 34, -180, 93, -50, -76, 56, -9, -41, -180, -4, 19, -43, -47, 36, 42, -138, 109, 4, -116, -24, -221, 50, -182, 95, 231, -154, 77, -110, -114, -214, -70, -251, 58, -346, -118, -78, -141, -331, -158, 136, -83, -172, 91, -85]
3071h5J13npj6k14J63L55r4p2R3m1j50J60nj00j7J62k50mlJ63k06K40k19K0l84
3097d03R5K12O0j10K24k24K45j45j24L75q8j72K61j91P4O3j67K14l00%L21m2j99
3120b1P6j45M9J45P6j73j78L08k74K00k34o2K50j51L17k50k0J37kr2M6j37K1M52
3144C38l98J51j08k36L19p9P6L00k68k34J37J62o1J24o4j85k64L53j94k15J54
3165a92M16m64P5L88l04r0L35j52j05p3M60r2m03K64J13Rk11M07r4l31J8L28l43
3188d1N8j8J1m1J0K82l59k05J64J70j84L08j88K12l19MK51k9N1j84K67k06M1R1
3212A46J86k78k91K79P9j66N9J11j16L4Q3k2l13L34p2j98J05l6m8l1L7K12O2j75
3236a9m8K40m0m05k5L22J33k87J86p1M17n58K99j01Q0k76K94j20l83Q2L51k56
$$ y = [-85, 28, 23, 16, 0, -214, -51, 304, 210, 138, 231, 190, 40, 200, 195, 95, 78, 240, -10, -14, -17, 146, -60, 180, -39, -19, -403, -308, -96, -36, -146, 78, -146, 99, -46, -170, 205, 117, -55, 206, 15, 89, 152, -15, 199, -101, -101, 220, 178, -21, 55, -90, -41, 104, 180, 7, -171, 137, -137, 63, -171, -233, 17, -134, 183, -67, -87, 50, 48, -44, 2, -135, -114, 338, -60, 91, -17, -253, 66, -13, 63, 363, 95, -139, -2, 160, 99, 223, 159, -26, -290, 63, -131, -346, -192, 224, -240, -165, 223, -81, -171, 164, 12, -93, -166, 294, 202, -201, 63, 176, 185, -26, 381, 287, -44, -26, 302, -41, 17, -1, 10, -31, -21, 261, -98, -303, -139, 31, -153, 155, -33, 179, -140, -136, 115, 86, 137, -47, 220, 14, 55, 146, 332, 54, -237, 42, 121, -45, 14, 125, 9, 43, 126, 104, -209, 125, 53, -145, -40, -76, -124, -155, -118, 94, 156, -19, -67, 173, 133, -272, -297, 25, 158, -129, 57, -14, 403, -155, 144, 43, 123, -153, 141, 21, -362, -280, 71, -185]
3258a85K6J09Q2l07J53J98j62J4r2K18j4o3Q7k8k21M92j44k42m5K35R9l63n1M00
3282A96l01Q1L09k88M5j72j51M78l29J29J60J35n56M31l81J74mK07k84P3n3K07
3304A06L1r4K01l16J81n4Q9q5j99K81p1l05J85r7M34m26J64J30j46o6j54K42k67
3327b36J80J49l3n2p4J21K54l99J77k97M34q7k6K63m70J17Q1P3p6J60j02l49j1
3350b03J26L5l28K92J56k86K2P3n5q7l4Q9O1j23L52k66J63J8J05P5k6j43K10k12
$$ y = [-185, -159, -50, 32, -275, -122, 76, -86, -72, -164, 54, 40, -23, 64, 36, -185, 307, 163, -79, -124, 111, 210, -153, -204, 196, -105, -24, 285, -3, 42, -130, -281, 197, -132, -3, 157, 292, -264, 167, -214, -40, -44, 163, -121, -48, -101, 106, 137, 43, 244, -72, 109, 55, 144, 59, -140, 141, 70, -235, -50, -147, 287, -139, 25, 155, 9, -57, -211, 31, -236, -56, 93, 60, 8, -66, 55, 309, -90, 87, -210, 224, 137, 111, 374, -96, 21, 102, 175, 99, 259, 157, -192, -203, -77, -42, -370, -78, 78, -208, -186, -113, -168, -255, -289, -200, -139, -262, 90, -176, -13, 5, 110, 185, 159, 16, 226, 14]
$$ [...]
8191a51
##END NTUPLES=NMR FID
##END=
