##TITLE=1H_Ad=o(bat1)-cryst-ACN-pr
 CDCl3
 8 sc, 
 22.12.2022
##JCAMPDX= 6.0         $$ Bruker NMR JCAMP-DX V2.0
##DATA TYPE= NMR FID
##DATA CLASS= NTUPLES
##ORIGIN= UXNMR, Bruker Analytische Messtechnik GmbH
##OWNER= root
$$ XWIN-NMR		Version 3.5
$$ Thu Dec 22 14:13:45 2022 Russian Standard Time (UT+4h)  she@DPX200
##.OBSERVE FREQUENCY= 200.13135
##.OBSERVE NUCLEUS= ^1H
##.DELAY= (6, 6)
##.ACQUISITION MODE= SIMULTANEOUS
##.ACQUISITION SCHEME= undefined
##.AVERAGES= 8
##.DIGITISER RES= 18
##SPECTROMETER/DATA SYSTEM= spect
##.PULSE SEQUENCE= zg30
##.SOLVENT NAME= CDCl3
##.SHIFT REFERENCE= (INTERNAL, CDCl3, 0, 15.7039)
##AUDIT TRAIL= $$ (NUMBER, WHEN, WHO, WHERE, WHAT)
$$ ##TITLE= Audit trail, XWIN-NMR		Version 3.5
$$ ##JCAMPDX= 5.01
$$ ##ORIGIN= Bruker BioSpin GmbH
$$ ##OWNER= she
$$ F:/spectra/data/she/nmr/H-F/1/audita.txt
$$ ##AUDIT TRAIL=  $$ (NUMBER, WHEN, WHO, WHERE, WHAT)
(   1,<2022-12-22 14:12:17.70 +0400>,<she>,<DPX200>,
      <created by zg, POWCHK disabled, PULCHK disabled
       configuration hash MD5:
       00 E9 B6 7A A2 85 ED C7 34 08 36 98 17 FE 4E 26
       data hash MD5: 16K
       35 21 EF EF C2 71 E8 26 1F CB DD 1D D5 4A C6 86>)
$$ ##END=
$$ 
$$ hash MD5
$$ 1A 2F 89 8C 71 47 F6 B4 20 7D 46 CF F1 5A 7D 0C
##$RELAX= 
##$RELAX= 
##$RELAX= 
##$RELAX= 
##$RELAX= 
##$RELAX= 
$$ Bruker specific parameters
$$ --------------------------
##$DU= <F:/spectra>
##$EXPNO= 1
##$NAME= <H-F>
##$PROCNO= 1
##$TYPE= <nmr>
##$USER= <she>
##$AMP= (0..31)
100 100 100 100 100 100 100 100 100 100 100 100 100 100 100 100 100 100 
100 100 100 100 100 100 100 100 100 100 100 100 100 100 
##$AQSEQ= 0
##$AQ_mod= 1
##$AUNM= <au_zg>
##$AUTOPOS= <>
##$BF1= 200.13
##$BF2= 200.13
##$BF3= 200.13
##$BF4= 200.13
##$BF5= 200.13
##$BF6= 200.13
##$BF7= 200.13
##$BF8= 200.13
##$BYTORDA= 1
##$CFDGTYP= 0
##$CFRGTYP= 5
##$CHEMSTR= <none>
##$CNST= (0..31)
1 1 145 1 1 1 1 1 1 1 1 1 1 1 1 1 1 1 1 1 1 1 1 1 1 1 1 1 1 1 1 1 
##$CPDPRG= <>
##$CPDPRG1= <>
##$CPDPRG2= <>
##$CPDPRG3= <>
##$CPDPRG4= <mlev>
##$CPDPRG5= <mlev>
##$CPDPRG6= <mlev>
##$CPDPRG7= <mlev>
##$CPDPRG8= <mlev>
##$CPDPRGB= <>
##$CPDPRGT= <>
##$D= (0..31)
0 1.2 0 0 0 0 0 0 0 0.06 0 0.03 0 0 0 0 0.0002 0 0 0 0 0 0 0 0 0 0 0 0 
0 0 0 
##$DATE= 1671703937
##$DBL= (0..7)
120 120 120 120 120 120 120 120 
##$DBP= (0..7)
150 150 150 150 150 150 150 150 
##$DBP07= 0
##$DBPNAM0= <>
##$DBPNAM1= <>
##$DBPNAM2= <>
##$DBPNAM3= <>
##$DBPNAM4= <>
##$DBPNAM5= <>
##$DBPNAM6= <>
##$DBPNAM7= <>
##$DBPOAL= (0..7)
0.5 0.5 0.5 0.5 0.5 0.5 0.5 0.5 
##$DBPOFFS= (0..7)
0 0 0 0 0 0 0 0 
##$DE= 6
##$DECBNUC= <off>
##$DECIM= 32
##$DECNUC= <off>
##$DECSTAT= 4
##$DIGMOD= 1
##$DIGTYP= 9
##$DL= (0..7)
0 120 120 120 120 120 120 120 
##$DP= (0..7)
150 150 150 150 150 150 150 150 
##$DP07= 0
##$DPNAME0= <>
##$DPNAME1= <>
##$DPNAME2= <>
##$DPNAME3= <>
##$DPNAME4= <>
##$DPNAME5= <>
##$DPNAME6= <>
##$DPNAME7= <>
##$DPOAL= (0..7)
0.5 0.5 0.5 0.5 0.5 0.5 0.5 0.5 
##$DPOFFS= (0..7)
0 0 0 0 0 0 0 0 
##$DQDMODE= 0
##$DR= 18
##$DS= 0
$$ [...]
##$SUBNAM2= <"">
##$SUBNAM3= <"">
##$SUBNAM4= <"">
##$SUBNAM5= <"">
##$SUBNAM6= <"">
##$SUBNAM7= <"">
##$SUBNAM8= <"">
##$SUBNAM9= <"">
##$SW= 18.05172834244
##$SWIBOX= (0..15)
0 0 2 0 0 0 0 0 0 0 0 0 0 0 0 0 
##$SW_h= 3612.71676300578
##$TD= 16384
##$TD0= 1
##$TE= 0
##$TE2= 300
##$TE3= 300
##$TEG= 300
##$TL= (0..7)
0 120 120 120 120 120 120 120 
##$TP= (0..7)
150 150 150 150 150 150 150 150 
##$TP07= 0
##$TPNAME0= <>
##$TPNAME1= <>
##$TPNAME2= <>
##$TPNAME3= <>
##$TPNAME4= <>
##$TPNAME5= <>
##$TPNAME6= <>
##$TPNAME7= <>
##$TPOAL= (0..7)
0.5 0.5 0.5 0.5 0.5 0.5 0.5 0.5 
##$TPOFFS= (0..7)
0 0 0 0 0 0 0 0 
##$TUNHIN= 0
##$TUNHOUT= 0
##$TUNXOUT= 0
##$USERA1= <user>
##$USERA2= <user>
##$USERA3= <user>
##$USERA4= <user>
##$USERA5= <user>
##$V9= 5
##$VALIST= <valist>
##$VCLIST= <CCCCCCCCCCCCCCC>
##$VD= 0
##$VDLIST= <DDDDDDDDDDDDDDD>
##$VPLIST= <PPPPPPPPPPPPPPP>
##$VTLIST= <TTTTTTTTTTTTTTT>
##$WBST= 1024
##$WBSW= 4
##$XGAIN= (0..3)
0 0 0 0 
##$XL= 0
##$YL= 0
##$YMAX_a= 172493
##$YMIN_a= -207878
##$ZGOPTNS= <>
##$ZL1= 120
##$ZL2= 120
##$ZL3= 120
##$ZL4= 120
##$ABSF1= 10
##$ABSF2= 0
##$ABSG= 5
##$ABSL= 3
##$ALPHA= 0
##$AQORDER= 0
##$ASSFAC= 0
##$ASSFACI= 0
##$ASSFACX= 0
##$ASSWID= 0
##$AUNMP= <proc_1d>
##$AZFE= 0.1
##$AZFW= 0.1
##$BCFW= 1
##$BC_mod= 2
##$BYTORDP= 1
##$COROFFS= 0
##$CY= 11.3945322036743
##$DATMOD= 1
##$DC= 2
##$DFILT= <>
##$DTYPP= 0
##$F1P= 2.36226072786647
##$F2P= -0.459571619588291
##$FCOR= 0.5
##$FTSIZE= 0
##$FT_mod= 4
##$GAMMA= 1
##$GB= 0.15
##$INTBC= 1
##$INTSCL= 1
##$ISEN= 128
##$LB= 0.24
##$LEV0= 0
##$LPBIN= 0
##$MAXI= 10000
##$MC2= 0
##$MEAN= 0
##$ME_mod= 0
##$MI= 1.114404
##$NCOEF= 0
##$NC_proc= 0
##$NLEV= 6
##$NOISF1= 3.799351
##$NOISF2= 2.8
##$NSP= 1
##$NTH_PI= 0
##$NZP= 0
##$OFFSET= 15.70392
##$PC= 1
##$PHC0= -19110.57
##$PHC1= 21.40073
##$PH_mod= 1
##$PKNL= yes
##$PPARMOD= 0
##$PSCAL= 0
##$PSIGN= 0
##$REVERSE= no
##$SF= 200.130013532006
##$SI= 16384
##$SIGF1= 3
##$SIGF2= 2
##$SINO= 400
##$SIOLD= 16384
##$SREGLST= <1H.CDCl3>
##$SSB= 0
##$STSI= 0
##$STSR= 0
##$SW_p= 3612.71676300578
##$SYMM= 0
##$S_DEV= 0
##$TDeff= 0
##$TDoff= 0
##$TI= <>
##$TILT= no
##$TM1= 0
##$TM2= 0
##$TOPLEV= 0
##$USERP1= <user>
##$USERP2= <user>
##$USERP3= <user>
##$USERP4= <user>
##$USERP5= <user>
##$WDW= 1
##$XDIM= 8192
##$YMAX_p= 0
##$YMIN_p= 0
$$ End of Bruker specific parameters
$$ ---------------------------------
##NTUPLES= NMR FID
##VAR_NAME=  TIME,          FID/REAL,        FID/IMAG
##SYMBOL=    X,             R,               I
##VAR_TYPE=  INDEPENDENT,   DEPENDENT,       DEPENDENT
##VAR_FORM=  AFFN,          ASDF,            ASDF
##VAR_DIM=   8192,          8192,            8192
##UNITS=     SECONDS,       ARBITRARY UNITS, ARBITRARY UNITS
##FACTOR=    0.0002768,     1,               1
##FIRST=     0,             0,               0
##LAST=      2.2672688,     0,               0
##MIN=       0,             -207878,         0
##MAX=       2.2672688,     172493,          0
$$ Real data points
##PAGE= N=1
##DATA TABLE= (X++(R..R)), XYDATA
0 0 0 0 0 0 0 0 0 0 0 0 0 6 -8 8 -8 8 -16 16 -16 24 -25 32 -40 47 -54 64 -72 81 -96 109 -125 144 -162 185
34 185 -208 235 -262 295 -328 368 -408 456 -505 560 -618 682 -751 832 -916 1009 -1111 1224
52 1224 -1349 1488 -1645 1820 -2021 2250 -2515 2828 -3203 3662 -4238 4984 -5998 7459 -9746
67 -9746 13874 -23612 96169 -31538 -203669 115087 146764 -119339 -111895 141927 62363
78 62363 -131451 -33254 126685 -4634 -111197 22863 95283 -51950 -78051 59887 54194
89 54194 -75400 -33832 69869 13321 -66612 473 53955 -6570 -41446 12662 31328 -8680
101 -8680 -15580 10259 7991 801 6309 -5472 -10158 19537 14859 -29320 -12483 37786 3901
114 3901 -44096 2392 40783 -15310 -40972 19460 30862 -31269 -26747 35421 14502 -43764
126 -43764 -3519 47033 -9222 -47246 24212 47448 -33005 -37970 46095 33166 -47527 -19264
138 -19264 52306 12028 -47865 -221 43800 -8256 -35652 14443 23340 -20780 -14354 18276
150 18276 328 -19517 5299 12470 -15108 -9508 16912 2052 -19055 2247 17977 -5716
162 -5716 -13405 11655 11375 -12312 -1727 17251 -3872 -14072 15640 13839 -22291 -7162 31142
175 31142 928 -36669 6292 37936 -17690 -39528 23853 32868 -34213 -29055 37253 17010
187 17010 -42183 -7641 40849 -5166 -37686 16077 32536 -24087 -23628 33621 16775 -35885
199 -35885 -4711 40737 -1857 -38132 12757 37097 -18776 -30963 24814 23687 -28630 -15597
211 -15597 27256 4859 -26511 961 19134 -10479 -15024 12840 5152 -17189 870 16268
223 16268 -8068 -14625 13783 11496 -16216 -5332 19800 1430 -17212 7033 16333 -10252 -9400
236 -9400 16562 4971 -18800 2379 21057 -10809 -21564 17691 17574 -26259 -15072 29819 7004
249 7004 -35217 -1512 34142 -8203 -33127 14536 27564 -20651 -20518 25581 13739 -26420 -3946
262 -3946 28555 -2141 -24642 11881 23268 -15738 -17419 21943 13376 -23519 -7448 24508 1344
275 1344 -23995 2303 19794 -8129 -18108 9047 10711 -13114 -6886 11404 -398 -10947 4338
288 4338 7593 -8054 -3632 11085 815 -10237 4391 11465 -5765 -7130 9710 5815 -8983
301 -8983 -847 10021 -1855 -8299 5647 5698 -9154 -3456 10011 -1611 -13078 2798 11141 -8681
315 -8681 -11885 10450 8041 -14054 -5657 14437 1329 -13883 3417 13324 -5832 -9027 11007
328 11007 6868 -11169 -219 13322 -2225 -11477 7533 11470 -10294 -8501 12808 5065 -14859
341 -14859 -2684 13589 -2446 -14512 3866 11013 -8702 -10183 9514 5342 -12425 -2186 12485
354 12485 -2066 -11653 6445 11859 -8961 -7402 12959 5827 -12397 -254 14100 -1486 -10971
367 -10971 5665 9616 -7203 -6593 8178 2583 -9397 -746 7073 -4029 -7960 4291 4213 -8421
381 -8421 -3444 8453 -322 -9340 2543 8390 -4493 -6581 7546 5898 -7710 -1417 10079 313
395 313 -7620 4435 8202 -5616 -5293 8398 3321 -9619 -651 9130 -2430 -9755 3176 7050
409 7050 -6716 -7496 6015 3846 -8215 -3418 6845 388 -7091 1190 6792 -2597 -4412 5019
423 5019 3938 -4534 -389 6642 254 -4688 3046 4685 -3139 -2576 4644 1141 -4756 178 3244
438 3244 -2885 -3561 2212 399 -4839 -569 3041 -2578 -4223 2755 2329 -4648 -1474 5151 889 -4887
454 -4887 1349 6074 -1120 -4056 4161 4943 -3574 -2269 6139 1978 -5786 331 5979 -2342 -5650
469 -5650 3480 3513 -5515 -3739 4731 710 -6816 -810 5003 -2192 -5421 2357 4052 -3288 -2640 4441
485 4441 2334 -3438 32 4752 276 -2736 2572 3817 -1658 -1364 3346 1575 -3493 -309 3212
500 3212 -838 -3379 903 1517 -2879 -2167 1560 -479 -3020 -95 1058 -1469 -1078 1482 360 -1250
516 -1250 702 1679 -385 -112 1955 1617 -641 236 2368 339 -1494 953 1922 -1334 -1264 1537 446
533 446 -2549 -947 1608 -1107 -3281 29 1700 -2353 -2463 1919 862 -3717 -805 3085 -39 -2784
549 -2784 1478 3136 -1206 -1386 2750 2167 -1477 -149 2920 962 -1857 177 2293 -524 -2488 873
565 873 1590 -2067 -1878 709 -82 -2291 -1206 1145 -513 -1889 -31 833 -729 -796 682 617 -535
582 -535 414 1255 546 462 1115 622 321 918 491 -187 -6 700 148 -317 55 415 -604 -1101 -345 -54
602 -54 -1115 -1139 35 129 -1331 -679 1017 -258 -1101 595 1248 -464 -209 1451 1196 -178 735 1787
620 1787 494 -238 592 1222 248 -676 584 357 -829 -515 331 -268 -969 -575 -134 -854 -995 -493 124
639 124 -725 -729 481 413 -646 87 760 278 -222 845 943 157 457 607 585 328 236 309 115 130 220 78
661 78 -347 -213 -461 -231 -359 -705 -387 -803 -393 -334 -404 -563 123 -59 -166 56 410 259 -118 531 853
682 853 387 10 803 910 165 52 674 603 -707 -106 767 -275 -818 -216 -131 -472 -895 -430 274 -847
702 -847 -949 -416 338 -488 -455 557 624 -481 123 914 245 -71 696 840 619 75 475 767 38 139
722 139 531 121 -96 -336 -257 185 -408 -1249 -61 112 -724 -1049 47 138 -1048 -495 509 301 -769
741 -769 56 675 -62 138 757 1094 288 -19 818 1072 -23 -173 590 1135 -483 -376 650 89 -883
760 -883 -640 313 -352 -1083 -461 -187 -785 -1098 -205 5 -454 -419 -144 432 -6 127 400 599 174 -1 532
781 532 726 219 -200 578 442 -66 75 287 88 -318 -578 -213 127 -908 -800 118 112 -1092 -632 593
801 593 -259 -1382 -81 534 -251 -740 677 1232 -168 -221 1470 954 -594 225 1313 305 -362 230
819 230 1042 -421 -1043 613 470 -968 -760 214 80 -1106 -669 484 -380 -1496 -158 576 -519 -689
837 -689 329 340 -211 36 682 314 419 446 252 387 549 644 6 309 557 106 -619 57 280 -718 -620
858 -620 24 -104 -1189 -916 551 -421 -1542 -206 744 -803 -1120 883 1018 -578 -342 1446 780 -965
876 -965 79 1961 92 -780 1156 1327 -704 -837 1246 697 -1580 -536 935 -234 -1453 -118
892 -118 543 -1124 -1342 215 407 -963 -711 833 -149 -1040 293 648 -100 -300 1146 606 -480 572
910 572 1100 108 -197 940 779 -328 -10 842 -139 -749 293 463 -1136 -589 455 -616 -1589 -70
928 -70 835 -842 -1235 631 714 -1103 -298 1244 676 -1037 325 1870 178 -671 1318 1614 -1122 -640
946 -640 1736 800 -1168 -88 1470 -550 -1302 441 650 -1745 -1068 790 -43 -1737 -349 772 -761
963 -761 -1318 639 916 -694 -491 1258 657 -865 161 1244 -287 -313 994 1008 -693 -99 1220 -12
981 -12 -1017 709 787 -1315 -721 1111 -18 -1527 -175 809 -950 -1487 540 527 -1491 -619 1472 20
999 20 -1253 408 1648 -519 -901 1187 1026 -976 -197 1979 447 -1323 483 1703 -762 -1554 1189
1016 1189 629 -1679 -965 1575 -332 -2003 -56 1137 -1067 -1718 744 953 -1543 -723 1510 134
1032 134 -1298 458 1183 -572 -773 1507 915 -702 73 1409 47 -929 692 1210 -1131 -852 878
1049 878 152 -1637 -333 1218 -846 -1598 651 618 -1581 -663 1418 -70 -1495 474 1292 -781 -673
1066 -673 1509 808 -1098 233 2086 170 -1361 1120 1527 -1010 -1109 1554 771 -1645 -466 1610
1082 1610 -634 -1725 350 1244 -1302 -1487 1098 418 -1876 -273 1684 -411 -1610 826 1390 -845
1098 -845 -977 1455 592 -1419 342 1764 -137 -978 1037 1287 -857 -695 1380 406 -1362 60 1142
1115 1142 -893 -1219 507 693 -1581 -974 1144 -193 -1419 163 866 -988 -788 1189 789 -1236
1131 -1236 128 1485 -176 -1281 966 1227 -867 -200 1609 696 -1112 -116 1435 -697 -1557 734
1147 734 990 -1560 -1056 1120 49 -1811 -143 1279 -778 -1434 748 1036 -1090 -544 1474 265
1163 265 -1348 368 1661 -217 -809 1399 1177 -1186 -321 1620 574 -1204 304 1092 -645 -904
1179 -904 808 411 -1214 -652 844 -503 -1574 327 835 -1134 -946 1019 365 -1281 123 1404
1195 1404 -469 -952 866 767 -835 -455 1503 514 -1129 719 1353 -650 -815 1321 765 -1371 -616
1212 -616 1450 -181 -1625 258 924 -1007 -1088 974 524 -1430 -529 1466 255 -1359 454 1525
1228 1525 -449 -824 1045 708 -1151 -148 1735 169 -1032 326 1263 -564 -861 924 536 -1102
1244 -1102 -525 787 -304 -1470 -97 395 -949 -808 827 97 -1103 -212 658 -180 -751 444 940
1261 940 -721 74 954 379 -600 651 1171 -402 -460 666 756 -1221 -114 962 -189 -1055 362 862
1279 862 -930 -678 849 16 -1305 -341 817 -296 -1215 98 1102 -570 -881 932 898 -858 124
1296 124 1359 178 -643 514 1077 -362 -520 1070 430 -995 -154 616 -502 -1108 103 188 -963
1313 -963 -831 411 171 -1117 57 771 -554 -453 534 126 -429 83 599 149 -132 606 533 -142 -190
1332 -190 629 220 -302 235 710 -386 -879 347 186 -826 -641 661 -147 -1197 -201 622 -621 -1365
1350 -1365 461 509 -867 -376 613 -61 -832 345 978 5 -998 666 791 -124 -84 754 175 -666 -96
1369 -96 827 -18 -902 333 237 -595 -755 270 83 -778 -130 447 -550 -309 548 390 -76 24 264 110
1389 110 -324 456 523 -53 268 462 227 -209 324 541 79 -399 213 236 -489 -396 362 -90 -765 -243 320
1410 320 -640 -844 195 471 -723 -531 512 -82 -532 189 819 -86 -227 395 545 -268 -25 518 376
1429 376 -259 -22 622 -53 -313 313 310 -476 -331 328 149 -615 -96 110 -464 -436 74 -66 -252 -220 287
1450 287 209 -371 93 480 -11 102 240 303 -42 152 454 227 136 143 99 -81 16 168 67 -200 -330 150
1472 150 -9 -523 21 -62 -333 -347 342 -84 -446 -56 274 -167 29 267 331 -166 374 627 276 -88 338
1493 338 173 -51 -354 362 238 -555 -253 242 -195 -399 116 94 -304 -537 78 255 -347 -273 333 -222 -241
1514 -241 -205 486 148 -124 255 416 84 -184 370 413 213 96 477 210 4 81 288 133 131 -37 -282 16
1536 16 -442 -255 -8 -122 -173 -86 -359 23 144 -297 -66 40 -57 -4 159 206 120 -25 243 330 277 2 264
1559 264 272 -77 254 379 -51 -384 107 253 98 -173 -78 103 -566 -336 151 -9 -86 -146 99 -21 -227 42
1581 42 200 122 -170 231 469 3 247 356 483 -103 -21 382 -77 -323 112 218 -151 -259 -215 20 -114
1602 -114 -347 222 -181 -7 -305 -95 -87 201 -13 -131 135 165 -92 105 320 126 -208 44 312 313 473 341
1624 341 270 135 -257 -190 28 -238 -221 -6 -100 -238 -302 114 -267 -539 -143 -25 73 -315 -126 34 146 -109
1646 -109 323 42 70 12 373 211 93 -46 406 108 -232 275 161 -81 -145 148 47 -315 -270 98 -180
1667 -180 -265 -128 151 -207 -61 -147 7 -62 43 -172 -185 -34 92 -14 489 -58 57 139 -78 420 106 -12
1689 -12 120 93 38 -102 191 -191 -360 56 131 70 -297 -214 169 -231 -370 117 76 -242 -394 101 242 -255
1711 -255 271 159 278 -212 206 256 175 -44 288 406 9 -115 222 84 -142 -267 226 -10 -214 -113 283
1732 283 -174 -367 -91 -43 -149 -331 157 28 -107 -199 56 -46 17 416 226 -206 29 387 57 33 411
1753 411 157 95 115 311 74 -178 13 -44 140 -212 -108 -106 -251 -6 112 -193 -276 169 -104 135 148 183 76
1776 76 12 89 136 -146 56 132 54 14 77 259 31 -3 -20 276 -116 139 -227 158 2 -269 48 -152 -331
1799 -331 16 -225 -33 -213 165 471 -3 -73 -38 42 -104 17 42 210 250 17 0 217 110 -75 -117 77
1821 77 -93 159 81 -204 -2 -233 41 -245 -213 -414 -161 -250 -153 18 96 37 12 324 134 214 54 65 42 4
1845 4 154 -43 162 52 0 137 255 61 -395 -270 -260 -356 -293 -53 -11 20 -75 -136 32 4 -249 84 -82 -248
1869 -248 44 -278 -64 173 406 378 -17 78 -1 333 -108 -6 183 -112 20 188 181 -16 -44 130 132 59 -5
1892 -5 149 169 48 -41 16 7 -1 -12 100 -138 -175 61 44 24 20 -94 151 9 114 426 259 111 -64 111 -52
1917 -52 -21 -26 36 -23 -155 -48 80 -7 -22 -126 -51 -235 -115 -34 -10 -283 -67 24 -40 418 -269 -164 -60 -48 -66
1942 -66 159 106 -19 131 -15 90 -96 245 231 81 32 -181 72 -2 -358 -219 113 -108 -185 -131 225 -152
1964 -152 -333 105 38 43 384 189 -232 -48 -164 107 180 26 51 290 -105 66 33 205 110 -97 -8 -132 -151
1987 -151 -322 43 126 -53 -175 -39 -189 -208 -59 -27 181 -1 -186 282 82 -122 -61 -112 63 182 -27 103
2009 103 41 314 -149 199 -55 -57 -175 45 4 107 -226 -53 20 -47 -11 121 -242 -267 0 -96 -131 -24 385
2032 385 148 -65 -68 226 -14 145 250 184 -98 283 123 165 251 31 19 10 -146 122 -13 12 -17 0 -249 -262
2056 -262 42 -168 -31 -9 -3 49 -157 116 -14 141 144 74 163 151 301 22 143 95 223 262 -190 286 196 95
2080 95 -97 17 58 -129 17 -153 169 -279 -127 34 30 -558 -109 231 -120 -317 62 195 83 -236 293
2101 293 197 -95 -51 266 93 164 293 252 213 -141 -32 -130 -232 -224 69 -51 -156 -41 -121 -172 114 12 -44 91
2125 91 -142 26 -242 -122 226 -69 -11 -141 79 -259 108 199 457 -76 -47 -139 266 114 -160 -102 83 -190
2147 -190 179 -62 -20 -303 210 -107 -311 -14 -11 -191 -195 -37 -167 256 -263 17 176 -128 153 242 -36 -145
2169 -145 80 433 -42 42 272 420 6 174 70 244 -439 115 132 -215 113 111 67 -423 107 -103 -211 -90
2191 -90 151 23 53 -92 -134 -81 80 100 -33 43 -61 158 19 -23 -137 -12 67 198 299 35 -141 102 48
2214 48 -60 -100 61 111 -122 143 51 108 44 148 138 70 -24 315 270 106 -125 201 180 -86 87 322 -76 -151
2238 -151 95 320 139 -295 46 168 -49 -77 -96 -72 -64 -50 -38 -195 -336 -36 -37 201 -36 -168 91 -20 199
2261 199 320 -129 -324 -153 50 214 91 -15 153 138 -228 314 -152 -27 37 -418 -24 52 -24 -184 -51
2282 -51 205 -112 -254 -101 25 175 51 213 -133 93 141 134 190 -70 25 25 -15 -81 161 242 -154 99 213 226
2306 226 -275 -52 -127 -31 3 154 5 8 -67 -157 322 -73 -257 119 220 -36 -14 217 113 56 -107 105 -8
2329 -8 27 72 31 7 108 9 216 -77 140 166 142 -111 -52 -40 -237 -25 108 -224 84 134 -64 26 110 -62 114
2354 114 -194 162 88 -58 138 157 139 -41 111 327 107 113 372 -187 -176 97 100 119 -9 -32 86 -216 58
2377 58 -43 -149 -93 -265 -60 -19 -78 319 89 89 22 -49 123 -103 93 -79 -278 -37 14 44 -169 167 271
2400 271 -147 -237 31 -45 73 -92 76 6 -187 -188 -56 -50 -66 -45 -27 -53 -105 119 74 -51 31 16 95 63 -72 -14
2426 -14 34 -124 568 -41 26 -175 198 -106 -9 96 150 -28 -338 78 -106 -166 -173 153 -58 -348 133 132 36 -284
2450 -284 173 219 -7 -107 -99 285 -119 25 113 264 10 -23 126 200 -89 -60 -140 -18 -33 63 42 120 51 75 -252
2475 -252 -6 -100 153 146 68 33 -236 188 -120 84 238 101 -36 -56 153 91 -109 86 108 12 77 252 66
2498 66 173 27 -113 59 -231 -29 -8 -29 44 114 127 32 -121 -135 -193 198 -135 -26 128 -121 -31 219 162 155
2522 155 32 44 -169 211 -57 18 116 -8 -239 14 268 11 86 49 162 43 68 -91 -142 -322 -97 -145 -235
2545 -235 -24 -28 -212 -192 161 5 -72 -51 41 177 -47 -104 -79 118 -39 50 107 176 -323 -118 -89 -98 44 -147 -51
2570 -51 105 99 14 118 174 77 42 162 -6 -9 179 149 245 -6 -35 152 52 56 20 211 -257 88 -107 268 143
2595 143 55 88 -47 -35 -118 78 211 58 -138 -141 84 167 -65 42 -10 -369 -252 -42 -38 140 -19 -74 195 80
2619 80 153 18 44 164 15 42 46 142 -46 69 -93 20 71 9 -90 -177 -106 -104 -76 -139 -61 -34 -17 68 46 -210 -206 178
2647 178 -157 -83 -108 313 -7 -5 -48 -35 84 -3 -139 172 -42 13 -106 212 72 -93 81 42 -157 -101 -78 -33
2671 -33 -133 -135 225 -84 18 -102 -101 -161 -5 -39 -132 122 -68 6 12 -19 65 77 -32 145 -105 38 245 -226 98
2696 98 161 95 -98 12 -54 -246 61 -223 -137 90 -69 140 82 133 114 112 -121 -66 153 114 -50 -45 -205 143 -62
2721 -62 -5 -29 10 59 2 203 -90 40 -45 -95 -130 -27 3 -48 104 84 292 88 226 127 -2 36 -46 -222 -286
2746 -286 -25 78 -47 -118 -98 299 110 39 141 -192 150 -95 -121 119 109 -13 102 -91 -333 -331 20 -182
2768 -182 32 -252 21 20 62 6 -75 135 14 -169 216 25 -66 160 -107 -270 -230 176 161 -139 9 172 -42
2791 -42 -197 -37 39 28 -20 -195 -15 -30 174 -161 226 64 -80 25 69 71 313 100 -112 -183 -300 -97 -107
2814 -107 57 -208 12 24 -67 102 -7 -86 80 8 167 -114 117 -107 -232 -233 -10 129 68 -44 -127 -62 132
2837 132 128 -73 139 -231 95 180 -1 24 -78 153 81 -26 -108 28 -13 -143 -70 -150 26 124 -290 44 324
2860 324 108 51 84 61 0 129 -236 -159 -184 -43 -123 -80 -52 -108 -8 200 -229 -102 -143 85 -107 -8 -13 -107 176
2885 176 188 182 -64 59 175 -70 -70 148 -24 -131 -182 160 -96 -259 -45 -73 -395 172 34 4 79 -199 -199 -39
2909 -39 61 104 248 -124 10 256 54 -2 88 73 24 55 153 -61 -68 -194 79 -105 124 191 136 108 -104 -141 76
2934 76 -94 -51 -144 -174 50 98 49 -101 -43 -84 344 183 117 269 -31 -61 11 -78 -122 210 -105 -21 -276 229 -16
2959 -16 -87 -73 -4 -24 33 -128 128 23 287 195 -33 67 161 75 85 144 -41 -145 -147 79 -56 3 -33 100 246
2984 246 47 221 -44 -62 -55 -93 -71 -172 -30 -68 184 -147 -4 -76 -27 -136 -117 16 140 -212 4 -32 -42 -103
3008 -103 -45 20 -64 139 -44 146 -2 -50 161 -100 237 113 14 70 -158 -126 -34 -53 -161 76 -111 -31 -242
3031 -242 -74 -25 -52 89 -21 -128 155 -245 295 24 144 37 -266 -264 94 -141 -173 57 -289 209 -33 44
3053 44 -17 -123 247 238 -200 157 115 -206 95 -322 61 -117 42 8 205 -69 127 35 245 181 -228 166 18
3076 18 -96 -51 5 -75 -35 -28 -20 -45 -57 240 -197 69 -89 -110 235 -140 -173 -57 -51 -20 53 -102 97 -44 45 -74
3102 -74 -13 0 7 124 171 196 -8 28 -13 97 -45 185 -107 -61 69 34 50 162 26 -277 55 -327 -297 -15
3126 -15 55 22 -74 95 190 124 -153 54 -113 37 49 -75 -130 -12 -241 -180 -154 19 -42 -144 56 -26 101 244
3150 244 -143 52 -53 -19 -210 30 -83 177 120 178 108 126 -125 278 162 -49 -109 110 -93 6 -177 -25
3172 -25 -22 40 -47 137 163 -106 168 -167 135 41 7 29 -53 -12 -48 -158 -9 -327 -231 -55 82 55 -85 90 -98
3197 -98 -15 53 -90 7 -14 -129 2 -54 -44 136 -47 196 -18 265 -79 -31 107 -15 -117 96 153 29 -184
3220 -184 -6 -125 -13 15 47 47 -54 -21 -49 97 161 154 -123 13 153 74 62 -78 -155 28 48 -92 27 48 42
3245 42 121 53 24 -109 41 -37 -195 -206 -15 14 -367 -151 -329 -220 -114 192 239 34 21 -93 76 15 -51 -11
3269 -11 101 180 -61 -226 5 70 78 192 -74 105 70 150 -65 5 -103 319 -6 -44 113 -13 13 96 -21 305
3293 305 -216 72 -130 10 192 -182 39 208 388 -158 235 -334 100 -65 123 -25 8 -1 -8 -39 78 -119
3315 -119 51 219 -37 216 -104 145 -87 -43 38 -17 -87 -19 -108 214 67 -74 62 -163 -124 90 278 -88
3337 -88 -312 -247 166 0 -122 -176 176 146 -138 96 6 84 82 -40 -155 -328 141 -272 -4 -55 -112 113 253
3360 253 8 -202 -39 -143 -260 159 20 71 233 -132 105 62 21 -201 217 255 -121 214 -87 134 124 -64
3382 -64 242 151 -19 -85 32 -55 23 -126 -170 -52 -237 268 88 186 45 -51 225 -134 -169 -186 56 135 221 92
3406 92 259 -267 -165 226 175 -67 260 60 4 -64 80 0 126 182 -11 -12 -71 -110 330 26 210 36 133 -140
3430 -140 261 61 -172 203 -35 -104 -113 155 -185 -42 -115 -113 22 -34 -30 44 -94 304 52 191 7 69 399 16
3454 16 -88 -49 -26 -13 -94 -286 124 -21 -75 42 132 209 182 150 72 -197 77 -158 -186 334 -57 30 92 217 99
3479 99 21 -34 -159 -128 -162 -22 -194 79 -242 20 -116 -131 -231 -23 153 -200 -209 80 123 71 6 -44 14 -56 0
3504 0 6 72 79 98 -103 137 121 171 236 -313 -456 265 -174 205 -104 -103 153 -105 -159 -192 -14 -117 49 -59 -141
3529 -141 105 -122 -29 -44 4 -173 179 9 -213 52 189 13 14 14 63 -75 -386 185 -2 19 14 22 -65 78 230
3554 230 -71 -65 -34 -71 136 -51 207 -20 -160 75 -36 21 -85 22 212 119 -112 33 -157 189 21 7
3576 7 -68 -132 -46 5 55 -72 1 -164 177 32 18 69 -132 33 22 50 -218 -19 83 126 -46 186 140 -173 -136
3601 -136 -81 76 184 -144 7 141 -6 49 -51 -73 -74 -9 86 128 8 -257 -67 -197 260 -64 124 35 126
3624 126 -205 3 17 244 184 -74 101 200 38 -212 -1 22 356 -17 114 -67 61 -8 38 166 38 124
3646 124 -229 -11 1 -40 181 360 101 203 361 -42 -69 82 153 120 -5 118 -124 304 -166 -22 12 -120
3668 -120 -51 147 -25 -182 -137 89 -100 -20 151 -149 188 89 38 59 61 -15 -18 -307 61 -41 59 219 288 195
3692 195 293 -66 79 -28 -13 -82 256 -241 21 -139 -215 354 133 -16 130 81 27 25 126 83 -132 -80 -68 24
3716 24 99 -24 77 -48 -84 -183 -221 -87 50 20 184 35 25 72 93 -205 172 255 -41 78 -142 140 163 12
3740 12 -127 -166 -132 -60 -105 79 -44 -40 -209 -168 178 -141 -95 -86 40 -226 84 152 26 -84 -91 50 -27 246 45
3765 45 138 4 3 189 -114 175 0 57 20 94 7 -47 209 83 216 -105 208 230 134 -52 -170 -75 -183 -118
3789 -118 -53 -163 143 130 142 78 228 230 140 99 154 26 -30 18 274 51 -133 -28 102 -170 -159 -9 1 -269
3813 -269 88 40 217 -6 265 -117 -124 -206 -1 15 -160 154 -137 -258 -99 86 -37 -41 78 258 184 -157 166
3836 166 18 -3 140 76 50 78 230 -246 104 -108 259 -206 222 -39 -22 -71 234 -69 -45 -79 37 -64 -232
3859 -232 -92 4 -11 -59 -73 -321 -271 117 132 91 -50 41 14 -1 189 119 112 116 -129 -244 39 -147 -206 52 -92
3884 -92 29 148 80 33 149 -281 115 -60 26 -37 -99 73 104 187 -31 187 -57 19 -13 147 -124 5 -134
3907 -134 -167 -90 -165 -18 84 -2 -13 -194 20 -208 79 229 -106 37 72 64 -101 154 217 283 63 98 -180 131
3931 131 -77 -101 -316 109 49 215 -16 -120 124 31 -129 -15 6 13 30 87 -188 58 17 131 163 164 109 -242
3955 -242 107 -50 84 96 93 173 15 -52 230 30 -38 215 115 -114 -73 304 185 39 -13 -214 -90 156 158
3978 158 193 152 267 -255 -201 -100 -232 -153 92 112 76 -142 270 -211 105 -92 49 -165 -104 52 174 51
4000 51 -47 222 -141 118 45 -206 0 0 281 -33 -225 -106 -45 23 -138 -41 201 61 -191 16 -97 -244 -196
4023 -196 82 -51 168 -210 -56 -113 6 216 193 -108 -14 -188 -49 74 98 -155 -143 108 99 -157 22 28 43
4046 43 143 43 39 90 135 -160 -11 -36 150 -21 100 119 305 26 -324 -127 188 -88 146 -154 -117 195 -19
4069 -19 -131 -101 -89 63 143 75 -51 87 -165 -150 -253 128 93 67 60 100 245 -102 -148 200 125 -48 50 -135 175
4094 175 258 -17 138 -72 -36 151 86 16 -145 153 -153 65 -110 258 47 58 -39 -105 271 -8 -65 -143 -44
4117 -44 131 -99 34 -92 -26 196 28 -244 -116 77 87 -114 -35 270 -25 -280 -66 -85 -63 -34 -235 -97
4139 -97 -30 40 231 136 -91 -105 229 298 -83 -167 -386 290 -132 -97 -36 220 -111 -254 -77 -116 -70 -75 -120 -3 74
4164 74 -121 -211 -182 219 42 289 -99 19 41 -186 20 -56 -26 132 -17 84 359 109 206 -436 202 8
4186 8 19 -117 -82 229 -6 -58 119 113 168 -141 -186 7 18 21 -8 -89 60 166 15 -112 194 -104 -196 -37 38
4211 38 211 -52 117 -51 -80 65 156 -166 147 -2 138 194 60 101 -80 -66 -213 98 -363 93 28 -94
4233 -94 211 140 -22 -37 121 -10 7 -16 -87 262 97 208 -204 36 95 258 -23 -54 177 -79 334 70 -114
4256 -114 -145 263 107 5 -27 -41 -32 13 195 -83 -72 142 252 -65 -70 67 -182 -55 148 -119 -121 -47 65 -53
4280 -53 -151 -27 -149 9 82 69 -228 34 50 196 35 -69 143 260 39 27 55 -202 19 131 -243 104
4302 104 -150 -76 251 -32 122 100 -109 -40 -38 123 95 76 -97 130 6 -9 -60 108 11 -62 411 -77 -97 151
4326 151 -11 -161 -62 -174 9 60 -157 99 -183 -127 124 -78 -170 -296 160 -197 -42 0 -88 -164 -133 89 -144
4349 -144 224 123 -73 -125 -85 -39 100 -277 -59 170 -114 58 91 86 -13 -64 69 178 -61 168 -108 -223 54
4372 54 -202 -16 135 14 110 -124 56 52 -22 34 -38 37 93 -63 -48 43 -165 -297 -34 35 120 -68 47 -189
4396 -189 119 43 -229 -2 315 55 -153 56 -62 -306 64 199 -52 -120 122 144 97 -354 175 149 140 -61
4418 -61 -105 -37 79 93 13 -42 41 -90 -238 123 91 39 -15 -39 -211 18 53 215 271 37 221 -73 131 158 320
4443 320 35 -97 -237 157 322 -42 -65 -12 -53 31 -440 27 45 200 -48 33 154 -26 146 -31 186 235
4465 235 87 166 -69 -192 371 -189 -316 52 137 154 47 328 144 -5 36 49 135 -131 30 -99 43 -117
4487 -117 -9 50 41 40 -211 143 -49 -57 219 -70 -39 51 -94 133 89 12 126 97 -157 -28 -244 133 115 0
4511 0 -81 85 292 -287 135 174 158 212 63 -128 66 -249 -59 205 57 102 -45 134 -35 -176 -43 9 142
4534 142 -79 94 -107 94 -239 -115 138 -47 -4 -46 212 7 -222 -77 70 174 -93 -64 40 21 90 -210
4556 -210 117 -134 15 -304 -113 -288 180 -92 -14 39 -17 38 -84 95 264 147 259 -134 64 102 59 -76
4578 -76 -35 170 -222 -34 212 181 175 -76 -234 297 -36 49 -48 92 133 -328 35 -12 20 95 -76 -73 183 -86
4602 -86 -18 36 232 -243 85 -8 -160 -161 32 23 5 -13 -121 -73 315 -12 94 -253 78 130 -65 -174 16 -81
4626 -81 52 132 -41 48 113 -69 74 21 -20 126 -119 210 57 -51 -15 27 107 182 -48 92 35 -60 -151 155
4650 155 -144 167 33 82 206 72 -48 -180 226 -114 205 239 41 82 -53 126 -19 -56 -72 160 -62 129
4672 129 -24 -129 -2 84 -19 224 -215 -248 -60 -36 254 78 -156 153 64 84 118 79 64 -3 38 -125 123
4695 123 94 102 136 26 182 181 76 115 30 -62 233 -158 3 -65 -22 -82 -51 91 -108 -147 -3 -38 -44 -9 -97 -74 57
4722 57 230 -165 62 155 -32 137 -135 -12 197 -106 -80 -18 152 -72 -120 45 246 54 -163 25 -71 -102
4744 -102 96 -219 -218 -10 -246 143 -20 -267 -85 95 -49 -68 92 -100 -9 84 -108 -57 -65 -39 173 64 176
4767 176 -166 36 13 118 0 -414 -137 -33 -44 62 134 -118 82 138 -35 -18 -30 -76 -304 -172 121 118 54
4790 54 -141 26 83 173 -366 -105 91 114 13 -236 -140 -56 2 -111 -60 157 149 -114 17 -14 -18 -110 -1 -93 94
4815 94 141 -68 -122 67 100 -170 97 -213 -48 -133 -102 85 -267 81 68 -150 -190 -87 -34 17 67 -127 66 9
4839 9 10 41 151 217 -107 -61 -128 79 -20 74 -255 -143 63 -260 24 -132 -7 -35 26 -263 -95 -68 -150 152 374
4864 374 265 -18 43 -10 40 12 -150 2 -30 -46 -259 -91 92 62 136 209 2 -1 108 105 -44 59 112 14 -80
4889 -80 14 38 144 40 8 -63 33 141 59 -23 58 205 67 35 -78 -24 -88 -54 16 -117 -144 144 59 74 -79 78
4915 78 93 126 197 17 -21 -249 31 -148 127 1 188 -23 97 251 -201 -231 -207 30 21 11 168 3 -37 119
4939 119 -29 140 2 -121 30 -25 94 -84 -344 -194 26 -156 25 -24 -88 29 62 110 -188 -56 127 37
4961 37 -104 -47 -173 -147 -24 167 -147 -24 265 -43 -3 25 -116 92 29 -128 -184 -34 100 225 85 -183
4983 -183 30 177 90 69 27 33 -290 -157 137 -8 288 123 20 169 11 -51 21 180 240 -67 86 -124 -152
5006 -152 54 75 64 164 196 141 194 9 206 -113 -62 28 191 -14 43 55 -136 317 -12 -114 -19 144 35
5029 35 101 -88 12 177 104 -70 96 -45 12 -342 -34 -89 -244 -70 -178 48 130 -113 -133 -186 -75 -62 3
5052 3 167 137 234 5 24 80 157 -130 -87 45 -312 142 -7 -129 156 -150 13 -123 149 -76 -114 -96 -45 95
5076 95 -94 106 145 -69 -127 -259 296 197 197 -85 115 -92 18 -94 -130 108 25 -142 71 339 142 26 -108
5099 -108 51 -201 86 -183 21 -137 14 10 67 -32 152 17 13 143 -157 8 36 15 64 40 147 44 101 68
5123 68 32 164 -235 238 92 -1 -61 115 -91 -266 -158 -161 -124 -83 -155 32 -138 2 -18 29 46 -323 -88 -35
5147 -35 129 -149 -88 -222 318 91 34 294 151 135 4 204 -29 -70 -88 -25 164 -52 106 55 67 38 136 119
5171 119 56 -129 118 -48 27 300 49 85 118 109 10 -54 22 21 185 96 34 -121 84 17 75 -235 -124 141 -271
5196 -271 48 -100 -57 -19 -87 80 146 -29 47 93 -19 174 -89 -135 -183 -39 108 -125 228 175 136 184 -162 -141
5220 -141 142 -223 -43 65 113 48 -30 -32 -95 63 7 218 94 -6 8 -100 147 15 90 -58 -11 -87 64 -132
5244 -132 171 116 -211 69 -159 -71 -80 -156 -238 -114 10 13 -62 5 123 -68 33 153 92 164 39 -79 218 -82
5268 -82 41 140 193 16 -5 125 111 -44 236 102 -76 74 26 209 34 -80 119 72 -146 216 -40 -162
5290 -162 -68 36 203 54 145 97 91 20 -75 8 -56 83 -31 -96 263 101 -1 13 -25 -188 -22 140 4 57
5314 57 -75 97 -109 210 -17 -78 240 130 99 -109 -26 90 38 -29 111 -88 23 112 43 -202 232 -16 121
5337 121 162 135 -13 -111 -107 -35 -89 42 63 99 9 -179 -68 90 61 15 -93 -77 -50 78 -114 -342 280 -274 19
5362 19 54 10 -58 -152 143 167 29 260 210 -247 1 66 -113 249 59 249 -179 38 -117 58 -71 -214 116
5385 116 -183 -93 -84 -103 58 -5 146 -226 -75 -218 -26 45 168 218 -132 -11 -249 267 222 -49 36 104 -231
5408 -231 -93 -66 67 -177 91 -90 -88 28 -25 86 167 141 35 -106 -117 -362 90 130 -58 -59 -146 -419 135 -132
5432 -132 -131 237 53 -138 -74 6 259 184 179 65 -71 171 139 -7 -240 132 -84 28 180 -105 -88 -2 191
5455 191 -64 75 256 -326 151 -173 120 -56 -306 34 115 -228 -99 -197 -225 98 119 66 99 291 -152 128
5477 128 85 -188 242 280 -156 166 26 -82 96 68 -136 2 -54 -168 -227 162 -228 78 105 93 163 -111 -71
5500 -71 -132 -104 -117 -90 141 -33 -137 55 -178 -4 -188 -82 -7 -163 215 -10 -224 -70 108 141 65 -116 -39
5523 -39 -93 -64 180 63 149 -270 174 -136 -196 -70 214 94 -107 194 36 86 -49 -87 -119 6 128 -274 -225
5546 -225 91 167 47 329 -42 -47 8 -75 89 -137 191 -204 95 128 8 87 62 -101 4 -288 129 -7 -47
5569 -47 -50 153 -159 16 -126 -76 106 -151 249 119 57 -108 163 17 146 -102 -31 287 -52 156 72 3 79
5592 79 16 -47 85 1 20 122 292 -7 -209 7 -171 -56 175 130 19 -28 -62 60 51 53 -30 227 -93 -11 -134
5617 -134 -5 125 -29 123 140 177 100 88 -144 134 77 -66 -127 -77 147 -98 64 -115 -210 236 -79 -40 74
5640 74 -192 109 290 111 55 -94 -82 -17 -80 -139 -231 -91 60 -22 -7 106 193 -19 -73 -99 337 -288 -166 4
5664 4 229 38 18 -261 286 257 224 -32 -37 194 -65 -105 103 -146 1 -223 -315 -186 -105 158 162 59 48 -182
5688 -182 -7 -189 30 63 -93 239 13 112 -213 -32 84 -4 -57 81 56 -228 -2 -183 -279 -139 11 -125
5710 -125 98 -103 -168 22 190 21 -249 95 159 48 -207 83 50 -44 1 -232 159 52 -111 115 -188 58
5732 58 24 235 -18 142 288 -108 173 147 70 106 76 78 107 64 69 128 42 -45 60 -160 130 -121 -77 16 71 30
5758 30 26 125 -13 42 -45 -4 174 -71 -31 169 -158 31 -192 -149 -58 87 -114 -240 -100 -79 -127 50 -208 234
5782 234 -208 -81 40 -144 50 -54 54 -140 -105 -64 -174 -66 197 29 82 -73 20 -189 -91 -47 -282 -70
5804 -70 -118 -116 123 -12 31 16 11 -98 48 -15 103 -134 40 -19 -132 75 243 65 -103 -191 143 -27 14 -122
5828 -122 160 116 275 -37 74 -104 -18 96 -132 12 41 28 -100 -217 133 -131 -227 207 -155 -61 -288 -3
5850 -3 4 99 -107 32 98 -56 17 -129 -170 103 -50 -166 71 138 91 -5 -70 -39 -146 9 26 -108 -87 69 -104
5875 -104 -213 -164 -133 289 -304 97 -154 -187 48 71 -114 -100 -147 124 23 40 -53 0 -65 124 -6 143 150 -72
5899 -72 40 -71 168 37 -19 131 -257 -268 18 53 -181 7 53 180 144 -174 36 139 43 173 -71 296
5921 296 98 73 -107 -194 -142 23 98 -86 -1 -58 -65 -4 53 -217 -36 68 182 69 -2 -1 -221 -180 -95 10 57
5946 57 -100 -39 -273 100 -56 -147 -83 58 -100 100 -45 -145 90 -24 204 73 -93 111 -2 164 55
5967 55 23 248 67 9 -79 -4 -212 -104 -69 -102 118 -15 -94 -8 -143 23 95 20 88 -175 -85 329 177 -75
5991 -75 -326 -146 189 76 -11 -301 10 168 -276 0 -124 171 156 -100 -199 -51 177 -94 2 86 -81 128
6013 128 73 -237 196 2 109 -65 173 168 155 -105 171 25 4 -89 -121 112 217 -166 199 -240 145 53 84
6036 84 -13 -61 181 -25 65 -88 10 -280 -79 -30 351 109 -227 -151 -30 221 87 -51 225 27 16 -4 -9 74
6060 74 -160 117 2 -42 41 150 165 -138 1 157 285 35 -183 -35 99 -13 -327 367 66 -156 121
6081 121 20 77 53 -83 -39 -1 142 141 -49 217 -164 190 -61 -250 161 -53 -45 -18 31 -54 -81 -162 -237 87 42
6106 42 85 75 -38 98 -180 -123 -265 250 11 -10 39 -224 -56 -96 -201 -108 275 260 108 149 -34 149 162 -159
6130 -159 359 35 38 132 103 -175 -82 -35 19 -64 303 -148 -176 -33 139 -93 -123 121 201 12 -206 156 -232 -10
6154 -10 -23 125 -56 -124 -67 -27 -162 63 64 -79 202 48 -321 185 13 -57 -316 -58 -102 54 78 -187 44
6177 44 84 -4 125 -96 61 -71 -265 -77 -143 -165 144 -109 22 201 24 -46 -78 -101 -41 18 64 45 24 82 -203
6202 -203 236 -199 -162 -9 131 105 -222 138 -41 -59 -129 -120 -21 -23 -129 200 1 -88 -72 258 341 36 15 42 244
6227 244 107 174 109 -81 -112 -67 129 -133 -63 54 -83 101 90 142 -27 -15 -10 -76 -68 -125 -104 22 -108 -66 87
6252 87 30 -59 297 -226 -84 90 71 39 99 178 302 -4 191 84 120 145 -152 266 58 199 -61 490 146
6275 146 -39 134 -29 153 -141 -105 140 -11 -29 -149 -130 94 9 -131 -52 -157 99 -348 244 -124 -154 -204
6297 -204 -301 18 173 -121 53 -88 -35 -3 158 -13 -197 132 -42 -113 82 -37 144 -102 74 -208 -29
6318 -29 90 -47 -2 126 -53 -89 47 -147 84 -56 -215 -12 -121 -7 -5 60 -46 255 251 -46 105 6 90
6341 90 -15 115 -83 99 145 113 -122 -127 113 -355 -139 45 156 -97 90 38 -75 -221 275 -373 274 -75
6363 -75 101 131 26 138 -49 82 -47 8 145 107 58 -18 45 81 93 -163 -79 55 80 29 232 16 -10 -227
6387 -227 81 8 41 -60 226 -105 -149 97 -8 -55 -92 -37 217 -76 -53 -82 26 -92 -283 -187 190 101 -41
6410 -41 217 -51 -129 -110 -77 -117 82 150 -220 184 -89 4 -327 43 153 66 34 188 147 -90 27 -205 -77
6433 -77 -24 -14 13 26 -25 -28 -116 91 -59 -24 147 -48 -234 293 7 65 128 57 -38 -278 235 64 -35 -160 35
6458 35 63 56 74 -51 -92 -157 -136 371 9 -29 -75 70 -48 -53 19 -3 93 99 165 -7 -140 171 -255 -16 -151 -19
6484 -19 35 -136 29 -105 -24 -114 18 0 267 184 51 36 -38 31 46 -100 178 97 -147 -12 -22 139 11 172
6508 172 46 -15 153 -102 -120 71 -45 167 220 -201 -126 -108 68 -52 91 14 -80 -16 -142 -15 -79 -206 92
6531 92 -29 72 -46 -59 -84 18 -114 3 -354 -317 67 8 132 99 272 -141 -215 -35 -157 -134 -87 133 -30
6554 -30 199 -156 -161 90 -32 28 44 -70 281 237 52 -59 64 37 -2 -113 69 47 -24 -350 142 300 134
6577 134 69 -96 -124 175 -41 -181 -128 219 -198 -61 -8 -112 -186 32 258 -91 7 -183 128 76 64 66 -133
6600 -133 58 -50 -27 107 -27 84 157 6 34 -214 -56 21 -137 -165 268 18 -45 -42 -43 -15 -3 106 -34 63
6624 63 200 8 -31 165 171 -40 -7 72 -57 107 -66 89 -124 56 -34 -42 55 -64 106 -55 -192 54 -105
6647 -105 -267 113 23 306 1 -23 -47 -22 97 -57 105 203 -135 -64 172 -2 -97 -196 -188 -111 -47 239 -13 -298
6671 -298 -14 154 -131 -157 -56 6 18 18 -92 -156 216 127 -213 240 -21 5 -165 129 1 217 239 -162 -105
6694 -105 -159 -134 150 -70 -38 57 -104 194 90 103 -219 99 -121 -24 -51 189 -136 11 -178 -196 185 97 181
6717 181 -31 -211 92 -180 -118 -35 -271 0 -165 280 -9 -144 -17 329 -72 44 209 167 -166 -43 103
6738 103 114 121 206 39 -67 -44 162 -102 -48 -258 -48 -26 -7 -88 -85 29 -201 21 -178 16 25 -32 51 -86 -12
6763 -12 -198 -135 -41 -107 -103 -41 -10 101 228 244 84 305 147 -63 203 -19 14 90 78 -88 23 171 -63 87
6787 87 -170 -82 135 181 -250 132 130 18 -81 291 -64 -204 211 40 69 -204 130 119 80 155 78 197 9 27
6811 27 292 85 226 4 106 -39 -59 -167 91 -25 -68 16 66 238 -14 179 -28 -92 69 164 -31 -151
6833 -151 217 52 185 11 86 19 -257 196 -73 218 -51 54 -79 87 124 65 -79 311 3 -179 -156 19
6855 19 -132 97 72 13 121 -16 -144 172 101 -156 -183 -152 -228 -90 121 -212 -30 169 63 88 146 -20 -134
6878 -134 -15 -21 45 244 23 -66 -192 50 -108 60 102 66 -83 11 28 166 160 80 289 16 -168 8 -184 -67
6902 -67 51 -25 25 179 -97 94 162 -9 -189 306 243 -17 162 -188 -117 -104 29 32 -208 139 -22 115 32
6925 32 -188 -58 -60 159 -76 241 181 -87 160 -156 53 -189 49 -133 -89 14 -261 175 -69 -242 32 71
6947 71 29 205 134 -3 111 -109 -25 389 137 -7 194 50 17 8 -108 -125 14 -293 -26 48 200 86 94 169
6971 169 74 -100 319 43 -100 -131 -25 -201 185 11 300 -8 -1 110 -26 -4 35 -102 1 45 46 150 -118
6994 -118 -57 20 -301 -57 147 185 146 183 172 149 -172 -85 62 86 -95 -207 37 77 -73 180 -328 187 -110
7017 -110 -5 -173 -104 222 80 142 -48 -15 -71 -32 -249 -207 -122 12 59 125 -1 -138 208 40 186 -116 -141
7040 -141 -27 133 253 -69 43 156 -60 44 -18 -90 25 79 -71 -134 44 146 -133 -49 113 43 -31 -187
7062 -187 113 18 70 -206 272 195 118 78 96 -62 -151 138 -337 184 227 21 99 -25 -82 -18 -97 105 23 -11 -123
7087 -123 -229 -109 -49 19 -134 114 64 -108 -196 110 78 -135 122 188 -54 10 -75 1 -53 205 60 33 62 -186
7111 -186 -14 -80 -47 -145 323 57 -25 -232 -15 97 -197 144 -86 20 238 54 -50 18 -65 148 56 -82
7133 -82 246 10 -65 -242 -8 235 -141 76 -82 -209 39 116 -4 128 48 -204 115 392 35 -34 99 143
7155 143 -10 -120 124 188 -92 -167 -22 -13 7 -147 341 29 18 117 -73 146 115 115 28 -166 -127 188 -195 41
7179 41 10 54 139 73 40 -195 -85 -66 -345 411 69 -40 34 -7 159 -154 -299 -47 -24 146 -65 131 211 86
7203 86 11 -49 69 54 23 -245 69 -64 79 -71 57 -338 -118 80 69 87 126 -85 18 230 212 -294 -191
7226 -191 -176 -23 302 91 -77 -47 100 188 152 -25 177 267 328 76 -55 -116 103 -143 -8 4 199 62 -57
7249 -57 93 95 262 -30 306 -167 98 -1 76 41 -101 -63 -51 61 2 -27 63 144 -190 113 -42 21 2 -135 -70
7274 -70 -158 -75 26 -172 -271 -195 52 -281 2 1 -41 -93 101 161 -97 112 217 -320 3 132 1 80 -110 51
7298 51 7 -108 -136 197 23 25 -95 58 -13 -143 59 6 16 108 187 12 -154 39 177 85 -63 -42 -15 -370
7322 -370 -52 -180 10 -186 -54 -296 -61 -27 34 300 -154 -171 -74 -154 32 -23 -11 -179 266 -65 -159 -50 -348
7345 -348 191 -24 -51 70 -68 74 -13 -23 -61 -78 30 16 -55 -95 -84 -18 55 -40 109 157 -38 286 -68 129
7369 129 228 -54 -24 81 -5 110 150 37 97 -21 -142 143 176 -22 -116 136 92 -34 -60 -288 -165 64 109
7392 109 -116 419 66 30 17 -76 81 -73 -102 147 125 -266 75 -141 156 148 -77 99 -127 -107 165 -117 45
7415 45 74 -259 112 -62 107 -87 43 19 77 110 108 24 141 -97 -51 -82 20 -67 27 67 283 -194 86 162 -46
7440 -46 -92 -66 101 260 -71 -21 0 81 59 97 -24 43 57 -70 82 -55 99 -230 30 105 122 54 -8 128 -269
7465 -269 -112 -139 25 -113 -264 -127 -105 57 97 -200 -42 135 -44 -92 -272 -86 16 -77 28 -96 32 111
7487 111 -29 20 -65 -61 11 -150 63 141 2 -193 -29 108 -72 -196 -65 43 86 -141 -147 -75 179 49 -51
7510 -51 110 83 255 -320 18 60 57 168 127 274 -135 150 -12 58 -236 39 222 -156 -153 -38 -137 -129 36 174
7534 174 -279 -114 -12 35 358 87 -106 1 15 -176 141 -138 -36 141 -10 -202 -170 141 89 174 80 -261
7556 -261 37 45 -63 -136 -30 245 -23 -94 42 301 -6 -307 -305 91 91 -132 -84 170 272 -105 120 56 167
7579 167 -11 44 29 -31 252 161 103 244 115 130 77 -16 -87 157 -6 -207 4 -126 -194 -75 61 -140 105
7602 105 96 175 -175 205 218 33 -100 87 -161 104 -39 -127 23 -16 28 -79 -270 121 161 203 105 -112 18
7625 18 216 46 11 83 -142 82 -24 137 241 -93 163 -183 59 -126 -61 120 -103 33 -149 -130 -135 -195 -23
7648 -23 22 53 -89 -53 -111 -19 -244 50 -163 -123 219 108 27 264 -45 -7 -43 67 -80 19 -214 -42 168 -153
7672 -153 95 74 42 -122 108 -80 -66 -253 -205 19 -60 -133 -89 107 -98 -112 89 -7 64 84 -55 -169 21 64
7696 64 -151 155 -7 162 147 -80 118 -15 45 172 -96 -6 -97 7 -235 148 50 -161 128 20 -72 -117 93
7719 93 94 -434 69 -164 -17 -19 -41 279 -319 45 -229 -88 -141 -211 -74 99 -28 -216 25 174 28 -114 277
7742 277 -34 -136 7 -87 137 210 106 24 -65 179 -96 22 -89 162 73 104 224 14 -81 -220 -100 -174 32
7765 32 53 188 -171 -13 -31 4 224 -72 68 -174 50 95 -134 -99 129 -14 149 -24 123 52 12 142 81
7788 81 125 -107 -1 104 -99 3 -43 107 123 -48 70 208 100 -178 88 307 -106 145 94 29 68 -20 -100
7811 -100 -6 243 -228 -81 123 87 -92 319 27 -123 -53 -237 205 75 -199 179 -156 -22 -111 121 -106
7832 -106 206 -182 93 -13 13 6 70 -199 -55 289 86 -104 200 -137 -36 -96 125 -294 -144 116 -153 89
7854 89 -9 171 53 444 125 133 -170 203 77 52 192 -7 324 -121 84 -135 86 71 -244 -18 -65 -13 199
7877 199 -12 -118 127 114 -64 -121 -160 5 102 40 -205 224 -48 124 327 86 120 127 9 14 81 32 39 -35 -73
7902 -73 3 -17 -64 13 305 -93 109 -77 -5 -179 9 -159 -228 -44 -360 48 26 -289 -159 2 -64 86 15
7925 15 199 90 188 79 322 -158 87 110 65 47 46 -26 -328 -204 -42 40 132 -45 26 -14 -27 324 233 -71 53
7950 53 -106 -158 20 120 133 159 -289 -118 102 -144 -73 -108 -75 -197 267 -114 263 180 246 267 87 94 -13 -2
7974 -2 -21 -133 -136 -38 7 -110 -172 120 292 288 -17 -87 106 129 12 213 -3 57 14 259 349 -139 127 126 135 -41
8000 -41 78 -47 -55 -50 138 -7 165 -92 51 24 48 -27 -116 -75 -181 -66 -12 98 186 -127 -5 41 26 6 2 222
8026 222 289 217 -37 104 -88 -117 32 -127 100 146 63 -68 -62 -193 -47 118 -209 267 -52 20 347 75 104
8049 104 -69 110 -11 176 -54 -141 -101 -40 48 231 438 -206 177 6 -67 -167 -12 102 -109 -4 -50 7
8071 7 313 3 -23 -71 49 -9 -97 -246 -85 -45 314 4 -31 -206 -80 55 50 -208 73 -152 -138 -55 -94 103
8095 103 -75 -61 -14 6 -2 82 185 162 365 -58 -228 61 94 238 115 77 -198 107 8 158 99 21 -30 163
8119 163 87 -88 -19 11 -253 74 -121 123 -219 -46 -71 -153 -70 126 -203 283 -96 90 130 -220 188 160 -17
8142 -17 -63 -155 -59 -33 -248 63 -370 244 99 28 -14 -135 -260 65 -173 59 55 148 -186 208 289 112 -72 89
8166 89 -43 93 106 -241 -120 -101 -185 92 -141 52 -31 -145 -82 -249 52 -87 3 18 -122 80 116 10 -96
8189 -96 -166 -19
8191a9
$$ Imaginary data points
##PAGE= N=2
##DATA TABLE= (X++(I..I)), XYDATA
0 0 0 0 0 0 0 0 0 0 0 0 0 0 0 0 0 0 0 -8 8 -8 8 -8 8 -16 16 -16 19 -24 26 -31 34 -39 44 -51 55 -60 68 -76 86
39 86 -95 106 -119 130 -143 158 -176 193 -212 235 -257 284 -313 347 -383 423 -472 525 -590 665
59 665 -756 868 -1010 1196 -1454 1824 -2399 3409 -5500 11468 -61004 -207878 83152 172493
73 172493 -115346 -129613 136369 88363 -133584 -44566 134114 15906 -115659 16163 106222
84 106222 -36812 -85946 56640 66413 -69820 -44978 71587 21017 -71750 -8588 57257
95 57257 -6808 -50491 7804 34150 -12748 -24891 9227 11277 -4833 121 -1402 -6911 14280
108 14280 15472 -21744 -11730 36355 10930 -39422 633 44643 -7831 -40435 17835 35929
120 35929 -26052 -30431 31891 19035 -41680 -11282 43259 -4796 -49967 14529 45989 -30130
132 -30130 -44363 39480 35665 -47407 -25677 51268 16956 -49120 -4130 48197 -1763 -37890
144 -37890 13571 31467 -16392 -17664 20923 7788 -19011 2653 15782 -11597 -12317 14980 4221
157 4221 -20071 -1749 16888 -6164 -17713 7711 11863 -13128 -7070 14949 -654 -15470 10550
170 10550 15491 -17730 -9297 28715 6403 -32499 4351 39436 -10845 -38040 21838 37197
182 37197 -28706 -31435 35432 22401 -41286 -13715 40542 -649 -41380 8969 33820 -21718
194 -21718 -29498 27950 19373 -35601 -11068 38821 1696 -39077 8488 38929 -14527 -32867
206 -32867 23687 29034 -25741 -18241 29784 11318 -26317 -1412 23335 -5694 -17408 11535
218 11535 9562 -16407 -3671 15800 -6095 -17001 9365 11866 -16186 -9590 17293 2746 -19033
231 -19033 2879 17187 -8464 -12507 14469 8585 -16560 119 21668 -5041 -20254 15440
243 15440 21220 -21096 -16116 28480 11331 -32827 -5017 34315 -4000 -35015 10324 29461
255 29461 -19197 -25658 22031 16307 -27327 -9625 26993 125 -27161 7176 24842 -13520
267 -13520 -19854 20094 16811 -21652 -9140 25259 5626 -23496 1559 22942 -4971 -18199
279 -18199 8903 14121 -11542 -9348 11670 2281 -12295 1449 8357 -7704 -6778 8446 1219
292 1219 -12102 1177 10667 -5623 -9283 8034 6867 -8977 -2913 10631 829 -8172 5003
305 5003 8385 -6149 -3787 10649 1845 -11351 2679 12387 -5644 -12066 8782 9264 -13270 -7887
319 -7887 13050 2045 -15352 -127 12875 -5636 -12302 7727 7478 -11173 -3643 12771 -410
332 -410 -11959 5656 12573 -7805 -8998 12877 7838 -12684 -2984 15206 889 -13867 3364
345 3364 12972 -6678 -11338 8486 7040 -12189 -4691 11233 -983 -13480 3318 10833 -8375
358 -8375 -10092 10512 6435 -12835 -3006 13614 83 -12048 4379 11909 -5336 -7159 9019
371 9019 5953 -7943 -876 9264 -1447 -7450 4467 6029 -7009 -4497 7583 449 -9767
384 -9767 458 7838 -4641 -8775 4997 5552 -8404 -4239 8455 394 -8658 2469 8583 -4151
398 -4151 -5916 8013 5463 -7929 -1052 10431 47 -8619 3670 9062 -4871 -7221 6214
411 6214 5127 -7635 -4373 6990 716 -8210 -612 5713 -3139 -6712 3011 3776 -5838 -2377 5774
426 5774 428 -5231 2081 5511 -2311 -2803 4851 3076 -3593 819 5291 -585 -2800 2862 2285 -3342
442 -3342 -535 3698 -1667 -4481 2009 2479 -4645 -3070 4004 150 -5997 -574 4722 -1780 -5711
457 -5711 2665 4669 -3876 -3124 5748 3056 -4943 64 6860 -196 -4942 3653 5769 -3540 -3157 5579
473 5579 2236 -5703 -936 5391 -1158 -5892 1190 3523 -3695 -4525 2801 1708 -4584 -1536 3615
488 3615 -386 -4035 1125 3450 -1482 -2113 3084 2538 -2504 -218 3959 629 -2141 1802 3257 -1449
504 -1449 -1460 2223 729 -2523 -119 1373 -1675 -1952 614 -415 -2052 -688 833 -1265 -1721 756
520 756 747 -1768 -543 1477 489 -951 924 2273 -254 -547 2358 1830 -1412 93 2720 290 -2225
537 -2225 845 2376 -1707 -2728 1736 1335 -3466 -1973 2632 -573 -3735 12 2172 -1934 -2603 1327
553 1327 1537 -2236 -1121 2441 1130 -1716 250 2836 534 -1487 1552 2663 -538 -1370 1878 1514
569 1514 -1512 -763 1477 -94 -2161 -140 735 -1283 -1636 58 -201 -1369 -597 274 -430 -412 308 172
587 172 -453 350 387 132 418 825 925 161 550 1090 530 -43 554 634 -115 -846 452 653 -1331 -867
607 -867 366 -629 -1524 -445 426 -1014 -1379 265 314 -1255 -469 890 74 -824 394 1279 272 -159
625 -159 934 1270 -31 488 1056 751 -88 337 669 226 -304 -79 231 -369 -938 -145 -329 -1016 -1050 -112
645 -112 -588 -881 -281 213 -530 -318 300 144 -71 134 473 452 809 422 619 778 709 425 360 471 108
666 108 115 -96 -257 -146 -169 -530 30 -441 -709 -463 -356 -183 -593 -678 275 -206 -897 348 562 -317 -328 722
688 722 844 -115 225 1223 480 32 673 860 151 -183 496 476 -231 -638 96 87 -655 -1004 116 47 -976
709 -976 -919 468 -75 -1106 -147 224 -107 -561 209 627 223 -173 607 875 180 179 623 872 395 67 319
730 319 999 -155 -549 286 479 -766 -712 207 -125 -1350 -374 -224 -452 -774 -273 362 -327 -950 44 630
750 630 97 -390 517 1157 -272 94 884 948 -104 317 1057 155 -397 104 621 118 -815 155 172 -715
770 -715 -627 -434 -166 -465 -859 -237 -81 -312 -660 -65 313 -190 -59 581 840 238 300 620 834 314 -47
791 -47 819 1038 99 -201 636 369 -600 -528 453 -289 -1272 -275 322 -849 -1375 56 271 -767 -1167 481
811 481 429 -1052 -95 1329 352 -287 125 1483 213 -325 679 1379 -110 -112 1053 823 -612 -474 957
830 957 -14 -1233 -124 348 -612 -1041 -51 -196 -841 -462 82 -404 -687 65 -177 -231 -6 144 -201 392
850 392 631 351 19 604 840 313 186 784 712 -510 -236 634 104 -1096 -150 633 -774 -1566 225
869 225 607 -1276 -1303 572 109 -1651 -501 1221 -76 -1311 754 1370 -260 -631 1437 1274 -561
886 -561 -56 1583 409 -1031 610 1417 -386 -967 594 448 -1085 -920 642 34 -1440 -329 250
903 250 -700 -1241 285 109 -1223 -368 932 69 -412 970 666 -201 -60 1191 325 -521 754 957
921 957 -488 136 864 266 -981 -155 979 -787 -1490 266 788 -1438 -1104 626 292 -1865 -676
938 -676 1164 -652 -1631 544 1222 -1033 -629 1598 1197 -1109 81 1948 219 -1295 1154 1602 -751
955 -751 -594 1263 584 -1348 -417 1175 -278 -1598 184 649 -1104 -1085 462 166 -1143 -427 926
972 926 -347 -930 728 772 -652 46 1363 549 -911 784 1487 -418 -338 1353 409 -976 160 1227
990 1227 -272 -880 711 717 -1301 -747 924 -283 -1696 -278 1183 -961 -1698 775 1297 -1467 -847
1007 -847 1465 487 -1686 569 2104 -432 -1255 1238 1569 -1043 -293 1825 782 -1580 122 1559
1023 1559 -588 -1357 815 737 -1420 -1016 1081 -224 -1823 -172 828 -752 -1583 730 557 -932
1039 -932 -492 1313 75 -1006 637 1218 -409 -498 1514 808 -925 45 1603 -53 -1065 831 1030
1056 1030 -1022 -743 1134 -358 -1726 141 1137 -1117 -1470 763 829 -1798 -696 1612 -127 -1618
1072 -1618 380 1535 -481 -1131 1338 1317 -1044 -289 1916 300 -1414 562 1750 -562 -1194 1148
1088 1148 884 -1449 -722 1558 -133 -1760 201 1073 -1288 -1420 1165 495 -1806 -404 1313 7
1104 7 -1379 830 1205 -626 -657 1564 992 -1193 400 1544 -281 -1093 914 1218 -793 -791 1082 404
1122 404 -1539 -73 948 -1022 -1304 495 314 -1391 -812 1241 -209 -1576 596 1048 -719 -656 1202
1139 1202 784 -1188 -151 1777 90 -1047 1007 1332 -706 -630 1542 622 -1278 -214 1282 -632
1155 -632 -1330 564 1016 -1125 -1208 819 152 -1502 -374 1155 -252 -1348 846 1095 -1093 -596 1326
1172 1326 432 -953 99 1494 -425 -540 1006 1146 -410 -346 1199 36 -1015 -17 889 -568 -900
1189 -900 703 368 -1541 -476 856 -383 -1366 480 834 -1045 -673 965 130 -1268 218 1479
1205 1479 -250 -883 1019 1113 -960 -413 1559 515 -1326 380 1433 -696 -1291 932 761 -1501
1221 -1501 -826 1062 -84 -1461 -10 951 -752 -1735 891 1019 -1415 -348 1331 -7 -1130 299
1237 299 1427 -230 -617 1052 791 -778 -107 1067 38 -924 357 1090 -278 -911 725 460 -797
1254 -797 -214 864 -267 -1314 -114 427 -831 -833 811 46 -978 -15 897 -318 -551 799 839 -807
1272 -807 -252 1556 162 -444 664 1198 -835 -544 848 451 -1167 -452 847 -204 -1307 356 848
1289 848 -661 -1340 412 291 -1273 -566 986 207 -1023 596 1124 -427 -763 1152 961 -412 -53
1306 -53 1289 374 -765 316 735 -531 -613 326 172 -984 -13 487 -436 -1004 313 4 -637 -436 151
1325 151 -139 -775 -101 539 -332 -325 879 469 -139 174 1020 280 -445 603 745 -407 -353 1024 333 -843
1345 -843 124 706 -167 -1088 420 331 -721 -654 530 135 -983 -238 763 -273 -1131 255 708 -245
1363 -245 -364 689 576 -345 179 1117 -60 -517 538 941 -395 -399 790 217 -448 -90 407 -125 -470
1382 -470 39 -26 -422 -423 75 -50 -585 26 435 -146 -318 258 182 -333 157 754 -37 -270 397 500 -367
1403 -367 1 664 441 -318 109 541 -262 -527 235 145 -707 -674 231 -229 -790 -338 321 -260 -845 187
1423 187 326 -269 -368 442 190 -339 97 855 7 -388 464 668 -268 -162 462 327 -170 2 663 74
1443 74 -597 340 446 -351 -352 107 -227 -606 -241 222 -239 -660 130 261 -458 35 190 114 -129 147 201 184
1465 184 -100 345 179 186 239 -85 -6 -162 148 280 -454 -365 232 -145 -318 -168 136 -140 -476 -51 -58 -541
1487 -541 -53 229 -154 -197 242 220 31 -279 276 278 -280 56 542 294 -427 261 513 212 -234 35 543
1508 543 -170 -399 4 33 -370 -313 159 -147 -301 -207 7 -250 -417 41 201 -9 -155 258 243 -232 108
1529 108 285 -61 -32 355 106 53 9 47 -142 130 -351 -75 -199 -37 -85 -96 -224 20 70 -192 -174 177 2
1552 2 -245 -295 238 -87 -67 196 271 -207 -87 308 -133 -205 183 404 120 -218 195 318 -43 -166 -99 70
1574 70 -219 -236 -4 -189 -316 -364 263 -88 -391 -186 32 -263 -234 217 114 131 -155 348 191 -3 31 354
1596 354 151 29 21 365 240 -53 79 62 -41 -84 170 -237 -252 -221 -147 -10 -163 -176 -374 46 -198 -303 -192
1619 -192 -96 6 -181 -22 399 78 36 219 356 535 221 21 586 -92 -64 240 180 -248 121 50 -25 -409
1641 -409 -536 -48 -86 -290 128 116 -411 -449 -48 136 -444 -98 172 49 158 -12 296 109 -116 120 81
1662 81 50 99 17 282 -20 87 93 -10 -140 31 -235 59 -92 -225 -93 -198 -236 124 -69 -57 -115 -107 95 -105
1686 -105 34 269 141 247 211 42 367 403 343 40 221 222 -128 273 262 -231 -251 -21 199 -89 -301 -153
1708 -153 -43 -327 -223 184 -209 -250 -155 -26 446 35 127 240 130 16 22 345 77 64 352 252 -172 17
1730 17 45 53 82 87 88 -95 -203 -157 -39 -161 24 -237 -191 -204 -38 119 -10 -164 32 317 -15 -266 -127 2
1754 2 154 224 -56 53 141 73 -14 1 104 102 -7 -11 237 -289 95 248 -154 -470 -329 233 7 -211 -224 61
1778 61 -36 -254 27 -67 -151 52 246 295 -154 66 307 134 124 11 115 -71 -5 112 319 -110 -219 170
1800 170 66 -341 -57 36 -314 -327 -208 156 -57 11 -135 -137 -101 91 -104 417 226 -120 224 127 5 238
1822 238 180 208 -100 -24 142 -80 55 77 -13 -70 -60 105 -39 -242 -161 -234 88 -121 -181 -85 68 -102 134 -32
1846 -32 -14 -30 160 285 70 138 74 16 312 96 -17 354 78 81 47 453 125 -141 -99 -314 -128 -149 123 1
1870 1 -255 -44 -3 9 -168 -211 -111 156 -160 246 107 -14 105 116 435 183 -38 -6 177 2 31 -13 94
1893 94 -94 -51 -7 -47 -152 -218 95 -220 -40 1 -246 -96 -200 -45 87 -170 -60 128 136 6 134 184 328
1916 328 34 81 -198 189 -11 144 271 63 -67 -189 45 134 -79 -90 -150 172 -167 -108 -91 -138 -201 -256 -52
1939 -52 37 -134 -130 65 177 -300 17 -21 -2 -129 280 69 48 -50 129 267 55 70 51 48 -59 -19 84 63 -224
1964 -224 -26 -65 -152 -305 334 -163 -103 -367 134 -12 41 11 -158 19 400 277 248 43 101 -147 79 35 -71
1987 -71 300 -136 233 48 -22 174 58 -288 139 -5 -38 -394 -6 -194 -155 -323 -5 -141 -74 150 156 54
2009 54 -188 -132 48 168 -86 -93 170 219 8 98 201 -3 143 110 63 121 -366 -218 166 -135 17 203 -253
2032 -253 -120 -26 -95 160 -46 10 128 238 -44 256 190 -159 -54 130 18 190 149 169 -1 360 208 -7
2054 -7 5 54 79 99 -160 -74 -136 214 -81 -90 -77 -152 -122 -51 -111 -318 -64 111 11 -104 1 -55 153 91 129 -278
2080 -278 99 297 -67 -231 47 111 -102 -108 38 -64 -135 -166 432 -139 -314 -164 -347 -40 179 301 -7 -427
2102 -427 110 141 -222 -146 163 102 458 -181 40 273 -157 186 38 94 -78 201 304 125 -62 -119 34 87
2124 87 -104 -91 2 -48 -224 -34 255 -319 23 -17 23 186 85 192 -71 -30 12 23 225 394 -36 16 242
2147 242 109 -272 197 -64 115 -233 109 255 42 -44 26 -8 -109 -75 -50 -138 -157 -327 136 34 -102 119
2169 119 345 26 56 -77 -56 -202 118 449 -192 -176 228 312 74 113 -18 67 27 -65 -46 127 83 -7 -83 350
2193 350 221 25 -326 -59 -17 -106 4 74 -81 -54 139 -176 270 70 64 152 -15 -167 -17 324 308 -169 117
2216 117 314 -289 -79 240 91 -72 -173 106 -236 1 66 24 -166 -166 -146 103 -84 115 127 -33 158 2
2238 2 235 229 -231 -114 112 -117 195 -91 -104 -258 -140 291 54 5 174 128 -13 -128 -107 132 -45 -214 -156
2261 -156 -228 154 113 -138 -107 -45 179 135 -38 3 44 -31 -123 267 351 -8 -58 141 129 -250 -40 -53 -118 73 -61
2286 -61 -29 -75 149 -60 -250 191 175 -3 -246 -89 116 85 -152 -35 -63 79 -165 201 154 108 -70 402 -158
2309 -158 -183 214 67 164 44 -239 -91 -94 -133 -115 -159 185 6 12 -138 -111 43 22 9 -212 -153 121 92 -22 84
2334 84 73 137 -19 143 192 98 91 62 -342 -45 23 -107 103 96 239 -31 -49 45 -54 -6 -9 91 115 -55 -70 -33 -216
2361 -216 177 -163 -225 -202 103 223 -202 137 299 -120 -246 70 18 -150 -278 250 104 -269 -9 51 136 -41
2383 -41 51 -25 257 -69 230 -1 -15 -17 56 162 -184 -13 152 -178 -136 184 132 -48 -60 166 49 -38 348 32
2407 32 23 73 -134 -75 -101 110 20 -124 -265 -53 -58 -110 -136 124 -201 -130 -101 -124 -25 -123 255 71 -48 136 109 -41
2433 -41 -6 390 26 -96 179 107 331 82 190 -136 9 238 -100 57 363 -59 122 215 -149 -264 16
2454 16 88 -234 50 2 -71 -54 54 93 -2 106 -32 -10 205 -40 98 153 -108 -153 157 223 117 223 -98 -110
2478 -110 -58 -82 -188 -62 -12 83 -220 208 101 -26 1 -42 134 -169 187 -64 -28 95 -128 90 -163 -4
2500 -4 33 154 16 284 25 -56 -94 184 18 32 -342 -72 208 -97 -218 38 -10 -16 50 97 -224 -59 35 -108
2524 -108 -4 1 105 86 -151 -85 163 273 74 148 -76 271 128 -185 186 50 64 -101 -67 252 -105 98
2546 98 89 -234 -130 -362 -1 204 -56 -75 69 -45 -49 -199 267 19 106 -121 4 -228 -55 288 -38 20 241
2569 241 -196 93 -159 57 167 -71 61 63 -174 -11 84 9 -111 -21 143 -133 36 -106 -121 -85 -84 -112 -206 119
2593 119 4 135 59 151 103 32 199 -26 77 129 -237 275 -24 70 -26 -36 -228 -132 8 -148 -52 -55 131 -79
2617 -79 21 -151 79 171 -188 -11 -6 -98 -10 340 239 -101 -8 -23 232 38 11 -176 -25 -57 -30 -146 -274 -46
2641 -46 -30 9 45 -223 -76 117 129 -237 100 -109 -25 -212 -48 159 -56 -12 47 406 -50 -27 28 75 49 -6
2665 -6 204 -240 -17 -66 219 45 -29 -60 132 179 -82 -8 -221 -76 -77 11 -39 89 63 13 145 -73 25 6 3 -36
2691 -36 -252 43 -7 -23 148 -281 -77 113 -271 -6 -59 -248 96 113 -192 159 -33 -13 103 177 96 -4 -10
2714 -10 -43 170 131 39 -100 251 83 -151 20 -13 238 224 -72 -43 246 126 15 257 24 9 -98 -159 -13
2737 -13 -5 308 0 -12 82 60 112 33 60 -189 -134 -125 114 -252 102 -128 20 -38 -195 310 -16 -15 -15 -13 -15 -4 -10 -46
2765 -46 153 -57 -117 -44 -19 -50 48 192 209 -45 184 -16 59 -162 90 24 177 -174 -25 -9 -168 113 -69
2788 -69 -1 60 3 -64 -20 -235 -186 128 277 250 183 -132 74 -51 -108 -42 -41 -101 -163 105 -78 -97 -23 -112 5 -139
2814 -139 16 203 96 1 -1 237 -112 66 80 -28 -220 41 -143 27 103 241 278 3 135 106 -64 204
2836 204 71 97 -45 33 53 -51 79 76 -69 -266 -33 -51 192 -9 152 -20 101 175 293 -59 -223 179
2858 179 302 18 98 -120 73 68 158 117 89 -192 65 195 91 229 -49 48 -89 -4 -146 -26 229 -150 154
2881 154 -2 -95 33 293 270 -49 60 94 -72 -130 -106 -64 190 -125 187 11 -27 -96 12 15 -43 261 149 -167
2905 -167 61 80 92 169 -131 -119 -151 -26 -103 -55 104 -192 25 88 170 -135 -34 166 -30 90 69 60 -28 -49 -10
2930 -10 79 -46 63 107 -125 -209 18 -41 7 -204 92 -34 -206 26 97 -375 17 0 78 -66 83 12 7 100
2954 100 10 25 64 102 73 -26 106 -223 -176 46 -273 36 -73 28 -23 128 -260 -247 -184 -110 -7 -69 -59 -336
2978 -336 60 182 -131 -183 -76 -290 78 147 10 12 -97 215 -85 -83 -176 6 19 104 222 137 155 -5 144 -9
3002 -9 216 -65 -192 -262 47 -7 -287 58 -118 94 180 231 354 149 145 33 -16 34 -33 41 -292 -103 189 82
3026 82 -70 -288 157 -76 -19 77 -16 34 -57 122 356 18 -95 185 37 274 5 -131 -92 -20 -44 115 -225
3049 -225 166 -7 -249 -91 -11 -114 89 303 -142 126 -55 -7 -5 99 -63 15 -204 -8 0 -106 -123 93 207
3072 207 -178 -37 -66 -165 -137 -26 -145 -156 5 -108 -22 187 -237 143 96 -9 -83 216 162 10 -50 137 134 -386
3096 -386 -216 194 -177 -36 13 -101 34 83 -87 5 65 -28 33 -61 -16 3 15 -190 -28 202 -8 -95 -77 -182
3120 -182 98 156 -49 -118 54 32 44 -189 -180 30 -139 -151 -107 114 -130 21 -20 127 -151 -38 15 -123 127
3143 127 67 173 131 -112 -85 171 -76 -176 52 -188 -103 28 218 201 -14 -152 -366 -259 -12 -4 -49 74 -24
3166 -24 113 -62 -177 -58 -103 -69 -173 -31 156 -30 162 -187 -47 -60 -40 55 63 -44 33 15 80 305 -45 -141
3190 -141 -14 -273 -206 5 -77 180 -7 32 11 -12 30 -172 -63 68 174 -21 -50 49 -179 116 40 -31 -141
3213 -141 -68 -48 -65 48 140 55 -3 9 203 124 -114 127 151 231 32 86 122 -92 -8 -119 -42 292 47 98 -138
3238 -138 -106 -125 132 -98 -178 44 -175 -130 -100 -8 129 35 -15 117 68 -21 108 9 92 86 -145 76 90 56 117 -34
3264 -34 -12 44 54 3 59 147 242 75 -55 -308 0 203 -258 -30 103 -98 42 51 15 -206 36 -4 276 -310
3288 -310 -129 -130 -126 25 132 16 -57 166 46 -2 321 54 113 85 163 201 -15 -88 -56 -176 93 82 6 -73 -31
3313 -31 176 -99 145 -149 44 93 84 -188 -23 197 -28 56 -21 -10 55 107 -85 -384 -294 -99 171 1 -177
3336 -177 161 -252 2 -56 59 20 92 157 -20 -53 203 -9 102 48 -75 21 6 -205 40 22 177 -5 -28
3359 -28 -5 -38 150 -144 108 -36 40 361 122 -30 -111 -185 129 -78 -67 -110 -191 -2 -124 -38 115 -36 15 30
3383 30 38 -119 308 261 112 -156 -319 76 84 -109 -81 -15 29 137 -176 -141 -211 119 210 173 112 -163 102 201 85
3408 85 40 175 147 82 -46 -217 103 -120 -136 168 37 221 74 257 -202 -162 -438 -115 330 99 112 -57
3430 -57 -139 66 -82 -218 94 -38 -47 -83 -108 -72 97 69 102 -81 -121 150 231 -184 136 21 -21 -6 24 4 -256
3455 -256 -7 146 61 232 -115 -131 70 -9 -201 109 -18 12 -101 -39 -36 138 151 42 -278 80 -55 8 167
3478 167 -21 -88 193 240 14 50 -148 253 -12 49 -124 272 -263 -22 -21 -50 287 -165 -54 176 -44 -6 42
3501 42 48 36 160 -188 -157 -146 -74 -42 -77 -60 -64 -103 204 219 178 24 -155 -74 -53 -159 12 117 12 -208 -67 -205
3527 -205 -236 -69 54 -122 -190 166 46 41 138 -318 -47 222 -174 -5 227 250 75 11 80 -129 20 -58 -6
3550 -6 106 243 -238 -297 5 -47 96 -57 274 -14 -109 301 29 -174 202 -159 -91 23 171 143 30 -2 204
3573 204 -9 -73 154 57 -77 -212 270 -46 77 13 -29 107 127 213 47 199 -261 -234 43 -91 -241 231
3595 231 37 71 -58 -88 -102 132 -99 85 152 110 142 -77 148 -111 138 -62 265 88 -60 -245 236 -49
3617 -49 37 102 -205 -251 -30 67 -272 122 -154 -58 -184 164 46 -175 129 88 10 -163 -209 3 -125 44 131
3640 131 139 -93 347 161 -137 -217 26 -164 -28 -43 -42 -30 -29 -55 -137 -162 224 22 -226 -60 -45 -205 -113 166 -192
3665 -192 260 -98 35 -41 -9 24 5 69 -6 160 36 314 32 38 -164 -169 -161 36 -57 44 12 -160 -175 -165 41
3690 41 -46 -41 -404 -109 -265 -157 56 146 437 115 45 -26 -152 139 -6 265 -145 166 95 -62 -140 180 -12
3713 -12 -89 -45 54 -228 161 61 11 49 -120 21 -8 116 329 140 44 57 -13 -97 -13 136 122 -140 32 68 -144
3738 -144 -152 -93 304 34 -47 101 -177 38 82 -46 -255 -121 283 -150 36 -72 -299 1 90 -23 43 237
3760 237 6 -207 62 90 55 -165 244 -55 -207 -202 115 -178 166 98 -11 -327 1 110 60 -83 -8 -169
3782 -169 -50 63 189 -45 -120 203 -87 -114 168 157 -29 133 169 -255 235 167 117 213 -231 105 58 -163 -182
3805 -182 -278 -78 -125 -68 -133 227 -229 200 95 -367 150 11 -124 36 201 -124 110 -113 -12 131 -62
3826 -62 70 116 -14 -71 131 -104 -57 -248 119 94 -157 -138 -70 206 48 42 -83 -127 107 171 -148 -1 -99 -88
3850 -88 -68 -253 -75 -104 -19 -50 86 -21 275 172 38 -69 21 -128 -8 166 -185 -206 44 229 200 50 184
3873 184 -95 -200 18 16 160 40 39 -13 10 143 -160 16 165 46 67 32 195 52 -156 63 -118 -62 -102
3896 -102 222 -42 115 91 24 -98 -66 -161 195 -20 -104 186 80 -57 -156 -50 -58 92 109 134 -45 10 49 190
3920 190 153 -69 -97 -25 56 -64 106 151 -71 -49 -15 -180 96 -213 85 -255 -28 120 78 70 -103 -39 -209 30
3944 30 -110 -138 -172 125 -46 47 -181 13 2 63 -65 -66 52 241 45 82 -212 -241 1 -328 172 52 -258
3967 -258 -252 -21 -29 -24 -291 -100 45 -36 29 -70 -14 187 110 -193 326 -43 225 -65 13 -126 -41 -160 -67 -125 116
3992 116 -17 26 -78 39 -129 55 11 -48 -48 -57 -184 67 91 -79 -57 -61 102 -376 -178 -156 158 -61 101 221
4016 221 101 12 -42 27 12 -30 -245 -180 58 25 75 16 189 115 94 -45 202 29 57 -126 -300 -102 -73 -150 -64
4041 -64 19 21 -32 -37 -104 -195 -5 -39 -27 -82 -31 220 -33 16 179 -213 -2 151 -69 126 65 209 67 -197 -112
4066 -112 37 -64 -247 149 13 -68 -47 -253 -102 11 4 228 186 3 -94 19 -19 -156 225 -30 141 -62
4088 -62 -145 -113 49 333 86 -47 112 96 -158 42 129 -115 218 174 29 24 108 -35 305 3 -256 20 23 -69
4112 -69 -126 73 54 -142 -141 112 -68 169 -32 62 63 -194 -98 94 125 -91 36 194 105 -127 9 222 -41 207
4136 207 60 67 -139 98 -134 -104 -133 98 13 -203 23 55 -101 -112 9 68 247 59 -49 78 216 280 152
4159 152 169 -42 43 -7 -162 29 -62 -177 47 53 42 121 -76 44 106 61 -3 -35 -264 159 -136 225 -146 16
4183 16 84 58 14 -31 35 -72 -126 216 21 -270 -20 22 33 -143 -155 -100 -64 46 231 225 -31 -74 -17 -67 133 -25
4209 -25 -2 64 182 44 -19 -137 10 11 -122 37 -209 62 175 58 319 192 -115 -30 1 156 38 15 -96
4232 -96 -186 -77 198 -172 220 92 21 -18 -102 -70 -171 93 -98 163 -2 -323 -123 -20 -146 114 231 -39
4254 -39 100 177 92 -145 204 -46 -194 251 60 -36 172 -134 -38 5 -66 -172 10 -13 141 128 23 217 -17
4277 -17 50 -232 -173 -363 -10 396 -310 -266 108 -6 125 55 176 -156 -73 29 205 48 -33 -13 152 -267 -99
4300 -99 53 -217 26 -118 73 82 -47 -41 111 -412 115 -165 50 120 22 52 -104 94 63 27 218 -96 256
4323 256 -57 -66 67 -20 -306 -155 -69 151 154 12 52 20 160 -69 -110 -77 -299 -5 58 43 195 17 -73 123
4347 123 21 -80 128 43 19 88 17 -51 87 -116 -90 -16 89 105 -90 81 79 -13 -12 101 -131 -15 -19 -162 -8
4372 -8 67 -120 111 -60 41 -144 -36 285 23 176 -125 86 20 -12 -1 -91 -186 11 -43 44 135 -134 156 -144
4396 -144 178 -51 65 -195 -79 -21 -127 -303 121 -54 -209 10 89 -120 -50 98 -214 156 -43 36 -14 -62
4418 -62 145 185 308 92 -17 -97 240 6 292 104 -173 280 89 41 65 209 -5 -173 -38 -75 -100 -12 236
4441 236 60 66 -31 71 -39 -220 0 -29 141 134 -303 32 -44 33 -137 -74 -17 15 -39 0 -11 -82 223 31 -12
4466 -12 176 42 61 35 355 -79 -212 185 -112 249 129 -81 -123 -174 -16 76 65 161 64 -5 0 -79 -17 -6 -58
4491 -58 102 10 -14 -105 80 -197 -164 -33 34 262 -68 -275 72 105 199 -125 6 113 -72 151 -155 68 -180
4514 -180 -173 104 -312 -73 251 283 79 -71 180 -1 -68 -259 162 -22 -108 -25 -14 -147 143 -82 88 -28
4536 -28 -191 37 -57 23 96 -93 121 -116 -184 -81 -171 36 179 132 -135 -436 176 22 -195 -31 195 99 238
4559 238 32 -186 339 -40 55 247 -13 -46 45 -73 22 -267 208 -187 121 95 6 -88 -30 -67 -119 72 10 -113
4583 -113 37 125 -73 64 -59 18 9 116 -244 101 -88 60 66 -68 -63 -152 208 -124 -23 -86 -216 84 -11 -259
4607 -259 93 129 -23 59 -145 46 46 91 -43 133 -6 -22 -115 -106 71 186 70 -180 -99 12 -55 -86 152 61
4631 61 51 -275 42 154 244 -17 322 -83 -142 -49 96 142 231 -19 43 78 270 -72 -115 -35 -95 19 169 22
4655 22 0 30 -109 -143 18 -125 -307 127 -50 128 124 123 213 148 91 197 176 -255 -73 -68 24 -119 12 48 130 148
4681 148 -12 -80 27 17 -257 1 -129 -66 -44 -201 23 -147 -121 -324 253 181 161 90 -4 107 -242 -208 166
4704 166 -60 -46 2 98 95 -40 190 275 78 149 39 -414 -83 -6 -76 -41 -102 -135 420 35 108 50 -327 -27 111
4729 111 179 -133 -298 -22 125 -57 -68 -132 -17 -247 -137 -61 33 -81 -20 45 -42 67 128 -43 85 -24 54
4752 54 176 44 -20 -115 20 84 -18 -64 73 111 38 -99 177 -55 -263 241 -66 120 147 25 155 -87 35
4775 35 -54 125 -273 -56 -31 -220 18 -125 53 90 3 143 161 -8 -83 12 49 172 9 -192 16 240 133
4798 133 136 -301 -60 -72 -15 57 -18 -254 -131 -18 77 -36 -45 -68 -254 -74 -72 135 -68 135 -7 -250 -111 166
4822 166 -191 -40 -62 -148 -3 -24 342 -78 -335 95 64 -209 -156 58 -100 29 -66 158 156 93 -55 109 86
4845 86 -111 -29 -104 -42 22 109 32 -111 79 -32 -141 -29 104 -10 0 131 74 -96 1 -181 112 61 120 283
4869 283 -3 -48 -195 101 12 -84 107 100 -51 -118 -6 -286 55 82 13 59 -24 -158 -49 151 157 145 198 97 -193
4894 -193 276 -92 70 -135 66 -24 9 71 145 -79 -93 173 37 228 170 -361 -25 7 336 28 296 -31
4916 -31 -262 -102 2 -193 -115 -3 103 -240 7 -108 -60 -133 111 198 -238 -7 89 86 243 89 -4 -91 153
4939 153 73 9 60 193 -5 123 -134 -25 -16 -106 -21 -104 317 -100 70 -123 -182 145 -101 -33 28 -314 57 -119
4963 -119 46 -191 -86 -195 -74 -5 -58 -94 -130 139 1 -247 15 -151 -230 67 271 -242 6 -249 -217 22
4985 22 136 104 -41 -79 -129 -152 -83 -17 9 -107 310 -84 75 -26 160 48 151 -37 -208 59 -47 105 100
5008 100 -149 -280 85 102 133 10 220 -110 66 -52 -19 -8 -172 -140 118 -338 220 -230 90 90 290 19
5030 19 -114 -34 -1 31 15 221 -114 -192 -35 139 -35 304 169 -100 112 -208 4 -135 -39 154 112 -56 81
5053 81 192 167 41 298 -35 145 41 -142 -35 -57 55 58 -20 29 -60 214 65 77 110 245 -56 -87 264 38
5077 38 61 -50 57 132 45 -203 79 6 17 64 -29 -153 -48 -69 -125 -56 2 -26 -26 112 -66 -56 -106 -31 100 -102
5103 -102 144 138 -66 60 126 54 -203 -44 175 -65 147 33 -106 58 302 98 210 -97 131 52 18 -99
5125 -99 4 97 266 53 119 -61 -42 63 -225 -40 273 -142 -95 76 132 -174 -23 235 39 -83 -149 -183 63
5148 63 167 -137 66 31 -22 262 -35 -186 -47 -96 -128 0 -21 -1 31 -32 -94 -62 -120 109 7 84 29 295 -15
5173 -15 -103 -68 107 23 -9 -19 21 17 169 24 16 -5 -33 -84 136 27 35 -39 121 46 58 179 66 85 -202 71 92
5200 92 -94 -36 -104 80 -132 135 89 -33 88 -65 100 174 -132 31 -26 168 66 -65 178 -3 71 15 -199
5223 -199 102 21 -37 -24 90 -42 94 164 43 11 5 -84 -288 257 -226 285 185 34 -37 38 -62 -27 -86 135
5247 135 39 142 -72 -82 95 -253 -54 -78 -39 -83 -250 92 -77 -202 -320 3 139 82 -138 245 115 79
5269 79 -73 37 -56 -57 30 -138 294 -79 -184 -148 61 16 402 80 -62 -170 -138 180 77 152 -13 72 -45
5292 -45 187 -67 86 79 147 91 99 132 -12 -59 223 193 8 -138 77 240 -74 97 -80 -61 -227 157 -144 -78
5316 -78 -38 87 153 69 -19 16 36 57 51 56 40 164 -83 136 175 -205 -20 -109 -53 132 -42 -63 84 262 105 51
5342 51 -83 -26 88 19 -46 164 -56 195 198 -441 80 13 149 -260 52 -82 86 -83 -74 -152 86 -29 -36 -2
5366 -2 338 50 43 60 117 -55 -376 146 70 -13 -107 -151 172 -120 8 66 100 208 -8 115 -51 297 -94 -129
5390 -129 -66 -194 -134 -142 -194 25 -79 53 -49 91 54 125 -64 -64 -292 98 -34 231 178 -115 136 98 74 79 -84
5415 -84 328 -209 53 200 -154 -289 -181 -3 78 99 -123 61 167 288 -70 -59 -40 99 -107 -20 -23 74 166
5438 166 90 -375 -11 198 54 -210 88 -49 -53 2 272 -88 109 114 -48 48 -163 22 119 94 138 204 -316 -286
5462 -286 52 47 -118 -4 4 81 -139 195 -266 -194 225 85 -244 -185 214 49 -4 80 -53 -135 168 9 133
5485 133 -301 148 63 -104 -41 -358 -57 91 -68 -106 -206 222 -120 22 118 17 222 -74 51 87 -253 21
5507 21 -143 -84 39 -238 157 -124 -27 96 -168 130 215 34 209 -112 88 -218 -69 -108 -2 125 -78 -185
5529 -185 -108 -187 -111 -17 -190 -232 79 -21 52 6 206 47 -172 -138 109 103 57 378 74 -7 -71 49 119 209 220
5554 220 173 116 -232 -122 71 -19 64 -154 -129 25 -64 -295 -216 115 -77 52 10 -5 -92 97 -35 38 169 38
5578 38 -110 35 -131 10 13 192 45 -186 -73 -116 -178 109 60 30 255 35 259 20 -14 139 98 275 -157
5601 -157 -107 36 52 -4 -177 33 128 131 128 9 126 76 27 -31 126 -148 -71 210 49 300 -131 81 -124 -213
5625 -213 45 336 15 37 -162 175 -118 362 104 -34 269 74 -17 -94 108 -52 -108 -211 117 113 230 181
5647 181 2 29 -49 -236 -97 163 -51 -132 42 -117 136 -17 -1 5 -20 0 126 -258 264 -166 71 194 -42
5670 -42 57 -61 7 -53 -19 181 -75 35 -141 64 -107 42 -350 -137 -40 7 44 -47 -15 -122 152 -31 3 -106
5694 -106 -9 79 132 -39 -28 -22 69 139 112 122 -14 37 -9 -54 -109 -7 -182 -250 100 -150 -141 -98 -16 150 -31 197
5720 197 23 -97 192 -12 69 -55 72 -33 65 -46 -82 79 13 107 36 101 180 37 -64 -83 159 -179 12
5743 12 -366 25 59 98 -52 -145 -43 207 -148 -17 -86 220 -68 -24 88 17 64 103 -87 2 -148 -129 35 36
5767 36 258 -6 87 -111 36 202 -18 15 -65 -48 -116 -135 -28 12 -71 159 106 166 70 -112 -45 -53 -15 192 153 -34
5793 -34 92 -18 2 221 -385 288 221 -137 -41 10 181 138 206 37 10 -33 98 53 245 38 7 53 81 80 21
5818 21 -233 -3 272 89 141 95 -182 103 164 1 14 -301 -111 -136 13 -164 -79 -56 -19 -102 324 -211 41
5841 41 -4 259 -105 13 54 55 -217 -32 52 28 267 -133 134 -182 -120 51 239 321 30 -162 -85 112 -67
5864 -67 179 -59 272 -33 191 -50 -119 27 -89 145 -80 80 33 -201 -126 -286 -114 113 120 -17 115 1
5886 1 41 20 111 -23 -73 14 -196 -41 85 -106 16 -175 24 17 -181 -157 235 21 79 102 61 -25 -85 -121 -71 144
5912 144 106 164 169 -22 82 -64 28 149 -148 -143 27 30 62 -34 293 5 -22 -106 -89 21 114 90 4 -31 -178 27
5938 27 -48 -134 11 116 -17 72 53 -60 -16 194 28 -162 193 20 107 -347 117 -25 65 56 -61 -1 86 28
5962 28 100 24 310 -270 135 -124 4 25 -118 -101 -20 -37 -3 197 -160 235 -118 27 -61 -267 79 -42 6
5985 6 29 -228 -34 -174 -5 -106 92 137 -37 -77 -136 71 31 114 -95 111 124 -14 122 50 80 -18 -116 86
6009 86 245 10 93 -4 73 91 -43 28 -106 -49 -118 357 -123 -14 1 114 -141 -22 65 -49 -105 6 -66 45
6033 45 126 -77 -85 149 -9 -183 -239 6 -194 78 -72 37 -164 -32 -213 56 119 -280 170 -133 -17 78
6055 78 132 186 173 145 13 19 81 -66 155 499 88 -59 201 164 194 -74 -145 174 480 80 307 -134 -38 -200
6079 -200 -44 45 -43 -172 -196 -48 -156 -29 -31 -246 -113 -156 148 -26 -45 114 116 -59 135 -73 -270 95 138
6102 138 11 157 -127 -191 48 111 -49 21 -125 -263 -140 -154 254 -89 214 -82 104 -153 -7 -283 73
6123 73 -346 -36 -105 2 3 109 99 -63 16 -48 136 -171 -146 -50 -261 27 75 -125 20 -116 -38 55 -41 -80 149
6148 149 142 233 109 83 154 -63 -65 211 15 112 -196 -107 -118 -178 -289 -52 148 -218 73 99 99 17 -72 -60 -145 -47
6174 -47 126 -315 -66 163 -250 182 -8 121 -15 148 77 19 -73 -2 63 14 -127 99 122 -103 -181 -171 40
6197 40 -177 29 121 182 146 29 -238 110 213 90 -226 112 91 -224 -57 30 -85 120 21 224 -232 -55
6219 -55 36 -7 207 -212 168 -48 -5 -91 85 240 52 -218 -21 -118 -322 -100 140 -197 -120 -288 74 -23 -105
6242 -105 -37 -104 29 76 106 -57 111 86 232 -23 96 31 -74 -203 -23 102 111 -187 -43 -201 -64 -281 -2
6265 -2 -134 -61 -195 11 205 189 284 23 127 50 26 173 -109 138 38 -94 -11 50 141 -24 -78 -5 -103 -75 -64
6290 -64 130 -270 -200 -166 -246 -55 65 177 31 15 181 -79 -129 74 -132 311 -118 -75 -107 9 -2 136 99
6313 99 134 175 143 95 -108 16 -208 -59 132 -95 158 282 -9 137 -241 103 69 -86 115 41 243 -102
6335 -102 -4 36 96 237 -239 158 -144 49 -125 93 112 225 49 -132 248 -123 98 -71 41 6 76 333
6357 333 -112 77 168 -210 -16 -101 -144 20 -89 41 -160 13 136 -32 43 -3 -82 -22 1 -83 -42 170 -415
6380 -415 54 136 -194 -126 -7 293 -100 -96 -147 -77 24 93 91 -15 -25 119 -239 16 -62 17 -82 79 146 -49 -78
6405 -78 103 -198 -190 19 -65 -226 168 -232 -135 234 4 35 -52 16 71 -94 -173 -144 20 -71 69 66 134 190 -92
6430 -92 -53 -328 -167 -153 -85 -75 -147 -76 166 -51 -87 -140 36 61 78 147 164 -113 53 -170 -212 -63 -234 85 110
6455 110 141 -121 -76 -189 -294 70 -40 161 -224 -40 -154 -251 -70 -128 74 145 160 77 144 1 45 -94 160
6478 160 49 -350 21 80 -3 205 -106 -44 122 315 101 143 -127 26 5 -100 -119 -137 -86 354 -287 -59 198
6501 198 66 125 -137 241 139 -156 -232 103 59 60 -184 224 -56 65 29 -6 -78 221 123 -80 77 -244 -63
6524 -63 73 -166 107 54 21 -118 72 64 261 110 -56 -7 107 126 -85 127 -55 -230 395 -129 -295 -131
6546 -131 -93 -3 -108 -97 -63 8 -206 115 285 -146 54 -92 -24 93 1 118 298 45 -24 -11 -93 -249 37
6569 37 -63 64 114 47 61 -100 -271 5 187 -188 28 -36 33 -41 -39 -221 51 88 143 175 155 109 77 -76 -64
6594 -64 -137 -35 -119 20 -144 76 166 131 -119 156 372 162 -291 -32 125 -200 -115 100 142 -39 10 50 30
6617 30 -42 -140 73 -123 -410 -19 31 76 120 -73 -58 151 -128 -8 -88 101 -294 -282 -162 -39 121 -110 100
6640 100 -27 23 105 330 77 -43 -68 321 -40 -23 -18 186 240 -68 72 3 -42 215 56 -150 -36 -101 -60 329
6664 329 -2 70 -303 -122 -48 54 153 -171 52 138 -10 -198 118 -131 -68 61 73 -217 -20 -277 205 -116
6686 -116 -162 113 292 140 -67 -105 -114 -117 137 6 -262 236 -5 422 57 -82 -60 -156 -52 -70 -185 -154 19
6709 19 73 -172 19 1 281 239 -28 -233 -70 -137 -108 -109 72 313 -230 -98 -95 -145 -287 88 43 295 -18 52
6733 52 230 -31 22 86 30 -38 27 14 102 123 -109 11 -6 14 142 -103 55 69 -109 27 132 103 72 131 -51
6758 -51 -66 37 24 9 22 270 -100 -231 260 40 -73 -74 165 -243 105 69 -70 70 -64 35 -31 -24 -198 113
6782 113 -143 175 71 -113 19 13 63 -135 67 74 -146 40 -72 72 -5 59 -87 -134 58 -162 321 107 -353
6805 -353 -162 64 -184 -63 277 69 -60 -128 -90 -61 121 -74 -20 -95 -104 172 95 130 -185 139 -79 -126 -49 76
6829 76 123 137 113 -178 -140 188 70 229 124 237 172 145 52 272 225 -193 -231 73 -25 107 -175 42 35 -72
6853 -72 35 -108 0 -68 88 -82 147 -152 -9 -211 63 -92 23 328 122 141 -88 109 -118 1 310
6874 310 302 37 92 61 -133 69 114 62 -120 47 -192 130 -65 108 23 159 125 118 124 218 17 -225 -51 -111 59
6899 59 143 -30 -20 -127 35 93 18 141 3 -49 -298 174 136 -133 51 120 12 -120 -97 106 194 95 65 -40
6923 -40 61 63 -182 172 -60 -33 23 76 -104 -58 5 336 63 336 -47 63 232 144 -1 13 145 -122 -78 20
6947 20 177 -117 156 42 161 -93 -213 -6 174 102 -86 -185 214 -161 55 -77 -192 172 -196 325 -155
6968 -155 13 -86 -233 -134 308 -136 -1 -112 -255 64 119 188 -207 -187 -202 193 -2 31 -120 -152 166 -36 -175
6991 -175 -147 260 -21 90 153 179 35 54 -126 -86 -3 -191 -166 -22 164 49 -53 130 128 93 13 3 13 197
7015 197 -42 -197 -27 -124 -133 -96 -75 -138 25 -147 20 147 79 214 139 189 93 67 -177 41 21 65 -7 -61 83
7040 83 -228 -201 -19 -86 144 225 -326 -90 2 -124 179 87 -201 44 277 85 87 -233 -94 -158 -105 -25 -35 -94
7064 -94 -136 164 257 -302 -108 250 9 15 138 141 288 9 -25 76 134 -114 -38 4 -113 133 -235 5 -43 34
7088 34 -159 111 -82 -104 -39 115 -66 71 92 135 97 144 72 -40 264 173 -189 -107 33 137 -85 -230 -225 158
7112 158 -116 -94 -52 -12 -44 -8 193 -86 -271 -104 -29 -92 26 51 -102 -99 89 -59 92 87 -202 -109 21 88 15
7137 15 183 211 -72 84 -87 -73 22 -348 224 26 -31 25 -26 -168 -111 14 -129 -43 97 115 -30 -92 -145 50
7161 50 -122 -9 -184 -29 -179 -9 277 -116 -121 -207 71 96 -37 -61 -128 -158 84 -69 -72 -285 -49 -65 -170 -119
7185 -119 28 -52 -51 -15 -224 57 180 -301 300 272 -32 -87 177 70 -177 33 -49 136 159 123 158 -18 -209
7208 -209 -46 -64 94 86 -177 -259 64 -51 109 -234 167 -112 32 -67 -77 -179 -27 167 -117 21 -29 -113 27
7231 27 -66 -30 -61 -126 127 114 41 -149 -38 166 189 324 -21 -243 29 -71 -107 151 94 129 -123 9 -31 -58
7255 -58 -232 -86 2 -25 30 217 97 56 -121 -223 82 -76 46 -145 202 84 -44 22 137 228 62 -25 -30
7278 -30 99 -141 117 -4 -103 -209 -136 -42 297 211 -229 9 -252 131 65 -98 -90 -10 -71 56 -36 -119 86 209
7302 209 169 -31 -136 176 -122 -11 107 -171 116 -34 123 -200 -1 -12 -30 142 94 190 46 -52 -72 60
7324 60 132 -19 140 85 2 16 -169 103 47 -271 120 118 20 4 18 128 20 1 264 -38 -117 -75 272 147 182
7349 182 107 -44 103 -24 -81 83 -144 -276 346 -138 -122 84 -22 -179 80 65 41 -594 -13 -43 -165 -35
7371 -35 41 30 76 98 -73 67 -49 75 -130 -9 -242 -76 -58 -2 -39 -7 -127 97 19 -21 16 220 61 -49
7395 -49 -74 56 -70 50 -49 -231 69 129 127 149 153 -140 -57 -120 31 -154 -108 123 119 171 20 -198 -254 -43 -177
7420 -177 31 -173 273 54 34 -176 40 -108 -58 -37 68 184 220 16 -109 157 148 84 -24 -14 230 -193 -24
7443 -24 17 -37 -160 65 -105 37 231 -81 164 -127 125 10 -28 -311 -73 -23 -84 121 -289 -67 -31 -31 -131
7466 -131 -23 185 10 -34 63 194 95 157 81 57 -142 -153 2 262 91 4 -33 -143 23 176 147 -22 94
7489 94 229 8 -259 -217 -98 -363 119 303 -2 90 -76 111 -254 -97 94 -153 34 140 106 -50 193
7510 193 168 -258 98 105 24 47 51 86 -211 53 18 -90 -38 247 -156 172 295 1 -64 -3 -153 -28 93 -78
7534 -78 -52 -43 44 -76 329 166 53 35 104 -55 28 -103 -188 -57 -94 -22 267 32 -91 84 44 25 202 225 251
7559 251 -339 -12 365 55 141 -250 -175 -90 28 15 51 -180 -105 -263 47 147 -50 17 -107 149 8 -16 -56
7582 -56 -151 0 24 -185 27 -58 157 44 -292 50 63 -61 -250 140 306 -161 -181 -123 128 6 179 -46
7604 -46 11 87 67 118 -111 -62 303 35 215 -106 49 113 -8 -37 223 -61 -56 -91 105 169 264 -47 -42 -21 -15 70
7630 70 -179 122 -224 19 -58 -27 253 315 -90 -74 -325 -103 372 6 -364 192 158 -105 -48 -73 58 -397 -205
7653 -205 -208 -163 31 239 -131 263 114 -74 -128 102 -35 288 20 9 -144 9 -155 48 12 110 33 118 238
7676 238 51 -126 -87 -150 -342 -39 -40 -89 27 29 131 142 120 212 -72 156 88 -22 -55 273 -139 12 120 99
7700 99 -9 -5 -155 -14 -162 -145 -68 16 -154 151 98 -25 24 -193 231 118 121 195 -163 232 87 4 0 176 7
7725 7 126 47 -131 73 244 248 154 -104 -93 -81 80 -33 89 65 210 -315 -171 -21 -68 -214 -61 -77 413 64
7749 64 -158 -57 -185 215 102 -179 75 166 114 234 -51 -154 -94 -47 16 -108 -185 162 -200 -57 29 73 -73
7772 -73 -140 10 -134 -76 112 -146 -141 -168 -117 194 -55 -109 -295 221 -67 -108 -79 -53 17 -97 26 -25 50 -1 -114
7797 -114 124 -129 198 98 -179 155 -232 -184 155 155 205 -118 11 33 -283 230 -318 23 -46 -202 -88 379
7819 379 -16 -58 -20 199 45 -4 -197 -244 99 -162 -123 133 -55 76 -42 82 -148 -24 275 73 -111 182
7841 182 -225 50 216 -56 168 -129 -81 -1 13 87 -16 -34 28 -217 -86 -291 225 243 -75 56 155 -137 -100
7864 -100 47 -13 -90 -37 115 326 88 168 -3 37 36 -52 -16 -16 -153 -159 -57 55 87 104 -33 270 2 -229 -18
7889 -18 -92 -51 106 11 71 155 -132 19 23 -93 -53 111 15 -191 4 208 -97 -241 46 -231 -63 -96 -125 157
7913 157 120 -168 -132 298 233 -125 58 -261 10 -160 84 234 78 110 224 -159 94 77 -98 -284 -12 -48
7935 -48 242 250 -517 -197 187 175 -95 -7 36 -148 -284 -68 -182 184 227 187 -164 -291 -32 -101 56 102 120 -4
7959 -4 268 35 -108 131 -9 204 26 -49 -71 -19 -174 -46 35 66 122 -1 -30 120 -38 -77 6 54 212 -222
7983 -222 150 180 -22 21 -10 108 173 -14 -77 -185 -264 -232 -106 -21 108 -156 -44 -70 11 82 -129 191 251 106
8007 106 93 -99 -212 0 134 9 146 -31 133 113 138 91 -82 -2 145 191 119 -25 -346 65 134 -112 -50
8030 -50 -123 51 -138 -119 34 341 199 -88 69 76 278 64 143 39 -69 -165 116 134 129 -63 128 133 274 -16
8054 -16 -102 39 -17 8 -102 -3 -92 -161 42 158 -253 182 -178 -54 -168 273 0 -14 -113 -5 101 49 -56
8077 -56 -113 -79 45 5 63 92 -3 136 413 109 120 -43 60 -113 -103 -31 -173 133 -307 30 -75 259 -42
8100 -42 91 69 -15 230 24 130 -185 -38 64 -48 9 -56 -194 -232 1 163 -257 132 89 -116 -154 -54 256
8123 256 -83 -169 189 65 9 -141 22 18 140 -156 14 35 -129 235 47 -114 48 26 135 218 -80 -52 -88
8146 -88 -181 -170 -211 42 -250 -83 71 -155 -89 39 -42 -112 89 103 204 277 148 53 -67 -10 -137 23 -39 52
8170 52 49 -11 95 62 143 67 -54 106 102 -32 156 23 -139 117 7 108 -203 -293 -145 -12 57
8191E7
##END NTUPLES=NMR FID
##END=
