##TITLE=1H_Ad=o(bat1)-PE-DCM
 CDCl3
 8 sc, 
 22.12.2022
##JCAMPDX= 6.0         $$ Bruker NMR JCAMP-DX V2.0
##DATA TYPE= NMR FID
##DATA CLASS= NTUPLES
##ORIGIN= UXNMR, Bruker Analytische Messtechnik GmbH
##OWNER= root
$$ XWIN-NMR		Version 3.5
$$ Thu Dec 22 14:08:09 2022 Russian Standard Time (UT+4h)  she@DPX200
##.OBSERVE FREQUENCY= 200.13135
##.OBSERVE NUCLEUS= ^1H
##.DELAY= (6, 6)
##.ACQUISITION MODE= SIMULTANEOUS
##.ACQUISITION SCHEME= undefined
##.AVERAGES= 8
##.DIGITISER RES= 18
##SPECTROMETER/DATA SYSTEM= spect
##.PULSE SEQUENCE= zg30
##.SOLVENT NAME= CDCl3
##.SHIFT REFERENCE= (INTERNAL, CDCl3, 0, 15.7039)
##AUDIT TRAIL= $$ (NUMBER, WHEN, WHO, WHERE, WHAT)
$$ ##TITLE= Audit trail, XWIN-NMR		Version 3.5
$$ ##JCAMPDX= 5.01
$$ ##ORIGIN= Bruker BioSpin GmbH
$$ ##OWNER= she
$$ F:/spectra/data/she/nmr/H-F/1/audita.txt
$$ ##AUDIT TRAIL=  $$ (NUMBER, WHEN, WHO, WHERE, WHAT)
(   1,<2022-12-22 14:06:49.96 +0400>,<she>,<DPX200>,
      <created by zg, POWCHK disabled, PULCHK disabled
       configuration hash MD5:
       00 E9 B6 7A A2 85 ED C7 34 08 36 98 17 FE 4E 26
       data hash MD5: 16K
       0B 8D 07 3A 7D C5 FB 0D 0E 3D 53 EC D0 7B D5 B6>)
$$ ##END=
$$ 
$$ hash MD5
$$ 2B 4B 91 D7 CD 89 B6 A3 B5 0C EF 0F CD 40 67 3E
##$RELAX= 
##$RELAX= 
##$RELAX= 
##$RELAX= 
##$RELAX= 
##$RELAX= 
$$ Bruker specific parameters
$$ --------------------------
##$DU= <F:/spectra>
##$EXPNO= 1
##$NAME= <H-F>
##$PROCNO= 1
##$TYPE= <nmr>
##$USER= <she>
##$AMP= (0..31)
100 100 100 100 100 100 100 100 100 100 100 100 100 100 100 100 100 100 
100 100 100 100 100 100 100 100 100 100 100 100 100 100 
##$AQSEQ= 0
##$AQ_mod= 1
##$AUNM= <au_zg>
##$AUTOPOS= <>
##$BF1= 200.13
##$BF2= 200.13
##$BF3= 200.13
##$BF4= 200.13
##$BF5= 200.13
##$BF6= 200.13
##$BF7= 200.13
##$BF8= 200.13
##$BYTORDA= 1
##$CFDGTYP= 0
##$CFRGTYP= 5
##$CHEMSTR= <none>
##$CNST= (0..31)
1 1 145 1 1 1 1 1 1 1 1 1 1 1 1 1 1 1 1 1 1 1 1 1 1 1 1 1 1 1 1 1 
##$CPDPRG= <>
##$CPDPRG1= <>
##$CPDPRG2= <>
##$CPDPRG3= <>
##$CPDPRG4= <mlev>
##$CPDPRG5= <mlev>
##$CPDPRG6= <mlev>
##$CPDPRG7= <mlev>
##$CPDPRG8= <mlev>
##$CPDPRGB= <>
##$CPDPRGT= <>
##$D= (0..31)
0 1.2 0 0 0 0 0 0 0 0.06 0 0.03 0 0 0 0 0.0002 0 0 0 0 0 0 0 0 0 0 0 0 
0 0 0 
##$DATE= 1671703609
##$DBL= (0..7)
120 120 120 120 120 120 120 120 
##$DBP= (0..7)
150 150 150 150 150 150 150 150 
##$DBP07= 0
##$DBPNAM0= <>
##$DBPNAM1= <>
##$DBPNAM2= <>
##$DBPNAM3= <>
##$DBPNAM4= <>
##$DBPNAM5= <>
##$DBPNAM6= <>
##$DBPNAM7= <>
##$DBPOAL= (0..7)
0.5 0.5 0.5 0.5 0.5 0.5 0.5 0.5 
##$DBPOFFS= (0..7)
0 0 0 0 0 0 0 0 
##$DE= 6
##$DECBNUC= <off>
##$DECIM= 32
##$DECNUC= <off>
##$DECSTAT= 4
##$DIGMOD= 1
##$DIGTYP= 9
##$DL= (0..7)
0 120 120 120 120 120 120 120 
##$DP= (0..7)
150 150 150 150 150 150 150 150 
##$DP07= 0
##$DPNAME0= <>
##$DPNAME1= <>
##$DPNAME2= <>
##$DPNAME3= <>
##$DPNAME4= <>
##$DPNAME5= <>
##$DPNAME6= <>
##$DPNAME7= <>
##$DPOAL= (0..7)
0.5 0.5 0.5 0.5 0.5 0.5 0.5 0.5 
##$DPOFFS= (0..7)
0 0 0 0 0 0 0 0 
##$DQDMODE= 0
##$DR= 18
##$DS= 0
$$ [...]
##$SUBNAM2= <"">
##$SUBNAM3= <"">
##$SUBNAM4= <"">
##$SUBNAM5= <"">
##$SUBNAM6= <"">
##$SUBNAM7= <"">
##$SUBNAM8= <"">
##$SUBNAM9= <"">
##$SW= 18.05172834244
##$SWIBOX= (0..15)
0 0 2 0 0 0 0 0 0 0 0 0 0 0 0 0 
##$SW_h= 3612.71676300578
##$TD= 16384
##$TD0= 1
##$TE= 0
##$TE2= 300
##$TE3= 300
##$TEG= 300
##$TL= (0..7)
0 120 120 120 120 120 120 120 
##$TP= (0..7)
150 150 150 150 150 150 150 150 
##$TP07= 0
##$TPNAME0= <>
##$TPNAME1= <>
##$TPNAME2= <>
##$TPNAME3= <>
##$TPNAME4= <>
##$TPNAME5= <>
##$TPNAME6= <>
##$TPNAME7= <>
##$TPOAL= (0..7)
0.5 0.5 0.5 0.5 0.5 0.5 0.5 0.5 
##$TPOFFS= (0..7)
0 0 0 0 0 0 0 0 
##$TUNHIN= 0
##$TUNHOUT= 0
##$TUNXOUT= 0
##$USERA1= <user>
##$USERA2= <user>
##$USERA3= <user>
##$USERA4= <user>
##$USERA5= <user>
##$V9= 5
##$VALIST= <valist>
##$VCLIST= <CCCCCCCCCCCCCCC>
##$VD= 0
##$VDLIST= <DDDDDDDDDDDDDDD>
##$VPLIST= <PPPPPPPPPPPPPPP>
##$VTLIST= <TTTTTTTTTTTTTTT>
##$WBST= 1024
##$WBSW= 4
##$XGAIN= (0..3)
0 0 0 0 
##$XL= 0
##$YL= 0
##$YMAX_a= 115282
##$YMIN_a= -156482
##$ZGOPTNS= <>
##$ZL1= 120
##$ZL2= 120
##$ZL3= 120
##$ZL4= 120
##$ABSF1= 10
##$ABSF2= 0
##$ABSG= 5
##$ABSL= 3
##$ALPHA= 0
##$AQORDER= 0
##$ASSFAC= 0
##$ASSFACI= 0
##$ASSFACX= 0
##$ASSWID= 0
##$AUNMP= <proc_1d>
##$AZFE= 0.1
##$AZFW= 0.1
##$BCFW= 1
##$BC_mod= 2
##$BYTORDP= 1
##$COROFFS= 0
##$CY= 11.3945322036743
##$DATMOD= 1
##$DC= 2
##$DFILT= <>
##$DTYPP= 0
##$F1P= 2.36226072786647
##$F2P= -0.459571619588291
##$FCOR= 0.5
##$FTSIZE= 0
##$FT_mod= 4
##$GAMMA= 1
##$GB= 0.15
##$INTBC= 1
##$INTSCL= 1
##$ISEN= 128
##$LB= 0.24
##$LEV0= 0
##$LPBIN= 0
##$MAXI= 10000
##$MC2= 0
##$MEAN= 0
##$ME_mod= 0
##$MI= 1.114404
##$NCOEF= 0
##$NC_proc= 0
##$NLEV= 6
##$NOISF1= 3.799351
##$NOISF2= 2.8
##$NSP= 1
##$NTH_PI= 0
##$NZP= 0
##$OFFSET= 15.70392
##$PC= 1
##$PHC0= -19107.2
##$PHC1= 19.20073
##$PH_mod= 1
##$PKNL= yes
##$PPARMOD= 0
##$PSCAL= 0
##$PSIGN= 0
##$REVERSE= no
##$SF= 200.130013532006
##$SI= 16384
##$SIGF1= 3
##$SIGF2= 2
##$SINO= 400
##$SIOLD= 16384
##$SREGLST= <1H.CDCl3>
##$SSB= 0
##$STSI= 0
##$STSR= 0
##$SW_p= 3612.71676300578
##$SYMM= 0
##$S_DEV= 0
##$TDeff= 0
##$TDoff= 0
##$TI= <>
##$TILT= no
##$TM1= 0
##$TM2= 0
##$TOPLEV= 0
##$USERP1= <user>
##$USERP2= <user>
##$USERP3= <user>
##$USERP4= <user>
##$USERP5= <user>
##$WDW= 1
##$XDIM= 8192
##$YMAX_p= 0
##$YMIN_p= 0
$$ End of Bruker specific parameters
$$ ---------------------------------
##NTUPLES= NMR FID
##VAR_NAME=  TIME,          FID/REAL,        FID/IMAG
##SYMBOL=    X,             R,               I
##VAR_TYPE=  INDEPENDENT,   DEPENDENT,       DEPENDENT
##VAR_FORM=  AFFN,          ASDF,            ASDF
##VAR_DIM=   8192,          8192,            8192
##UNITS=     SECONDS,       ARBITRARY UNITS, ARBITRARY UNITS
##FACTOR=    0.0002768,     1,               1
##FIRST=     0,             0,               0
##LAST=      2.2672688,     0,               0
##MIN=       0,             -156482,         0
##MAX=       2.2672688,     115282,          0
$$ Real data points
##PAGE= N=1
##DATA TABLE= (X++(R..R)), XYDATA
$$ [...]
1780A92k6n9K13m65L19j22m6M3p9p3k40L25J81o9j47L1J5L2k54J41J26J8j62Q6
1804b0K11R7l54J45K09r7k12J34k61P2j3K42R4k62N1K93k66J32l98J42j99N32
1826B72l38J95k55k7n1J99Kk14K91m9n4o6J05J33k18J03j25l7L70j68K25j63k34
1849a04P0m1K54j49j48J3J09k12K33k05l5J74K0j22K46r6k8k1N8R6j70j38O22
1872D26k16j77l07J91M5K00m37J74L4K25k96j1J80n8J43j0j94l32L67j17K88r5
1894B3O8j81J14j44J22J53n2k44K52q8J06p5l3l4M9j62K73%k05N0J34l34K43p5
1918d0L7j75K76K5l47K90K4j12n7P2k12Q6l0L21j90J25j84K69p6j27K11l03M1
1941g6M5R7k98K02M8k5J75j76J19J7n1j99O5M8K5q0K37p2p4j4OJ62k04K74j02
$$ plain form
1780 192 166 107 320 -145 174 52 6 49 -30 -103 -343 -18 163 94 -53 -22 -7 25 -229 -88 38 56 -106 -20
1804 -20 191 288 -66 79 288 191 -21 113 -148 -76 -89 153 247 -15 36 329 63 195 -203 -61 -260 272
1826 272 -66 129 -126 -153 -204 -5 -3 -217 74 25 -29 -95 10 143 -75 28 -97 -134 236 68 293 130 -104
1849 -104 -34 -75 179 30 -118 -105 4 -208 25 -180 -215 -41 -21 -143 103 7 -21 -42 16 112 -58 -196 426
1872 426 210 33 -274 -83 -38 162 -275 -101 -67 158 -138 -149 31 -27 116 106 -88 -420 -53 -170 118 23
1894 23 91 -90 24 -120 2 155 103 -141 111 23 129 54 21 -13 36 -126 147 147 -58 -8 126 -208 35 -40
1918 -40 -3 -178 98 123 -224 66 90 -22 -79 -7 -219 -133 -163 158 -32 93 -91 178 102 -25 186 -117 -76
1941 -76 -31 66 -232 -30 18 -7 168 -8 111 128 77 -122 -57 -9 16 -64 173 101 27 13 19 181 -23 251 149
1966A49o03L12M45m06R3p0j64K79L03n22P8J39l1Rl9K11J15m70J99R3j15N5o5
1989ej1N3l01J4K77m4RK1R1l02Q4R7K09j62J20j01R1r5j08J8N2J57k27P0J45m1
2015A11k21o7J25j6J35j73k42K03P3j2K1k7J61j88J09P2j43n6kJ88l5J9J35LK9
2040B02p2j65J29j41j32J06n4J92Q6m77M26J77l12r0K41k38K36j64o1L11k15n5
2062g0O1r6J28p4J42j77j36q0L49p3r0M7R6J39m49M47k47l0L5j86K57J15k43L
2086a32o6L8K69N8O8k91k38K52J15k67L02n06M42o1j23J38K15j43p0R5j13k5q8
2109a31M29l41J47k91R0O0k20K11J44m31L09pR1j2k6j76M11m33L07M4Nk04Kn3
2133g5j00J97r6Q9j16O7N7kn4L7l4Q3k26L03j26K34m34K89k4m9J5N2L7r8j18J41
$$ plain form
1966 149 -454 -142 303 -103 -10 -80 -244 35 338 -184 -106 33 2 11 -28 183 298 -172 27 120 5 60 -5
1989 -5 -16 37 -264 -250 27 -17 -8 13 104 -198 -114 -17 192 30 150 49 140 45 -63 -45 7 164 -63 7 152 111
2015 111 -110 -177 -52 -68 67 -106 -348 -145 -72 -84 -63 -90 71 -117 -8 64 -79 -135 -137 51 16 35 170 173 202
2040 202 130 -35 94 -47 -179 -73 -127 65 151 -326 100 277 -35 -125 116 -122 114 -50 -111 200 -15 -70
2062 -70 -9 -105 23 -51 91 -86 -222 -302 47 -26 -116 -69 27 166 -283 164 -83 -113 -78 -264 -7 108 -135 -132
2086 -132 -198 -160 109 167 235 -56 -294 -42 73 -194 108 -398 44 -17 -140 -2 213 70 0 95 -18 -43 -131
2109 -131 298 -43 104 -187 -97 -37 -257 -46 98 -333 -24 -31 60 48 22 -154 257 -176 131 175 180 -24 -22 -75
2133 -75 -175 22 -74 15 -101 -34 23 21 -33 4 -30 53 -173 130 4 238 -196 93 69 20 35 87 124 26 -92 49
2159D9P7l18Q2J04K08j06l5J43m02L85l57K14k2j53L22j13j76K1j79K29J13J02
2181A88mR2l59k32K83j50M19j79m8p9L49k47j09J62j42K7r6N7o1K51m4j02k51
2204b75J95L3K12jm34L74j18O7mq5o9J95P6j18j45L49m43j2K10q1kn5K52q3P0
2229A08k1k34P2K81j88P9p3j07J8n9J64M3pj96K39k41J30J60j71M6n0M7p0J19
2253H9o3j56J94q4J38j99J72j24jJ29r6k3j47J76J66l04J90m6r8J29J71k96n0
2276a33M62n95J39J77j32J87j71k2r6L68k38J03j64P0K68j53j15k67M42o6p3O4
2298E5N8l02J19O3J75j15n6o7r1P0N6J55L1q9j2j57K3J91R8l12J64lj35j15N73
2323C77m23L33m64j05J38K54R4k97j88M26N0j78p0J7j67L69l3m21J59K30k43J37
$$ plain form
2159 49 126 -192 -110 -6 202 96 61 204 -198 187 -170 44 22 -131 191 78 -98 -77 -256 -27 86 188
2181 188 184 276 -83 -315 -32 -182 237 58 10 -69 280 33 -76 86 -56 -29 -125 -68 -129 122 78 -24 -275
2204 -275 -80 -47 165 164 -270 104 -14 53 49 -36 -105 90 166 48 -97 252 -191 -203 7 -74 -76 -131 121 38 108
2229 108 87 -147 -75 206 18 97 24 -83 -65 -124 40 83 76 -120 119 -122 8 168 -3 43 -7 40 -30 89
2253 89 26 -130 64 -20 118 -81 91 -33 -34 95 -1 -24 -171 5 171 -133 57 11 -87 42 213 -83 -133
2276 -133 329 -266 -127 50 -82 105 -66 -88 -184 184 -54 49 -115 -45 223 70 -45 -312 130 64 -9 55
2298 55 113 -189 -70 -7 168 53 -3 -70 -161 -91 -35 120 151 62 50 -107 -84 107 205 -107 57 54 -81 -196 377
2323 377 -46 287 -177 -282 -144 110 204 -93 -281 145 195 17 -53 -36 -203 166 133 -288 -129 101 -142 -5
2345ej70P7P0K30q1K21r6l80J20j59R7Q7K30k52L3j18J10j09rL0qrK14o4J3r8
2371b6m2J47j63J39k1j52L49j80j11O0j25O5L70m05l6N6J4J39J16l9k12j7j0J31
2395D7K8j85o2J99J26j95j31M51j74p3k30J88P8l7J28q3J11k66K05n6j48Q7j42
2418a34J22j04K43L4l55M69k53L4l4J11l35J87J10KN0N6kk48K20L9j38j0m2l47
2442c25J15J2M5k0J49M4M8j86R6qN1L6J00P1l13k2L8J47L07m75R1P0K20o4k93
2467f6L54j82k43j58PM12r4r6J40k94J92n7k33N61m13K72J88l20O1j09J13j94
2489a59L24o7l27J28L10q1p9M2m5k4K2R0j6L9k36o4M50l89K17l53R5J93j23K39
2513A86O3k47J64j45m19J47M15rj74r0J88j30J60l30L17J24k61J91k31L08p4j24
$$ plain form
2345 -5 -175 -98 -28 202 121 342 246 -134 -14 -173 -76 11 241 -11 22 -96 14 -95 -104 -74 -82 -91 123 59 72 -26
2371 -26 -68 79 -84 55 34 -118 231 51 -60 0 -125 -60 310 -95 -131 -75 -61 78 194 155 -57 -74 -84 47
2395 47 75 -110 -172 27 153 -42 -173 278 104 31 -199 -11 67 30 158 75 186 -80 125 69 -79 8 -134
2418 -134 -12 -116 127 161 -194 275 22 56 22 133 -202 -15 95 97 147 203 201 -47 173 212 74 64 22 -325
2442 -325 -210 -198 -153 -173 -24 20 68 -118 -22 -30 21 57 157 228 -85 -107 -69 78 385 -90 1 71 291 227 -66
2467 -66 288 106 -137 -295 -288 124 30 -66 74 -220 -28 -85 -318 243 -170 102 290 -30 31 -78 35 -159
2489 -159 165 98 -229 -101 209 128 49 91 46 22 44 134 118 157 -79 -143 307 -82 135 -218 -123 70 -53 186
2513 186 249 2 166 21 -398 -251 164 155 -19 -109 79 -51 109 -221 96 220 -41 150 -81 227 153 29
2535B9q0n1n0K12k89J74r0J62K05k10q8J15m3l9o3k6L21k10oJ14J1P7j30o0O9
2560E4j15J09p1NJ08P6k36M10m02J30k42J5J15J14l5P0j6j44J23j64K90p6j19
2583ak03N15k56q6k55R4K44P4K18m93J91j65J03k2p4J49k03L55k01J86k12L71
2605C29j81k12K14l53K37j26N3L2J30j90K72j59J99k89m7K1N4l3M30j96j86j58
2627a59K04j15J85J82L5k01k41J69j0j62J17j20K99k70r7J86K66k57j91J44j14
2648a50K77j9j09J48j84J29j19M9j33O2k7J09j87J55j93J28J55j53L1Q7o6o2M4
2671b8R4q9j1J04n9k11J55J2j6K13j84Q3m4M7j17j5Jk6J5L1P0J32l27J81j21O9
2697d1j50K84k18j3j12K65J70k82J63j09P9j5J18J93k65j53K13J18j94k51K57
$$ plain form
2535 29 -51 -102 -152 60 -229 -55 -145 17 222 12 -76 39 -4 -43 -106 -132 189 -21 -27 87 98 175 45 -15 54
2560 54 -61 48 -23 -18 90 166 -70 340 -62 68 -174 -159 -44 70 35 105 89 -55 68 -96 194 118 -1
2583 -1 -204 311 55 -31 -286 -192 52 126 344 -149 42 -123 -20 -42 -116 33 -170 185 -16 170 -42 329
2605 329 148 -64 150 -203 34 -92 -39 -7 123 -67 205 46 245 -44 -91 -70 -16 -49 381 185 -1 -159
2627 -159 45 -70 115 297 332 131 -110 59 49 -113 4 -116 183 -87 -184 2 268 11 -180 -36 -150
2648 -150 127 108 -1 147 -37 92 -27 22 -111 -49 -76 33 -154 1 -192 -64 91 -62 -31 56 -10 -72 -28
2671 -28 66 -23 -34 70 11 -200 -45 -33 -49 164 -20 63 19 66 -51 -66 -65 -91 -76 -45 25 157 -170 11 -110 -41
2697 -41 -191 93 -125 -138 -250 15 185 -97 66 -43 36 21 139 332 67 -86 127 245 51 -200 57
2718E7J18q0j03J79k26J65k8k03J63R4j97m9J46r9k00R9K33j08J11m07K42j06
2740a99J80J22p4r7K23l91J89M0J47j90J84k73N7J85j2l11K63M2j51N01m82J50
2762A03l40K79j07Q0R2K8j25k7O6QJ53j29Q5k58J03j50J77o9J48r0k49K62n3Q4
2786G1j62J13j08J78k10P0K06j85J53j97l1r9M62k55K3j57j1L09K34n73MQ8k0
2809i7J36j09P5J22l16J66J88k42J04p8Q9j47k42O31l34J75q2J4K29m53M00o0
2831A69k75j1M6J0J16j66K28q4j37J4m4N2L3K02Qj33O9j67K14J44n98K23P7j26
2855a36Kl8K78j92k69K65L13k67p3j30K11q2L00k31Q0Q1k10J20K67l65Q5j24O8
2878d7j67j5K78L8J19o40L15P8N7R9l43K49M15l45L0r4n8QJ01j2l9J19o3lj0k0
$$ plain form
2718 57 175 95 -8 171 -55 110 82 -121 42 136 -61 -110 36 -63 -263 -164 69 -39 72 -335 -93 -199
2740 -199 -19 103 29 -68 155 -236 -47 -7 140 -50 134 -139 -82 103 91 -220 43 85 -66 435 -47 103
2762 103 -237 42 -65 15 107 135 10 -17 49 57 210 81 166 -92 11 -139 38 -31 117 27 -222 40 -13 71
2786 71 -91 22 -86 92 -118 -48 158 -27 126 -71 -102 -201 261 6 29 -128 -139 170 404 -169 -165 -77 -97
2809 -97 39 -70 5 127 -189 -23 165 -77 27 -51 38 -109 -351 280 -54 121 39 53 282 -171 229 169
2831 169 -106 -117 -71 -61 55 -111 117 33 -104 -90 -134 -82 -49 153 161 28 97 -70 144 288 -310 -87 -10 -136
2855 -136 -134 -172 106 -86 -355 -90 223 -44 -117 -247 -36 -118 182 -49 31 112 -98 22 289 -76 9 -115 -47
2878 -47 -214 -229 49 87 206 -434 -119 -41 16 115 -228 21 436 91 121 27 -31 -23 78 66 27 146 83 80 70 50
2904E0j80J91j1L3o9L17j95n3r0j71J61p2J22R1j63L33k06Q4l23q5M9K91O8J09
2928B81l23K08l42N7K10k62L63j82nJ94k15L6K7j59J22j04M1Q7j39J61J18j14
2950F0R4j73J12j02O0J50k02j92K40pR0m6n1J53j17k81K09L2j51J75M8J2j29J9
2974Cj78K43l23K82J13l4j19k3M8J06r1k48L44j11k78J36K83j68J2K52l27kK1
2997e9J91k28J29K8q7K03k84j10L37J54k52j44J24j14K84q3j20J11Mj05r1N30
3019D18k49l97L57l25J87R8k04P3k4pPJ19J5j06j52K40k3j59J76j34K14N4K2p8
3043A22j71j5Ro2K69k50J43j95J84Q8p7Q1j55k98M61r9r6j20R1J24j15j32M09
3066A96m9Q4j1j61r7L1J7j15J43j53J80p4O7j74J41P8k72P8J89j39j88J54K79
$$ plain form
2904 50 -130 61 50 83 14 331 136 83 -7 -178 -17 -89 33 124 -39 294 88 172 -151 -236 -187 104 172 281
2928 281 -42 166 -176 -119 91 -171 192 10 5 199 -16 20 47 -112 10 -94 -53 34 -105 56 174 60
2950 60 154 -19 93 -9 51 201 -1 -193 47 40 130 84 33 186 69 -212 -3 29 -122 53 101 113 -16 3
2974 3 -175 68 -255 27 140 106 -13 -36 12 118 27 -221 123 12 -266 -130 153 -15 -3 249 -78 -80 -59
2997 -59 132 -96 33 61 -26 177 -107 -217 120 274 22 -122 2 -112 172 89 -31 80 84 -21 -112 418
3019 418 169 -228 129 -196 -9 89 -115 -42 -66 -73 -66 53 68 -38 -190 50 27 -132 44 -90 124 178 200 122
3043 122 -49 -64 -55 -117 152 -98 45 -150 34 122 45 126 -29 -327 134 35 -61 -181 -90 34 -81 -213 196
3066 196 147 231 220 59 -38 -7 10 -105 38 -115 65 -9 58 -116 25 103 -169 -91 98 -41 -229 -75 204
3089B04j34R4j61J77j80J58l56M0j12K65O5J31j88Q1J69k20j18J97N3j10P0N4
3111A79j02R2j78r3K33j03k05J68j42Q3L20l06M5p2M6L8M1n6J67n19M89k37L4
3134g8L2J90M9L4k28Q1K1N3j78k28J15K73j54l6j3K8j21J02lq6J25k83K95r4J02
3159bl9k7J65k4J28Mj92j71R0L0J99m4k42j3K52j75j47k1M0J48j68J32M2j67J52
3184e0Q8j11J9l5J42o6j35J4K28J69j72k10J3o6QK21j83J89m9j6j00J99q3k09
3208a95K61l04K35r1j83K84r2j11O6J08o9K8J63q0J07l03K82q1j24J57k81o1J43
3231a41M00k09j71J70k83K15n4q5M7L51l80J86l38J83J47J2o2J38j83j21L2J06
3253d0j09o1J17J67r0J16K8k17k0QL3L7P4j35l1K10J08k22K48l88M1J79j60l15
$$ plain form
3089 204 70 164 3 180 0 158 -198 -158 -270 -5 60 191 3 84 253 33 -85 112 165 55 125 179
3111 179 77 169 -9 -102 131 28 -177 -9 -151 -68 252 -54 -9 -81 -35 3 44 -12 155 -364 125 -112 -78
3134 -78 -46 144 193 227 -1 80 101 154 -24 -252 -137 136 -18 -54 -67 -39 -160 -58 -61 -147 -22 -305 -10 -104 -2
3159 -2 -41 -68 97 73 201 205 13 -158 -68 -38 161 117 -125 -138 114 -61 -208 -229 -189 -41 -209 -77 -35 -202 -50
3184 -50 38 -73 -54 -89 53 -13 -148 -134 94 263 91 -119 -106 -172 -164 57 -126 63 14 -2 -102 97 14 -195
3208 -195 66 -238 -3 -94 -277 7 -85 -196 -130 -22 -91 -63 100 20 127 -176 106 25 -99 58 -223 -284 -141
3231 -141 259 50 -121 49 -234 -19 -73 -158 -111 240 -140 46 -292 -109 38 50 -12 126 -57 -178 -146 -40
3253 -40 -149 -210 -93 74 -16 100 128 -89 -109 -101 -68 -31 43 -92 -123 87 195 -27 221 -167 -126 53 -107 -422
3277d22M09K07n1O6j94P5k23R8M5j83J56rJ0J11k12PN7J27j84L52k61K5j12O8
3301c8j63L71m56L54J87l93l1r8j1M6R7J6J04J61j63Q1k3K17l69K45j40J11j15
3324a0k23K90k57J62R8J03q8n2j86Q5L41k23J7k34J85j24R8J6k08L52j64Q1k55
3347a96K91R2l89L02j55J86j21kjL8j37J97Q1l77K46m9R7J71j75p3m1J61j59J0
3371cN9k9J8K8J6J82l53J22k79J1K68J0oj10P1j58K33r2J51j7l22K14J53r7K02
3396B72k89J76L1l03j2M8j5J9J53l50N15k33M7M4l7O0m5k15K00R1M8k99M7J56
3420A09l6j64K27k60J21J23k29J39j05J80m8k71J14j14j36L08o8O8p9L38l29N8
3442e4KJ17J42m89N38k82J93Q1j55j17P1O2q4p5P0j25j11K24jj86K45j42J7Q2
$$ plain form
3277 -422 -13 194 143 209 15 90 -133 -35 10 -173 -17 -26 -16 95 -117 -110 -53 74 -110 242 -19 6 -106 -38
3301 -38 -201 170 -286 68 255 -138 -169 -267 -278 -232 -135 -119 -15 146 -17 64 41 258 -111 134 -6 105 -10
3324 -10 -233 57 -200 -38 60 163 75 23 -163 -78 263 40 57 -177 8 -116 -18 -2 -210 142 -22 59 -196
3347 -196 95 187 -202 100 -55 131 10 8 7 45 -92 105 186 -191 55 6 103 274 99 26 -15 146 -13 -3
3371 -3 56 27 45 73 89 271 -82 40 -239 -228 40 50 44 -66 5 -153 80 -12 139 122 -200 14 167 70 272
3396 272 -17 159 190 -113 -125 -77 -92 -73 80 -270 245 12 59 103 66 126 81 -134 66 157 205 -94 -47 109
3420 109 73 -91 136 -124 -3 120 -109 30 -75 105 57 -214 -100 -214 -350 -42 -110 -42 -121 217 -112 -54
3442 -54 -52 65 207 -282 256 -26 167 248 93 -24 47 109 25 -50 20 -105 -216 8 7 -179 66 -76 -59 23
3466B3j3j05L0R7l63K12k14J41L10j82j2K47j99J35k7j76R5pJ14N8o8j65j56J92
3490c3J14M5k2q1P6l70L56l06M12j15j22L8j07p6J05L9j63L3J60k36p5K42R4l14
3514c06L49j19j8n9K10r4q5L44j45k45M08l66j7k5J87k8K6j53R4J66q4j7j60l9
3538a76L10j52n0L4L5P2J50j99j84K03k58J06l7J00K45j33J84p0k27K01j43m4
3560c3j49J18R5k10K1L54k12Kl1mn6J11j14Q4j27J38R0j43M1L4o1j37KQ8K41j19
3586B3P8m6j08o8L7j16m4K98k72L54n7l6k45K60k07K10q9k48M41q8j96M9K7j10
3610a53O8L79p14N28j59J87J33m47J11lL05m8k88l2K51j57J28m6j26J51k90L20
3632I8j47M4P1J1m8j02M2J35M5k27J18J27j43j46L5N0l03L77K56m29J42l6J30
$$ plain form
3466 23 10 -95 -65 32 -331 -119 -333 -192 118 -64 -76 171 -28 107 80 -96 -1 -8 106 164 96 -69 -225 -33
3490 -33 81 126 104 23 99 -271 85 -221 191 76 -46 -8 -115 -191 -86 -47 -210 -177 -17 -253 -328 -86 8 -306
3514 -306 43 -76 -94 -153 57 -37 -122 222 77 -168 240 -126 -143 -168 19 -9 17 -136 -42 124 40 23 -137 -176
3538 -176 134 -18 -68 -34 1 73 223 24 -160 43 -215 -109 -146 -46 199 66 250 180 -47 154 11 -33
3560 -33 -182 -64 31 -179 -158 196 -16 -14 -45 -49 -105 6 -108 -24 -151 -13 77 -66 -25 9 -52 -189 -187 -99 142 23
3586 23 101 55 -53 -121 -84 -200 -244 54 -218 136 79 43 -202 58 -149 61 -28 -276 165 77 -119 -70 -43 -153
3610 -153 -85 294 -420 108 -51 136 269 -178 -67 -70 235 187 -101 -133 118 -39 89 43 -83 68 -222 98
3632 98 -49 -5 66 77 29 -73 -31 104 149 -78 40 167 24 -122 -87 -37 -340 37 293 -136 6 -30 100
3655A00l2N8o3j66N4J81j49MM9K04q0k12q6Q3l2j34L21j67m5J4L1j5J45rK15k23
3681D6k14J52jj34J22q0J00J9L52n02m4K54J43k75O2o0r6J44J20ol15J47R9J41
3705A74j39J36l30Ql3r6L63o8J18p7r6J96j88kJ00k93L66m9J9l1j22L17k40J1
3729D4j7l46L05J79l78L3k32L18n4KJ40jK4LL4j14K24j05k5m5O7J72o2j77r0K11
3755A10kpk0kj56j5J72J14k01j0j81K10p2J03o9J15J11k03K31k82Pk15K17N1j15
3780a09K48P0j99k8L15l23J7N3p3J77l21j71N51l27p3K88K2k80M46j75j66j9K52
3803A75n7p7k04P8K21Kl5j11j27Q2K27k59KJ59JL5k07K54j70O6j16J49J92j27
3827A53j40k42K36R8k18J44k12K89o1q8J11j04r8J12j3K23j08j50P3J62m7l2j26
$$ plain form
3655 100 68 126 63 -103 -49 132 -17 -13 36 240 160 -52 -138 -55 -87 -221 100 -67 -112 -98 -67 -82 63 54 269 46
3681 46 -168 -16 -17 -151 -29 -109 -9 10 362 -140 -184 70 213 -62 0 -60 -156 -12 108 102 -213 -66 33 174
3705 174 35 171 -159 -151 -184 -280 83 15 133 56 -40 156 -32 -34 66 -227 139 90 109 78 -44 273 33 44
3729 44 27 -319 -14 165 -213 -180 -412 -94 -148 -146 -6 -7 17 20 54 -60 164 59 34 -11 56 228 166 -11 -101 110
3755 110 108 101 81 79 -77 -92 80 194 -7 -17 -198 12 -60 43 -26 89 200 -3 228 -54 -47 -262 -45 6 -109
3780 -109 139 209 10 -18 297 -26 -9 44 -29 148 -173 -344 207 -120 -193 95 117 -163 283 108 -58 -77 175
3803 175 118 41 -163 -85 136 138 103 -8 -135 -53 174 -85 -83 76 77 112 -95 159 -11 55 -61 88 280 153
3827 153 13 -229 7 105 -113 31 -181 108 47 -41 70 -34 -132 -20 -33 190 82 -68 5 167 120 88 -38
3850c8j68O9J25j13j2J16L9j37l8N0R0J36q0K8n6R9j40p2Q1L7P1j26J85j61r1
3875a06p1J70kL24l52N7j9j3J89m29k7M3L18Q6j55J89j95K3k1%r1J08k93M51j16
3900F8k25N2L03k80o5j2K57j68K93o1j60m8J4P1k92J95J85k23P6K89l16J52k71
3923a66J29j29o1K84r2j04L14j72K19m78J56m3K09l5K40j70l6m4JN3j28j20K40
3946F7K31l59K30k45L9j45K97j86K75k79R9k13L17j55J45j48j47L27k31n4p4R9
3968a10M6K99k19L1m8K00j37k55K39R0Nn2k01K08j40Rj26j11M9K73M9j97N1j00
3992a47K94k10J22j10K03j56J09K6l77L75o8R4j75k2Nk1J45n5m2j02K16j89J98
4015A13M5k32J29j36J98k06J4Mkm2K43k97k1O6k8o3L92l50L49n4j56R4k94j04
$$ plain form
3850 -38 -206 -137 -12 -125 -137 -21 18 -119 -157 -107 -17 119 39 67 11 110 -30 -102 -21 16 87 -39 146 -15 -106
3875 -106 -177 -7 -9 315 -37 20 1 -12 177 -252 -279 -236 82 168 13 202 7 30 9 9 -82 26 -267 184 68
3900 68 -157 -105 198 -82 -147 -159 98 -70 223 162 2 -46 -32 39 -253 -58 127 -96 -20 269 -47 105 -166
3923 -166 -37 -166 -227 57 -35 -139 175 3 222 -256 -100 -143 66 31 271 101 65 21 22 75 -53 -173 67
3946 67 298 -61 169 -76 -37 -182 115 -71 204 -75 24 -189 128 -27 118 -30 -177 150 -81 -135 -209 -110
3968 -110 -64 235 16 47 -1 199 62 -193 46 136 141 89 -112 96 -44 -35 -161 -272 -223 50 99 -98 -47 -147
3992 -147 147 -63 59 -51 152 -4 105 131 -246 129 61 155 -20 -42 -37 -58 87 32 -10 -112 104 -85 113
4015 113 158 -74 55 -81 117 -89 -75 -71 -73 -115 128 -169 -190 -124 -152 -215 177 -173 176 122 -34 60 -234 -338
4039c38M70M7l62Q1J83j08J93k07K43o6J45k56J16o4q4r5J23j3k78M44j90lK36
4062B17j23k02J57j10L06j34J2l47J53Rj00N5O6k61N8L48k38oJ14K34n8J11k99
4085c8J87k8o7l75J27J60m6K76p9k04L12l9l53N7J33j70K5R7n2K36k10n4J49J45
4109A89j13k42K42J39k11k88J66p2J77k6J6K16l71M7q7O3M15l17K7J80m7j7j08
4132b2K9n0L2N6k40K58k31K74O3l30J67j52K66K8K6n0j16r1M2K08k2K5k40R1n9
4157c8L5J3L9r8J43j47J47j81k6k4K73k13L54m51J10K24k90K46k56L3p6l2L06
4180I1k33o6J71L32j9k00j12K87m00K21j58j39J64L7K2N2K40k86L4j15K3m1M0
4203e5j17K59N6k36J17pJ62p8j04j39J25o1mJ39lq8j90N99k23j43j38O8K52j17
$$ plain form
4039 -338 132 179 -183 -102 81 -27 166 -41 202 136 281 25 141 77 -7 -102 21 8 -270 174 -16 -19 217
4062 217 94 -108 49 -61 245 111 123 -224 -71 -62 -162 -107 -41 -302 -244 104 -134 -140 -26 208 150 261 -38
4085 -38 149 121 54 -321 -194 -34 -80 196 117 -87 225 186 -167 -110 23 -147 -122 -25 -77 159 -51 -105 44 189
4109 189 76 -166 76 215 4 -284 -118 -190 -13 -39 -23 193 -178 -131 -218 -155 260 -57 -30 150 103 86 -22
4132 -22 7 -43 -11 45 -195 63 -168 106 169 -161 6 -146 120 148 174 124 8 -83 -41 167 145 170 -70 21 -38
4157 -38 -3 10 49 -49 94 -53 94 -87 -113 -137 136 -77 277 -174 -64 160 -130 116 -140 -107 -183 -215 91
4180 91 -142 -208 -37 295 276 76 -36 251 -149 72 -86 -225 -61 -24 -2 50 290 4 38 -77 -54 -95 -55
4203 -55 -172 87 143 -93 24 17 179 101 -3 -142 -17 -78 -82 57 54 -34 -224 375 152 9 -129 -61 191 74
4227G4M6Q4j86n4Oq1J91j10N4J04m1l56J90K63k59m5J44j35p0L45j16j36qJ54
4251E8j2j34l9J33j1K00j38j99J66J34j43Q2k25J74q1K77k04J88k50m4K89j99
4273B2O9k11l9nJ5J8J6J53O8K7k18qp5J97l4K38k79M8O6j65K59j26k53J97Nk07
4299b22K59p9J94N7k55M4L42l05lk43M95l50k4R4L03l93J71j55J33j63Q8J84j7
4322A55J22j14k91K55k50P4J21J6J03l41J11j33O2j55K25J42nj84J53J12k05J29
4344A02o6k9K4k27M1L64j36q8N0J64j51J96l50J69j70J4J72k11J49j07K60m2k66
4367a38J08J54k48K85N4k06r8J97p3rj72J5L45m38J41j3J18N8Q9m99L33J93k51
4390e5j29J06K7P1L65m35K8j06n6n0K91M3l6o7J98n5o4L2j19R2oQj98n8R2J26
$$ plain form
4227 74 120 204 18 -36 -30 -111 80 -30 24 128 87 -269 -79 184 -75 -120 24 -111 -181 164 48 -88 -96 58
4251 58 46 -88 -127 6 -5 195 57 -142 24 158 15 97 -128 46 -35 242 38 226 -24 -68 221 22
4273 22 91 -120 -159 -164 -149 -131 -115 38 106 133 -85 -93 -168 29 -5 233 -46 2 68 -97 162 36 -217 -20 -15 -222
4299 -222 37 -42 152 209 -46 -2 340 35 32 -211 284 -66 -90 4 307 -86 85 -70 63 -100 -12 172 155
4322 155 277 163 -128 127 -123 -49 72 88 191 -150 -39 -172 -110 -265 -40 102 97 -87 66 178 -27 102
4344 102 36 7 31 -196 -155 209 73 -15 35 199 48 244 -106 63 -107 -93 79 -132 17 -90 170 128 -138
4367 -138 -30 124 -124 161 215 9 -89 108 35 26 -146 -131 214 -224 -83 -96 22 80 169 -330 3 196 -55
4390 -55 -184 -78 -51 20 385 -50 -22 -128 -184 -234 57 100 64 -3 195 140 76 108 -11 81 75 83 -115 -173 -81 45
4416D5j83O9L00n9j64n5O6j43J33j6J43k02PK08k44L9J38p5N5j1rk60K44l61J03
4441b32L7M6K29m13L36N4J47k32J0K69j69m0l71L83k33K22J02j41m2J28P7l44
4463a77R9nK1K70j38j42J14k06M7J12O6J64j77J31mj33o6j10J55K93l45L8j65
4486a58L05j47k29J01J22j77J91J71j67Q3J08l08Q6n6K31l2j05q7J88k91K43j2
4508F0o3m9j46M12k52N5p6j28J64K29j95k55K35k5O2k39Q2K73j02o3j61L66j44
4531D0j46J97q5j4r8k5K93o8K4j44K1J4K4l44R3K35q7N2J48o6m9J95o0j66O4m7
4557An6M49n25J53Q9j1k05L86n10O0K34O5k57J15O9p1Q4j39j33L69k08L16l94
4580a19M5Q9M8K6J18k10k52P9K60k12K71l18K15K09o0j20%o1O0k58J85j13j4K27
$$ plain form
4416 45 -138 -69 231 172 8 -47 19 -124 9 -7 136 -66 -59 149 -95 -56 82 7 62 51 42 -218 26 -335 -232
4441 -232 -195 -149 80 -333 3 57 204 -28 -18 251 82 42 -329 54 -179 43 145 4 -38 90 167 -177
4463 -177 -78 -83 -62 208 70 -72 42 -164 -117 -5 61 225 48 179 175 42 -24 -134 21 314 -31 7 -158
4486 -158 147 0 -229 -128 -6 -183 8 179 12 95 203 -105 -19 -75 156 124 19 -68 120 -171 72 60
4508 60 -3 -52 -198 214 -38 17 -59 -187 -23 206 11 -244 -9 -34 28 -211 -129 144 42 -21 -182 184 40
4531 40 -106 91 6 -8 -106 -131 162 94 118 -26 -5 9 33 -311 -218 17 -70 -18 130 64 15 210 150 -16 48 1
4557 1 -55 394 -131 22 111 100 -105 281 -229 -169 65 130 -127 -12 57 -14 70 -69 -202 167 -41 275 -119
4580 -119 -74 15 63 89 207 -3 -255 -176 84 -128 143 -175 40 249 189 69 69 8 68 -190 -5 -118 -132 95
4604I5o2J08J14j62Q4m97M83p7j35L7j05J34R4J08k17M6j84J19j08m6J31J78j66
4627b8l0K62k29k04N32k50ok67L97r5k13K34jR4M8k01R7j58nR3j58j13K15q4K24
4652A54r3j85k65L39O5j70M03l70L02l39K80k60Q5k97P33m80J20r9J86j76j81
4673b48K58p0K3O0j82N9K30j3l12R9j88K49M9M89o05O7R7J5N7L6p7k79J35K55
4697B04k01O9j69JJ89K2N1m79M01p4J12j08n8j07J03N9J82k2m13J26K47j94J22
4720F3k02J40J07j01K54o23K84K25k01M8P6j90J07J09j3l11K65J34j31N1j99O3
4742d5K43j54L9q8R0k53K40r3j49Q3K48q5o7J08j06R6j44j15K29l2k06J59q0K7
4766e5J25n6N2l4j56R6J0O9j12K55l90M87k09K49j45j21j17J16m2k29K86j39J32
$$ plain form
4604 95 33 141 255 93 177 -320 163 86 -49 -12 -117 17 111 219 2 48 -136 -17 -125 -171 -40 138 -28
4627 -28 -58 204 -25 -229 303 53 47 -220 177 82 -131 103 102 196 244 43 140 -18 -23 70 -88 -201 14 -70 154
4652 154 61 -124 -389 -50 15 -155 248 -122 180 -159 121 -139 -54 -351 382 -98 22 -77 109 -67 -248
4673 -248 10 -60 -37 23 -159 -100 130 117 -195 -96 -284 -35 14 503 -102 -35 62 77 134 170 93 -186 -51 204
4697 204 3 72 -97 -96 93 115 166 -313 88 14 126 18 -40 -147 -44 15 197 175 -238 -112 135 -59 63
4720 63 -139 1 108 7 261 -362 -78 147 -54 -6 70 -120 -13 96 83 -228 37 171 40 91 -108 -45
4742 -45 198 44 83 -5 85 -168 72 -21 -170 -87 161 76 9 117 11 107 -37 -152 77 45 -161 -2 -82 -55
4766 -55 70 14 66 32 -124 -28 -18 51 -61 194 -196 291 82 331 186 65 -52 64 22 -207 79 -60 72
4789G2P0k13m9K15L6j30P7q7l4rJ02o1J80n53K20M14l32l4m1K9L82k54o4K32j84
4814a6Q4j63RJ75k73n2K96K03l49J8P2k14l2M12q2n6k07J72J20N0r4k27K0N7P9
4839BK46j79j38J44l5j43K08k20K16N4j87J34q8j50J41kO4p7K5j14j31K34l01
4862b97L17P6j29J98j45k13M13q4j43n3O2K47j47j01O0K89m17j70J12K26j41p8
4884a18J60l5L54j27J51m59k03J37L09m4l84L26k27K54l7n9J0q9m9J38m0rQ9m1
4908GK13j60L3k43j9L53m5m38L37N4j80M5l6J91r5n4J83j60j3jR6m6k09O8L63
4933B44m45Q4K5K13J2k7jj71J35l08j1L11J72j28j30MJ31j58J97qj31q9L62k56
4957B7j40J19J31j8O1m35L81k32p9J65J91k06P0j22r3J29J4J7j80j2l0L45j70
$$ plain form
4789 72 142 -71 -120 95 131 1 78 -9 -43 -52 50 -11 169 -384 -164 250 -82 -116 -157 -128 254 0 -64 168 -16
4814 -16 68 -95 -86 89 -184 -236 60 263 -86 -68 4 -210 -242 170 88 32 -175 -3 117 167 73 -154 -134 -77 2
4839 2 248 69 -69 75 40 -103 105 -115 101 155 -32 102 14 -136 5 3 67 -10 15 -99 -230 4 -297
4862 -297 20 96 -33 165 20 -193 220 136 -7 -60 2 249 102 1 61 350 -67 -237 -125 101 -40 -118
4884 -118 42 7 361 234 385 -74 -277 -140 169 125 -259 67 -160 94 57 -2 8 -81 -130 8 -32 -41 48 7
4908 7 220 60 93 -150 -169 184 139 -299 38 92 -88 -43 -79 112 17 -37 146 -14 -27 -28 68 22 -187 -119 244
4933 244 -201 -117 -92 121 133 106 105 -66 69 -239 -250 61 233 105 -25 -21 110 -48 149 141 10 -79 283 27
4957 27 -113 6 137 119 180 -255 126 -106 -185 -20 171 -35 35 -87 -180 -51 -37 -20 -200 -212 -242 103 -67
4980f7Q0Qr5J58k67J92p2J30k9j37J30r3j30L56k0k89K91j31M8l09K85j55J11
5003eL1j01k26L59q2J72o9j85J50j7j25K41Kj27J8j96J11Q8Jk64K60p4M6j10K48
5028A46r8O0r0j67J83l26K65J02j1N1l98M31oj8J30m68P1j24K02J31l96M03l16
5051b43K37R2k26oL64k31K7Q6M3k82R0O4j52K10j56J29P6n4j43k93L45K76p4l27
5075a48K29k81L59k23J9K00l9J1k48J82k04R4l0k5J60q3m0M13l43j07P4K55r3
5098A32J08j19k32J14R6o8l2J5j48m1K59k82K11j10q5M30k36l7J10Q4l18J30L92
5121C73n27M29j57l94M04k72K35j14N1j36K20J4k98K2K97m9M8o7O4l62L09j92
5143a02K43O5l50J13K73L7m30K73k24K10j51J27R9l71J90m3O1j22q9L15L9p4K2
$$ plain form
4980 -67 13 21 -74 84 -183 9 -63 67 38 -99 31 -62 -192 164 144 -145 146 15 63 -246 39 -116 -5
5003 -5 26 -75 -301 58 -24 148 79 -106 44 27 -98 143 145 18 36 -160 -49 39 40 -224 36 -38 8 -102 146
5028 146 48 108 18 -149 34 -292 -27 75 64 115 -283 148 142 124 254 -214 -143 -267 -65 66 -330 73 -243
5051 -243 -6 86 -140 -146 218 -13 14 100 143 -139 -49 15 -137 73 -83 46 122 68 -75 -368 -23 253 179 -148
5075 -148 81 -200 159 -64 -45 155 116 127 -121 61 -143 -49 -79 -104 56 -27 -67 346 3 -104 -30 225 132
5098 132 240 121 -111 3 99 31 -1 14 -134 -175 84 -198 13 -97 -182 248 12 -25 85 169 -149 -19 373
5121 373 -154 275 118 -276 128 -144 91 -23 28 -108 112 126 -172 -150 147 98 146 79 143 -219 90 -102
5143 -102 141 206 -144 -31 242 279 -151 122 -102 108 -43 84 183 -188 2 -41 20 -102 -191 124 163 89 111
5166A11j08m5M5N4J37r0j22Q6%k58J78J72k73P0J00K23l58j45N06m89K49j56L79
5189B66K1m46J41j62M21k20k5J59l1j29j20L3L3K21j80pl4K69j55l33J81K09j85
5212g3L26l92p0L90j52O7l3q6k47M78O3j07k31J58j70J02m7J26J74n04K87j42
5234h3J9n5K20j63o2J66o7J79j75j00j68L18j90K70o0j51o9L6K64k01J6q6O1J60
5258G9r4p2O3K98m08L3K0N2p8J16Q5l6n5M3j00j6L5M2J49k89K17k25J91j87K32
5283I5p8L5O0k38o5K88p0N8J11k01O1j66J73R4j24n3P6r9j73M25q7q1k87L75J40
5308B69j89q4M4J8Rrp1J25j09j27L6J45K6k6m3J89k06ok2m3j03L14j92P6j6k66
5334b61K1L14j41o1N30n94J93J22n4j6R4l24K49k6lj1p7P2J30k28J63N3l20L30
$$ plain form
5166 111 3 -42 3 57 194 104 -18 68 68 -190 -12 160 -113 -43 57 280 -78 -223 283 -206 43 -113 266
5189 266 287 -159 -18 -180 241 21 -4 155 124 -5 -125 -92 -59 162 -18 -25 -59 210 55 -278 -97 112 -73
5212 -73 253 -139 -209 181 29 96 63 -23 -270 208 271 164 -67 91 -79 23 -24 102 276 -228 59 -83
5234 -83 -64 -119 101 -62 -124 42 -25 154 -21 -121 -289 29 -161 109 49 -102 -171 -135 129 -72 -56 -142 -81 79
5258 79 -15 -87 -24 274 -134 -101 -81 -29 -107 9 94 58 3 46 -54 -70 -35 7 156 -133 84 -141 50 -137 95
5283 95 17 52 112 -126 -191 97 27 85 196 -5 56 -110 63 157 33 -20 56 -43 -216 209 122 41 -246 129 269
5308 269 80 -4 40 58 67 58 -13 112 3 -124 -88 57 83 57 14 203 -3 -9 -31 -74 -177 137 -55 21 5 -261
5334 -261 -240 74 -67 -128 402 -192 1 123 69 53 147 -177 72 46 43 32 -45 27 157 -71 92 145 -175 155
5358A55k45J46j51J36K58m22K41M3n9k24K30J20k12M3J51l81K2L54k33j1j77L18
5380A02p0j94J71oj27K1j64J10n0L57l00J92q5j67K09J87j78kk8o2K10j1j18R8
5404I5K24n49J09K30r8n1L4J22k04M0J18l41M39j09kj64M8L0lJ03K1j02K11q7
5428A14l19J82j03M96m28J6J08o9k78J52r9L06j40P3k39K83P0j68L6J20l53L92
5450A52j83J73l59R8j5L1P1J51k12J08J01j80K72k23Nj7J39J35k63j38l9N25m03
5473g1L5j24J45J15j48q0J45j47M09l02J5q0K23n6L7n2J86l58K10j54R4k74L79
5496A47Lk85J98l06K32j23p5N09j58j81J43l71K93O5m8j31J08k35K66K6j47L7
5518c3K70n02K78k09k26M70k54K94K8J96k35j56j51L57m23L54K6J22j41j51j0
$$ plain form
5358 155 -90 56 -95 41 299 -123 118 161 102 -122 108 228 16 59 210 -171 -149 205 -28 -39 -216 102
5380 102 32 -162 9 3 -124 -103 -267 -157 -207 150 -150 42 -43 -210 -1 186 8 6 -22 -84 126 115 -3 95
5404 95 319 -230 -121 109 11 -40 -6 116 -88 -48 70 -271 168 59 57 -107 -59 -29 -32 71 92 -10 201 114
5428 114 -205 -23 -126 370 -58 -42 66 -3 -281 -129 -228 78 -62 11 -228 55 125 -43 -7 113 -240 152
5450 152 -31 142 -217 -119 -134 -103 -32 119 -93 15 116 -64 208 -15 -10 -27 112 247 -16 -154 -193 332 -71
5473 -71 -36 -160 -15 100 -48 -128 17 -130 279 -23 -8 -88 135 79 116 64 250 -108 102 -52 42 -232 147
5496 147 150 -135 63 -243 -11 -134 -209 300 142 -39 104 -267 26 91 43 -88 20 -215 51 77 -70 -33
5518 -33 237 -265 13 -196 -422 48 -206 88 116 312 77 -79 -230 127 -296 58 84 206 65 -86 -96
5539i6J40k0j28J28J28n3j38n5j62J63J36J76j3k80J1oM59m35L7J60j52J10m2
5562F8L0m94M63j02K28j95k26L31Jj91K82l46Mm3K50K1k53J15K75k83j82K94j86
5585a39L9J28j7k91M12o8j22N3J07l46J07K46j89K77n6J1k77J50k0J48j14R9J4
5608A52K7J45m15J18J56k79l8o2J09L09j74j1r4l1K10J11j58j82j33K26R8K33
5630C17m68L35p1k51J23J19k04pK24j47J59k97L78k40j1L46l68O6l26J09L13J12
5652B11j77j38j1K69L6p1k43O%K78L5k22o9L33k99k3J07k09L36j4o7l1j77N3K29
5677A42j29j87J22J83m09L66J86j52j32j16K80k58K0R3J60P8j29l99K61R3j42
5698f9k7J79j7k24L81k52J0LJ24j07q7mK53n6m36K33Q8k36P1l5K57k47J52O1J04
$$ plain form
5539 -96 44 24 -104 24 152 99 -39 -94 -256 -93 43 219 206 -74 -63 -69 390 -45 -8 152 0 110 68
5562 68 98 -396 67 -35 193 -2 -228 103 104 -87 195 -151 -147 -190 60 81 -172 -57 218 -65 -247 47 -139
5585 -139 -100 28 11 -280 132 64 -58 -5 102 -244 -137 109 -80 197 141 152 -125 25 5 153 39 138 152
5608 152 179 324 -91 27 183 -96 -134 -196 -87 222 48 37 -57 -88 122 233 75 -107 -240 -14 84 317
5630 317 -151 184 113 -138 -15 104 -100 -107 117 -30 129 -168 210 -30 -41 305 -63 3 -323 -214 99 211
5652 211 34 -104 -115 154 190 119 -124 -118 -118 160 195 -27 -96 237 -62 -85 22 -187 149 135 68 37 -140 -87 142
5677 142 13 -174 -52 131 -278 88 274 122 -10 -126 154 -104 -84 9 169 247 118 -281 -20 73 -69
5698 -69 -96 83 66 -158 223 -29 -19 -16 108 1 -86 -90 163 107 -329 -96 -8 -244 -173 -208 49 -198 -46 15 119
5723A19r6J03J01k85J80k95K57R0l90N47n09RO9K45m52L76k71J50K01m25L08q9
5745e7j18K3M3R5j3P7j85J33N7j8k69O05l54j25J09j43QL01j37j00K00p2k01K79
5769A38M9p6j11mO7m1j02J2J51J29l31P8J44k95N65k33p8j26P0lJ27k4j57Q9N0
5794H8K0o3L9N8L6j87M59j29l19k00pJ39L5J03j40J38j70J46r8J55j69K5jj92
5818b34K58J8%K01l32K48O4j65L26m10n8L05p4p2j70K04M7j23J41k45K2l8j3J19
5842A9j22L02k92J55j86J96P7j61p4R7k41K24J26j25K8K28m31L71j06j65J72L0
5864A22j12n4J54l6r5J79n98P21m79L53j29k9J04j51k2J2l42L40O1p9J34K1R9
5887A74j47l58M09j25K48l19K16k20J44q4J10k0o4K82k83J21m8o8j07L02j96L2
$$ plain form
5723 119 23 126 227 -58 122 -173 84 174 -216 331 -178 -169 -100 145 -307 69 -202 -52 149 -276 32 -57
5745 -57 -175 -152 -109 -14 -27 50 -135 -2 55 37 -232 373 19 -106 3 -140 -132 169 32 -68 132 60 -141 138
5769 138 187 111 0 -4 63 22 -80 -68 83 212 -119 -41 103 -192 373 140 62 -64 6 3 130 106 -51 38 88
5794 88 108 45 84 142 178 -9 450 321 2 -198 -205 -66 -31 72 -68 70 -100 46 -52 103 -66 -41 -42 -234
5818 -234 24 42 42 243 -89 159 223 58 384 -26 -84 221 147 75 -95 109 156 33 174 -71 -49 -87 -100 19
5842 19 -103 199 -93 62 -124 72 149 -12 -86 11 -230 -6 120 -5 23 251 -180 191 85 -80 92 122
5864 122 10 -44 110 74 -21 158 -440 281 -198 155 26 -3 101 -50 -72 -60 -402 -62 -1 -80 54 75 174
5887 174 27 -331 78 -47 201 -118 98 -122 22 -62 48 28 -36 246 -37 84 36 -32 -139 163 -33 -1
5909aJ62j00j61K25k00k67J81L07k19Q9P3j91j5J5q4R0L07j2k17J30j29M9K0%
5933E2j15M2L73m98J87qo6N6k29L24p2L6L7k45o6J84K51j48q4L83l55j58m6J19
5957d6L93l45j51J63j21J4K83j20j75J98J34l15O5p8J80k2k04N3O1J57l37K77
5979F4j55J35N8l13L81k22J49j56J91j35l14M46k22K36j72n2J31%nM7j40R0l9
6002Ck58l9M88l3l13n4L04n6J97k98j18Q2J15Rq3k63M03k12K89j69Q1l72J90N4
6026e3n7K24j45P9RJ06j67RJ26j33J69j86K4k5q6o8L56j25k65L51k47ML11L4l85
6051a40K82n4m4j3k04J49J53j71P4k1m6K03l63J72j7j55K27L17k47p0l01Q1L10
6074A22k1j61M2K86Q8l67mJ75J43m15J01J21j72L14k53L14l79O7n7LJR9K6q0K01
$$ plain form
5909 -1 161 61 -100 125 -75 -342 -161 146 -73 16 89 -102 -117 -102 -186 -96 211 199 -18 112 -17 32 52 52
5933 52 -63 -21 352 -146 41 33 -33 23 -206 118 46 82 119 -126 -192 -8 243 95 11 394 39 -119 -165 -46
5957 -46 347 2 -149 14 -107 -93 190 70 -105 93 227 -88 -23 -101 79 57 -147 -94 -33 124 -213 64
5979 64 -91 44 102 -211 170 -52 97 -59 132 -3 -317 129 -93 143 -29 -81 50 50 45 92 -48 42 3
6002 3 -255 -294 194 161 -152 -206 98 42 239 -59 -177 -95 20 29 -54 -317 86 -126 163 -6 75 -297 -107 -53
6026 -53 -110 114 -31 48 57 163 -4 5 131 -2 167 -19 5 -20 -106 -174 182 57 -208 143 -104 -100 211 245 -140
6051 -140 142 88 44 31 -173 -24 129 -42 32 11 -35 168 -195 -23 -40 -195 32 349 102 32 -269 -188 122
6074 122 101 -60 -18 268 356 -11 -15 160 303 -112 -11 110 -62 252 -1 313 -66 1 -56 -53 -52 47 73 -7 194
6099A94j16K9Rj85K06o0j45J13K72k53Q3k49j01M3J88R1j38j6k2k49L12m6%R7
6123E7l3K06l00N1P1J03l26N7J22lK3J74j29l79M20l4j98K30k82K41K2K08k39
6146F2m4j81k20M68o7j68O1M28l10K02l46L77k57J38jL4j31k59M27l67K98l02
6168a58J79K01Q9k41p7L3j1L9j9j63J04M4k08K8K97j52L3R7j68O6J59j99j29K68
6192A12j34K18k24j08J28J19l1k2J78k42J13m8J23l32r6J75j25L10j85J60j65
6213g6P3Q1o9k30L15k41Q8P9J80k24K5J32j40o0K8O5Or3K43l38K28j55K28j95
6237e0j0J70k21K5K02O3l83P1P4P4p1J95l57K14J51k40r9K64l49N87l86O6P8m13
6261c45L80o2K60l37K3J38j92J28n6K31j90r2K04q6j20R5K45k15o2N5O5l0J06
$$ plain form
6099 194 78 107 116 -69 137 77 -68 45 317 64 147 -102 -203 -160 28 119 -19 -35 -57 -306 6 -40 -40 57
6123 57 24 230 -70 -19 52 155 -171 -114 8 5 28 202 73 -306 114 80 -118 112 -170 71 93 301 62
6146 62 18 -163 -383 85 18 -150 -89 339 29 231 -115 262 5 143 142 176 45 -214 213 -154 144 -158
6168 -158 21 222 311 70 -7 26 15 54 35 -128 -24 20 -188 -160 137 -15 18 115 -53 13 172 -27 -156 112
6192 112 -22 196 -28 -136 -8 111 80 58 236 -6 107 59 182 -150 -246 -71 -196 114 -71 89 -76
6213 -76 -3 78 9 -221 94 -147 -59 20 200 -24 1 133 -7 -67 -39 26 32 -61 182 -156 72 -83 145 -50
6237 -50 -60 110 -111 -86 116 179 -204 -133 -59 15 -56 139 -218 -4 147 -93 -192 72 -277 310 -76 -10 68 -345
6261 -345 35 -27 233 -104 -81 57 -135 -7 -63 168 -22 -114 90 4 -116 -21 224 9 -53 2 67 37 143
6284A43j16k69N11k10k27L55l5l50M43O4k4j42J45l28n1L07k24q6O7K70l03nK92
6307B27l49O8J26k06J30M7L5j61J34K44j89k11O8j45K24rk35L04n8jk2j34K44
6330A31j49J2J16k4j33J42rJ8m8p1k1r6Q6k8n0J09q4J18N4k1Jp3q4k8r9K11J15
6357I5j99J98j28j22JJ88k44Q1K92k69j19L76k15P6o1J93l21O0j38P5K56pM1R9
6381B08j80r4L04j96O4Oj10j14P2K31j91rj07k14M32r7J27j91Lj32K32J80l87
6404a63N8N6j35P1R5jJ57k52J3N6O4p5l2N0J70q8N6r6j4n1p5J84N1q4O6M7j40
6431a2K69l02J14O1j15Q6j50J69k64J65r5L27j29m3m2K9p2K13l6k50K34j07n9
6454iq2L3l9J73j66J48o7nK22l02L85N4k31k86O2J28j2Oj31K22O5m07K62K07k03
$$ plain form
6284 143 27 -242 269 59 -168 187 152 -198 245 309 285 143 288 -40 -91 216 -8 -94 -27 243 -60 -65 227
6307 227 -122 -54 72 -134 -4 43 78 -83 51 295 106 -105 -37 -182 42 33 -202 102 44 43 21 -113 131
6330 131 -18 -6 110 86 -47 95 86 104 56 -15 -36 -132 -46 -74 -124 -15 -99 19 73 52 53 -20 -104 -132 -231 -20 95
6357 95 -104 94 -34 -156 -155 33 -211 -130 162 -107 -226 150 -65 11 -50 143 -178 -118 -256 -181 75 68 109 208
6381 208 28 -66 238 42 106 112 2 -112 -40 191 0 -9 -116 -330 102 5 132 -59 -56 -188 44 224 -163
6404 -163 -105 -49 -184 -113 -18 -19 138 -114 -101 -45 19 -56 -88 -38 132 44 100 4 -10 -61 -136 48 99 15 81 128 -12
6431 -12 257 -45 69 130 15 101 -49 120 -144 21 -74 253 124 81 39 68 -4 209 173 -77 157 50 -9
6454 -9 -91 -58 -97 76 -90 58 -9 -14 208 -94 291 345 114 -172 -110 18 6 12 -119 103 168 -239 23 230 27
6479B7lJ11r2r7N0Q6N3j91L03n24K82o7LJ47r0k40L57l22j51N33j50J30o6l19
6503b30L76j04k20P8J77nO8k08O5K10m9j53J11k28K02p1j9k10Q1p1J40J49k60
6526a71K84k56O4k5J43l53O9N48l71J76j63P2j84n3K08j58K23j50J54k23R2Q2
6548Hk80J88l3J33L7j60L1J10J5J84m2k88L4M9j41L25j58j39K01j06J6k0J49r1
6572B2j8R5%J71m61L7K99l10M81j48j52K2M8L0l6o4k55K79j73L20j68O2k47K1
6596a45j1J31Q9J44j69j12J17j21k9J53J39n27O13n04J84K06jl39L52k67J03l08
6618c02M24N3k69K80n7j67l8j47K45J27l9o9j54L3k31K88J1PJ25j79j01R4m5J70
6642E9j02rK26j04jl12K76J07k66p2K28R1J33n2k15k7J27j48o9K77j64O4Nj21
$$ plain form
6479 27 24 135 43 -54 -4 82 135 -56 247 -277 5 -62 -59 88 -2 -242 115 -207 -358 175 25 155 89 -230
6503 -230 146 42 -178 -100 77 72 140 -68 -3 207 158 5 116 -112 90 19 0 -210 -129 -200 -60 89 -171
6526 -171 113 -143 -79 -104 39 -314 -245 303 -68 108 -55 17 -167 -220 -12 -170 53 -97 57 -166 -74 8
6548 8 -272 -84 -117 16 53 -107 -76 34 49 233 191 -97 -63 -14 -155 170 12 -127 74 -32 -16 -36 113 22
6572 22 4 99 99 270 -191 -154 145 -165 316 168 16 38 86 116 80 16 -239 40 -133 187 19 81 -166 -145
6596 -145 -156 -25 64 208 39 -73 44 -77 -106 47 186 -341 272 -232 -48 158 157 -182 170 -97 6 -302
6618 -302 122 175 -94 186 129 -38 -76 -223 22 149 110 41 -113 -80 -311 -23 -12 -5 120 -59 -160 -66 -111 59
6642 59 -43 -52 174 70 69 -243 33 140 -126 -198 30 121 254 202 -13 -40 87 -61 -130 147 -17 47 52 -69
6666f9j66L36l3k88J7L11j13k5K2jJ77k08J11j43J04j06K48j07L6K2k3j22J95
6689A75k18l4J00K01k84Q2O4ok3R2j60j37J79o7n9J71m9k36K23J80k97l1P0l1
6713i5K10k41K06j29K11l24J37J71K07l98J19n8n2K00j27r4K6J72N0k04l1J99
6735A55k69Q2n4J62M8n2p5K5m4j48J88J97m36K17J6k30j60L92k09k9J70J69n0
6758F5o1j50p5J24N6J21k45J02k08K28l9J22R8j21k42L91n20K13O0J92m4J41l23
6781a15J34j34j4M90m12j7o5Jj20K58ol52K10O1J29r1J05P0k22K95j57j6J19j18
6805C3j49R4J62j85j52K01k2J62k49J34j10j58K23N5J85k13J90%k27J18q3m6j17
6828a54J65N3Q6j03o2k19J92o3K89n4k86R4K64k77P2j54K23J65l86K6K66l9J41
$$ plain form
6666 -69 -235 101 68 -220 -203 108 -5 -30 -8 -9 168 -40 71 -72 32 -74 174 67 103 125 102 -20 175
6689 175 -43 -77 23 224 -60 22 86 80 57 149 -11 -148 31 -36 -95 76 27 -209 14 194 -103 -134 -64 -95
6713 -95 115 -126 80 -49 162 -162 -25 146 353 -45 74 16 -36 164 37 -57 -31 141 191 -13 -44 155
6735 155 -114 -32 -86 76 124 72 -3 22 -22 -170 18 215 -221 -4 12 -218 -378 14 -195 -224 -54 115 65
6758 65 4 -146 -221 -97 -41 80 -165 -63 -271 -43 -82 40 138 17 -225 166 -354 -141 -81 111 67 208 -115
6781 -115 19 -115 -129 361 -51 -68 -133 -132 -252 6 0 -352 -142 -81 48 -43 62 132 -90 205 48 32 151 33
6805 33 -116 -22 140 -45 -197 4 -18 144 -105 29 -81 -239 -16 39 224 11 201 201 -26 92 9 -37 -154
6828 -154 11 64 150 47 -15 -234 -42 -105 184 130 -156 -62 202 -75 -3 -157 66 231 -155 -129 137 98 239
6851B39k85l35L52M98o17J06K05r8Q3k37J22J18n9k00Q2r6O7Q5o9L57l99N8l0
6874e3j29J73J00k08j15J80j37K39K51P9m28l4j0J25P5m8L2J16k74K71l03j62
6896b60J53K42j59j82K02l1q9J7K02l9o2J39k15J02pQ8o6L8k10O8J24n2K8j21
6920i0O7L3n4L7N7m8K74l16O9K29k87OP4k38M88m28P6o4l8J23q2J8j18J95N7N4
6946I4j75L84k45k5n5j01J02j72J09J08m1r6K43k9J76j82o2p4j55K53K9R5k88
6969a07P9j16K8Q8j7l8J63j30P8J0J3j15K58lN0k82k13J50K59j82J95j92k13M05
6993A68j95l3L2J4j22K41j49j32M45k82j6j8J5j11R8n7j02M01q4j78Ml7N3P0q5
7018f0q9K57J7j67O9j39j23L02R6l8R5k53L04k34P7n5l22L49j28K10J67l59Q7
$$ plain form
6851 239 -46 -381 -29 469 -148 -42 163 65 148 -89 33 151 92 -108 -26 -122 -55 30 -39 318 -81 -23 -53
6874 -53 -182 -9 91 -117 -232 -52 -189 50 301 380 -48 -82 -92 33 108 60 92 208 -66 205 -98 -260
6896 -260 -107 135 -24 -206 -4 -35 -124 -107 95 56 -6 133 -82 20 13 101 35 73 -137 -69 55 3 31 -90
6920 -90 -23 10 -44 -7 50 2 276 -40 29 258 -29 -23 51 -187 301 -127 -51 -115 -153 -30 -112 -94 -212 -17 40 94
6946 94 -81 303 58 33 -22 -123 -21 -193 -84 24 -17 -113 130 101 277 95 33 -41 -196 57 86 181 -107
6969 -107 -28 -144 -116 -28 -45 -83 80 -50 28 38 51 -64 194 191 241 -41 -254 -104 155 -27 168 -24 -237 168
6993 168 -27 -60 -28 -14 -136 105 -44 -176 269 -13 -29 -47 -32 -143 -45 -102 -204 197 113 -65 -61 -98 -45 25 -60
7018 -60 -149 108 125 -42 27 -112 -235 67 163 125 220 -33 271 37 114 59 -263 86 -42 168 335 -24 63
7041F3J41j6l16J56J02j75rL0J6k04L66k75J21j94K20n5K19p0k8K3r6Q4k50J93
7065D6l8j1j41J11Q5k23j39K55K26j43j81L18k68K87q3k66J51K9J26k06M6K9J75
7088A85n7j02J28j04mk3l19M03k46J86K9K9j02J71N9n17K69J01p5rk7OK50j21
7112A10J77l49%L27k76q8L53m14R6J47p7o6J3J89l65J84j84J65j12M67m79J95
7134A3K36k28J31j06r4M7J79m22L3K73k6k6J04k89L96q1k4o5j21K5j38J65K6k9
7158b1Q3l5j4k6qk25K45J2j77K36k6j03K28M3l60K07m5q4j99K01pJ77n6o1k50
7183b65M08r2j73J99M6k02J25p4J92j00r8j89K84L4k14L13j85l0K56l30j47J76
7205f6l6l6m2J4L71j51j16J87j99K02k82K93j38n1J15j35j5j33L57l88L85k54
$$ plain form
7041 63 204 188 -128 28 130 -45 -54 -24 -8 -212 154 -121 0 -194 26 -29 190 120 92 115 19 103 -147 46
7065 46 8 -3 -144 -33 52 -171 -310 -55 171 28 -153 165 -103 184 101 -165 -14 15 141 -65 -19 10 185
7088 185 128 26 154 50 46 23 -296 107 -139 47 76 105 3 174 233 -284 -15 86 11 2 -25 -19 231 110
7112 110 287 -62 -62 265 -11 -99 254 -160 -64 83 6 -60 -47 142 -223 -39 -223 -58 -170 297 -182 13
7134 13 249 21 152 46 -48 -1 178 -244 -211 62 36 10 114 -175 221 140 116 51 -70 -45 -183 -18 8 -21
7158 -21 62 27 13 -13 -21 -246 -1 11 -166 70 44 -59 169 212 -148 59 14 -70 -269 -68 -75 102 46 -15 -265
7183 -265 143 51 -122 77 123 -79 46 -28 164 64 -34 -223 61 95 -119 194 9 -21 235 -95 -242 -66
7205 -66 -102 -138 -180 -166 205 54 -62 125 -74 128 -154 139 1 -50 65 -70 -85 -218 139 -249 136 -118
7227a18q5K51k7k91L03j22J41J2o1R0j9K61k91l6o0k7J39m12N26k35L1J3M5L67
7251C95k42j64j94J0J53n0m8N1K41l44J81l0o1K46k30n5j31K64q9q9J03J39p9
7274b3j26J07O0j46J85m9K6j77L34N9j74k58K56m20L92l01L45k91J64J29k68l7
7296b13L14n8k03P8J56n9M8j82J21mj13J1J45K02j71j8K5j6pj29JO5r1J24NJ50
7322A81Oj31L4N0q5J81m15M41k01r6J1M6j05K41m0p2p8J83j97K08l40J17J99l09
7346a71K84L5J63k48k13K29P9p0j61PJ86p1N9Rk0j4k12J40j07K8J68J21l27O1
7370d5J34l5q3O5j10j4J01q5J68J94j89k30l2K86q2n9J98j90k0K69j00k02J59
7393I8P1n7O0j54k9P3N0p1j60Q2L9J38Qk69J49j20J64k80K93n3k8n5L8j65J62
$$ plain form
7227 -118 -203 48 21 -270 33 -89 52 64 3 93 74 335 44 8 -52 -79 60 -352 174 -61 -30 -17 28 395
7251 395 153 -11 -205 -195 -42 -92 -140 -89 152 -192 -11 -41 -102 144 -86 -141 -272 -8 -97 -186 -83 56 -23
7274 -23 -149 -42 18 -128 57 8 34 -143 191 250 76 -182 74 -346 46 -255 90 -201 -37 92 -176 -213
7296 -213 101 43 -160 -82 74 15 63 -119 2 -2 -115 -104 41 243 72 54 79 63 56 -73 -72 -7 -98 26 31 181
7322 181 187 56 90 140 55 236 -179 262 61 -35 -24 22 -83 158 118 46 -32 151 -46 162 -178 -61 138 -171
7346 -171 113 148 311 63 -150 79 158 88 -73 -66 120 49 108 117 97 83 -129 11 -96 -68 100 221 -106 -45
7370 -45 89 54 -29 36 -74 -88 13 -72 96 290 101 -129 -161 125 43 -16 182 -8 -28 241 141 -61 98
7393 98 169 112 172 18 -11 62 112 41 -119 -37 2 140 148 -121 28 -92 72 -208 85 32 4 -51 -13 -178 -16
7418a6J85m15J98lk58K73MK78q1o3j1j28K46l62J44J46m6j69l6P9J6K56k28j00
7442i1J29q9rJ32M7p9l79L95Kk30K8RJ87k6J30k35L3j4j62K01N3kJ70k76OJ74
7468A04m9J4K27k63j81K60j13J17j10O3J5p9J5L0l46J04J09N6o5Q2Q9n%j12O0
7493B2J83k46R9k66K83k18N58n15J66k1j55J74k01j6q9K49k89M04M7j83R4M5J32
7516B57k03R0m02K36J15k36J35J6k18K71l23lL93K05m29K04j21J04j6j49J17l7
7538Fj12K06j2m9L8p2j57L0K77k25j06j64M77m3p1K3k16L25K1J26k83k73L22k89
7562b21K63j47K30J24l31QJ02l7J42n2l73L00P3pJ9j51L6n6o2K37k34P4l0J21
7586B8l0J02n0N3j06L54l77m5k7J84Rj21j15J95lj9J72j29q9K18j51k67L78k53
$$ plain form
7418 -16 169 -246 -48 -51 -309 -36 -32 246 165 102 91 -37 209 -153 -9 137 91 -78 -114 -35 -19 237 9 -91
7442 -91 38 -51 -60 72 119 40 -339 56 58 -172 -144 -135 52 26 156 -79 -46 -60 -222 -21 32 30 200 -76 -70 104
7468 104 55 69 296 33 -148 112 -1 116 6 69 84 5 20 50 -296 -192 -83 -27 -92 -10 79 74 74 -38 22
7493 22 205 -41 58 -208 75 -143 415 -100 66 45 -110 64 -137 -153 -242 7 -282 122 169 -14 80 125 257
7516 257 54 144 -258 -22 93 -143 -8 8 -210 61 -262 -265 128 333 -96 108 -13 91 75 -74 43 6
7538 6 -106 100 88 39 77 5 -152 -122 155 -70 -176 -340 137 94 23 46 -170 155 176 302 19 -254 68 -221
7562 -221 42 -105 125 249 -82 -74 28 -9 133 81 -292 8 81 74 93 -58 -22 -78 -140 97 -137 -63 -93 28
7586 28 -2 100 50 103 -3 351 -26 -71 -98 86 95 -26 -141 54 51 32 204 75 -14 204 53 -214 164 -89
7610h9K40J1k04J84r4l10K63K36J2l92K37n6k62K21j01M08j54L2J52n3k74j09
7632a02rL37j77j94jK82k55N6J47M6qJ55l24J64l7k57J61p6j9M5k5R4j8k03M22
7657B04m01L06m83M14K78m22O2j83K6P2J82k05K36k78P8L50m01N6P2j40Q3J47
7679E3J43j70j6l8K33k81K24j87M8L0O7p9J09l78L45k37K46k43P1J20j99N62n39
7702a16K47k72M19m16j00J66m6K95j47l29J86J23Q0j58K95Oj87j74P8K87k2k22
7724gk65M74l35KK00k02J69N4k90L62k73Q5P6j17K16o3J8l12J87j07J88r2L9j48
7748a41L07rk75J0J00K6j07J10J22J9j27k09M9O5j17N60l43r0lPM38l89L7k16
7772a76M8q8J78j55L95k92j04K86J66l79K11J54k26L0j39P0j88N28l18J02J18
$$ plain form
7610 -89 151 162 -42 142 48 -262 1 237 249 -143 94 38 -224 -3 -104 304 150 182 334 281 7 -102
7632 -102 -111 226 49 -145 -146 136 -119 -63 84 130 122 277 -47 117 80 -177 -16 -92 -111 -66 -91 3 -15 -218 204
7657 204 -197 109 -374 40 318 -104 -42 -225 -199 -127 55 -150 86 -192 -114 236 -165 -109 -37 -177 -94 53
7679 53 196 26 10 -28 205 -76 148 -39 9 39 106 27 136 -242 103 -134 112 -131 -60 60 -139 423 -116
7702 -116 131 -141 278 -138 -238 -72 -118 177 30 -299 -113 10 90 -68 227 233 46 -128 -50 237 215 -7
7724 -7 -272 202 -133 -131 69 -133 36 90 -200 162 -111 -26 50 -67 149 86 104 -208 -21 -128 60 -32 7 -141
7748 -141 166 157 -118 -108 -8 18 -89 21 143 162 35 -174 -125 -60 -177 383 40 -50 -53 -46 392 3 40 -176
7772 -176 -128 -216 -38 -193 202 -90 -194 92 258 -121 90 244 18 48 -91 -21 -209 319 1 103 221
7793B21k47J49k31J02j40O8J18Q7n08J45M75j61k8K1p6mj38K1J42p6NJ07J22k99
7817a25j38M15j25j13mJ44l01J29J76j38L7j5P3K2J19k67L41l45J1K63k62j08
7839b11K33J69j80L4j59LO1J2K72k54j81L81m3r6M3K19l30o2j59M59k71k2O8K06
7863A92m41J15J14j59J73l24K37P3k7K64l05K70l4q4j73P3J44J1n2J34j2l18J60
7886C1J24k92L14j51j16k5L84k78J10j62L44l98j94J43K56l08M30j49O8r9j5N5
7908G2k57L11J7J10j15k98J51k51K88o6r2m9L03k78L94k97O7m4N3jK0p5J06q7
7932a8n4Ml0J65kL8j30q6K19j27j21R9m3L95m25K23j79P3j66k9J44k07J28K21
7956I2j31N8Oj58J59q4N3Q9p8N4j15k9QR7R8J2p2l36L92r9LM3R2k62P8J20k61
$$ plain form
7793 221 -26 123 -108 -6 -146 -78 40 127 -381 -236 239 78 50 71 -5 -9 -147 -126 16 -60 -55 52 174 -125
7817 -125 -263 152 27 -86 -90 54 -247 -118 58 -80 -43 -58 15 37 156 -111 230 -115 -104 159 -103 -211
7839 -211 22 191 11 45 -114 -111 -50 -38 234 -20 -201 180 137 41 84 303 -27 -89 -248 211 -60 -82 -14 192
7863 192 -249 -134 -20 -179 -6 -330 -93 -20 -47 217 -88 182 148 64 -109 -36 108 119 67 201 189 -129 31
7886 31 155 -137 177 26 -90 -115 269 -9 101 -61 283 -115 -309 -166 90 -218 212 63 131 32 17 72
7908 72 -185 126 143 253 138 -160 -9 -260 28 -38 -130 -179 124 -154 240 -57 10 -34 19 18 38 -37 69 -18
7932 -18 -72 -68 -98 67 65 103 -27 -113 106 -21 -142 -43 -86 309 -116 107 -72 1 -165 -194 -50 -257 -129 92
7956 92 -39 19 25 -133 26 -58 -5 84 6 60 -55 -84 -76 21 119 131 59 -277 115 16 19 62 154 -108 -30 90 -171
7983a71n7K57p3K60kj57k20J15L1J80l04J29Q3k41j49M64l62O0Q7k16P64o05J61
8006C4n7M8l79L76O8r4J95k4m42K26K41k62L4k0j53K17k62P4K75j35K2O9%o2P6
8031F5j42L45n26K49J21j04p4J22r6k42M68k15p9J72Q1q9J70m13K79J65k16j53
8053a12J27j9k06K56m38L21k2J5N1K84l04Q7j35K42k90J27n4J65j03J11j35n7
8075h9j27M23j30k35J69j29K27Q9N3k77Q3j90K42j34L9R4j68L5J34k12K52l09
8097a60J99K8l18L01n1J45j25R7m2n8j82J10N9J9j2P1O6M7l02J17L20l20J72n9
8121A22L6j65o3j84J70J62o4j79R2J09N8j72J52P6k25K01l18L0P0N3J53J3j70
8144d3N4M2j47J66J01m1j1p2o8k34L11k41K16j45J82j95j13K71o0j17K18l4J17
$$ plain form
7983 -171 -228 29 -44 216 214 57 -163 -48 -17 163 -141 -12 71 -170 -319 145 -217 -157 -70 -286 478 -127 34
8006 34 -23 25 -354 22 90 -4 191 167 -275 -49 192 -70 -36 -56 -209 8 -254 -180 95 -40 -18 51 51 -11 65
8031 65 -77 268 -258 -9 112 8 -66 56 -40 -282 186 -29 -108 64 145 56 226 -187 92 257 41 -112
8053 -112 15 -4 -210 46 -392 -71 -93 -78 -27 257 -47 40 -95 147 -143 -16 -70 95 -8 103 -32 -89
8075 -89 -216 207 77 -158 11 -118 109 198 251 -26 57 -133 109 -25 14 108 -60 -25 109 -103 149 -160
8097 -160 39 67 -251 50 -1 144 19 116 74 16 -166 -56 3 22 10 81 147 194 -108 9 329 9 181 122
8121 122 158 -7 -70 -254 -84 78 14 -165 -73 36 94 -78 74 150 -75 126 -192 -162 -92 -39 114 127 -43
8144 -43 11 53 -94 72 173 132 121 49 -19 -253 58 -183 33 -112 70 -125 -238 33 -27 -144 74 40 157
8167A57q2m0j54o6M08r9p1J5L4l27N94l41Q4k63O0J21j8j10L9QK94m03K14Q9
$$ plain form
8167 157 75 35 -119 -185 223 124 53 68 102 -225 369 28 112 -151 -91 30 12 -98 -59 -51 243 -160 54 143
8191A43
$$ Imaginary data points
##PAGE= N=2
##DATA TABLE= (X++(I..I)), XYDATA
0@%%%%%%%%%%%%%%%%%%Qj6J6j6J6j6J6k4L2l2L5m3M8n4O2p0P9q8J00j11J23j37
40g2J52j68J85k07K29k51K77l05L35l69M08m49M94n46O05o72P48q35R38j062J216
61F51j407J653j983K446l149M317o593J2494n0698j14213J99449P2315j80105
74f4823k0564J58791j4043j20135L2509R0848m1119o5706L8782M5807m2912l4238
86c6803M1542K4140m1065j2705M0182O364l6558l847L0653K369l0610n906K9961
99G717Q546k9704p054L3555J0066l1902r049L1688Q827l3476r679L2529P019l2535
113a3452k578L3342j134k9837P085K5367j3665k1793J4973J3708j9509r915K1624
126D216O128k1315j322K4632o39k4903L493K4394o917k4579Q287K2663q726j8539
$$ plain form
0 0 0 0 0 0 0 0 0 0 0 0 0 0 0 0 0 0 0 0 8 -8 8 -8 8 -8 8 -16 16 -16 19 -24 24 -30 32 -38 41 -47 53 -58 65 -72
40 -72 80 -88 97 -110 119 -132 145 -160 175 -194 214 -235 259 -287 318 -354 394 -441 497 -565 651
61 651 -756 897 -1086 1360 -1789 2528 -4065 8429 -42269 -156482 42967 115282 -64823
74 -64823 -85387 73404 59361 -60774 -28265 62583 21464 -44242 -5460 40347 -2565 -36803
86 -36803 4739 28879 -12186 -24891 15291 21655 -14903 -18750 11903 14272 -16338 -22244 7717
99 7717 16263 -13441 -20495 13060 23126 -8776 -17825 13863 22690 -10786 -20465 12064 19083 -13452
113 -13452 -16030 17312 16178 -13659 -6574 18793 5128 -16665 -1692 12016 -7493 -17408 4216
126 4216 10344 -10971 -12293 12339 11700 -13203 -9710 14684 7767 -16812 -8525 14138 5412 -13127
140a3127J0516J7702q149j4023P646J0183p810r248L798N458l206l789J983L212
154A146J89j630J40J224j883k121J924k38m082J282N554n75m435K553P234q64
170E418q188M44Q164o30j0454r53J1592J121j1522m4J3514J56j3292oJ1153k353
186D120j2029J980R495l894o984N358O120m676l024O132J331p052l29O691j511
201A728q079L469R479l263q569N849R769o666r445O174P344p593p900N722P193
216E212n421n859N568N844m011n841L599M593n150m507M783K569m201r48N967
231B197J068m874J644O195l501o706L490O116n338o732O077P728o476o880Q001
246B009P209q846p996Q602N828j0529n570J0290L418r447m30R425n3q114K545
$$ plain form
140 -13127 -2611 15091 6942 -7081 565 10748 2938 -6310 -2512 2946 -260 -4049 -2066 1146
154 1146 1335 -295 -155 1069 -814 -2935 -1011 -1249 -5331 -4049 1505 930 -3505 -952 6282 5418
170 5418 -2770 -2326 5838 5208 -5246 -6199 5393 6514 -5008 -5052 8462 8618 -4674 -4680 6473 4120
186 4120 -7909 -5929 3566 -328 -7312 -1954 4166 -510 -3534 2598 3929 -3123 -3452 3239 1728
201 1728 -6351 -2882 6597 3334 -5235 614 10383 3717 -5728 446 7790 197 -7703 -1981 5212
216 5212 -209 -6068 -500 5344 1333 -4508 -909 3684 -1466 -5973 -1190 1379 -2822 -3770 2197
231 2197 3265 -1609 35 6230 2729 -3977 -487 5629 291 -6441 -364 7364 888 -5992 2009
246 2009 9218 372 -7624 978 6806 -3723 -9293 997 4415 -5032 -5462 3963 3910 -4204 -1659
261a659O305l842o010M811L891n538k168O994K436o594l29P075j72p966J22O750
277D106j911p142J552O523j655n088K381M696k166l808J220J903j298k234M98
292b423J643p0J6J225Q40qj76P19n97j392J88J092q08j752J213K493o48k012J309
311H52J701j485k464J1J748j289k276R17K493o66q30J179J633j094n44N0j27r75
329a166P22K70q08Q48J899q0j538J383J587j718k363R14J268j819j239J120J257
346E37j031k48J408M16j641q2N97j108j008J034O65j166K64K486M92j760Q41J691
364B387q57k376Q72J449j393j058J158J093n37j78L76L94m31o91o80m48l04L1
382a193k76k7O25Q01q9j98R71k8q77j39L65o55k04N80O53k48O14J313k63j039
$$ plain form
261 -1659 4646 804 -5206 -395 3496 -2042 -4210 2784 5220 -1374 -1703 5372 5200 -2766 -2644 4106
277 4106 2195 -4947 -3395 3128 1473 -3615 -1234 3462 1296 -2512 -1292 611 -687 -2921 -2423
292 -2423 -780 -850 -834 391 1231 1223 1047 1766 1169 -223 -35 1057 249 -1503 -290 2203 1555 -457 852
311 852 2553 1068 -1396 -1385 363 -926 -3202 -2285 208 -458 -1288 -109 1524 430 -114 -64 -191 -1166
329 -1166 -444 -174 -982 -134 1765 1685 147 1530 3117 1399 -964 -50 1218 -601 -1840 -720 537
346 537 -494 -742 666 1082 -559 -641 -44 -1152 -2160 -1126 -461 -1627 -1363 1123 1615 -145 696 2387
364 2387 1530 -846 26 1475 82 -976 182 1275 738 560 936 1330 899 208 -472 -920 -1224 -1193
382 -1193 -1469 -1496 -871 -70 -159 -357 614 586 -291 -430 -65 -720 -924 -344 309 61 675 1988 1725 686
402F86M51N00j501j110P93M42j301k99J710O47j037l23O39N67j414j264Q50M96
420d68j215L15J143M21J7L57P66k99n95R6j83k40l06QM96j45%O42N42l72o62J5
442C33J63j126j291R98O15q09n79J359R66p13j92Q55K54j413m73R89K55j348N46
461f11J476j5n85O63J016q23j231Q34o0j379n24J317k68p16P10J078p33n75L57
480f9N22r47r06L24N02l52j35R52N97j93K44M67j82m74k27R7m38k85O85M73n27
501A28L31N72o0m32j20l55m81m37j17l7J37P8J04M68O15l22R1J42k17n80m8K21
523c19j15J9K72O65J54L44O4O8o32j06j36o2q45R6L92j47k38O45M28m62k74O7
545a22J84r24l90O25N0l82M44O97J82J15K96J43l10l80m65K82k21j38L89K64p0
$$ plain form
402 686 1137 1637 136 -974 -181 261 -1040 -1339 371 1018 -19 -342 297 864 -550 -1814 -964 -468
420 -468 -1683 -1368 -225 196 213 570 1336 1037 442 538 355 115 -191 -183 313 168 168 810 1352 980 318 333
442 333 496 -630 -1921 -923 -308 -1117 -1696 -337 629 -84 -276 579 833 -580 -1053 -64 191 -1157 -611
461 -611 865 850 265 928 1944 1121 -110 724 664 -715 -1239 78 -190 -906 -196 882 149 -426 -69
480 -69 453 -494 -1400 -1076 -574 -926 -1061 -109 488 295 539 1006 824 350 123 220 -218 -503 182 655 128
501 128 459 1031 971 539 419 64 -417 -854 -971 -1008 -871 -793 -689 -221 394 72 163 305 88 -492 -540 -319
523 -319 -434 -415 -143 522 676 1020 1084 1152 520 414 278 216 -629 -533 -141 -288 -526 119 547 85 -189 -122
545 -122 62 -862 -1252 -627 -577 -959 -515 182 364 479 775 918 608 228 -237 45 -176 -314 75 339 269
566B69K92L12J02p54k06J88o44o27J75K94m28K59N26M08r1J48K0k33l31j19N6
587c84j38K11J96M24J34M55N1n8j83l38j42k96l75k62L02M6L76n3J87J10q2j65
609A6k72l13l49k24K78K52K82L54K53J5J46K16J01n44l1k0j73k10J97M79O6j72
631C47K37J16k56k48k89k16n08l1Q8K46j73L66M40j07j83M18n9j34m95J3J77L8
653b13j88N86J02N70j48K09l20q3m68J99k00l81k09J63J58J52K32NJ30k91o4k82
675c41r2m74J62J16O2K17L03N99J62p5m00L19j58l12m08K54K09j0KL14j6K37r3
698E77r9m96k19j1l67r4M2L15lK01J5M9K40J0l60J37l16l57L14J66N76j7K56o3
722D96N66m03k60j14k67l28j7j41N0K27J50Q9M5j53L72l12q3l01k02k71r0J28
$$ plain form
566 269 561 873 975 221 15 203 -441 -1068 -893 -599 -1027 -768 -242 166 75 223 243 10 -321 -440 -384
587 -384 -522 -311 -115 309 443 898 949 891 708 370 228 -68 -443 -705 -403 -357 19 -34 153 263 181 16
609 16 -256 -569 -918 -1142 -864 -612 -330 24 277 292 438 654 755 211 180 160 -13 -223 -26 453 519 347
631 347 584 700 444 196 -93 -309 -817 -848 -760 -514 -687 -321 119 12 -171 247 188 54 -441 -428 -251 -213
653 -213 -401 185 287 857 709 918 598 515 47 246 46 -335 -544 -381 -223 -71 161 166 296 5 -59 -341
675 -341 -433 -907 -745 -629 -567 -350 -47 552 714 639 239 558 400 88 -320 -66 143 133 135 449 433 670 577
698 577 478 -18 -237 -248 -615 -709 -667 -352 -355 -154 -139 -90 150 160 -200 -63 -379 -736 -422 -256 320 303 559 496
722 496 1062 659 399 285 18 -310 -327 -468 -418 -191 -41 48 93 -60 312 0 -83 -384 -586 -857 -947 -819
744h19O74K34J53Q2K37j69p1l6q7k07j20J27J15K12j76L21J25pl07Q9l73k34m83
767g20N9K13j50L43J91J26NM8n0r9k39j84l4K3K90K20K03K26p6K22L2j63j4j31
791C41j04k60l75N0J84K00J02k73L97p7n6l36J96o91K36j04L3L4L73K06J20p7
813A19O05m54k01O5j58N3j27K7L92L65k93K7j48J20k19k53k9k3k81O8j43j88K97
836c79M56R3o3l3o6J2l29PR3j11K17K58m3L95m4K32j53k36m9k39O6j41j29J67
860a9J47O8j16j40j41M54n27j71J01j24j08lK84K06l6J85L59j64J77n9l72j68
882a67L05k36J31p2L75J95j35P8p0K7k29k56q0n7l26K09p0L60O9K3N9P5l13P3
906c2j19l9j92J92j4K87k59N81J05j19Q6l51K68l13j49m73N19Rml66L47K68K3
$$ plain form
744 -819 -145 89 242 324 561 392 321 285 198 -9 -129 -2 113 325 149 470 595 588 281 370 -3 -237 -720
767 -720 -661 -448 -598 -255 -64 62 67 115 65 -34 -273 -457 -491 -468 -178 42 245 471 395 617 649 486 472 341
791 341 237 -23 -398 -348 -164 36 138 -135 262 185 129 -207 -11 -702 -466 -570 -537 -503 -130 76 196 119
813 119 724 270 69 134 -24 29 -98 -71 321 686 393 420 272 392 173 -80 -109 -132 -413 -345 -488 -676 -379
836 -379 77 170 107 74 8 20 -309 -302 -209 -320 -103 155 112 507 463 695 542 306 257 18 84 -57 -186 -19
860 -19 128 196 80 -60 -201 253 -274 -445 -344 -468 -576 -579 -295 -89 -125 60 419 255 432 373 1 -167
882 -167 138 -98 33 -39 336 531 396 474 404 431 202 -54 -134 -191 -517 -308 -378 -18 51 74 133 208 -105 -32
906 -32 -151 -190 -382 -190 -204 83 -176 405 510 391 477 126 394 81 -68 -541 -22 -13 -17 -383 -36 232 255
929B55r0nk75k0L0k91j54N3L85J8K19l14P57m84l9K0J12l90J21K07j81K05k8O77
953G88m01lO1j44n00j21P3k61L11p2J33n1K21Q0m8l6Q1p57K77J09J12J38o9J47
977F8J10J71k36K17K12j94r4k52R6j62l14K41K99j14j6K77k25k30j28J04l26k87
999g83N69j32o4J59L41j4P6O3k1q0Mj89j4R5L8O4L17l64J98K33q6j40j64n6n06
1024d56J11J54l31J55J01L78k64M96j30m04K42j01m7q2j71k9N07J07j17M76j54
1045D41k31o9k01J27k59L5p4J31K41j03j02j11M70j66k11l36l5L58j5k82K6M35
1067F9j89K72J52j18n7J34k26k15J59K33k62J28J88n7k32K54p0nk65L46k84k47
1089b92k90M37m9j4J67q2L97m35J15k50J35j3l5J83l11K66R9J41QL07Q1m20N0
$$ plain form
929 255 165 160 -115 -135 -105 -396 -550 -497 -112 -94 125 -189 568 84 45 65 177 -213 -92 115 -66 139 111 788
953 788 387 384 445 301 -199 -320 -247 -508 -197 -269 -136 -187 34 114 66 30 111 -646 -369 -260 -148 -10 -79 68
977 68 178 349 113 330 542 348 254 2 98 -64 -378 -137 162 48 32 309 84 -146 -274 -170 -496 -783
999 -783 -214 -346 -410 -251 90 76 152 215 194 114 118 -71 -85 10 48 112 429 65 263 496 410 270 106 50 -456
1024 -456 -345 -191 -522 -367 -266 112 -152 344 214 -190 52 -49 -96 -178 -349 -378 129 236 119 595 441
1045 441 210 141 -60 67 -192 -157 -231 -100 141 38 -64 -175 295 129 -82 -418 -453 -95 -110 -392 -366 69
1067 69 -120 152 304 186 129 263 37 -178 -19 214 -48 80 268 211 -21 233 163 158 -107 239 -45 -292
1089 -292 -582 -145 -194 -208 -41 -123 274 -161 -46 -296 -161 -174 -209 -26 -337 -71 28 169 177 484 565 145 195
1112A95p4R9m08J03K25k54j27N09j68k8J48j98Q3j81n17K17J72k60K12L39j38
1133e1Q8k5J97J40l05j3l7k10J53o7K28r2J43K92k60M9r1k26n2p4j33J68k47M36
1157A1n9k20K50R1N9l54K48l53JL3J69q2J58K66J28k92J55P8k66J32m1j40M5m02
1181c85J26M75j69k4L7J11K06n40J74m24J73m1K26r3NJ41K15l66K93l3lk02o5
1204a63L02m93L39J09K07q9J08R1k10r9j8k10J16n6n2J45j66J79K18q0l3j91P5
1227B9J18j96O5k11L8M4K05j44L36J01k80J04j97K59r2n8k81J19J33j28J27R5
1249A86j07r3J51k35J9q2K15l12qK32o2N8k22K04J38l2R5k9q7j09J60Q4j67L88
1273C85l74L91r4j99p7QO1k90J71k60L04j03j16K10J35j90L5K5j42L8N0j25M9
$$ plain form
1112 195 121 220 -188 -85 140 -114 -241 268 100 72 220 22 105 -76 -593 -376 -204 -464 -252 87 -51
1133 -51 37 12 209 349 44 31 -6 -216 -63 -130 98 6 149 441 181 230 139 -87 -139 -213 -346 -178 -425 11
1157 11 -48 -268 -18 73 132 -222 26 -327 -326 -293 -124 -206 -48 218 346 54 209 287 21 153 112 -28 17 -385
1181 -385 -259 216 47 23 60 171 377 -163 11 -413 -240 -281 -55 -148 -143 -2 213 -153 140 107 104 -98 -163
1204 -163 139 -354 -15 94 301 212 320 411 201 102 84 -126 -10 -66 -118 27 -139 40 258 178 145 -46 29
1227 29 147 -49 16 -195 -157 -113 92 -52 284 385 105 209 12 271 179 121 -160 -41 92 -36 91 186
1249 186 79 -14 137 -98 -79 -161 54 -258 -266 -34 -96 -38 -260 -56 82 50 145 116 29 -80 80 164 -3 385
1273 385 11 402 308 109 32 40 101 -189 -18 -278 26 -77 -193 17 152 -38 -3 22 -120 -82 -32 -157 -108
1296a08L5j42K29P1J4J28j24K83l08K60l17J51n06R2J82j21L85J28k25k32L1k60
1318c54K0J40J47j08r1k08K54L82j89J06p4k80N14M8k53R0l66L55R8J48j61l5
1340A83O9l69L12j62J4j02j58l7J5p5K68J35j60Q6r7J6j01K06l44J63OM0j00J56
1364c6J07J89l3q5or0k76P9L4J11j52J17J17J38j80n1j60R8K41l51j4J28k80J5
1388c40J63K9J2J81K70k56J34l22L86m62J12M6J2J05J63j28O7j66k05K81j88l30
1410d36L53J81k05n5K10k03R7K18j28Nk30K75m6j14j97L57l7j94M69k58O8Q3J13
1433C26l07J16J04j70ml9l13K83l4J42k59M23l91J2J25j76M7O3o4K4J02J1Q0L9
1457A40R7j1j42j28j37J41j16J33PR5j2l5L55k89n1p2j23Q0L2o6J5L61j49j74
$$ plain form
1296 -108 -73 -215 14 85 99 227 103 386 78 338 21 172 -334 -242 -60 -181 204 332 107 -125 -94 -354
1318 -354 -334 -194 -47 -155 -246 -454 -200 182 -7 99 25 -255 259 307 54 144 -222 133 231 379 218 183
1340 183 252 -117 195 33 47 -55 -213 -250 -235 -310 -42 93 -67 19 -78 -62 -163 43 -301 -138 -132 -92 -192 -36
1364 -36 71 260 227 142 136 46 -230 -151 -117 -6 -158 -41 76 214 34 -17 -177 -79 162 -189 -203 -75 -355 -340
1388 -340 -177 -148 -136 45 315 59 193 -129 257 -205 -93 -47 -35 70 233 105 172 6 -199 82 -106 -436
1410 -436 -83 98 -107 -162 48 -155 -58 160 32 37 -193 82 36 -78 -275 82 45 -149 320 62 130 213 326
1433 326 19 135 239 69 65 26 -287 -4 -38 104 -155 268 -123 -111 14 -162 -115 -52 -116 -92 10 21 101 140
1457 140 237 226 84 -44 -181 -40 -156 -23 -16 79 67 32 387 98 47 -25 -148 -68 -36 -102 -87 274 125 -49
1481d9N8k2j07J65j93L89m0m69J71j06K80p2K39J66l33Q5p3j72K20k47J46j31
1503i5O6k97L04J10j40Ql3l1k05M1m6K74k4k36K82J40r4K77k04O4j60P2l9K3m5
1528A2Q3M6P5k29J07jL54l34J35k15k06P6n7K34m57M01pJ56J9j15q8O7k8k2k90
1553b84L5L74q0M2J31l9l57K69q2Q6j27j97J96j02J68r2P9J63K8k8r0m78M85l20
1577b20k58L12k7L12k57J72j22J17J09m3j23m5M8M20l70K0J05j58J59r6P8P7j07
1600A03k47l9K57l41J87kqM42j66m7j31j00J05l82M70k78J17M5R3l1n9k1L42n0
1624B59m44N33l77K21l89N05m78K46k8K18k8m3k2j84j19j49K83N7k57K4Q4N7M0
1647IR4l83L37J13j83l4j0j7r2J81m4J85k2J41j89J47j15j19J46k79R0O0k05K50
$$ plain form
1481 -49 9 -13 -120 45 -148 241 201 -268 -97 -203 77 5 244 410 77 162 89 -83 137 -110 36 -95
1503 -95 -29 -326 -22 88 -52 -44 -77 -108 -313 -272 -318 -44 -68 -304 -22 118 24 301 97 161 1 73 34 57 12
1528 12 95 141 216 -13 94 93 447 113 248 33 -173 -97 -154 80 -377 24 17 173 192 77 -11 56 28 6 -284
1553 -284 -249 125 45 87 218 179 -178 91 9 95 -32 -229 -33 -135 33 -59 20 183 211 183 93 -385 100 -220
1577 -220 -478 -166 -193 119 -138 34 -88 29 138 95 -28 -73 -25 395 25 45 150 -8 151 55 133 210 103
1600 103 -144 -183 74 -267 -80 -82 -90 352 186 139 8 -92 13 -369 101 -177 -60 -15 78 47 -12 -33 309 259
1624 259 -185 348 -29 192 -197 308 -170 76 48 266 238 195 173 -11 -130 -279 4 61 -196 -172 -88 -31 9
1647 9 103 -280 57 170 -13 -47 -57 -74 -166 15 -29 156 134 275 86 233 118 -1 145 -134 -44 16 -189 61
1671F1j14k05K86J27q6m2pj20J10K1Q2p5j63P7MJ72r3J32K3k25N7j97J00J23J9
1696F7k2k8J21J01N2p6r8rj93j06K13q0j15J85j55K30j47n1J68K34l04j08p5j84
1720c80L52k37N72k66J36K4j8l26J83Q4o0l14J56NR5O1m4P7q6j75M5R1J00q6M73
1745D62l82j4l3J33j79n2K15J43j40k4q6j35J37r1J36l02J24M60m32L43j08m21
1767b46J3J85j6L0M8j68L4j72J02N5O0O0q6J40L3M0k27J02N4j31K32M6j81l2K0
1792eM4Kr4q4K6L1j13J42Q3J90J15l95K08k75M5o4J26L2%o1J84Jl71N18q7l45
1818a47L2Q8j21M6j74L82j61k3K63r3l8k72K79j47K79l38Q3p9k86L92N3k08j2
1841b02M80k63N9p4Q6l04N29l36J53J14j3l02K70J3j29j90K8K54j18O0k23J67
$$ plain form
1671 61 -53 -258 28 155 69 27 20 -100 10 31 113 38 -125 -48 -44 128 35 167 190 -35 22 -175 -75 48 67
1696 67 45 17 138 239 291 215 117 108 -85 -191 22 -58 -173 12 -143 87 -60 -111 57 291 -13 -121 -196 -380
1720 -380 -28 -265 307 41 177 201 183 -143 40 124 64 -250 -94 -89 6 67 23 100 14 -161 -116 -25 75 -11 462
1745 462 80 66 33 166 -13 -65 150 293 153 129 43 -92 45 -46 90 -212 -88 372 -60 283 175 -246
1767 -246 -233 -48 -64 -34 14 -154 -120 -292 -190 -135 -75 -15 -101 39 72 112 -115 -13 41 -90 142 188 7 -25 -5
1792 -5 39 41 -53 -137 -111 -80 -193 -51 32 222 337 -58 150 -125 -80 -144 -18 14 14 -47 137 138 -233 285 198 -147
1818 -147 -115 -27 -148 -102 -276 106 -55 -78 185 92 54 -218 61 -86 193 -145 -62 -141 -427 -35 18 -190 -202
1841 -202 278 15 74 0 86 -218 311 -25 128 242 229 -73 197 210 81 -109 -81 173 55 115 -108 59
1863E9q8p0J71k3r8K8j96L14j58J67O3j21j5j47L34j93M6N1J5l01p3M33P4j89
1887H3l77K87r7j8J03q2NJ91n6k31K61j64J02k23K10M0j54J55J8J23l62K11j42
1910a17p6J74p0J36OK43k89M2J39q6K46j91p7o4j39Q4n6J13q2m1o0K14n7l51M16
1935E7k7j58J13J47j01J76l49K4L61m13K03M7l8j38J08q1M60l75j24R7J43l01
1957a69Q6J70P1m6j67j67K02j28K24m17M79K0l50K80J10k51R3J64N7p0k1j58J99
1980B11j38n2P9j96K66j3l06J38k3J6k80K20P1j74L4K93l54M0j48J77J15j93J66
2003e1q9k3L5J86l3l9N3m3o8P2j93M2K82j0l40J30K40q3N9l35L48k62m5K55r1
2028cKK9k7j74M02k31P6k39K13j07K17k05N1J32k07j00Q1K54k2j64K98j13m1r3
$$ plain form
1863 59 -29 -99 72 49 -49 -21 -217 97 -61 106 169 48 33 -114 220 27 73 124 139 -162 -235 198 272 83
1887 83 -294 -7 -104 -122 -19 -101 -96 95 39 -192 69 -95 7 -216 -6 34 -120 35 53 176 -186 25 -117
1910 -117 -193 -19 -89 47 53 296 7 49 188 102 348 157 80 16 -123 -39 -95 18 -64 -105 -165 49 -8 -359 57
1935 57 30 -128 -15 132 31 207 -142 -118 243 -170 33 80 42 -96 12 -69 391 16 -108 -11 132 -169
1957 -169 -83 87 158 112 -55 -222 -20 -148 76 -341 138 158 -192 88 198 -53 40 204 261 191 170 12 211
1980 211 73 21 100 -96 170 157 -149 -11 -34 -18 -298 -78 -7 -181 -147 146 -208 -168 -316 -139 -24 -217 -51
2003 -51 -140 -163 -128 58 25 -14 39 -4 -72 0 -193 -151 131 121 -219 -89 151 68 127 -208 140 -122 -167 88 -3
2028 -3 -1 28 1 -173 229 -2 74 -165 48 -59 158 -47 4 136 -71 -171 -90 164 142 -22 276 163 122 29
2052B9O0j47J08k10J72J18q2K22k86m7J60j94J42k07K11oj49J91k02O7J12l77
2074c15L96k77L88n9j69p4j5J40j26L66j3j87k5j72J06m9K60j87J33k40J97j69
2096i1o4M3M34k21j46J81j36J08m6k36J82J25k30P0K11j14l9KL09n57J12K68k61
2119i6J71j76j45K78p4J64O3k70j35J71l2j31L42j30J50j13R1j21oj99K47J76
2141B25l03J53l15M05k86K65k3l6l49J99K17j03J65j64j24j16L10j86J18m2K22
2162B32m13K60P2O7m09J0M67j59k92O9r7J49R8k7K47j19k96J0O6OQ7n8Kk35L40
2187G7j0p8J00Q4k8j8j53p3l8J67J16k11J30j97Q7M2j03p1L96j46j31j25K12J08
2211A37k48M10l27J0j17L23m1n4k57j89L75q8M3k28J68m0K98j66k32R4O1M9J00
$$ plain form
2052 29 89 -58 50 -160 12 130 48 270 -16 -63 97 -97 45 -162 49 43 -106 85 -117 -50 62 -315
2074 -315 81 -196 192 133 -36 -110 -125 15 -111 255 242 55 30 -142 -36 -85 175 -12 121 -119 78 -91
2096 -91 -155 -112 322 101 -45 136 0 108 62 -174 8 133 -97 -27 184 70 31 33 342 -215 -103 165 -96
2119 -96 75 -101 -246 32 -42 122 185 -85 -220 -49 -81 -212 130 0 150 37 128 7 1 -198 49 225
2141 225 -78 75 -240 165 -121 144 121 85 -264 -65 152 49 214 50 -74 -190 120 -66 52 10 232
2162 232 -181 79 151 218 -191 -181 286 127 -165 -96 -193 -44 54 27 274 155 -141 -131 -65 -59 28 -30 -28 -263 77
2187 77 67 -11 89 173 145 127 -26 -99 -137 30 146 -65 65 -132 -45 -3 -106 -177 219 73 -58 -183 29 137
2211 137 -111 299 -28 -18 -135 188 147 93 -164 -353 22 -66 -23 -251 -83 -123 175 9 -223 -129 -68 -19 81
2234H1k40L29O6k83J42l22K93M3J0k68L70l07J76J40l85J3J56rj26PM21r3j04
2257A10J3k38M60o00L98j07M1P5j1k78J59r9J98lk06P2oR7k97M34l02K13j28J47
2281A42r2M0pr4k45P2K02o8p6L4p2j29L46O0j20K15j80r2k9J18j47J69j22K1J19
2306F5k44J60RK48r5j48j58q7N8M5K80J0j98l7K8j00K44l31K49J67o7J88k41j40
2330i5J70L9k10J52k03J80m4N2nJ80K5m49K49j94K45K7l05M19k98N8J10k65J88
2353B6p5m1J3q6J92J72l46q9K70J36m0m81K21J39k21N73j11m29L82l51K04O0n7
2376F1L1j7j09J70J40m13L00l27j22N10m63J65R3k62L02J63n00L30p2Q6m5l2O0
2399D9l89L98j1j49n7J72J07l46L19L8k51J4N2K07o0j06j85k43L48k33K91J55
$$ plain form
2234 81 -159 170 236 -47 95 -227 66 109 119 -149 221 -86 90 230 -155 -142 14 5 -121 -114 307 214 110
2257 110 123 -115 345 -255 143 36 77 152 141 -137 22 -77 121 118 -88 -16 -22 75 -222 212 -90 123 -5 142
2281 142 50 90 83 -11 -256 -184 18 -50 -126 -92 -164 -293 53 113 -7 208 28 -64 -93 25 -122 47 -75 -54 65
2306 65 -179 -19 -10 238 143 -5 -163 -250 -192 -147 133 143 -55 -92 -64 -164 80 -251 -2 165 98 286 45 -95
2330 -95 75 114 -96 56 -147 33 -11 41 36 216 241 -208 41 -153 92 119 -186 233 -65 -7 103 -162 26
2353 26 -49 -90 -77 -163 29 201 -145 -234 36 172 132 -349 -128 11 -210 363 252 -177 205 -146 58 118 61
2376 61 92 75 -34 136 276 -137 163 -164 -286 224 -239 -74 19 -243 59 222 -278 52 -20 66 21 -11 49
2399 49 -340 58 47 -102 -159 13 120 -226 93 131 -120 -106 -54 153 93 -13 -198 -441 -93 -326 -35 120
2421A20M6l85K25L8j47M9P9M4R0j83K89l74l6J38oj21j56K63o3n4K20j96j21L16
2445G5l62J05L06l33L99j96j52J41j93K58j55M21m07j02M44k02p9j49K38L6k89
2466a96L67k36J75o8K6m8k0nJ81l77J69J39k28J69J9m4J03k05K40o7j77L2J47
2489I6pk42K42j57J68k32J08J47r1J91j25p1r9P1J82k23J04r5O2p7O4J8J9k51
2513a98J83N2j17J11r3J15j28m9j82K49K55l91J80J06m3P8k61Q3nJ69l99L16m7
2536a6l1r4K73r1k57K91Nj37J90J3k90K69j65J40j56K8K20k51J64m58L39pK34
2559B13k53L2j39K29N2k05K8J02J14m12L98j00P4j5J50k49M3J3qk64N5K62j06
2582A4j51O3o6R6K12n07J61%oJ49r8R3k5q8PJ38K4k17L11r0K6o3j77J4R7J13j88
$$ plain form
2421 120 166 -219 6 44 -103 -54 25 69 159 -24 265 -109 -145 -7 -13 -134 -290 -27 -90 -144 76 -120 -241 75
2445 75 -287 -182 124 -209 190 -6 -158 -17 -210 48 -107 314 -93 -195 249 47 -32 -181 57 93 -196
2466 -196 171 -65 110 42 68 20 0 -5 176 -201 -32 107 -121 48 67 23 126 -79 161 94 -83 -51 96
2489 96 89 -153 89 -68 100 -132 -24 123 32 223 98 27 -72 -1 181 -42 62 -33 29 -48 16 34 53 -198
2513 -198 -15 37 -80 31 -62 53 -75 -124 -306 -57 198 -193 -13 93 50 128 -133 -50 -55 114 -285 31 -16
2536 -16 -47 -141 132 41 -216 75 80 -57 133 146 -144 125 -40 100 -56 -28 192 -59 105 -353 -14 -21 213
2559 213 -40 -8 -147 82 134 -71 -43 59 173 -239 159 59 133 118 268 19 62 75 67 -197 -142 120 14
2582 14 -137 -74 -140 -44 168 -339 -178 -178 -184 -35 -133 -40 -65 -153 -146 -8 16 -201 110 20 46 -17 -194 -180 -83 30 -158
2609a58K42k53M17m54J49r0J58j12J13qj02j63L05K2m2o1N3k7j8P4J30k28J55
2632A02k3j02J46N1j50J25j7j63R4N6j86J3q5J54J11k58pl0K93j27J52k68J89
2655G0q1P8k30K19r3K6j58N0l0MQ1q6K43q4M0j43l9K2J56l6N7P6k40L29j1k47
2681b7N6k0R9J29j34k8l6K12l21J28N7j90K04k1p0k7o1J44k73L68l23j2J77Q5
2705A16j77l2J22N8o4O5m8n9RK5j93J31k1j10L14k67J17R3L8l57K96R4l07K20
2729F3j64K44j58j10J66k72K28J76l7j89k1L15oj61j6j59K80k89J32r8p8M9k14
2752c19L81l52L74%k80M34l96K80l4j05Rl10M40q9j64J22Q7K60k41k4J5J09m6
2775A51n83O26j42j80J08j9N3K4K6N2L6p2J50j14j48j75K66j52K14m7m7p0J92
$$ plain form
2609 -158 84 -169 248 -206 -57 -147 11 -101 12 4 -98 -261 44 66 24 -37 16 -11 -29 45 175 -53 102
2632 102 79 -23 123 174 24 149 132 -31 63 119 -67 -54 -139 15 126 -132 -139 -169 124 -3 149 -119 70
2655 70 -11 67 -163 56 -37 -11 -169 -119 -149 -145 -64 -150 93 9 49 -94 -133 -111 45 9 66 142 -98 231 220 -27
2681 -27 29 9 108 237 103 75 39 251 -70 58 115 -75 129 108 38 11 -50 94 -179 189 -134 -146 31 116
2705 116 -61 -93 29 87 23 88 40 -19 -10 15 -178 -47 -68 -178 136 -131 -14 79 117 -240 56 150 -157 63
2729 63 -101 143 -15 -125 41 -231 -3 173 136 -53 -74 241 235 74 58 -101 179 -110 22 -76 -154 -105 -319
2752 -319 62 -290 84 84 -196 238 -158 122 88 -17 -8 -318 122 33 -131 -9 78 338 97 73 88 197 151
2775 151 -432 194 52 -128 -20 -39 14 38 64 116 152 80 230 116 -32 -207 59 -93 121 74 27 -43 149
2798A49k58O8K15q9j07O0l10J82J65J39l10L3J91Lj65j50Q6J34j25L4M6r6P9j25
2822a51L83j77J14m00L26j27J83Kk33j76K48j13L32p5k12n1J7N5mJ00m8q6lR5
2846aj1L6L1r3K30K1k59JM43n07R1k58L25n0j77L64q7r4L1j87N0P2P4O6j44o4
2872i7K78l48J60j6J34J5Q9k16J4J89Jk31P4Q8o9N2q9m6P8L19m39j70M00j21J26
2897A75J4j95R3l7j4J74j68o7R1j06j16R9Q5m7l9R0J2K10N3k13k26K59j43L05
2921B89j50Lj96J28j97K47M2k80q9K65J14m0k87j40L69n4r5l6j72K49Q3j16J68
2944A05k43K53k50L2J78k4P5k8j15j05K43M9J95m73J22j06L33m54K32q6o5J62
2966C0k37K04Q9j20Pp4n3K14k43J90p7J04K46m53J30K3n4J78k22O3K0J56l48P
$$ plain form
2798 149 -109 -41 174 85 -22 38 -272 -90 75 214 -96 -63 128 131 -34 -184 -98 36 -89 -55 -9 -105 -26 -151
2822 -151 232 55 169 -231 95 -32 151 153 -80 -256 -8 -121 211 136 -76 -127 -110 -55 -59 41 -7 -93 -96 -1
2846 -1 -12 24 55 -38 192 213 -46 -45 398 -109 -18 -276 49 -1 -178 186 99 5 36 -151 -101 -29 45 111 -33 -97
2872 -97 181 -167 -7 -23 111 126 215 -1 13 202 203 -28 46 134 65 117 28 -18 60 379 -60 -230 170 49 175
2897 175 189 -6 87 50 36 210 42 -25 66 -40 -156 -57 28 -19 -58 32 44 254 307 94 -132 127 -16 289
2921 289 139 142 -54 74 -123 124 166 -114 -203 62 176 136 -151 -291 78 24 -71 -107 -279 -30 53 -63 105
2944 105 -138 115 -135 -103 75 51 126 98 -17 -122 121 170 365 -108 14 -92 241 -213 19 -67 -132 30
2966 30 -207 -3 86 -34 -27 -101 -154 60 -183 7 -70 34 280 -173 -43 -20 -74 104 -118 -55 -35 121 -227 -220
2990b20J35J05O8J63k66L5Jp1J37j51J96pJ7p5j61J31j34k0M1K45k20l5q4L29
3014A59j91k40L81n9k51M08k68J17J47j72J7K9nj75K25p3mk54K00J51j03q6J77
3037A30N9j4k59K40l06J47j44N3k5K81k47n5L54k66j06P1L06j84j10J89k2j58
3059f6K13k44o3J41Q8R9l59J28J19q9M5j01Q6J12j64j91J04J37l3J25k46L35j
3082A75k00J33j20J73j33P7j52j8j5L8j43L46k22L16j86k10J01K08k02J18l05
3103b21m3J16L05k31k2J27j99JJ10l1J85l8q0M9P0J6k30R6K94j87k67L35q1N2
3127A26l27K9J19R1j3qj59n9K87j08o1K9j30K02m5j21p1K49j20J71k37J85J82
3150B11k53j49J52n4K07j06N0j60J75r8o5n8J59J20l25J83P7l80M42j65Qr8Nk
$$ plain form
2990 -220 -85 20 88 251 -15 20 21 -50 87 -64 132 125 142 67 -94 37 -97 -117 -76 169 -51 -86 -170 159
3014 159 -32 -272 109 50 -201 207 -61 56 203 31 48 77 72 -103 122 49 45 -209 -9 142 39 -47 130
3037 130 189 175 -84 156 -150 -3 -147 -94 -119 162 -85 -140 214 -52 -158 -87 219 35 -75 114 92 -66
3059 -66 147 -97 -160 -19 69 168 -191 -63 56 -33 12 -89 -3 109 -55 -246 -142 -5 -38 87 -159 176 175
3082 175 -25 108 -12 161 28 105 -47 -65 -80 -42 -185 161 -61 255 69 -141 -40 168 -34 84 -221
3103 -221 -264 -148 157 -74 -96 31 -168 -167 -57 -88 97 59 -21 28 98 114 -116 -20 274 87 -180 155 74 126
3127 126 -201 -172 -53 38 25 17 -142 -201 86 -22 -83 -54 -184 18 -27 -148 -219 30 -90 81 -156 29 211
3150 211 -42 -191 -39 -93 114 8 58 -102 73 -25 -90 -148 11 131 -194 -11 66 -314 128 -37 -29 -127 -122 -124
3174a24J81k52J24k0K96K43n14K66l65K53m08M40k46K44n5j37P6q3J75k03j08
3195b17P8K12k56P3kj50J96J11K30k98J19k74Q8J11l7j19K7M13m64L81K01m23
3217@p9m8J70r5R5j83N4L9k9J85k01p9N5J61l1K02l05N7j70P8K7o6K51K04l36
3242d4j34K14j20j65M58j60j60K72k21JJ97o6M4j76L1K26j00J89k96jR7o5k16
3265a95J59j18L6p8K80j66l5J57r6j77R2Q8r5K79O0j31k78K55R0m72K24m3J19
3288d5j42J5P1J19j55K13L3k09J69j46L18k83j9J32O7l11L45l82M12l0k81K29
3310A20k62q7N84m61kJ07j87Q2J03Q6j12K05k26j44K21L6j52J54k4K04l80J16
3332a9K68m59O1l0K25k5q3K34j33K04j98r1K9m6km8J87Lq6J89l52K48k97K78k00
$$ plain form
3174 -124 57 -195 -71 -91 205 448 -66 200 -165 88 -320 120 -126 118 63 -74 2 -81 94 -109 -217
3195 -217 -139 73 -183 -110 -112 -262 -66 45 275 -23 96 -178 -90 21 -16 -135 -108 305 -159 222 423 0
3217 0 -79 -127 43 -52 43 -140 -86 -47 -76 109 -92 -171 -116 45 14 216 -89 -32 -202 -124 -97 -163 88 292 -44
3242 -44 -178 36 -84 -249 209 49 -111 161 -60 -59 138 72 116 -60 -29 197 97 286 -10 -11 86 21 -195
3265 -195 -36 -154 -118 -196 84 -82 -117 40 -56 -233 -141 -53 -148 131 191 60 -218 37 127 -345 -121 -164 -45
3288 -45 -187 -172 -101 18 -137 76 109 -100 69 -77 241 -42 -61 71 138 -173 172 -210 202 172 -109 120
3310 120 -142 -229 355 -106 -108 -1 -188 -106 -3 83 -29 176 -50 -194 27 63 -89 65 41 245 -135 -19
3332 -19 249 -210 -149 -179 46 21 -62 172 39 243 45 -46 -17 -63 -65 -113 74 77 -9 180 -172 76 -221 57 -143
3357a43p5R8J63o8k09L89j88o5O3O2j10j86N45j69j90R6M6mJ22j86M0J10l44K46
3381D3q7K19r9l23L15K4Q5O0k37L1n3n6J86j86J06N6q3l1J8J82k08k7O8k11L16
3406A08j11J2Nk16P8J28m5o1L40l19J44L47j81n7k81M9k74J76J05J0J68j46K46
3429B25j23J09L0j61r0K52k11k4o4qj1JJ71m4o2qO0OR0o1o4j67P4K01nk43N5K09
3457A37p0o2j53K77k07R1q5O6L32l88N9N6l8K01j85p9J95j69J10q5n1m5L57j98
3481F6j34J00Mm02M63j09J3M82m22oo1k19M08j87K41q7k07k0p6K46L2l4j45N4
3505@mK28k92k5J43J76r9l7n5j79j9J15O7J37j15j79MK75j01l7j6J7K32k08J63
3530A91l45J44M30m87j10p9J97k2J38k2m0M6l57L76l7m7J81k3q5j50L20l81K30
$$ plain form
3357 -143 -218 -120 43 -25 -234 155 -33 -98 -35 27 -83 -269 276 107 -83 13 59 55 177 -9 31 141 -203 43
3381 43 -44 175 76 -247 68 92 177 237 0 31 -22 -78 108 -78 28 84 1 -30 -12 170 -38 -65 3 -208 108
3406 108 -3 9 14 -202 -124 4 -41 -102 238 -81 63 410 229 172 -109 -60 -334 -158 -53 -43 125 -21 225
3429 225 102 211 241 80 -10 242 31 7 -57 -65 -76 -75 96 52 -10 -18 42 48 138 77 13 -154 -80 121 116 -127 -72 137
3457 137 67 5 -148 129 -78 13 -72 -6 326 -62 -3 53 15 216 31 -48 147 -22 88 3 -48 -93 264 66
3481 66 -68 32 36 -366 97 -12 1 483 61 55 -6 -225 183 -4 237 150 -57 -77 -153 93 125 91 -54 0
3505 0 -4 224 -68 -93 50 226 127 90 35 -144 -163 -48 19 156 41 -138 -134 141 40 3 -13 4 236 28 191
3530 191 -154 -10 420 -67 -177 -256 -59 -81 57 35 -5 41 -316 60 23 -24 157 134 49 -101 219 -162 68
3553F8N8r6Q2q4J4Q1p4p2J36k5J10j85k7j27l6K20l3O3j40N8j77J43l4j73K58
3578Hj39J04R8k42M00k10O8p2M4k63J35j26K96lk24Q5O5P1J10j39o5P8k7k3j88
3603a59J68j01J07R7j78R7P3j6K12m70R2N3p7N3J44K41l49O9m8J70l77J79L3L9
3627E2j71p7J93j50L9K12k90M17k77K7K01l77M88j45k32N3O5j30J23j42rM55l30
3650eR0j55M7M5j06N7k2oP9J7N7M5k73J68J55l21M8KL12j76p3j6J19J80j26k76
3676a34J62j5k45L91m19K98r3J93l88L37l61P1K40lr6K03j66J47j99K87j72P0
3698A08j33k45K00J42p4j32K31j95J79J42l06Q6m0J5M7k2j68J77j40P9K38l28
3720a39L38k43K58j03j95K97j04r7J12l84L35l1L7k34J31K37j59l0Q5j26J34k23
$$ plain form
3553 68 126 30 112 28 42 123 49 -23 113 88 198 13 -14 -141 -177 43 10 73 -67 -9 -186 -43 -77 -250 8
3578 8 -131 -27 71 -171 229 19 87 15 59 -204 -69 -195 101 98 -126 -41 24 95 205 66 1 79 52 29 -159
3603 -159 9 -92 15 112 -66 31 104 88 300 -170 -78 -25 -102 -49 95 336 -13 56 8 178 -199 -20 13 52
3627 52 -119 -196 -3 -153 -114 98 -192 225 -52 -25 176 -201 287 142 -90 -37 28 -102 21 -121 -130 325 -5
3650 -5 85 -70 -23 22 -84 -27 -49 -55 24 41 98 143 -130 38 193 -128 -80 -78 234 58 -15 -31 88 268 142 -134
3676 -134 28 13 -232 159 -260 38 -55 138 -250 87 -274 -203 37 34 -62 141 -25 122 -77 210 38 108
3698 108 -25 -270 -70 72 -2 -134 97 -98 81 223 -83 3 -37 -22 25 3 -165 12 -128 -49 189 -139
3720 -139 199 -44 214 111 -84 213 109 12 124 -260 75 44 81 -153 -22 215 56 26 111 -15 119 -104
3742a04J50p3k88L83m67J65L91j25Q3p8lj88J72%n4K7O8j07M2M2j30q8L55R8m47
3767a76K26m0J55k51K2%J02j69LJ41J3mrJ61m5j36p5P4l5j66L85m65L63j93K04
3792H5Mk72L66k54J76k05R5q2J05m8P0o9j58J53K46q9k34j56L46l4j94L01K3p
3816A68j98J17k40J29J32k06j63K36j16J39q9J20k86K71p5N55o62j29L02J6j30
3837a09j66M58p9j50J41l5K0p8k11K8K92j21K29r6k90P7K2P8r9P1OJ02j18j9J66
3862A19k99J96m0J42J70r6p1k26L12k58K66q0j52K2K7k94J30QK27pq8l0j8M4O5
3887F9j5k21K13J11k12M36m49L8L6Q4Rj67l4M6J43Qo3j37K12R9l30J02J09j46
3911e9M8Q3K6j06j76K31Jo4K12j27r0K03k17J08j46J28K3k48k9L18j76P1m7j8
$$ plain form
3742 -104 46 -27 -315 68 -399 -234 157 32 115 37 34 -154 18 18 -36 -9 59 -48 -6 36 -94 -182 173 271 -176
3767 -176 50 10 165 -86 -64 -64 38 -131 -128 13 26 22 13 174 129 -7 -82 -8 -43 -209 176 -289 74 -119 85
3792 85 89 -183 183 -71 105 -100 -5 -87 18 -30 40 -29 -187 -34 212 123 -111 -267 79 45 -149 152 175 168
3816 168 -30 87 -153 -24 108 -98 -261 -25 -141 -2 -91 29 -257 14 -61 494 -168 -297 5 21 -109
3837 -109 -275 183 104 -46 95 60 80 2 -209 -181 111 -10 219 123 -167 -90 -68 10 -89 -18 -12 90 -28 -47 119
3862 119 -180 16 -24 118 288 192 121 -105 207 -51 215 135 -17 5 32 -262 -132 -124 103 96 8 -22 -40 4 69
3887 69 54 -167 46 157 -55 381 -68 -30 6 90 99 -68 -102 -56 87 95 32 -105 107 206 -124 -22 87 -59
3911 -59 -11 72 98 -8 -184 47 48 -16 196 69 -21 182 -35 73 -73 55 78 -170 -199 119 -57 14 -33 -51
3935e1n1j50K55o3Jm9L55k47N3r9p4J93Mj11J16j76J29J04k52K78k39J05j45J09
3959ep5J30j89M90m49L41k31J61o7p8OO2k12J62j63m3q0L10l72K15J43o3j79L45
3983A59j55n5J83j77q3J4K17j33J16k47Q6J27j71J53q5J46j97J63J19j34J23k47
4005g8p2L44j29O2r8l6J99l12K31k29P8J28J10j54j7Pj32L34k56j09K81m24M64
4028A92j36J3l13K15J64j09J27l0k53L72l39J56l58L37J00j82K19l08K10k56M33
4049B54l83J01q5J42r1Nj08j18K38r2J78M3k25J24j31K65j50O9o9R6j56J70Rn
4073H1j45lJ54rk8J2r0J31j05j72L42Mk40K07J1k31K08r3J26j78J7j31nk0N32
4098C75k68N8l96L19k02J00J99l6j35k05L24p8L7j1j12Q4j56N2R2j18J1J63k73
$$ plain form
3935 -51 -102 -252 3 -60 -59 -108 247 0 53 -46 -120 73 77 -34 82 -94 35 139 -113 165 -74 31 -114 -5
3959 -5 -80 50 -139 351 -98 243 12 173 106 28 34 96 -116 46 -117 -160 -240 70 -302 -87 56 -7 -186 159
3983 159 4 -51 132 -45 -128 -114 103 -30 86 -161 -75 52 -119 34 -51 95 -102 61 180 46 169 -78
4005 -78 -150 194 65 127 29 -7 192 -120 111 -118 -40 88 198 44 27 34 -98 236 -20 -129 152 -272 192
4028 192 56 69 -244 -29 135 26 153 123 -130 242 -97 59 -299 38 138 -44 175 -133 77 -179 254
4049 254 -129 -28 -113 29 -62 -57 -165 -283 -45 -137 41 84 -141 -17 -148 117 -33 36 -33 63 -93 77 86 81
4073 81 -64 -67 87 78 50 62 -28 103 -2 -174 168 172 -68 139 150 -81 127 34 160 -18 -1 -132 -137 -157 375
4098 375 107 165 -231 88 -114 -14 185 149 14 -191 133 55 92 81 -31 53 -103 -51 41 -77 -66 97 -176
4121a76J05Rq6Rk0K60j57L0j46J40K62O3O6l96M8J1P3j44J49k2q3L41k20l12M6
4146a50K76l78L13O4P5j51j48O2J90j26M0j75J65n3j35M13j43j05K10j60j85j06
4168b07K48j14j52L35j61j73L70j59L18m34j66J49K76Nj6l41K2K53Nk39M24n9
4190A84l72M01l46q2M15l8n2k75l9L43k68J19l1K61k72L9J18p9K0p1L04k58j54
4213a33k2J52j91K62l01J04K75j99J56k09K6K78p3j28N7l56M02k83K47j69K19
4234A14l74N5K06j29J88K00k12Q9l19L05r5j31N5lk9O3L0j05k52J50K46M2k98
4257b04K45j28OK92r0l83K7L67l6j03k20J56K80j99j3k07M50l10J49nK89m74L2
4280g9o0J43J37j19k2N7K75k89l05J76RJ11j18K58j35k18J50Rn0J9P9m0j2Q9l9
$$ plain form
4121 -176 -71 -62 -148 -139 -159 101 -56 -26 -172 -32 230 293 359 -37 11 22 95 -49 100 78 -5 336 116 -196 -150
4146 -150 126 -252 61 125 200 49 -99 -37 153 27 67 -108 57 4 -131 282 139 34 244 84 -101 -207
4168 -207 41 -73 -225 110 -51 -224 146 -13 305 -129 -295 -146 130 135 119 -222 -200 53 58 -181 243 184
4190 184 -188 213 -133 -215 200 162 110 -165 -204 139 -129 -10 -41 220 -52 -13 105 26 46 -25 279 21 -133
4213 -133 -155 -3 -194 68 -233 -129 146 -53 103 -106 -80 198 125 -3 54 -302 100 -183 64 -105 114
4234 114 -260 -205 1 -128 60 260 48 137 -182 123 28 -103 -48 -51 -80 -17 13 -92 -344 -194 52 94 -204
4257 -204 41 -87 -81 211 121 -262 -235 132 96 -7 -227 -71 209 10 -3 -210 240 -70 79 74 363 -111 -79
4280 -79 -139 4 141 22 0 57 332 43 -262 -86 -77 34 -84 174 39 -179 -29 -20 -70 -51 28 -12 -24 65 26
4305B6j26kK89k00JJ97r9n9J6j1k45M15l63J98K23k45R0j4k30Q1pJ78j7j74O2
4330a6k6O3k20J21J25k2k21J67n4L25j58r8K12m63L19k01k2j05j8L22nOQM7j60
4355g4j43J89j2J03J96k06l1r0J29k28J12R4J14J04l15P6j78J52k67K97j14K18
4377A26q4m21K11J86j04q7L8m3J30P6K03n9k80l0K35k50P9m9M39m33J8PP7J93
4401A78k62j89J59R1j39K54l4Q3j28j15m7L47j88lk18M18o8j25N2j9k37K48K11
4424B69j04j36l1o5k80L1L64n9k08R4j13N3K32j66j34L55k69J34O9J0k19K46j29
4447e6N6J83j83j04L96j51j60L4J42k85J19J68j94J54m0l19M2L70j54n7k73L74
4469F2j59R7l8K02O0k83K65j47M5r0M4K4M0j51K9J36r5l06M96j71J99l56L67j59
$$ plain form
4305 26 -100 -102 187 -13 -12 185 86 27 43 32 -213 202 -161 37 260 15 105 91 -139 -58 -65 113 96 -78 -16
4330 -16 -42 21 -199 -78 47 25 -196 -29 -83 242 84 -14 198 -265 54 -147 -169 -274 -292 30 25 31 39 86 -74
4355 -74 -217 -28 -40 63 259 53 22 -68 61 -167 -55 39 153 257 -58 18 -160 -8 -275 22 -92 126
4377 126 42 -379 -168 18 -86 -173 -135 -178 -48 28 231 172 -108 -138 97 -153 -74 -123 316 -117 -99 -92 -15 178
4401 178 -84 -273 -114 -23 -162 92 58 141 13 -102 -149 198 10 7 -211 207 139 14 66 47 -190 58 269
4424 269 165 29 -2 -67 -347 -316 48 -11 -219 -125 -238 -185 47 -119 -253 102 -167 -33 36 46 -173 73 -56
4447 -56 0 183 0 -104 292 141 -19 15 157 -128 -9 159 -35 119 79 -240 -198 172 18 -39 -312 62
4469 62 -97 0 -38 164 224 -59 206 59 104 14 58 82 122 -29 0 136 41 -265 231 60 259 -97 270 111
4493A11j06pJ18j1j6J4n8K44j73q1n9o5K03J1Q2l36R6n6R0J24l44L81k03J18j1
4518F6q8k71K72l8j00J55K7j33L20j65J7j61K53j54p9l7L92l44J47j02L11k88
4540@j50J72K04n6j97O1M8q7k6J76k02l9K50j34j12l1Q1n0J16j0jl99J47J39j36
4565b36K49k53L85j07k7m7j81J71p7L4j83K88r7P6R9j81j2O0j01j7K38q7J12j66
4589f0J8j61L7J04m9J71j67J51R6k60L52l00l6J37J19r7j9J09l30R3N7l9j06M27
4613B47J01l73P5k8K00Q6k46L0l10K05q2L44l58l6J86j04J42l11K19n0J55j94
4635a02j43K08J1n3j4N7J10J39j25j11j2j17J70J6p8L4J04J8r3rq9o0J23L9J56
4660A79l8k20R0q9L3K02j14L13o99K08Q8n9R1j12j25J59J44k03J86p8jK37k20
$$ plain form
4493 111 5 -2 116 105 89 103 45 289 116 35 -24 -89 114 125 207 -129 -33 -89 1 125 -219 162 -41 77 66
4518 66 -22 -293 -21 -59 -159 -4 23 -110 210 45 62 -99 154 0 -79 -116 276 -68 79 -23 288 0
4540 0 -150 22 226 170 -27 34 82 -5 -31 145 -57 -96 154 20 -92 -123 -42 -92 24 14 13 -386 -239 -100 -236
4565 -236 13 -240 145 38 11 -36 -217 -46 -123 -89 -272 16 -81 -5 94 -87 -99 -39 -140 -157 81 -6 106 -60
4589 -60 -42 -203 -166 -62 -111 60 -107 44 140 -120 232 -68 -104 33 152 55 36 145 -185 -92 -35 -74 -180 247
4613 247 348 -25 50 22 222 308 62 92 -218 -13 -95 249 -109 -145 41 -63 79 -232 -13 -63 92 -102
4635 -102 -245 -37 -26 -79 -93 -36 74 213 88 -23 -35 -152 18 34 -44 -10 94 112 19 10 -79 -139 -16 23 179
4660 179 141 -79 11 -78 -45 157 43 356 -343 -135 -47 -106 -15 -127 -252 -93 51 -152 34 -44 -45 192 -28
4683b8j1Q2J58j05k53J14L04l42P2K9k27L09j89j91J96J10j16J93k4Q3l78R9L37
4706B22J64l10M0j36l4JJ11mo6k00L30j25P4K2l6K35k35l2l3j5K99m74J3K38j60
4731a11J42J30j01j34J02K43l19j59J84J09j70J26n6r5P5K51j53k51J08N4K39
4752B14j91P2l9p1N1J46m53M42l13j04L03k90L03j94R4J41K0k35p4r0N84l11k50
4775b45J00K72k47J07J56j74P4j22L36n4j67n5k68L72P5j2j50p0Q1Pj80J18qp4
4799a28N4J96j55K2m1Ro1p8P3K05j60N6r4K48Nj16j09l1J77k94L68j16J57k48
4823f1l7J50l01L26P3m73L28k50L65q8p8J94o8J74j30j66J91J4j02L0j18j22L59
4846B10k26N1M6J6O0l15J20j58J32k54K24n9P5J72k7l72L41m6O7j82O9Q7j57M64
$$ plain form
4683 -28 -39 43 201 96 -157 -43 261 -81 -9 20 -207 102 -87 -278 -82 28 -88 105 81 164 -214 -115 222
4706 222 386 76 116 -20 -54 -53 58 54 -12 -212 118 -7 67 89 53 288 53 21 -12 -27 272 -202 -189 49 -111
4731 -111 31 161 60 -74 28 271 -48 -207 -23 86 -84 42 -14 -109 -34 217 64 -187 -79 -25 214
4752 214 23 95 56 -15 36 182 -271 171 -142 -246 57 -233 70 -124 -30 111 131 -104 -178 -268 316 5 -245
4775 -245 -145 127 -120 -13 143 -31 43 -79 257 203 36 -19 -287 85 160 148 -2 -72 9 16 -164 -46 -54 -128
4799 -128 -74 122 -33 -11 -52 -43 -104 -182 -109 96 -64 -8 -102 146 151 35 -74 -105 72 -222 146 30 187 -61
4823 -61 -98 52 -249 77 150 -323 5 -245 120 32 -46 148 80 254 124 -42 149 163 61 91 -27 -149 210
4846 210 -16 35 81 97 157 -158 -38 -196 -64 -318 -94 -153 -78 94 67 -305 36 -10 57 -125 -56 31 -126 338
4870C38l25k86M19L0l18L13j6l26K21qj39r1J13j9L1K40j84r3J47o3rK22l53K12
4894E6k0q8L0j42R3M7p8J77k84K86kK4l1j00J0K0R9j33K1R1l61L6L60K00k75r7
4920f1j23M3L06j18o0k40M67r6k08J97k52L93j09k09j49L00K32j56Rl54L8K55
4942A05J83m32L74m10J78P6p5r6Q7J65o2j15M5j24J57o7k57K35k26J70r7M9K21
4965H4k84M73j29j13K09l66K31n2J5O1k25J30Q6j12j80j76L64P0k52L38o2j88
4987g8k18K62K6K31l91K11j96M09l04J59j5rKp0j22j17J23J74j45M66k68k14J34
5010E0o5J08k79L05J08l38L8m9K19PM7j65K48j85l6j80J74J76k14K76k67Oq7K36
5034A33q2kj28j44K23j2K3J36k72K14R8k01m7n2l9K30K20m45O8J02k74M21j80
$$ plain form
4870 338 13 -273 146 176 -142 171 155 -171 50 42 -97 -188 -75 -94 -63 177 -7 -100 47 -16 -25 197 -156 56
4894 56 36 -52 -22 -164 -71 -24 -102 75 -209 77 75 99 68 -32 -22 -2 97 -36 -15 76 -285 -249 111 311 36 -61
4920 -61 -184 -141 165 47 -13 -253 214 118 -90 107 -145 248 139 -70 -219 81 313 157 166 -188 -150 105
4942 105 288 -144 230 -180 -2 74 -1 -97 -10 155 93 -22 23 -101 56 -11 -268 -33 -259 -89 -186 -137 84
4965 84 -200 273 144 31 240 -126 105 53 68 129 -96 34 120 8 -172 -348 16 86 -166 172 110 -78
4987 -78 -296 -34 -8 223 -168 43 -153 256 -48 111 96 87 89 19 -103 -220 -97 77 -68 398 130 -84 50
5010 50 -15 93 -186 119 227 -111 -73 -122 97 104 151 -14 234 49 13 -167 7 183 -31 245 -22 -16 -103 133
5034 133 51 49 -79 -223 0 -12 11 147 -125 89 187 -14 -61 -113 -152 78 298 -147 -79 23 -251 170 -10
5057a0Q8K0j99J02R6j52j52K44L9k63K20O6j66j01l4J21K1k20P14k20k70j32R6
5080i2K70k92n5J86k10L12M4l51O2J29lJ31k26m5K63m14L33j6J86p9m9q8j10K74
5104A60k02k01M96k10j63J88K0j29O7r2K35j23k51L45j44J7J59l46p8L6L20k64
5126a60J52J91Q1j00l79J71k03J55K39n3j22oJ93L2j71k29J95m3K51mk26J5J22
5149A01Mj0L0j47j12J24l5J2L45l28K03k46O6O2j27K06k68K09j89O7r1Q0J54p4
5173C6j60J03q4J66J68m21J91j00m5J30J58k97K70q0J32k76r7M37k77L8j33K17
5195G6m9k51M00j29l6j61K2J26j47J28l8K90o1k10j7J77m4K0Q7l48J33P2j57K6
5219i1N1J60J27q7k05N1r8J6O0J24j52K6L8K17l39k7q5J39L0J78j26j37J23j27
$$ plain form
5057 -10 78 98 -101 1 97 -55 -207 37 76 -187 33 99 -67 -168 -202 -81 -60 -280 434 214 -56 -188 -92
5080 -92 178 -114 -169 17 -193 119 163 -188 -126 3 0 131 -95 -140 123 -291 42 26 212 133 84 -4 -114 160
5104 160 -42 -243 253 43 -120 68 88 -41 26 -66 169 46 -205 140 -4 13 172 -174 -252 -216 104 -160
5126 -160 -8 183 264 164 -215 -44 -247 -92 147 94 -28 -34 159 191 20 -209 -14 -57 194 190 -36 -21 101
5149 101 105 95 125 -22 -134 -10 -45 -33 312 -16 187 -59 7 69 -58 148 -120 89 -100 -33 -124 -44 110 36
5173 36 -124 -21 -105 61 229 -192 -1 -101 -146 -16 142 -155 115 35 167 -109 -206 231 -46 -8 -141 76
5195 76 27 -224 176 47 11 -150 -128 -2 -149 -21 -59 231 170 -40 -57 120 76 96 183 -165 -32 40 -117 -91
5219 -91 -40 120 247 160 -45 6 -92 -76 -16 108 -44 -18 20 237 -102 -129 -214 -75 -45 133 7 -130 -7 -134
5243a34J57J89l67J44L0mj56r8J94J91m68L06j50J02R2j86J93m7q0Q4J41q4j05
5266e6J3k29M09j72q2j47M7J90L8k5N3R5M0l23J01K31k8k89P9q5K78k56J70j64
5290a12J60o1J01l6k27L85j49%q5kPL8l78J26L62l15K4O7Q5K07l85Q4J33J2J64
5315B05k37j53mJ76k50K83J38k69nK37j21p6j07J52J38j93j44K40J12j59O3j80
5337a54K03j46J62NK28m29K84L1k6p3l3k34K26j18l3J54J39j64j68K06r0K17k69
5360h2K26m54M31k12J65n0j40n6J70Q7l17K07j72K85m2Q4m58L86l31J86K58l06
5382a35j15K03J27m7k7L9J22l48K00l7J69j59L3n3k9M8j56J44m3j02R4K55l56
5405a73J93O8k10K28j42j77O94n51K91k02Q4k31o3L2J11K56j44j10q8K3J05j31
$$ plain form
5243 -134 23 212 -155 -11 19 15 -141 -239 -45 146 -322 -16 -166 -64 28 -158 35 -12 -92 -8 133 49 -56
5266 -56 -43 -272 137 -35 -117 -264 -217 -27 11 -14 39 134 174 -149 -48 183 155 -134 -55 -140 138 -118 52 -112
5290 -112 48 -13 88 52 -175 210 61 61 -24 -26 -19 19 -359 -233 129 -186 -162 -95 -10 197 -188 -104 29 41 205
5315 205 -32 -185 -189 -13 -263 20 158 -111 -116 121 0 -76 -183 -31 107 -86 -230 10 122 -37 26 -154
5337 -154 49 -97 65 70 298 -131 153 184 158 85 52 -182 44 -74 -107 47 186 22 -146 60 -30 187 -82
5360 -82 144 -310 121 -91 74 24 -116 -172 -2 85 -232 -25 -197 88 46 130 -328 58 -273 -87 171 -135
5382 -135 -250 -47 80 33 6 45 167 -181 19 -18 151 -8 25 -28 -57 -9 -165 -21 -64 -166 -72 183 -173
5405 -173 20 88 -122 106 -36 -213 481 -70 221 19 103 -128 -191 -159 -48 208 64 -46 -134 -111 -6 -137
5427a37M3n7J67K24l61K88l98L48j05P4J46k20q2o7P2O8N4J09jj68K05k33Q1P3
5451A23l7q6jr4J11k49NM70p1p2J06j90J37r6j38J23j86J66ooj08K35m6k1j1j49
5477i1j77L42k15Q7R9j28J08j1K74m2k65l2j9J39j39j15p3K43J13j5l8K17k56
5500Fn0QJ79k15J46p4J65k29Q6o7p7J42J25k84J52o9J13j81J24L1l66K52J94j43
5524c2K25j22l5m9J59j34pn8J94Q2l81L88k77j12J73p6N9n1NJ05o9J7j48J29K5
5549A0jlm0J93K6o1M5l64J94O9j7j41n0j3L17m81J95K6J9j7J89mj23J92qK8j17
5576F3r2J17k21K82j09J16p5n8K27j29l32K63J77r8m35L83j65K79o2k16K37j25
5598B7l0L4p1k24K01L38l22K08r7o2Rj06Q3o2j34J11J58K90m77Q8J60j22J1O8
$$ plain form
5427 -137 -94 -151 16 240 -121 167 -231 117 12 86 232 12 -70 -137 -65 3 57 166 165 -3 202 -31 50 123
5451 123 86 0 -1 -95 16 -233 -228 242 171 99 205 15 152 56 -82 41 -145 21 15 9 -99 136 90 69 58 -91
5477 -91 -268 74 -141 -54 45 -83 25 14 288 246 -19 -51 -70 69 -70 -185 -258 -15 98 83 45 262 6
5500 6 -44 -36 143 -72 74 0 165 -64 22 -45 -122 20 145 -139 13 -56 57 -124 0 31 -335 -83 111 -32
5524 -32 193 71 36 -13 146 12 5 -53 141 223 -158 230 -47 -159 14 -62 -3 -54 -49 56 -13 4 -144 -15 10
5549 10 9 6 -34 159 185 124 169 -195 -1 68 51 -90 -140 -153 164 -317 -122 -96 -77 -94 95 91 -32 160 152 180 63
5576 63 -29 88 -133 149 40 156 81 23 250 121 -211 52 229 131 -304 79 -86 193 131 -85 152 27
5598 27 -3 31 -40 -264 -63 275 -47 161 64 2 11 -95 -12 -74 -208 -97 61 351 -126 -38 122 0 11 79
5622G9j98Q9j45K50m5j78J58l74M78j53rP3k2L2j25l9O4r1L6l5K15r4J26M5Lk45
5648a05J77P1q7jN7j60k45K53k55K72J53q3k80K16L2j06K13l72N7L96j24O2K1
5671A62j01R0j33j2Ml41K95R1j02K4j26K23j11M9J77j94l5o6Q8j93M45j55q9M
5695fR4j00j5J87j68O9k00Q6j08J69j02j4J4L96k51%m6mj53K75j22j2j48J49m2
5720e2j9nJ58o3k3K7j46l2K54k52O1oq3lJ33n3K38p8k51K75j95j63L46K8j96K3
5746g7qJ86n82O51j98O0k70K32q6q4K54j53L07j13j33K02j56l9L45l96%k63K16
5769a05K7L48k08p7m4O5l4r5K94j28J4r5J41l73J88J70j62K4k6L44l98M0J18j64
5793a36L48k71J58m03R2J69j60K76J36l1j31J42n5j77o8K73l12L3LL71k39K0m84
$$ plain form
5622 79 -119 -30 -175 75 30 -148 10 -364 114 -39 -48 25 3 35 -90 -129 -65 -156 -120 -155 60 -34 92 137 140 -105
5648 -105 72 143 56 55 112 -48 -293 -40 -295 -23 130 47 -233 -17 15 -91 122 -250 -193 203 79 141 162
5671 162 61 151 18 6 10 -331 -36 55 -47 -23 -149 74 -37 12 189 -5 -40 -106 -18 -211 234 79 -10 -6
5695 -6 88 -12 -27 160 -8 61 -139 -53 -161 8 -94 -108 -94 302 51 51 5 1 -152 123 1 -11 -159 -10 -52
5720 -52 -71 -76 82 19 -4 23 -123 -155 99 -153 -92 -98 -181 -184 -51 -104 134 56 -195 80 -115 -278 68 96 -100 -77
5746 -77 -85 101 -481 170 -28 32 -238 -6 -92 -176 78 -75 232 119 -14 188 32 -7 338 -58 -58 -321 -105
5769 -105 -78 270 62 -15 -59 6 -28 -123 171 43 57 -38 103 -270 -82 88 -74 -50 -76 268 -130 -90 28 -136
5793 -136 212 -59 99 -304 -212 -43 -203 73 209 178 47 189 134 -43 -111 162 -150 -117 -114 257 18 38 -446
5816d46K52n0K99j31K06k21K75j61P2j58j38L84j2k89N0l36K46K36K4k34M4K20
5838A32q1j63p5K7J57j30Q3J23O9j50Q4j74K17j62K11j44m4j50K19K6k18j41L82
5861I8K45j73l10p8J08K29P1j16n3k26j37M76l40L22k58J02P7M9k3j02J55j25
5883ik03K06N5j00J15j54K30j81O9N6j95nK6r2K43k42K15M2J22m7O1m31J98j0
5907c1O2Ml04L32L40l30p8P8k75L32k3o9l3JN5L37n63n7N49l76N0J72m29J28J19
5932iJ71r0J9j37P5R4j74J9k47M15J42n54L15qq2n2J46j41K44J21l70Q9k5O1j67
5957a45K47K6j17k98K34k1J21K9j98O7J31l22K61j1l6m2oj5J08q8L4l5l5M72n09
5982a48j16J95K88m16J72j13n1K41J30k47j55J93j72K61l44K81n4j60J21M8R6
$$ plain form
5816 -446 -194 -244 55 -76 130 -91 184 23 95 -63 -201 183 171 -118 -68 -404 -158 78 102 -132 -88 132
5838 132 51 -112 -187 -160 -3 -133 -50 73 142 -8 76 -98 119 -43 168 24 -20 -170 49 75 -143 -284 98
5861 98 343 170 -140 -218 -110 119 190 74 21 -205 -342 134 -206 116 -142 -40 37 86 63 -39 116 -9
5883 -9 -212 -6 49 -51 64 -90 140 -41 28 84 -111 -116 -90 -182 61 -181 34 76 198 151 212 -219 -21 -31
5907 -31 31 35 -269 63 403 73 -5 73 -202 130 107 38 5 6 61 398 -165 -222 327 -49 1 173 -256 -128 -9
5932 -9 162 72 91 -46 29 123 -51 -32 -279 136 278 -276 39 31 -51 -103 43 -98 146 267 -103 -14 -39 22 -145
5957 -145 102 128 11 -287 -53 -74 47 76 -122 -55 76 -246 15 4 -32 -74 -80 -95 13 -75 -41 -76 -111 361 -148
5982 -148 -264 -69 219 -197 -25 -138 -189 52 182 -65 -220 -27 -199 62 -282 -1 -55 -215 -94 -46 50
6003E0J62j10j61J49J06JM7l06J06j88J82o7n2J85m23M74k80j71J31K21R4q0J33
6026B03l34Q2j34J08Q4j24K18k02r4L0L62k14l47M04j01J43k38K68j46J43J01
6047B12Ol98O0K12O7l91J85J2j69K14k48L37k4K03k79j17Q9J56l42Q0K62m92M44
6070G9j3p0k28K56k9p5J93k58L4P3K5J6j1r4J7Q1K2K87m08R3j4k22L26J73m21
6095a68J53J93k83O9K32P7j42k56K93k54ln9L78l26J77j23p3J09l08K73p3K63
6117A49l33L37k9k37J34J7MN8k09K73r5j97L18j45n0j85J9J14rk7n4N0OJ10J65
6142A84j62J29k49j03J08K21k99J1P6J24OR2l15J33N6k81J21J64J15l22J23K18
6164A50K8j85L7R5l53j8N62l55Q7j17N1k02J54K02p5oL07l34N4n1J69Rl66K63
$$ plain form
6003 50 212 102 -59 90 196 197 244 -62 44 -144 38 -29 -81 104 -319 155 -125 -296 -165 56 150 70 203
6026 203 -131 -49 -183 -75 9 -115 103 -99 -193 -163 199 -15 -362 42 -59 84 -154 114 -32 111 212
6047 212 218 -180 -120 92 159 -232 -47 -35 -204 10 -238 99 75 278 -1 -118 -29 127 -215 -135 127 -365 79
6070 79 66 -4 -232 24 -5 -80 113 -145 -111 -38 -13 3 -8 -102 -85 -4 18 305 -103 -10 -24 -246 80 253 -168
6095 -168 -15 178 -105 -36 196 273 131 -125 168 -86 -89 -148 230 -96 81 -42 -115 -6 -314 -41 -114 149
6117 149 -184 153 124 -113 21 38 42 100 -109 164 69 -128 190 45 -5 -190 -171 -57 -66 -93 -147 -97 -91 19 184
6142 184 22 151 -98 -201 -93 128 -171 -160 -84 40 46 138 -177 -44 12 -269 -148 16 131 -191 -68 150
6164 150 178 -7 30 125 -228 -246 316 -39 48 -69 -18 -220 -66 136 61 55 362 28 82 31 200 209 -157 106
6188A06j92O2J62P8n16M51R5k27j05Q8K28j74K47k02k12M35l66J29j71J84p8k15
6210a93J20o2J42J83j10J70o0j52j02j0K49k16NJ43o7j09L0L8J87l33q9K62J17
6233A43l16J55K22k19m15N70j8j09J0K65k18j33J65j18K46q6l93M64l29P8Q3k04
6255a57K42j69J36K07l04R1j68j02M97k33QJ89k18k42L36J03j28j7q1K08k39j6
6277e7K61k55k37M34r9J5J1l45J56j08K25J17k46L9r7MM74j46k99J84j18N6J35
6300A04k04J28J01k39j6J31P1j22L9J08j35K04m75M49k92L46j11j99K54l68M28
6321B02j83n4J82j20J86j56K8M8m16J39J40k15J75o7O4J47jl46J7L94k14J15k2
6344D3j3q7K17j58m3j16Q9mJ80M0rl24J26R7j02j35N66j51k32m7P3L7j09o8M9
$$ plain form
6188 106 -86 -24 138 216 -300 151 246 19 -86 2 230 56 303 101 -111 324 -42 87 -84 100 22 -193
6210 -193 -73 -135 7 190 80 250 190 38 -64 -74 175 -41 -36 107 40 -69 -39 -1 186 -147 -236 26 143
6233 143 -173 -18 204 -15 -430 140 122 13 23 288 70 -63 102 -16 230 144 -249 215 -114 -36 47 -157
6255 -157 85 -84 52 259 -45 46 -122 -224 273 40 48 237 19 -223 113 216 88 71 -10 198 -41 -57
6277 -57 204 -51 -288 146 47 62 73 -272 -116 -224 1 118 -128 -89 -186 -182 292 146 -153 31 -87 -31 104
6300 104 -100 28 129 -110 -126 5 76 -46 -7 101 -34 170 -305 144 -148 198 87 -112 142 -226 202
6321 202 19 -35 147 27 213 57 85 133 -283 -144 -4 -219 -44 -111 -47 100 99 -247 -230 164 -50 65 43
6344 43 30 -57 160 2 -41 -157 -68 -72 108 148 139 -185 -59 38 -64 -199 367 216 -16 -63 10 47 -62 -130 -81
6369h1l8K04J39o20L50l9M3m75M22OP2l6J05P7l47M4N0J50j68K54j09R0j72N1
6393b8R2K41m75l7K06J25j05j64M73n25K52M7m3J7p5k3o5J20Q3k0j06Qn7J75j3
6418A03o3j4J35k80K83k67J97k10J1J72j98J31m9L02k84n1q8K19P9j62P2N05m59
6441H4j85J06R9m2qJ68l25R9l0M0P6l19RL25l10J17J49k77R8p5J65J52r6K02j70
$$ plain form
6369 -81 -119 85 224 -396 -46 -85 -42 -517 -95 -89 -17 -53 52 129 -218 -174 -124 26 -142 112 3 93 -79 -28
6393 -28 64 305 -170 -207 -1 124 19 -145 328 -197 55 102 59 76 1 -22 -87 33 116 96 -10 -2 -59 116 103
6418 103 40 26 161 -119 164 -103 94 -116 -105 67 -131 0 -49 253 -31 -82 -170 49 128 -34 38 543 84
6441 84 -101 5 104 62 54 222 -103 -4 -34 6 82 -237 -228 97 -213 -96 53 -224 -126 -201 -36 116 20 222 52
$$ [...]
8191a54
##END NTUPLES=NMR FID
##END=
