##TITLE=1H_Ad=o(bat1)-Cryst-ACN-ti
 CDCl3
 8 sc, 
 22.12.2022
##JCAMPDX= 6.0         $$ Bruker NMR JCAMP-DX V2.0
##DATA TYPE= NMR FID
##DATA CLASS= NTUPLES
##ORIGIN= UXNMR, Bruker Analytische Messtechnik GmbH
##OWNER= root
$$ XWIN-NMR		Version 3.5
$$ Thu Dec 22 13:55:35 2022 Russian Standard Time (UT+4h)  she@DPX200
##.OBSERVE FREQUENCY= 200.13135
##.OBSERVE NUCLEUS= ^1H
##.DELAY= (6, 6)
##.ACQUISITION MODE= SIMULTANEOUS
##.ACQUISITION SCHEME= undefined
##.AVERAGES= 8
##.DIGITISER RES= 18
##SPECTROMETER/DATA SYSTEM= spect
##.PULSE SEQUENCE= zg30
##.SOLVENT NAME= CDCl3
##.SHIFT REFERENCE= (INTERNAL, CDCl3, 0, 15.7039)
##AUDIT TRAIL= $$ (NUMBER, WHEN, WHO, WHERE, WHAT)
$$ ##TITLE= Audit trail, XWIN-NMR		Version 3.5
$$ ##JCAMPDX= 5.01
$$ ##ORIGIN= Bruker BioSpin GmbH
$$ ##OWNER= she
$$ F:/spectra/data/she/nmr/H-F/1/audita.txt
$$ ##AUDIT TRAIL=  $$ (NUMBER, WHEN, WHO, WHERE, WHAT)
(   1,<2022-12-22 13:54:13.39 +0400>,<she>,<DPX200>,
      <created by zg, POWCHK disabled, PULCHK disabled
       configuration hash MD5:
       00 E9 B6 7A A2 85 ED C7 34 08 36 98 17 FE 4E 26
       data hash MD5: 16K
       6B 22 E0 B2 1D F2 3E 7A CE FF FA 19 EE 35 25 BD>)
$$ ##END=
$$ 
$$ hash MD5
$$ 79 F5 CA 0C BD F1 5F 47 CB 9B 57 DF B4 34 60 98
##$RELAX= 
##$RELAX= 
##$RELAX= 
##$RELAX= 
##$RELAX= 
##$RELAX= 
$$ Bruker specific parameters
$$ --------------------------
##$DU= <F:/spectra>
##$EXPNO= 1
##$NAME= <H-F>
##$PROCNO= 1
##$TYPE= <nmr>
##$USER= <she>
##$AMP= (0..31)
100 100 100 100 100 100 100 100 100 100 100 100 100 100 100 100 100 100 
100 100 100 100 100 100 100 100 100 100 100 100 100 100 
##$AQSEQ= 0
##$AQ_mod= 1
##$AUNM= <au_zg>
##$AUTOPOS= <>
##$BF1= 200.13
##$BF2= 200.13
##$BF3= 200.13
##$BF4= 200.13
##$BF5= 200.13
##$BF6= 200.13
##$BF7= 200.13
##$BF8= 200.13
##$BYTORDA= 1
##$CFDGTYP= 0
##$CFRGTYP= 5
##$CHEMSTR= <none>
##$CNST= (0..31)
1 1 145 1 1 1 1 1 1 1 1 1 1 1 1 1 1 1 1 1 1 1 1 1 1 1 1 1 1 1 1 1 
##$CPDPRG= <>
##$CPDPRG1= <>
##$CPDPRG2= <>
##$CPDPRG3= <>
##$CPDPRG4= <mlev>
##$CPDPRG5= <mlev>
##$CPDPRG6= <mlev>
##$CPDPRG7= <mlev>
##$CPDPRG8= <mlev>
##$CPDPRGB= <>
##$CPDPRGT= <>
##$D= (0..31)
0 1.2 0 0 0 0 0 0 0 0.06 0 0.03 0 0 0 0 0.0002 0 0 0 0 0 0 0 0 0 0 0 0 
0 0 0 
##$DATE= 1671702853
##$DBL= (0..7)
120 120 120 120 120 120 120 120 
##$DBP= (0..7)
150 150 150 150 150 150 150 150 
##$DBP07= 0
##$DBPNAM0= <>
##$DBPNAM1= <>
##$DBPNAM2= <>
##$DBPNAM3= <>
##$DBPNAM4= <>
##$DBPNAM5= <>
##$DBPNAM6= <>
##$DBPNAM7= <>
##$DBPOAL= (0..7)
0.5 0.5 0.5 0.5 0.5 0.5 0.5 0.5 
##$DBPOFFS= (0..7)
0 0 0 0 0 0 0 0 
##$DE= 6
##$DECBNUC= <off>
##$DECIM= 32
##$DECNUC= <off>
##$DECSTAT= 4
##$DIGMOD= 1
##$DIGTYP= 9
##$DL= (0..7)
0 120 120 120 120 120 120 120 
##$DP= (0..7)
150 150 150 150 150 150 150 150 
##$DP07= 0
##$DPNAME0= <>
##$DPNAME1= <>
##$DPNAME2= <>
##$DPNAME3= <>
##$DPNAME4= <>
##$DPNAME5= <>
##$DPNAME6= <>
##$DPNAME7= <>
##$DPOAL= (0..7)
0.5 0.5 0.5 0.5 0.5 0.5 0.5 0.5 
##$DPOFFS= (0..7)
0 0 0 0 0 0 0 0 
##$DQDMODE= 0
##$DR= 18
##$DS= 0
$$ [...]
##$SUBNAM2= <"">
##$SUBNAM3= <"">
##$SUBNAM4= <"">
##$SUBNAM5= <"">
##$SUBNAM6= <"">
##$SUBNAM7= <"">
##$SUBNAM8= <"">
##$SUBNAM9= <"">
##$SW= 18.05172834244
##$SWIBOX= (0..15)
0 0 2 0 0 0 0 0 0 0 0 0 0 0 0 0 
##$SW_h= 3612.71676300578
##$TD= 16384
##$TD0= 1
##$TE= 0
##$TE2= 300
##$TE3= 300
##$TEG= 300
##$TL= (0..7)
0 120 120 120 120 120 120 120 
##$TP= (0..7)
150 150 150 150 150 150 150 150 
##$TP07= 0
##$TPNAME0= <>
##$TPNAME1= <>
##$TPNAME2= <>
##$TPNAME3= <>
##$TPNAME4= <>
##$TPNAME5= <>
##$TPNAME6= <>
##$TPNAME7= <>
##$TPOAL= (0..7)
0.5 0.5 0.5 0.5 0.5 0.5 0.5 0.5 
##$TPOFFS= (0..7)
0 0 0 0 0 0 0 0 
##$TUNHIN= 0
##$TUNHOUT= 0
##$TUNXOUT= 0
##$USERA1= <user>
##$USERA2= <user>
##$USERA3= <user>
##$USERA4= <user>
##$USERA5= <user>
##$V9= 5
##$VALIST= <valist>
##$VCLIST= <CCCCCCCCCCCCCCC>
##$VD= 0
##$VDLIST= <DDDDDDDDDDDDDDD>
##$VPLIST= <PPPPPPPPPPPPPPP>
##$VTLIST= <TTTTTTTTTTTTTTT>
##$WBST= 1024
##$WBSW= 4
##$XGAIN= (0..3)
0 0 0 0 
##$XL= 0
##$YL= 0
##$YMAX_a= 193328
##$YMIN_a= -217000
##$ZGOPTNS= <>
##$ZL1= 120
##$ZL2= 120
##$ZL3= 120
##$ZL4= 120
##$ABSF1= 10
##$ABSF2= 0
##$ABSG= 5
##$ABSL= 3
##$ALPHA= 0
##$AQORDER= 0
##$ASSFAC= 0
##$ASSFACI= 0
##$ASSFACX= 0
##$ASSWID= 0
##$AUNMP= <proc_1d>
##$AZFE= 0.1
##$AZFW= 0.1
##$BCFW= 1
##$BC_mod= 2
##$BYTORDP= 1
##$COROFFS= 0
##$CY= 11.3945322036743
##$DATMOD= 1
##$DC= 2
##$DFILT= <>
##$DTYPP= 0
##$F1P= 2.36226072786647
##$F2P= -0.459571619588291
##$FCOR= 0.5
##$FTSIZE= 0
##$FT_mod= 4
##$GAMMA= 1
##$GB= 0.15
##$INTBC= 1
##$INTSCL= 1
##$ISEN= 128
##$LB= 0.24
##$LEV0= 0
##$LPBIN= 0
##$MAXI= 10000
##$MC2= 0
##$MEAN= 0
##$ME_mod= 0
##$MI= 1.114404
##$NCOEF= 0
##$NC_proc= 0
##$NLEV= 6
##$NOISF1= 3.799351
##$NOISF2= 2.8
##$NSP= 1
##$NTH_PI= 0
##$NZP= 0
##$OFFSET= 15.70392
##$PC= 1
##$PHC0= -19111.55
##$PHC1= 22.80072
##$PH_mod= 1
##$PKNL= yes
##$PPARMOD= 0
##$PSCAL= 0
##$PSIGN= 0
##$REVERSE= no
##$SF= 200.130013532006
##$SI= 16384
##$SIGF1= 3
##$SIGF2= 2
##$SINO= 400
##$SIOLD= 16384
##$SREGLST= <1H.CDCl3>
##$SSB= 0
##$STSI= 0
##$STSR= 0
##$SW_p= 3612.71676300578
##$SYMM= 0
##$S_DEV= 0
##$TDeff= 0
##$TDoff= 0
##$TI= <>
##$TILT= no
##$TM1= 0
##$TM2= 0
##$TOPLEV= 0
##$USERP1= <user>
##$USERP2= <user>
##$USERP3= <user>
##$USERP4= <user>
##$USERP5= <user>
##$WDW= 1
##$XDIM= 8192
##$YMAX_p= 0
##$YMIN_p= 0
$$ End of Bruker specific parameters
$$ ---------------------------------
##NTUPLES= NMR FID
##VAR_NAME=  TIME,          FID/REAL,        FID/IMAG
##SYMBOL=    X,             R,               I
##VAR_TYPE=  INDEPENDENT,   DEPENDENT,       DEPENDENT
##VAR_FORM=  AFFN,          ASDF,            ASDF
##VAR_DIM=   8192,          8192,            8192
##UNITS=     SECONDS,       ARBITRARY UNITS, ARBITRARY UNITS
##FACTOR=    0.0002768,     1,               1
##FIRST=     0,             0,               0
##LAST=      2.2672688,     0,               0
##MIN=       0,             -217000,         0
##MAX=       2.2672688,     193328,          0
$$ Real data points
##PAGE= N=1
##DATA TABLE= (X++(R..R)), XYDATA
$$ [...]
$$ plain form
1753 153 27 -69 -67 -31 49 -168 -129 16 -47 -178 -375 -43 -26 -232 -235 -321 -153 -34 -52 159 225 196 -45 235 230
1778 230 52 19 214 137 97 102 380 -15 1 -114 -119 137 18 9 -55 -143 73 -424 -213 -2 -347 -169 -14 -358
1802 -358 3 60 -103 142 -92 133 -52 15 -187 280 190 -92 251 391 -66 163 237 -134 67 -15 -323 -38
1824 -38 -170 -350 -200 -92 -157 -5 -134 -112 175 -230 -245 122 1 -142 20 -155 -182 219 -97 213 70 57
1846 57 142 -206 75 23 196 417 -241 59 -68 38 -70 -287 -302 -308 -278 -119 -109 -207 -297 -37 -213 -40 -157
1869 -157 -181 90 125 200 195 58 65 -13 54 -3 144 310 130 242 -149 -170 70 29 -151 -296 -354 -12 -123 -270
1893 -270 -88 -115 -198 -18 -276 -178 -33 -7 -251 -107 -103 107 24 -53 -236 91 67 50 224 -3 262 67 143 151
1917 151 105 -142 78 -53 -151 -182 -5 -299 -48 -243 -69 -66 -474 -148 -117 -41 -86 5 167 -26 57 40 238 226
$$ packed form
1753A53j26r6KL6Q0k17L9J45o3j31j97L32J7k06lq6J68J19j8K11O6k9k41K80n
1778B30j78l3J95p7m0NK78l95J6j15nK56j19ro4q8K16m97K11K11l45J78J55l44
1802c58L61N7j63K45k34K25j85O7k02M67r0k82L43J40m57K29P4l71K01q2l08K85
1824c8j32j80J50J08o5J52j29K2K87m05j5L67j21j43J62j75k7M01l16L10j43j3
1846E7Q5l48K81n2J73K21o58L00j27J06j08k17j5oL0J59J0r8r0K60j76J73j17
1869a57k4K71L5P5nj37Pp8O7n7J47J66j80J12l91k1K40m1j80j45n8L42j11j47
1893b70J82k7q3J80k58R8J45K6k44J44MK10q3p7j83L27k4j7J74k27K65j95P6Q
1917A51m6k47K20j31r8l1J77k94K51j95J74Lm08L26L1P6m5R1J62j93Q3j7J98j2
$$ plain form
1941 226 74 266 182 191 -72 -39 2 81 171 -42 -56 -154 -147 -46 -208 -337 -173 -265 -330 -132 -390 -217 -66 -22 -123
1966 -123 -66 -30 182 216 -29 -10 284 493 255 308 338 317 134 22 13 75 -65 89 79 -35 -174 63 -198 -63
1990 -63 47 -39 -210 34 2 -207 -142 -53 69 162 134 -67 78 260 85 82 140 114 -60 122 450 -203 367 137
2014 137 252 108 -306 -56 -294 154 -410 -188 -33 -126 -43 21 -99 -114 46 -167 -53 -177 -33 186 168 -49
2036 -49 -83 275 143 379 241 136 194 106 286 -13 55 269 51 24 139 -81 0 67 31 -122 33 -238 -11
2059 -11 -180 -76 -17 6 -28 4 113 -72 -36 253 252 428 110 396 218 176 164 232 72 -46 362 -124 1 -105
2083 -105 -134 -50 51 -61 -47 -208 -351 -86 -259 -21 21 191 -53 82 -85 298 369 360 174 117 357 182 -5
2106 -5 1 -155 -117 -45 -30 -71 71 60 263 -189 -110 -54 56 -114 -46 -76 -104 -298 -310 31 -243 142 31 67 73 -97
$$ packed form
1941B26j52J92q4Rk63L3M1P9R0k13j4r8PJ01j62j29J64r2o5J98k58J73J51M4j01
1966a23N7L6K12L4k45J9K94K09k38N3L0k1j83j12rO2j40J54j0j14j39K37k61J35
1990f3J10q6j71K44l2k09O5Q9J22R3k8k01J45J82j75lN8k6j74J82L28o53N70k30
2014A37J15j44m14K50k38M48n64K22J55r3Q3O4j20j5J60k13J14j24J44K19j8k17
2036d9l4L58j32K36j38j05N8q8J80k99O8K14k18k7J15k20Q1O7l6j53J55k71K27
2059a1j69J04N9K3l4L2J09j85L6K89jJ76l18K86j78m2j2O8j60j18M08m86J25j06
2083a05k9Q4J01j12J4j61j43K65j73K38M2J70k44J35j67L83P1rj86n7K40j75j87
2106eOj56L8P2J5m1J42j1K03m52P9N6J10j70O8l0k8j94j2L41k74L85j11L6Oj70
$$ plain form
2132 -97 50 111 578 103 12 92 194 392 33 434 268 121 -86 91 -71 -102 -185 64 -212 -99 79 -70
2154 -70 -209 -194 -76 195 -259 214 -73 192 -14 183 194 310 -46 -122 -24 66 -17 98 250 106 149 -41 117
2177 117 -103 -91 0 130 -253 -115 -60 -213 -88 -207 -294 -241 -209 -81 -61 241 -108 31 311 386 253 171 43
2200 43 0 7 191 107 -63 286 64 193 -25 -63 -191 204 100 56 62 -49 -40 -40 -96 -314 -30 93 62 -379 -47
2225 -47 72 126 34 89 223 140 153 197 113 16 131 176 103 45 19 137 -221 155 27 -7 -149 -108 52 -308 -216
2250 -216 -377 -218 -92 -190 -167 12 72 52 -67 -73 79 10 172 112 -78 296 160 297 99 122 69 -150 171
2273 171 145 -37 -94 -100 -80 -143 -106 -101 49 -216 -236 55 -187 -64 1 100 -229 122 -167 -19 -100 183 199 -86 74
2298 74 -4 88 140 -212 -251 -5 -90 -72 0 44 -3 -29 -18 -238 -314 -217 17 43 -118 -201 152 -362 -92 -109 9 172
$$ packed form
2132i7J47O1M67m75r1Q0J02J98l59M01j66j47k07J77j62l1q3K49k76J13J78j49
2154g0j39J5J18K71m54M73k87K65k06J97J1J16l56p6R8R0q3J15J52j44M3j90J58
2177A17k20J2R1J30l83J38N5j53J25j19q7N3L2J28K0L02l49J39K80P5j33q2j28
2200D3m3PJ84q4j70L49k22J29k18l8j28L95j04m4Oj11R%n6k18K84J23l1m41L32
2225d7J19N4r2N5J34q3J3M4q4r7J15M5p3n8k6J18l58L76j28l4j42M1J60l60R2
2250b16j61J59J26r8K3J79O0k0j19oJ52o9J62o0j90L74j36J37j98K3n3k19L21
2273A71k6j82n7oK0o3L7NJ50k65k0K91k42J23O5R9l29L51k89J48q1K83J6k85J60
2298G4p8R2N2l52l9K46q5J8P2M4m7k6J1k20p6R7K34K6j61q3L53n14K70j7J18J63
$$ plain form
2324 172 -51 175 168 -37 -44 153 125 122 165 -80 103 137 -73 102 -50 -159 -10 -263 -142 50 -154 26 23 -108
2348 -108 -169 -62 11 -269 -149 -7 214 117 189 -22 242 296 90 115 51 198 274 155 -175 129 -6 133 76
2371 76 -170 86 -81 -176 -29 -177 -92 -119 -128 -8 -87 89 65 -175 -272 -45 188 37 -16 -11 101 369 29 163
2395 163 24 206 -89 215 -11 -94 -216 45 -2 -121 -56 -97 -211 53 -344 -43 1 71 -187 -12 -28 -68 -49
2418 -49 -28 217 -104 123 -32 260 15 -158 73 -11 -121 -98 -147 168 84 85 -66 -46 25 -168 -199 -144 -348 -183
2442 -183 115 -73 -170 45 -118 -3 129 -253 105 43 42 -96 14 -47 126 53 235 -67 16 -182 51 173
2464 173 139 -148 65 -91 -59 173 69 172 -33 -164 20 153 -159 -148 12 -258 161 -250 26 -117 204
2485 204 29 -178 302 -51 73 77 65 202 102 -2 89 129 -49 153 103 -120 -160 -190 15 -301 -51 -347 -149
$$ packed form
2324A72k23K26pk05pJ97k8lM3k45J83L4k10J75j52j09J49k53J21J92k04J80lj31
2348a08o1J07P3k80J20J42K21r7P2k11K64N4k06K5o4J47P6j19l30L04j35J39n7
2371G6k46K56j67r5J47j48Q5k7rJ20p9J76k4k40r7K27K33j51n3NJ12K68l40J34
2395A63j39J82k95L04k26q3j22K61m7j19O5m1j14K64l97L01M4P0k58J75j6m0J9
2418d9K1K45l21K27j55K92k45j73K31q4j10K3m9L15q4Jj51K0P1j93l1N5k04J65
2442a83K98j88r7K15j63J15J32l82L58o2jj38J10o1J73p3J82l02Q3j98K33J22
2464A73l4k87K13j56L2K32j04J03k05j31J84J33l12J1J60k70M19m11K76j43L21
2485B04j75k07M80l53J24Mj2J37j00j04R1M0j78K02n0k23m0l0K05l16K50k96J98
$$ plain form
2508 -149 -284 -21 -176 201 -95 -12 170 -131 -85 54 40 -73 -34 35 -163 344 83 112 117 41 -118 -25 -4 150
2532 150 -11 155 84 38 -118 84 -134 -214 19 -129 6 -21 -29 59 11 298 9 -161 99 -17 -55 213 -33
2555 -33 191 198 17 369 -133 33 121 21 -163 -113 -84 115 -209 42 -401 -273 -125 -165 -111 -62 -98 76 105 -383
2579 -383 -211 62 -185 -326 19 -6 -24 -181 138 -275 -273 -20 -2 -15 -28 7 129 169 -72 -126 51 -349 103
2602 103 -134 -62 -319 -242 56 -248 -149 -519 -195 74 33 -217 94 -119 190 -33 -175 -11 37 60 -96 -40
2624 -40 -138 387 273 72 -116 -199 -142 -94 -182 -180 -103 -185 -3 -313 -241 -291 61 -115 -116 -7 -145 -87 117 169 168 173 -15
2651 -15 282 -107 150 -103 42 -64 46 215 -71 56 -94 -11 -308 -1 -125 -83 -56 -165 -26 -102 -185 22
2673 22 -9 -76 -132 90 -199 -64 125 -139 145 76 55 -57 -42 29 28 112 38 -21 47 -282 -41 -82 151 -142 -415
$$ packed form
2508a49j35K63j55L77k96Q3J82l01M6J39j4j13L9O9j98N07k61K9Np6j59R3K1J54
2532A50j61J66p1m6j56K02k18q0K33j48J35k7qQ8m8K87k89j70K60j16l8K68k46
2555c3K24Pj81L52n02J66Q8j00j84N0K9J99l24K51m43J28J48m0N4M9l6J74K9m88
2579c83J72K73k47j41L45k5j8j57L19m13KK53J8j3j3L5J22M0k41n4J77m00M52
2602A03k37P2k57P7K98l04R9l70L24K69m1k50L11k13L09k23j42J64M8K3j56N6
2624d0r8N25j14k01j88q3N7M8q8KP7q2J82l10P2n0L52j76jJ09j38N8K04N2jNj88
2651a5K97l89K57k53J45j06J10J69k86J27j50Q3k97L07j24M2K7j09J39p6q3K07
2673B2l1o7n6K22k89J35J89k64K84o9k1j12J5P1jQ4p4n9O8l29K41m1K33k93k73
$$ plain form
2698 -415 -95 -70 -77 -40 -84 17 -44 -204 200 -73 154 -153 -110 -150 -234 -146 122 -129 -137 116 179 295 -228 -53
2722 -53 -239 -62 -63 216 -28 250 -36 -50 -205 -129 -307 106 -76 -114 80 171 126 -320 8 12 245 55 53 -91
2746 -91 244 216 163 53 -11 21 144 176 10 -10 101 -46 29 89 -231 -178 -5 -26 71 -240 -6 11 -88 -51 46
2771 46 253 135 211 -95 -19 -31 201 -100 -12 -184 52 -78 39 65 75 17 87 103 163 -86 -174 51 -143 -43
2795 -43 23 5 -33 -26 22 -145 50 32 -178 -21 109 -8 -186 -76 -97 -211 -35 -114 -84 293 -80 14 47 292
2819 292 132 -121 162 -64 -43 -13 97 28 56 -226 -96 1 -39 -303 -102 -174 -12 138 -145 -121 199 122 -384
2842 -384 -101 30 -43 178 161 -131 67 5 106 115 30 111 106 -221 21 -69 50 -213 133 278 -329 -166 -137 106
2866 106 6 -113 150 288 -137 -214 -19 1 245 -63 10 -111 73 83 -128 -196 52 164 128 -123 143 128
$$ packed form
2698d15L20K5pL7m4J01o1j60M04k73K27l07M3m0q4Q8K68k51qK53O3J16n23J75
2722e3j86J77jK79k44K78k86j4j55P6j78M13j82l8J94R1m5m46L28MK33j90kj44
2746i1L35k8n3j10o4L2J23L2j66k0J11j47P5O0l20N3J73k1R7l11K34J7r9L7R7
2771D6K07j18P6l06P6j2K32l01Q8j72K36j30J17K6J0n8P0J6O0k49q8K25j94J00
2795d3O6j8l8PM8j67J95j8k10J57J30j17j78J10k1j14J76p9L0L77l73R4L3K45
2819B92j60k53K83k26K1L0J10o9K8k82J30R7m0k64K01p2J62J50k83K4L20p7n06
2842c84K83J31p3K21j7k92J98o2J01Rq5Q1nl27K42r0J19k63L46J45o07J63K9K43
2866A06j00j19K63J38m25p7J95K0K44l08P3j21J84J0k11o8K48J12l6k51K66j5
$$ plain form
2888 128 -243 18 -79 -100 202 -116 -131 5 -45 77 -136 -118 64 -163 94 -57 -23 12 41 5 141 98 296
2911 296 221 284 -13 112 100 241 256 -128 205 -107 64 22 -47 -101 -126 -8 -14 -247 146 61 -168 24 -64 22
2935 22 0 -42 110 -101 29 63 117 -45 124 -55 211 -151 -19 -33 129 -125 253 164 -53 -231 -223 247 -55
2958 -55 -67 99 -4 172 -41 -169 7 -29 249 19 -87 89 -89 73 -182 -153 -51 155 14 -15 90 152
2980 152 -69 -73 -62 -347 57 181 -129 -29 -72 -222 94 -211 23 -178 -92 5 96 -17 156 242 42 32 32 154
3004 154 300 -73 -118 19 -141 7 35 -14 38 -159 -65 22 42 -254 -88 -30 -46 121 -90 -223 53 98 -61
3027 -61 34 -53 -161 -84 -25 145 192 166 -7 80 -66 -99 -6 -88 -6 73 548 64 189 -151 16 -16 -61 73 -86
3052 -86 -234 100 -5 42 -82 -75 -227 -75 166 67 13 -137 -105 -208 -164 278 107 -90 47 70 -40 87 96 53
$$ packed form
2888A28l71K61r7k1L02l18j5J36n0J22k13J8J82k27K57j51L4L5K9l6J36m3J98
2911B96p5O3k97J25j2J41J5l84L33l12J71m2o9n4k5J18ok33L93q5k29J92q8Q6
2935B2k2m2J52k11J30L4N4j62J69j79K66l62J32j4J62k54L78q9k17j78QM70l02
2958e5j2J66j03J76k13j28J76l6K78k30j06J76j78J62k55K9J02K06j41k9J05O2
2980A52k21mJ1k85M04J24l10J00m3j50L16l05K34k01Q6R7R1j13J73Q6k00j0%J22
3004A54J46l73m5J37j60J48K8m9N2j97R4Q7K0k96J66N8j6J67k11j33K76M5j59
3027f1R5q7j08P7N9J70M7k6j73Q7j46l3R3q2Q2P9M75m84J25l40J67l2m5J34j59
3052h6j48L34j05M7j24Pj52J52K41r9n4j50L2j03M4M42j71j97J37K3j10J27Rm3
$$ plain form
3076 53 101 -117 -55 -4 50 211 68 116 -116 232 -256 -135 -115 -376 -52 26 -95 -127 247 -19 3 -57 -26 120
3100 120 107 -134 123 22 78 209 -76 -4 10 -256 161 164 105 -84 -51 145 -186 -84 -94 -183 37 7 148 -273
3124 -273 53 69 -208 104 -174 -49 -102 152 182 9 47 223 -8 -33 273 107 134 84 -17 60 -59 -39 -148
3147 -148 -13 -156 256 53 -100 -200 -55 96 10 -216 -163 66 -157 -157 179 110 -135 -52 63 123 211 -88 87
3170 87 -72 19 58 -19 101 235 158 -147 -133 -105 -251 -118 231 1 82 -66 29 123 -146 -21 -140 -229 4 70
3194 70 226 65 8 -116 8 6 118 179 -10 84 36 -131 -36 79 -29 -117 -147 91 68 -36 -38 -95 243 -107 4
3219 4 -179 -75 161 -98 -35 -35 -120 199 333 277 -16 -171 130 -165 177 52 -43 246 154 -4 -99 -98 -128 -76 99
3244 99 -15 -189 80 -75 89 -286 71 -230 98 204 -47 -197 -252 26 105 109 -49 116 323 54 -158 21
$$ packed form
3076E3M8k18O2N1N4J61j43M8k32L48m88J21K0k61L24P8j21l2L74k66K2o0L1J46
3100A20j3k41K57j01N6J31k85P2J4k66M17Ln9j89L3J96l31J02j0q9K20l0J41m21
3124b73L26J6k77L12k78J25n3K54L0j73L8J76k31k5L06j66K7n0j01P7j19K0j09
3147a48J35j43M12k03j53j00J45J51q6k26N3K29k23%L36o9k45Q3J15O0Q8k99J75
3170H7j59R1L9p7J20J34p7l05J4K8j46J33L49k30Q1j48R5R4k69J25j19q9K33O6
3194G0J56j61n7j24J24kJ12O1j89R4m8j67R5J15j08q8l0K38k3j04kn7L38l50J11
3219Dj83J04K36k59O3%q5L19J34n6k93j55L01k95L42j25r5K89r2j58r5Jl0N2J75
3244I9j14j74K69j55J64l75L57l01L28J06k51j50n5K78P9Mj58J65K07k69k12J79
$$ plain form
3266 21 50 50 -137 -129 236 223 4 -52 -41 -22 -101 -65 -40 -128 82 -186 -16 103 -402 64 -21 -236 -82 -42 -101 -89
3292 -89 -128 315 -37 23 207 -4 50 -230 38 20 49 -13 -229 -119 -285 190 -33 -107 152 -188 -196 -3 -5 -149
3316 -149 -202 78 -81 -61 10 87 217 279 194 241 -73 202 27 211 34 49 241 174 -24 -145 -107 165 228 -50
3340 -50 -176 -3 -33 160 -219 -347 79 10 -27 176 179 -132 -20 -122 58 193 -268 153 2 -43 43 -15 264
3363 264 -106 36 -11 -62 -271 -176 -1 -146 79 94 -158 -66 -32 -3 -215 -115 -111 264 -32 -222 257 162 81 -59
3387 -59 97 -109 131 -155 -7 -122 -35 165 98 -3 115 93 61 -50 192 -196 -17 -119 4 212 123 67
3409 67 -108 -246 -66 -40 179 73 -199 -20 -1 50 -23 -103 319 149 -210 187 355 -28 195 54 307 -80
3431 -80 -30 68 57 -74 231 -76 31 5 83 6 -138 60 109 135 -169 -163 44 -31 194 45 89 37 -49 -99 -20 -92
$$ packed form
3266B1K9%j87QL65j3k19n6J1J9p9L6K5q8K10k68J70J19n05M66q5k15J54M0n9J2
3292h9l9M43l52O0J84k11N4k80K68j8K9o2k16J10j66M75k23p4K59l40qJ93kj44
3316a49n3K80j59K0P1P7J30O2q5M7l14K75j75J84j77J5J92o7j98j21L8K72O3k78
3340e0j26J73l0J93l79j28M26o9l7K03Ll11J12j02J80J35m61M21j51m5Q6n8K79
3363B64l70J42m7n1k09R5J75j45K25J5k52R2L4K9k12J00ML75k96j90M79r5q1j40
3387e9J56k06K40k86J48j15Q7K00o7j01J18k2l2j11K42l88J79j02J23K08q9n6
3409F7j75j38J80K6K19j06k72J79J9N1p3q0M22j70l59L97J68l83K23j41K53l87
3431h0N0R8j1j31L05l07J07k6P8p7j44J98M9K6l04OK07p5K25j49M4n2q6n0P9p2
$$ plain form
3457 -92 94 210 -103 15 -174 -171 -140 -36 13 -33 271 -168 67 -183 -86 -158 -166 60 126 -195 -4 81 -204 231
3481 231 134 -76 -97 -36 25 -2 -220 225 45 8 -123 104 -115 119 32 -32 -203 127 191 26 -16 30 134 7
3505 7 25 -147 68 76 107 -248 75 153 121 -24 119 -99 -63 57 140 -245 8 -72 -349 174 120 386 354 7
3529 7 -76 64 85 113 159 114 -167 6 -50 -344 -95 -238 -3 40 -63 96 76 89 9 -146 31 63 -162 62
3553 62 -186 56 54 268 183 60 230 -109 -41 29 23 33 -192 -303 -95 187 126 -54 -35 7 36 99 -386 -61 -41
3578 -41 -51 -22 -189 -141 197 38 -242 -32 -44 65 98 -146 55 133 80 -15 166 -46 99 -244 -32 102 69
3601 69 -203 45 -160 55 313 -132 -139 -192 8 138 42 -310 -6 -63 -33 -332 129 35 -10 141 6 175 -77
3624 -77 -39 -47 99 -31 65 -6 62 -23 155 -247 -303 -4 -217 194 -162 -24 -15 149 -252 -19 16 -215 117 -71
$$ packed form
3457i2J86J16l13J18j89LL1J04M9m6L04m39K35k50R7p2qK26O6l21J91Q5k85M35
3481B31r7k10k1O1O1k7k18M45j80l7j31K27k19K34q7o4j71L30O4j65m2M6J04j27
3505GJ8j72K15QL1l55L23P8l2j45J43k18L6J20Q3l85K53q0k77N23n4K66l2l47
3529Gq3J40K1K8M6m5k81J73n6k94K49j43K35M3j03J59k0J3q0j55J77L2k25K24
3553F2k48K42kK14q5j23J70l39O8P0oJ0k25j11K08K82o1j80J9M2K9O3m85L25K0
3578d1j0K9j67M8L38j59k80K10j2J09L3k44K01P8n3r5J81k12J45l43K12J34l3
3601F9k72K48k05K15K58m45pn3K00J30r6l52L04n7L0k99M61r4m5J51j35J69k52
3624g7L8qJ46j30R6p1O8q5J78m02n6K99k13M11l56J38RJ64m01K33L5k31L32j88
$$ plain form
3648 -71 98 216 -5 -31 -121 -30 -52 125 1 81 319 176 -26 184 236 55 -245 330 -1 -264 1 56 -23
3671 -23 -150 81 91 111 -214 72 -35 -193 -119 -70 92 -69 67 86 24 94 109 68 -93 5 -56 -163 28 190
3695 190 153 -83 -2 -105 97 0 135 -98 -165 -69 148 -213 -57 91 94 -88 -214 102 -202 355 46 -38 -65
3718 -65 -56 9 -138 316 161 156 185 196 43 58 310 -7 -423 18 -100 27 50 102 -59 -162 -102 -20 19 160 -39
3743 -39 227 119 -240 48 -147 -43 -97 -57 -139 324 -69 23 5 28 -135 100 68 29 -19 -40 69 227 116 50
3767 50 -69 -73 -132 19 -1 -115 34 13 -73 -145 118 -99 60 89 87 -55 -213 -110 35 28 61 120 49 -120 109
3792 109 70 -90 -94 91 -175 23 203 159 -89 -76 41 -22 5 -17 -343 -188 -58 -245 -196 161 -80 118 -47
3815 -47 13 -340 -89 -166 133 124 14 -72 -208 59 47 -19 -190 29 -28 -28 -204 242 -54 -92 23 -83 -101 13
$$ packed form
3648g1J69J18k21k6r0R1k2J77j24Q0K38j43k02K10N2j81l00N75l31k63K65N5p9
3671b3j27K31J0K0l25K86j07j58P4M9J62j61J36J9o2P0J5m1j61R8o1j07J91J62
3695A90l7k36Q1j03K02r7J35k33o7R6K17l61J56J48Lj82j26L16l04N57l09q4k7
3718f5RO5j47M54j55nK9J1j53J5K52l17m16M41j18J27K3N2j61j03O0Q2L9J41j99
3743c9K66j08l59K88j95J04n4M0q2M63l93R2j8K3j63K35l2l9m8k1J09J58j11o6
3767E0j19mn9J51k0j14J49k1q6p2K63k17J59K9kj42j58J03J45pL3N9p1j69K29
3792A09l9j60mJ85k66J98J80m4k48J3J17o3K7k2l26J55J30j87M9L57k41J98j65
3815d7O0l53K51p7K99rj10q6j36K67j2o6j71K19n7%j76M46k96l8J15j06j8J14
$$ plain form
3839 13 137 -119 73 331 -177 51 43 31 -201 -167 177 -135 218 2 119 -167 17 -19 -32 43 -231 -170 93
3862 93 23 -78 79 -130 -231 146 -18 -13 -115 112 11 -196 209 -47 -21 125 113 -140 55 -251 94 -42
3884 -42 -49 114 181 -266 45 25 159 -73 130 -301 136 -47 -144 113 -87 7 -145 184 127 -192 -323 274 -186
3907 -186 -67 59 124 157 56 -119 -20 -29 -145 192 183 -23 168 172 -65 -118 214 251 41 29 18 25 240 -182 68
3932 68 -59 -15 105 -24 89 -8 -164 55 120 83 87 108 88 154 38 81 149 -103 -147 -63 -21 -29 -42 48 -31 -74 -49
3959 -49 -86 55 -45 -1 -355 -6 -119 58 5 63 152 -49 -39 -193 39 -97 261 383 26 27 -52 -136 -152 227
3983 227 85 -106 135 92 -5 38 -83 -32 -314 -15 -52 -100 32 331 -143 -93 225 68 35 -2 376 -18 299
4006 299 73 -176 -117 -136 195 107 -130 13 157 -6 15 -56 -118 67 -129 -154 25 166 -79 -13 43 -335 -40
$$ packed form
3839A3J24k56J92K58n08K28qj2k32L4L44l12L53k16J17k86J84l6j3P5k74O1K63
3862I3p0j01J57k09j01L77j64Nj02K27j01k07M05k56K6J46j2k53J95l06L45j36
3884d2pJ63O7m47L11k0J34k32K03m31M37j83r7K57k00R4j52L29n7l19j31N97m60
3907a86J19J26O5L3j01j75R9rj16L37rk06J91Mk37n3L32L7k10j2j1PK15m22K50
3932F8j27M4J20j29J13r7j56K19O5l7MK1k0O6j16M3O8k52m4Q4M2qj3R0p9m3K5
3959d9l7J41j00M4l54L49j13J77n3N8Q9k01J0j54K32j36L58J22l57Jp9q4j6L79
3983B27j42j91K41m3r7M3j21N1k82K99l7m8J32K99m74N0L18j57l3l7L78l94L17
4006B99k26k49N9j9L31q8k37J43J44j63K1p1o2J85j96k5J79J41k45O6N6l78K95
$$ plain form
4029 -40 -3 -42 -52 197 -159 -134 64 -51 -37 -185 224 167 79 132 -52 270 145 13 -25 -16 -32 -231 -150 20 -153
4054 -153 21 -157 -7 59 -175 236 -33 -59 205 132 23 -35 75 80 -76 304 179 -50 119 165 -28 -8 -7
4077 -7 258 -1 -48 -136 78 -1 -314 -28 65 -202 -1 -145 97 -234 -320 -93 -80 -21 118 -121 -104 -14 120 -104
4101 -104 66 71 -10 198 -31 28 -9 63 22 99 -166 62 -103 -138 171 221 82 -134 80 -146 -161 4 -104 134
4125 134 -22 -64 -17 -277 71 -76 208 -131 97 164 15 10 -91 140 -4 123 -141 16 312 -67 -263 -247
4147 -247 -29 113 -6 95 73 -89 -17 -131 281 -48 -140 60 2 -87 -86 -100 124 4 86 260 -123 6 -155
4170 -155 -219 -156 205 71 146 11 44 -32 290 -62 104 -105 -65 228 -55 -27 -147 221 -76 -230 54 -12 -51
4193 -51 13 137 -38 -100 86 156 4 -130 84 -126 201 88 38 -538 81 81 119 -13 -116 86 173 -174 0
$$ packed form
4029d0L7l9j0K49l56K5J98j15J4j48M09n7q8N3j84L22j25j32l8Rj6j99Q1J70j73
4054a53J74j78J50O6k34M11k69k6K64p3j09n8J10Nj56L80j25k29J69M6j93K0J
4077gK65k59m7q8K14p9l13K86R3k67K01j44K42l31q6K27J3N9J39k39J7R0J34k24
4101a04J70Nq1K08k29N9l7P2m1P7k65K28j65l5L09N0j39k16K14k26j5J65j08K38
4125A34j56m2M7k60L48j47K84l39K28O7j49nj01K31j44J27k64J57K96l79j96J6
4147b47K18J42j19J01k2j62P2j14M12l29r2K00n8q9Jj4K24j20Q2J74l83J29j61
4170a55o4O3L61j34P5j35L3p6L22l52J66k09M0K93k83K8j20L68k97j54K84o6l9
4193e1O4J24j75o2J86P0j52j34K14k10L27j13n0n76O19%L8j32j03K02Q7l47J74
$$ plain form
4216 0 137 -48 -4 -179 -119 116 15 -5 98 52 -50 -90 -146 0 24 -172 77 69 55 -248 -193 -106 120 22 102
4241 102 117 21 -56 -112 93 -261 90 13 -147 91 -125 -81 -141 -228 -139 -22 -52 210 176 149 18 -54 10 -3 -246
4266 -246 -192 144 -182 -45 35 -124 -27 -26 195 161 165 11 -17 -11 -36 -197 -170 27 -5 -192 -11 30 -131 -43 22 -111
4292 -111 82 204 -94 -74 34 -65 -173 -115 -129 16 -234 228 -103 28 -46 -66 317 -204 121 381 146 34
4314 34 208 -118 -203 17 59 -79 127 124 -154 -98 209 -29 9 118 -75 25 -20 284 33 -125 -181 127 57
4337 57 223 -122 114 174 -198 -8 115 32 20 -74 137 -99 -1 -211 -128 149 90 22 45 159 116 -77 62 -24
4361 -24 11 -397 134 0 -22 -113 7 -69 67 197 -143 -96 -90 116 79 -60 -53 91 -208 -49 -15 -102 -64 125 57
4386 57 62 -61 -159 52 -119 19 26 -50 -284 -143 -302 17 -7 220 -87 143 68 -14 108 -16 3 349 -30 -296
$$ packed form
4216@J37j85M4j75O0K35j01k0J03m6j02m0n6J46K4j96K49qj4l03N5Q7K26r8Q0
4241A02J5r6p7n6K05l54L51p7j60K38k16M4o0q7Q9J17l0K62l4k7j31p2O4j3k43
4266b46N4L36l26J37Q0j59R7JK21l4Mj54k8Ok5j61K7J97l2j87J81M1j61Q8O5j33
4292a11J93J22k98K0J08r9j08N8j4J45k50M62l31J31p4k0L83n21L25K60k35j12
4314C4J74l26q5K20M2j38K06lk78N6L07k38L8J09j93J00m5L04k51j58n6L08p0
4337E7J66l45K36O0l72J90J23q3j2r4K11k36R8k10Q3K77n9o8K3J14m3j93J39q6
4361b4L5m08N31j34k2r1J20p6J36J30l40M7OK06l7j39PJ44k99J59L4q7L8J89o8
4386E7Nj23r8K11j71J38Pp6k34J41j59L19k4K27l07K30p5q2J22j24J9L46l79k66
$$ plain form
4410 -296 -93 -132 -233 -283 99 -196 -99 -171 45 -6 224 128 -51 -134 164 162 -118 158 54 28 166 130 -150 -148
4434 -148 -21 29 -50 -39 177 -61 263 -164 -104 -126 -52 -105 -90 45 -130 5 -178 109 189 -5 -47 -77 71 250
4458 250 146 8 75 -41 -118 43 -151 -10 29 94 -135 119 131 4 5 -152 -203 -58 132 -21 -11 182 -138
4481 -138 -136 -8 19 232 -109 182 153 -26 24 -55 -123 -120 -211 -128 88 -92 149 161 -165 -52 115 -76 156 -34
4505 -34 -94 39 88 117 137 48 -165 73 -121 99 110 -75 164 -70 25 33 190 58 -120 384 90 209 216 -113
4529 -113 113 -92 20 -33 -79 -7 328 150 24 285 6 80 -136 148 138 -42 26 -247 -252 82 139 -4 -54
4552 -54 107 -249 -156 69 37 25 -39 282 -131 -12 103 136 -11 -112 288 231 -373 -216 -106 -90 -27 55 66 -89
4576 -89 -98 -50 -12 46 -29 -45 8 59 35 -110 180 -111 -38 102 84 -118 150 -50 -47 66 -11 184 -47 47 -40 9
$$ packed form
4410b96K03l9j01n0L82k95R7p2K16n1K30r6j79q3K98kk80K76j04k6J38l6k80K
4434a48J27N0p9J1K16k38L24m27O0k2P4n3J5J35j75J35j83K87Q0j94m2l0J48J79
4458B50j04j38O7j16p7J61j94J41L9O5k29K54J2j27Jj57n1J45J90j53J0J93l20
4481a38KJ28K7K13l41K91k9j79N0p9o8Lr1Q3K16j80K41J2l26J13J67j91K32j90
4505c4o0J33M9K9K0q9k13K38j94K20J1j85K39k34R5QJ57j32j78N04k94J19Pl29
4529a13K26k05J12n3m6P2L35j78j26K61k79P4k16K84j0j80O8k73nL34N7j43n0
4552e4J61l56R3K25l2j2o4L21m13J19J15L3j47j01M00n7o04J57J10J6O3Q2J1j55
4576h9rM8L8N8p5j6N3N1k4j45K90k91P3J40j8k02K68k00LJ13p7J95k31R4q7M9
$$ plain form
4602 9 -74 18 -57 19 -118 -82 -303 13 -51 -40 30 -206 -87 134 167 -127 99 -79 23 272 48 -118 151 190
4626 190 86 -196 144 -212 266 -72 -8 -116 -77 -79 -256 37 45 68 53 148 214 -203 -100 -41 -230 -66 -143 27
4650 27 35 131 -11 259 -28 237 -175 -104 108 -50 -155 -113 -117 85 4 32 96 164 -200 32 31 104 -5 292 -40
4675 -40 -114 -12 -88 -164 28 77 222 -109 -138 -263 -12 21 -141 -30 252 117 170 -48 135 -64 -216 -200 23
4698 23 -24 64 148 -6 81 -88 -8 35 42 -192 15 36 -32 9 -165 70 -2 -61 68 185 -17 -4 -43 112 -85
4723 -85 115 -204 128 77 112 -17 126 63 -45 71 -153 -156 73 -101 -92 102 -14 43 18 -258 -140 -52 52 -151
4747 -151 -55 -27 -223 151 -74 77 137 -23 274 -216 134 -131 202 -45 -50 28 0 -151 -70 -33 -107 177 43
4770 43 78 -50 -154 -341 249 228 -217 2 156 12 -49 -148 32 8 -247 -14 -40 158 60 -188 51 156 -208
$$ packed form
4602Iq3R2p5P6j37L6k21L16o4J1P0k36J19K21L3k94K26j78J02K49k24j66K69L9
4626A90j04k82L40l56M78l38O4j08L9kj77K93QK3j5R5O6m17J03N9j89J64p7J70
4650B7QR6j42K70k87K65m12P1K12j58j05M2mK02q1K8O4O8l64K32jP3j09K97l32
4675d0p4J02p6p6J92M9J45l31k9j25K51L3j62J11K82j35N3k18J83j99j52J6K23
4698B3m7Q8Q4j54Q7j69Q0M3Pk34K07K1o8M1j74K35p2n9J29J17k02J3l9J55j97
4723h5K00l19L32n1L5j29J43o3j08J16k24lK29j74RJ94j16N7k5k76J18Q8J04k03
4747a51R6K8j96L74k25J51O0j60K97m90L50k65L33k47nP8k8j51Q1L7p4K84j34
4770D3L5j28j04j87N90k1m45K19J54j44o1r9J80k4k55K33k6J98r8k48K39J05l64
$$ plain form
4793 -208 8 -81 1 -455 -78 24 -40 -125 -68 218 9 76 -92 302 -9 -145 104 0 -15 -160 -69 123 -150
4816 -150 53 205 -183 -6 -95 30 -146 -202 -131 149 22 30 4 3 59 -241 -176 -125 61 -175 -80 195 95 142
4840 142 130 90 88 -154 235 -16 24 -105 177 65 39 16 80 144 48 28 -35 103 -108 243 149 -152 97 187 -19
4865 -19 -38 -175 202 84 85 -129 56 -39 251 -34 -420 -74 -97 136 80 155 166 -60 44 -51 3 187 -62 -172
4889 -172 -42 261 160 85 38 -38 -305 -112 134 -72 48 -82 -104 55 -264 -377 64 -217 -301 -190 -55 127
4911 127 -105 23 130 -169 -71 245 137 66 19 23 -16 -27 -179 18 47 -3 80 -156 -139 -3 -186 -79 15 -38
4935 -38 -169 -5 139 -137 -131 7 -175 -10 -201 -184 -18 17 -54 -10 108 -208 3 20 -70 -18 156 -74 -9 38
4959 38 1 63 -162 -8 -4 1 35 -12 -224 282 -26 120 129 137 -26 -33 110 78 -143 -36 89 -208 -24 -27 111 52
$$ packed form
4793b08K16q9Q2m56L77J02o4q5N7K86k09O7j68L94l11j36K49j04j5j45R1J92k73
4816a50K03J52l88J77q9J25j76n6P1K80j27Qk6jN6l00O5N1J86k36R5K75j00M7
4840A42j2m0kk42L89k51M0j29K82j12k6k3O4O4r6k0o3J38k11L51r4l01K49R0k06
4865a9j9j37L77j18Jk14J85r5K90k85l86L46k3K33n6P5J1k26J04r5N4J84k49j10
4889a72J30L03j01p5m7p6k67J93K46k06J20j30k2J59l19j13M41k81q4J11J35J82
4911A27k32J28J07k99R8L16j08p1m7Ml9j1j52J97K9n0Q3k36J7J36j83J07R4n3
4935c8j31J64J44k76OJ38j82J65j91J7J66L5p1M4J18l16K11J7r0N2J74k30O5M7
4959C8l7O2k25J54MNL4m7k12N06l08J46RQj63pJ43l2k21J07J25k97J84lJ38n9
$$ plain form
4985 52 151 55 -212 163 94 -139 -71 -148 -35 75 24 135 -47 -55 -34 -158 42 -24 -157 204 140 222 72 -139
5009 -139 56 -130 -17 -90 -83 -189 84 -90 1 12 -130 24 -73 113 -73 -205 41 -230 -82 74 -120 146
5031 146 -144 -261 19 22 35 -18 -200 -157 82 31 -93 83 82 29 63 -89 91 -72 -130 -68 -226 153 -9 -3 -99
5056 -99 -128 -34 37 -43 19 147 57 -1 34 288 -108 152 78 -93 -99 2 -142 159 -56 19 -69 79 -19 89 -202
5081 -202 207 -61 -144 -32 -168 -73 144 -69 -55 0 -73 39 29 -210 10 92 66 17 -86 -107 37 285 12
5104 12 -183 1 -20 9 178 -53 -18 -21 -218 38 -53 -121 -123 -63 237 -28 -13 39 220 68 -329 144 -50 -66 71
5129 71 -210 297 2 375 -302 67 -159 -125 -111 69 144 323 125 66 59 -150 -248 -69 25 -26 64 -127 -99 -13
5153 -13 158 177 55 90 -321 -195 84 -8 -406 -244 32 -97 24 57 263 -33 -69 -157 51 172 -167 81
$$ packed form
4985E2R9r6k67L75o9k33O8p7J13J10n1J11j82qK1j24K00o6j33L61o4Q2j50k11
5009a39J95j86J13p3Pj06K73j74R1J1j42J54r7J86j86j32K46k71J48J56j94K66
5031A46k90j17K80LJ3n3j82M3K39n1j24J76jn3L4j52J80j63n8O2j58L79j62Or6
5056i9k9R4P1q0O2J28r0n8L5K54l96K60p4j71oJ01j44L01k15P5q8J48r8J08k91
5081b02M09k68q3J12j36R5K17k13J4N5p3J12j0k39K20Q2k6m9j03k1J44K48k73
5104A2j95J84k1K9J69k31L5lj97K56r1o8kO0L00k65J5N2J81j52l97M73j94j6J37
5129G1k81N07k95L73o77L69k26L4J4J80P5J79j98n9pk09r8J79R4n1R0j91K8Q6
5153a3J71J9j22L5m11J26K79r2l98J62K76j29J21L3K06k96l6q8K08J21l39K48
$$ plain form
5175 81 60 42 174 -70 19 60 155 63 -91 -23 146 -147 -97 -151 -136 144 -17 -94 -289 0 -67 -17 -66 86 229
5200 229 -174 -232 -197 85 15 -78 71 123 -81 24 74 110 -220 -128 -99 233 -211 117 86 -28 -10 -210 109 -111
5224 -111 -46 27 287 -122 -120 -81 239 -152 -191 -108 -28 262 -42 12 112 -1 -46 199 150 -154 18 -43 -42 184 -50
5249 -50 -213 -46 0 -16 152 -126 -89 44 120 -197 303 187 78 53 -30 -160 -85 57 -61 10 -203 82 38
5272 38 -196 -62 -89 50 -28 18 179 2 -209 13 -29 17 -46 120 -240 -73 -227 35 -29 12 22 95 66 -124
5296 -124 70 64 203 84 138 38 203 122 -38 7 209 -60 107 -21 -74 -42 168 194 35 6 23 -328 -30
5319 -30 -203 -530 110 25 107 -67 -190 138 114 -82 -66 21 -43 16 127 -6 146 -96 110 -34 -227 71 -103
5342 -103 -194 54 207 -46 254 -94 134 -146 -230 -107 -55 8 -162 66 -231 -199 -135 208 142 107 -73 34 -41
$$ packed form
5175H1k1j8J32k44Q9M1R5r2j54O8J69k93N0n4J5K80j61p7j95K89o7N0m9J52J43
5200B29m03n8L5K82p0r3J49N2k04J05N0L6l30R2K9L32m44L28l1j14J8k00L19k20
5224a11O5P3K60m09KL9L20l91l9Q3Q0K90l04N4J00j13m5K45m9l04J72o1JK26k34
5249e0j63J67M6j6J68k78L7J33P6l17N00j16j09k5q3j30P5J42j18P1k13K85m4
5272C8k34J34k7J39p8M6J61j77k11K22m2M6o3J66l60J67j54K62o4M1J0P3k9j90
5296a24J94oJ39j19N4j00J65q1j60M5K02k69J67j28n3L2K10K6j59k9J7l51K98
5319c0j73l27O40q5Q2j74j23L28k4j96J6Q7o4N9J11j33J52k42K06j44j93K98j74
5342a03r1K48J53k53L00l48K28k80q4J23N2O3j70K28k97L2O4L43o6l5j80J07p5
$$ plain form
5365 -41 89 93 -5 -117 -155 -77 39 133 51 -185 -260 -170 -164 -297 -14 -256 -91 -63 151 -164 -128 210 17 -24 -45
5390 -45 -65 -3 87 -281 -116 88 98 186 86 -11 -15 -39 -80 -94 209 -172 66 -76 -141 8 275 -26 -227 40
5414 40 -139 -298 196 -105 -53 23 86 -75 -54 -132 -159 -267 117 92 -123 10 11 88 168 163 275 -74 107 81 128
5439 128 -100 186 -137 103 -199 44 183 105 -51 145 225 42 98 -63 -117 -143 -4 -99 282 -62 57 88
5461 88 -37 72 -141 -107 154 -87 176 124 7 6 -27 52 44 200 71 -246 -258 -34 71 -91 -91 -189 -98 -39 -113
5486 -113 148 174 -111 88 -83 -225 -88 -210 -48 7 -216 322 155 -150 -214 -52 166 323 259 -186 -63
5507 -63 242 -260 175 -54 -68 -223 148 -183 -360 238 -17 -213 133 -13 -316 21 -11 99 -22 35 6 24
5529 24 160 -49 154 -44 -44 198 -87 209 -75 -113 -116 197 107 -82 -30 66 -74 -114 2 -2 -207 -253 -133 -20
$$ packed form
5365d1J30Mr8j12l8P8J16R4q2k36p5R0Oj33K83k42J65K8K14l15L6L38j93m1k1
5390d5k0O2R0l68J65K04J0Q8j00r7mk4m1j4L03l81K38j42o5J49K67l01k01K67
5414D0j79j59M94l01N2P6O3j61K1p8k7j08L84k5k15J33JP7Q0nJ12l49J81k6M7
5439A28k28K86l23K40l02K43J39p8j56J96Q0j83N6j61n4k6J39r5L81l44J19L1
5461H8j25J09k13L4K61k41K63n2j17jl3P9qJ56j29l17j2K24J05j62%r8R1N9p4
5486a13K61K6k85J99j71j42J37j22J62N5k23N38j67l05o4J62K18J57o4m45J23
5507f3L05n02M35k29j4j55L71l31j77N98k55j96L46j46l03L37l2J10j21N7k9J8
5529B4J36k09K03j98%K42k85K96k84l8lL13r0j89N2R6j40m0J16mk05m6J20J13
$$ plain form
5553 -20 170 -3 137 -44 -67 181 84 187 -155 -26 42 -42 80 18 126 81 -105 185 -172 202 -123 -151 149
5576 149 -6 8 -6 -187 -4 20 99 57 72 -384 -114 65 -21 -78 74 -181 -98 -79 -24 68 124 107 -143 -34 146
5601 146 -333 -62 -6 -198 191 -174 167 -183 313 71 67 -107 -12 67 -143 -48 -105 -134 -97 302 -142 -179 115
5624 115 197 160 -204 11 92 -169 -101 -120 -105 135 38 -210 -143 98 6 7 -59 -180 -94 -30 96 -104 36 316 -1
5649 -1 -36 153 -99 129 43 163 -257 -72 158 110 54 181 17 50 93 -129 80 -39 -4 108 -94 154 -129
5672 -129 137 90 127 -243 45 -76 212 -92 123 22 -194 36 215 230 -35 31 211 30 -106 37 -206
5693 -206 -27 387 93 198 207 180 52 143 85 92 203 -89 85 -33 -176 53 165 -53 28 93 108 232 -187
5716 -187 90 -16 -101 -14 -146 9 285 95 136 143 -104 -67 -242 -152 71 -39 61 1 -20 94 58 85 94 -108
$$ packed form
5553b0J90j73J40j81k3K48r7J03l42J29O8q4J22o2J08m5j86K90l57L74l25k8L00
5576A49j55J4j4j81J83K4P9m2J5m56K70J79q6n7J52k55Q3J9N5R2N6j7k50J09J80
5601A46m79K71N6j92L89l65L41l50M96k42mj74R5P9k10R5n7k9L7L99m44l7K94
5624A15Q2l7l64K15Q1k61O8j9J5K40r7k48O7K41r2Jo6j21Q6O4J26k00J40K80l17
5649al5J89k52K28q6J20m20J85K30m8n6J27j64L3M3k22K09j19L5J12k02K48k83
5672a29K66m7L7l70K88j21K88l04K15j01k16K30J79J5k65O6J80j81j36J43k43
5693b06J79M14k94J05Rk7j28R1n8PJ11k92J74j18j43K29J12k18Q1O5J5J24m19
5716a87K77j06q5Q7j32J55K76j90M1Pk47L7j75R0K23j10J00o0k1J14l6K7Rk02
$$ plain form
5740 -108 -60 -20 23 -13 -7 0 23 221 163 -160 113 235 372 117 295 241 122 51 66 -204 48 32 -287 -61 -128
5765 -128 171 -55 -9 139 -169 75 134 128 -187 37 44 158 15 -181 -186 363 101 -19 -44 -172 329 57 -36
5788 -36 -230 -82 -145 -82 124 51 128 -129 216 -127 -111 123 -75 50 83 -22 -93 -43 6 -26 -197 -126 -10 -17 -53
5813 -53 -128 -126 -135 -211 -161 181 -97 -51 -309 -100 -76 25 -55 147 113 -28 54 -73 163 73 -35 154 -59 -111 -94
5838 -94 -59 68 -171 137 -163 -81 -80 -111 -93 -205 -207 121 278 146 -126 18 -38 111 57 35 -47 70 88 -166 103
5863 103 -164 -76 34 89 -15 -87 -5 -51 -61 -356 -28 128 -68 145 54 179 141 116 116 284 23 -238 50 -18
5887 -18 271 -5 -50 230 39 256 28 110 -120 52 -37 267 -108 -118 69 90 80 12 -56 64 -45 -40 68 -50
5911 -50 56 -115 94 206 43 31 -40 -27 21 32 90 -204 -64 -15 -119 -192 -132 72 245 -41 -103 -176 98 256
$$ packed form
5740a08M8M0M3l6OPK3J98n8l23K73J22J37k55J78n4j19p1J5k70K52j6l19K26o7
5765a28K99k26M6J48l08K44N9ol15K24PJ14j43j96nN49k62j20k5j28N01k72r3
5788c6j94J48o3O3K06p3P7k57L45l43J6K34j98J25L3j05p1N0M9l2j71P1J16pl6
5813e3p5Krp6N0L42k78M6k58K09K4J01q0K02l4j41Q2j27K36r0j08J89k13n2J7
5838i4L5J27k39L08l00Q2Jl1J8j12kL28J57j32k72J44n6J49n4k2q2J17J8k54K69
5863A03k67Q8J10N5j04p2Q2m6j0k95L28J56j96K13r1J25l8k5%J68k61k61K88o8
5887a8K89k76m5K80j91K17k28Q2k30J72q9L04l75j0J87K1j0o8o8J20j09NJ08j18
5911e0J06j71K09J12j63j2p1J3M8J1N8k94J40M9j04p3O0K04J73k86o2p3K74J58
$$ plain form
5935 256 -58 103 -78 117 171 -142 -317 -105 96 -32 -74 95 160 -20 -95 54 -70 64 -31 159 77 31
5957 31 74 -106 -188 40 83 21 -83 50 114 230 -67 -84 -2 -111 15 54 -20 -60 -21 61 17 144 -7 46 12
5982 12 -20 116 -23 33 -11 -228 -108 66 -28 -78 160 182 -85 66 -44 215 18 -209 -27 54 -99 5 173
6005 173 -133 32 9 -65 -102 208 47 -41 119 -154 -71 -330 166 -44 193 63 -138 53 -112 -163 -109 -121 -128
6028 -128 -333 85 -65 -175 225 -53 144 17 29 44 -123 -114 -225 4 74 33 149 134 108 -68 -130 -62 10 29
6052 29 -65 46 167 105 -28 216 -13 -43 -93 127 49 -28 -392 270 115 75 126 -146 16 -21 51 -121 14 118
6076 118 21 55 -109 63 -17 125 184 -98 15 -188 -48 112 91 -148 41 -69 18 146 16 253 19 147
6098 147 17 -137 71 124 48 24 281 -26 91 61 40 45 -80 180 -131 75 -50 -245 -60 -98 16 34 -80
$$ packed form
5935B56l14J61j81J95N4l13j75K12K01j28m2J69O5j80p5J49j24J34r5J90q2m6
5957C1M3j80q2K28M3o2j04J33O4J16k97j7Q2j09J26L9p4m0L9Q2m4J27j51N3l4
5982A2l2J36j39N6m4k17J20J74r4n0K38K2k67J51j10K59j97k27J82Q1j53J04J68
6005A73l06J65k3p4l7L10j61q8J60k73Q3k59M96k10K37j30k01J91j65n1N4j2p
6028a28k05M18j50j10M00k78J97j27J2J5j67Rj11K29P0m1J16j5k6j76o2O8P2J9
6052B9r4J11J21o2j33K44k29l0n0K20p8p7l64O62j55m0N1k72J62l7P2j72J35J04
6076A18r7L4j64J72q0J42N9k82J13k03J40J60k1k39J89j10Q7J28j30K37k34J28
6098A47j30j54K08N3p6k4K57l07J17l0k1Nj25K60l11K06j25j95J85l8J14J8j14
$$ plain form
6121 -80 -20 -9 88 87 -132 59 248 -32 58 -91 -212 291 77 -141 41 -164 56 -62 316 -260 -159 248
6143 248 -39 -32 -171 -189 -31 145 8 -5 -30 46 -162 -310 -55 157 25 -35 -155 -275 19 -131 185 -55
6165 -55 -297 13 -152 71 -208 -55 -49 49 35 -73 -34 -178 215 80 -265 -145 -44 137 75 174 -56 72 185
6188 185 30 -18 -32 230 71 -101 254 -102 -450 -109 -48 -202 -48 65 -78 -24 47 -87 -192 301 -61 -134
6210 -134 -5 -22 66 218 -65 14 185 -38 -121 87 43 -158 178 0 50 97 -79 7 66 27 30 62 124 -280 102
6235 102 -342 -26 134 50 -76 170 41 -155 18 -231 29 -49 165 -154 -128 86 -56 -103 -225 74 -122
6256 -122 -132 99 92 38 -20 -56 14 -122 18 72 -296 47 -21 174 106 27 161 46 296 -46 201 15 57 153
6280 153 3 33 -62 -256 -76 -173 -110 40 173 -432 -47 114 10 -300 -111 153 -172 19 46 -31 162 38
$$ packed form
6121h0O0J1R7jk19J91J89k80R0j49j21N03k14k18J82k05K20j18L78n76J01M07
6143B48k87Pj39j8J58J76j37j3k5P6k08j48K55K12j32o0j20j20K94j50L16k40
6165e5k42L10j65K23k79J53OR8j4j08L9j44L93j35l45J20J01J81o2R9k30J28J13
6188A85j55m8j4K62j59j72L55l56l48L41O1j54J54J13j43N4P1j34j05M93l62p3
6210a34J29j7Q8J52k83P9J71k23q3K08m4k01L36j78N0M7j76Q6N9l9LL2O2m04L82
6235A02m44L16J60q4j26K46j29j96J73k49K60p8K14l19K6K14j42m7j22K99j96
6256a22j0K31pn4n8l6P0j36J40N4l68L43o8J95o8p9J34j15K50l42K47j86M2R6
6280A53j50L0r5j94J80r7O3J50J33o05L85J61j04l10J89K64l25J91K7p7J93j24
$$ plain form
6302 38 -280 -2 -98 10 -118 233 55 40 -153 1 -110 -57 -188 -73 -176 -399 -250 46 -165 -4 -64 -75
6324 -75 -110 144 -47 -225 195 -99 77 -64 -74 231 93 75 -98 -54 15 230 211 -51 -189 -7 -43 -37 157
6347 157 104 -21 -124 -318 5 -18 238 25 -8 140 -164 154 34 78 -38 145 -28 -18 59 -191 179 227
6369 227 -109 253 -170 17 116 96 -135 -90 -43 108 -41 41 -1 -104 218 -204 -80 -212 -78 -190 90 -12
6391 -12 276 34 126 -47 -113 538 72 243 -68 -53 -31 -27 -60 62 130 -104 210 -38 35 -65 -46 -103 74 162
6415 162 96 -12 226 -202 -135 282 6 250 -8 9 -52 -89 58 -37 -115 40 232 -253 -87 285 -66 0 -121
6438 -121 30 154 22 -11 -45 -39 -83 67 -40 -27 -77 124 227 -43 82 -91 41 130 -78 80 -33 86 -56
6461 -56 75 7 14 82 202 77 6 9 290 79 1 66 137 -104 -76 -109 -105 135 83 -64 -104 -10 -137 -58 37 65 -138
$$ packed form
6302C8l18K78r6J08j28L51j78j5j93J54j11N3j31J15j03k23J49K96k11J61o0j1
6324g5l5K54j91j78M20k94J76j41j0L05j38j8j73M4O9K15j9k62j38J82l6OJ94
6347A57n3j25j03j94L23k3K56k13l3J48l04L18j20M4j16J83j73J0P7k50L70M8
6369B27l36L62m23J87R9k0k31M5M7J51j49Q2m2j03L22m22J24j32J34j12K80j02
6391a2K88k42R2j73o6O51m66J71l11J5K2Ml3J22O8k34L14k48P3j00J9n7J77Q8
6415A62o6j08K38m28O7M17k76K44k58J7o1l7J47r5p8J55J92m85J66L72l51O6j21
6438a21J51J24j32l3l4Om4J50j07J3n0K01J03k70J25j73J32Q9k08J58j13J19j42
6461e6J31o8PO8J20j25p1LK81k11p8O5P1k41K8l3MK40n2j47m0R4j27P9R5K8k03
$$ plain form
6488 -138 -29 128 227 251 -123 -100 -110 105 7 46 112 -181 231 -23 53 -179 -102 328 -75 166 -150 9 -32
6511 -32 -291 -6 -73 128 37 -93 189 88 -347 -88 105 -72 262 -2 -85 264 -423 -92 45 -123 -183 -46
6533 -46 -61 12 172 55 11 -65 39 23 55 -39 12 -118 -253 -111 64 -172 57 -42 39 166 19 111 145 -19
6557 -19 6 -8 -124 -37 186 -27 -114 139 115 -3 -115 -443 91 -378 -552 21 -69 40 99 122 -5 -166 16
6580 16 10 127 -60 -172 -127 -18 -121 -138 17 97 -87 -75 10 116 168 127 9 45 -56 -34 -189 -65 -108 -108 157
6605 157 235 184 -17 -61 -184 60 -25 57 -172 -107 240 -56 5 -188 -61 54 -165 140 -12 -5 -41 90 81 201
6629 201 31 66 -203 -221 90 130 -49 -115 -17 -45 -109 -92 5 -101 -49 -67 177 -127 -115 158 43 145 -263 -195
6653 -195 154 -195 -101 -163 175 -22 -21 -182 -105 -12 67 143 30 -95 46 -106 -177 6 -220 108 48 -23 -43 100
$$ packed form
6488a38J09J57R9K4l74K3j0K15r8L9O6k93M12k54P6k32P7M30m03K41l16J59m1
6511c2k59K85o7K01r1j30K82j01m35K59J93j77L34k64q3L49o87L31J37j68o0J37
6533d6j5P3J60j17m4p6J04j6L2r4N1j30j35J42J75k36K29r9Q1J27j47R2L4j64
6557a9K5j4j16Q7K23k13q7K53k4j18j12l28N34m69j74N73r0J09N9K3j27j61J82
6580A6oJ17j87j12M5J09j03j7J55Q0j84J2Q5J06N2m1j18L6j01K2j55J24m3%K65
6605A57P8n1k01m4j23K44q5Q2k29O5L47k96O1j93J27J15k19L05j52Pl6J31rJ20
6629B01j70L5k69j8L11M0j79o6R8k8o4J7R7j06N2j8K44l04J2K73j15J02m08O8
6653a95L49l49R4o2L38j97Jj61P7R3P9P6j13j25J41j52p1J83k26L28o0p1k0J43
$$ plain form
6677 100 -30 -283 -57 108 -247 -39 260 -182 -39 11 -182 146 -175 284 127 -1 83 -17 5 -132 32
6698 32 224 142 160 105 -15 220 14 -101 -145 -1 169 -17 -24 -39 150 27 142 -190 -172 200 62 74 -18 369
6722 369 -157 290 24 122 159 -14 -88 -92 -55 261 -197 -111 51 95 -82 -48 83 -24 -154 -32 21 -327 291
6745 291 -21 126 -19 -53 -36 76 -72 -62 81 -110 104 89 -34 101 209 181 -47 148 42 -75 -49 60
6767 60 -52 -269 59 4 211 20 -28 -52 199 83 -218 -73 -21 161 -36 -157 -50 -103 137 -184 -80 53
6789 53 -214 71 -15 -181 155 73 143 88 -201 108 -20 -61 152 -1 -8 -63 -74 -81 -141 -68 27 242 -219 -240 -166 3
6815 3 26 -75 85 -37 -8 44 -122 -250 233 -29 -306 64 7 35 59 66 -10 33 90 -225 67 -207 34 156
6839 156 38 227 81 19 91 19 100 -128 -150 -10 -103 132 -176 -73 -135 -293 -225 -286 -170 -69 183 123 -232
$$ packed form
6677A00j30k53K26J65l55K08K99m42J43N0j93L28l21M59j57j28Q4j00K2j37J64
6698C2J92q2J8n5j20K35k06j15m4J44J70j86pj5J89j23J15l32J8L72j38J2r2L87
6722C69n26M47k66R8L7j73p4mL7L16m58Q6J62M4j77L4J31j07j30J22N3l48O18
6745B91l12J47j45l4J7J12j48J0J43j91K14j5j23J35J08k8k28J95j06j17K6J09
6767F0j12k17L28n5K07j91m8k4K51j16l01J45N2J82j97j21J07n3K40l21J04J33
6789E3k67K85q6j66L36q2P0n5k89L09j28m1K13j53pn5j1po0P3R5K15m61k1P4J69
6815CK3j01J60j22K9N2j66j28M83k62k77L70n7K8K4Pp6M3N7l15K92k74K41J22
6839A56j18J89j46o2P2p2Q1k28k2J40r3K35l08J03o2j58O8o1J16J01K52o0l55
$$ plain form
6862 -232 178 -64 -243 -94 -125 -84 151 15 80 75 48 -29 1 -133 -278 -364 -26 -100 -229 -246 43 -181 2 -6
6886 -6 -117 83 187 -132 -186 23 8 1 -70 -208 -130 -181 131 68 -21 21 -27 -190 128 47 -114 104 129 -83 -217
6911 -217 56 -104 200 -30 23 -162 198 150 -227 -267 -143 -2 203 -19 118 91 -90 -120 -185 248 -222 -192
6933 -192 76 193 54 21 26 -20 -301 232 17 -86 -24 -99 355 114 -50 -11 11 29 199 -28 97 -91 5
6956 5 56 -164 82 104 -9 23 -15 -112 19 -27 66 -33 -56 54 -2 -32 -50 -57 -49 -107 -86 140 104 14 73 146 175 81 49
6985 49 -88 115 246 -32 22 72 265 201 31 221 -34 -66 352 45 -156 61 91 -50 109 122 91 -45 130
7008 130 41 -193 -26 -88 90 86 333 -252 -9 -181 -23 -120 -42 -108 -262 -26 -74 167 -41 67 -248 -24 -174
7031 -174 60 146 164 163 -11 8 185 3 -3 39 128 28 -8 34 -18 -40 -111 -132 54 329 -1 92 -86 361 79
$$ packed form
6862b32M10k42j79J49l1M1K35j36O5nk7p7L0j34j45q6L38p4j29j7K89k24J83q
6886fj11K00J04l19n4K09j5pp1j38P8n1L12o3q9M2m8j63L18q1j61K18K5k12j34
6911b17K73j60L04k30N3j85L60m8l77m0J24J41K05k22J37k7j81l0o5M33m70L0
6933a92K68J17j39l3Nm6k81N33k15j03O2p5M54k41j64L9K2J8J70k27J25j88R6
6956EN1k20K46K2j13L2l8r7J31m6R3r9k3J10n6l0j8pQn8K1K26l6r0N9P3K9r4l2
6985D9j37K03J31k78N4N0J93o4j70J90k55l2M18l07k01K17L0j41J59J3l1j36J75
7008A30q9k34J67o2J78mK47n85K43j72J58r7P8o6j54K36m8K41k08J08l15K24j50
7031a74K34Q6J8jj74J9J77j82oM2Q9j00l6M2n2k2p1k1J86K75l30R3j78M47k82
$$ plain form
7056 79 56 -74 -38 -268 191 -32 -284 60 0 36 77 -25 -1 117 117 204 10 6 -75 20 22 218 -29 68 65 104 101
7083 101 -48 -87 -105 299 138 -341 -217 125 87 -141 -32 187 -60 7 -310 -114 -15 -55 -108 -97 25 -72 -11
7106 -11 -2 -78 101 -98 30 85 149 -155 -63 46 46 42 -97 -178 37 -121 368 114 92 100 36 -56 -165 -20 -5 -16
7132 -16 13 -98 -358 21 7 -22 -150 -20 82 -116 -59 58 -29 288 136 -136 -62 79 -156 95 76 -69 -278
7155 -278 -178 12 225 237 276 26 135 -34 11 -3 96 -75 -234 83 129 -82 47 103 -13 66 108 236 -52
7178 -52 84 -247 47 98 98 194 -6 117 -18 190 -109 -234 115 130 -13 57 98 163 -21 -44 -24 -139 -13 275
7202 275 210 170 -84 -25 -90 -273 -41 272 -169 225 171 -79 -67 -179 206 -10 -277 -59 22 361 203 -101
7224 -101 -373 -14 66 42 -17 -3 333 84 -320 -78 166 82 79 327 -111 93 62 -82 -48 170 104 -78 21 -54
$$ packed form
7056G9k3j30L6k30M59k23k52L44o0L6M1j02K4J18%Q7j94mq1R5KJ96k47R7lL9l
7083A01j49l9j8M04j61m79J24L42l8k28J09K19k47O7l17J96R9m0n3J1J22r7O1
7106a1Rp6J79j99J28N5O4l04R2J09%mj39q1K15j58M89k54k2Qo4r2j09J45J5j1
7132a6K9j11k60L79j4k9j28J30J02j98N7J17q7L17j52k72P4J41k35K51j9j45k09
7155b78J00J90K13J2L9k50J09j69M5j4R9j71j59L17M6k11J29N6j16P9M2J28k88
7178e2J36l31K94N1%R6k00J23j35K08k99j25L49J5j43P0M1O5j84k3K0j15J26K88
7202B75o5m0k54N9o5j83K32L13m41L94n4k50J2j12L85k16k67K18Q1L39j58l04
7224a01k72L59Q0k4n9J4L36k49m04K42K44q4lK48m38K04l1j44L4K18o6j82R9p5
$$ plain form
7248 -54 -44 93 -309 58 -45 -152 50 -380 8 -161 220 -86 117 -130 15 -271 -78 -97 280 -16 -67
7269 -67 -78 -32 77 96 21 78 -85 -181 240 -62 208 39 240 173 -66 314 -177 105 -162 124 -76 -441 17
7292 17 189 -132 -78 89 -155 129 110 150 76 219 41 113 -28 -103 132 110 -83 -30 52 12 -18 16 233 -10
7316 -10 52 -86 -148 -71 247 -148 45 12 27 43 100 -23 379 -18 -26 -97 -105 6 105 14 -314 -25 71 266 275 66
7342 66 -82 -19 51 -38 -218 -154 -43 154 74 -101 69 -325 -479 -125 182 -74 -20 176 152 -33 -158 -34 -49
7365 -49 -32 164 -104 94 138 209 240 -63 -60 -264 12 -155 158 -19 -101 78 -120 -181 31 283 -44 -174 -202
7388 -202 139 -5 -149 -66 -82 -132 -149 21 -183 -13 13 -26 -70 116 209 15 128 135 -156 81 -105 -23 154 -36
7412 -36 165 178 109 -61 -88 -35 -7 -19 246 -22 -66 -106 58 213 -162 -87 112 -55 -10 -161 56 -1 196 25
$$ packed form
7248e4J0J37m02L67j03j07K02m30L88j69L81l06K03k47J45k86J93j9L77k96n1
7269f7j1M6J09J9p5N7j63r6M21l02K70j69K01o7k39L80m91K82k67K86k00l65M58
7292A7J72l21N4J67k44K84j9M0p4J43j78P2j41p5K35k2j93N3Q2m0l0L4K17k43
7316a0O2j38o2P7L18l95J93l3J5J6N7j23M02l97qp1qJ11R9r1l28K89R6J95Rk09
7342F6j48O3P0q9j80O4J11J97q0j75J70l94j54L54L07k56N4J96k4j85j25J24j5
7365d9J7J96k68J98M4P1L1l03Lk04K76j67L13j77q2J79j98o1K12K52l27j30k8
7388b02L41j44j44Q3j6n0j7J70k04J70K6l9m4J86R3j94J13Pk91K37j86Q2J77j90
7412c6K01J3o9j70k7N3K8j2K65k68m4m0J64J55l75P5J99j67M5j51K17n7J97j71
$$ plain form
7436 25 47 -173 102 162 13 46 -63 -1 18 178 293 167 45 231 -57 164 -49 154 49 262 8 -233
7458 -233 -179 48 -56 -95 -123 152 -133 -92 -14 31 106 47 -48 -307 -3 85 -113 58 25 -102 -154 72 190 -132
7482 -132 8 -163 10 218 -5 -135 126 77 -110 6 222 -224 -61 -131 42 -83 65 230 256 187 -131
7503 -131 44 74 244 -70 -146 0 -93 484 222 -71 101 104 -101 11 -148 -169 -280 42 -44 -239 79 -106
7525 -106 66 141 138 -67 42 109 66 153 79 20 -50 -143 166 -136 -20 200 -95 -300 203 -134 -85 -181 81 41
7549 41 -141 -23 52 -181 97 153 225 82 -219 51 57 12 71 9 -46 -194 104 5 27 10 -249 57 -29 -148 322
7574 322 -31 -28 -18 169 14 -179 -258 -214 46 -206 67 31 305 -52 48 -150 -53 -112 -79 -76 141 102 -67 -68 -269
7599 -269 -74 122 -91 -202 -19 -177 226 74 21 -3 66 -66 42 64 -63 -271 -143 16 102 143 95 -116
$$ packed form
7436B5K2k20K75O0j49L3j09O2J9J60J15j26j22J86k88K21k13K03j05K13k54k41
7458b33N4K27j04l9k8K75k85M1P8M5P5n9r5k59L04Q8j98J71l3j27n2K26J18l22
7482a32J40j71J73K08k23j30K61m9j87J16K16m46J63p0J73j25J48J65K6o9l18
7503a31J75L0J70l14p6J46r3N77k62k93J72Lk05J12j59k1j11L22q6j95L18j85
7525a06J72P5lk05J09O7m3Q7p4n9p0r3L09l02J16K20k95k05N03l37M9r6K62m0
7549D1j82J18P5k33K78N6P2j43l01K70Om5N9o2n5j48K98r9K2j7k59L06q6j19M70
7574C22l53LJ0J87j55j93p9M4K60k52K73l6K74l57J00j98R7n9L3LK17l9j69jk01
7599b69J95J96k13j11J83j58M03j52n3k4O9j32J08K2j27k08J28J59Q6M1m8k11
$$ plain form
7621 -116 53 -37 79 182 218 192 -71 69 -8 -20 -69 104 -23 84 31 21 2 -14 -91 4 -65 46 96 -157 -109
7646 -109 160 36 -164 -158 -148 88 -129 -38 -91 330 77 73 -331 -195 239 -32 152 -130 -124 121 -115 -11 146
7669 146 185 -99 53 -96 181 -65 -121 -148 -147 -123 121 118 34 -177 -62 196 223 19 94 23 28 38 -52 -246 43
7694 43 105 90 52 -143 62 -38 29 -42 -168 -73 -182 166 84 -96 97 -241 -43 -99 -20 173 154 43 121 -131
7718 -131 112 193 -158 89 -24 -59 14 -77 94 -148 38 148 -234 -40 -19 -40 -246 210 20 80 -35 -70 14
7741 14 -311 153 -24 -198 -39 55 -36 -79 -16 12 260 0 -229 -28 -136 28 -122 116 3 -130 169 141
7763 141 -1 258 -73 59 71 50 -27 148 148 14 25 -17 10 -54 -140 -216 -118 60 123 2 143 129 -187 -120 27
7788 27 -141 67 -142 -10 173 11 -154 -46 -104 -25 -140 -57 -82 212 60 4 275 -26 274 86 -212 271
$$ packed form
7621a16J69r0J16J03L6k6k63J40p7j2m9J73j27J07n3j0j9j6p7R5o9J11N0k53M8
7646a09K69j24k00OJ0K36k17R1n3M21k53mm04J36M34k71J84k82OK45k36J04J57
7669A46L9k84J52j49K77k46n6k7JK4K44lq4k11J15K58K7k04P5p1NJ0r0j94K89
7694D3O2j5l8j95K05j00O7p1j26R5j09L48q2j80J93l38J98n6P9J93j9j11P8k52
7718a31K43Q1l51K47j13l5P3r1J71k42J86J10l82J94K1k1k06M56j90O0j15l5Q4
7741A4l25M64j77j74J59R4r1m3O3K8K48k60k29K01j08J64j50K38j13j33K99k8
7763A41j42K59l31J32J2k1p7J75%j34J1m2K7o4q6p6R8J78O3j21J41j4l16O7J47
7788B7j68K08k09J32J83j62j65J08n8P9j15Q3k5K94j52n6K71l01L00j88k98M83
$$ plain form
7810 271 -108 -191 -83 31 -266 -110 -93 -9 33 -51 -40 47 250 -131 184 -7 31 -120 -163 -69 -39 -268 230 -115
7834 -115 -191 -31 -111 19 -75 -79 166 -13 -198 181 85 19 -76 -5 48 -82 211 130 -237 -206 1 -157 -56 125
7858 125 15 95 -208 -171 -71 -35 -95 -168 298 -65 149 -75 -53 -170 -187 116 106 82 -65 231 -35 -62 109
7881 109 201 -48 14 -115 -67 45 140 273 113 10 -38 117 -128 92 -121 -104 73 93 -87 -146 92 -170 -13
7904 -13 31 134 135 -186 62 -81 -38 -108 9 -163 78 -106 -145 59 256 -210 15 79 -166 205 -31 44 -221
7927 -221 64 1 -113 12 27 -43 104 159 -187 -147 47 94 55 76 64 -95 43 150 197 69 -61 77 -28
7950 -28 -109 149 42 71 -44 -6 -25 -294 -56 -115 -232 77 224 74 -31 -89 84 139 122 -251 -120 32 -26
7973 -26 6 -182 103 189 -61 90 -300 1 70 42 17 -82 -147 -62 82 155 -182 -65 59 -184 -86 -7 13 66 130
$$ packed form
7810B71l79q3J08J14k97J56J7Q4M2q4J1Q7K03l81L15j91L8j51m3R4L0k29M98l45
7834a15p6J60q0J30r4mK45j79j85L79r6o6r5P1N3j30K93q1l67L1K07j58J01J81
7858A25j10Q0l03L7J00L6o0p3M66l63K14k24K2j17j7L03j0k4j47K96k66k7J71
7881A09R2k49O2j29M8J12R5J33j60j03m8J55k45K20k13J7J77K0j80n9K38k62J57
7904a3M4J03Jl21K48j43M3p0J17j72K41j84l9K04J97m66K25O4k45L71k36P5k65
7927b21K85o3j14J25J5p0J47N5l46M0J94M7l9K1j2j59J38J07M7j28j30J38j05
7950b8q1K58j07K9j15L8j9k69K38n9j17L09J47j50j05n8J73N5j7l73J31J52n8
7973b6L2j88K85Q6k50J51l90L01O9k8k5r9o5Q5J44P3l37J17J24k43R8P9K0N3O4
$$ plain form
7998 130 68 33 114 188 223 -60 94 -300 87 -56 18 129 -200 111 -42 88 -200 -58 -62 -142 1 -95 -256
8021 -256 -133 7 -102 124 17 85 11 -264 -119 -158 -208 -37 18 -138 237 -53 -93 2 -164 -106 89 -65 -44
8044 -44 -20 35 -146 205 -99 -171 -114 313 80 67 5 -52 -68 121 -20 107 -23 33 125 -224 28 -13 -82 -50 -45
8069 -45 16 -44 -43 259 204 0 166 -86 -63 156 -168 254 68 188 -193 -81 -124 0 73 62 299 -59 12 238
8093 238 51 -236 238 -73 98 69 102 -181 -267 -108 -36 85 71 -237 255 217 -51 28 18 31 -19 -54 -247 -63
8117 -63 -40 -127 110 -368 -18 221 -97 -149 -68 -207 -154 -117 157 135 -347 -48 100 62 30 -25 78 156 110 112 -19
8142 -19 65 -235 72 268 -108 -2 -39 -133 140 37 -36 -71 4 65 -302 205 187 -67 -15 156 -37 102 30 237
8166 237 24 70 198 -125 -127 -155 -53 -90 63 -94 -18 241 -87 -7 124 -244 287 29 93 120 -164 98 -40
$$ packed form
7998A30o2l5Q1P4L5k83J54l94L87j43P4J11l29L11j53J30k88J42mq0J43r6j61
8021b56J23J40j09K26j07O8p4k75J45l9n0J71N5j56L75k90m0R5j66N8J95j54K1
8044d4K4N5j81L51l04p2N7M27k33j3o2n7j6J89j41J27j30N6R2l49K52m1o9L2N
8069d5O1o0JL02n5k04J66k52K3K19l24M22j86J20l81J12m3J24P3j1K37l58P1K26
8093B38j87k87M74l11J71k9L3k83q6J59P2J21j4l08M92l8k68P9j0J3n0l5j93J84
8117f3K3q7K37m78L50K39l18n2Q1j39N3L7K74k2m82K99J48l8l2n5J03P8m6Kj31
8142a9Q4l00L07J96l76J06l7r4K73j03p3l5P5O1l67N07j8k54N2J71j93J39p2K07
8166B37k13M6J28l23kk8J02l7J53j57P6K59l28Q0J31l68N31k58O4K7k84K62j38
$$ plain form
8189 -40 -19 35
$$ packed form
8189d0K1N4
8191C5
$$ Imaginary data points
##PAGE= N=2
##DATA TABLE= (X++(I..I)), XYDATA
$$ plain form
0 0 0 0 0 0 0 0 0 0 0 0 0 0 0 0 0 0 0 -7 8 -8 8 -8 8 -14 16 -16 16 -23 24 -27 32 -38 40 -47 51 -59 65 -71 81
39 81 -90 98 -109 122 -135 148 -163 179 -200 218 -241 265 -292 323 -357 394 -440 490 -549 619
59 619 -705 812 -945 1118 -1359 1707 -2253 3209 -5198 10936 -58830 -215263 62626 193328
73 193328 -80279 -166068 95866 141567 -95322 -112663 102559 94106 -98121 -68567 104366
84 104366 49281 -103493 -26163 105127 4803 -105468 10727 101532 -29122 -104444 36103
95 36103 99796 -51171 -103473 56639 99362 -67021 -98160 71542 92956 -74597 -85046
106 -85046 77688 79855 -74572 -67867 77831 61705 -72840 -45833 74459 34763 -68985
117 -68985 -17694 65604 2861 -60337 9276 52664 -23988 -50576 31169 42589 -43655 -42348
$$ packed form
0@%%%%%%%%%%%%%%%%%pJ5j6J6j6J6k2L0l2L2l9M7n1N9p0P8q7R8j10J24j36J52
39H1j71J88k07K31k57K83l11L42l79M18m59N06n57O15o80P51q34R30j039J168
59F19j324J517j757K063k477L066l960N462q407J6134o9766j56433K77889J30702
73A93328k73607q5789K61934M5701k36889j7341K15222q453j92227K9554J72933
84A04366n5085j52774P7330J31290j00324j10271J16195R0805j30654p5322J40547
95C6103O3693j50967n2302J60112M2723j66383l1139J69702K1414j67553j0449
106h5046J62734K167j54427O705J45698j6126j34545K7007J20292l9696j03748
117f8985N1291Q3298o2743o3198O9613M3388p6652k6588Q1745J1420q6244J307
$$ plain form
129 -42348 48043 35890 -56592 -35247 58720 31330 -60816 -28184 60835 27032 -56531 -22264
141 -22264 55298 22676 -46849 -17299 44206 17962 -35280 -13258 30882 11623 -24979 -8927
153 -8927 20280 3724 -18737 -1835 13338 -6491 -14419 8658 9702 -17227 -11295 20094 9273
166 9273 -25568 -9812 28905 11656 -30180 -11705 34293 15810 -32742 -14672 36550 18978
178 18978 -34024 -17311 35484 18672 -33302 -16602 31831 13536 -30471 -11636 25737 5023
190 5023 -24966 -3101 18825 -4432 -18369 7251 13842 -14437 -12477 18844 10425 -24048 -7487
203 -7487 30690 7188 -32653 -3022 38590 3994 -38222 247 41716 466 -39844 2174
215 2174 39982 -2942 -38522 4193 34204 -7887 -33099 8499 26386 -13948 -23918 14645
$$ packed form
129d2348R0391j2153r2482K1345R3967k7390r2146L2632Q9019l3803q3563L4267
141b2264P7562l2622o9525K9550O1505k6244n3242K2022M4140j9259l6602J6052
153h927K9207j6556k2461J6902J5173j9829p928K3077J044k6929N932L1389j0821
166I273l4841J5756L8717j7249m1836J8475M5998j8483m8552J8070N1222j7572
178A8978n3002J6713N2795j6812n1974J6700M8433j8295m4007J8835L7373k0714
190E023k9989K1865K1926k3257j3937K5620O591k8279J960L1321q419l4473J6561
203g487L8177k3502l9841K9631M1612l4596m2216L8469M1469m1250m0310M2018
215B174L7808m2924l5580M2715L0011m2091k5212M1598J7887m0334r970L8563
$$ plain form
227 14645 16314 -20088 -12043 22075 5948 -25148 222 28603 -4187 -29230 10999 32819
239 32819 -12024 -31346 17927 34338 -18271 -31849 22001 32304 -23000 -30112 23855 26709
251 26709 -25386 -24224 23945 17762 -26045 -14792 22604 7004 -23375 -3494 19905 -3020
263 -3020 -18814 7206 17500 -11157 -14578 16898 15021 -17590 -11422 22645 12464 -22202 -8751
276 -8751 25208 9198 -24309 -7088 23984 5533 -23282 -5120 20006 1728 -19636 -2618
288 -2618 14326 -1213 -13535 489 8832 -3520 -7075 4034 3985 -5661 -1047 7462 155 -7278
302 -7278 3453 10419 -2589 -8522 6061 10820 -4661 -8909 5609 8814 -4958 -8035 3686
315 3686 6818 -3816 -6931 1228 3666 -2429 -4548 -645 955 -359 -483 -1739 -1967 2166 3389
$$ packed form
227A4645J669l6402Q045L4118j6127l1096K5370K8381l2790k5043M0229K1820
239C2819m4843j9322M9273J6411n2609j3578N3850J0303n5304p112N3967K854
251B6709n2095J162M8169o183m3807J1253L7396j5600l0379J9881K3399k2925
263c020j5794K6020J0294k8657l421L1476j877l2611O168L4067j0181l4666J3451
276h751L3959j6010l3507J7221L1072j8451k8815J8162K5126j8278k1364J7018
288b618J6944j5539j2322J4024Q343j2352l555J1109m9r646M614Q509p307p433
302g278J0731O966j3008n933J4583M759j5481m248J4518L205j3772l077J1721
315C686L132j0634l115Q159K438o095k119L903J600j314j24j256k28M133J223
$$ plain form
330 3389 -2555 -3900 4240 6076 -2898 -4731 4774 6827 -2539 -4532 4150 5667 -2630 -4069 2191
345 2191 3292 -2118 -3150 591 894 -2155 -1562 406 -1744 -1969 1211 199 -3993 -1348 4182 818
361 818 -5203 -133 6580 1015 -5261 342 6951 1685 -4559 47 5953 2112 -3991 -1008 4606
376 4606 1819 -3475 -1587 2249 747 -2862 -2007 596 -3 -1636 -1457 -499 -437 -515 -426 -527 -291 319
394 319 825 581 -418 109 2415 1711 -1039 -560 3280 2593 -2211 -1615 3441 2869 -2727 -2922 2843 2829
412 2829 -3517 -4304 2130 2615 -4058 -4675 2445 2942 -4354 -3643 2898 2047 -3768 -1818 3645 1449 -2604
429 -2604 497 4147 386 -2102 1812 3928 -760 -2407 2967 3848 -2569 -2843 3602 3169 -4648 -3474
445 -3474 4079 2223 -5895 -3158 4318 1066 -5705 -2238 4172 519 -4840 -951 3981 294 -3596
$$ packed form
330C389n944j345Q140J836q974j833R505K053r366j993Q682J517q297j439O260
345B191J101n410j032L741L03l049N93J968k150k25L180j012m192K645N530l364
361H18o021N070O713n565o276N603O609n266o244M606N906l841o103K983N614
376D606k787n294J888L836j502l609Q55K603n99j633J79R58O2p8Q9j01K36O10
394C19N06k44r99N27K306p04k750M79L840o87m804N96N056n72n596j95N765j4
412B829o346p87O434M85o673o17P120M97p296P11O541q51n815J950N463k196m053
429b604L101L650l761k488L914K116m688j647N374Q81o417k74O445m33p817J174
445c474P553j856q118K737P476l252o771L467O410l653n359L889M932l687l890
$$ plain form
460 -3596 672 4226 -127 -2805 2603 3943 -1626 -1221 3417 2370 -2870 -382 3851 439 -3631
475 -3631 107 3190 -1398 -4387 259 2537 -2113 -3847 732 2098 -2511 -2952 1640 1963 -2156 -1430
491 -1430 2397 1237 -1655 616 3036 335 -1008 1857 2387 -719 -706 2298 1142 -1823 -813 1978
507 1978 275 -2523 -1260 1687 -383 -3043 -1005 1355 -1287 -3114 43 1400 -1475 -1804 1312
522 1312 1061 -1151 -412 2311 1014 -1256 676 2681 632 -1033 1200 2386 -252 -1144 1413 1854
538 1854 -1304 -1625 1292 660 -2034 -1652 916 -87 -2905 -1258 1365 -569 -2359 -332 1353 -795
554 -795 -1559 1083 1918 -455 -434 1513 1585 -279 -94 2065 1274 -743 55 2106 426 -1565 92 1384
572 1384 -671 -1666 -168 493 -1360 -1779 -119 69 -1126 -1149 242 94 -1037 -629 713 463 -482 202
$$ packed form
460c596M268L554m353k678N408J340n569M05M638j047n240K488M233l412m070
475c631L738L083m588k989M646K278m650j734M579J366m609m41M592L23m119P26
491a430L827j160k892K271K420k701j343K865N30l106J3L004j156k965J010K791
507A978j703k798J263K947k070k660K038K360k642j827L157J357k875l29L116
522A312k51k212P39K723j297k270J932K005k049j665K233J186k638q92K557M41
538A854l158l21K917o32k694L82K568j003k818J647K623j934j790K027J685k148
554g95p64K642Q35k373K1J947P2j864J85K159p91k017P98K051j680j991J657J292
572A384k055r95J498O61j853m19J660J88j195k3J391j48j131M08J342k50r45O84
$$ plain form
590 202 1349 646 97 859 1482 487 343 1027 813 121 65 573 -1 -636 263 -55 -664 -565 -689 -357 -760
611 -760 -1098 -510 -352 -718 -614 62 -194 -376 258 756 553 -68 869 1016 242 63 1707 1066 50 124
631 124 1375 769 -533 -57 597 -4 -905 -594 297 -612 -1388 -848 294 -728 -1577 -140 232 -826
649 -826 -997 627 586 -283 107 860 727 184 300 1276 1128 47 242 1161 655 -82 367 583 -144 -960
669 -960 -270 199 -453 -1111 -551 241 -832 -1003 -414 -133 -680 -737 -75 398 -12 -556 637 793 333 90
689 90 907 1129 490 289 1227 1045 180 -44 878 367 -389 -442 166 -65 -572 -812 -189 -281 -1068 -1196 -202
710 -202 -180 -847 -598 187 -134 -764 294 1146 297 -195 656 1001 567 180 1015 1048 291 1 916 743 -82
731 -82 -643 493 207 -658 -852 -76 -257 -1403 -824 231 -456 -1158 -443 51 -400 -639 -35 692 -48 -335
$$ packed form
590B02J147p03n49P62O23r95j44O84k14o92n6N08n74o35Q99l18o09R9j24L32m03
611g60l38N88J58l66J04O76k56j82O34M98k03o21R37J47p74j79J644o41j016P4
631A24J251o06j302M76O54o01r01L11Q91r09p76N40J142j022q49J437L72j058
649h26j71J624m1q69L90P53j33n43J16R76j48j081J95R19n06p37M49K16p27q16
669i60O90M69o52o58N60P92j073j71N89K81n47n7O62M73m10n44J193J56m60k43
689I0Q17K22o39k01R38j82q65k24R22n11p56n3O08k31n07k40O23r2p87j28R94
710b02K2o67K49P85l21o30J058Q52q49m92Q51L45m34l87Q35L3p57k90R15j73q25
731h2n61J136k86q65j94P76j81j146N79J055o87p02P15M94m51k39O04P27p40k87
$$ plain form
751 -335 730 1116 -48 -69 955 1304 -14 -73 1141 723 -633 -450 1453 138 -1053 -109 781 -568
769 -568 -1137 -610 79 -982 -1438 -199 -7 -672 -1292 192 424 -604 -358 1034 922 -229 183 1468
787 1468 1027 -342 260 1227 578 -462 395 1082 -91 -599 -122 460 -566 -1310 -289 270 -844 -1327
805 -1327 64 -158 -1051 -1156 417 287 -892 -389 1043 74 -615 338 1131 57 -504 972 1309 432
823 432 -243 573 1076 133 -624 594 550 -500 -774 68 -68 -1185 -918 166 -352 -1151 -708 370 -382
842 -382 -946 -368 590 -94 -302 248 1090 348 -411 616 1358 279 29 852 848 93 -364 575 375 -305
862 -305 -424 52 -129 -780 -493 -220 -194 -791 -817 -55 -48 -824 -288 578 -225 -643 301 704 -347 -237 616
883 616 887 152 224 788 754 -148 271 478 277 -295 -149 331 353 -550 -486 142 -253 -938 -280 4 -678 -873
$$ packed form
751c35J065L86j164k1J024L49j318n9J214m18j356J83J903j315j191R44Q90j349
769e68n69N27O89j061m56J239J92o65o20J484K32j028K46J392j12j151M12J285
787A468m41j369O02R67o49j040Q57O87j173n08M77N82j026p44J021N59j114m83
805a327J391k22q93j05J573j30j179N03J432r69o89R53P93j074n61J476L37q77
823D32o75Q16N03r43p57J218m4j050k74Q42j36j117K67J084n18p99M43J078p52
842c82n64N78R58o84k08N50Q42p42p59J027P42j079k50Q23mp55m57R39k00o80
862c05j19M76j81o51K87K73K6n97k6P62Pp76N36Q66q03m18R44M03j051J10Q53
883F16K71p35P2N64l4r02M19K07k01n72J46M80K2r03O4O28l95o85O58K84o82j95
$$ plain form
905 -873 -483 26 -245 -192 165 95 53 43 522 640 160 399 728 859 123 40 857 426 -321 -151 604 99
927 99 -378 -248 7 -431 -770 -398 -148 -535 -566 -404 -243 -511 -307 183 306 -51 -259 450 373 123 556
948 556 579 404 377 343 1010 234 120 -8 281 6 -263 -27 -198 -563 -569 -398 -363 -471 -679 -548 -409 -206
970 -206 -315 -346 -19 -264 38 321 271 169 374 401 309 657 161 522 633 446 254 579 395 213 -38 175
992 175 -246 -447 -613 -292 -308 -812 -368 -213 -501 -499 -347 -98 -148 -414 153 37 -97 -101 369 240 226 306 393
1015 393 501 440 167 301 300 195 39 139 69 -423 -281 -305 -460 -509 -488 -347 -427 -665 -222 -450 -268 -481 -431
1038 -431 380 -126 -219 223 313 265 301 333 533 397 323 719 305 -116 63 78 232 -71 -195 -272 30 -434 -510
1061 -510 -295 -94 -474 -514 -174 -383 -424 -389 118 -118 -230 334 394 242 -223 290 780 227 -144 682 582
$$ packed form
905h73L90N09k71N3L57p0m2j0M79J18m80K39L29J31p36q3Q17m31p47J70P55n05
927I9m77J30K55m38l39L72K50l87l1J62J61k68K04M90J23l57k08P09p7k50M33
948E56K3j75k7l4O67p76j14j28K89k75k69K36j71l65oJ71L5j08k08J31J39K03
970b06j09l1L27k45L02K83n0j02K05K7r2L48m96L61J11j87j92L25j84j82k51K13
992A75m21k01j66L21j6n04M44J55k88KJ52K49n0k66N67j16j34mM70j29j4Q0Q7
1015C93J08o1k73J34jj05j56J00p0m92J42k4j55m9K1J41q0k38M43k28J82k13N0
1038d31Q11n06r3M42R0m8L6L2K00j36p4L96m14m21J79J5J54l03j24p7L02m64p6
1061e10K15K01l80m0L40k09m1L5N07k36j12N64O0j52m65N13M90n53l71Q26j00
$$ plain form
1082 582 448 169 134 338 -90 -232 211 235 -381 -523 -114 -317 -458 -183 -243 -217 -700 -303 21 126 -215
1103 -215 -108 540 385 -112 329 566 363 57 631 671 456 303 274 612 -184 -81 208 168 -462 -330 -260
1124 -260 -59 -1012 -373 -184 -142 -550 -296 89 -244 -373 -201 -7 -100 197 348 714 79 -23 671 969 172
1145 172 -154 272 368 168 -370 509 73 -329 -543 185 63 -528 -356 -25 -384 -706 -501 -82 -109 -376 -370
1166 -370 142 -109 280 156 448 356 -121 401 617 252 31 492 240 124 96 198 319 -193 -96 240 -151
1187 -151 -600 -137 -55 36 -512 -534 -129 -358 -652 -238 68 -234 -254 47 506 162 160 239 488 102 383 81
1209 81 430 361 -219 458 138 71 -32 -43 58 -260 -380 -82 -472 -255 -413 -28 -89 -324 -305 -301 -76 -283 -30
1232 -30 239 -67 121 435 437 485 -49 324 492 341 210 535 268 -88 -9 394 117 -187 -21 -75 -107 -517
$$ packed form
1082E82j34k79l5K04m28j42M43K4o16j42M09k03j41K75o0K6m83L97L24J05l41
1103b15J07O48j55m97M41K37k03l06N74M0k15j53k9L38p96J03K89m0o30J32P0
1124b60K01r53O39J89M2m08K54L85l33j29J72J94r3K97J51L66o35j02O94K98p97
1145A72l26M26R6k00n38Q79m36m02k14P28j22n91J72L31l59l22K05M19k7k67O
1166c70N12k51L89j24K92r2m77N22K16l65k21M61k52j16k8J02J21n12R7L36l91
1187a51m49M63Q2R1n48k2M05k29k94M14L06l02k0L01M59l44kP9K49l86K81l02
1209H1L49o9n80O77l20o7j03j1J01l18j20K98l90K17j58L85o1k35J9MK25k07K53
1232c0K69l06J88L14KM8n34L73J68j51j31L25k67l56P9M03k77l04J66n4l2m10
$$ plain form
1254 -517 -286 -118 -247 -248 -164 30 -156 -364 -45 251 -36 -141 129 249 290 309 324 453 91 32 431 548
1276 548 115 -100 90 123 -84 -296 75 73 -177 -216 -123 -491 -600 -123 15 -462 -382 -72 -25 -262 -43 371
1298 371 108 19 113 557 318 49 355 496 93 62 400 241 184 -189 105 229 94 -322 -255 86 -448 -297
1320 -297 -17 -60 -556 -654 -284 -132 -264 -224 313 11 -352 145 374 336 75 161 270 474 57 369 373 79
1342 79 -34 58 250 52 -144 -214 -138 -151 -357 -36 -209 -151 -435 -164 -386 -546 -132 54 146 -110 -115 171 234
1365 234 39 100 299 427 -8 165 373 227 322 19 285 355 -81 -1 11 -300 -358 -201 -290 -224 -236 -239 -240 -421
1389 -421 -329 -280 -121 157 220 -87 335 31 253 318 504 183 -20 449 309 338 50 238 120 65 225 -59
1411 -59 35 -155 -164 -47 -323 -391 -550 -165 -572 -518 -177 -234 -249 -266 -215 -70 -111 -289 203 193 292 51 271 526
$$ packed form
1254e17K31J68j29jQ4J94j86k08L19K96k87j05K70J20M1J9J5J29l62n9L99J17
1276E48m33k15J90L3k07k12L71kk50l9R3l68j09M77J38m77Q0L10M7k37K19M14
1298C71k63q9R4M44k39k69L06J41m03l1L38j59n7l73K94J24j35m16O7L41n34J51
1320b97K80m3m96r8L70J52j32M0N37l02l63M97K29l8k61Q6J09K04m17L12Mk94
1342G9j13R2J92j98j96p0P6j3k06L21j73N8k84K71k22j60M14J86R2k56nK86O3
1365B34j95O1J99J28m35J73K08j46R5l03K66P0m36Q0J2l11n8J57q9O6j2ljj81
1389d21R2M9J59K78O3l07M22l04K22O5J86l21k03M69j40K9k88J88j18n5J60k84
1411e9R4j90rJ17k76o8j59L85m07N4L41n7j5j7N1J45m1j78M92j0R9k41K20K55
$$ plain form
1435 526 139 373 -40 104 374 0 -13 51 229 -162 -146 -384 -113 -133 -75 -284 -390 -482 -456 -83 5 -345 -120
1458 -120 46 -63 -248 226 256 381 66 393 265 282 58 295 140 92 43 -143 174 -294 -227 -199 -11 -382
1480 -382 -329 -195 69 -449 -515 -279 65 -386 -73 212 -58 94 56 39 117 168 206 227 425 85 140 331 -49
1503 -49 -336 70 215 156 -145 245 331 -305 -349 -178 -8 -313 -407 -106 65 -55 -274 -101 231 -298 -232 83
1525 83 147 -61 124 381 334 168 262 307 184 -42 290 32 2 -399 97 -91 40 -360 -182 -133 -252 -323 -174
1548 -174 -19 -299 -302 -12 -318 -189 -108 76 175 198 172 38 222 205 164 198 330 -10 248 501 177 -213 160
1571 160 134 -187 -114 -367 -100 -231 -359 -195 -236 -69 -437 -197 -303 16 -363 -128 187 78 -102 132 292
1592 292 59 -55 443 109 269 331 386 195 -21 282 -11 44 196 209 93 -282 17 41 -133 -429 -203 -281
$$ packed form
1435E26l87K34m13J44K70l74j3O4J78l91J6k38K71k0N8k09j06r2K6L73Q8l50K25
1458a20J66j09j85M74L0J25l15L27j28J7k24K37j55m8m9j86L17m68O7K8J88l71
1480c82N3J34K64n18o6K36L44m51L13K85k70J52l8j7P8N1L8K1J98l40N5J91l80
1503d9k87M06J45n9l01L90Q6o36m4J71J70l05r4L01J71j20k19J73L32n29O6L15
1525H3O4k08J85K57m7j66R4M5j23k26L32k58l0m01M96j88J31m00J78M9j19p1J49
1548a74J55k80lK90l06J29Q1J84R9K3k6j34J84j7m1L4J32l40K58K53l24l90L73
1571A60k6l21P3k53K67j31j28J64m1J67l68K40j06L19l79K35L15j09j80K34J60
1592B92k33j14M98l34J60O2N5j91k16L03k93N5J52J3j16l75K99K4j74k96K26p8
$$ plain form
1614 -281 -204 -208 -75 -84 -138 77 -48 65 128 20 188 307 248 239 406 241 251 270 205 210 90 -45 84 -157 -85
1639 -85 -461 -125 -178 -440 -207 15 -457 -543 -114 -2 35 -101 -245 259 108 -41 159 496 -93 -93 142 106
1661 106 159 68 205 416 100 -76 -17 -128 -123 -348 -64 -217 -80 -157 -23 -226 -485 -320 85 -8 -136 -56 55
1684 55 -172 -174 323 399 185 134 178 407 -2 -42 315 300 239 75 49 171 -334 -150 -76 -270 -198 -169 -184 -205 -380
1709 -380 -46 -190 -216 -278 -68 -7 -325 14 -82 275 127 32 208 329 277 -1 13 307 159 116 36 143 37
1732 37 -114 142 45 -145 -35 -188 -198 -266 -258 -170 -125 -221 -200 -73 -61 -149 -357 90 97 -51 189 712 246 488 112
1757 112 30 35 97 445 90 -96 46 218 59 2 -154 -80 -118 -423 -260 -56 -273 -103 -204 3 -274 -295 -70
1780 -70 137 -70 198 88 66 193 -32 380 -306 446 370 181 110 151 327 118 29 -121 48 -12 -196 -248 -145
$$ packed form
1614b81P7mJ33rn4K15j25J13O3j08J68J19n9rJ67j65J0J9o5Nj20j35J29k41P2
1639h5l76L36n3k62K33K22m72q6M29J12L7j36j44N04j51j49K00L37n89%K35l6
1661A06N3r1J37K11l16j76N9j11Nk25K84j53J37p7J34k03k59J65M05r3j28Q0J11
1684E5k27kM97P6k14n1M4K29m09m0L57j5o1j64k6J22n05J84P4j94P2K9j5k1j75
1709c80L34j44k6o2K10O1l18L39r6L57j48r5J76J21n2k78J4K94j48m3q0J07j06
1732C7j51K56r7j90J10j53j0o8QQ8M5r6K1J27J2q8k08M47Pj48K40N23m66K42l76
1757A12q2NO2L48l55j86J42J72j59n7j56P4l8l05J63K04k17J70j01K07k77k1K25
1780g0K07k07K68j10k2J27k25M12o86P52p6j89p1M1J76k09q9j50J69o0j84n2J03
$$ plain form
1803 -145 -378 -179 -367 -150 -231 -235 -77 -319 -167 -289 -10 -111 50 276 -84 327 337 87 330 163 246 201
1825 201 52 86 71 199 154 -110 -99 -34 -66 102 -204 83 -191 -247 87 -267 -187 -285 -49 48 156 44 75 447
1849 447 83 280 224 99 167 251 198 284 310 30 113 -104 145 -165 -165 -75 -420 -515 -71 30 -237 -154 -401 -23
1873 -23 -122 -65 62 68 -91 -255 74 204 335 -78 112 252 167 200 -149 238 -18 -136 196 89 160 110 30
1896 30 -66 -5 -84 -14 -149 -97 -260 -37 -338 -52 -80 -200 -298 -275 -32 65 -107 90 132 417 -82 93 57 -121
1920 -121 -14 128 196 -126 -89 114 144 -20 -60 -208 166 -427 -140 43 -224 -398 149 -401 65 -134 -200 160
1942 160 17 -87 -200 222 114 40 127 86 -26 363 166 182 230 85 288 -75 425 -46 84 -250 39 -268
1964 -268 -135 -257 -201 -32 -302 -476 -90 -197 28 -278 -77 100 50 98 -190 304 -5 -7 288 65 232 347
$$ packed form
1803a45k33J99j88K17q1mJ58k42J52j22K79j01J61K26l60M11J0k50K43j67Q3m5
1825B01j49L4j5J28m5k64J1O5l2J68l06K87k74n6L34l54Q0r8K36R7J08j12L1L72
1849D47l64J97n6j25O8Q4n3Q6K6k80Q3k17K49l10%R0l45r5M44J01k67Q3k47L78
1873b3r9N7J27Oj59j64L29J30J31m13J90J40q5L3l49L87k56j18L32j07P1n0q0
1896C0r6O1p9P0j35N2j63K23l01K86k8j20r8K3K43R7j72J97M2K85m99J75l6j78
1920a21J07J42O8l22L7K03L0j64m0j48L74n93K87J83k67j74N47n50M66j99o6L60
1942A60j43j04j13M22j08p4Q7m1j12L89j97J6M8j45K03l63N00m71J30l34K89l07
1964b68J33j22N6J69k70j74L86j07K25l06K01J77n0M8k88M94l09kK95k23J67J15
$$ plain form
1986 347 112 -129 353 41 112 -30 -59 -12 64 -176 -147 -293 -260 -69 -271 25 -179 -152 5 -303 52 146 107
2009 107 -271 327 253 -57 97 -90 201 168 242 129 99 125 218 47 142 171 107 27 -85 61 -149 -204 -202 -121 -71
2034 -71 -192 85 40 -337 -284 -120 -23 28 43 39 172 127 82 265 301 141 162 153 77 -102 262 166 30 -99 -76 -89
2060 -89 -185 40 -321 -62 -181 -151 -43 -117 9 -211 -222 51 -13 -6 51 151 -61 133 86 28 41 37 97 217 159
2085 159 124 73 -149 68 -18 62 96 -39 -177 -217 -157 -115 3 -180 -225 -32 -103 -113 -143 -200 -27 87 -38 -73 264
2110 264 224 257 274 165 -64 -64 124 120 -138 -119 -110 -150 34 75 -129 29 -136 -240 -55 -104 -233 -129 -227 -110 80
2135 80 159 189 318 57 226 272 95 182 239 251 84 280 -163 237 180 -55 97 27 87 -120 -100 -185 -202 -389
2159 -389 -140 -83 -195 -58 -145 -156 -381 45 40 -131 -42 69 23 -87 187 96 119 -49 -157 59 150 213 -80 -36
$$ packed form
1986C47k35k41M82l12P1j42k9M7P6k40K9j46L3J91k02K96k04K7J57l08L55R4l9
2009A07l78N98p4l10J54j87K91l3P4j13l0K6R3j71R5K9o4q0j12J46k10n5KQ1N0
2034g1j21K77m5l77N3J64R7N1J5mJ33m5m5J83L6j60K1rp6j79L64r6j36j29K3j3
2060h9r6K25l61K59j19L0J08p4J26k20j1K73o4PN7J00k12J94m7n8J3mO0J20n8
2085A59l5n1k22K17q6Q0L4j35j38m0O0M2J18j83m5J93p1j0l0n7J73J14j25l5L37
2110B64m0L3J7j09k29%J88mk58J9Rm0J84M1k04J58j65j04J85m9j29J04r8J17J90
2135H0P9L0J29k61J69M6j77Q7N7J2j67J96m43M00n7k35J52p0O0k07K0q5j7j87
2159c89K49N7j12J37q7j1k25M26nj71Q9J11m6j10K74r1K3j68j08K16R1O3k93M4
$$ plain form
2183 -36 76 103 -66 -135 -353 10 -266 -174 76 -180 -90 96 46 -26 61 -259 -7 -68 58 331 39 115 12
2206 12 -115 382 -91 -23 66 335 185 -86 -110 28 72 -4 -1 72 -64 156 123 -281 -245 -28 191 -309 -201 -6
2230 -6 -159 221 141 -24 189 -170 148 -33 192 -93 262 181 246 -22 -59 95 -122 -89 -57 -2 200 -35 -53
2253 -53 -178 -122 39 9 -128 -183 58 33 -199 -85 -376 -245 136 5 257 8 -61 136 7 472 -81 139
2275 139 147 102 1 49 -200 106 -46 -155 -57 -113 -36 234 -336 -147 -171 -127 -236 173 223 -138 -133 -206 -42 -136 179
2300 179 -140 95 -17 156 -27 116 163 212 13 336 323 132 -90 35 -15 31 -79 136 -82 -17 117 -32
2322 -32 -160 83 -163 -105 -254 62 113 36 447 97 97 276 364 66 118 271 114 120 184 339 -83 147 71 273
2346 273 -67 -59 -34 -186 -181 -46 240 -124 93 -156 -67 -434 -150 -246 -167 151 -158 -71 -199 121 -108 267 115
$$ packed form
2183c6J12K7j69o9k18L63k76R2K50k56R0J86n0p2Q7l20K52o1J26K73k92P6j03
2206A2j27M97m73O8Q9K69j50k71k4J38M4p6LP3j36K20l3m04L6K17K19n00J08J95
2230fj53L80q0j65K13l59L18j81K25k85L55q1O5k68l7J54k17L3L2N5K02k35j8
2253e3j25N6J61l0j37n5K41k5k32J14k91J31L81j31K52k49o9J97j29M65n53K20
2275A39Qm5j01M8k49L06j52j09R8n6P7K70n70J89k4M4j09M09N0l61Np3J64r4L15
2300A79l19K35j12J73j83J43M7M9j99L23j3j91k22J25n0M6j10K15k18O5J34j49
2322c2j28K43k46N8j49L16N1p7M11l50%J79Q8k98N2J53j57OO4J55m22K30p6K02
2346B73l40QK5j52NJ35K86l64K17k49Q9l67K84r6P9L18l09Q7j28L20k29L75j52
$$ plain form
2369 115 -85 15 -4 73 180 -56 -30 -30 -179 -46 -62 -121 -60 -245 -177 -97 24 -159 69 -284 88 -58 -120 -19
2393 -19 -64 45 -49 -66 239 -35 81 138 189 231 213 157 65 -28 -55 67 65 -78 -80 -124 -2 -33 -235 65 -154 16
2419 16 -203 -222 -281 106 17 -27 281 59 237 107 89 7 -7 -47 -2 145 119 212 186 -104 249 135 137 214 162 -114
2445 -114 -29 -97 -51 -63 -168 109 -22 -77 182 27 -108 138 -6 -134 60 -8 18 152 188 1 280 -15 -19
2468 -19 389 133 -48 259 -191 162 142 202 -140 -74 -249 34 -50 -12 -168 14 21 -74 -233 -402 41 -240 -6
2491 -6 53 -126 -183 204 95 16 74 91 114 -118 -117 73 238 212 10 168 -61 -52 33 88 28 -295 119 94 -219 -225
2517 -225 -102 -18 -35 -251 -117 265 -43 -87 125 266 -49 -106 243 -119 96 216 179 28 -164 138 71 218
2539 218 -176 63 203 -164 -212 -166 -105 -3 -280 -140 10 -144 -74 -50 -75 -201 -71 122 48 -51 21 -79 209
$$ packed form
2369A15k00J00j9P7J07k36K6%j49J33j6n9O1j85O8Q0J21j83K28l53L72j46o2J01
2393a9m5J09r4j7L05k74J16N7N1M2j8n6r2r3k7J22kj43km4J22l1k02L00k19J70
2419A6k19j9n9L87q9m4L08k22J78j30j8q2j4m0M5J47k6R3k6k90L53j14KP7n2k76
2445a14Q5o8M6j2j05K77j31n5K59j55j35K46j44j28J94o8K6J34L6j87K79k95m
2468a9M08k56j81L07m50L53k0O0l42O6j75K83q4L8j56J82Pr5j59j69M43k81K34
2491fN9j79n7L87j09p9N8J7K3k32JJ90J65k6k02J58k29RQ5N5o0l23M14k5l13o
2517b25J23Q4j7k16J34L82l08m4K12J41l15n7L49l62K15J20l7j51j92L02o7J47
2539B18l94K39J40l67m8M6O1J02k77J40J50j54P0K4k5j26J30J93p4r9P2j00K88
$$ plain form
2562 209 -192 49 95 54 -55 68 157 8 20 -15 14 -191 101 -112 -11 -282 -74 -226 -79 -285 45 -9
2584 -9 -90 -54 -95 15 -59 -125 -80 70 58 30 133 157 190 167 173 -164 114 -94 207 164 175 230 -70 160 -17 -19 -133
2611 -133 -128 38 13 28 -89 -260 -68 13 12 111 118 -318 126 -119 210 -101 114 88 126 148 170 100 79 43 19 180
2637 180 68 -42 -319 55 27 24 -124 -86 -58 -98 -65 -198 -49 -25 -9 -120 5 19 67 232 158 -47 -94 -179 158
2662 158 159 231 59 290 -33 249 55 -21 226 68 91 77 -247 -183 53 -165 -143 267 -42 -6 -122 72 191
2685 191 -219 116 -36 -119 48 136 154 -36 -18 179 -249 18 -195 -19 196 -240 -121 -135 177 -144 -154 -294
2707 -294 0 -28 -248 80 -146 -10 -85 -208 -250 1 76 297 85 120 58 4 143 37 137 1 84 -7 211
2730 211 102 96 -84 100 59 85 -12 -106 127 -129 -189 -45 230 67 -113 -180 115 -160 144 118 -172 177 -57
$$ packed form
2562B09m01K41M6m1j09J23Q9j49J2l5K9k05K92k13J01k71K08j52J47k06L30n4
2584iq1L6m1J10p4o6M5J50j2k8J03K4L3k3Ol37K78k08L01m3J1N5l00K30j77kj14
2611a33NJ66k5J5j17j71J92Q1jR9Pm36M44k45L29l11K15k6L8K2K2p0k1l6k4J61
2637A80j12j10k77L74k8lj48L8K8m0L3j33J49K4J6j11J25J4M8J65p4k05m7q5L37
2662A58JP2j72K31l23K82j94p6K47j58K3j4l24O4K36k18K2M10l09L6j16J94J19
2685A91m10L35j52q3J67Q8J8j90J8J97m28K67k13J76K15m36J19j4L12l21j0j40
2707b94K94k8k20L28k26J36p5j23m2K51P5K21k12L5o2n4J39j06J00j36Q3r1K18
2730B11j09oj80J84m1K6r7r4K33k56o0J44K75j63j80o7K95k75L04k6k90L49k34
$$ plain form
2753 -57 57 224 125 145 323 108 1 -24 64 203 -198 96 67 -201 -25 -4 -184 -399 -192 -38 -127 -87 -204
2776 -204 -208 -159 161 -48 -155 -136 52 -17 267 146 -105 186 -176 149 -136 101 68 147 146 204 32 76 -264 15
2800 15 316 -133 67 -169 -105 -75 50 -48 178 10 -18 76 26 169 -9 -102 43 119 -98 136 -127 274 36
2823 36 239 170 -147 -29 164 127 222 200 -106 51 28 -235 -231 -202 -56 -236 11 -93 -266 -210 55 -36 -182 306
2847 306 2 95 -100 252 -133 -81 178 198 -29 92 -137 -105 164 -229 -220 8 367 91 -176 139 -59 -63 -105
2870 -105 -115 -132 -52 -240 -9 -131 173 172 -64 95 107 -105 62 156 165 209 27 -66 0 118 13 111 -90 189
2894 189 111 112 -58 17 153 15 -128 -43 10 41 -211 -29 -3 -4 -43 60 -40 -412 70 131 66 135 -104 91 98
2919 98 -121 -98 278 -72 -239 45 218 -17 -88 -123 27 -64 -142 31 -153 -48 -123 154 -184 -64 -158 122 130
$$ packed form
2753e7J14J67r9K0J78k15j07k5Q8J39m01K94k9k68J76K1j80k15K07J54q9M0j17
2776b04mM9L20k09j07J9J88o9K84j21k51K91l62L25k85K37l3P9jN8j72M4l40K79
2800A5L01m49K00k36O4L0J25r8K26j68k8R4n0J43j78r3J45P6k17K34k63M01k38
2823C6K03o9l17J18J93l7R5k2l06J57k3k63MK9J46j80K47j04j73N6K65r1j46M88
2847C06l04R3j95L52l85N2K59K0k27J21k29L2K69l93RK28L59k76k67L15j98mm2
2870a05j0j7Q0j88K31j22L04jk36J59J2k12J67R4RM4j82r3O6J18j05R8k01K79
2894A89p8Jj70P5J36j38j43Q5N3L1k52J82K6jl9J03j00l72M82O1o5O9k39J95P
2919I8k19K3L76l50j67K84J73k35p1l5J50r1p8J73j84J05p5K77l38J20r4K80Q
$$ plain form
2942 130 -85 188 255 88 -15 12 -20 -87 7 -106 -20 71 183 -75 -105 -372 1 -81 89 217 -145 -144 125 -156
2966 -156 -155 -50 -110 55 -79 -90 -299 -223 -99 -19 221 -234 153 -92 320 13 -17 350 256 -72 196 322 -76
2989 -76 -66 29 144 119 32 147 313 -225 -154 -88 18 -98 -350 47 3 -173 206 147 -84 -196 199 244 110
3012 110 -107 -184 0 -202 97 86 -110 -226 -71 138 16 170 75 229 -93 -140 88 -58 49 -148 -158 -125
3034 -125 -42 -335 -8 -52 -75 54 11 -27 2 7 -48 91 -39 267 71 -96 28 221 -130 -1 -125 -41 -59 10
3058 10 128 -75 8 -80 187 -210 32 -114 -126 160 28 -219 -52 21 -84 99 -71 265 -312 4 58 66 197
3081 197 285 43 -59 229 -158 -65 -104 -100 -76 -129 -134 -269 -32 -24 159 -237 -333 50 -204 -323 6 120 62 -110
3105 -110 145 135 -22 -69 82 110 41 78 146 75 -42 86 147 -51 47 306 -49 14 23 -2 44 -95 18 -156 -77
$$ packed form
2942A30k15K73O7j67j03K7l2o7R4j13Q6R1J12k58l0k67L73q2J70J28l62JK69k81
2966a56JJ05o0J65j34j1k09P6J24Q0K40m55L87k45M12l07l0L67r4l28K68J26l98
2989g6J0R5J15k5q7J15J66n38P1O6J06j16k52L97m4j76L79n9k31j12L95M5j34
3012A10k17p7J84k02K99j1j96j16J55K09j22J54r5J54l22m7K28j46J07j97j0L3
3034a25Q3k93L27m4k3J29m3l8K9Nn5J39j30L06j96j67J24J93l51J29j24Q4j8O9
3058A0J18k03Q3q8K67l97K42j46j2K86j32k47J67P3j05J83j70L36n77L16N4QJ31
3081A97Q8k42j02K88l87R3l9MK4n3nj35K37QJ83l96r6L83k54j19L29J14n8j72
3105a10K55j0j57m7J51K8o9L7O8p1j17J28O1j98R8K59l55O3Rk5M6j39J13j74P9
$$ plain form
3130 -77 -179 134 -85 150 33 200 216 -122 -243 75 -5 101 108 64 -123 148 -12 173 207 182 216 192 -8
3153 -8 -197 -59 134 113 140 -46 -50 -105 -188 -78 50 201 94 -181 -208 22 -62 -197 -352 -66 70 -80 272
3176 272 4 88 223 17 93 177 87 -63 125 0 -60 87 107 -248 -136 -171 71 -61 -314 24 16 -210 29
3199 29 224 2 -36 -82 195 -168 -110 115 77 24 63 -250 -12 27 -153 -3 -36 200 -12 -166 -45 -29 -70 107
3223 107 -190 -22 12 -92 -50 -127 -153 -161 234 24 -163 40 165 -80 137 -69 -159 147 193 35 20 96 68 141
3247 141 97 113 119 172 28 -75 227 -138 -60 117 -92 -165 107 -17 231 -59 69 216 25 -37 123 21 55
3270 55 -229 -252 -88 95 39 -48 235 35 2 155 -71 -122 123 39 -134 112 -266 4 -87 27 -21 -58 -152 -148
3294 -148 -195 24 153 251 -173 -120 122 -94 46 19 17 71 74 -284 -272 38 128 -11 90 188 114 -152 20 117 302
$$ packed form
3130g7j02L13k19K35j17J67J6l38j21L18q0J06Pm4j87K71j60J85L4k5L4k4k00
3153hj89J38J93k1K7j86mn5q3J10J28J51j07k75k7K30q4j35j55K86J36j50L52
3176B72k68Q4J35k06P6Q4r0j50J88j25o0J47K0l55J12l5K42j32k53L38qk26K39
3199B9J95k22l8m6K77l63N8K25l8n3L9l13K38L9j80J50l3K36k12j54J21J6m1J77
3223A07k97J68L4j04M2p7k6qL95k10j87K03J25k45K17k06r0L06M6j58j5P6k8P3
3247A41m4J6ON3j44j03L02l65P8J77k09p3K72j24K48k90J28J47j91o2J60j02L4
3270E5k84k3J64J83n6q7K83k00l3J53k26n1K45q4j73K46l78K70r1J14m8l7r4M
3294a48m7K19J29R8m24N3K42k16J40k7kN4Ll58J2L10R0j39J01R8p4k66J72R7J85
$$ plain form
3319 302 -43 -218 147 -35 -168 -246 154 -67 112 1 -339 -180 158 -204 -106 -88 -54 -22 -92 -27 205 -15
3341 -15 57 -64 127 -254 -31 121 -124 -36 -22 -190 68 -83 2 84 -229 -28 -246 222 46 -197 -138 -207 14
3364 14 -138 23 -57 13 269 232 95 75 96 -355 -107 -52 12 79 -78 14 175 -24 40 169 -157 -74 -318 -127
3388 -127 -19 -25 -154 42 -196 -279 -90 110 -103 -123 -99 129 -7 151 114 144 116 -107 59 -131 -173 -128 50
3411 50 343 156 79 222 87 100 22 191 1 61 -106 -399 -17 -227 -21 73 39 -67 157 17 71 138 197
3434 197 -23 12 -222 -103 299 12 26 -85 177 -12 98 139 -5 33 -229 5 -12 -152 -111 -117 -316 28 -46
3457 -46 22 -176 -184 -42 152 -135 191 264 -199 178 -233 -83 -173 -200 -122 37 120 -98 76 14 -99 -99 21 -60
3481 -60 -167 87 -99 -8 122 -128 63 -83 412 301 -123 197 -125 164 190 -36 -198 -23 116 158 243 76
$$ packed form
3319C02l45j75L65j82j33p8M00k21J79j11l40J59L38l62R8J8L4L2p0O5K32k20
3341a5P2j21J91l81K23J52k45Q8J4j68K58j51Q5Q2l13K01k18M68j76k43N9o9K21
3364A4j52J61q0P0K56l7j37k0K1m51K48N5O4O7j57R2J61j99O4J29l26Q3k44J91
3388a27J08oj29J96k38q3J89K00k13k0K4K28j36J58l7L0k8k23J66j90m2M5J78
3411E0K93j87p7J43j35J3p8J69j90O0j67k93L82k10K06R4l4j06K24j40N4O7N9
3434A97k20L5k34J19M02k87J4j11K62j89J10M1j44L8k62K34j7j40M1oj99L44p4
3457d6O8j98qJ42J94k87L26P3m63L77m11J50r0k7P8J59Q3k18J74o2j13%J20q1
3481f0j07K54j86R1J30k50J91j46M95j11m24L20l22K89K6k26j62J75J39M2Q5j67
$$ plain form
3503 76 246 103 -225 -5 6 -187 -84 127 264 -92 -53 135 26 140 -62 -29 -120 -25 65 -27 1 33 289
3526 289 214 -26 -134 98 -50 -71 -115 99 -50 95 3 -41 -174 -116 86 -295 -13 -44 -177 -248 -132 -62 -213
3549 -213 -125 -39 -45 -22 68 11 193 -165 24 5 -2 64 -25 -98 215 291 -1 -34 159 -169 280 -115 -100 -73 -95 -15
3575 -15 -48 -182 211 125 220 -31 161 114 172 34 19 -76 -33 201 162 88 193 70 330 22 -265 -42 221 -72
3599 -72 -3 18 155 60 92 -183 -45 244 74 31 63 55 -105 53 -112 -121 205 -133 -97 -188 19 151 15 -11 -216
3624 -216 -78 371 14 78 50 -41 -59 -185 98 -72 20 4 -20 21 -214 -80 -340 -31 65 -80 -89 -38 -6 -141
3648 -141 -183 99 -67 -83 -65 -113 -101 -59 182 66 -57 215 -34 183 -142 -172 293 -45 -142 30 170 163 67 3
3672 3 21 282 -226 96 167 -39 -27 40 -65 69 -80 -49 -2 -161 19 6 -217 150 180 -29 -34 38 223 70
$$ packed form
3503G6J70j43l28K20J1j93J03K11J37l56L9J88j09J14k02L3r1R5R0r2K8L2K56
3526B89p5k40j08K32j48k1m4K14j49J45r2m4j33N8K02l81K82l1j33p1J16P0j51
3549b13Q8Q6oK3R0n7J82l58J89j9pO6q9p3L13P6k92l3J93l28M49l95J5K7k2Q0
3575a5l3j34L93q6R5k51J92m7N8j38j5r5M3K34l9p4J05j23K60l08k87K23K63k93
3599g2O9K1J37r5L2k75J38K89j70m3L2qj60J58j65rL26l38L6r1K07J32j36k6k05
3624b16J38M49l57O4k8r1j8j26K83j70R2j6k4M1k35J34k60L09R6j45rN1L2j35
3648a41m2K82j66j6J8m8J2M2K41j16j23K72k49K17l25l0M65l38r7J72J40pr6o4
3672CJ8K61n08L22P1k06J2O7j05J34j49L1M7j59J80j3k23L67L0k09nP2J85j53
$$ plain form
3696 70 173 -49 257 65 -368 -201 205 243 103 58 -15 235 66 -47 -201 -52 -121 -167 -86 -52 -29 154 259
3719 259 -28 -103 -20 -75 -144 69 -287 -151 28 -100 -104 -104 181 119 160 -54 283 167 186 171 181 -168 -75 -110 -208
3744 -208 199 -182 36 63 60 -26 40 56 84 -125 -100 47 -1 -12 24 -140 -26 -50 104 -66 -119 133 -140 73
3768 73 71 -99 -246 122 144 -156 -56 -12 -176 -16 -33 -217 130 -205 88 -150 69 -154 -215 -193 -154 212 -14
3791 -14 185 -48 200 4 266 169 -226 -8 13 -38 198 -76 43 102 55 -33 -269 100 -86 83 85 -33 68
3814 68 -196 -15 -125 64 77 62 106 -341 317 22 177 12 -51 -58 -31 -38 138 -90 154 3 189 20 -120
3837 -120 -225 75 61 -143 -70 -92 -162 -224 -298 105 -100 213 -59 250 -162 -198 -264 211 15 -98 -12 -34 -153
3860 -153 341 152 -226 142 -54 -97 -300 -64 -117 -3 136 71 -4 -51 -141 168 -115 -162 -27 -149 199 318
$$ packed form
3696G0J03k22L06j92m33J67M06L8j40m5p3K50j69j13j54J49o9m6Q1L4K3J83J05
3719B59k87p5Q3n5o9K13l56J36J79j28m%K85o2M1k14L37j16J9j5J0l49R3l5r8
3744b08M07l81K18K7lq6O6J6K8k09K5J47m8j1L6j64J14k4J54j70n3K52k73K13
3768G3kj70j47L68K2l00J00M4j64J60j7j84L47l35K93k38K19k23o1K2L9L66k26
3791a4J99k33K48j96K62r7l95K18K1n1K36k74J19N9m7q8k36L69j86J69Kj18J01
3814F8k64J81j10J89J3j5M4m47O58k95J55j65o3pK7pJ76k28K44j51J86j69j40
3837a20j05L00j4k04P3k2p0o2p4M03k05L13k72L09m12l6o6M75j96j13Q6k2j19
3860a53M94j89l78L68j96m3k03K36n3J14J39o5p5m7r0L09k83m7J35j22L48J19
$$ plain form
3882 318 12 -25 7 238 -79 324 -72 186 -113 66 133 -129 -10 -85 -53 173 36 -83 -148 46 -70 161
3904 161 -75 162 -62 161 11 -23 112 19 -127 57 53 104 217 94 27 167 85 17 -12 18 -35 -98 -111 178
3928 178 42 140 -191 126 143 42 166 -292 -161 142 132 -103 -73 147 42 2 10 152 121 111 98 -57 -63 218
3952 218 126 -1 25 -93 -107 7 -142 96 7 -148 -339 18 36 141 -213 33 -10 -171 98 -21 -78 -7 -167
3975 -167 -202 -98 145 51 33 -46 52 110 22 -27 61 280 228 -35 -112 -197 60 56 131 127 82 169 49 -90 -30 63 -198
4002 -198 25 -11 -114 -53 24 -46 -235 -27 28 -157 -98 -55 79 254 20 216 -183 204 15 -172 105 -77
4024 -77 3 -140 -221 229 -87 162 -179 -270 169 -128 -197 58 -39 113 -122 -100 -35 105 -46 146 -45 -55 -207
4047 -207 3 69 78 65 -91 63 52 117 113 103 -61 -19 69 -12 8 -2 20 -94 243 -109 -178 50 49 -151 2 -105
$$ packed form
3882C18l06l7L2K31l17M03l96K58k99J79O7k62J19p5L2K26j37j19o5J94j16K31
3904A61k36K37k24K23j50l4J35r3j46J84mN1J13j23o7J40q2o8k9L0n3o3j3K89
3928A78j36R8l31L17J7j01J24m58J31L03j0k35L0K20j05m0QJ42l1j0j3j55oK81
3952B18r2j27K6j18j4J14j49K38q9j55j91L57J8J05l54K46m3j61K69j19n7P1j60
3975a67l5J04K43r4j8p9R8N8q8m9Q8K19n2k63p7q5K57mP5mm5Q7j20j39O0R3k61
4002a98K23l6j03O1P7p0j89K08N5j85N9M3J34J75k34J96l99L87j89j87K77j82
4024g7Q0j43q1M50l16K49l41r1M39k97o9K55r7J52k35K2O5J40j51J92j91j0j52
4047b07K10O6Rj3j56J54j1O5mj0j64M2Q8q1K0j0K2j14L37l52o9K28jk00J53j07
$$ plain form
4073 -105 -116 81 33 33 153 -158 -149 92 39 127 311 95 5 -148 205 -111 -223 320 -19 119 -54 32 177
4096 177 -110 -205 -43 54 -17 -174 162 -267 46 140 -87 -123 184 78 86 174 -245 97 169 75 -284 -73 16 229
4120 229 -52 117 58 375 76 183 -75 -236 46 -95 -179 -122 -103 -158 -104 50 218 -116 53 265 86 9
4142 9 -27 232 119 22 226 20 -55 -23 20 -16 126 178 -227 -70 101 -110 -176 -130 -41 -278 -133 -120 202 25
4166 25 -256 -122 -228 -200 -84 -121 -21 -284 102 42 -232 276 63 232 227 34 -5 -222 315 151 125 180 16
4189 16 58 20 -136 -45 80 -24 -113 62 50 -139 -23 -15 50 -14 18 -7 89 70 54 -46 72 -102 -161 58 213
4214 213 -116 -283 5 162 -79 102 73 -203 -203 -153 -119 286 79 142 -268 138 -53 -61 -271 -38 66 211 100
4237 100 -37 97 32 99 -85 -84 -56 -58 65 28 -213 -65 128 -83 106 21 -24 -32 -160 5 279 -111 -40 -186
$$ packed form
4073a05j1J97m8%J20l11RK41n3Q8J84k16r0j53L53l16j12N43l39J38j73Q6J45
4096A77k87r5J62R7p1j57L36m29L13R4k27l6L07j06QQ8m19L42P2r4l59K11Q9K13
4120B29k81J69n9L17k99J07k58j61K82j41q4N7J9n5N4J54J68l34J69K12j79p7
4142Il6K59j13r7K04k06p5L2M3l6J42N2m05J57J71k11o6M6Q9k37J45J3L22j77
4166B5k81J34j06K8J16l7J00k63L86o0k74N08k13J69nj93l9k17N37j64k6N5j64
4189A6M2l8j56R1J25j04q9J75j2j89J16QO5o4L2k5R6j9j6j00J18j74n9K19J55
4214B13l29j67K88J57k41J81k9k76%N0L4M05k07O3m10M06j91qk10K33J04J45j11
4237A00j37J34o5O7j84JK8kJ23l7k41J48J93k11J89q5m5qj28J65K74l90P1j46
$$ plain form
4261 -186 -51 -213 -198 185 81 15 11 -169 48 120 -64 70 84 159 13 -67 -58 -10 -167 100 -123 -146 53 -81
4285 -81 2 55 22 -46 20 37 -30 -56 -77 -16 126 -59 -172 -266 -174 -12 -93 22 3 -3 40 171 37 35 43 246 -100
4312 -100 207 204 228 -40 197 140 -190 -42 -56 284 38 -260 -33 -136 -3 -277 171 -13 -317 -141 -86 -116
4334 -116 86 60 -59 -143 -28 83 -257 243 19 333 76 160 158 144 145 252 -71 136 -285 156 -236 143 243
4357 243 -254 -150 -75 62 -235 96 66 -179 -218 157 158 54 -92 -128 31 213 -74 -113 -24 -64 152 102 -76
4380 -76 -54 174 34 141 541 -142 88 -40 -49 77 -22 -56 0 -331 40 -99 -139 37 -34 -254 -86 -132 6
4403 6 5 -108 -72 -70 159 74 103 -135 -214 -145 113 28 18 -47 -68 161 61 137 -24 60 89 -153 77 -37 -7 82 51
4430 51 138 -119 52 72 25 -56 47 101 131 9 138 51 154 96 102 49 161 -20 5 -119 49 -144 56 -6 -223
$$ packed form
4261a86J35j62J5L83j04o6mj80K17P2j84J34J4P5j46q0RM8j57K67k23k3J99j34
4285h1Q3N3l3o8O6J7o7k6k1O1J42j85j13r4R2J62q1J15j9oM3J31j34kQK03l46
4312a00L07lK4k68K37n7l30J48j4L40k46k98K27j03J33k74M48j84l04J76N5l0
4334a16K02k6j19q4J15J11l40N00k24L14k57Q4kj4JJ07l23K07m21M41l92L79J00
4357B43m97J04P5J37k97L31l0k45l9L75Jj04j46l6J59J82k87l9Q9m0K16n0j78
4380g6K2K28j40J07M00o83K30j28rJ26r9l4N6l31L71j39m0J76p1k20J68m6J38
4403Fjj13L6KK29q5K9k38p9O9K58q5j0o5k1K29j00P6j61Q4K9k42K30j14L0Q9l1
4430E1Q7k57J71K0m7q1J03N4L0j22J29q7J03n8On3J12j81K5j24J68j93K00o2k17
$$ plain form
4455 -223 129 65 -159 -121 -210 -77 -70 197 61 51 29 164 3 -36 -64 -11 226 -120 47 -51 43 78 117 -37 -60
4480 -60 -32 161 -83 -195 -98 -211 -77 -104 -69 34 137 -138 -101 132 -163 39 -113 -98 53 91 126 -33 175
4503 175 -9 -182 131 -28 31 46 200 -139 41 100 -176 -108 -144 64 61 -84 -83 -17 -101 -183 81 -24 -252 133
4527 133 49 -5 -14 -19 247 372 -165 -210 208 -145 -113 -64 194 -35 -60 -80 236 383 -78 -19 -229 -320 -72 123
4551 123 -3 260 -174 -69 -24 31 103 126 148 8 72 -152 60 -314 -248 -323 -142 -101 45 26 -95 99 -154
4574 -154 -23 11 223 88 -45 -131 -182 38 119 144 -127 -70 107 46 259 41 -42 38 -325 -24 199 -24 65
4597 65 -33 53 -88 141 -104 -226 -15 -72 31 130 73 -89 -60 128 26 37 -232 -34 -256 81 116 -131 -97
4620 -97 26 -208 3 84 -12 -106 -243 -219 91 117 143 240 167 -67 42 55 228 96 86 -83 57 158 17 312
$$ packed form
4455b23L52o4k24L8q9J33PK67j36j0k2J35j61l9k8N3K37l46J67r8R4L5L9j54k3
4480f0K8J93k44j12R7j13J34k7L5J03J03k75L7K33k95K02j52J5J51L8L5j59K08
4503A75j84j73L13j59N9J5J54l39J80N9k76O8l6K08lj45JO6q4q2K64j05k28L85
4527A33q4n4rnK66J25n37m5M18l53L2M9K58k29k5k0L16J47m61N9k10r1K48J95
4551A23j26K63m34J05M5N5P2K3K2j40O4k24K12l74O6p5J81M1J46j9j21J94k53
4574a54J31L4K12j35j33q6n1K20Q1K5k71N7J77o1K13k18q3Q0l63L01K23k23Q9
4597F5r8Q6j41K29k45j22K11n7J03R9n7j62K9J88j02J1k69J98k22L37L5k47L4
4620i7J23k34K11Q1r6r4j37K4L10K6K6R7p3k34J09J3J73j32j0j69J40J01j41K95
$$ plain form
4644 312 72 -63 -46 -58 -111 69 23 151 -50 79 176 -150 1 -49 9 98 -207 -86 -65 -26 -202 80 94 -75
4668 -75 157 -268 241 -49 -132 14 39 -148 37 111 -63 62 129 70 -22 -44 70 3 -59 78 36 -97 -152 -24
4692 -24 -2 31 107 91 95 42 82 117 -2 92 335 -106 260 61 111 54 -276 -71 -85 -86 101 97 -21 -27 -97 9 -120
4719 -120 -21 -37 164 -40 105 287 181 263 133 128 -147 141 338 -52 248 142 -182 107 -325 -93 151 -32
4741 -32 -147 -18 172 20 139 -6 -139 -141 -35 4 -189 -181 49 153 125 -38 -87 3 251 -124 114 4 -111
4764 -111 35 -23 -24 -235 -22 -135 -214 63 11 -113 75 -19 -14 -35 226 -139 -178 -21 -40 77 -119 -41 183 140
4788 140 -116 -138 -87 -56 -66 -29 102 -241 -5 173 -22 45 198 9 -61 150 67 -14 -62 3 -268 38 93 89 33
4813 33 224 -53 91 -37 46 18 38 -88 160 -162 -9 65 20 -161 266 220 -16 258 79 115 -43 -26 -191
$$ packed form
4644C12k40j35J7j2n3J80m6J28k01J29R7l26J51n0N8Q9l05J21K1L9j76K82J4j69
4668g5K32m25N09k90q3J46K5j87J85P4j74J25O7n9r2k2J14o7o2J37m2j33n5J28
4692b4K2L3P6j6Mn3M0L5j19R4K43m41L66j99N0n7l30K05j4jJ87mj18op0J06j29
4719a20R9j6K01k04J45J82j06Q2j30nk75K88J97l90L00j06l24K89m32K32K44j83
4741c2j15J29J90j52J19j45j33kJ06L9j93QK30J04k8j63m9R0K48l75K38j10j15
4764a11J46n8jk11K13j13p9K77n2j24J88r4Nk1K61l65l9J57j9J17j96P8K24m3
4788A40k56k2N1L1j0L7J31l43K36J78j95O7J53j89p0K11q3q1m8O5k71L06N5mn6
4813C3J91k77J44j28Q3k8K0j26K48l22J53P4m5j81M27m6k36K74j79L6j58J7j65
$$ plain form
4836 -191 -100 27 53 178 -45 149 242 -236 27 -130 3 -11 98 74 -100 -292 -86 -75 -40 -219 67 -113
4858 -113 193 8 -64 5 272 -188 -2 -128 -75 -48 -40 279 -41 150 -65 -105 53 100 28 -135 -40 189 -207
4881 -207 -53 -9 74 22 190 128 168 10 -17 77 2 132 82 -177 116 274 57 -79 48 167 7 107 28
4904 28 -21 -14 29 -73 239 179 213 43 -83 166 -51 95 -186 138 177 35 172 -77 102 68 91 -45 -59 -131
4928 -131 -195 -150 101 75 3 54 -149 -215 -1 -344 -271 -150 -100 -161 92 7 120 -81 -223 62 174 -49 22 165
4952 165 -42 167 -77 17 410 87 -256 140 -195 175 -108 56 21 -41 225 122 38 144 -11 102 -234
4973 -234 -13 123 36 99 -47 -30 -48 16 -108 77 113 70 -136 13 -38 -8 -363 74 -9 -52 143 73 21 48 61
4998 61 -2 -211 30 93 49 18 -8 330 -1 -266 -211 -190 37 85 -19 175 -175 144 -164 -91 213 -187 -159 -136
$$ packed form
4836a91R1J27K6J25k23J94R3m78K63j57J33j4J09k4j74j92K06J1L5j79K86j80
4858a13L06j85p2O9K67m60J86j26N3K7QL19l20J91k15m0J58M7p2j63R5K29l96
4881b07J54M4Q3n2J68o2M0j58k7R4p5J30n0k59K93J58k17j36J27J19j60J00p9
4904B8m9PM3j02L12o0L4j70j26K49k17J46k81L24L9j42J37k49J79l4K3j36j4p2
4928a31o4M5K51k6p2N1k03o6K14l43P3J21N0o1K53q5J13k01j42K85J12k23P1J43
4952A65k07K09k44R4L93l23l43L96l35L70k83J64l5o2K66j03q4J06j55J13l36
4973b34K21J36q7O3j46J7j8O4j24J85L6m3k06J49n1L0l55M37q3m3J95p0n2K7J3
4998F1o3k09K41O3m4l1k6L38l31k65N5K1K27M8j04J94l50L19l08P3L04m00K8K3
$$ plain form
5022 -136 -61 -57 -69 -207 72 -26 -231 186 -181 -251 1 165 76 -141 123 18 255 -153 116 -35 91 -42
5044 -42 -56 89 333 184 -201 226 152 -91 -30 -139 -64 -12 79 -103 6 83 -103 -74 -208 -18 -38 86 -229
5067 -229 36 29 94 108 109 -18 180 93 -214 -145 13 251 -76 -113 -52 -132 166 193 115 151 -49 73 299 -218 130
5092 130 -63 -67 -232 -209 -2 -58 -31 -121 -297 178 175 36 26 148 -90 86 -99 67 -5 76 90 152 4 54 -13
5117 -13 -16 187 -1 229 -111 378 -26 -39 236 28 -30 -97 -85 -174 -109 182 -24 -115 -172 102 33 106 60 -25 -74
5142 -74 -97 -187 -68 162 23 -196 -103 34 -22 -24 42 223 134 -179 -75 16 -93 76 15 -149 -81 -82 -163 -15 -20 134
5168 134 -298 77 208 -296 -76 -76 -15 0 246 -138 262 105 28 162 -90 -1 6 163 69 -82 190 117 -218
5191 -218 -225 19 -50 -80 -33 -25 -152 -33 97 -44 -222 87 -91 -85 -66 104 -179 -227 194 82 162 341 -8 63
$$ packed form
5022a36P5Mj2j38K79r8k05M17l67p0K52J64q9k17K64j05K37m08K69j51J26j33
5044d2j4J45K44j49l85M27p4k43O1j09P5N2R1j82J09P7j86K9j34J90k0J24l15
5067b29K65pO5J4Jj27J98q7l07O9J58K38l27l7O1q0K98K7p8L6k00J22K26n17L48
5092A30j93mj65K3K07n6K7r0j76M75lj39j0J22k38J76j85J66p2Q1J4O2j48N0o7
5117a3lK03j88K30l40M89m04j3K75k08n8o7J2q9O5K91k06r1n7K74o9P3m6q5m9
5142g4k3r0J19K30j39k19R3J37n6kO6J81q9l13J04R1j09J69o1j64O8jq1J48nJ54
5168A34m32L75J31n04K20%O1J5K46l84M00j57p7J34k52Q9PJ57r4j51K72p3l35
5191b18pK44o9l0M7Qj27J19J30j41j78L09j78OJ9J70k83m8M21j12Q0J79l49P1
$$ plain form
5215 63 -144 66 -146 111 -220 217 271 86 -24 66 -61 -166 -38 67 59 89 -80 67 20 -19 130 112 -293
5238 -293 148 144 -81 159 50 122 -47 233 22 159 -236 38 -65 -116 46 128 8 158 24 -2 44 171
5260 171 282 71 168 -218 53 -88 -11 65 177 179 -157 -142 0 -114 13 67 -56 -163 246 36 116 99 -268
5283 -268 -172 -47 -72 103 144 -308 -210 -10 48 -238 38 -159 127 18 35 51 -15 -59 -6 -64 151 -45 75 160
5307 160 217 36 -20 71 65 86 253 110 4 41 68 -227 192 -89 -291 91 -411 18 -130 -98 22 183 21
5330 21 105 122 -154 72 -201 15 89 6 -205 174 -192 210 -102 -149 136 -226 -14 -11 24 -95 -157 216 80
5353 80 -309 -98 -141 -83 -100 36 63 24 -236 165 266 -13 203 67 277 -127 61 -18 144 -136 17 -113
5375 -113 312 -96 128 114 68 22 10 -188 -185 101 152 -16 -436 -12 -33 149 74 -145 -194 64 74 62 -41 -114
$$ packed form
5215F3k07K10k12K57l31M37N4j85j10R0j27j05J28J05qL0j69J47m7l9J49j8m05
5238b93M41mk25K40j09P2j69K80k11J37l95K74j03n1J62Q2j20J50j34k6M6J27
5260A71J11k11R7l86K71j41P7P6J12Kl36J5J42j14J27N4j23j07M09k10Q0j7l67
5283b68R6J25k5J75M1m52R8K00N8k86K76j97K86j09J7J6o6m4N3n8K15j96J20Q5
5307A60N7j81n6R1oK1J67j43j06L7K7k95M19k81k02L82n02M29j48L2J20J61j62
5330B1Q4J7k76K26k73K16P4q3k11L79l66M02l12m7K85l62K12LL5j19o2L73j36
5353H0l89K11m3N8j7J36K7l9k60M01J01k79K16j36K10m04J88p9J62k80J53j30
5375a13M25m08K24j4m6m6j2j98LK86N1j68m20M24k1J82p5k19m9K58J0j2j03p3
$$ plain form
5399 -114 14 -167 201 -15 -20 48 -10 59 11 -140 140 -39 -43 101 24 25 207 -56 191 -139 -41 105 22 -130
5423 -130 -118 -86 -170 -62 -125 42 -244 -198 4 -61 -76 59 128 57 32 143 -67 -120 218 53 -49 -97 172 35
5447 35 -37 -110 177 -104 -46 123 -253 -127 17 144 -68 -171 -325 -15 319 88 192 -45 298 91 17 -164
5469 -164 3 -23 -140 -97 127 59 -39 11 -282 31 183 97 214 278 -228 -67 -215 -272 32 38 -275 -300 -39 -24
5493 -24 29 165 -233 -108 -77 65 403 53 278 37 45 -146 -120 202 -19 -69 -67 134 -173 -153 -62 63 179 19
5517 19 155 196 91 -142 -132 -32 90 -92 219 44 63 144 167 -66 67 181 252 132 -25 114 77 46 -210
5540 -210 -29 -40 360 -36 -8 106 -55 32 -147 -121 -208 9 33 -85 180 16 -108 229 -149 -26 -127 -174
5562 -174 -11 23 -71 193 -72 -258 28 -142 70 -153 246 188 -1 -100 -69 -13 -244 -61 -170 -59 -224 -105
$$ packed form
5399a14J28j81L68k16nO8n8O9m8j51K80j79mJ44p7JJ82k63K47l30R8J46q3j52
5423a30J2L2q4J08o3J67k86M6K02o5j5J35O9p1k5J11k10n3L38j65j02m8K69j37
5447C5p2p3K87k81N8J69l76J26J44J27k12j03j54L10L34k31J04k37L43k07p4j81
5469a64J67k6j17M3K24o8r8N0k93L13J52q6J17O4n06J61j48n7L04Ol13k5K61J5
5493b4N3J36l98J25L1J42L38l50K25k41Qj91K6L22k21n0KK01l07K0R1J25J16j60
5517A9J36M1j05k33J0J00J22j82L11j75J9Q1K3k33J33J14P1j20j57J39l7l1k56
5540b10J81j1M00l96K8J14j61Q7j79K6q7K17K4j18K65j64j24L37l78J23j01m7
5562a74J63L4r4K64k65j86K86j70K12k23L99n8j89r9L1N6k31J83j09J11j65J19
$$ plain form
5584 -105 94 136 -88 -32 52 -62 -4 -4 266 -78 -28 -240 -211 33 71 -76 238 213 12 120 87 214 199 80
5608 80 -196 -273 123 -57 248 -116 186 -298 -108 -4 57 -119 -211 -140 -208 -6 85 -15 -224 -36 -188 109
5630 109 -140 -183 -44 -166 74 152 53 113 154 -38 19 -34 240 255 -96 -104 -94 -40 66 -22 85 -144 146 151 103
5655 103 -157 14 190 -175 -179 -140 -8 82 -187 -154 -27 258 142 -149 249 66 -239 -204 -195 -314 133 192 69
5678 69 136 -122 -66 -171 93 -16 168 68 -171 -147 65 -132 70 22 142 -36 -58 92 -187 61 15 -18 31
5701 31 -219 155 -123 25 -117 96 149 -5 69 9 -194 -301 -21 54 57 122 170 117 278 29 56 -125 155 45
5725 45 -160 -79 3 18 238 -103 233 2 253 -5 -96 52 -203 196 -140 169 -67 -44 -47 94 -208 201 -14
5748 -14 -114 13 14 100 403 -367 -113 13 62 -67 116 -122 -16 -79 -28 -122 -118 -38 145 90 -35 -198 -55 94
$$ packed form
5584a05J99M2k24N6Q4j14N8%K70l44N0k12K9K44L8j47L14k5k01J08l3J27j5j19
5608H0k76p7L96j80L05l64L02m84J90J04O1j76r2P1o8K02R1j00k09J88j52K97
5630A09k49m3J39j22K40P8r9O0M1j92N7n3K74J5l51qJ0N4J06q8J07k29K90Nm8
5655A03k60J71J76l65mL9J32R0k69L3J27K85j16k91L98j83l05L5Rj19M47N9j23
5678F9O7k58N6j05K64j09J84j00k39K4K12j97K02m8J20j78k2J50k79K48m6l3M9
5701C1k50L74k78J48j42K13N3j54P4o0k03j07K80P5LO5M8n3J61k49K7j81K80j10
5725D5k05Q1Q2J5K20l41L36k31K51k58r1J48k55L99l36L09k36K3lJ41l02M09k15
5748a4j00J27JQ6L03p70K54J26M9j29J83k38J06o3N1r4MQ0J83n5j25j63J43J49
$$ plain form
5772 94 60 33 -61 17 -138 -212 -169 40 37 103 -77 64 -14 -71 29 0 -122 99 -110 111 -23 -114 -197 -36 -147
5797 -147 12 83 162 39 -46 -59 -57 143 -220 -20 -157 75 12 -28 210 105 -45 127 -44 259 66 -157 29
5820 29 -222 7 154 -29 101 183 -69 29 14 63 -27 61 -209 57 -23 -53 46 -142 -98 304 2 56 -128 46
5844 46 69 -173 -83 107 -109 -217 298 -64 113 52 -15 -51 -50 196 210 -6 -18 -29 83 50 106 -113 263 -24
5868 -24 -41 -20 84 -204 89 114 -93 -95 47 141 158 -86 202 -112 288 -56 30 -54 156 -25 -76 109 127 174
5892 174 -27 333 109 38 103 18 -84 48 -238 141 113 -235 59 0 -90 23 48 105 -52 61 -15 -166 0
5915 0 153 201 -161 66 -53 119 27 95 57 39 -38 -11 125 -121 102 -257 -61 126 -7 284 -191 96 -76
5938 -76 -50 61 -49 -42 91 79 79 -27 279 -39 49 -57 -67 200 2 13 -106 -71 -166 -102 -247 -21 327 -17
$$ packed form
5772I4l4k7r4P8j55p4M3K09lO6j80J41p8n7J00k9j22K21k09K21j34r1q3J61j11
5797a47J59P1P9j23q5j3KK00l63K00j37K32o3m0K38j05j50J72j71L03j93k23J86
5820B9k51K29J47j83J30Q2k52R8j5M9r0Q8k70K66q0l0R9j88M4M02l02N4j84J74
5844D6K3k42R0J90k16j08N15l62J77o1o7l6JK46J4k16j2j1J12l3N6k19L76k87
5868b4j7K1J04k88K93K5k07kJ42R4J7k44K88l14M00l44Q6q4K10j81n1J85J8M7
5892A74k01L60k24p1O5q5j02J32k86L79k8l48K94n9r0J13K5N7j57J13p6j51J66
5915@J53M8l62K27j19J72r2O8l8j8p7K7J36k46K23l59J96J87j33K91m75K87j72
5938g6K6J11j10PJ33j2%j06L06l18Q8j06j0K67j98J1j19L5r5O4j45K26L48l44
$$ plain form
5962 -17 -77 -226 -93 -164 -97 208 67 146 49 43 -2 -55 -115 -40 -9 119 88 16 -105 50 25 13 -2 5 -240 92 -80
5989 -80 -177 -37 -156 -44 112 -90 -25 -72 38 -52 -273 249 85 -22 -25 120 -212 -105 81 151 28 -88 -317
6012 -317 132 -32 87 -266 -80 140 -145 -119 -58 111 -147 91 -86 186 342 142 372 17 -263 42 201
6033 201 53 130 197 41 -157 -110 94 110 -255 -294 118 -165 33 -101 29 145 342 -112 -34 36 -208 280
6055 280 -60 -25 -53 -6 157 363 81 -145 -66 -94 -174 -172 -30 5 -220 -3 159 -269 -252 -84 -102 -74 -324 121
6079 121 -20 -22 60 58 96 -24 44 49 -110 333 60 -49 163 101 -327 76 4 -166 60 18 -392 50 -29 -124 -13
6104 -13 -279 -122 -159 -22 28 -106 72 89 -12 97 -112 145 -212 -85 124 -176 -175 -57 -79 -101 -36 -16 -8 -286
6128 -286 -31 76 91 -123 -17 -311 -72 -77 -22 -157 19 121 -94 96 108 98 255 20 -61 -266 3 -159
$$ packed form
5962a7o0j49J33p1O7L05j41P9r7om5n3o0P5L1J28l1p2j21J55k5j2j5Pk45L32j72
5989h0r7J40j19J12J56k02O5m7J10r0k21N22j64j07lJ45l32J07J86P0j23j16k29
6012c17M49j64J19l53J86K20k85K6O1J69k58K38j77K72J56k00K30l55k80L05J59
6033B01j48P7O7j56j98M7K04J6l65l9M12k83J98j34J30J16J97m54P8P0k44M88
6055B80l40L5k8M7J63K06k82k26P9k8q0KJ42L5k25K17J62m28J7J68j8K8k50M45
6079A21j41kQ2kL8j20O8Nj59M43k73j09K12o2m28M03p2j70K26m2m10M42p9r5J11
6104a3k66J57l7J37N0j34J78J7j01J09k09K57l57J27K09l00JJ18k2k2O5K0Qk78
6128b86K55J07J5k14J06k94K39nN5j35J76J02k15J90J2j0J57k35q1k05K69j62
$$ plain form
6150 -159 -108 230 -12 138 -92 156 -110 -151 -25 -156 197 -8 42 -193 -75 256 -155 129 -121 -42 -70 -152
6172 -152 164 -9 -117 -131 -142 63 160 105 -61 -64 -30 -8 46 -100 -6 -71 -40 163 72 25 -34 8 -76 101 -72 -31
6198 -31 -111 -303 29 -41 -35 -31 -204 -90 1 81 74 -111 -125 -7 38 130 -109 -25 80 -128 -39 -164 261 85 153 -120
6224 -120 -25 -3 -128 92 37 163 -54 65 -84 -129 222 99 -297 21 -25 47 -207 97 -206 24 -117 -228
$$ packed form
6150a59N1L38k42J50k30K48k66m1J26j31L53k05N0k35J18L31m11K84k50P9k8q2
6172a52L16j73j08j4j1K05R7n5j66lL4K2N4j46R4o5L1K03r1m7n9M2q4J77j73M1
6198c1q0j92L32p0OMj73J14R1Q0pj85j4J18M5R2k39Q4J05k08Q9j25M25j76O8k73
6224a20R5K2j25K20n5J26k17J19j49m5L51j23l96L18m6P2k54L04l03K30j41j11
$$ [...]
8191d8
##END NTUPLES=NMR FID
##END=
