##TITLE=1H_Ad=CH2(from Grignard)
 CDCl3
 8 sc, 
 17.3.2023
##JCAMPDX= 6.0         $$ Bruker NMR JCAMP-DX V2.0
##DATA TYPE= NMR FID
##DATA CLASS= NTUPLES
##ORIGIN= UXNMR, Bruker Analytische Messtechnik GmbH
##OWNER= root
$$ XWIN-NMR		Version 3.5
$$ Fri Mar 17 14:08:30 2023 Russian Standard Time (UT+4h)  she@DPX200
##.OBSERVE FREQUENCY= 200.13135
##.OBSERVE NUCLEUS= ^1H
##.DELAY= (6, 6)
##.ACQUISITION MODE= SIMULTANEOUS
##.ACQUISITION SCHEME= undefined
##.AVERAGES= 8
##.DIGITISER RES= 18
##SPECTROMETER/DATA SYSTEM= spect
##.PULSE SEQUENCE= zg30
##.SOLVENT NAME= DMSO
##.SHIFT REFERENCE= (INTERNAL, DMSO, 0, 15.7039)
##AUDIT TRAIL= $$ (NUMBER, WHEN, WHO, WHERE, WHAT)
$$ ##TITLE= Audit trail, XWIN-NMR		Version 3.5
$$ ##JCAMPDX= 5.01
$$ ##ORIGIN= Bruker BioSpin GmbH
$$ ##OWNER= she
$$ F:/spectra/data/she/nmr/H-F/1/audita.txt
$$ ##AUDIT TRAIL=  $$ (NUMBER, WHEN, WHO, WHERE, WHAT)
(   1,<2023-03-17 14:07:01.43 +0400>,<she>,<DPX200>,
      <created by zg, POWCHK disabled, PULCHK disabled
       configuration hash MD5:
       00 E9 B6 7A A2 85 ED C7 34 08 36 98 17 FE 4E 26
       data hash MD5: 16K
       E2 D6 CB 65 7B 83 FE F2 1D 93 54 FD B4 77 27 D6>)
$$ ##END=
$$ 
$$ hash MD5
$$ AA 5E 29 D0 92 32 4A 17 07 7F 79 74 B4 35 05 83
##$RELAX= 
##$RELAX= 
##$RELAX= 
##$RELAX= 
##$RELAX= 
##$RELAX= 
$$ Bruker specific parameters
$$ --------------------------
##$DU= <F:/spectra>
##$EXPNO= 1
##$NAME= <H-F>
##$PROCNO= 1
##$TYPE= <nmr>
##$USER= <she>
##$AMP= (0..31)
100 100 100 100 100 100 100 100 100 100 100 100 100 100 100 100 100 100 
100 100 100 100 100 100 100 100 100 100 100 100 100 100 
##$AQSEQ= 0
##$AQ_mod= 1
##$AUNM= <au_zg>
##$AUTOPOS= <>
##$BF1= 200.13
##$BF2= 200.13
##$BF3= 200.13
##$BF4= 200.13
##$BF5= 200.13
##$BF6= 200.13
##$BF7= 200.13
##$BF8= 200.13
##$BYTORDA= 1
##$CFDGTYP= 0
##$CFRGTYP= 5
##$CHEMSTR= <none>
##$CNST= (0..31)
1 1 145 1 1 1 1 1 1 1 1 1 1 1 1 1 1 1 1 1 1 1 1 1 1 1 1 1 1 1 1 1 
##$CPDPRG= <>
##$CPDPRG1= <>
##$CPDPRG2= <>
##$CPDPRG3= <>
##$CPDPRG4= <mlev>
##$CPDPRG5= <mlev>
##$CPDPRG6= <mlev>
##$CPDPRG7= <mlev>
##$CPDPRG8= <mlev>
##$CPDPRGB= <>
##$CPDPRGT= <>
##$D= (0..31)
0 1.2 0 0 0 0 0 0 0 0.06 0 0.03 0 0 0 0 0.0002 0 0 0 0 0 0 0 0 0 0 0 0 
0 0 0 
##$DATE= 1679047620
##$DBL= (0..7)
120 120 120 120 120 120 120 120 
##$DBP= (0..7)
150 150 150 150 150 150 150 150 
##$DBP07= 0
##$DBPNAM0= <>
##$DBPNAM1= <>
##$DBPNAM2= <>
##$DBPNAM3= <>
##$DBPNAM4= <>
##$DBPNAM5= <>
##$DBPNAM6= <>
##$DBPNAM7= <>
##$DBPOAL= (0..7)
0.5 0.5 0.5 0.5 0.5 0.5 0.5 0.5 
##$DBPOFFS= (0..7)
0 0 0 0 0 0 0 0 
##$DE= 6
##$DECBNUC= <off>
##$DECIM= 32
##$DECNUC= <off>
##$DECSTAT= 4
##$DIGMOD= 1
##$DIGTYP= 9
##$DL= (0..7)
0 120 120 120 120 120 120 120 
##$DP= (0..7)
150 150 150 150 150 150 150 150 
##$DP07= 0
##$DPNAME0= <>
##$DPNAME1= <>
##$DPNAME2= <>
##$DPNAME3= <>
##$DPNAME4= <>
##$DPNAME5= <>
##$DPNAME6= <>
##$DPNAME7= <>
##$DPOAL= (0..7)
0.5 0.5 0.5 0.5 0.5 0.5 0.5 0.5 
##$DPOFFS= (0..7)
0 0 0 0 0 0 0 0 
##$DQDMODE= 0
##$DR= 18
##$DS= 0
$$ [...]
##$SUBNAM2= <"">
##$SUBNAM3= <"">
##$SUBNAM4= <"">
##$SUBNAM5= <"">
##$SUBNAM6= <"">
##$SUBNAM7= <"">
##$SUBNAM8= <"">
##$SUBNAM9= <"">
##$SW= 18.05172834244
##$SWIBOX= (0..15)
0 0 2 0 0 0 0 0 0 0 0 0 0 0 0 0 
##$SW_h= 3612.71676300578
##$TD= 16384
##$TD0= 1
##$TE= 0
##$TE2= 300
##$TE3= 300
##$TEG= 300
##$TL= (0..7)
0 120 120 120 120 120 120 120 
##$TP= (0..7)
150 150 150 150 150 150 150 150 
##$TP07= 0
##$TPNAME0= <>
##$TPNAME1= <>
##$TPNAME2= <>
##$TPNAME3= <>
##$TPNAME4= <>
##$TPNAME5= <>
##$TPNAME6= <>
##$TPNAME7= <>
##$TPOAL= (0..7)
0.5 0.5 0.5 0.5 0.5 0.5 0.5 0.5 
##$TPOFFS= (0..7)
0 0 0 0 0 0 0 0 
##$TUNHIN= 0
##$TUNHOUT= 0
##$TUNXOUT= 0
##$USERA1= <user>
##$USERA2= <user>
##$USERA3= <user>
##$USERA4= <user>
##$USERA5= <user>
##$V9= 5
##$VALIST= <valist>
##$VCLIST= <CCCCCCCCCCCCCCC>
##$VD= 0
##$VDLIST= <DDDDDDDDDDDDDDD>
##$VPLIST= <PPPPPPPPPPPPPPP>
##$VTLIST= <TTTTTTTTTTTTTTT>
##$WBST= 1024
##$WBSW= 4
##$XGAIN= (0..3)
0 0 0 0 
##$XL= 0
##$YL= 0
##$YMAX_a= 330167
##$YMIN_a= -451986
##$ZGOPTNS= <>
##$ZL1= 120
##$ZL2= 120
##$ZL3= 120
##$ZL4= 120
##$ABSF1= 10
##$ABSF2= 0
##$ABSG= 5
##$ABSL= 3
##$ALPHA= 0
##$AQORDER= 0
##$ASSFAC= 0
##$ASSFACI= 0
##$ASSFACX= 0
##$ASSWID= 0
##$AUNMP= <proc_1d>
##$AZFE= 0.1
##$AZFW= 0.1
##$BCFW= 1
##$BC_mod= 2
##$BYTORDP= 1
##$COROFFS= 0
##$CY= 11.3945322036743
##$DATMOD= 1
##$DC= 2
##$DFILT= <>
##$DTYPP= 0
##$F1P= 2.36226072786647
##$F2P= -0.459571619588291
##$FCOR= 0.5
##$FTSIZE= 0
##$FT_mod= 4
##$GAMMA= 1
##$GB= 0.15
##$INTBC= 1
##$INTSCL= 1
##$ISEN= 128
##$LB= 0.24
##$LEV0= 0
##$LPBIN= 0
##$MAXI= 10000
##$MC2= 0
##$MEAN= 0
##$ME_mod= 0
##$MI= 1.114404
##$NCOEF= 0
##$NC_proc= 0
##$NLEV= 6
##$NOISF1= 3.799351
##$NOISF2= 2.8
##$NSP= 1
##$NTH_PI= 0
##$NZP= 0
##$OFFSET= 15.70392
##$PC= 1
##$PHC0= -19132.23
##$PHC1= 46.60075
##$PH_mod= 1
##$PKNL= yes
##$PPARMOD= 0
##$PSCAL= 0
##$PSIGN= 0
##$REVERSE= no
##$SF= 200.130013532006
##$SI= 16384
##$SIGF1= 3
##$SIGF2= 2
##$SINO= 400
##$SIOLD= 16384
##$SREGLST= <1H.CDCl3>
##$SSB= 0
##$STSI= 0
##$STSR= 0
##$SW_p= 3612.71676300578
##$SYMM= 0
##$S_DEV= 0
##$TDeff= 0
##$TDoff= 0
##$TI= <>
##$TILT= no
##$TM1= 0
##$TM2= 0
##$TOPLEV= 0
##$USERP1= <user>
##$USERP2= <user>
##$USERP3= <user>
##$USERP4= <user>
##$USERP5= <user>
##$WDW= 1
##$XDIM= 8192
##$YMAX_p= 0
##$YMIN_p= 0
$$ End of Bruker specific parameters
$$ ---------------------------------
##NTUPLES= NMR FID
##VAR_NAME=  TIME,          FID/REAL,        FID/IMAG
##SYMBOL=    X,             R,               I
##VAR_TYPE=  INDEPENDENT,   DEPENDENT,       DEPENDENT
##VAR_FORM=  AFFN,          ASDF,            ASDF
##VAR_DIM=   8192,          8192,            8192
##UNITS=     SECONDS,       ARBITRARY UNITS, ARBITRARY UNITS
##FACTOR=    0.0002768,     1,               1
##FIRST=     0,             0,               0
##LAST=      2.2672688,     0,               0
##MIN=       0,             -451986,         0
##MAX=       2.2672688,     330167,          0
$$ Real data points
##PAGE= N=1
##DATA TABLE= (X++(R..R)), XYDATA
0@%%%%%%%%%%qJ6j6K4l2M0m8N6p2Q8j05J29j53J77k10K50k93L39l91M50n15N87
$$ 0 0 0 0 0 0 0 0 0 0 0 -8 8 -8 16 -16 24 -24 32 -40 48 -57 72 -81 96 -114 136 -157 182 -209 241 -274 313
32C13o68P58q59R69j089J222j370J531j705J896k105K334k584K856l154L480l837
$$ 313 -355 403 -456 513 -576 646 -724 807 -898 998 -1107 1227 -1357 1499 -1655 1825 -2012
49b012M226m654N128n651O233o882P609q430R370j0458J1726j3232J5057j7316
$$ -2012 2214 -2440 2688 -2963 3270 -3612 3997 -4433 4937 -5521 6205 -7027 8030 -9286
63i286K0199k4031K9401l7504N1289q0744K50652l04105l21648P16492m4593n29768
$$ -9286 10913 -13118 16283 -21221 30068 -50676 199976 -104129 -425777 290715 246122 -283646
75b83646J53120M19998k82023k28398K63409J39802k71139n4629K32809M2812
$$ -283646 -130526 289472 7449 -220949 42460 182262 -88877 -143506 89303 132115
85A32115k45235p360K35719j6423k33339P1296J82680r9151j28149J27930O6092
$$ 132115 -113120 -120480 115239 98816 -134523 -63227 119453 20302 -107847 20083 86175
96H6175j33880k5696J50474k1851j49018O8166J34795j10469q9750J24311K7567
$$ 86175 -47705 -73401 77073 55222 -93796 -25630 109165 -1304 -91054 33257 60824
107F0824j11396M2228O4544r4178K14J10219o3493q4146Q6158L3807o3739M727
$$ 60824 -50572 -8344 56200 -37978 -37764 72455 8962 -75184 10974 44781 -18958 -14231
119a4231J2797j3172L4598j285n9178K2606N7397l3472l2979L4122j151j9069
$$ -14231 -1434 -14606 19992 18707 -40471 -17865 39532 6060 -26919 7203 6052 -13017
131a3017L1753l468m4183K0879M3311k3343l7612J6377K8681j1011j5193L697
$$ -13017 18736 15268 -28915 -8036 35275 11932 -25680 -9303 19378 8367 -6826 -3129
143c129k117Q956J0489k4564n104K6491j4168j0920L5777j7688m9217N2713M7616
$$ -3129 -5246 3710 14199 -10365 -15469 11022 -3146 -14066 21711 4023 -45194 7519 55135
156E5135q4129k6017R9395p734q3902M2085M2882n7666M824N1228l8329l4020
$$ 55135 -28994 -55011 44384 36650 -47252 -5167 37715 -19951 -15127 36101 -2228 -36248
168c6248N2849J9386n0990j1596L6152J0114j7638j6728L626K5240j864k7466
$$ -36248 16601 35987 -15003 -26599 9553 19667 2029 -14699 -11073 14167 12303 -15163
180a5163O773J5462j1988K993J5468k0636j6982L5361J5414m8359n358N4210j1741
$$ -15163 -8390 7072 -4916 -1923 13545 -7091 -24073 11288 26702 -21657 -27015 27195 15454
193A5454m1768L0670J5980m0724J4399M1168l9763l1348N6991J3241o0595P388
$$ 15454 -26314 4356 20336 -20388 -5989 35179 -4584 -35932 21059 34300 -26295 -18907
205a8907M4885k3839j8429K6815n107k2062J5970J6106j5895j8034J0887K4309
$$ -18907 25978 2139 -16290 10525 5418 -16644 -674 15432 -463 -18497 -7610 16699
217A6699l455l4274k278M5956J094n4006J1724N2902k9411l7171M6407J3585n6629
$$ 16699 13244 -21030 -23308 22648 23742 -30264 -18540 34362 4951 -32220 14187 27772 -28857
230b8857J2465O1422l7326n7840N7904M3434o8185k3265O1870N004m5154L571
$$ -28857 -16392 45030 7704 -50136 7768 51202 -16983 -40248 21622 26626 -18528 -14957
242a4957K8023n895j7679L761J3898k400j8243L408L0280j1500m0512K6912M0839
$$ -14957 13066 7171 -10508 -6747 7151 4751 -13492 -10084 20196 8696 -31816 -4904 35935
255C5935m1989k6201M7829P100m1210J2143K7462k7382j0504L7746q030l7446
$$ 35935 -6054 -32255 15574 22674 -18536 -6393 21069 -6313 -16817 20929 12899 -24547
267b4547K2482K7094k7975j3304K1489J316j0709N649Q67j1383O216J1883j0924
$$ -24547 -2065 25029 -2946 -16250 5239 6555 -4154 1495 2362 -9021 -2805 9078 -1846
280a846q940Q831N538K268o886j3439J4290J9237k2757j5251K8921P178l1138
$$ -1846 -10786 -1955 3583 5851 -1035 -14474 -184 19053 -3704 -18955 9966 17144 -13994
293a3994N871K8575k1596j8394L4524K029l5712J2003K6362j9158j3730J5818
$$ -13994 -8123 20452 -1144 -19538 14986 17015 -18697 -6694 19668 510 -13220 2598
305B598L044r380M656l19p763Q300L353j1834O856N909j4517Q258J5184k2349
$$ 2598 5642 -3738 918 599 -7164 1136 4489 -7345 -489 5420 -9097 -839 14345 -8004
319h004q233K9973M55l1600J0285K7703j9939j6327K5469m21k2432J4558J4539
$$ -8004 -16237 13736 14191 -17409 -7124 20579 640 -15687 9782 9361 -13071 1487 16026
332A6026k1178p661K0732L231j8652k363J5134K642j1382n951J0402Q072j4773
$$ 16026 -5152 -12813 7919 11150 -7502 -9865 5269 7911 -3471 -9422 980 9052 -5721
345e721o864K3043k219k6728J5546K5285k7852j8944L7537R620m2831N814M1150
$$ -5721 -12585 10458 8239 -18489 -2943 22342 -5510 -24454 13083 22703 -20128 -14314 26836
358B6836k2244k8988L3210J1229l4737M235L0277j4354k4005J9248J5353k0197
$$ 26836 4592 -24396 8814 20043 -14694 -10459 19818 5464 -18541 707 16060 -4137
370d137q323J5671M778j0059o563Q089Q134j1681n832J6577n28j8955R804J8778
$$ -4137 -12460 3211 7989 -2070 -8633 -544 7590 -4091 -9923 6654 6126 -12829 -3025 15753
384A5753j8439j5253K7062Q168l2076N069L0270j7667k1049K4745Q587k6090K687
$$ 15753 -2686 -17939 9123 17291 -14785 -9716 20554 2887 -18162 6583 15170 -10920 -8233
397h233K3873j1697j8803J6672J0021j7534j810J1906j693m473j119J160M165
$$ -8233 15640 3943 -14860 1812 11833 -5701 -7511 4395 2702 -1771 -2890 -1730 2435
410B435k917n987P425N384j1528k324J6417m289j7389J2494J4289j8113m677J7869
$$ 2435 -482 -6469 956 6340 -5188 -7512 8905 4616 -12773 -279 14010 -4103 -8780 9089
424I089l947j2331Q484N154r179J433P134o180l678O988l211l838P001k701o165
$$ 9089 5142 -7189 1295 6449 -2730 -1297 5837 -343 -4021 2967 -244 -4082 2919 218 -5947
439e947Q966M54j0611M166R204q360n188J1358R1j1509P774O610j1978J147J1912
$$ -5947 3019 3473 -7138 -2972 6232 -2128 -7316 4042 4133 -7376 398 7008 -4970 -3823 8089
454H089o819o404Q652P70p924L322M978o215q7N541m565k283O197m347l042Q471
$$ 8089 1270 -5134 3518 4288 -3636 -314 4664 -1551 -1638 3903 -662 -2945 3252 -1095 -4137 4334
470D334m173p189R284L713j2935J410J2733p093q967J2101L316j3292N255Q481
$$ 4334 161 -7028 2256 5969 -6966 -5556 7177 84 -8883 3218 6534 -6758 -1503 6978
484F978r646j132R762m131n810P151M97p681N024M868j0003J077J0368q090n981
$$ 6978 -2668 -3800 5962 1831 -3979 3172 3669 -4012 1012 5880 -4123 -3046 7322 -768 -6749
499f749J0437j264q411N887L661p083J052N967o087k156R189l738p248J0920N33
$$ -6749 3688 2424 -5987 -100 3561 -3522 -2470 3497 -2590 -4746 4443 705 -6543 4377 4910
514D910j2023O409Q546j0221l087J1572j929r573O142N567r312N31P546n952k199
$$ 4910 -7113 -704 7842 -2379 -5466 6106 4177 -5396 746 6313 -2999 -2468 5078 -874 -3073
529c073P260m218m217O285n23o353M647M768q319o53R681n154p338R948J372r741
$$ -3073 4187 -31 -4248 2037 1514 -4839 -192 4576 -3743 -4396 5285 131 -7207 2741 4113 -5628
545e628N312N781q628J28Q340m546n274Q530Q57r949N209O504r797k19R297n361
$$ -5628 -316 5465 -3163 -3035 5305 759 -4515 4015 4872 -5077 132 6636 -3161 -3380 5917 556
561E56n094P156p59n232K841K411m661K131L470o041J38P204n188m487Q836m83
$$ 556 -4538 2618 1859 -3373 -532 1879 -2782 -651 2819 -3222 -3084 4120 -1068 -5555 3281 2798
577B798q054M892N721o777k638P515n83o666M834L848p251J273N337n267j259
$$ 2798 -5256 -364 5357 -1420 -4058 3457 2874 -3792 1042 4890 -2361 -1088 4249 -1018 -2277
592b277N243k552l376M804j43n817L246M583o813j37P535n523l208P829k800n726
$$ -2277 2966 414 -2962 1842 1699 -4118 -872 3711 -3102 -3239 4296 -1227 -4435 3394 594 -5132
608e132O766J306o294L152M607o392j110P402k761n618O661J328o968K829L512
$$ -5132 1634 2940 -3354 -202 4405 -1987 -3097 4305 1544 -4074 2587 3915 -3053 -224 3288
623C288m070K3K965j471k543K047R67l040J112K628m532L44N241l736l417O111
$$ 3288 -782 -759 2206 735 -1808 239 1206 -1834 -722 1906 -2626 -2282 2959 -777 -4194 1917
639A917P0n827L147N395n968k553Q077k926n907P131J087p008M445L187p191K584
$$ 1917 1987 -3840 -693 4702 -1266 -3819 4258 1332 -4575 2556 3643 -3365 1080 4267 -2924 -340
655c40M576o085j180O994l087n612O705Q55p906L811N086o366P4N500l806k514
$$ -340 4236 -1849 -3029 3965 878 -4734 1971 2826 -5080 -1269 3817 -2549 -2475 3025 -781 -3295
671c295M626Q3l932K287L416m188j185N464k339l924M563J539n217J956L545l236
$$ -3295 1331 1414 -2518 -231 3185 -1003 -2188 3276 937 -2987 1576 3115 -2102 -146 3399 163
687A63k274M230j172l861M708N04o166L336M059p021P97O607m977l330O844m51
$$ 163 -2111 2119 947 -2914 1794 2298 -3868 -532 3527 -3494 -2697 3910 -1067 -4397 2447 1996
703A996o418L776M254o000L65N496l949j610N504k997l230N049r4m519K587L485
$$ 1996 -4422 -646 3608 -2392 -2027 3469 -480 -2090 3414 417 -2813 2236 2142 -2377 210 3695
719C695m585j947N453r36n276L963K760n311N97L560l009j357L790j066k894L020
$$ 3695 -890 -2837 2616 1680 -3596 367 3127 -2184 -1587 1973 -1036 -2393 1397 331 -2563 457
735D57J139m557K104M304n513j21O196l660l513N267k63m154L012K094l618l5
$$ 457 1596 -2961 -857 3447 -2066 -2187 4009 349 -3164 2103 1840 -2314 698 2792 -826 -861
751h61L722l231k051M867j588m171M587J369n404J359L811l014k264L603Q60l742
$$ -861 2861 -370 -2421 2446 858 -3313 1274 2643 -2761 -1402 2409 -605 -2869 734 1594 -2148
767b148J183K663l161Q7L248k142p99L257j815k117L337M64m196J504M214l897
$$ -2148 -965 1698 -1463 -1376 1872 -270 -1069 2188 373 -1744 1593 2057 -2139 -635 3579 -318
783c18j882N482j933m617M213J317m368J812K044l148Q2K493j668j782L435l80
$$ -318 -2200 3282 1349 -3268 945 2262 -2106 -294 1750 -1398 -1316 1177 -491 -2273 1162 782
799G82l581L235J692n011J658L972l385j447M025K0l439J463K375k803p43L726
$$ 782 -2799 436 2128 -2883 -1225 2747 -638 -2085 1940 1960 -1479 -16 2359 -444 -1187 2539
815B539j967k329L476q96k648K557K93k388J054K103k615j250K900o23l034L647
$$ 2539 572 -1757 1719 823 -1825 732 1025 -1363 -309 1794 -821 -2071 829 206 -2828 819
831H19P19l992K088K491l782K60L595k290j794L414L73l591J445K879l276n35
$$ 819 1538 -2454 -366 2125 -1657 -1397 2198 -92 -1886 1528 1901 -1690 -245 2634 -642 -1177
847a177L368j610j507J755l96j394J156M76j180K64J113j634q10K522r73k322
$$ -1177 2191 581 -926 829 433 -961 195 671 -509 -245 868 -766 -1576 946 -27 -2349
863b349K628J023l174J038K270k147j096L217j8k878J535K510l413Q6K953k202
$$ -2349 279 1302 -1872 -834 1436 -711 -1807 1410 1392 -1486 49 2559 -854 -768 2185 -17
879a7j166L485j651k167K236L88k279L86K037j927o50K411j581j282K883j394
$$ -17 -1183 2302 651 -1516 720 1108 -1171 -785 1252 -675 -1325 1086 -495 -1777 1106 -288
895b88j759L275l19l225K013K016k487o68L165m92k808K281J448l401Q18K471
$$ -288 -2047 1228 909 -2316 -303 1713 -774 -1442 1723 1231 -1577 704 2152 -1249 -431 2040
911B040k408j24K112j403o89R54J82j691L01J626j625o12K525j191k246K578O29
$$ 2040 -368 -492 1620 217 -472 482 664 -1027 -726 900 -725 -1337 1188 -3 -2249 329 958
928I58k322P47J331q92q51J717m53j673K185P48k855J772J570l302R48K511k176
$$ 958 -1364 -617 714 -178 -1029 688 235 -1438 747 1495 -1360 412 1982 -1320 -372 2139 -37
945c7j121K569q9k923J531J503k831M03K734k600o70K884j789j791K648J92k079
$$ -37 -1158 1411 1322 -1601 -70 1433 -1398 -995 1739 -861 -1531 1353 -436 -2227 421 613 -1466
962a466R21J942j804j503L116l34k442K060J088j964Q25R37j565l1J484p77j006
$$ -1466 -545 1397 -407 -1910 1206 872 -1570 490 1578 -386 439 1376 -189 -220 1264 487 -519
979e19J259M69k561J147J543k391m9K856k233j177K250O8k549J306J265j630J63
$$ -519 740 1209 -1352 -205 1338 -1053 -1102 1754 -479 -1656 594 662 -1887 -581 684 -946 -783
996g83J873j290j211K693p07k111K257P09j977K97J491j324m45J445j82j329O91
$$ -783 1090 -200 -1411 1282 575 -1536 721 1430 -547 -250 1241 -83 -528 917 735 -594 97
1013I7J075j870QJ110r73l66J593j005o66J054L64j609N14J536j129o80K016o81
$$ 97 1172 -698 -690 420 -553 -919 674 -331 -997 57 421 -1188 -674 862 -267 -947 1069 388
1031C88j912K314J66j789Q54J377j489lJ082o43j089J351K44k334J860Q94k625
$$ 388 -1524 790 956 -833 21 1398 -91 -94 988 345 -744 607 851 -1483 377 1271 -1354
1048a354J072J147j805J68J622j048j311J678M85k076P96J758j811r0J871j121
$$ -1354 -282 865 -940 -772 850 -198 -1509 169 654 -1422 -626 1132 -679 -769 1102 -19
1064a9j133J677K31j047J15J244m85o45N70j55o14J044n32r95J785l24j788R75
$$ -19 -1152 525 756 -291 -176 1068 583 -62 508 353 -261 783 251 -744 1041 717 -1071 -96
1082i6J287k182J18K005j073k242J910J805k995K10K765j618j107K063j99j562
$$ -96 1191 -991 -873 1132 59 -2183 -273 1532 -1463 -1253 1512 -106 -1213 850 651 -911
1098i11O07J265o15p76J144o9j074P40J97j003R12J32j121J061O0q74l55J441
$$ -911 -304 961 346 -430 714 645 -429 311 508 -495 417 549 -572 489 549 -325 -680 761
1116G61j321j010K495j90l385K214K299l130n98L444j265k048K454N38k364P11
$$ 761 -560 -1570 925 735 -2650 -436 1863 -1267 -1865 1579 314 -1734 720 1258 -1106 -395
1132c95J931j157j166J728l84q53J444j166n03J540p13j244J516K56j891J82J553
$$ -395 1536 379 -787 941 557 -296 1148 -18 -521 1019 306 -938 578 834 -1057 -875 678
1149F78p30j436J914K01j904P16J186j135l48J434k65o33L27Q62j376n6J990j165
$$ 678 -52 -1488 426 627 -1277 -561 625 -510 -858 576 311 -322 5 867 -509 -565 1425 260
1167B60j002J791L4j658J025J73j115N45R69j247j67R43n68j315J663o9j755J943
$$ 260 -742 1049 1083 -575 450 623 -492 53 1022 -225 -392 551 -17 -1332 331 262 -1493 450
1185D50N17k301N49J805j202o18J374J9j093O81N04j416O84J304j214k74J107
$$ 450 967 -1334 -785 1020 -182 -800 574 593 -500 181 685 -731 -47 1257 43 -231 876
1202H76o95r43J454k15q35K66Q62p96r14J181J84j641J177M60j160M90L41p49
$$ 876 181 -762 692 477 -358 -92 770 -26 -940 241 425 -1216 -39 421 -739 -249 92 -657
1220f57K7R30k39q30J267k2j314R20J235k246O81J910j546o17J780n11j718J400
$$ -657 -630 300 61 -769 498 476 -838 82 1317 -929 -248 1662 116 -501 1279 768 -950 450
1238D50M32j319qJ403r32j236J608k86j106Q78M9n63M21L35n09m54R18p4n60Q63
$$ 450 882 -437 -445 958 26 -1210 398 112 -994 -116 -67 -630 -209 126 -383 -837 81 7 -553 310
1258C10M05r95O04Q13j543M29R12q17n57J204J37j334K08J447j559r90K475j115
$$ 310 715 -280 324 1137 -406 23 935 118 -439 765 902 -432 -224 1223 -336 -1326 1149 34
1276C4j550J746K63j669O60R85r06j29R04k47j347J423N01j257Q05N96j213M89
$$ 34 -1516 230 493 -1176 -516 469 -437 -566 338 91 -1256 167 668 -589 216 812 -401 88
1294H8N75q34j33J221l80j137J152J49j535N85J137j436n21K295j091j268J143
$$ 88 663 -171 -304 917 537 -600 552 701 -834 -249 888 -548 -1069 1226 135 -1133 10
1311A0N16j396J82J086m87r17J227K97j329O25O09o49M96K41o00K18K79l49J06
$$ 10 526 -870 -688 398 -89 -1006 221 518 -811 -186 423 -226 270 511 -89 129 408 59 165
1330A65M16K1r95K76P17r55l56J224n45n56N08m6o12L78M58p35j23R47P0r42J156
$$ 165 581 602 -393 -117 600 -355 -711 513 -32 -588 -80 -126 -738 -360 98 -637 -760 187 257 -685 471
1351D71o0j023O61O16p03N3L55k61Q8J07J79o51N48M30j515P81N59j195J67J093
$$ 471 411 -612 49 665 -38 15 370 109 197 304 483 -168 380 810 -705 76 635 -560 -393 700
1371G00r57m43J124l76o89J62O84m53n33J245o06n18Q94J8o94O42K63m68J08L52
$$ 700 -257 -700 424 48 -641 -479 205 -248 -781 464 -142 -660 234 252 -442 200 463 -5 103 455
1391D55J60j078P06J59o23K77L95n09O5J90o78L12M73n67j57L98N95j152r3J163
$$ 455 615 -463 243 402 -221 56 451 -58 7 197 -481 -169 304 -263 -420 -22 573 -579 -672 491
1411D91j056j22J304m45q45R28J13q08K90O98m29k51P80p07k90O47j7o11O69L03
$$ 491 -565 -687 617 172 -673 255 368 -440 -150 548 119 -132 648 -59 -349 298 281 -330 339 642
1431F42r49K88J68m27%O87n62l47M96J34n74j93R20l03m10O39j48n33L86N03m79
$$ 642 -307 -19 149 -278 -278 409 -153 -500 -4 130 -444 -637 283 -20 -430 209 61 -472 -86 417 -62
1452f2j65N06K05o11M94J66j012P93L10o58P9O00n84l64P04m21q12Q80J49j175
$$ -62 -227 279 484 -127 367 533 -479 314 624 -34 45 645 61 -303 401 -20 -832 48 197 -978
1472i78N50O43p45O7R22o87j92N49m4l22N25j07m65K82Q37m99l80N28m24k94J085
$$ -978 -428 215 -530 -463 459 -228 -420 129 85 -237 288 181 -284 -2 835 336 -44 484 60 -234 851
1493H51n70o90N40K86o07j25O17k75m76K10K54m86M92o1l80K04Q5k3J17J82L0
$$ 851 281 -409 131 417 -190 -315 302 27 -449 -239 15 -471 21 -40 -420 -216 -131 -154 -37 145 175
1514A75l41L56J79k91J45L40l54l29O09j23m83M08K79n45j49N77k83o62N57K14
$$ 175 -166 190 369 78 223 563 209 -120 489 366 -117 291 570 25 -124 453 170 -492 65 279
1534B79q06L78N33o44J14L22k23j32J45J41k97J76J18n10O45R9p86M90Q15n05
$$ 279 -527 -149 384 -260 -146 176 -47 -179 -34 107 -190 -14 104 -406 239 338 -448 42 857 352
1554C52n66P87j83o68M69M54p90n5O71m07n81P07Q2n78J69M05o37K21J59j79j21
$$ 352 -214 573 390 -278 191 645 -145 -200 471 64 -517 190 272 -306 -137 268 -369 -148 11 -168 -289
1575b89K61n6k30M85J81m79K18L54o79M01N67n75j36K54J26q03K57N97m31j78
$$ -289 -28 -84 -314 171 352 -127 91 445 -234 167 734 159 23 277 403 -400 -143 454 23 -155
1595a55M69k55o10N07J54j58R6mj65k50L11M9l35L60L80n16K13K61m82o2M67j36
$$ -155 314 59 -551 -44 110 -48 48 44 -121 -371 -60 -11 -346 14 394 -122 91 352 -130 -192 275 139
1617A39k91M94P4l97O4L73o19j61O34j91l20M53j99n69M55N8l74J31M65m00l01
$$ 139 -152 342 416 19 83 456 -163 -324 310 119 -201 252 53 -516 -61 -3 -377 -246 219 -181 -482
1638d82L94L86o02K78J20k12J57L53o88M38J11j97LM00k80m21K36N48q32M08N48
$$ -482 -88 298 -304 -26 94 -118 39 392 -296 142 253 56 59 459 179 -242 -6 542 -290 118 666
1659F66p84j87K16K2j98J98J19l4j18J97k30m87R20j74p72Q54J11p44O00j35j78
$$ 666 -118 -305 -89 -67 -265 -67 52 18 -100 97 -133 -620 300 126 -646 208 319 -425 175 40 -138
1680a38K33J5J07n0J99K1m97L12n5l36j89O09k73Lk6O1m11PK64m4l11N23n7o08
$$ -138 95 110 217 167 366 387 -110 202 147 -189 -378 231 -42 -39 -65 -4 -415 -408 -144 -188 -499 24 -33 -641
1704f41J053j65m22K58L01n20J54L76k48k99N00J2m73M93J47q68L08N32o18k15
$$ -641 412 247 -175 83 384 -136 18 394 146 -153 347 359 -114 379 526 -342 -34 498 -120 -335
1724c35Q11o30k57L19K56p12M41Nj61l60R69l32m19J60J27N4J94J33j98N8l6J73
$$ -335 476 -154 -411 -92 164 -548 -107 -102 -263 -623 346 14 -405 -245 -118 -64 130 263 65 123 87 260
1746B60l95K65K93l43K03R2m67P0j04J35n35N15k23oj4L98l44l21O85m09J09J75
$$ 260 -135 130 423 80 283 375 -92 -22 -126 9 -526 -11 -234 -240 -254 144 -200 -521 164 -245 -136 39
1768C9Q4n24K63K37k38J61M30j65l42N89n67j47N51k07l73J97L22k73j44pK71
$$ 39 123 -401 -138 99 -139 22 452 287 -55 534 -33 -180 371 164 -209 -12 310 37 -107 -114 157
1789A57k94N1N35o44j35N11m10j1J97J62l70p2O96n53K48J49k32j13K23M9l06
$$ 157 -137 -86 449 -195 -330 181 -229 -240 -43 119 -251 -323 373 -180 68 217 -15 -128 95 144 -162
1810a62M15j88l3K46Ol88K37L43o12l14M82j00p6j9R3j61l3L14j07J63j09N5L3
$$ -162 253 65 32 278 284 -104 133 476 -136 -450 32 -68 -144 -163 -70 -231 -264 50 -57 106 -3 52 85
1833H5J09l79o9m5O04o93J99N70l59o5O01k80k90J02Oj13J15j68K29m59J92M31
$$ 85 194 -185 -254 -299 305 -388 -189 381 22 -43 558 278 -12 90 96 -17 98 -70 159 -300 -108 323
1855C23p45N27J05k64k59L81r5k23L26R4n37J29L33p0p1M59k75J38j28N2l79M85
$$ 323 -422 105 210 -54 -313 68 -27 -250 76 170 -367 -238 95 25 -46 413 138 276 148 200 -179 306
1877C06k7l87PO40n31l67O02j50k97m4L16r0j44L49m64L23j30J36m72L10M20p06
$$ 306 279 -108 -101 539 8 -359 243 93 -204 -248 68 -22 -166 183 -281 42 -88 48 -424 -114 306 -400
1899d00K89J20L3l1K94l06K11n2j40j16J02J00M9l70L97q2l94L88L1n60M56l9
$$ -400 -111 9 42 11 305 -1 210 158 18 -98 4 104 153 -217 180 98 -296 92 123 -437 19 -20
1921b0l8j80J91l5j36J17K5r2K20K81n61J76J45k53p1L87L5j92l5K56k39m3L62
$$ -20 -58 -238 -47 -82 -218 -101 -76 -168 52 333 -228 -52 93 -160 -231 156 191 -1 -36 220 -19 -62 300
1944C00k72k60M11l1m76M33Pm89L11J71k30J4MM1j74K82L2k84J4M47k34j31L00
$$ 300 28 -232 179 148 -328 105 112 -377 -66 105 -125 -111 -107 -66 -240 42 74 -210 -196 251 17 -114 186
1967A86l68J32J42L4J53j54q5k69L14K16j60l36M14j86k56K32k27K14k5K00l25
$$ 186 -182 -50 92 126 279 125 40 -229 85 301 141 -195 219 33 -223 9 -218 -4 -29 171 -154
1988a54p0K80n2j59L8R2o9O4O2n00K37M03N6ll1n8k69r1O27k20k66J64r0r3L28
$$ -154 -224 56 4 -155 -117 -25 -94 -30 32 -468 -231 172 228 225 194 136 -133 -224 403 183 -83 81 -9 -102 226
2013B26j72r7lOl50M25o5L12n11M73o25L49Q8j39J40k36J42P0J05j06j10K63N3
$$ 226 54 -43 -46 -40 -390 35 -30 282 -229 244 -381 -32 56 -83 57 -179 -37 33 138 32 -78 185 238
2036B38k99Q5O3K00l84r1M93k16j95K90k38q7j25N92j52l46K27O5k23O6j49R6
$$ 238 -61 24 87 287 -97 -188 305 89 -106 184 -54 -141 -266 326 174 -172 55 120 -103 -37 -186 -90
2058i0K65k31k2n5L35l25L1L76j81j35K04N1p9l68L51j74K04j01J58K8p2k96p9
$$ -90 175 -56 -78 -133 202 -123 -92 284 103 -32 172 223 144 -224 127 -47 157 56 214 242 170 -126 -205
2081b05J74N5j30o3J71M0L9k38l8K5K89J1J03k23j72L04k93K00M2L0J4k25j15
$$ -205 -31 24 -106 -169 2 42 81 -157 -195 -170 119 130 233 10 -162 142 -151 49 91 121 135 -90 -205
2104b05L08J36j50j44M91l70L2j07J04K4k88J1l34N40K21l13n5L3M0pM6J59j35
$$ -205 103 239 89 -55 436 66 98 -9 95 119 -169 -158 -492 48 269 -44 -99 -66 -26 -33 13 172 37
2127C7j05K64J34k80K60j07k56M28k84l4M7K9k7O7k57K75l93N7L58m68L04mP5
$$ 37 -68 196 330 50 310 203 -53 375 91 57 104 133 106 173 -84 191 -202 -145 213 -255 49 45 120
2150A20l99L53p2j27O7k23K14j51L22p1j79L61j52m1o3K58j40M2O7R7p06P48l82
$$ 120 -279 74 2 -125 -58 -281 -67 -218 104 33 -146 215 63 22 -41 217 77 119 186 283 -423 325 -57
2173e7k72J73K61k41J76k0k10j36L12r5r7P6L09m95J43N5R7j43J51M3j14L49l45
$$ -57 -329 -156 105 -136 40 20 -190 -326 -14 -109 -206 -130 179 -316 -173 -118 -21 -164 -13 30 -84 265 -80
2196h0L85k63q1J4O0J65n85K02L93k44j9K05j57j86J52j52J02k03L34N1l94O8
$$ -80 305 42 -39 -25 35 200 -385 -183 210 -34 -53 152 -5 -191 -39 -191 -89 -292 42 93 -301 -233
2218b33J92J35n13L64J65j17N6j05R6k28L58j25P1lJ89j87L12m92k2K38l09O1
$$ -233 -41 94 -419 -55 110 -7 49 -56 40 -188 170 45 116 113 302 115 427 -65 -87 151 -158 -97
2240i7K27j31j91K13p5j10l5J24jk14P08m09J2k14M75l84L4L60k34J1n1K30l60
$$ -97 130 -1 -192 21 -54 -164 -199 -75 -76 -290 418 9 21 -193 282 -102 -68 292 58 69 18 248 -112
2263a12J73O2k9j42L98j40l26J48j07o2M31k51L9o6k48K24j64K05k17m9J40L85
$$ -112 61 123 94 -48 350 210 -116 32 -75 -137 294 43 82 16 -232 -8 -172 33 -184 -233 -93 292
2285B92k79k79L58k17P1J61Qk07J12j05J85j31K38l62L01J93l15j20PL10l78M17
$$ 292 13 -266 92 -125 -54 107 115 -92 20 -85 100 -31 207 -155 146 339 24 -96 -89 221 -157 260
2307B60j93r3J64j22P2k92O3J53j11o7M53o29K50J84r2J05J03K6q5k47K52j65
$$ 260 67 -26 138 16 88 -204 -141 12 -99 -166 287 -342 -92 92 0 105 208 234 149 -98 154 -11
2329a1Rj00L89l22k23K47K73m88L81l9l45L58O0l43K45K08m70J38J04Ok38P0O3
$$ -11 -2 -102 287 -35 -258 -11 262 -226 155 116 -229 129 189 -154 91 299 -171 -33 71 77 -161 -91 -28
2352b8j68J72J00l18J60K05l6R1J17l16r5P6L15m56L64k80Q1K5k67K27k08L25
$$ -28 -196 -24 76 -242 -82 123 87 178 295 -21 -116 -40 275 -181 183 -97 -16 9 -258 -31 -239 86
2374H6L8j6k74J95j51J53l52K91p7r6L02q1O4n3l8K38J6l71K17o3j86J04O6k3
$$ 86 124 108 -166 29 -122 31 -321 -30 -107 -203 99 18 82 29 -9 229 245 -126 91 28 -158 -54 12 -11
2398a1j23M01j23j92J31P9l15k96L29J11j9q6J78j60j59M2K51j04N6q0j36L51
$$ -11 -134 267 144 -48 83 162 -153 -449 -120 -9 -28 -114 64 -96 -255 -213 38 -66 -10 -90 -226 125
2420A25J2l82L57j6kJ94l77K95k30J10l5m7l34O36k98j51J29m2k1J91p9l07L3
$$ 125 137 -245 112 96 94 288 -89 206 -24 86 51 4 -330 306 8 -143 -14 -56 -77 114 35 -272 -239
2443b39J99r8J20k6p1K24j65M1J23j07k2qK85j36p0RJ8k84M40j55k02o5J00K26
$$ -239 -40 -138 -18 -44 -115 109 -56 -15 108 1 -21 -29 256 120 50 59 77 -207 233 78 -124 -189 -89 137
2467A37k89o0J49k6O1J0k6K1n3Q7O7r9j33J46j3j80J74Q4Q5qk30L48j61J14KP5
$$ 137 -152 -212 -63 -89 -28 -18 -44 -23 -76 11 78 -21 -154 -8 -21 -201 -27 57 142 134 -96 252 91 205 207 282
2493B82j07j3q2j02P8p5J89l51j01L17j46K17j83k73J68K14Q3j79j69K65J90j69
$$ 282 175 162 80 -22 56 -19 170 -181 -282 35 -111 106 -77 -350 -182 32 115 -64 -233 32 222 53
2515E3K1j70K55Jr4q0N0M5K63k18k61K07J4k65K89l3p2J7j27K3j00J58k12k4M51
$$ 53 74 -96 159 160 66 -14 36 81 344 126 -135 72 86 -179 110 77 5 22 -105 -82 -182 -24 -236 -260 191
2540A91l25J99k9j57p0K01j1p7K70k91KL32k76jj49M32k53k0K95k84J23J30j01
$$ 191 -134 65 36 -121 -191 10 -1 -78 192 -99 -97 235 -41 -42 -191 241 -12 -32 263 -21 102 232 131
2563A31k31K6K57k51j39J23J69k81M2n7r4O1rL05O3k25K43k16QJ41o7j36M04O3
$$ 131 -100 -74 183 -68 -207 -84 85 -196 -154 -211 -305 -244 -253 52 115 -110 133 -83 -75 66 -1 -137 267 330
2587C30l94L70l40J5o3K46j20l62L73k44J20K31m13K48j77K55k69K66j38N2j54
$$ 330 -64 306 -34 -19 -82 164 44 -318 55 -189 -69 162 -251 -3 -180 75 -194 72 -66 -14 -168
2608a68J99m05J72J11P9L8n7J18k5j8k50J45L1J12j71J78j09k4p4Jo7%k6j83N11
$$ -168 31 -374 -202 -91 -12 26 -31 87 62 44 -206 -61 -30 82 -89 89 -20 -44 -118 -117 -184 -184 -210 -393 118
2633A18j06k03N6p0K47O2k52J92q2P4J46j13k07j1LL49k37o8N0R8N2j00oJ06j50
$$ 118 12 -191 -135 -205 42 104 -148 44 -38 36 182 69 -138 -149 -146 203 -34 -102 -52 46 98 -2 -8 98 -52
2658e2J4Q9m3P4k97M0K14j01J87J5l38K99j08J59j85J46l72M57k15r8J55K39k49
$$ -52 -38 51 8 82 -215 -175 39 -62 125 140 -198 101 -7 152 -33 113 -259 198 -17 -115 40 279 30
2681C0K16k32p4L94m00M77m94K26p3N1M0K6m00N63k72Q2j64j24K20j04p8J59k07
$$ 30 246 14 -60 334 -66 411 -83 143 70 121 161 187 -213 350 78 160 -4 -128 92 -12 -90 69 -138
2704a38J80j89p7M36l31K72K13n83N1L62j03k9o5J65k37j46K49k7j35K80q2k88
$$ -138 42 -147 -224 212 -119 153 366 -217 -166 196 93 64 -1 164 -73 -219 30 3 -132 148 66 -222
2726b22L31l34j08K43j5J40l05L18J75k57j3l3j06J34J3J00M9J2k0j79MM1k7J5
$$ -222 109 -225 -333 -90 -105 35 -270 48 223 -34 -47 -80 -186 -52 -39 61 110 122 102 -77 -73 -32 -59 -44
2750d4j2K04N0k13Q1k60K41Q4k34J46J39k52l1k52L51j2J52m7Lj74K71m06M2K62
$$ -44 -56 148 198 -15 66 -194 47 131 -103 43 182 -70 -101 -353 -2 -14 138 91 94 -80 191 -215 -173 89
2774H9J80k38J44j26J45l56K48Q6l26r7K77k6j78L01k75J9O3l3j30K50qk29J28
$$ 89 269 31 175 49 194 -162 86 172 -154 -251 26 0 -178 123 -152 -133 -70 -103 -233 17 9 -220 -92
2797i2j19Q0J86m57R6M47j16P7j15j87J17J93j55J46nk25J36M0k81K21P2J43k95
$$ -92 -211 -131 55 -402 -306 141 25 102 -13 -200 -83 110 -45 101 96 -129 7 47 -234 -13 59 202 -93
2820i3J08J24k87K73l58L11k29J36k1J12k08L05j16J52l91J88M01l67n3J37m0
$$ -93 15 139 -148 125 -233 78 -151 -15 -36 76 -132 173 57 209 -182 6 407 40 -13 124 84
2841H4l45J57K28p6n1j37K89k10J70k15J91j67k1J01j95J54M8J9m4K61k20O4R9
$$ 84 -261 -104 124 48 -3 -140 149 -61 109 -106 85 -82 -103 -2 -197 -43 5 24 -20 241 21 85 184
2864A84k12m1JJ71j75J59n5L0L3k13N06l15Nn2K3j22K91l7J59m59J11j35K35N4
$$ 184 -28 -69 -68 103 -72 87 32 62 95 -118 388 73 78 26 49 -73 218 181 340 -119 -8 -143 92 146
2888A46j91K98l03k1L81l01L5j82J52N5l59M61k99M4K08m8j67LN2P0J61j97K15
$$ 146 -45 253 -50 -71 310 9 44 -138 14 69 -290 171 -128 -84 124 76 -91 -88 -36 34 195 -2 213
2911B13j07Q4k32K90k69J77j59k98J76J27P9j56j65K62pK29k71k40L71j08j19
$$ 213 106 190 -42 248 -21 156 -3 -301 -125 2 81 -75 -240 22 15 244 -27 -267 104 -4 -123
2932a23K74p3O9m09N03j03j82M2M7K7l6K50k35L8k10r0L21l4n1k06M49k23m02
$$ -123 151 78 147 -262 241 138 -44 -2 45 72 36 286 51 89 -121 -211 110 76 25 -181 268 45 -357
2955c57K18J43J67k41J5k22J95j79L19rk03J95K54k58M30l12j15L37l28j2j4j11
$$ -357 -139 4 171 -70 -55 -277 -82 -261 58 49 -154 41 295 37 467 155 40 377 49 37 23 -88
2977h8J85J02j49K62j39j7K8m45l5L68n6L5j15M7k08K00l9J26L26l96j61RL19
$$ -88 97 199 50 312 173 156 184 -261 -296 72 16 51 -64 -17 -225 -25 -64 62 388 -8 -169 -160 159
3000A59k21j63M63l70J75J2l2R6k16M1L09k46m8L4J7j29J70l04M6O4J49Q0j22
$$ 159 -62 -225 238 -132 43 55 23 119 -97 -56 253 7 -41 -7 10 -119 51 -253 -207 -143 6 86 -36
3023c6P3j40L01l13J79j04k34L23K64k61l39L70k49J73r5%K5J87n4m8J44l08O1
$$ -36 37 -103 198 -115 64 -40 -274 49 313 52 -287 83 -166 7 -88 -88 -63 124 70 22 166 -142 -81
3046h1K24j98J77Nj3j53j92J89r7o1M63l37q8J82J30j23P7j43l4j0O1J43J2j66
$$ -81 143 -55 122 127 114 -39 -231 -42 -139 -200 263 -74 -162 20 150 27 104 -39 -73 -83 -22 121 133 -33
3070c3J42j9J36r5j27Q8l1l06m0K76k02M16j82q9K81o6m6n4ln3k1M2k46L42MK2
$$ -33 109 90 226 131 4 92 61 -245 -285 -9 -211 205 23 -66 215 149 103 49 46 -7 -28 14 -232 110 114 136
3096A36q9p4J21J83j64P8M0r0L8l45L8L9o3L11n5k48Q3j27K80r6k3M1j43J21k63
$$ 136 47 -27 94 277 113 191 231 141 179 -166 -128 -89 -152 159 104 -144 -61 -188 92 -4 -27 14 -129 -8 -271
3121b71K18n9K81q0j19J32L1q3j05K54m41R2J37P5q9K5K44j42k85R5n3K65j46
$$ -271 -53 -112 169 89 -30 102 133 50 -55 199 -242 -150 -13 62 -27 -2 242 100 -185 -90 -143 122 -24
3144b4K02k77J20j17M2K12o4nl52K75j96K45l6J04j67K54j47JR9rl59R8O2K69
$$ -24 178 -99 21 -96 -54 158 94 89 -263 12 -184 61 25 129 -38 216 69 70 169 160 -199 -101 -39 230
3168B30j51m35M24L8j95J85k61L3L04l98L50l01J40q2J04Q8Ojj39J15p4PO9n7
$$ 230 79 -356 68 106 -89 96 -165 -132 172 -226 124 -177 -37 -119 -15 73 79 78 -61 54 -20 -13 56 -1
3192aj71K62j28K10j00O2n1j69r0K06k4R2l2K9J1p3Q4n92L19KJ98ll27J56J69
$$ -1 -172 90 -38 172 72 134 83 -86 -176 30 6 98 66 95 106 33 117 -475 -156 -154 44 41 -286 -130 39
3217C9m7J15l38L01j50K23k23K16j78M5K25k14J13j12j78K11J15l55K89j3Q2j94
$$ 39 -8 107 -231 70 -80 143 -80 136 -42 3 228 14 127 15 -163 48 163 -192 97 84 166 -28
3239b8N9J49O5j64p4K3j86j0J09JK75l59j00K85O0j95O3Q6N4j57Q5mK55k77k9
$$ -28 31 180 245 81 7 30 -156 -166 -57 -56 219 -140 -240 45 105 -90 -27 59 113 -44 41 37 292 15 -14
3264a4L4j12L59m33K29l38K95kK4O6j3k22O4J73j68m7O7j9K48k26Q0M9M4J01l54
$$ -14 20 -92 267 -166 63 -275 20 18 42 108 95 -127 -63 110 -58 -105 -38 -57 191 -35 45 94 138 239 -115
3289a15J65J25j60j64L11j69R3l84L13p3J97l5l92K09O5J70l67J93r3J14p8j01
$$ -115 50 175 15 -149 162 -7 86 -298 15 -58 139 104 -288 -79 -14 156 -211 -18 -111 3 -75 -176
3311a76J71k58K18j15L09r7j54Q5rL7q9R3O4L5k23K87q6j34R1O0j15K37j60j51
$$ -176 -5 -263 -45 -160 149 52 -102 -17 -26 11 -78 15 79 114 -109 178 92 -42 49 109 -6 231 71 -80
3335h0j04M62j38o5k54J49J4o6N8l79K72M3M2j83K71k87J45k2L48k00p8J68j34
$$ -80 -184 278 140 75 -179 -30 -16 -82 -24 -403 -131 -88 -46 -229 42 -245 -100 -122 226 26 -52 116 -18
3358a8O0R6j17j49M9J28J48K9k60J05No2J35l89K02j64K76k06n8K45r5j1j33N24
$$ -18 42 138 21 -128 -79 49 197 226 -34 71 76 14 149 -240 -38 -202 74 -132 -190 55 -40 -51 -184 340
3382C40m43N4M4k22L67q2R0l4O7k07j19K74k53M45j53m04M02J07k07k64K15J34
$$ 340 -103 -49 -5 -227 140 58 148 114 181 -26 -145 129 -124 321 168 -236 166 273 66 -198 17 151
3404A51k32M2j79o8J82K14r7n1k04K86J90j44N5r0m2Q5j18j82J69N0p7J32p9j15
$$ 151 -81 -39 -218 -286 -104 110 13 -38 -242 44 234 90 145 55 13 98 -20 -202 -33 17 -60 72 -7 -122
3428a22J33mNo0K21q1K6r4l38J61L19l11L31j94l2l5M3L1L8l3o3m7J80j09K88
$$ -122 11 7 12 -48 173 92 118 24 -314 -153 166 -145 186 -8 -40 -75 -32 -1 37 4 -59 -106 74 -35 253
3453B53l45K15m41K99p6J78j16k05L03J19J03k73K09j56p9J62l28J34j04J99k96
$$ 253 -92 123 -318 -19 -95 83 -33 -238 65 184 287 14 223 67 -12 150 -178 -44 -148 51 -245
3474b45j47M48k49K29K09j84j64J61n0N5k07J71P2k39R2j2J98n1j85J00k40K02
$$ -245 -392 56 -193 36 245 61 -103 58 8 63 -144 27 99 -140 -48 -60 138 87 -98 2 -238 -36
3496c6p6J08k33L75Mk5l50L79k31p2K11j18J31R7r4j9j6Q8j70m9K41j17K94l32
$$ -36 -112 -4 -237 138 142 117 -233 146 -85 -157 54 -64 67 164 70 51 35 123 -47 -96 145 28 322 -10
3520a0J01k1K6j24J43k63L74l81RM75k76k60Q5j80L86k31Q3K02j65r1j10K38K05
$$ -10 91 70 96 -28 115 -148 226 -155 -146 329 53 -207 -122 -302 84 -147 -64 138 -27 -118 -228 10 215
3543B15o6l62M67j01j55K37q2j46O2l9l9O0q1L07k4k09o6k46Q2j1K07m8J77k30
$$ 215 149 -213 254 153 -2 235 153 7 69 30 -9 51 -30 277 253 44 -22 -268 -186 -197 10 -38 139 -91
3567i1J13O2p0k68M25j28j79J1K30l4J87k37O4P2j24m2n5J33M2j52J09J42p3k28
$$ -91 22 84 14 -254 171 43 -136 -125 105 71 258 21 85 157 33 -9 -64 69 111 -41 68 210 137 -91
3591i1O9j09J08J45R4k69J44p0O3o0pl9O7J56j90K6j24J43P7k45J65K39n9Nj76
$$ -91 -22 -131 -23 122 216 -53 91 21 84 24 17 -22 45 201 11 37 -87 56 133 -112 53 292 233 238 62
3616F2j15N2J32j94K0M4m5k00K19k16KJ71l12L41M1J81n6n0j10qP0j74N6J35l1
$$ 62 -53 -1 131 -63 -43 1 -44 -244 -25 -241 -239 -68 -380 -39 2 183 127 77 -33 -41 29 -145 -89 46 15
3641A5j7J91k69kj83J49L24J4l99p8K71J73j67Q4j37O8j67R8O4o5K47l49M52n17
$$ 15 -2 189 -80 -82 -265 -116 208 222 -177 -255 16 189 22 106 -31 37 -130 -32 32 -33 214 -135 317 -200
3665b00K65O2k53P7K41j29J70m54R9K22j81K42k08n0L5J32J8k61J77r0J08j04
$$ -200 65 127 -126 -49 192 63 233 -221 -122 100 -81 161 -47 -97 -62 70 88 -173 4 -86 22 -82
3687h2N1j50R7J69k07J58j86K81j65o2P7J30j60J03j2r5j40K44j34q8J78j84P4
$$ -82 -31 -181 -84 85 -122 36 -150 131 -34 -96 -19 111 -49 54 42 -53 -193 51 -83 -171 7 -177 -103
3710a03L88j75JJ84k79Oj33R5rJ51K4l11J80Q9m01L42l2L2l3j84L24m00Q6K69
$$ -103 285 110 111 295 16 22 -111 -16 -25 126 150 -161 19 108 -293 49 17 49 16 -168 156 -244 -158 111
3734A11k9M8J8l43J14J72k40J91J19k67K3M4k09M77j73J61k59J10k74L69o6J5
$$ 111 82 130 148 -195 -81 91 -149 42 161 -106 -83 -39 -248 229 56 217 -42 68 -206 163 97 112
3756A12j65J02J61k67q4N3q8M81k84k13K80k07K08n2L2J2l57K11J13j40J96p2
$$ 112 -53 49 210 -57 -141 -88 -176 305 21 -192 88 -119 89 37 69 81 -276 -65 48 -92 104 32
3778C2k14J92o7K09l76J09J32L9j39J83M0j76O5P0k61K81k90K02Nr1O4R1J9Q8
$$ 32 -182 10 -57 152 -224 -115 17 56 -83 100 140 -36 29 99 -162 119 -171 31 36 -55 9 100 119 207
3802B07j17k07J57m7K3r0L0l9j58L24O3l06J63O2k14L00j91M0K5j30K95j13P4
$$ 207 90 -117 40 -7 16 -74 -44 -83 -241 83 146 -160 3 65 -149 151 -40 0 25 -105 190 77 151
3825A51l44J63%Nl2j72M41l57L9j20L38n1n5K26m17K82j25l6P0l3Q1K2L3R3m64
$$ 151 -193 -30 -30 -25 -57 -229 212 -145 -106 -226 112 61 6 232 -185 97 -28 -64 6 -27 54 76 109 202 -262
3850b62L41q2r4L56j86P2K4k20J73j85L31l95P0kJ36p4J24q6j88J14k25K86J52
$$ -262 79 -3 -97 259 73 145 169 -51 122 -63 268 -127 -57 -59 77 3 127 41 -147 -33 -258 28 180
3873A80k26J39p1j1q1J50j86L5n0K38N9j36j02Q2j34J67J01p0n76M83k5ql4J53
$$ 180 -46 93 22 11 -70 80 -106 -71 -121 117 176 40 -62 20 -114 53 154 84 -492 -9 -34 -42 -76 77
3897G7o6N0j64j5J82J5k80P7J40N9r4n5PN1J90l0k04J48l65L23r3j6K14j52j65
$$ 77 11 61 -103 -118 64 79 -201 -124 16 75 -19 -74 -67 -16 174 144 -60 88 -277 46 -47 -63 151 -1 -166
3922a66M1J50M01m90l9J36j03J00N8j88q7J47j71R0K07R6r4J8k02L92l75Q0Q8
$$ -166 -125 25 426 -64 -103 33 -70 30 88 -100 -187 -40 -211 -121 86 182 88 106 -96 296 -79 1 89
3945H9k09M17o40L77J99l84L09j41NnKKj78J58L51l63N0k39K80q0K2M38o70J99
$$ 89 -120 297 -343 34 233 -151 158 17 22 17 19 21 -157 1 352 -11 39 -200 80 0 22 460 -210 -11
3969a1j19J22k26L8L99j43j72K53l3j80J51l54M01m7l60O9L94o4j43KJ86j20j24
$$ -11 -130 -8 -234 -196 203 60 -112 141 108 -72 79 -275 126 79 -281 -212 182 118 -25 -23 163 43 -81
3992h1r9K21J77k25j23K52l57Q3J39j57K72rm7L2p1J42j89K43j13j06O4j95J97
$$ -81 -180 41 218 -7 -130 122 -235 -152 -13 -170 102 93 46 78 7 149 -40 203 90 -16 48 -147 50
4015E0j8m9R9k16K21P6k50J03p8k43N05j40l15K33n5L6j32K36k8J74k87mo6j43
$$ 50 32 -17 82 -134 87 163 -87 16 -62 -305 200 60 -255 -22 -77 -41 -173 63 35 209 -78 -82 -148 -291
4039b91J16K8K85k38K07j9Qq1j24J32j20J94k45l0J15j67J22J39J9k68K40j01
$$ -291 -175 -147 138 -100 107 88 96 15 -109 23 -97 97 -148 -178 -63 -230 -108 31 50 -218 22 -79
4061g9Q6n6j48J16J70M2k03Q9j65J05J67l63K42m7K14l46M03r1Rj33n3J23j66
$$ -79 7 -49 -197 -81 89 131 -72 17 -148 -43 124 -239 3 -44 170 -176 227 136 145 12 -41 82 -84
4084h4j03K50j09J8P6L8opk89J35R2J62j14QMj08k3K93l7J65k44j39J35p8K8R7
$$ -84 -187 63 -46 -28 48 86 80 73 -216 -81 11 173 59 67 71 -37 -60 233 196 361 117 -22 113 35 63 160
4110A60l38J47q7J9K1j9k3L23m17R2L42k27k8l6P0J42k45Q9J36l6J8j63K4Q9M9
$$ 160 -178 -31 -118 -99 -78 -97 -120 203 -214 -122 220 -7 -35 -71 -1 141 -104 -15 121 85 103 -60 -36 53 102
4135A02j0m25J98P9J58q7qr7J33j46p5N1J15j53J81J02k53K00m3oK6j04j75K88
$$ 102 92 -333 -135 -56 102 15 7 -90 43 -103 -178 -127 -12 -165 16 118 -135 65 22 16 42 -62 -237 51
4159E1J0J83l86L19o6J95l51j90M91N0k35j8j10K09j98n8J68Mj12J8J50j61K6
$$ 51 61 244 -142 177 111 306 -45 -235 256 306 71 53 -57 152 -46 -104 64 68 -44 -26 124 -37 -11
4182a1N1j75K17k09J67o1J2k7J86j10j52K12j55J41j15L21o38N28j57K15j54j23
$$ -11 40 -135 82 -127 40 -21 -9 -36 150 40 -112 100 -55 86 -29 292 -346 182 25 240 86 -37
4204c7O7m3J17j35n4j18J81j60M1jl1J24J68P1m7l85K20L5r3J52k19J74O9j06
$$ -37 30 -13 104 -31 -85 -203 -22 -182 -141 -142 -173 -49 119 190 143 -242 -22 13 -80 72 -147 27 96 -10
4228a0O3O1J11j07j94l4P5Jj29P8J05k33J90N8J55m04N6K8J26j60K32n8K3n0J35
$$ -10 53 114 225 118 -76 -110 -35 -34 -163 -85 20 -213 -23 35 190 -214 -158 -130 -4 -164 68 10 33 -17 118
4253A18p7J1J72l08J61p5j19J20L8j07q6K16O0Jl38K47L8j00J13j32N08m32k3
$$ 118 41 52 224 -84 77 2 -117 3 41 -66 -152 64 124 125 -213 34 72 -28 85 -47 461 29 6
4276FK55k70j4j28J08J81j12o7K19j46o9K50ml67J67q2qM5L5q9q9J96q7M4k19
$$ 6 261 -9 -23 -151 -43 138 26 -41 178 32 -37 213 209 -158 9 -73 -81 -36 -1 -90 -179 17 -70 -26 -245
4301b45K66J20R2n3j27j22o5L18p7j23j58J14L3J68k35J10J07J00r1l37K53K32
$$ -245 21 141 233 180 53 -69 -134 184 107 -16 -174 -60 -27 141 -94 16 123 223 132 -205 48 280
4323B80q0k24K04k99J55K2J14Nk87L16j97k39J88J21n5K4J18rr2j4l3R9l1k02
$$ 280 200 -24 180 -119 36 58 172 177 -110 206 9 -230 -42 79 24 48 166 157 65 51 18 117 86 -116
4347a16L21m96J99k8lJ86k22p6l0K98j44J57k28N34l65J25K05l42K32l39K06M4
$$ -116 205 -291 -92 -120 -123 63 -159 -235 -265 33 -111 46 -182 352 -13 112 317 -25 207 -132 74 118
4369A18q6J74k74O3o5J4P9K57m46J40Nq6O8K32l09Q9J23m3j31j54J75J31l06K80
$$ 118 32 206 -68 -5 -70 -56 23 280 -166 -26 -21 -107 -39 193 -116 -27 96 53 -78 -232 -57 74 -232 48
4393D8J8j64K56j31j06N5j99M62j13j92j67K66Ooj12J47k24J36l6K7N2j37M57
$$ 48 66 -98 158 27 -79 -24 -223 239 126 -66 -233 33 39 33 -79 68 -156 -20 -56 -29 23 -114 343
4416C43k15k14j45L1K23j88J81K5K28j31l35n2N60k74k8K41j62j51Q5o4J90j81
$$ 343 128 -86 -231 -200 23 -165 16 41 269 138 -197 -249 311 37 9 250 88 -63 22 -42 148 -33
4438c3q8m3J22J32P0p7k45L03j06p4L54k11J0LLl28M27k81R9M5rK42k53j0m16
$$ -33 -121 -164 -42 90 160 83 -162 141 35 -39 315 104 114 117 120 -208 219 -62 37 82 73 315 62 52 -364
4463c64L14op0j32K82J04mk54Q6J75j92L23j28m23J45j6J55R8M0j94J37O9j29
$$ -364 -50 -56 -126 -258 24 128 124 -130 -44 131 -61 262 134 -289 -144 -160 -5 93 133 -61 76 145 16
4486A6L02j83M1r6j05J32j08K49k43r4N5J85j16m15M30j20L40k46k2j38L8L58
$$ 16 318 135 176 80 -25 107 -1 248 5 -89 -34 151 35 -380 50 -70 270 24 2 -136 -98 260
4508B60n23K84m3j3N2Kp5J39P9j20R9k99J76p7P6K21r7J81k45M7k78L19q5k88
$$ 260 -263 21 -22 -35 17 19 -56 83 162 42 141 -158 18 -59 17 238 141 322 77 124 -154 165 80 -208
4532b08Q7J5q1J66K4K84j69q2o2J4k7J76j8j59L59j65j10J08j1k48K23j14q7J06
$$ -208 -121 -106 -187 -21 3 287 118 36 -26 -12 -39 137 119 -40 319 154 44 152 141 -107 116 2 -85 21
4556B1q6J4L81m03K03o8l4k53J15J62l9o5J14k00j2K08k42Q7M8N3J72M4j01M5
$$ 21 -65 -51 330 -73 130 62 28 -225 -110 52 13 -52 62 -138 -150 58 -184 -97 -49 4 176 220 119 164
4580A64J5j84kJ9L2J78j20j42J41j01K24k49R9Jl56L04k2J67k6k48J32j08J67
$$ 164 179 -5 -7 12 44 222 102 -40 101 0 224 -25 74 75 -281 23 1 168 142 -106 26 -82 85
4603H5m59R7L41k07n4K92N0k24L15m03J94K91M6k57k39L02l10P5L39p6k51K91
$$ 85 -374 -277 64 -143 -197 95 145 -79 236 -167 27 318 364 107 -132 170 -140 -65 274 198 -53 238
4625B38l34P8J96j47K2j04l8J84j93J73j75q4J16J97l15J82J51j65k00M53l01
$$ 238 -96 -18 178 31 53 -51 -89 95 -98 75 -100 -184 -68 129 -186 -4 147 -18 -218 235 -66
4646f6J64j9j5J7m0J79j07r3q5K41j05n4L7q0J45k2j99L02k56j55K08o5j91K39
$$ -66 98 79 64 81 41 220 113 20 -65 176 71 17 54 -26 119 97 -102 200 -56 -211 -3 -68 -259 -20
4670b0K72k24m3n4L40l07K69j72j03o6O5J5R4R7l6r0o5J91k16k4J83k89K04l1
$$ -20 252 28 -15 -69 271 -36 233 61 -42 -108 -43 -28 66 163 127 37 -28 163 -53 -77 106 -183 21 -10
4694a0J1K84j29l3l42K56n5J97l41J10J6r4L29k15k34K22L5M1R2q9j02K03n4k38
$$ -10 1 285 156 123 -219 37 -18 179 -162 -52 -36 -130 199 -16 -250 -28 7 48 140 51 -51 152 98 -140
4718a40P7K58l54J99j66r3K75m3p5L79k50l19K48j96L03j18k06K20J84j39k33
$$ -140 -63 195 -159 40 -126 -219 56 13 -62 317 67 -252 -4 -200 103 -15 -221 -1 183 44 -189
4739a89j4K33N1Kk46J99KQ8l1k32k3M4J58j09mr2J50J1N4j30p4K57j47J3N3rj29
$$ -189 -203 30 81 83 -163 36 38 126 95 -137 -160 -116 42 -67 -71 -163 -13 -2 52 -78 -152 105 -42 -29 24 15 -114
4766a14j4r8L09%l0k00L19j08l13L97J5k52R3j54R5P3Q3J32k19J18j23q2K52l71
$$ -114 -128 -226 83 83 53 -147 172 64 -249 148 163 -89 4 -150 -55 18 101 233 14 132 9 -73 179 -192
4790a92L38l21O3J23K0J46j41K30n1p7k04J08K58k78j10L0p4N16m40J38j80l5
$$ -192 146 -175 -112 11 31 177 36 266 215 138 -66 42 300 22 -88 -58 -132 384 -56 82 -98 -133
4812a33J97O0M8j7m11J92oq8P4K65j89k1J30k57K65k04Q2nL09j19Q2j64n6LNP3
$$ -133 64 124 172 155 -256 -64 -70 -158 -84 181 -8 -29 101 -156 109 -95 -13 -18 291 172 254 90 34 37 42 115
4838A15k51J72n1K2J44j63j4j4M0P2j89l9J04M4k08P2J80j36m6J45q6R0j11l4
$$ 115 -136 36 -15 7 151 -12 -26 -40 0 72 -117 -156 -52 -8 -216 -144 36 -100 -146 -1 -87 3 -108 -142
4862a42J56K2r0J80m3k19j05K34j16J59l1p9j09J04J58j32p6Q5L99m43K30j86
$$ -142 14 36 -54 126 83 -136 -241 -7 -123 36 5 -74 -183 -79 79 -53 -129 -44 355 -88 142 -44
4884d4K23m59K80Q3po8q6K58L8l3k6j37mj05pK01k04n5K01j97j88J32R2K75m70
$$ -44 179 -280 0 83 76 8 -78 180 218 185 159 22 18 -87 -94 107 -97 -152 49 -148 -336 -204 -112 163 -307
4909c07N19k44K42l50K32M6j17q1J10j56J72k14K04J91l89K20k6r9Q3j70P9J66
$$ -307 212 -32 210 -140 92 138 21 -60 50 -106 66 -148 56 247 -142 78 52 -47 36 -134 -55 111
4931A11n6j67p4N7o3J77L12k50j49R4j43O2o0J87j01L4Q4k88K59J69n50K55J52
$$ 111 55 -112 -186 -129 -192 -15 297 47 -102 -8 -151 -89 -149 38 -63 -29 55 -233 26 195 -355 -100 52
4954E2j86q7K26q9L24o5l55K42k33J31P5K2Q5k80M50l91m8K45j10R0j23N2J14
$$ 52 -134 -221 5 -84 240 175 -180 62 -171 -40 35 57 142 -138 312 -79 -127 118 8 98 -25 27 141
4977A41j69j22L7K50j03j19R6o0j57L71l99K57k41M25L0k98J42k58J33P%K7J96
$$ 141 -28 -150 -113 137 34 -85 11 -49 -206 165 -234 23 -218 207 237 -61 81 -177 -44 -37 -37 -10 186
5000A86J77k59o7J34j90K4r2K03j01k69M98j73j12L9L8L9j57J06K79k55k55J59
$$ 186 363 104 37 171 -19 5 -87 116 15 -254 244 71 -41 -2 36 75 -82 24 303 48 -207 -48
5022d8J20J17l30N7J46k42J33Q7r8k9O6J54K4J16j85n3p9J7J76oj9j26J21j72
$$ -48 72 189 -141 -84 62 -180 -47 40 -58 -87 -21 133 157 273 88 35 -44 -27 149 143 124 -2 119 -53
5046e3L14l32K16j95O0j86J53k29K94j91K22j10j09L18k95J35m2j38J6K08J71
$$ -53 261 -71 145 -50 10 -176 -23 -252 42 -149 73 -37 -146 172 -123 12 -30 -168 -152 56 227
5067B27k21j2J46O9k56j10J17qJ06m2j55J16J87j11j52oJ91l4k41J15J84N8rk35
$$ 227 6 -6 140 209 -47 -157 -40 -48 58 16 -139 -23 164 53 -99 -105 86 52 -189 -74 110 168 159 -76
5091g6J65j58k3J79K4k5k35J25J27n6lL3j01P6R5q6l10K57%k31K43m4j3L18k73
$$ -76 89 -69 -92 87 111 86 -149 -24 103 47 44 77 -24 52 147 61 -249 8 8 -223 20 -24 -37 281 8
5116HK4K79l78L20j83j1j6j10n8j41K94j24J57o5k50M41j94J54Q9J62l18n3J22
$$ 8 32 311 -67 253 70 59 43 -67 -125 -266 28 -96 61 -4 -254 187 -7 147 236 398 80 27 149
5139A49r6p8l2O1O0j80p6J16p4j82J54K53j00lP7J64j48J5n8p7j93J25K64k31
$$ 149 53 -25 -57 4 64 -116 -192 -76 -150 -332 -178 75 -25 -28 49 213 65 80 22 -55 -248 -123 141 -90
5163i0R1j15J15P2J25j50R7l25Q3K19l23K02N7j38M4o9j5M9J09J01r0j7j34L05
$$ -90 1 -114 1 73 198 48 145 -180 -97 122 -201 1 58 -80 -36 -105 -120 -71 38 139 49 32 -102 203
5187B03j7q3k93L11L6K1j71n3M5L1m8o9K07l72K59k98K97J17k26J7L6N7r0K6K7
$$ 203 186 103 -190 121 157 178 7 -46 -1 30 -18 -87 120 -252 7 -291 6 123 -103 -86 -50 7 -83 -57 -30
5212c0J54J91l93j50L84j68L8M9O4k07J58l3j37Q3Q9j88J49K16l29n0J90L6k04
$$ -30 124 315 -78 -228 156 -12 26 75 139 -68 90 57 -80 3 92 -96 53 269 -60 -110 80 116 -88
5235h8n6K72k5m69R1L09K32k04J27j12k2j29K08J2j88q8j8K75q9k98K68Q1Jj71
$$ -88 -144 128 103 -366 -275 34 266 62 189 77 55 -74 134 146 -42 -130 -148 127 38 -260 8 89 90 -81
5259h1j59L90k51p0J76N2M3k25J05nN9j45L00j32J71k42J05Nq1n9J63k54N2K12
$$ -81 -240 150 -101 -171 5 57 100 -125 -20 -25 34 -111 189 57 228 -14 91 96 15 -44 119 -135 -83 129
5283A29k52Q6j4p9M01m94J48M4K11j3j4j78J09N7j25L4l13K89j78J40r4J9P8K32
$$ 129 -123 -37 -51 -130 271 -223 -75 -31 180 167 153 -25 84 141 16 50 -263 26 -152 -12 -106 -87 -9 223
5307B23k55J64o0m03P6L95j09k26K58j30Q5l4N6k65J73j2K04l23K29o2K6N0o8
$$ 223 -32 132 72 -331 -255 140 31 -195 63 -67 18 -16 40 -225 -52 -64 140 -183 46 -16 10 60 -8
5330hP2nm8j84J26P6K19m02K38N9l41L43k78j40K83O8N9j01M4P2j23J67j65L27
$$ -8 64 59 11 -173 -47 29 248 -154 84 143 -198 145 -133 -273 10 78 137 36 80 152 29 196 31 358
5354C58m37j26J09J99j24J53j18J76k78J61Q9k80r1J50O4l3j39K50j91j35J71
$$ 358 -79 -205 -96 103 -21 132 14 190 -88 73 162 -118 -209 -59 5 -28 -167 83 -108 -243 -72
5375g2P4j48M5P9p2L7k9K83k03q3kL10j94J42J0j25J06k76J72k10Q9j89L18R1
$$ -72 2 -146 -101 -22 -94 -57 -86 197 -6 -89 -91 219 25 167 177 52 158 -118 54 -156 -67 -256 62 153
5399A53J32k80J74j53j80J20j71L12k01N6K40o6n68M90j01K5N0k68K03J19k07
$$ 153 285 5 179 26 -154 -34 -205 107 -94 -38 202 136 -432 58 -43 -18 32 -236 -33 86 -121
5420a21P3Q4J22j59R2k4j44j14N5K90j26J5j43K08m57L57m5j4OJ78j50r5Q5R7
$$ -121 -48 36 158 -1 91 67 -77 -191 -136 154 28 43 -100 108 -349 8 -37 -51 -45 133 -17 -112 -27 70
5444G0k8j38J23m0p2J21r7J9M5jJ3J32k50M9J13k98J4K16K18k87J47J7N5k87J38
$$ 70 42 -96 27 -13 -85 36 -61 -42 3 2 15 147 -103 -54 59 -239 -225 -9 209 -78 69 86 141 -146 -8
5469hPJ50p1k72L51j28j62j33L96m7k97J05L12j56j70l3l4M54l72J43Lk2K76o39
$$ -8 -1 149 78 -194 157 29 -133 -266 130 83 -214 -109 203 47 -123 -156 -190 264 -108 35 38 16 292 -347
5493c47o1K88J81o6Q3j67k6j8Q3OO3K88n20L34k66K83M4j95k57K31l6M7J88j30
$$ -347 -408 -120 61 -5 78 -89 -115 -133 -50 -44 19 307 -213 121 -145 138 182 -13 -270 -39 -75 -28 160 30
5517C0r4J82P1j96K40l55P5R7p4O3j88L25o7j54L8Q1k77K03J00J60j00n5k9k57
$$ 30 -64 118 189 -7 233 -122 -47 50 -24 39 -149 176 109 -45 -7 74 -203 0 100 260 160 105 76 -181
5541a81J58k4RJj1j2n9J92j04Q5N6J28j50j51J43k24K40j14O4J3j17l1k4j02L57
$$ -181 -23 -47 -38 -37 -48 -60 -119 73 -31 54 110 238 88 -63 80 -144 96 -18 46 59 -58 -89 -113 -215 142
5566A42k03J46K43j40k46K22k39J39m3j96J78J05J6m19M59l34K47r4k82M09N4
$$ 142 -61 85 328 188 -58 164 -75 64 21 -175 3 108 124 -295 164 -170 77 -17 -299 110 164
5587A64J6J53j62j00j69j03Q5J20q5J04Q2k36N9M60m46L2k28O2K91J14k26R8J65
$$ 164 180 333 171 71 -98 -201 -116 4 -81 23 105 -131 -72 388 -58 -26 -254 -192 99 213 -13 85 250
5610B50l26q7O1Q0p3K81j42k3J16Kl53K75k10M59m67K86J77l52Om4J1J48j60K9
$$ 250 -76 -163 -102 -22 -95 186 44 21 137 139 -214 61 -149 310 -157 129 306 -46 -40 -84 -73 75 -85 -56
5634e6K89l64N4J68J10K5k43j02K1L16j07N2j08L0K03k71j35J05O9R1o4P6j57
$$ -56 233 -131 -77 91 201 226 -17 -119 -98 218 111 163 55 85 288 17 -118 -13 56 147 83 159 2
5657Br1J78j09k99L45k05M6K49l1J4l28R2J23K5M3l8k2k94J05J07J21j66K64O
$$ 2 -89 89 -20 -319 26 -179 -133 116 85 99 -229 -137 -14 11 54 16 -6 -300 -195 -88 33 -133 131 137
5681A37k40K11Ml18J86j7k3j33N6P3K08j74J26j04M1k5J00Rok22l9J98m14K58
$$ 137 -103 108 112 -206 -20 -37 -60 -193 -137 -64 144 -30 96 -8 33 8 108 117 111 -111 -150 48 -366 -108
5705a08R6j16J03J75j27J85k68p5J70J30j94L03m33K25Q5L2j14Q5q0j43N5K30
$$ -108 -12 -128 -25 150 23 208 -60 -135 35 165 -29 274 -159 66 151 183 69 154 74 -69 -14 216
5727B16k34k4Q4K53o3k46O7j83M0J74p5N1J4j83J18L3j40N4O3q0J48l25L74j81
$$ 216 -18 -42 42 295 232 -14 53 -130 -90 84 9 60 74 -109 9 42 -98 -44 19 -61 87 -238 136 -45
5751d5J7r6Q6kR6%mK9j98J80k00J8QJ09j33m0Q6L43j79j17mK33j25l1j06jkL34
$$ -45 -28 -124 -38 -40 56 56 52 81 -117 63 -137 -119 -111 -2 -135 -175 -89 254 75 -42 -46 187 62 31 -75 -76 -78 256
5779B56l58L89m27O4J15k15K42L2k75J10L34l78n2K30p7M7q3K44k13M8J62k68
$$ 256 -102 287 -140 -76 39 -176 66 98 -177 -67 267 -111 -163 67 -10 37 -46 198 -15 33 195 -73
5801g3o6K25q3k37K26j05J73n5J0q0N6L2q0l0Q9K6k97J57M6O9j4K54j92j0o5p4
$$ -73 -139 86 3 -234 -8 -113 60 5 15 -65 -9 23 -57 -87 2 28 -269 -112 -66 3 -11 243 51 41 -24 -98
5827i8o8M09j07p2j58L6o5J11j17nK59k47K74oj13q5k24K59m7J84k32J31r2Q3
$$ -98 -166 243 136 64 -94 -58 -123 -12 -129 -134 125 -122 152 146 33 -52 -276 -17 -64 120 -112 19 -73 10
5851A0J00K27l30l12L99jok2o4o4K44l93J79k4J2q6K02o9P7k9l0o5J10J3k19j94
$$ 10 110 337 7 -305 94 93 87 65 1 -63 181 -212 -33 -57 -45 -131 71 2 79 50 20 -45 65 78 -141 -335
5877c35M08J73k85R7L7j14K39q7j76M9r4j24%Q7j18L53j8L2k71J11j92J80p7J63
$$ -335 73 246 -39 58 95 -19 220 133 -43 6 -88 -212 -212 -125 -243 110 92 124 -147 -36 -228 -48 -125 38
5901C8n1QQ8n2k93J14J5j35J50J92m2N4j47J95kl70K94Rj14m6J60K1j96L54k07
$$ 38 -13 -5 83 31 -262 -148 -133 -268 -118 74 32 86 -61 134 132 -238 56 65 -49 -95 65 86 -110 244 37
5926C7j07J80l44k8M33n8o0j68J72j7L0p5J24k4oP7j18q7JJ06p2m1K49k39l05
$$ 37 -70 110 -234 -262 171 113 53 -115 57 40 70 -5 119 95 89 166 48 -39 -38 68 -4 -45 204 -35 -340
5951c40N09k38J24J78j91p1j42J17N4J4P8J04j76L2%M9J25l21Q9J85p4j23k7L7
$$ -340 169 -69 55 233 42 -29 -171 -54 0 14 92 196 20 52 52 101 226 -95 -6 179 105 -18 -45 -8
5975hj8k01M5J51J23k75m5P4K15R7j15M9pj40L1m6KJ63j06k09O6L07N8j41J15
$$ -8 -26 -227 -182 -31 92 -183 -228 -154 61 158 43 92 85 -55 -24 -70 -68 95 -11 -220 -154 153 211 70 185
6000A85k05N8j12n5K43J45l10j41K05P3Q8m24L66k25K1Q5N4J70l54J73j73K3L8
$$ 185 -20 38 -74 -129 114 259 -51 -192 13 86 174 -250 116 -109 -88 -3 51 221 -133 40 -133 -110 -72
6023g2Q1O4k3j48J02K8n6K08j91q6J36j90K17p0j35J73l1O1o0m8j52K00m52K63
$$ -72 9 73 50 -98 4 32 -24 184 -7 -93 43 -147 70 0 -135 38 7 68 8 -40 -192 8 -444 -181
6047a81Q1l5l0L32l68Q0K47k14J30J20l16O6K8j42J28J8M0M3J26k3m32K64n8R2
$$ -181 -100 -135 -165 167 -201 -121 126 -88 42 162 -154 -88 -60 -202 -74 -56 -16 27 153 130 -302 -38 -96 -4
6071dj10P4l0j25J73Q1K1pr7j41K06o1P9q7j68J68M5J15l76J82J40k55p9M38k42
$$ -4 -114 -40 -70 -195 -22 59 80 73 -24 -165 41 -20 59 -28 -196 -28 17 132 -244 -62 78 -177 -256 182 -60
6096f0Q8J42J73n21J68J34K8j46K2n9j82J90O8p1K6J24p6N5r1j28N1K54l1Q9j90
$$ -60 28 170 343 -178 -10 124 152 6 28 -31 -213 -23 45 -26 0 124 48 103 12 -116 -65 189 158 247 57
6121E7k1j97L29l04J25j01M7J14p5j6L00j28k03J39l1K3Nq6O3P1J23k42o2J47
$$ 57 36 -161 168 -136 -11 -112 -65 49 -26 -42 258 130 -73 66 35 58 63 -23 40 111 234 -8 -70 77
6145G7j77o6L15k84J01j6J64j67m5K33j8r5r7MK57k81J84J9l01L17j35L4k04K59
$$ 77 -100 -166 149 -135 -34 -50 114 -53 -98 135 117 22 -75 -71 186 -95 89 108 -193 124 -11 23 -181 78
6169G8o2rl4J7Q7l9j74J22j39N4K2J3J5lq8J32K9P5j22O3n6J3Lk94K58J66o4n5
$$ 78 16 7 -27 -10 77 38 -136 -14 -153 -99 -77 -64 -49 -52 -140 -8 21 96 -26 37 -19 -6 -3 -297 -39 127 63 8
6197HJ5P1m00N49j08k3k4k93K90j52k51K47K83m9j91j69J76j0l0j03J80k0J96
$$ 8 23 94 -306 243 135 112 88 -205 85 -67 -318 -71 212 163 -28 -197 -21 -31 -61 -164 16 -4 192
6220A92m28K56l6K9P1j45J69o8K4j29j30K88n1lQ0j15l8O4j74R6J9L6J31qj62
$$ 192 -236 20 -16 13 84 -61 108 40 64 -65 -195 93 42 39 119 4 -34 30 -144 -48 -29 7 138 130 -32
6245c2J19k3N7R2j07Lk40J0L11j25J10j97k02M06j18n3l15M00j30J42ro2j21n1
$$ -32 87 64 121 213 106 109 -131 -121 190 65 175 -22 -224 182 64 11 -304 96 -34 108 99 37 -84 -135
6269a35K61j62k00O4N0j10K89o7o0M19n08j52L31P6L28l93J8p4R0J4r2j45L43
$$ -135 126 -36 -236 -172 -122 -232 57 -10 -70 349 -159 -311 20 96 424 31 49 -25 65 79 -13 -158 185
6292A85l56j11K54J12j14k10L96j65k26M30j28J31P6l27L4M0J52l8j61K41k41
$$ 185 -171 -282 -28 84 -30 -240 156 -9 -235 195 67 198 274 -53 -19 21 173 135 -26 215 -26
6313b6P4k2l6r7j34K88k7n6j06K88k13J35K07l64OK55j65o4J32K23l47J08K70
$$ -26 48 26 -10 -107 -241 47 20 -36 -142 146 -67 68 275 -89 -83 172 7 -57 75 298 -49 59 329
6336C29k97N7k18k05K09L85k75k18K05J67K24n54J06%jJ32k8L2l4P5o8j44J08
$$ 329 32 89 -129 -334 -125 260 -15 -233 -28 139 363 -191 -85 -85 -86 46 18 50 16 91 23 -121 -13
6359a3K35q3m13J66Q6o2O1q8P8L03l08J13L8Rj17m5J83j13o9j61K27N3j27l1K91
$$ -13 222 139 -274 -108 -22 -84 -23 -111 -33 270 -38 75 113 122 5 -40 143 30 -39 -200 27 80 -47 -78 213
6384B13r8l46L48J21k34P2j91J04r6J48r9j12K8L63j06k4j44R6pmK6j68K81l74
$$ 213 115 -231 117 238 4 76 -115 -11 -107 41 -58 -170 -142 221 115 91 -53 43 36 32 58 -110 171 -203
6408b03J89L73n72R9P5Kj69M41K1l74J82J83nk48L0Q9j22R3p2p0N3p2J97k65J87
$$ -203 -14 359 -213 -114 -39 -37 -206 235 256 -118 64 247 242 -6 24 113 -9 84 12 -58 -5 -77 120 -145 42
6433D2J81l62K27j91M16k25j35L8J62j75j55J69MP5N7J74l58rq5M1M8K9R8J3J78
$$ 42 223 -139 88 -103 313 88 -47 -9 153 -22 -177 -8 -4 71 128 302 -56 -65 -150 -109 -61 -32 66 79 257
6458B57k18K3L6j57k8K90J11n99N81l18j34L63m26K47r1J08K2K6l05K02j19RJ02
$$ 257 39 62 98 -59 -87 203 314 -285 296 -22 -156 207 -219 28 -63 45 67 93 -212 -10 -129 -120 -18
6481a8j01j3J64j25RQL95m33q8L20j36n3J7j60M60k02oO8j0r9N4J1k79o6L44j56
$$ -18 -119 -132 32 -93 -84 -76 319 -114 -202 118 -18 -71 -54 -214 246 44 38 106 96 -3 51 62 -217 -283 61 -95
6507i5j76K36j7K05k60nP6R9j44N5j49j6P8J98J80m09j68J36J54R0LJ24m32L23
$$ -95 -271 -35 -52 153 -107 -112 -36 63 -81 -26 -175 -191 -113 85 265 -144 -312 -176 -22 68 71 195 -237 86
6531H6l33K63k01M7J3KK20k37J6L80n13N03l49J15kR3o1K73k87J24j38j83K89
$$ 86 -247 16 -185 -138 -125 -123 97 -140 -124 256 -257 246 -103 12 10 103 42 315 28 152 14 -169 120
6554A20j78K04l48J43j84K41J66m19J00L4J18m8O7J76k73k5j7r8J64J59j30J63
$$ 120 -58 146 -202 -59 -243 -2 164 -255 -155 -121 -3 -51 16 192 -81 -106 -123 -221 -57 102 -28 135
6576A35j25j95L62J2m29L34pm7l50L96J62j59j68q4K41k97j2J51j5K55l03Kr2
$$ 135 10 -185 177 189 -240 94 87 40 -310 86 248 89 -79 -163 78 -219 -231 -80 -95 160 -143 -141 -233
6599b33R7K88l31K34p1o6j3N0o6R1J4J0K16l33J22J49j1r8J43k17j3oP9M2J06
$$ -233 -136 152 -179 55 -16 -82 -95 -45 -111 -20 -6 4 220 -113 9 158 147 49 192 -25 -38 -44 35 77 183
6624A83k93JK32k55R3o3J49N3j50J79o7k17K27OM4k3Mo0J7k11L8K04n4J3lo8O6
$$ 183 -110 -109 123 -132 -39 -102 47 100 -50 129 62 -155 72 78 122 99 103 43 60 -151 -113 91 37 50 47 -21 45
6651D5j33N8K43j8j68%q4L20k70p3M1l5K34k60LN0r3J96k73L34k22K81j63K8n7
$$ 45 -88 -30 213 195 27 27 -57 263 -7 -80 -39 -74 160 -100 -97 -47 -140 56 -217 117 -105 176 13 41 -16
6676a6j93J51J40Q2l58J98j6NJ11L5j47l60K04J05n8M42k58Qm0k5j49Q4m9K08
$$ -16 -209 -58 82 164 -194 4 -12 -7 104 139 -8 -368 -164 -59 -117 325 67 75 35 10 -139 -55 -104 104
6700A04k6L5j04k83J27q0M21k22J04j41J96k28J62j33K92r3j25J00k86L9L00m8
$$ 104 78 113 9 -274 -147 -227 194 -28 76 -65 131 -97 65 -68 224 131 6 106 -180 -141 159 111
6722A11L1J14l84K22nm0l8Opj42J38o2K2k28M78l19L08j78m6j25R5J47j65J69
$$ 111 142 256 -128 94 89 49 11 17 10 -132 6 -56 -34 -262 216 -103 205 27 -19 -144 -49 98 -67 102
6746A02j43j75L17k33n9J36l9L3n9J12l2R5r5r4K65k7j11l5J14J09j83J91k4o3
$$ 102 -41 -216 101 -132 -191 -55 -94 -61 -120 -8 -40 55 -40 -134 131 104 -7 -42 72 181 -2 189 165 102
6770A02j89J43l94JM49J30j61k44M06p3k14J7q9J61j66K21j17J71k08Nj81L13
$$ 102 -87 56 -338 -337 112 242 81 -163 243 170 -44 -27 -116 45 -121 100 -17 154 -54 -49 -230 83
6792H3k40Q6J60j86k3M19j48p4k16N5M4N8n8J55k26K70o3q2J64j63M08l96J18
$$ 83 -157 -71 89 -97 -120 299 151 77 -139 -84 -40 18 -40 115 -111 159 96 14 178 15 423 27 145
6815A45l65P0L35j04j47J51j06j45lL75j29j02L7l2m5n8M07k55q4o6R6J06n6j00
$$ 145 -220 -150 185 81 -66 85 -21 -166 -169 206 77 -25 12 -20 -65 -123 284 29 -55 -121 -25 81 25 -75
6839g5P0k28N20m22J21j51J49J41l51J10PM5j81N50k84L0l70J64K58J61j14k5
$$ -75 -5 -233 287 -135 -14 -165 -16 125 -226 -116 -109 -64 -245 305 21 51 -319 -155 103 264 150 125
6861A25m1N0l7m3J12l1k35p8M3J58m9o3K43j16m1J44k19M6j07j0J24J36p8k20
$$ 125 84 134 97 54 166 135 -100 -178 -135 23 -26 -89 154 38 -3 141 -78 -32 -139 -149 -25 111 33 -187
6885a87K15J08j38r3R0j30K64J40l45L2j21K52J00l35J64J25K1m30M71l98K64
$$ -187 28 136 -2 -95 -5 -135 129 269 -76 -44 -165 87 187 -148 16 141 162 -268 203 -195 69
6906F9O2j10J45j68Q7r4J03j85M2K13k45J09j13J78m5P7j49L4j6j90L02j00j29
$$ 69 131 21 166 -2 85 -9 94 -91 -49 164 -81 28 -85 93 48 125 -24 10 -6 -196 106 6 -123
6929a23J20O5K18k40j41L09l19j12K70M3jn6j3K3j42J42o8J00pr4l7J13J10n1
$$ -123 -3 62 280 40 -101 208 -111 -223 47 90 89 33 20 43 -99 43 -25 75 68 -26 -63 50 160 109
6953A09k58Lj17L33j97K4L22n41Q0K00J22m7l3N9j59J1M9L4R6q9J22M0j93j38
$$ 109 -149 -146 -263 70 -127 -103 219 -322 -242 -42 80 33 0 59 -100 -89 -40 -6 90 1 123 163 -30 -168
6977a68L67k37J32k1j86K12l02K91M3n6j43R7K9j43l7j19K15R5j13J52j49J38
$$ -168 199 -38 94 73 -113 99 -203 88 131 75 -68 29 58 -85 -122 -241 -26 69 -44 108 -41 97
6999I7l13K39O2r8j08Q0J32j87k34J83J93j01N4K50m75L29l1K13k70j46o8K23
$$ 97 -216 23 85 -13 -121 -41 91 -96 -330 -147 46 -55 -1 249 -226 103 72 285 15 -131 -199 24
7021B4p1L73l32j69L8K10Q3j56J01j57J34L1K33l76K77k61J47k64J0K25j36o4
$$ 24 -47 326 -6 -175 -137 73 156 0 101 -56 78 109 342 -34 243 -18 129 -135 -125 100 -36 -100
7043a00K8m8Q1K06k12j29L95j08j88K8j01J09m0J79k6N0j40K11j92j10K99j17
$$ -100 -72 -120 -39 167 -45 -174 221 113 -75 -47 -148 -39 -79 100 74 124 -16 195 3 -107 192 75
7065G5k31J79l3k50M02k89J23J7Q3k54KK88k00K97k70j78L00P4J5k75qJ42J48
$$ 75 -156 23 -10 -260 142 -147 -24 -7 76 -178 -176 112 -88 209 -61 -239 61 135 150 -125 -133 9 157
7088A57j78K61j94Q1j17k12m1k8L61r7j06P7J30o1j13J41J47j3j8n0j97M2M9n9
$$ 157 -21 240 46 127 10 -202 -243 -271 90 -7 -113 -36 94 33 -80 61 208 195 177 127 -70 -28 21 -38
7112c8k5k7J3L40j75j91J74j96N9J54j02L44k19r3j09K53j96J46N5k79l7N7R3
$$ -38 -63 -90 -77 263 88 -103 71 -125 -66 88 -14 330 111 18 -91 162 -34 112 167 -112 -149 -92 1
7135AJ22l00L24l49K53Q9lQ2k12K3OL17l62L27j80k47j25L53J31j09j92n9R3o2
$$ 1 123 -177 147 -202 51 140 137 219 7 30 36 353 -9 318 138 -109 -234 119 250 141 -51 -110 -17 -79
7159g9J30m9o0K19o0n2k37K50P6j85J16o7n7K58j63j20J29k70J08J78pj73J6K95
$$ -79 51 2 -58 161 101 49 -188 62 138 -47 69 2 -55 203 40 -80 49 -221 -113 65 58 -115 -99 196
7183A96m13J64j3P7l1%n6K26l51L03r6K23o6k08J95l14mL73l8j58j35J64K0nj28
$$ 196 -217 -53 -66 11 -20 -20 -76 150 -201 102 6 229 163 -45 150 -164 -168 205 167 9 -126 38 58 53 -75
7208g5J18q0L3lR8K8k01J43R4j2rr8j0J77j52k74K82r7k5O8L2j56P5M0k49p2K97
$$ -75 43 -37 -4 -7 91 119 -82 61 155 143 134 36 26 203 51 -223 59 -38 -63 5 37 -119 -44 -4 -253 -325 -28
7235b8J8L1k1l0J21k21l0K29l52K41p8J56J05p7j84N1M9l79K77K5o0NJ52k7r0
$$ -28 -10 21 0 -30 91 -130 -160 69 -283 -42 -120 36 141 64 -120 -69 -20 -399 -122 -97 -157 -152 0 -27 -117
7260a17L84j38k09J6j58K11p5L48k21J40k49J04J09k59NJ55Q2o6k77L01j94J63
$$ -117 267 129 -80 -64 -222 -11 -86 262 41 181 -68 36 145 -114 -109 46 128 62 -215 86 -108 55
7282E5j07R9M3k88J83J88j73J6J85K5j43k97M35l52M09m56J73K7J72q5j42k15
$$ 55 -52 47 90 -198 -15 173 0 16 201 226 83 -214 221 -131 278 -178 -5 22 194 109 -33 -248
7304b48K22Q0K71j62k14J0KJ17j19K04j05p3j02J02R3l0k2l8K21j32k5o1K10j9
$$ -248 -26 54 325 163 -51 -41 -39 78 -41 163 58 -15 -117 -15 78 48 26 -12 209 77 52 -9 201 182
7328A82K7l93K35j03J03o6J63J4m5k85l7J82O0P6j54m3R1k50K84P1o9M8r8r2L1
$$ 182 209 -184 51 -52 51 -15 148 162 117 -168 -205 -23 37 113 -41 -84 7 -243 41 112 43 91 -7 -99 -68
7353f8k74L36j22J29J58n1p4j22K20j64J1M0j95j05L64j97j5N2j1L39j93Rj37
$$ -68 -342 -6 -128 1 159 108 34 -88 132 -32 -21 19 -176 -281 83 -114 -129 -77 -88 251 58 67 -70
7376g0LJ28j70J4j21K75K13k62K21j04j73j02L11k01j4J86r6j40Q0L42l33J19
$$ -70 -67 61 -109 -95 -216 59 272 10 231 127 -46 -148 163 -38 -52 134 38 -102 -22 320 -13 106
7398A06J78k75KJ6M4m6k51j1J95N8J46j69k76M79k78M4J0J65m64N61j39l3j82
$$ 106 284 9 11 27 71 25 -226 -237 -42 16 162 -7 -283 196 -82 -38 -28 137 -327 234 95 62 -120
7421a20R9K07j63k30K84J12m27L72R1l56j9K19P7k15K7J75o7P3k26L60j82j1K28
$$ -120 -21 186 23 -207 77 189 -238 134 225 -131 -150 69 146 -69 -42 133 66 139 -87 273 91 80 308
7444C08l88K24k00J13J72m44K36o4N4l9Km3j70J53m5k2M89k13k87K14k90M34l07
$$ 308 -80 144 -56 57 229 -215 21 -43 11 -28 -26 -69 -239 -86 -131 -153 336 123 -164 50 -240 194 -113
7467a13k8J08J18q6j51K89m13M31Q4k56O9k42n9K12k8J43o4r2K7K95j67j56J29
$$ -113 -141 -33 85 -1 -152 137 -276 155 239 -17 52 -190 -249 -37 -65 78 14 -78 -51 244 77 -79 50
7490E0K01k17k38J19K49j72K7m3J10k6l48L42j81N4r9L69k90P2J45k01n9J59O7
$$ 50 251 34 -204 -85 164 -8 19 -24 86 60 -288 54 -127 -73 -172 197 -93 -21 124 -77 -136 23 90
7513I0l73K6K06J40K5J14n02L99j52Q6k1N3n8k8K22k50j35K32l2j93M05k56L5
$$ 90 -283 -257 -51 89 114 228 -274 125 -27 59 38 91 33 5 227 -23 -158 74 42 -151 254 -2 33
7536C3k2nK5J22rm3j44q4J18O7j00J16k15K46j73K03j01KQ4l85L96j74L0J71l19
$$ 33 11 6 31 153 144 101 -43 -127 -9 58 -42 74 -141 105 -68 135 34 36 120 -265 131 -43 -13 158 -161
7561a61K25j87m6J98M0l17M24o5k29K90k37J75k50M05k07k85Q0J74K93k37k70
$$ -161 64 -123 -169 29 69 -248 176 111 -118 172 -65 110 -140 265 58 -227 -147 27 320 83 -187
7582a87P6K52j23lJ30M8m14M00l21J9L33l35J04J04m7j51J8J27J18j32j33J24
$$ -187 -111 141 18 15 145 193 -221 179 -142 -123 210 -125 -21 83 36 -115 -97 30 148 16 -117 7
7604Gk05NM6L74k6k47P6J29k11K45r4j63Q2m3Rj49L3L3o0J53J01j25N4Jn5J34
$$ 7 -198 -193 -147 227 201 -46 30 159 -52 193 99 -64 18 -25 -16 -165 -132 -99 -159 -6 95 -30 24 25 -30 104
7630A04J08j50k10J49L9k05J62J68m13Q9K21J90j67n5j28J95j69K48r3n81L50
$$ 104 212 62 -148 1 40 -165 -3 165 -248 -159 62 252 85 30 -98 97 -72 176 83 -498 -148
7651a48P7o2J72j25J85m5J03j93j54K20J4J19j45j65K24k4m5j29J59J34j93N6
$$ -148 -71 -133 39 -86 99 54 157 -36 -190 30 44 163 18 -147 77 53 8 -121 38 172 -21 35
7673C5N4R7k34l29L69rK1J19k13j01J93j55O1R9q6l9K60j92j14M15k09rlQ6l72
$$ 35 89 186 -48 -377 -8 -17 4 123 -90 -191 2 -153 -92 7 -79 -118 142 -50 -164 251 42 33 30 116 -256
7698b56L24nl6r9J44j27j90M00q7k04K36M1k46J34N5j13K92n5j94j5J80j58k62
$$ -256 68 63 27 -72 72 -55 -245 155 68 -136 100 141 -105 29 84 -29 263 208 14 -1 179 21 -241
7721b41K40Nk9K1K4N3j47K7j66O7L7N8J36k4J3j6R6j52n4K4J66j90L27l01K5J81
$$ -241 -1 4 -25 -4 20 73 -74 -47 -213 -146 -109 -51 85 61 74 58 154 2 -52 -28 138 -52 275 -26 -1 180
7747A80k10j04J80K57k34n1J48J33k92q2Jl5J58Q9J64l69M3j32NJ85j8q7K5J59
$$ 180 -30 -134 46 303 69 18 166 299 7 -75 -74 -109 49 138 302 -67 -24 -156 -151 34 16 -71 -46 113
7771A13j65k42M83j82J93n0j20j12j31J12J09%J07k10P8M6l8Kp2K3O2L1J37q7
$$ 113 -52 -294 189 7 200 150 30 -82 -213 -101 8 8 115 -95 -17 29 -9 -7 -79 -56 6 37 174 87
7795H7j57J48j60J15R4m93J27L73j09p2M6p0K78j19o3j33l8J45Q8n8J2r3P4j34
$$ 87 -70 78 -82 33 127 -366 -239 134 25 -47 -1 -71 207 88 25 -108 -146 -1 87 29 41 -52 22 -112
7819a12K36J22l12K60l06J34j45N5q1o6J75N7j81J35Q5j28O9R9l18J62K31k11
$$ -112 124 246 -66 194 -112 22 -123 -68 -149 -215 -40 17 -164 -29 56 -72 -3 96 -222 -60 171 -40
7841d0k05K88Q6j6j51Q0k33J63j31L03k16J34j84K52q3J38j3nj56L2J67l9m6l12
$$ -40 -245 43 129 113 -38 42 -191 -28 -159 144 -72 62 -122 130 47 185 172 167 11 43 210 171 125 -187
7865a87L12l14K0J62j07o7Q1M5Q7m2j00M5m6J96k83n9J38o0R9J31k26l7K53l2
$$ -187 125 -189 -169 -7 -114 -181 -100 -55 32 -10 -110 -65 -111 85 -198 -257 -119 -179 -80 51 -175 -212 41 9
7889IJ10r9j8j32J11o4L61m11K05kN0k49N2n9P3J17r9j58J76j87J57J18j37M08
$$ 9 119 20 2 -130 -19 -83 278 -133 72 70 120 -129 -77 -136 -63 54 -45 -203 -27 -214 -57 61 -76 332
7913C32k93J05J18j35j8k07J99j64k05J14J55o8j26K20j27J87j5k2N2j15j09J26
$$ 332 39 144 262 127 109 -98 101 -63 -268 -154 1 -67 -193 27 -100 87 72 50 102 -13 -122 4
7935DO7l8Rk8n5J92L6n66L62K70m16R8J90J7k40Q2k08p9K72K2j8N9k25L92k39
$$ 4 71 33 42 14 -41 151 187 -379 -17 253 -163 -65 125 142 -98 -16 -224 -303 -31 -9 -27 32 -193 199 -40
7960d0J40q9K23j51k34J96M4o7J61j1q0l34K45j53K16j84J64n8R9J9%mj82o3K30
$$ -40 100 11 234 83 -151 45 89 22 183 172 92 -242 3 -150 66 -118 46 -12 87 106 106 102 -80 -143 87
7985H7j33N1oj00J72j23N5n0J07j43N7j03L79j08r6j97O9M1Qk16L22k42K10K39
$$ 87 -46 5 -1 -101 71 -52 3 -47 60 -83 -26 -129 250 142 46 -151 -82 -41 -33 -249 73 -169 41 280
8009B80l22j5j62K57q1j05L6P8p4K79j65l18R9J9L15k16j21K97k13Pn5K60Q3j56
$$ 280 -42 -57 -219 38 -43 -148 -112 -34 -108 171 6 -312 -213 -194 121 -95 -216 81 -132 -125 -180 80 163 7
8033Gn2l1ok54M88J64n40J36J4K4j5J07j75M76l44n5J55r5K05o6l24L61j59j70
$$ 7 -45 -76 -82 -336 152 316 -224 -88 -74 -50 -65 42 -133 343 -1 -56 99 4 209 143 -181 180 21 -149
8057a49K90k18J38j29J1R5k12J9Q9j34J39p7j38L60k3K02j76k45K25J76o2k77
$$ -149 141 -77 61 -68 -57 38 -174 -155 -66 -200 -61 -138 -276 84 61 263 87 -158 67 243 181 -96
8079i6N1j66M28l22J51N4j93k0k15M62j86K47j26j08O2n3J76k1k13L09l03M5N7
$$ -96 -45 -211 217 -105 46 100 -93 -113 -328 134 -52 195 69 -39 23 -30 146 125 -88 221 -82 -37 20
8102B0O7p2l0j09J51J54j38o1L8k08K48k22L80j86l06N66k98j46L90k39L4j7M1
$$ 20 87 15 -15 -124 27 181 43 -18 20 -188 60 -162 218 32 -274 292 -6 -152 238 -1 33 16 57
8125E7J2n8l66M50j88J20k2j95L06k24j31L11m5k36J72j46l5J97J50Lk83q8L30
$$ 57 69 11 -355 95 -93 27 5 -190 116 -108 -239 72 27 -209 -37 -183 -218 -21 129 132 -151 -239 91
8148I1K34l86Q5p3Q3M3R3p3J1j56J73R6o6M0p5j41n3L3n8L72n4k25n4l7M2N2J1
$$ 91 325 -61 24 -49 34 77 170 97 108 -48 125 221 155 195 120 -21 -74 -41 -99 273 219 -6 -60 -97 -55 -3 8
8175HJ37j71N9j39K13j01j3l3J34n7l1M9r8j49R2J19
$$ 8 145 -26 33 -106 107 6 -7 -40 94 37 6 55 -43 -192 -100 19
8191A9
$$ Imaginary data points
##PAGE= N=2
##DATA TABLE= (X++(I..I)), XYDATA
0@%%%%%%%%%%%%%qJ6j6J6j6K4l2L4m2M8n6P1p9Q8j04J20j37J57j79K03k29K57
$$ 0 0 0 0 0 0 0 0 0 0 0 0 0 0 -8 8 -8 8 -8 16 -16 18 -24 24 -32 39 -40 48 -56 64 -73 84 -95 108 -121 136
35A36k89L24l62M03m48M98n51O10o74P44q22R07j000J099j208J331j469J619j787
$$ 136 -153 171 -191 212 -236 262 -289 321 -353 391 -431 476 -524 575 -633 698 -771 848 -939
54i39J978k195K445k735L077l485L983m607N415o496Q020j0324J4158k1597M0733
$$ -939 1039 -1156 1289 -1446 1631 -1854 2129 -2478 2937 -3559 4461 -5863 8295 -13302 27431
69B7431j70494l08923O74166J07987o16764R9745M87397k34299l14972K74166
$$ 27431 -143063 -451986 222180 330167 -286597 -186852 300545 66246 -248726 25440
79B5440J81343k72946q8585K47000M7707k39983k4727K38118j742k39657M4418
$$ 25440 206783 -66163 -154748 92252 139959 -100024 -124751 113367 111625 -128032 -83614
90h3614K10209q6867j57311J15906R4255j30020m5638J43727J722j50474M4732
$$ -83614 126595 39728 -117583 -1677 92578 -37442 -83080 60647 62369 -88105 -43373
101d3373J45824r1090j14586J21369O1293j21472Q802R1713p1008l3713J07432
$$ -43373 102451 11361 -103225 18144 79437 -42035 -33233 58480 -12528 -46241 61191
112F1191l4729j01873P9953N9891q0945j1753L9279j3239J2497P295n0700J1971
$$ 61191 26462 -75411 4542 64433 -16512 -28265 11014 -2225 10272 17567 -33133 -21162
124b1162O1219k9665m7751L5893J6177k7908J7944Q211l9753J4515M5432k3195
$$ -21162 40057 10392 -37359 -1466 14711 -13197 4747 12958 -26795 -12280 33152 9957
136I957m0696K0874L4185j3143k2287Q117O018K032P711j7555j0551K7900l896
$$ 9957 -30739 -9865 24320 11177 -11110 -2993 3025 5057 12768 -4787 -15338 12562 8666
149H666k1236K5092k646m4539L4413N0170o9915l9200R4829J0692r5825K6231
$$ 8666 -12570 12522 9876 -34663 -250 49920 -19995 -59195 35634 46326 -49499 -23268
161b3268O5801n2237j8416N7276k3593m2216M7832K6158n3702j4274M4821R950
$$ -23268 42533 -9704 -28120 29156 5563 -36653 11179 37337 -16365 -30639 14182 24132
173B4132k6754j2519R424K1398j551k8099M157K2720r850p094J3630j2429j6403
$$ 24132 -2622 -15141 -5717 15681 14130 -13969 -9812 12908 3058 -4036 9594 -2835 -19238
186a9238K7095J6444m2155j1570N2844k860n0211K1974L0368l6961l71M2526k7183
$$ -19238 7857 24301 -17854 -29424 23420 20560 -29651 -7677 22691 -14270 -14641 27885 702
199G02l7246N0242K3239o0832k578N5522j6934l1969K7150M594k4928J2127J8275
$$ 702 -36544 13698 36937 -23895 -26473 29049 12115 -19854 7296 11890 -13038 -911 17364
212A7364j6834j6742J3551K0292p696k9247l5L9397L242n1087L721N5904k1044
$$ 17364 530 -16212 -2661 17631 9935 -19312 -19347 20050 23292 -27795 -24074 31830 10786
225A0786m6470L8389K6130n1594j83N9903k4627o0830M9261N1718o4740l3273
$$ 10786 -35684 2705 28835 -22759 -22942 36961 12334 -48496 765 52483 -12257 -45530
237d5530O7135J3442n4107M59L6099n335k2628M619J5118l688j5465K149K3775
$$ -45530 21605 35047 -19060 -18601 17498 12163 -10465 -5846 9272 5584 -9881 -7732 16043
250A6043p003l6226J8503M2302l5387l4709M6473J6960m5878K540L5653k0170
$$ 16043 9040 -27186 -8683 33619 -1768 -36477 9996 26956 -18922 -16382 19271 -899
262h99j9216L3915J900l8598J6133L3344k6414j9777K5872O682j6117K259N479
$$ -899 -20115 13800 15700 -22898 -6765 26579 165 -19612 6260 12942 -3175 -916 4563
275D563r053L049J1504r189j1280J0835O524m634m842q757R574J7529j8798j8054
$$ 4563 -4490 -1441 10063 874 -10406 429 6953 2319 -2523 -11280 -1706 15823 -2975 -21029
289b1029K7024J1382l0317j108L1101j3404k4290K9167J1099l6322N425L1845
$$ -21029 5995 17377 -12940 -14048 17053 3649 -20641 8526 19625 -16697 -11272 20573
301B0573j6402j9800J8492Q038j2885J070M315p032M511O020j1516J747R615j1267
$$ 20573 4171 -15629 2863 10901 -1984 -914 3401 -3631 880 6900 -4616 -2869 6746 -4521
315d521K26J4941j5641j1982K7037M559l1686M664L1096j5530k2338K3812P799
$$ -4521 -4295 10646 -4995 -16977 10060 14619 -17067 -12403 18693 3163 -19175 4637 12436
328A2436k4302Q540J8660j8640j0206K1511N080j9644k414J6723K245j3485l873
$$ 12436 -11866 -3326 15334 -3306 -13512 7999 13079 -6565 -8979 7744 9989 -3496 -7369
341g369R720P062j2092q093J8415L025k5976Q285K6524k1955k2847L3316J5001
$$ -7369 2351 9413 -2679 -10772 7643 10668 -15308 -7023 19501 -2454 -25301 8015 23016
354B3016m0929k263M3498j4424l5767K9032K0578l4841k551L2993j0067k6898
$$ 23016 -17913 -20176 23322 8898 -26869 2163 22741 -12100 -14651 18342 8275 -18623
366a8623J7761J9955k0590j1982J8691O166j3324n199Q102O980r523p719J4306
$$ -18623 -862 19093 -1497 -13479 5212 11378 -1946 -7145 957 7937 -1586 -9305 5001
379E001K720j8408M868J9139j4502j7191K3401J1996k9967j985L2199j1378k6209
$$ 5001 7721 -10687 -5819 13320 -1182 -18373 5028 17024 -12943 -14928 17271 5893 -20316
392b0316K2050J5561k5912k670K5742p505k1824J4859J4918j7579o189J5250n81
$$ -20316 1734 17295 -8617 -11287 14455 6950 -14874 -15 14903 -2676 -8865 6385 5804
405E804q241K91K204K630k066n141M662N906r947m206J3739m08j7184Q136J6948
$$ 5804 -2437 -2146 58 2688 622 -4519 143 6049 -3898 -8104 5635 5227 -11957 -3821 13127
420A3127j5795r754J8939m5j5392P386Q636q695j895Q808l722o116P527L4n909
$$ 13127 -2668 -12422 6517 6472 -8920 -1534 7102 -1593 -3488 5320 1598 -4518 3009 3043 -2866
435b866N724L63p421O314L272j0452J765R907o285p786R744K735j2089M077R424
$$ -2866 2858 3221 -4200 2114 5386 -5066 -3301 6606 321 -7465 2279 5014 -7075 -2998 6426
450F426r912l339J2822m179r247Q402L880q495J226P398m482l286O396k003m605
$$ 6426 -3486 -6825 5997 1818 -7429 973 4853 -3642 -2416 4982 500 -2786 3610 1607 -2998
465b998O137j315n364P223m78q515O582N210j1132j374J2540l901j1313R468O470
$$ -2998 3139 1824 -3540 3683 3205 -5310 1272 6482 -4650 -6024 6516 2615 -8698 770 7240
480G240j3585J080J1540p855n020J0730j966p547N889L418p499K344P291p865
$$ 7240 -6345 -5265 6275 -1580 -6600 4130 2164 -5383 506 3924 -3575 -1231 6060 -1805
494a805k228J1005m606q648R415K533r783L561O134p076j620O641l737m617P915
$$ -1805 -4033 6972 2366 -6282 3133 5666 -4117 -556 5578 -1498 -3118 3523 -214 -4831 3084
509C084j127q728P829L873j1899L160J0679q676n624J1478N80j0870M729P857
$$ 3084 1957 -6771 1058 4931 -6968 -3808 6871 -1805 -7429 4049 4629 -6241 -1512 6345
523F345q076k354Q926l306n038P055j245n805N616J384o772K678N581o622l316
$$ 6345 -1731 -4085 4841 1535 -3503 3552 2307 -3498 2118 3502 -3270 -592 4989 -1633 -4949
538d949R028j636r226Q017M038j0532K172Q243p431k958Q843k439o982P148L543
$$ -4949 4079 2443 -6783 1234 5272 -5260 -3088 5155 -2276 -5234 3609 1170 -5812 1336 4879
553D879r915K232R336p933l498J0425k846p121O852J890p081K269L999m039k39
$$ 4879 -5036 -2804 6532 -1401 -4899 5526 2680 -4441 2411 4301 -2780 -511 3488 -551 -790
568g90M044m125k701P120k711o792P503J866q461K482P073n584m437P242J580
$$ -790 3254 -871 -3572 3548 837 -5955 1548 3414 -5047 -2565 4508 -1076 -5513 1729 3309
583C309p466L043N790o435j182O628l229l386O089q52m695L595K161o097J498
$$ 3309 -4157 -1114 4676 -1759 -2941 3687 458 -2928 3161 2309 -2386 1209 3370 -2727 -1229
598a229O036n331l209P711l156n685P067j26p150M971L957p065P71N984n086l171
$$ -1229 4807 -524 -3733 3978 822 -4863 2204 2078 -5072 -101 3856 -3209 -2438 3546 -1540 -4711
614d711P339m95o742M931L729o946R78N461l560j569L702r27k209J599J575k715
$$ -4711 2628 2133 -4609 322 4051 -2895 -1917 3544 -16 -1585 2117 1190 -1019 580 2155 -560
630e60m6L100l061j422M985k494m756N248J477o064J418O319n088l955O917K57
$$ -560 -606 2494 -567 -1989 2996 502 -4254 994 2471 -3593 -2175 4144 -944 -4899 2018 2275
646B275p573N503M005p652K168N379o085k21O324m260l238P054j024o281M571
$$ 2275 -5298 205 4210 -3442 -1274 4105 -1980 -2201 4123 -137 -3375 3679 2655 -3626 945
661I45L504p715J553O621n707k287O181k520m050M386N88m093J476L535l200k464
$$ 945 4449 -3266 -1713 4908 -799 -3086 3095 575 -3475 911 1499 -2594 -1118 2417 -783 -3247
677c247M559m7m820L870K621m945L42M622k974k493L865Q81m027K785K615o018
$$ -3247 1312 1265 -3555 315 2936 -2009 -1667 2955 -19 -2512 1353 2234 -1793 992 3607 -2411
693b411J194N743o095j524P331l351n517O567R49o865K428N205n028k024O191
$$ -2411 -1217 4526 -1569 -3093 4238 887 -4630 1937 2886 -3979 -1551 3654 -1374 -3398 2793
708B793k709l959N480o67m341L931J994m765J361M186l791k298M922O10n471K596
$$ 2793 84 -3875 1605 938 -3403 528 2522 -2243 -882 3304 -487 -2785 2137 2747 -2724 -128
724a28M196m929j116M725k336k639L448L59l496J474K088m063O84M591l727k628
$$ -128 4068 -861 -1977 2748 412 -2227 1221 1580 -1916 -442 1646 -2417 -1733 2858 -869 -3497
740c497O204j615n388M558J972m740J642L693l631j228M189j576l144M403L24
$$ -3497 2707 1092 -4296 262 2234 -2506 -864 2829 -802 -2030 2159 583 -2561 1842 2166
755B166m543L065L087n690M70M545k517k897L260J104l552J4L392k736j489L465
$$ 2166 -2377 688 3775 -1915 -1445 3100 583 -2314 946 2050 -1502 -1488 1904 -832 -2321 1144
771A144j150j996K978m64l134K936J161l544N91M349k410l296M775M90n447L293
$$ 1144 -6 -2002 976 512 -2622 314 1475 -2069 -1478 2871 461 -2835 1940 2430 -3017 276
787B76K981m440M47L126k752r73L064j271k200K871P07m017J847K588m408j25
$$ 276 3257 -1183 -736 2390 -362 -1335 1729 458 -1742 1129 1836 -2181 -334 2254 -2154 -2279
803b279M722k593k974L934M91l618J348K788j989j637L481m42l323K886R13l181
$$ -2279 2443 -150 -3124 810 1301 -2317 -969 1819 -170 -1807 1674 1232 -2091 795 1708 -1473
819a473J857J850k877K81K817k259k182L164M31l448J888K175m052N27L590l620
$$ -1473 384 2234 -643 -362 2455 196 -1986 1178 1609 -1839 49 2224 -1828 -1301 2289 -1331
835a331q70L837j162k655K406J183l360L64L846k549j661L648o54k612K482M79
$$ -1331 -2201 1636 474 -2181 225 1408 -1952 -1588 2258 -291 -1952 1696 1042 -1570 912 1391
851A391k038J039J086j092l71J011p39j332K119n5k798J899J806l549L95K820
$$ 1391 -647 392 1478 386 15 1026 287 -1045 1074 1019 -1779 120 1926 -1623 -1228 1592
867A592k120j631K590Q57l154N02L076k458j259L625j174k372L787m46l098J686
$$ 1592 -528 -2159 431 1288 -1866 -1364 1712 -746 -2005 1620 446 -1926 1861 1415 -1683 3
883CJ631k444L32K444j554j325J993m36k185K298J69k671K417Q05l705J825K035
$$ 3 1634 -810 -478 1966 412 -913 1080 644 -1541 757 926 -1745 672 1477 -2228 -403 1632
900A632k434j446L306J99l319J288K399k806l86L274j410j440K001l27j077R50
$$ 1632 -802 -2248 1058 1257 -2062 -774 1625 -1181 -1567 1707 297 -1143 858 531 -546 404
916D04L45q84o3J661p31j598K120k84k377J486J526k636K04J568r76j254J444
$$ 404 749 -135 -198 1463 732 -866 1254 970 -1407 79 1605 -1031 -827 741 -235 -1489 -45
933d5K88j900J427J565k887M81K709k740r3L195j859j838K864N43l015P65K336
$$ -45 243 -1657 -230 1335 -1552 -1071 1638 -1102 -1195 2000 141 -1697 1167 1710 -1305 -540 1796
950A796j711p82K661j580j771K881q14k549K245R53k651N83J842j456j446K146
$$ 1796 85 -697 1964 384 -1387 1494 680 -1869 376 1329 -1322 -739 1103 -353 -1799 347
966C47N32k928J540J995k524J24J877j065p39J584k43j170J137P02j631K34K181
$$ 347 879 -2049 -509 1486 -1038 -914 963 -102 -841 743 500 -670 467 1169 -462 -228 1953
983A953k031p68K424r56k100K314K37k413O75J919j555j220K224o69k158K393
$$ 1953 -78 -846 1578 622 -1478 836 1073 -1340 -665 1254 -301 -1521 703 34 -2124 269
999B69M15k511J739J391k232j18K069q09r72J022P38j514O41J268j592k85J578
$$ 269 684 -1827 -88 1303 -929 -1047 1022 213 -759 263 1001 -513 128 1396 -196 -481 1097
1016A097q80p13J395l96j249Q53N68j276l58J862r53j496K000o0k348J839J172
$$ 1097 217 -496 899 503 -746 107 675 -601 -959 903 -50 -1546 454 394 -1954 -115 1057
1033A057k054L74J557j157p89J351Q7j336J214Q80j682P26J142j546k75K141j717
$$ 1057 -997 -623 934 -223 -1012 339 426 -910 304 1184 -498 228 1370 -176 -451 1690 -27
1050b7k57J774j033j590J324P78k023K82J641r72j274J889l90k056J983K62j213
$$ -27 -284 1490 457 -1133 191 969 -1054 -772 869 -103 -1377 512 122 -1934 49 311 -902
1067i02K88J307o21p16P04Q6p80J061N49j506J198O26j925P66J221j661j37J921
$$ -902 -614 693 72 -644 60 146 -634 427 976 -530 668 1294 -631 135 1356 -305 -442 1479
1085A479r21k209J851J517k946n12L232j107k130K127L96k085R05Q18l79p49O45
$$ 1479 558 -1651 200 1717 -1229 -1741 1491 384 -1746 381 777 -1308 -403 415 36 -713 -68
1102f8P82j448M29Q12j004R36K06j036R75M16j359M63P65n74j079J622L57k503
$$ -68 714 -734 -305 507 -497 439 645 -391 584 1000 -359 104 869 295 -784 838 1195 -1308
1120a308O58K787k687j647L678q27l068K170J413k352l29K723j145j250J685R5
$$ -1308 -650 2137 -550 -2197 1481 654 -2414 -244 1169 -1183 -1512 1211 66 -1184 501 596
1136E96j400J343l07q15J368rj635J388P12j788k37J728m73j724J671N51k422
$$ 596 -804 539 232 -583 785 776 -859 529 1241 -547 -784 944 471 -1253 418 969 -1453
1153a453L29K157j183j110J456K68j204L55O54p63l85J507k59j597J403N88j707
$$ -1453 -1124 1033 -150 -1260 196 464 -740 -385 269 -494 -879 628 369 -1228 175 763 -944
1170i44J039P76j336M88J010p42p64J115P1j502J252N65j803Q69J292k278k01
$$ -944 95 871 -465 23 1033 291 -473 642 713 -789 463 1028 -775 94 1386 -892 -1093
1187a093J858o96r76J160J04j444N29J123j385j11J766p24p91J356n36r61J106
$$ -1093 765 69 -907 253 357 -1087 -558 565 -820 -931 835 111 -680 676 140 -821 285
1204B85L87p15j77J321q18r35R82M93j579O28J329j660M5J045j060J02L48j41
$$ 285 672 -43 -220 1101 283 -652 330 823 -756 -128 1201 -459 -414 631 -429 -327 21 -120
1222a20n22K73O26j120M90J140j700n3K039r14j239J868k34j587J425O01j242
$$ -120 -642 -369 257 -863 -373 767 -933 -986 1053 139 -1100 768 534 -1053 372 973 -269
1239b69k38J605p25j093J440Rr89O91M31j251K28O14p80m55P12P3o65M09N89r87
$$ -269 -507 1098 373 -720 720 729 -260 431 862 -389 -161 453 -327 -782 -70 3 -662 -253 336 -651
1259f51J00Q44j066K9J429n67n20J105O9j094K24J281j148r59J875j38j677J149
$$ -651 -551 293 -773 -744 685 118 -402 703 772 -322 -98 1183 35 -924 951 813 -864 285
1277B85O26j211k04J349p69q09R10j34j199P19J187j725K28J004r01m52J571p68
$$ 285 911 -300 -504 845 76 -733 177 43 -1156 -437 750 -975 -747 257 -644 -1096 475 -293
1295b93l54J268j91r80M73R04r53r2J498r99j027J764Oj902R84J039j370l18J233
$$ -293 -647 621 430 -550 -77 827 -126 -218 1280 281 -746 1018 1024 -878 106 1145 -225 -543 690
1314F90l85j265J161Q3q87J09Q08r04K25N54q32L76O76n93j23P48J16j070J32
$$ 690 305 -960 201 284 -603 -494 314 -590 -365 189 -643 -267 409 -184 -307 441 557 -513 -381
1333c81J106q53l05J378o23q92R73K11q78J44L40j15o39P23K56j312O30O97j431
$$ -381 725 -128 -433 945 322 -570 403 614 -264 -120 220 105 -534 189 445 -867 -237 460 -971
1352i71K22Q92p19j90Q21j37j60q7N42o40N96O39j140K23Q33m93n74J358o81r50
$$ -971 -749 143 -576 -766 55 -82 -242 -329 213 -427 169 808 -332 -109 724 231 -343 1015 334 -616
1372f16J256k68p50J50Q51q43m56J132j77j129R67m8p36M10K74j87j86O05l02
$$ -616 640 372 -378 -228 623 -220 -676 456 279 -850 117 69 -667 -257 17 -170 -356 249 -53
1391e3k34L88M95q83L39L95n08J78N60n98j89P77m49n62N57N38r95n42J347q22
$$ -53 -287 101 596 -287 52 447 -61 117 677 79 -110 667 218 -344 213 751 -244 -786 561 -261
1411b61n93J394q7j357O00N77p86L8R34m06r31P20L44n76N48Q7o97L74N85o61
$$ -261 -854 540 453 -904 -304 273 -513 -475 459 53 -878 -158 186 -390 158 245 -452 -78 507 -154
1431a54M3M94j21n68J082m58o79N80M34q10m21R15m41l20L20J53n20J46M63m61
$$ -154 -111 383 262 -306 776 318 -361 219 653 -157 -578 337 -104 -424 -104 49 -471 -325 138 -323
1451c23m70Q44J93q05N48M32q77O19M86o82K8M62m71j05L71rm00N62L86q28k7
$$ -323 -793 51 244 -561 -13 419 -458 161 647 -35 -7 455 -16 -121 250 241 -159 403 789 -39 -66
1472f6Q53q24n29Q67j53r05P21K18p83K38M25m76K72J75j75k63N76k40l09Q47
$$ -66 787 -37 -566 301 148 -757 -36 182 -601 -363 62 -414 -142 33 -142 -405 171 -69 -378 469
1492D69j19o86M49N08n89k55N27J61l41q2M37n79n2L55l6j32j38r0o4K31k26P3
$$ 469 350 -336 113 621 32 -223 304 465 124 42 479 -100 -152 203 167 35 -103 -193 -257 -26 -252 -179
1514a79m7J53J56l70O30k36q34Q37J40n02M38L76o86J03M38k12p09P29N14j003
$$ -179 -226 -73 83 -287 343 107 -727 110 250 -252 186 562 -124 -21 417 205 -504 225 739 -264
1534b64J40O24q91L57K68n50j01M41J75k28P8k16l04J82L95m79p1L56q6l81R37
$$ -264 -124 500 -391 -34 234 -316 -417 24 199 -29 49 -167 -471 -289 106 -373 -444 -88 -174 -555 382
1555C82p6n62L42R3%n00Q35j78m99J44L94n52L71K48o23J26K95k19j94k5K53l26
$$ 382 306 -256 86 179 179 -321 514 336 -163 -19 375 -177 194 442 -181 -55 240 21 -173 -198 55 -271
1577b71J55J35n06J92N77q19K96N41k96m08L11L93n29K0N14J73r00O44K67p00
$$ -271 -116 19 -487 -295 282 -537 -241 300 4 -404 -93 300 -229 -209 305 478 -422 222 489 -211
1597b11N30k81j47L14m72N87n16J36k8k90L46K68l32j43L65o83K82N17l89J43
$$ -211 319 38 -109 205 -267 320 -196 -60 -88 -378 -32 236 -96 -239 126 -557 -275 242 -147 -4
1617dK42m2m21O3P27m65l78R21m35q50R91P2p33L40K93m91J33J33n8l06P6N39
$$ -4 238 196 -225 -162 565 100 -278 643 208 -642 349 421 -312 28 321 -170 -37 96 38 -268 -192 347
1639C47p63L35M63q68K81K96o10L51L89j94l30Q40m05k51k1M91m21m2O83l34n28
$$ 347 -416 -81 382 -486 -205 91 -519 -168 221 27 -303 537 132 -119 -140 351 -70 -112 571 237 -291
1660b91M08k0m71M01L81n10l2M95m81l79N52p4k80K81K22l15L02k70j21N8K59
$$ -291 117 97 -374 27 408 -102 -134 361 -120 -499 53 -21 -301 -20 202 -113 189 -81 -202 -144 115
1681A15k53Q3L24L6m23K01L26l08j46Q00m58o49P42k34j99r7L34J68j032P38J12
$$ 115 -138 -55 269 305 -118 83 409 101 -45 755 297 -352 390 156 -43 -140 194 362 -670 68 180
1702A80o42M03J77n57pQ42m21l25L79J29q17Q58J86p62J59R32q17r1Q31n73k37
$$ 180 -462 -59 118 -439 -446 396 -25 -350 29 158 -659 199 385 -377 -218 714 -103 -194 637 64 -173
1723a73N86p3n92M47J92l80j19L49mo70M91k57k49N51o1k97q0M45j51l20M47j14
$$ -173 413 340 -252 195 387 7 -112 237 233 -437 54 -203 -452 99 38 -259 -339 106 -45 -365 82 -32
1745c2l44L01M03m44K1M72l48j0K06k8k35K58K32k85n98P69l40j75L14k91j38
$$ -32 -376 -75 328 -116 -95 377 29 19 225 197 -38 220 452 167 -431 338 -2 -177 137 -154 -292
1766b92K86K60m84j6k5K8O8J02J88k85K01Q5m57L80K76l27j11K68M5o3O0J11k04
$$ -292 -6 254 -230 -246 -271 -243 -175 -73 115 -170 31 116 -341 39 315 -12 -123 145 190 127 187 298 94
1789I4R0J48m19l5K53j24n27O15lj42J08l17J99k31K11J99n26O45o4m82L78L61
$$ 94 184 332 -87 -122 131 7 -520 95 92 -50 58 -259 -60 -291 -80 119 -407 238 174 -308 70 431
1811D31m11J84L7K9k46L69l83j06M28j95l33K24N82r69J8O62k69l72O75k74j96
$$ 431 20 204 241 270 24 393 10 -96 332 137 -196 28 610 -359 -341 321 52 -320 355 81 -115
1832a15K16N4k26j31K18k02j56N15k32m0J13k59N0J82P7j05k7J3L10m52L93Q0
$$ -115 101 155 -71 -202 16 -186 -342 173 -59 -99 14 -245 -195 -13 64 -41 -68 -55 255 -197 196 276
1854B76k93J64m5l04k42P56j29l72j86L95m09L33J96l91M1L03n8n56Q54j97m91
$$ 276 -17 147 102 -202 -444 312 183 -189 -375 20 -389 -56 140 -251 -210 93 35 -521 333 136 -355
1875c55J83N02k26m1J52j32l28J87N43o03K51K1k93J95J82l12j79L75j06m0p9
$$ -355 -172 330 104 63 215 83 -245 -58 485 -118 133 154 -139 56 238 -74 -253 122 16 -24 -103
1896a03N4q8j97L68l79J78K55J32o14L25J13k47J13J86M4m25L42L6k23K35J20
$$ -103 -49 -137 -334 34 -345 -167 88 220 -394 -69 44 -203 -90 96 140 -285 57 93 -130 105 225
1917B25k14r3K96k50K12j24j36j64o4L24n2J7P6k01j80L25MJ10n1j84R2k2k5k6
$$ 225 11 -82 214 -36 176 52 -84 -248 -312 12 -40 -23 53 -148 -328 -3 1 111 60 -124 -32 -54 -79 -105
1941a05NJ01J1j12M01k64k20J74K45j92l3k1O5K9Jj28n23M52K02m21M68K27o11
$$ -105 -100 1 12 -100 301 37 -183 -9 236 44 11 -10 55 84 85 -43 -566 -114 88 -333 135 362 -249
1964b49J20J01N1m1M5Mj7j79L23l0j94J58k77K63L72j33m87L24j5j5J42K4k45
$$ -249 -129 -28 23 -18 27 31 14 -165 158 128 -66 92 -185 78 450 317 -170 154 139 124 266 290 45
1987D5j8o5j06j38K30J39k53J77J04k63n1J25o5r2J82K02k36j08L85M6m43N33
$$ 45 27 -38 -144 -282 -52 87 -166 11 115 -148 -199 -74 -139 -231 -49 153 -83 -191 194 240 -203 330
2009C30l41j25L57k18j89L04p6j27qK21Ok00J98P9j07k0j10%j64K43j94K85m14
$$ 330 -11 -136 221 3 -186 118 42 -85 -93 128 134 -66 132 211 104 84 -26 -26 -190 53 -141 144 -270
2032b70K95j0O7k4j99K98o0j85J88K2oj07p4J54m2j73L49j71p9R1k1j35K23k56
$$ -270 25 15 82 58 -141 157 97 -88 100 122 116 9 -65 89 47 -126 223 52 -27 64 43 -92 131 -125
2056a25j87K66J17k10j13N33m54MK58l27R2J52kj3L2O5J01j11J05l30N3%k2K98
$$ -125 -312 -46 71 -139 -252 281 -173 -169 89 -238 -146 6 4 -9 23 88 189 78 183 -147 -94 -94 -116 182
2080A82l60L09P7l06L44l87J63M1p3j51l1J43j76K28K55l22k00N9o4R2K21L0k09
$$ 182 -178 131 208 -98 246 -141 22 63 -10 -161 -192 -49 -225 3 258 -64 -264 -205 -269 -177 44 74 -135
2103a35K01k04J73M0k17M01j42j47m3J4j09L13o2k54J94k23J20K16j82q8J67M2
$$ -135 66 -138 35 75 -142 259 117 -30 -73 -59 -168 145 83 -171 23 -200 -80 136 -46 -134 33 75
2125G5n3j15K36q7l25K39L9j35J12M53m89j5N3L1M8K3J17k73K13m7L7m46M03k40
$$ 75 22 -93 143 56 -269 -30 9 -126 -14 439 -50 -65 -12 19 67 90 207 -66 147 100 137 -309 94 -146
2149a46J16R3m85L39J34K62m30J43Nk74J63L7J16j49k5J23j77K30q8n7K6J73J76
$$ -146 -30 63 -422 -83 51 313 -117 26 31 -243 -80 -43 73 -76 -101 22 -155 75 -13 -70 -44 129 305
2172C05j30j68K73l33j2M44p37K55J95J28l71K71K04m36k5J18q6k22J77M8J74
$$ 305 175 7 280 -53 -65 379 -358 -103 92 220 -151 120 324 -112 -137 -19 -105 -327 -150 -102 72
2193G2k72J42m1J41o0P7J1jl9j4k9J35j23J66j05k32L22q1j00P5J92o0R4k73j79
$$ 72 -200 -58 -99 42 -18 59 70 69 30 16 -13 122 -1 165 60 -172 150 69 -31 44 236 176 270 -3 -182
2218a82L37j05P0j76j78K86P5k14L7j21j2K06J5m9L11j14J0k91L82L9l55O0R3
$$ -182 155 50 120 -56 -234 52 127 -87 -50 -171 -183 23 38 -11 300 186 196 -95 287 326 -29 31 124
2241A24k01L21j88L0k48K60j7j56L86j90j95KR0M1Q3j07q0l49L73k2j55J47R0
$$ 124 -77 244 56 86 -162 98 81 -75 311 121 -74 -72 18 59 142 35 -45 -394 -21 -43 -198 -51 39
2264C9J12q4K15m02j97K82k7J27J04p3j43J55K45l49j14L58k17j27M1l1k26L7
$$ 39 151 67 282 -120 -317 -35 -62 65 169 96 -47 108 353 4 -110 248 31 -96 -55 -86 -312 -275
2286b75J57J92l03L24l8l24M3K89j53j97M27j74P3J9q8n8O4J49k65K38J07j39
$$ -275 -118 74 -229 95 57 -267 -224 65 -88 -285 142 -32 41 60 -28 -86 -22 127 -138 100 207 68
2308F8j49J38j11K7J56j56l77O88k53l18J16P3J0J38J70n03J75m3L56k25j46K98
$$ 68 -81 57 -54 -27 129 -27 -404 284 31 -287 -171 -98 -88 50 220 -283 -108 -151 205 -20 -166 132
2330A32q4j56K39R1J9m46K22K64l32J05j57j39J81M68l37l39N84n37l9L08n3k7
$$ 132 48 -108 131 222 241 -205 17 281 -51 54 -103 -242 -61 407 70 -269 315 -222 -261 47 -6 -33
2352c3J11k73Q0Q1R4j73J70J24k47p6PQ7j26K61ok31r3L16j38Q3J31k35O4J5k4
$$ -33 78 -195 -115 -34 60 -113 57 181 -66 -142 -135 -48 -174 87 81 -150 -243 73 -65 18 149 -86 -22 -7 -31
2377c1n7p6L26l02o3M57m14K65l49J12L2J34k2l8k55J38L19k98J9J26j2N5K29
$$ -31 -88 -164 162 -140 -203 254 -160 105 -244 -132 -100 34 12 -26 -281 -143 176 -122 -103 23 11 66 295
2400B95m53j66O05k70N2J45o6j46K33l31m3K43j5j97L16l92J24N2m5k9J86J30
$$ 295 -158 -324 281 11 63 208 142 -4 229 -102 -145 98 83 -114 202 -190 -66 -14 -59 -88 98 228
2422B28q9k22K1R4k5P2j4Q7j46l68O55k80j27K63j87J25k83L93j01q9P2j28l2
$$ 228 139 -83 -62 32 7 79 65 152 6 -362 293 13 -114 149 -38 87 -196 197 96 7 79 -49 -81
2445h1K03k32q5K45k18n0K55O9l38M57l5j68l1J84j01k5j74J35R7l8J10j82J03
$$ -81 122 -110 -195 50 -168 -218 37 106 -232 225 190 22 -9 175 74 49 -125 10 107 69 179 -3 100
2468A00l4J73j20j7j86K45k06j70M12j52L0j80J7K15j15n1j0k08L69j67Q7m03
$$ 100 66 239 119 102 -84 161 -45 -215 197 45 75 -105 -88 127 12 -39 -49 -257 112 -55 32 -371
2490c71M97q2k27J74K09l4l13J78J64j21k4K5j66J94j98L5J80k8o2L7M2N6M8j44
$$ -371 126 44 -183 -9 200 166 -147 31 195 74 50 75 -91 103 -95 -60 120 92 30 67 109 165 213 69
2514F9k32J86q5P5n8O5J81o3q8o3k7K68m26O22j49k73O5o7J61q3l0J20l9k34j38
$$ 69 -163 23 -62 13 -45 20 201 138 50 -13 -40 228 -198 424 275 2 67 0 161 78 48 168 129 -105 -243
2539b43J64P8L28m90r4J96j11l1K4J51J7K38m73M85m74K40K7j92M57j79j78L79
$$ -243 -79 -1 327 -163 -257 -61 -172 -203 -179 -28 -11 227 -246 239 -235 5 32 -160 297 118 -60 319
2561C19l47L5J22j90Q8K05m1M3m52J50kJ37k65J07J07j53L19n05K64j18K2K37
$$ 319 -28 7 129 -61 27 232 191 234 -218 -68 -70 67 -198 -91 16 -137 182 -323 -59 -177 -155 82
2583H2k2k00J52J10l5Po1M3MMJ68l18L6NJ45J5j36K5Q6Nj59n6K04k78P8N7j47
$$ 82 60 -140 12 122 87 94 33 76 80 84 252 -66 -30 -25 120 135 -1 24 110 115 -44 -100 104 -174 -96 -39 -186
2610a86J67J67j35P5q3M1j29o4K79k03m0K80n5O5l08l7K10k52K22O1P5k51l6K14
$$ -186 -19 148 13 88 5 46 -83 -147 132 -71 -111 169 114 179 -129 -166 44 -208 14 75 150 -101 -137 77
2634G7j17M0l17L03J08j85J28j54q7J60P8l89K01J39Q8J11j82j82L37k68O9pK43
$$ 77 -40 0 -317 -14 94 -91 37 -117 -204 -44 34 -355 -154 -15 73 184 2 -180 157 -111 -42 -49 194
2657A94m9J30k27p9L5J57O4k91j7j13N2l7L93k54j5K2O4%p5O5j26J08K81m9j12
$$ 194 145 275 48 -31 4 161 225 -66 -83 -196 -144 -181 212 -42 -57 -35 29 29 -46 19 -107 1 282 233 121
2682A21j5l86J33J94K3J37r5L2j86O0P3J07Rj57r6O7o0J46R5l29P5L40p2l86L00
$$ 121 106 -280 -147 47 70 207 112 144 -42 18 91 198 207 50 -46 21 -39 107 202 -127 -52 288 216 -170 130
2707A30l49l2K12J80k44K48j56k7j13L86j03j31j79K70K12j90k29J61k49M7J90
$$ 130 -219 -251 -39 141 -103 145 -11 -38 -151 235 132 1 -178 92 304 114 -115 46 -203 -156 34
2728C4m4l9K83j34k00J44J16j18K4j1l41N16o4k35K70l33Q0k77L13M8j18M9j86
$$ 34 -10 -49 234 100 -100 44 160 42 66 55 -286 230 166 -69 201 -132 -52 -329 -16 32 -86 -37 -223
2751b23L43j15J27M8o0K7K6k07OJ68j18n0J02j01J37r9J3j45J7j30J06J33J00
$$ -223 120 5 132 180 120 147 173 -34 -28 140 22 -28 74 -27 110 11 24 -121 -104 -234 -128 5 105
2774A05k65K23j18J56k27L12n21K07J30K60l59m4j26L22O0qj0J0j68R8O0l16K38
$$ 105 -160 63 -55 101 -126 186 -335 -128 2 262 -97 -141 -267 55 115 107 97 107 -61 37 97 -219 19
2797A9l8j80J00j06J13K52l35J04J46l9Rk49K58R9j93%J07j16J05j69L8Q6m3j10
$$ 19 -19 -199 -99 -205 -92 160 -175 -71 75 36 45 -204 54 153 -40 -40 67 -49 56 -113 -75 11 -32 -142
2821a42J14J82o3p3k87K68j08J17p0L5j09Nl8J77M9k08Q1P3j62K61k27j28K26
$$ -142 -28 154 91 18 -269 -1 -109 8 -62 -27 -136 -131 -169 8 57 -151 -70 3 -159 102 -125 -253 -27
2844b7n0L14l47J43J05P0n5l46J51Kr4J43q1K36k18j9J65k50L41m7m11N73k59
$$ -27 -77 237 -110 33 138 208 153 -193 -42 -40 -134 9 -72 164 -54 -73 92 -158 183 136 -275 298 39
2867C9J15j55Qj24J05K17l70R9l7NP4J41pj67J68k55K24j65M51k82j00N9K63l94
$$ 39 154 -1 7 -117 -12 205 -165 -66 -103 -98 -24 117 110 -57 111 -144 80 -85 366 84 -16 43 306 -88
2891h8J74K01k68q4r1p8J19n6J52k80M24j35j36J32J99k87j01L86k18N4j1J94
$$ -88 86 287 19 -65 -156 -234 -115 -171 -19 -299 125 -10 -146 -14 185 -102 -203 183 -35 19 8 202
2913B02J1r0k8j9k20M31j34k36J36K0n04L68J43j53M2M2Q2Qk14J17k4R3p0N1l
$$ 202 213 123 95 76 -144 287 153 -83 53 73 -431 -63 80 -73 -31 11 93 101 -113 4 -20 73 3 54 51
2938E1J19o2q7q4L19l10L4l7P5p3M4K47j61L5p5j60K14N6k23J36j42L8j55L10
$$ 51 170 108 21 -63 256 -54 -20 -57 18 -55 -11 236 75 110 35 -125 89 145 -78 58 -84 -46 -201 109
2962A09q1k68j0K93M1j08k2P4m32L82J38p1p3J36J0J36j24L5k47K58k13j8J65
$$ 109 28 -240 -250 43 84 -24 -46 28 -404 -22 116 45 -28 108 118 254 130 165 -82 176 -37 -55 110
2985A10k69O7K07l2J3n1n4r2K59J37l24K0O3J62j75J04J57l52q8L70j83O0k02
$$ 110 -159 -92 115 83 96 45 -9 -101 158 295 -29 -9 54 216 41 145 302 -50 -138 232 49 109 -93
3008i3J86L3k36L28k00m26L28J02l1R4K07m92J44J09k43j56K23J26j54QkJ06n1
$$ -93 93 126 -110 218 18 -408 -80 22 -9 85 292 -200 -56 53 -190 -346 -123 3 -151 -143 -145 -39 -90
3031i0j14L27m42L14j91J42P2j72J37K01k80K54r2j29p5J67k5j69q1M55j64j48
$$ -90 -204 123 -319 -5 -196 -54 18 -154 -17 184 -96 158 66 -63 -138 29 4 -165 -246 209 45 -103
3053a03P0J93r1j04j04L65j5l94M61l30q0K31k0Kk27M0M7r4K16K58j30j85J93
$$ -103 -33 160 69 -35 -139 226 211 -183 278 -52 -132 99 79 81 -146 -106 -59 -153 63 321 191 6 199
3076A99r1k66K24mO2j52K31j88Rl3J37o5j81L08k91M2o7L41k5l97P2M4m7L0k00
$$ 199 108 -158 66 62 124 -28 203 15 24 -9 128 63 -118 190 -101 -59 -126 215 190 -207 -135 -91 -138 -108 -308
3101c08K40q4r4L63k77K72J51l29J46J40k43R8O1Q7r9O5Qk1l22J57K95m12J10
$$ -308 -68 -152 -246 117 -160 112 263 -66 80 220 -23 75 136 223 124 189 197 176 -146 11 306 -106 4
3124DJ25m4L1j28j87J51K04O3k44p6L38q7j12j62K73j53J08L2o0%j10J08n9j75
$$ 4 129 85 116 -12 -199 -48 156 219 -25 -101 237 150 38 -124 149 -4 104 136 76 76 -34 74 15 -160
3148a60N1K40l22N2J3J72r9J70j93o9J83o9j14K68k21J5J9J09J14j51k0J64j99
$$ -160 -109 131 -191 -139 -126 46 -53 117 -76 -145 38 -31 -145 123 -98 -83 -64 45 159 8 -12 152 -47
3171d7L9j56K14k66K68j00j12K63j47J54j72k7R0Jk80N4J44K6J13N1O8k78N4l4
$$ -47 -8 -164 50 -216 52 -48 -160 103 -44 110 -62 -89 1 2 -278 -224 -80 -54 59 110 178 -100 -46 -80
3195h0O5pO2R4K1j03Pj66J3M65l90L1l0K07k74o5K45j76J19N2j85PJ87k88O0L62
$$ -80 -15 -22 40 134 155 52 59 -107 -94 371 -19 12 -18 189 -85 -150 95 -81 38 90 -95 -88 99 -189 -129 233
3221B33m41J84k04J91n4m6n6O7q5K15J17q4q3N7j1k70J22J64l0p6K11j3j42J07
$$ 233 -208 -24 -228 -37 -91 -137 -193 -126 -211 4 121 37 -46 11 0 -270 -148 16 -14 -90 121 108 -34 73
3245G3k98K51K7l65L68m8k16J37m3l1J23J49P8l33M7m2K08k3j32J84j86J76k51
$$ 73 -225 26 53 -312 56 8 -208 -71 -114 -145 -22 127 205 -128 -81 -123 85 62 -70 114 -72 104 -147
3268a47K90m66K95K67k66J54j50J86m63L47k26M09k13L6j25j92L02o8PJ1l8m5
$$ -147 143 -323 -28 239 -27 127 -23 163 -300 47 -179 230 17 53 -72 -264 38 -30 -23 -12 -50 -95
3290i5P0j37P9m0j00L25l36J41K16m37K72l9J3M9J27M7j92k3k4J49j9L7J76o07
$$ -95 -25 -162 -83 -123 -223 102 -234 -93 123 -314 -42 -81 -68 -19 108 155 -37 -60 -84 65 46 83 259 -348
3314c48K09J43j57o9R5K86o9j30J5j13L02k66k9K49j04m8R3J25J8k52K9P4j3r
$$ -348 -139 4 -153 -222 -127 159 90 -40 -25 -138 164 -102 -131 118 14 -34 59 184 202 -50 -21 53 40 31
3338C1R2o0j26J35r8P0j31K17K6j98o8J24o6L8J86j89N1l0l6O5l4J7J45k98N9
$$ 31 123 63 -63 72 -26 44 -87 130 156 -42 -110 14 -52 -14 172 -17 34 4 -32 33 -1 16 161 -137 -78
3363g8k01M00N3j16L3l6N2r0j6qK0r6J53J05j54J92m60L6L57k01q6N4K10J0j42
$$ -78 -279 121 174 58 91 55 107 17 1 -7 13 -83 70 175 21 213 -247 -211 146 -55 -141 -87 123 133 -9
3388ik67J93K47j81n2R0R1j32j55L82m99L71m6r6k6J25K36l39L41j23J78m76J65
$$ -9 -276 -83 164 -17 -69 21 112 -20 -175 207 -292 79 33 -63 -89 36 272 -67 274 151 329 -147 18
3411A8j71L54rj61Q2o0n1j29J14M8L2q4J25k58K00j2k76K02J14j9J93k34J52J07
$$ 18 -153 201 192 31 113 53 2 -127 -13 35 67 -17 108 -150 50 38 -238 -36 78 59 252 18 170 277
3435B77L2m05p0j05J86K89l21J72J59l39J06J09j39N5K11k45l4Q2J96j98n4J86
$$ 277 309 -96 -166 -271 -85 204 -117 55 214 -125 -19 90 -49 6 217 -28 -62 20 216 18 -36 150
3457A50k17K6N0J0j1J19j01j23N26m02k3K54l57K78k3j0J07p4L3l08j6O5J57j74
$$ 150 -67 -41 9 19 8 127 26 -97 429 27 4 258 -99 179 156 146 253 179 212 -96 -112 -47 110 -64
3481f4Q8j15p6K39l43L02l12L45m2J45j81O5m3M7J07j62K6j37K74k40J37k51M97
$$ -64 24 -91 -167 72 -271 31 -281 64 22 167 -14 51 8 55 162 0 26 -111 163 -77 60 -191 306
3504C06k97J05J99m86J0R1n0J53k09K93j22M9m1p4Kl3K10j34n4J69K7r7Q2K06
$$ 306 9 114 313 -173 -163 -72 -122 31 -178 115 -7 42 1 -73 -71 -104 106 -28 -82 87 114 17 99 305
3528C05m52K7K33k39K82k13O9L2k2M8k74L12j72j21j91L97k81K59L0k74K00j14
$$ 305 -147 -120 113 -126 156 -57 12 44 22 70 -204 108 -64 -185 -376 21 -260 -1 29 -245 -45 -159
3550a59J64K7j50R9j00J68j02K9j8R2r7M3Q8k10Q3n3J38j51J09J7j17N6K31j85
$$ -159 5 32 -118 -19 -119 49 -53 -24 -42 50 -47 -4 84 -126 -43 -96 42 -109 0 17 -100 -44 187 2
3574Bj09k6j0R2J51k27P0Q7QJ24j03P8j11l9k86M26l73L67k23J25J61k42K02j11
$$ 2 -107 -133 -143 -51 100 -127 -57 30 38 162 59 137 26 -13 -299 127 -246 121 -102 23 184 -58 144 33
3598C3l0j11j39K86r5l12L49MM0k0K47k28k00j56L33QJ38j47K48l98J40l0j19
$$ 33 3 -108 -247 39 -56 -368 -19 -15 25 5 252 24 -176 -332 1 9 147 0 248 -150 -10 -40 -159
$$ [...]
8191d
##END NTUPLES=NMR FID
##END=
