##TITLE=1H_Ad=0(from Grignard)
 CDCl3
 8 sc, 
 17.3.2023
##JCAMPDX= 6.0         $$ Bruker NMR JCAMP-DX V2.0
##DATA TYPE= NMR FID
##DATA CLASS= NTUPLES
##ORIGIN= UXNMR, Bruker Analytische Messtechnik GmbH
##OWNER= root
$$ XWIN-NMR		Version 3.5
$$ Fri Mar 17 13:57:16 2023 Russian Standard Time (UT+4h)  she@DPX200
##.OBSERVE FREQUENCY= 200.13135
##.OBSERVE NUCLEUS= ^1H
##.DELAY= (6, 6)
##.ACQUISITION MODE= SIMULTANEOUS
##.ACQUISITION SCHEME= undefined
##.AVERAGES= 8
##.DIGITISER RES= 18
##SPECTROMETER/DATA SYSTEM= spect
##.PULSE SEQUENCE= zg30
##.SOLVENT NAME= DMSO
##.SHIFT REFERENCE= (INTERNAL, DMSO, 0, 15.7039)
##AUDIT TRAIL= $$ (NUMBER, WHEN, WHO, WHERE, WHAT)
$$ ##TITLE= Audit trail, XWIN-NMR		Version 3.5
$$ ##JCAMPDX= 5.01
$$ ##ORIGIN= Bruker BioSpin GmbH
$$ ##OWNER= she
$$ F:/spectra/data/she/nmr/H-F/1/audita.txt
$$ ##AUDIT TRAIL=  $$ (NUMBER, WHEN, WHO, WHERE, WHAT)
(   1,<2023-03-17 13:56:00.62 +0400>,<she>,<DPX200>,
      <created by zg, POWCHK disabled, PULCHK disabled
       configuration hash MD5:
       00 E9 B6 7A A2 85 ED C7 34 08 36 98 17 FE 4E 26
       data hash MD5: 16K
       D8 17 BC F5 81 6E 75 D6 B5 2D F7 C4 03 98 D5 49>)
$$ ##END=
$$ 
$$ hash MD5
$$ 59 36 FB 55 57 1F 7C 99 35 2A 8A CD 91 27 24 13
##$RELAX= 
##$RELAX= 
##$RELAX= 
##$RELAX= 
##$RELAX= 
##$RELAX= 
$$ Bruker specific parameters
$$ --------------------------
##$DU= <F:/spectra>
##$EXPNO= 1
##$NAME= <H-F>
##$PROCNO= 1
##$TYPE= <nmr>
##$USER= <she>
##$AMP= (0..31)
100 100 100 100 100 100 100 100 100 100 100 100 100 100 100 100 100 100 
100 100 100 100 100 100 100 100 100 100 100 100 100 100 
##$AQSEQ= 0
##$AQ_mod= 1
##$AUNM= <au_zg>
##$AUTOPOS= <>
##$BF1= 200.13
##$BF2= 200.13
##$BF3= 200.13
##$BF4= 200.13
##$BF5= 200.13
##$BF6= 200.13
##$BF7= 200.13
##$BF8= 200.13
##$BYTORDA= 1
##$CFDGTYP= 0
##$CFRGTYP= 5
##$CHEMSTR= <none>
##$CNST= (0..31)
1 1 145 1 1 1 1 1 1 1 1 1 1 1 1 1 1 1 1 1 1 1 1 1 1 1 1 1 1 1 1 1 
##$CPDPRG= <>
##$CPDPRG1= <>
##$CPDPRG2= <>
##$CPDPRG3= <>
##$CPDPRG4= <mlev>
##$CPDPRG5= <mlev>
##$CPDPRG6= <mlev>
##$CPDPRG7= <mlev>
##$CPDPRG8= <mlev>
##$CPDPRGB= <>
##$CPDPRGT= <>
##$D= (0..31)
0 1.2 0 0 0 0 0 0 0 0.06 0 0.03 0 0 0 0 0.0002 0 0 0 0 0 0 0 0 0 0 0 0 
0 0 0 
##$DATE= 1679046960
##$DBL= (0..7)
120 120 120 120 120 120 120 120 
##$DBP= (0..7)
150 150 150 150 150 150 150 150 
##$DBP07= 0
##$DBPNAM0= <>
##$DBPNAM1= <>
##$DBPNAM2= <>
##$DBPNAM3= <>
##$DBPNAM4= <>
##$DBPNAM5= <>
##$DBPNAM6= <>
##$DBPNAM7= <>
##$DBPOAL= (0..7)
0.5 0.5 0.5 0.5 0.5 0.5 0.5 0.5 
##$DBPOFFS= (0..7)
0 0 0 0 0 0 0 0 
##$DE= 6
##$DECBNUC= <off>
##$DECIM= 32
##$DECNUC= <off>
##$DECSTAT= 4
##$DIGMOD= 1
##$DIGTYP= 9
##$DL= (0..7)
0 120 120 120 120 120 120 120 
##$DP= (0..7)
150 150 150 150 150 150 150 150 
##$DP07= 0
##$DPNAME0= <>
##$DPNAME1= <>
##$DPNAME2= <>
##$DPNAME3= <>
##$DPNAME4= <>
##$DPNAME5= <>
##$DPNAME6= <>
##$DPNAME7= <>
##$DPOAL= (0..7)
0.5 0.5 0.5 0.5 0.5 0.5 0.5 0.5 
##$DPOFFS= (0..7)
0 0 0 0 0 0 0 0 
##$DQDMODE= 0
##$DR= 18
##$DS= 0
##$DSLIST= <SSSSSSSSSSSSSSS>
$$ [...]
##$SUBNAM2= <"">
##$SUBNAM3= <"">
##$SUBNAM4= <"">
##$SUBNAM5= <"">
##$SUBNAM6= <"">
##$SUBNAM7= <"">
##$SUBNAM8= <"">
##$SUBNAM9= <"">
##$SW= 18.05172834244
##$SWIBOX= (0..15)
0 0 2 0 0 0 0 0 0 0 0 0 0 0 0 0 
##$SW_h= 3612.71676300578
##$TD= 16384
##$TD0= 1
##$TE= 0
##$TE2= 300
##$TE3= 300
##$TEG= 300
##$TL= (0..7)
0 120 120 120 120 120 120 120 
##$TP= (0..7)
150 150 150 150 150 150 150 150 
##$TP07= 0
##$TPNAME0= <>
##$TPNAME1= <>
##$TPNAME2= <>
##$TPNAME3= <>
##$TPNAME4= <>
##$TPNAME5= <>
##$TPNAME6= <>
##$TPNAME7= <>
##$TPOAL= (0..7)
0.5 0.5 0.5 0.5 0.5 0.5 0.5 0.5 
##$TPOFFS= (0..7)
0 0 0 0 0 0 0 0 
##$TUNHIN= 0
##$TUNHOUT= 0
##$TUNXOUT= 0
##$USERA1= <user>
##$USERA2= <user>
##$USERA3= <user>
##$USERA4= <user>
##$USERA5= <user>
##$V9= 5
##$VALIST= <valist>
##$VCLIST= <CCCCCCCCCCCCCCC>
##$VD= 0
##$VDLIST= <DDDDDDDDDDDDDDD>
##$VPLIST= <PPPPPPPPPPPPPPP>
##$VTLIST= <TTTTTTTTTTTTTTT>
##$WBST= 1024
##$WBSW= 4
##$XGAIN= (0..3)
0 0 0 0 
##$XL= 0
##$YL= 0
##$YMAX_a= 208765
##$YMIN_a= -229402
##$ZGOPTNS= <>
##$ZL1= 120
##$ZL2= 120
##$ZL3= 120
##$ZL4= 120
##$ABSF1= 10
##$ABSF2= 0
##$ABSG= 5
##$ABSL= 3
##$ALPHA= 0
##$AQORDER= 0
##$ASSFAC= 0
##$ASSFACI= 0
##$ASSFACX= 0
##$ASSWID= 0
##$AUNMP= <proc_1d>
##$AZFE= 0.1
##$AZFW= 0.1
##$BCFW= 1
##$BC_mod= 2
##$BYTORDP= 1
##$COROFFS= 0
##$CY= 11.3945322036743
##$DATMOD= 1
##$DC= 2
##$DFILT= <>
##$DTYPP= 0
##$F1P= 2.36226072786647
##$F2P= -0.459571619588291
##$FCOR= 0.5
##$FTSIZE= 0
##$FT_mod= 4
##$GAMMA= 1
##$GB= 0.15
##$INTBC= 1
##$INTSCL= 1
##$ISEN= 128
##$LB= 0.24
##$LEV0= 0
##$LPBIN= 0
##$MAXI= 10000
##$MC2= 0
##$MEAN= 0
##$ME_mod= 0
##$MI= 1.114404
##$NCOEF= 0
##$NC_proc= 0
##$NLEV= 6
##$NOISF1= 3.799351
##$NOISF2= 2.8
##$NSP= 1
##$NTH_PI= 0
##$NZP= 0
##$OFFSET= 15.70392
##$PC= 1
##$PHC0= -19108.36
##$PHC1= 14.60074
##$PH_mod= 1
##$PKNL= yes
##$PPARMOD= 0
##$PSCAL= 0
##$PSIGN= 0
##$REVERSE= no
##$SF= 200.130013532006
##$SI= 16384
##$SIGF1= 3
##$SIGF2= 2
##$SINO= 400
##$SIOLD= 16384
##$SREGLST= <1H.CDCl3>
##$SSB= 0
##$STSI= 0
##$STSR= 0
##$SW_p= 3612.71676300578
##$SYMM= 0
##$S_DEV= 0
##$TDeff= 0
##$TDoff= 0
##$TI= <>
##$TILT= no
##$TM1= 0
##$TM2= 0
##$TOPLEV= 0
##$USERP1= <user>
##$USERP2= <user>
##$USERP3= <user>
##$USERP4= <user>
##$USERP5= <user>
##$WDW= 1
##$XDIM= 8192
##$YMAX_p= 0
##$YMIN_p= 0
$$ End of Bruker specific parameters
$$ ---------------------------------
##NTUPLES= NMR FID
##VAR_NAME=  TIME,          FID/REAL,        FID/IMAG
##SYMBOL=    X,             R,               I
##VAR_TYPE=  INDEPENDENT,   DEPENDENT,       DEPENDENT
##VAR_FORM=  AFFN,          ASDF,            ASDF
##VAR_DIM=   8192,          8192,            8192
##UNITS=     SECONDS,       ARBITRARY UNITS, ARBITRARY UNITS
##FACTOR=    0.0002768,     1,               1
##FIRST=     0,             0,               0
##LAST=      2.2672688,     0,               0
##MIN=       0,             -229402,         0
##MAX=       2.2672688,     208765,          0
$$ Real data points
##PAGE= N=1
##DATA TABLE= (X++(R..R)), XYDATA
$$ [...]
1730A11m79M06m78L48O5Jq2j0N9J26j49Q2J63k79j00K20J68l16L83j01Qj01j07
1753f2J57k11q6L65j09j98J16J86k4l51k46J50K49q9n6J0K09j50J62l13J56J66
1775C1J8J45j53R8j15O3J93q7m62K79K14j52p1K74j20l01J28m3n8m3j5K85m97
1798c89j95M83J29k52J72q9K26l71M53p3j1K3J34k98JL67m4l26O5P9q0J29k12
1821g9J92j59j4K80j48j47J23j07k5k92J96P0k48J18K86J35k47j04K96j34q2m4
1843a34M48m64L62O0k07j62mJ46j62k52M96O4l01J22L6l11j90M00k47O6L61l11
1865a84K40j05k90M65j23J4lj61K82j91O2N0J55Q5j86L2j03P8j46j21K73j45j00
1888a22%K30r2k14K63r5k70J65J21K61l62K1L25m91J70P1J48N3k84L08j80q1K06
$$ y = [111, -368, 38, -440, -92, -27, -26, -108, -118, -59, 67, -82, 0, 163, -116, -216, 4, 172, -144, 239, 138, 146, 45, -62, 95, -116, -202, 163, 54, -144, -28, 158, 134, -217, -463, -313, -64, -153, -209, -199, 10, -140, 22, -291, -135, 31, 49, 194, 41, 139, 24, 87, 280, 193, -269, 10, 224, 72, 1, 275, 155, -146, -18, -61, -119, -162, -177, 108, -389, -584, -101, 28, -224, -52, -141, 85, -286, 167, 94, 83, 106, 240, -58, -57, 310, 266, -60, 5, 84, 4, 133, -79, 113, -46, -60, 220, 72, -75, 48, -59, -84, -376, -180, -110, -358, -240, 46, 181, -66, -170, 126, -8, -90, -134, 314, -150, 212, 272, 65, -97, -101, 45, -117, -369, 127, 191, -110, 12, 48, -263, -453, -53, -300, -234, 127, -184, 56, -49, -339, 126, 3, 17, 14, -147, 135, -56, 6, 56, 211, 296, 110, 142, 39, 117, -29, -150, 123, -22, -122, -122, 108, 16, -198, 65, -30, -300, -135, -14, 247, -115, -94, 231, -260, -90, -19, 129, 182, -102, 206, 26, -55, 151]
1911A51J27l15L15k23j49O6o4J83j36o2L17m68J75L2L9l06O4K88k62K05pJ21k7
1934F4m31L73J2j03M6J5J05k78L09J72m05rM5J63j88J34j24M06o23L45j20l42
1956d34J33L04Qj32K07M4l51PJ08N5J52K5K09k90J96l30K07o2J21k30R5n1j3k23
1980b45J99j01J51J4J42m4j90q3l9J27p9n5K4J87M9j50J03k9j29K01k0o7P7J29
2004A72j82K3k23M14k36J26r9K32j71j03J33q3k31K1J43J85k27K80m25K1K39O0
2026F9N1l94L52N0m78J49L89K2o2K10l12J35k8l6l3o4L0R5l2j11q5M8L51m81J81
2051A6R0j70k40M27l16q2J28K54J01k75K46r7j17R0j97K77k2J0n1m59K12L99k61
2074c7K43o3n2k63M09j98K9k60L34j69j26J57J95k5k77J44k53J92l22J98J66j36
$$ y = [151, 278, -37, 278, 55, -94, -28, -92, 91, -45, -107, 210, -258, -83, -51, -12, -318, -254, 34, -228, -23, -30, 91, 64, -367, 6, 18, -85, -39, -24, 81, -197, 112, 284, -121, -130, -85, 78, -110, 24, -100, 306, -317, 28, -92, -434, -301, 3, 11, -121, 86, 130, -221, -214, -106, -51, 101, 126, 335, 45, 241, -89, 118, 56, 177, -53, 42, -9, -22, -245, -46, -147, 4, 18, 160, 116, -74, -157, -196, -69, -148, -203, -179, 8, 57, -93, 10, -19, -148, 53, 33, -34, 43, 172, -10, 13, -210, 204, -32, 94, -5, 227, 56, -47, 86, 3, -228, -207, -64, 121, -106, 174, -251, -230, 9, 69, 120, -274, 78, 128, -350, -201, 188, 210, 148, 358, 46, 181, 153, 117, 84, 20, 50, 145, 113, 2, -83, -35, 316, -165, 16, 106, -64, -304, 123, -193, -275, -147, 107, 208, -67, 179, 82, -35, 55, -142, 135, 113, 123, 72, -387, -175, 224, -37, 206, 143, 91, -172, 237, 39, 68, -192, 142, -27, -153, 4, 199, 174, -103, 41, -212, -20, -342, -144, 22, -114]
2096a14L3M2qJ10j84M40k50j91J86K49n71M55M3lLk6j27l09L30k59O4J13K1k73
2120b26K54q1L7o7K04j86P8q9k2L5L26m38L92J17m45J14J67o5M1L5p5l00L06J9
2144A31k01m0l7Rk24J06N1L31J3l64K25Kl7k8JJ7j15J40R7R2k80J83j35m7K68
2169A58o5j05k1P9j28K54ro6n7k43K47m8l3N1Nk20K35n2l7n4K32k44j02mJ75K5
2195b7j20M9J92p8J60j10J93q5k37K48k66J1O8r8K69k29J25j69L8j00L01m32M24
2218A27q4l91K61Q8R9l45J2L20k45P3L30j04r8J65l17M60k92J41r7q9O3r5lO8
2242D7j89M37m38L76k09m4N2k1l8k51K5M56k51LJ5J37Q8j03l4K83j92k33L1J51
2266I8LL7j16L11k44q5J74m88K62j19K09j51l4O8r7k3M3J77o1k26J63j28J11J68
$$ y = [-114, -81, -39, -47, 63, -121, 319, 69, -122, 64, 313, -258, 197, 240, 237, 240, 214, 87, -222, 108, -151, -87, 26, 47, -226, 28, -53, -16, -83, 121, -65, 13, -76, -98, -63, 263, -175, 217, 334, -111, 3, 170, 105, 146, 181, 106, -194, 112, 131, -70, -110, -147, -138, -362, -256, -205, 126, 139, -225, 0, 2, -35, -63, -62, -45, -160, -20, 77, 169, -111, 72, -63, -110, 158, 93, -12, -33, 46, -82, 172, 163, 97, 40, -203, 44, -4, -37, 14, 19, -201, 34, -18, -55, -109, 123, -121, -223, -227, -52, -27, -147, -98, 94, 16, 176, 66, 259, 174, -63, 185, -81, -70, -2, -100, 169, -60, 65, -104, -66, -166, 135, -297, 127, 43, -348, -87, 1, 100, -245, -233, 87, -158, -85, 245, 141, 43, 208, -109, 351, 59, 200, 103, 14, 77, -18, -21, 47, -142, 295, -143, 233, 24, -20, 32, 11, -27, -278, -253, 203, -48, -45, -30, 107, 195, 92, 58, 341, 149, -84, -53, 98, 101, 138, 22, 333, 89, 4, 178, -310, -48, -167, 42, -109, -143, -75, -172, -195, -152, 25, -36, -262, -99, -227, -116, 52]
2290E2j19R9p2n1N4j00L30l64k3K07j30J07J45N1m4Rk14mK19k22J15l68L23q3
2314h3J44Q9jqp2K4l4j72J87l8k03L44j89J16k82J63J40k42J79J34J00l62J22
2337E6o8J59j86N4K25k76j2p0r6J17j3J59n4k02J41k63K66q1k7K41j91K65k5r5
2361B4ok1l5J82l49J68k04k5L38M1J09k59J10p5p8K07l37P5n0L07L0l68K89n6
2385A7k2j64K61k04Q3R6p9k0J09p5k9p8K62j61j43L10m9L1k63J04k6prQ8k97J23
2411a42J66j51M2J1j63L99l24R6J56q8J52l57L38J05l20K32j06R9l59L42n7j67
2433i6j26M21j08j06k1K27m56L16qj17j43K06j13J57j1p5N2M3R3k95J75K1J40
2456A76l00J75m6J10k69L55L7J6k09L25k14j23l3J14l0k55R2mK90l07J00J07Q9
$$ y = [52, -67, 32, -40, -91, -37, -137, 193, -171, -194, 13, -117, -10, 135, 186, 142, 151, -63, -67, 152, -70, 45, -323, 0, -83, 61, 150, 149, 141, 69, 93, 59, -113, 74, 36, -167, 177, -12, 104, -178, -15, 125, -117, 62, 196, 296, -66, 56, -12, 147, -39, 15, 240, -36, -48, -118, -214, -97, -110, 49, -5, -207, -66, -329, -63, -144, -171, 70, -121, 144, 119, 24, 18, -3, -38, 144, -205, -37, -241, -266, 72, 113, 222, -37, 73, -2, -80, 127, -210, -135, -185, 122, 152, -216, 73, 17, -5, -169, 92, -112, -29, 67, -12, -32, 77, 2, -27, -105, 157, -4, -147, 163, 114, 145, -118, -14, -40, -47, -56, 32, -265, -142, 24, -127, -85, -74, -237, 162, -162, -66, 90, 2, 154, -203, 135, 240, -80, 152, 46, 145, -214, 128, 71, -96, -222, 199, 91, -15, -36, 191, -265, 51, 43, -74, -217, -11, -124, 33, 22, -53, -1, 42, 135, -160, 15, 36, 176, -124, 51, 5, 115, -154, 201, 238, 254, 45, 370, 156, 33, 0, 114, 84, -171, -79, -83, 207, -100, 0, 107, 196]
2479A96k60P6j80N5L60k3J14m08MQ7K2J85k76L1O6N8L5k82J17r2p6J30j08K69
2503A00R0p9l6k55l3L05j81j33K34j82j26L24J20j0j61Q8l11M01j13j36kK1J69
2526I4j25J56o9q0k0j98J88J25j33q7J87j88J76K60l80J50P4k50q5K25Q0k6P2
2549A46k22O9K31l19P1K86j23k15M2J80m9l14J13J33J31M9k02j00J25q9K38k93
2571a12p1M92l76J78j81L6J42K4k51J82j83J33l3O4K4k53J49K1j36J85K8R5lk31
2595g7O7Q7m2j56J74j46l1L47l20Ml7j89L55m6L77k41j23R5p2l2o2l3M58l24j19
2620h6j77K23N9J32o5Nj79j25L20n6k86K26L1j54R2j41o9K19P5j3j02R4K2n9j29
2645a43j64L42R3l22L93j95J36q6k23L91j6k17J42j33J30o0k20K56k88j3J99%
$$ y = [196, -64, 12, -168, -113, 247, 224, 338, -70, -66, 21, 43, 228, -48, -17, 49, 107, 142, -140, -23, -115, -191, -61, -169, 100, 190, 111, 75, -180, -213, 92, -89, -222, 12, -170, -296, 28, 148, 138, -23, 65, -246, 155, 42, -94, -96, -75, 94, -31, 125, 56, -24, -44, -242, -54, 71, -62, -149, 38, -150, 26, 286, -94, 56, 130, -120, -205, 20, 100, 74, 146, -76, -7, 224, -95, -24, 262, 139, -76, -34, 146, 97, -217, -104, 29, 160, 209, 7, -93, 32, -57, 181, -112, -183, 309, -67, 111, -70, -34, 108, 132, -119, 63, -120, 13, -20, 44, 68, -185, -36, -15, -151, 34, 62, 157, 154, -77, -10, 77, 35, -121, 53, -93, -124, 223, -97, -93, -130, -319, 36, -10, 367, 126, 3, 98, 26, -6, -68, -101, 357, 33, -86, -263, -40, 19, 151, 86, 91, -88, -213, 107, 51, -235, -9, 22, -132, -40, -181, -250, -31, 44, 31, -71, 23, 45, -14, -143, -307, 35, 128, -194, 199, 4, 140, 54, -169, 222, 206, -11, 131, -2, 128, 68, -152, 104, -184, -197, 2, 2]
2667BM0j80K05OR0j77k6j9P8j76l3K54k29L69n15M8N61nl75K66j01j4r5J06j63
2692h3J30r8M4P0l33L42r7J95l04J00j7m1J34j39PL46j25J21k21l02L8N29l09
2715a3m3R2r7k08K32M34n77K77M4m17J83J50k2j77K51j78m8J62N2k37J63m0l6
2738e3R7K1pk39K31q8J68l54K05J63l7k21J94O7k33J78k05K5K02J38j62O8j54
2761DRj4q8R4j93L43j98J18Lj94J1m7J32J12j15j31K20j39n6j50L63j91J24P7
2785I4r2M7r7K71k39J50j88J74l1j31k4m0J80j19J76L8k94R6o9K99l83Q1Q5N2
2809C6k12K84l39J97mJ64l12M60l66R1Lk9N7l33O12l06lN3j22o6J93o3j34J55
2833A6l09J41L17J7k89N3J24j33Oj24J58M1L4j69J61l6k4J86j64j56K22o8m9J25
$$ y = [2, 42, -138, 67, 73, 163, -14, -40, -59, 19, -157, -190, 64, -165, 204, -311, -263, 298, 293, -82, 184, 83, 69, -26, 80, -83, 47, -51, -7, 63, -270, 72, -25, 170, -134, -34, -51, -92, 42, -97, -90, 256, 131, 252, 31, -271, -233, 296, -13, -56, 36, -61, -269, -37, 397, -180, 97, 141, -276, -93, 57, 35, -142, 109, -69, -117, 45, 97, -140, 23, -17, -53, 44, 65, 58, -181, 50, -38, 130, -224, -19, 144, 107, -114, 80, 147, -86, 92, -113, -88, 114, 252, 90, 158, 4, 13, -1, -89, 5, -188, 155, -43, 75, 78, -116, -105, -152, -20, 92, -23, -154, 66, -73, -129, -279, 84, -107, 17, 94, 2, 49, -48, 223, -16, 134, -54, 120, 89, -42, -66, -106, 74, -45, 131, 169, -125, -29, -98, 201, -182, -101, -16, 36, -176, 108, -231, -34, -38, 126, -186, 274, -92, -1, 2, -27, 30, -303, 309, 3, 0, 53, -69, -135, 58, -5, -139, 16, -293, -152, 165, 182, -107, -54, 70, -63, -57, -181, -23, 18, 52, -117, 44, 8, -16, 170, 6, -150, 72, 4, -45, 80]
2857H0n9r5K26k35k66N31j09m63K39L66j83q1m8M31k84j69p1K64p9N2J11p7n0
2880C1J08j37q3J21j13K20j16o0K0J35j00n3J63j93P1k15J40r4L88j82m1n9m9
2903i8M74m47j02K88j29J78j42J26P3k65R4K24n49K75J70m2j04rJ24P7k69rJ75
2926A13k89M2K53l13K3L19j39j43K63K5q2j38oL16k89j42O7J27J53l3j10K09j69
2949E7N1r7k00L59j99J04O4Q5j91k20J27K50l68K19j42J42j69J16L39k65P4l72
2971b36L97j04J7l03J87J61q5J6M9q9J58k35j44J67J37l36Q2j68K20J35p5j20
2993a69j12M25n6%Q7j49R2q8j0q4L76k03j84M29l74j02O5j16J67R9p8k47N61j43
3017A86k07K35l79L11l32L6M1o6L33k69K60k68q8K01k31J11O9q5K59l9q6J80j11
$$ y = [80, 21, -74, 152, -83, -349, 182, 73, -390, -151, 215, 32, -49, -97, 334, 50, -119, -190, 74, -5, 47, 158, 81, 31, 139, 2, -81, 40, -73, 147, 31, -29, -9, 126, 26, -27, 136, -57, 14, -201, -61, -155, 233, 51, 10, -49, -98, 376, -71, -173, 115, -14, 164, 22, 148, 221, -44, 50, 274, -275, 0, 170, 128, 24, 15, 139, 216, -53, -62, 113, -176, -134, 119, -194, -171, 148, 9, -134, 129, 154, 72, -66, -72, 244, -45, -187, -120, 7, 160, 127, 17, 226, 57, 108, 11, -189, 170, -29, 75, 139, 224, 33, -187, -60, 190, -178, 41, -101, 41, -128, -12, 327, 62, 136, -236, 161, 57, 74, -229, -42, 119, 34, 50, 99, 10, 168, -67, -211, -44, 93, -243, -161, -329, -109, 26, -49, -169, -281, 144, 88, 88, 175, 26, 118, 30, 20, -64, 312, 109, -75, 354, -20, -122, -57, -173, -6, 93, 15, -232, 329, 186, -21, 214, -165, 146, -186, -150, -109, -175, 158, -111, 149, -119, -207, -6, -237, -126, -57, -142, 117, 78, -8, 172, 61]
3040F1j87K92J09l03J28k52K46O9p7l5OK21l57PPO3l0j43J47l1OJ20r3j14n0n3
3066b43K42j00K58l30J09M3L6j61J91m0L8j56P5J06j00j11L00j52L1O0k69M3K35
3089A05j69p5pK56l5j07J24j71j03L85r1j09j39r5K06J42mP6m39M09j13j29O0
3112b3O6j46J78p2Jj78K02R9J5k56K18j9k69L21l30M22K8l29j85J53L75l10k04
3135b43M14k3k3k59m2J50J10O8l26O4N7J64m7j1K2o2l44M09J66j95K17m32K66
3158A00p0k6J40j67J60k3j45N5M9j22RL8J66L9l23L47j74q4K22q7J41j65L2l08
3182a96K80J17l95K98j66O5J5k11K67Joj49j70K31o8L68k96j2k7L36l72J04L2
3205D6k72J98k27M74l36K01l1j15j86J38N6J63K03l69J55j86j94L14l7j44J85
$$ y = [61, -126, 166, 275, -28, 100, -152, 94, 163, 86, 51, 57, 278, -79, -72, -65, -2, -32, -175, -28, -59, -53, 67, -26, -140, -190, -243, -1, -101, 157, -173, -64, -21, 15, -146, 45, 5, 43, -113, -38, 68, -32, -143, 157, 5, 36, 96, -173, -130, 105, -64, -139, -146, 110, 75, -32, 92, -79, -182, 203, 112, 3, -136, -231, -25, 117, 113, 189, -250, 159, 46, -83, -23, 43, -103, 75, 3, 4, -174, 28, 127, 142, -114, 104, 85, -184, 137, -193, 229, 257, -72, -257, -104, 271, -39, -243, 171, 148, 125, -134, -176, -26, 84, 152, -174, -110, -53, 111, 64, 53, 75, 13, -331, 78, 244, 49, 266, -166, 100, 30, 4, 144, -23, 137, 114, -31, 24, 73, -49, -40, -2, 164, 203, -120, 227, 53, -31, 191, 104, 245, 80, 112, -196, 84, 201, -194, 104, -62, 3, 18, -193, 74, 75, 69, -80, -250, -19, -87, 281, -15, -27, -54, 282, -90, 14, 46, -226, -28, -255, 219, -117, 84, 53, -62, -248, -110, -54, 109, 312, -57, 98, -88, -282, 32, -5, -149, 36]
3226C6J09M2j54m4j6R2J15j20k61L08j40%j97K1J76R6j88O0J62J40p1q6R3l79
3250b06K68k20K25k23r3K46K26p6Lj69n5l2J18L4J0J52k19J21M2j96J65P9j81
3273A9j83K38k06J83k22o5L07R5m07J59j16R2R7j2j69k6M92m54L49j40J00P9p7
3296A33n1K55l07k79J12K94j44N6J78m7k4j04L8J07k01L6j39j31Q1K5jJ71K58
3319C16l53J5m0K59k74l7K18j21pK30r5k50J83OK23k71K01l21M72j92m24J38J85
3342F1mO9K6j54q4J0J78m58L09r9R6L0k05J44Q0J05J40j63J06j30qj30Jn3K86
3367A53j18p2o0Pr8Q3oJ44P1P7j58L5m2l4J26j05K46j95n3P9kJ1j23l3J63P4o0
3394A10j33L8J3L9R6K7j23l7n9l6R6j02J66R2j68Q6MJ35l08K12l13K23j75J39
$$ y = [36, 145, 187, 33, -11, -27, 65, 180, 60, -201, 107, -33, -33, -230, -209, -33, 63, -125, -65, 97, 237, 166, 80, 173, -206, 62, -158, 67, -156, -249, -3, 223, 147, 150, -19, -74, -106, 12, 46, 56, 208, -11, 110, 152, -44, 121, 200, 19, -164, 74, -132, 51, -171, -236, 71, 166, -241, -82, -198, -106, -9, -21, -190, -216, 276, -178, 171, 31, 131, 210, 133, 82, 337, 30, -249, -137, 157, 13, 69, 247, 200, 176, 72, 110, 217, 16, 52, -87, -218, -137, -112, -113, 58, 316, -37, -22, -62, 197, -77, -114, 104, -17, -24, 206, 111, -139, 44, 50, 273, 2, 203, -118, 354, 162, -262, -124, 61, 57, 126, 152, -2, -86, -76, 102, -356, -47, -146, -50, -20, -225, -81, -1, 104, 244, 81, 187, 57, 49, -81, -80, -133, 153, 35, -37, -97, -90, -188, -105, -111, 33, 104, 181, 23, 58, 16, -18, 108, 3, 249, 54, 1, 80, 78, 89, -34, -67, 96, 170, 110, -23, 15, 28, 67, 163, 190, 67, 30, -29, -65, 31, -71, 95, 187, 19, 105, 109, 244, -64, 148, -165, 58, -117, 22]
3418B2j26J09q2J22p0J79q1p6l6o6K7K62j87k92M65k31J52j08K86j30j88K06k9
3441A28k39J08j15K36j62J65Q4k17M8m8J53j70R1l1k26K40n2J32r5q4M5Mj02j0
3465a17J84K03l56K25k89Q5M0K32k24J25mj69L20l14k74J53k6jL63m56L62j0L5
3488H7o0M4lO5k6l09K79j22K33K9j57k12r7M82k68L52m16K52k42k8j41L75j93
3511g6N5K05k57j54M64k30q5Q7j0l09j3L56On6lj09J52Q3J44k01k38K37k2Q6l72
3536b60L06p7N7j32j4l7J42J41k15J06l2k04K75J1r8Q7k89L30N7k31J59l3j46
3559i7K87j52j14j08Q0J59k7J81j79k75K78J46k83r2K71j79N5J60r5l5J53m2O1
3582A53k65rJ91J17j95r1J7J14k25J57K92k59R6j23p3R0k19K88k36M71j86O8l73
$$ y = [22, -104, 5, -77, 45, -25, 154, 73, -3, -39, -105, -78, 184, -3, -295, 170, -61, 91, -17, 269, 139, -49, 157, 128, -111, -3, -118, 118, -44, 121, 205, -12, 36, -12, 141, -29, 62, 31, -195, 45, -7, 125, 30, -54, -9, -5, -107, -117, 67, 270, -86, 139, -150, -65, -25, 207, -17, 108, 104, -65, 255, -59, -333, -180, -206, -207, 156, -300, 62, 52, 87, 27, 71, 68, 133, 107, -202, 77, -45, 188, 217, 60, -152, -249, 233, -35, 317, -99, 153, -89, -117, -258, 117, -76, -21, 184, -73, -227, 237, 7, -78, 9, -1, -310, -323, 33, 39, -17, -20, -129, 23, 106, 250, 49, -189, 48, 26, 112, -260, 46, -31, 26, -106, -120, -157, -15, 126, -89, 17, -15, -219, 56, 67, -31, 56, -233, 97, 154, -77, 82, 49, -97, 190, 38, -76, -184, -104, 55, 28, 209, 30, -245, 33, 179, -104, -196, 75, -104, -49, 111, 16, -19, 134, 92, 153, -112, -121, 70, 187, -8, -99, -82, 32, -193, -36, 256, -3, 93, -30, -103, -13, -232, 56, -180, 291, 105, 173, -200]
3605b00J15R7k34L17j59n9J14J55k80l0M8K38n8J20l16N1O2J38m0J21k76L71k21
3628G4N2j4N7K6o34K68K2R9j97J93j94m6L43P6j03r3j27K21j29J28j7J65l63K46
3652E3n9k02M52l23Q0p4o3J39l4lK0j21l0m1M61k70QQ2P8j33j3l6j69L26P2j80
3678B0k27L1K57J02o5L2r3L8j25P7r3o9J52l2K5q6LL1Q1j29J90j60n9j60l2mL42
3705D7m6j36P2J06O9k89J58M5J79k25r3J01p3R7l21K86K77k76J78k5k94J32K7
3728dL6lj30J45k60L33m2r7R7j91M6L9J18k5J49k69k0%O2k75K99J93j53j04J84
3753A28q3j24kK01j11m2O8m7J31j00k6N1j99J33o3j09L06j27n3K0J28Q1l85L00
3777G6j62q0J46J59lm84K78l0O9M0Nj42J00q2J01J01l06K61j82J36r0J34l20L15
$$ y = [-200, -85, 12, -222, 95, -64, -123, -9, 146, -134, -164, -116, 122, 64, 184, -132, -81, -19, 119, 79, 200, -76, 295, 74, 126, 112, 169, 195, -439, -171, -149, -50, -247, -54, -248, -294, 49, 125, 22, -71, -198, 23, -106, 22, 5, 170, -193, 53, -6, -208, 244, -79, 1, -73, -136, 3, -31, -34, -14, -135, -165, -206, 255, -15, -7, 75, 153, 20, 7, -29, -198, 128, 200, 20, -207, -176, 81, 183, 118, 150, 57, 95, -30, 47, -46, -115, 37, 5, 30, -56, -53, -22, 59, -70, 120, -40, -99, -259, -291, -295, 47, 1, -135, -63, 43, 112, -177, -19, 26, 205, -20, -113, -12, -85, 12, -309, -23, 254, -22, 156, 131, -163, -31, -4, 32, 29, -101, 44, -216, 117, 75, -22, 75, -116, -70, -31, 87, 62, 211, -58, -78, -78, -16, -291, 8, 201, 48, -56, 128, 45, -79, -81, 120, 9, -33, 35, -12, 119, 19, -7, 44, -155, -22, -85, -194, 112, -15, -68, -48, 80, 161, -224, 76, -86, -166, -20, 139, 136, -348, -70, -100, -31, 9, 14, -128, -28, -110, -9, 92, -214, 47, -135, 1, -89, 45, -275, 40]
3801D0n6j0m6oK98j48L6L4P2j46N4j40k1P2R0j37K06j56p9R8j59K12l37K71J39
3826A81k01O5k20P0O8r8J47j11j25J34lQ2O5q0j29J55J1O4j08q1K22l46J63R8
3850B3M7k77J09M29l21j39O9J48m7p3K23k35r8M14o66K60N8R1N3q6K7J38k05j33
3874a91K37k57K53J09o6N1R5j20k53L10l53N6J83m6MP4j74LL01m48M8J53O1l06
3898b76J13j30K75J03k80P0k5k2L18j65J7J0qM3K2k27J33J80k5k31l0J05j96K61
3922C5j10K51j45J21P0k46j32K15j41J49k63J12n9j01K99j58M3J54q7j10N0J15
3944F2j93K17j48J47Pj99J5l5J89p0ok4j32L58k47L8J56j62j33R6Q3k03K10j08
3968h2j5o8J87Q9j31O3l6J96l27L00j01J9n9k51M5J01p8L47n9k49R8K59j33P2
$$ y = [40, -16, -26, -72, -78, 220, 72, 108, 142, 214, 68, 122, -18, -39, 33, 123, -14, 192, 36, -43, 55, -104, 108, -229, 42, 181, -20, 45, -175, -105, -37, -135, 12, -99, -224, -90, -93, -11, 54, -26, -155, 0, 11, 75, -33, -114, 108, -238, -75, 23, 70, -207, -98, 331, 10, -129, -60, 88, 41, -32, 191, -44, -142, 272, -394, -134, -76, 15, 68, -18, 9, 147, -58, -191, 46, -211, 42, 151, 85, 136, 231, 111, -142, 168, -185, -129, 54, 8, 12, 86, -88, -85, 216, -232, -184, -31, 30, -276, -163, -293, -18, 85, -195, -125, -150, -172, 146, -19, -2, 8, 0, 43, 65, -162, -29, 151, 126, -105, -135, -30, -226, 35, -75, 176, 31, 152, 222, -24, -156, 59, -82, 67, -196, -84, -143, -244, 55, -103, -60, 94, 7, -103, -53, 62, -131, 86, -62, 85, 92, -107, -92, -127, 62, -8, -14, -38, -170, 188, -59, -21, 135, -27, -160, -64, 19, -184, 26, -82, -97, -165, 22, 111, -20, 43, 7, 203, -124, 176, 75, 94, 35, -216, -171, -70, -148, 199, 140, -109, -11, 248, 115, 187]
3992A87j65K13j68j53J72j45J46o0J46m91K34J95k34j59K15kj88K00J35K7k25
4013a20o7P1J42K06j92r6p6K43l28p3M01k52K36j72P7lm0j71J97N0J31j88J9O5
4037F0lj7R5l04R6p6M2J58L1r0r4K56K2o5j53N9k44K61J30l39p8L09m6O1n7ro0
4064e5L67n30J17J17q6N4m7ML40k93J06j79K1Q0j59K30l4k0k8j49J81O2k38N2
4088h7K9j23k2J97J33j02j89J91o5J69J1k76J51j39l27M60R8N8k43J21k02M06
4110B49j79l8J41j90l1N8k04K43j14o5J48Qk3K1P0q6j15q1J76J93k48k2j01N1
4134a39L35j00j06L3J3j0j40K93k72j2J84k81K01P0J17j52N3l58K52K98l42J67
4156A04M8o9k3j46j30L7J00P9j47L92j91k03J11q5L75j92J9o8j81L8L44l32N8
$$ y = [187, 22, 235, 67, -86, 86, -59, 87, 27, 173, -318, -84, 111, -123, -282, -67, -69, -257, -57, 78, 105, -120, -187, -116, 26, 232, 40, -56, -132, 111, -217, -290, 111, -141, 95, -77, 0, -3, -43, -214, -17, 33, 164, -24, -5, 60, 57, 40, 135, -169, -73, -149, -107, 51, 82, -8, -102, 154, 176, 111, -42, 17, -227, 34, 164, -175, -253, 56, 10, 71, 14, 5, -55, 312, -218, -101, 16, -70, -16, -63, -59, 281, -12, 94, -85, -64, 16, -143, 87, 53, 33, 5, -144, 37, 99, -139, -87, -58, -181, -203, -6, 127, 25, -164, 27, -38, 131, 142, -134, 17, -122, -449, 11, 109, 167, -76, 45, -157, 249, 70, 32, 173, -17, -48, 10, -194, 49, -65, -130, 18, 26, 3, 24, 94, 8, -107, -188, -12, 181, -67, -89, -190, -139, 196, 96, -10, 23, 36, 26, -114, 179, -93, -105, 79, -202, -1, 69, 186, 34, 87, -271, -19, 279, -63, 104, 152, 83, 60, -86, -216, -179, -79, 0, -147, 245, 54, -149, -38, -123, 252, 60, 79, 11, -170, -132, 212, -120, -62]
4179f2J62m4J33l01l8k62M01R6j19O0Nn0j90J10J19O8j44q3J95j9j51kj85M57
4203A56k78J04J29j76L42k98J77p4j59Q6J4L3Q7K2j02k33J86k30K65j42K97j3
4225A93j60K18n00K68j0j34K14j34J92k46L5J76j18L0N3r4N7k5R0o2j84K47p6
4248C0k28L74l08K0l3J29j3J85j1k4l32J00L13j03m34K59j5q7M48l99L30l50P1
4271g8j44L61r1lM8J5L4l49J86K78k91K8j24j4M3L0K27L5j3o01J19L99O1j63K6
4296A9N2k83J95Q6o5R3Pl30N9K30Ll47L13j41K02l21O5J66j28m7L46p9J09j47
4320E7M8o6J8RO9P7j04J7k52J17P0K4o9K60j77j70L3J39J75k11l0R6k47Q2l3K16
4346A48p9J51l07K42j48j94R5J13l4P8k58K49J9R4L5k59KL64m55M06j59n1K7m
$$ y = [-62, 100, 56, 189, -112, -150, -412, -11, 85, -34, 26, 31, -19, -209, -99, 20, 88, -56, -139, 56, 37, -114, -116, -301, 156, -122, -18, 111, -65, 277, -21, 156, 82, -77, 9, 23, 56, 143, 165, 63, -170, 16, -214, 51, -91, 206, 193, 33, 251, -249, 19, 9, -125, 89, -45, 147, -99, -64, 112, -6, 24, 77, -17, 40, 15, 105, 43, -141, 106, 30, -198, 176, -132, -112, -145, -16, -29, 156, 145, 121, -211, -111, 202, 99, -335, -76, -91, -178, 270, -129, 201, -149, -78, -222, 139, 48, 45, 93, 108, 142, -207, -21, 257, -34, -6, -130, -144, -101, -71, 156, 191, 178, -423, -304, 95, 156, -7, 19, 71, -212, -17, 69, 4, 97, 104, -226, -167, 63, 66, -281, 32, -109, 93, -228, -163, 3, -125, -172, 174, 95, 204, 57, 105, 39, 57, 66, 135, 212, 108, 125, -127, -10, 60, 84, 15, 275, 98, -72, -39, 100, 275, 64, 34, 130, -117, -35, -68, 148, 69, 220, -87, 155, 7, -187, -92, 21, -13, 65, -193, 56, 75, 169, 204, -55, -53, 311, -144, 262, 103, 52, 79, 75]
4370G5j9p4NJ01q9l4J13j70P5l3j02M8q9R9K36j91Q6j77K90k04K3j16K06j40K85
4395B04l51R1j08J20K21l56J01J8J84j87k20J1J09K40M1k43K10l5j19j63K53N6
4417G7O7k50J15j70K60O8l2j47pk14K52J06k11M3J61k68J58L22k43j84J05M8J2
4440F8J6N7k65K43k1M3p0k13M3R6o2l7L07r1n5j10Q4r8J12k6J20k33J96N8j15
4465D7J86j46j32M5J73l57J30j14J3J66P2J75k6n05J76K2R0n5nm5K6K17l69N7
4489a59p9K21M03k58jJ31k47p6K08j1k79J82o4j85J91Q8l24J96j79K59k25K19
4511A1l90J54K68NN5j57J67o6O3j72r6K17k91L27o7j34L6J01J47l06J51k87K87
4534B3K60j32j15N8k25K09Op2J03j89o8K62k09k20L92k27N0r3K85k41L00k55j3
$$ y = [75, 56, -18, -13, 88, -1, -35, 78, -92, -17, -50, -152, -104, -193, -94, 142, -49, 37, -140, 150, -54, -31, -147, 59, -81, 204, -147, -56, -164, -44, 177, -179, -78, -60, 124, -63, -283, -272, -163, 77, 118, -125, 85, 50, -69, -232, 21, 77, 144, -106, 9, -161, 99, 167, 135, -12, -19, -233, 19, 125, -86, -43, 118, -150, 8, 330, 87, -97, 8, 56, 68, 84, 141, -124, 119, 98, 141, 71, -142, -99, -3, -65, -102, 205, 114, 59, -51, 33, -65, 47, 21, 141, -92, 104, 162, 47, 233, 87, -45, 0, 173, -184, -54, -168, -155, 11, 83, 258, 232, -273, -97, -75, 15, -40, -45, -90, -64, 153, -216, -159, -238, -17, 386, 128, 127, 258, 11, -65, 143, 132, -147, 35, -29, -214, -23, 65, -259, -63, -242, 17, -208, 11, -379, -225, 43, 48, 103, -54, 113, 47, 110, -62, -158, 59, -232, 95, 28, -106, -70, 31, 178, -128, 23, -264, 23, 283, 151, 36, 94, -131, 78, 84, 12, 115, -74, -142, 120, -89, -309, 83, -144, -94, -187, 98, -143, 157, -98, -111]
4557a11K87j20j16J95l7q8N4J43j76j51j5l3J74K0Q9k49J46j9J11m9j63P7j5L7
4581ij83M3K20r1J7m6Q8L29m31M2j90J02n0M79l50J18O8k44p5J70p0J13r3J97
4605A54j86j72N0R4M5R8k08J68J06o4l1lj12J3k65Q3L00j47J81Q0j65l9J35J5
4629A30l8p0k4j81L83k40k09J82J0L23k00j28M6N5j52R5KJ38k3j4L6j98J77r5
4653EL3J57l5k54K29k71R3K47r3j31J12j83N8Q5k09k32O29j63P9j38M4l4pj23
4677a02Q1n0M1j54N37l75J73r7K0k9J0j89L31O8J72j89k60nj75L6L68m18J95n9
4701g0j09J69l2p6J75K16l83J21J1J31j56J09q6j5L6j36nK47R3K2k69K41m7l51
4725a64L43k67K19k38j41M31N3l05P5J71l12J48L1Lj0j30R9Lj43KJ64o3q1K21
$$ y = [-111, 176, 56, -60, 135, 98, 10, 64, 207, 31, -120, -135, -168, 6, 26, 115, -134, 12, -7, 104, 55, -108, -31, -46, -9, -192, -149, 71, -20, -3, -49, 39, 368, -63, -21, -211, -109, -159, 320, -30, 88, 156, -88, -163, 7, -63, 50, -43, 154, -32, -204, -154, -60, -15, 83, -125, 43, 149, 85, 54, 51, -61, -48, -313, -230, 70, -77, 104, 184, 19, -20, 115, 130, 92, 22, -2, -183, 200, -40, -249, -67, -57, 266, 66, -62, -16, 39, -113, -18, -16, 122, 99, 85, 121, -77, 100, 5, 38, 195, 160, -94, 135, -136, -43, 204, 111, -20, 92, -91, -33, 52, -157, -389, 240, 77, 156, 18, 62, 28, 21, -102, -21, -71, -30, -184, 353, -22, 151, 54, 74, 45, 55, -134, 197, 265, 437, 248, -12, -17, -192, -156, 212, -206, -11, -70, -179, -10, -42, -118, 57, 273, -110, 11, 22, 153, -3, 106, 20, 5, 41, -95, -100, 147, 240, 262, -7, 234, 187, -164, 179, -88, 131, -107, -248, 183, 236, -69, 6, 177, -135, 13, 44, 47, 37, -93, 6, 9, -134, -132, 32, -31, -112, 109]
4749A09j3p5q6K42l0j42r6KJ26J76n5j2j0O1q7k4j09k27J50R7N9k44j59M18Rj06
4775b6J2N5k09K93p3o6j93R8N2j85K37Nk19K84m2K5N1j03o7N1j83K29J0j36J95
4800I5Jj5J80l13mj70o5K03J69j43K57m34M15k6j34K14l46R2O8J5j03J30p7k14
4824b05J62l9j08K83lk80L77k21J47k09j6K05Nl63L65j88J93mj92J31J10o7j44
4847f1J82j65K9j9N4q1nK23j88j48p5P6K08J0k09J53o7j25R6k5M23k07l84L34
4871B9rN2K9l6J35k29J16j17j0j44M02k19j37L59r2m4j6K8q8J00k13L10j23J28
4895B11m73J65K50k60J69j90J94j48K36l90L53J99l54o0%J28K2O4Rk09P8P0j90
4918a26P2r2M47k37m8j99K79l01J26J06O6j45J84k19K00Q7p1q2l7j46K05J9k1
$$ y = [109, 96, 21, -65, 177, 147, 5, -91, -89, 37, 213, 158, 146, 136, 197, 110, 86, -23, -250, -100, -3, 56, -188, -347, 71, 80, -26, -14, 41, -168, 125, 52, -14, -207, -109, -57, -242, -5, 0, -219, 65, 23, 48, 99, -4, -71, -20, -203, 26, 36, -100, 95, 96, 81, 261, -52, -56, -226, -291, -88, 81, -62, 195, -239, 176, 150, 16, 230, -116, -24, 44, 59, -44, 86, 9, -205, -43, -82, -190, 93, 90, -190, 187, -34, 113, -96, -112, 93, 98, -265, 100, -88, 105, 101, -91, 40, 150, 83, -61, 121, -44, -15, -34, 20, -61, -66, 157, -31, -179, -254, -178, 30, 40, -169, -16, -83, -208, -112, -137, 286, 79, -305, 29, 20, 72, 101, 65, 200, -29, 87, -30, -40, -184, 218, -1, -138, 221, 129, 85, 69, 97, 9, 109, -104, 206, 83, 211, -262, -97, 153, -107, 62, -128, 66, -82, 154, -236, 117, 316, -38, -98, -98, 30, 52, 116, 125, -84, -6, 64, -126, -54, -146, 301, 64, 16, -183, 96, -205, -79, 27, 93, -52, 132, -87, 113, 200, 129, 47, 10, -136, 69, 88, 67]
4941F7j49L12k49J98o7r2J16n11N72m17nK20K1r0p7K58j14l01L74j82L46r1j00
4964C9j00JL1K05j13N2j21K08l63K50j5j93k2J46J55r2P4q4L9k35K2j02L60k0
4988A22m14K88P8l26L60N4o3J8l66L03J01j81P9J42k73RK49m27K79J3j30K17j83
5011e1j91J91J23pl29J08K8J47k23J31J09N4j38O3JJ46l34J79K60k28K4j66j14
5034b17K54R6k07k9K36k64J43k8Q8J3po8J6N2k32K08j56J28M3o0j34K96k9k03
5058f1K18k52J62j35L4J25j04J47Oq0l9R9j60J1j23L82m00rJ69K77k00o8K53j63
5082H9Oq9q2j12n0J79K48m85J39J38L04j95j09N9p1J82j22P3l21K62o3k11O0O9
5106a02n1L12k89M2n7L05m7j54J01J19l26O1L94l21o0N2n2J8Kk29J35M10m35J05
$$ y = [67, -82, 230, -19, 179, 112, 20, 136, -375, 197, -220, -225, -5, 16, -74, -151, 107, -7, -308, 66, -116, 230, 139, 39, -61, -60, -29, 176, 63, 115, -6, 202, -161, 89, 74, -119, -141, 5, 160, 68, 142, 58, 97, -138, -116, -218, 142, 122, -292, -4, 74, -252, 108, 162, 99, 117, -249, 54, 155, -26, 53, 195, -78, -69, 180, -247, 32, 45, -85, 132, -51, -242, -51, 72, 65, -264, -156, -128, 19, -204, -73, 36, 90, -48, 15, 16, 162, -172, 7, 267, 39, 63, -103, -217, 37, 133, -74, -103, 133, -131, 12, -16, 72, 85, 78, 10, 26, 78, -154, 54, -102, 26, 69, 9, -125, 171, 142, -61, 157, -95, 67, -68, -34, 91, -13, 134, 140, 60, 21, 120, -40, -29, -152, 230, -170, -179, -10, 267, 67, -1, 252, 89, 95, 6, -76, -188, -238, -59, 189, -296, -157, -19, 285, 90, -19, 40, -31, 151, 29, 102, -219, 43, -20, -231, -171, -102, -153, 159, -130, -88, -145, 160, 113, -41, 60, 179, -147, -86, 308, -13, -73, -21, -73, -55, -53, -282, -147, 263, -172, -67]
5130f7Q3j84R2Q0R0k13J99k37J49K44l05lK18p5j36K44k79K19l24L31j61M8n2
5153c9r7J93n4j77O5N1K98m04L01k94R7J43l78M83l14K85k80L16k18j2J41o7M
5176D3N7j47K42m25L51Oj02j50R5J09r8j13j38J23j4L31o1j39k38L80j03k16K07
5199@K03l4m55M23l82M07lq7N1k8j28L09k86J19q7l15K38pJ20r3J23m1j34J03
5223A6j92J65KJ43j91J61O4N1j41j62k2k83M92O3k39J73k21J55Rk13K94M9l08
5246a35K34L2l14K15j39n4J90k74J46j15L44l1l55L62k01j39K33Oj08M20j41r0
5268H6j85K09MJ7j97Q2J66l38L3J55Q5j16Lr6J04K13m39o0K48p1k5J7J13p0K62
5293B00k07k11K35J75q6k92M51l40J39n1k8Pn0J78J5j0o1J78k88J20l7l8p0j09
$$ y = [-67, 16, -168, -76, 4, 94, -119, 80, -157, -8, 236, -69, -72, 146, 71, -65, 179, -100, 119, -205, 126, -35, 13, -39, -136, 57, 3, -174, -109, -58, 240, -164, 137, -157, -60, 83, -295, 188, -126, 159, -121, 195, -23, -35, 106, 39, 43, 100, -47, 195, -230, 121, 127, 25, -125, -30, 79, -19, -132, -270, -147, -161, 170, 109, -30, -268, 112, 9, -207, 0, 203, 169, -286, 137, -245, 162, 159, 72, 123, 95, -33, 276, -10, 109, 22, -293, -55, -62, 58, -35, 88, 47, -87, 16, -176, -11, -9, 134, -57, 104, 168, 219, 78, -84, -106, -389, 103, 166, -73, 100, -121, 34, 43, -170, 124, 173, -135, 99, 131, -183, 32, -107, -161, 29, -245, -99, -214, 130, 99, -256, 106, -95, -234, -1, 5, -103, 317, 176, 86, -99, 110, 114, 131, -66, 16, 182, -156, -123, 32, 117, 1, 4, -92, 12, 225, -214, -274, -26, -97, -122, -105, 8, -62, 200, -7, -218, 17, 192, 106, -186, 265, -75, 64, 13, -15, -8, -58, 120, 135, 125, 64, 242, -46, 74, 37, -1, -71, -180]
5317a80J11N9K6pn3j88K00L31n35J50lO12m69k86J20J43k4P9k3m9O6p2J04j84
5341g2L42l38J17j82O9J51k18K59k71K02R8j43j14O0J43k30M5Q5J36N1l25K15
5363H0j88J53J27m1J72m68J77J6o4n3L76k65j80J59M7k8RK2l1Ok09K14J09n29
5387c89M68L6q7J95l14o1K04j31J35l53K43OJ88J5j68n4k90M15j93M4J26n0JR5
5411H1k42K68j92n7J74r9o9L61k48k3L6R4j99J78Oj80M2K02k04j54K44o7J07j79
5435a20J62K6j61j8K43Qm4j12K82l03k1j73K60j72K02Q1l50J01K13j5N2k89K59
5458A11j28J10p5J9O6lj17Q0J30j50m2j06J67q1J6q3J8j4O1P3j14J04k04p9J84
5483e7k00k13N96M5j05j42L32o5k08k7j02Q0j90J81J74Q5j34j80K37p1J41m9k38
$$ y = [-180, -69, -10, 16, 9, -44, -232, -32, 299, -236, -86, -89, 523, 54, -232, -112, 31, 7, 86, 63, 14, 80, 8, 112, -72, 270, -68, 49, -133, -64, 87, -131, 128, -143, 59, 157, 14, -100, -40, 103, -127, -82, 3, 139, 190, -135, 80, -108, 45, 172, 131, 303, -165, 12, 28, -36, -89, 287, 22, -158, 1, 48, 20, 29, 51, 20, 26, -183, 31, 140, -389, 79, 115, 28, 223, -91, -152, 52, -79, 56, -297, -54, -48, 140, 155, -13, -67, -357, 58, -135, -91, 35, -15, -14, 81, -161, 107, -85, -142, 32, -67, -136, 225, -23, -46, -10, 84, -115, 63, 69, -111, -69, 133, -71, -225, 19, -48, 59, -120, 42, 68, -93, -111, 132, 140, 96, -16, 266, -37, -58, -231, 29, -143, 59, 140, -210, -109, 104, 89, 141, -148, 111, -17, 93, 18, 37, 103, 100, -17, 63, 193, 43, 1, -105, 62, -19, -3, -86, -68, -82, -21, 52, -62, 42, -162, -241, -57, -257, -470, 126, 171, 66, -76, 256, 191, -17, -44, -146, -66, -256, -75, 99, 184, 50, -130, 107, 36, 177, 128, -110]
5506a10J78j93L72j53j69K03k15J22N9O3j57j19K58j23n9M9J97k62k6J06j12J78
5528H7m6n3j09J8J93J70k85j05J45j26J80l7J52l68R4R6o0o6PL26p9j96n5K28
5552A11R9k59L7O8j00L2Lj00J10J45J35l96L08l06K67qk8r9j43K47k0j31nL01
5576B68l69J74j0r2Qo0L7O4n1m7J94r4j02jj30J62O4j99M27k43n4J0K01k13J0
5601d6J46K1l15O48m44j9k74J64k7j01K64J17l53L12k05K91j54l0Q9k71J65j66
5623a88M93q3j99ok0Kl5MK41l17n9J88q3O5J32p6l04L04M1j3p8J38n4k17N9J64
5649I9p0l40K30O2L1J92k99L15m32L02j94o6L30j82j32K04p2K56l00K36j79j12
5671a21r1K5J69k37J25J84o7k3J71N7r2k80N09j93p3k2o6j2k54M77k36Q9q1m0
$$ y = [-110, 68, -125, 247, 94, -75, 128, -87, 35, 94, 157, 0, -119, 139, 16, -43, 6, 203, -59, -85, 21, -91, 87, 41, -12, -121, -103, 90, 260, -25, -130, 15, -111, 69, 32, 184, -184, -90, 6, -54, -120, -113, 213, 134, -62, -117, 111, 210, -49, -12, 56, -44, -12, -9, -109, 1, 146, 281, -115, 193, -113, 154, 146, 118, 19, -124, 123, 103, -28, -33, 268, -101, 73, 63, -29, -21, -81, -44, 20, -31, -78, 116, 22, -80, -81, -211, -49, 15, -184, 243, 0, -54, -44, 157, -56, -46, 100, 121, -194, 454, 10, -9, -283, -119, -146, -247, 17, 134, -219, 93, -112, 179, 25, -5, 84, -187, -22, -188, 305, 222, 23, 17, -3, -1, -36, -32, 209, -108, -167, 21, -62, 3, 135, 59, -245, 59, 100, 87, 9, 147, 93, -124, -65, 99, 29, -311, -81, -19, 12, 204, -95, 220, -212, 90, -104, -170, 160, -22, -154, 50, -22, 234, -66, 170, -9, -121, -212, -187, -18, -255, -130, 54, -13, -36, 135, 192, 100, -180, 329, 136, 63, 41, -25, -37, -291, 186, -50, 39, -42, -82]
5695h2K59k33P5l4M5J70l09k5L64j92j14j44O7O5K00j2j38nQ8j74J42K5K4J46
5719B08o7q8j9k12K62k10L1J52j48o8J65P0j84O0O2j78L39q8p6o1j35N6o2J48
5743d3Q7K4Jj89K84k5N1j13m6k23M86l88mJ53J9j95R4R3j31Qk25M43l58J01K04
5768A08j94k04K99K5j05k1J68j78J96o7l8m8K07k31P8J87k25j58M19k61K37p9
5790A15j73J88k67QL09k3j71l7m8k75M6K30k30M70k11K4p3J60n5QQ7k43N29l50
5814A8q1m9K89j23N1o4N3r9L33l70j55L25j12j09n0K21k95O6j16K82q6O3n1K64
5838B05l12J36n0l1K0J45n9j90K1K75l16J25J05j83J61j62J71j23M4k2J45j10
5860el5O0k65J36j28L26m23K70K34j05K08l06P8J44j10K1J01K13m47j52K93j83
$$ y = [-82, 177, -56, 19, -15, 30, 200, -109, -134, 230, 38, -76, -220, -153, -88, 112, 100, -38, -43, 45, -129, 13, 38, 62, 208, 141, 53, 34, -178, 84, -126, -95, 57, -91, -159, 6, 76, -108, -48, 14, -164, 175, 87, 11, -50, -185, -129, -191, -43, 44, 68, 69, -120, 164, 139, 190, 77, 31, -192, 294, -94, -98, 55, 74, -121, -27, 66, -65, -57, -282, 161, -197, -96, 108, -86, -290, 9, 34, -71, -92, 76, -102, 94, 27, -11, -59, 148, -83, -5, 182, -43, -201, 218, -43, 194, 115, -58, 130, -137, -129, 180, 157, -14, -51, -99, -374, -328, -98, -328, 142, -69, -45, -118, 42, -13, -5, 82, -161, 368, 18, -63, -112, 177, 54, 105, 41, 94, -5, 328, -42, -197, 128, 16, -93, -143, 78, -217, -151, -267, 15, -71, -8, -59, 205, -107, 29, -21, -52, -32, 113, 54, -136, -115, 160, -156, -31, 74, -109, 52, -110, 61, -62, -18, -40, 105, -5, -40, 20, -245, -109, -237, 89, -334, -64, 170, 65, 273, -33, 45, 189, 79, 100, 201, 414, -33, -185, 108, -75]
5882g5J17r1m6k3k3J41k16q1K94j4J6K03j87j77K2J49o6J32j71J42pq9J0J79r9
5907D0Q3p1J61m08K06O7O8l03J31K24k45L9L48j95j84j93J22K86l04N1J47j56
5929h6K23j29J32j81j79J67J74k13J08K33l02L5m3J98O6l33J57O1j07K55J3k64
5951a5j4J13j59J75j47R6j33L02q9o1n4J73j32oo0K39m00J94l18K74j39o9K20
5974a0j01J30j32L09j8l17P8k22K31%R3l6o5J77j20J28m0j14j3R5J9R8l77K04
5998cp1J6n5K7j10J90j27MK70j91K47j50j80J45r5J07j11K16k18J32k23J93L4
6021D7j42P1j01J36P0j23Ql0Q0m04K13K27O3j95J19j47K16j18j05M9J08O9n1n0
6045A0l7K3J08n32L21O3r1p1J18j11J48J55l09L89j09l48K5M44N6k78p5J58j76
$$ y = [-75, 42, -49, -95, -118, -141, 0, -216, -297, -3, -17, -1, 202, 15, -162, -140, 9, -57, 75, -96, 46, 39, -50, -40, 139, 40, 123, 52, 213, -195, 11, 78, 146, -157, -26, 198, -47, -8, 340, 145, -39, -232, -110, 176, -128, -77, 70, -86, 137, 8, 140, -41, -220, -53, 121, -92, 16, 249, -53, -18, -61, 137, 203, -130, 27, 88, -19, 236, 249, -15, -29, 84, -75, 100, -47, 49, -84, 218, 129, 68, 14, 187, 55, 49, -11, 228, -172, 22, -296, -22, -161, -230, -10, -111, 19, -113, 196, 178, -139, -61, -283, -52, -52, 41, 5, -60, 117, -3, 125, 85, -29, -42, 53, 72, 170, -207, -3, -74, -58, -113, -86, -196, -6, -133, -129, 141, -50, 197, 47, -133, 12, -83, 24, -87, 129, -89, 43, -180, 13, 47, -95, -24, -125, 11, 81, -42, -34, -64, 16, -388, -175, 52, 115, -80, 39, -108, 108, -10, -115, -66, 42, 111, 60, 10, -27, -4, 104, -428, -107, -44, -135, -206, -88, -199, -51, 104, -205, 184, 75, -273, -248, 196, 252, -26, -101, 57, -119]
6068a19K23q4L5m5l0M6O9k79K92o5j48K25j05j67J54l1kK50m56J68J96k5j52j8
6092f8M7o1J33j29p8J61J07p1K6ql4N0r1l81M20N7J95k35j16K54k9kk27O2J96
6117A78r8j3N7J27M4k69m2M6k2k37R9L8n2J77j25J22l1n9Q7K31j08l01mN4k08
6142c09K41K68j91K70m12KJ4J31L7j19P3K37m23L91l01N3ll4kK39k90K92l4k50
6166a20K88l72q9L78k56L36l09J0P5j6L00k13M3k05K82j79J78J09j39n8J39p3
6188A09K8k68M6N3M4Q0j07N1p0L4j63J6K21Lo1R0j73P8J71J7J2k14j77L41k81
6213a20J82p4J17m8m6k9J8j24J45j66RJ15j61J76K1j08K61j58q5L35k69o9L4J31
6237H7j64J60j75J77M8j70P1j47J92K00l49q1M3J54j6Ml5O9mR0m30K45k02R8J36
$$ y = [-119, 104, 20, 55, 10, -20, 26, 95, -184, 108, 43, -105, 120, 15, -152, 2, -29, -31, 219, -237, -69, 127, 102, -50, -68, -21, -82, 51, -78, -156, 5, 112, 41, 67, 59, 25, 75, -16, -397, 23, 80, 275, 40, -76, 178, 149, 147, -80, -18, 178, 80, 67, 124, 251, 295, 26, -16, 30, 8, -229, -130, -92, -144, 33, -92, 30, -1, -60, 27, 258, 150, -151, -155, -101, -309, -68, 200, 9, 279, -133, -131, -117, 14, 51, -68, 5, 242, -181, 210, -91, -38, -41, -75, -77, 162, -128, 164, 130, -120, 168, -204, -293, 85, -171, 165, -144, -134, -59, -75, 225, 12, 55, -150, 132, -47, 131, 240, 101, 43, 182, 109, 137, -131, -85, -32, 12, 92, -15, 36, -34, 0, -163, -147, 74, 77, 16, 106, -67, 11, 182, 199, 211, -3, -180, 161, -120, 62, -12, 105, 57, 11, -18, 0, -124, 21, -145, -136, -21, -182, -6, 15, -93, 168, 10, -75, 260, -9, -78, -44, 87, -77, 83, -92, 85, 133, -37, 34, -113, 79, 279, -70, -151, -108, 46, 30, 34, -1, 68, 64, 154, -276, -31, -233, -135, 1]
6262Aj18J16k0j94L66j35K8j86p6J07L6K94k92K07j82J95m21J03K83j73j8kj05
6285a86J36J07K8j5j23R5l6J69k36L11k70l5N1r2J24j14J55m9jL1j08J82j00k57
6309b33J13J87P8j67N7N9j25k20L36m9j54R4lM7p9K26j88j19J38k5n6p3L25k53
6333h4K48k29L69l99M2L7l20K87O0j7P3Ok1k0k33k3K94K2k05N2M49n41K41l15
6357b27O3K67k62J51j32K84j01j2j85K13p7m8J49P%j02j46L38k4k08L2L30j53
6380A57l48P9K95j02r9P7m0j19K36p0R6l08L5K72j58p1K8J03l17J8R4L95m19L04
6404A38l27J82k5K84k52J09j89M5J95k97J31j49K17j47J47k84L01j40K41j13j41
6425g4L8k39M01M9Kk30J48o3m6q6N3J74k94J7K19j01l5J9j10K19kp0kR9j8j06
$$ y = [1, -117, -1, -21, -215, 151, 16, 44, -142, -218, -111, -75, 219, -73, 134, -48, 147, -274, -171, 112, -61, -79, -81, -186, -50, 57, 85, 70, -53, 42, 6, 175, -61, 250, -20, -55, -4, -96, 28, -86, 69, 20, 19, 50, -58, 124, 24, -233, -120, 67, 145, -22, 35, 94, -31, -251, 85, 36, -118, -24, -27, 20, -59, 167, -21, -140, -2, -27, -83, -156, 169, -84, 164, -65, 304, -95, -53, -16, -336, -49, 11, -6, 67, 73, 52, 32, -201, -224, 70, 92, -113, -61, 388, -153, 88, -227, -164, 103, -159, -8, -140, 144, 43, 31, -154, 59, -18, -66, 83, 90, 90, -12, -158, 180, 156, -52, -20, 310, 157, -191, -112, 183, 81, -18, 59, 19, -100, 136, 66, 162, -146, -111, 161, 3, -68, -40, 63, -254, -236, -142, 253, -166, 138, -189, -7, -32, 252, 0, 109, -80, -35, 160, -137, -6, -155, 62, -85, 62, -222, 79, -61, 180, 67, -74, -36, -275, 126, 175, 177, -53, 95, 32, -14, -100, -47, 127, -167, -150, 69, -32, -67, -48, -158, 61, 59, -11, -13, 86, 68, -38]
6451c8j74J57K21j98n9J91J57l22j44J45K49p3J3jk01oM68n99J98K75m81L9J77
6474fo9L40j47%l3j24j0R4j18R1J78k12K25j69J02j83k2J75l9j0qJ18j48P0k08
6499a13J04j36J69j34K12k22Q7K5O5k5j36K09j00K5L08n33J87l02O4J47P0J33
6521A04o3j00J76j84J53k3k71K23j32J27j63J26J19Q7j43k08L86k85K47pj20k6
6543B3k98L74j03j33R7J6j73M0m5J51lj9K89k44k29L36k15J11K04m9q5j23j17
6566a95P5j43L05j2qk87K95q0J58L8k34K39j06pJ5j67J07J18j8q0J20m1R9j73
6590A8j12J06j64M7Q1j0J18k15J10K43l02J22r6k8J3k6k15J84j74J07K41k33O6
6613a19j7K78kk3M3j19J2P4n1k0p3o3p9M0k0J56L3J49j23j40L6LqK82k94O5l8
$$ y = [-38, -212, -55, 166, -32, -91, 100, 257, -65, -209, -64, 185, 112, 125, 124, -77, -83, 385, -214, -16, 259, -222, -183, -6, -75, 265, 118, 118, 85, -39, -49, 45, -73, 18, 196, -16, 209, 40, 142, -41, -63, 112, 73, 63, 55, 173, 25, 95, -113, -9, -145, 24, -110, 102, -120, -33, -8, 57, 32, -104, 105, 5, 30, 338, -195, -8, -310, -246, -99, -29, 104, 41, -59, 117, -67, 86, 63, -208, 15, -117, 10, -153, -27, 92, 179, 36, -172, 214, -71, 176, 169, 49, 23, -275, 99, -4, -137, -40, -24, -197, -157, -202, -51, -54, -73, 216, -28, -257, 79, -136, -25, 179, 130, 45, -78, -195, -120, -263, 42, 30, 22, -265, 30, -50, 108, 146, -88, 151, 45, 38, 53, -114, -7, 111, 93, 13, 133, 92, 191, 18, -94, 12, -152, -105, -24, -34, 84, -131, -21, 222, -80, 42, -54, -82, -69, -95, -310, -126, -300, -193, 48, -185, -119, -136, 142, 140, 117, 160, 41, 53, 127, 76, 56, -17, -80, -159, -119, -139, 17, 50, 199, 76, -64, -28, -25, -33, 249, -45, 20, -18]
6640a8M0q8J33J87l71Q0k1J05k41J84J42l26J28N1j27K40j90J59k59R2J00L0j88
6663a58J37k04J91k8j77P2J87q9P9Pj41r0M10l32K37k51K24j33J18J4K4Ml82L33
6687E2k18L5p1rO9L66q9k83K56M3j30J05q8k36K25r2j1M1m7j20J92j2O7j96P0
6712h1J11o5j85J63j11J35Q3j20k5M15k92j34K50q9j17J52K1o2m7J41j66j15L29
6735A91j22j69J37l13K56K7j58J41j74J69m2M4j98K92%M4k34q5J29j20J53J21
6757H9k9Q7p5N5j96k17O60l05k50M27q5mk60l5K48l73K27J25N0l3J49l94r5P0
6781a64J91p2J2R4n7Mk09J77L1l2K9o1J49k74N11k13j39Q4n0P6q2o8J67k96J57
6806c5M7k67L44j41J16j42J32q3M0n2K7j86L99k7l37J75K23m08L6K48j44p8P2
$$ y = [-18, 22, -66, 67, 254, -117, -37, -58, 47, -194, -10, 132, -194, -66, -15, -142, 98, -92, 67, -192, -100, 0, 30, -158, -21, -225, -34, -62, -239, -167, 20, -69, 10, 17, -124, -214, 196, -136, 101, -150, 74, -59, 59, 73, 97, 101, -281, 52, -166, -131, -202, -211, -142, 224, 135, -148, 108, 151, 21, 126, 38, -198, 27, -65, -76, -35, -82, -202, -10, -22, 45, -151, -81, 30, -35, -220, -57, -168, -33, 50, -70, -95, 320, 28, -106, 144, 55, -62, 90, 111, 49, 2, 143, -23, -138, 191, 69, -100, 37, -276, -20, 7, -151, -10, -184, -15, -57, -13, -211, 81, 81, 125, -109, -194, -65, -185, -32, 89, 60, 147, 72, 127, -69, -286, 374, 69, -181, 246, 161, 157, -103, -138, 110, -263, -36, 89, 139, 106, 255, -139, -234, -164, 27, -45, -33, 61, 4, 8, -201, -24, 7, -25, 4, -57, 92, -182, 329, 116, -23, 61, 11, 87, 5, -63, 104, -192, -35, 12, -255, 89, -52, 64, -78, 54, -29, 11, -41, -14, -200, 199, 172, -165, 10, 233, -175, -139, 109, -35, -113, -41]
6829d1K0N2j02L25k82q2J68j24r6J80K39k87J44k89p0L79k0r5j15L75k56K4m1
6852FN0J52j42O4r8k29K04L04j64k03r2N8O7J04p3j8K58l41j45K08J66q0j47n6
6876a47r9J20J36P8j0q2j72K05R8j71k8R0n8JJ17j4j4j72J81KP4k23J55K1J32
6901B20j75j56L33L8p6m07L88j92j87K12k38L80j72J09l6j62J5L37j71Rj73J76
6923G2k99K07K2J32l62L37j11J83k11R7k29j11M57j38j7J40q2J06j35k3k4K03
6945B14l04K72j19k06K05k20P4L66q6m78L21k60K92j75p7K49j7j83k3j51M40m44
6967c10N30l24J80j82L9j28L75n4l25L63p1l59M00l7l48J86Q5PL3L9l32K30P8
6990G5k13m8L0K02M2j46L1J59k14k8q9J83J05j44M7k69M19j74k17P4m3J83J18
$$ y = [-41, -21, 31, -71, 254, -28, -110, 58, -66, -162, 18, 257, -30, 114, -175, -245, 134, 114, 19, -96, 279, 23, 47, 6, 56, 208, 66, 130, 32, -197, 7, 311, 147, -56, -148, -90, -23, 81, 8, -10, 248, -93, -238, -30, 136, 56, -91, -147, -246, -126, 10, 88, 78, -4, -176, 29, 127, -44, -72, 18, -40, -39, 78, 64, 50, -122, 59, 61, 135, -88, 67, 88, 220, 45, -111, 222, 260, 184, -223, 165, -27, -214, -2, -240, 140, -32, 77, 41, -121, -106, 231, 60, 69, -104, 72, -227, -20, 2, 134, -228, 109, -2, 181, -30, 67, -162, -273, 184, 46, 29, 169, 87, 193, 58, 35, 11, 214, -90, 182, 63, -143, 62, -158, -84, 282, 196, -282, 39, -221, 71, -104, -181, 68, 51, -132, -155, -306, 134, -310, 220, -104, 76, -106, -67, -195, 180, 126, -199, 164, 93, -266, 134, 97, -251, -65, 20, 27, 60, 99, -233, -3, 75, -138, -186, -156, 46, 88, -58, -27, 132, -82, -110, -199, -16, 89, -55, -8, -277, 142, -32, -249, -175, -218, -35, 83]
7013H3n1N4p9O3k47K31N3Kk06k2J27k3J1PJ6Q6oj40j1k3M7J51p4J1q2rk46M01
7041A24k27L3K42j89K6P0J06k45J71k43n0j28L56r7l01O35k01l2q9J15j2j4j08
7064e8L4L6j03J5N4j15J17K6o9K8o8L29l13J17p6J25M9M0j84l4j9Q4k8J87o7n4
7090E3k06J51l12L31l7O4m5k05N13n38K01j84M30m14J80Q5k08J64j41J96j44N0
7112a6k04K12N4j4J36k70O4L29k37m2J5j15J65o4J56j77M0j64K15j00r1J64j76
7135a20J71k39K26J9m8n0j04O0L55j80N5M3j00j65R5J98k86J41k28J77j46l8J95
7158C1k18J67K16Rl82N1J06Pj5N2pJj32J17K63q4k88L21j76K15k09K29k75r1q4
7183a76J17j7j14L21k18K7j03P7j09L9N2J37Q8l52J04J85k60J51pK7P8M5k84K48
$$ y = [83, 32, 86, 7, 70, -177, 54, 107, 109, -97, -119, 8, -15, -4, 3, 19, 105, 99, -41, -52, -75, -28, 123, 49, 60, -22, -31, -277, 124, -103, -70, 172, -17, 9, 79, 185, -60, 111, -132, -182, -310, 46, -51, -352, 283, 82, 50, -39, 76, 64, 50, -58, -24, 12, -91, -76, -22, -137, -20, 6, -63, -35, -103, 226, -87, 30, -46, 79, 128, 168, -16, -50, -69, 15, -13, 174, 107, 53, -153, -2, -314, 17, -20, 44, -1, -206, 307, -231, -30, -214, 216, -198, -18, 67, -141, 23, -118, 78, -66, -16, -220, -8, 46, 32, 168, -102, -38, 291, 54, 12, 27, -88, 77, 13, 169, -8, 32, -132, 83, -17, -108, 56, -120, 51, -188, 38, 57, 9, -41, -145, -85, 270, 90, 145, 188, 88, -77, 18, 216, -70, 71, -157, 20, -126, -164, 31, -187, -20, 196, 205, -177, -126, -20, -13, -28, 24, 17, 18, -114, 3, 266, 182, -106, 215, 39, 254, 45, 274, -1, -92, -176, -59, -76, -190, 131, -87, -60, -163, -86, -195, -156, -104, 33, 121, -231, -127, 58, -202, -51, -58, -31, 47, 92, -192, 56]
7207E6j97J67n3RN9j37J8o7J74K8J22m31K90m0j95K02m0k13L10L6M5J3j47J26
7231A35k43J05l0k2l99L63M27n45K25%M6J63l77J02j2K49k4k64M0m6J17J67j41
7254C6j53K20j47N1l6K0q1N0j60J71k5K86j19k99K61j96J28q8p3R0J0J63j02R
7278A6M1k14J20J56k18J48j73K50j29NJ20j7j92j79L51L7k17j02j5J31K45j65
7300ap7P7K30l85J42k7K5j2J33J40j52K8J4l29J74k23P4M1m7M07k19J0K01j66
7324E8p3j57K73j3j24J33j84K2Q4Q3j69K8L02l81K65j31j06J9l87L72L17r9k79
7347a47L9Q1N2pK51q6l70J68p4K9K33j90K4m7p7j57K91R5J63p9j22n7J13p3k0
7372C3J57j96nk8K37j42j10R8pk19J93o7M2N5n6J95j45j42l3K41j18J9K4q7N6
$$ y = [56, -141, 26, -27, -18, 41, -96, -78, -145, 29, 57, 179, -252, 38, -2, -197, 5, -35, -248, 62, 98, 143, 156, 9, 135, -108, -3, -33, -55, -454, -91, 336, -209, 16, 16, 62, 225, -152, -50, -62, 187, 163, -101, -61, -107, 10, 177, 36, -117, 103, -44, 7, -29, -9, -90, -40, -200, -29, -54, 232, 113, -186, 75, -121, 7, -81, -154, -64, -54, 109, 7, 16, 57, -157, -37, 119, -99, 49, -124, 126, -3, 2, 122, 105, -87, -266, 85, 122, -95, -197, -212, -81, 164, -1, -78, -1, 229, -156, -14, -41, -16, -28, 105, 245, 93, 121, 135, -194, -20, -243, -169, -128, -175, 232, 13, 23, 224, 58, -15, -172, 101, 88, -36, 97, -87, -65, 19, 102, -67, -39, 263, -118, 147, 16, -90, -71, -458, -86, 231, 132, -147, -108, -27, 25, 18, 269, 183, -187, -19, -93, -64, 169, -21, 3, -44, -121, -278, 13, 108, 271, 192, 70, 13, 126, 53, 33, 190, -6, -11, -39, 198, 56, -54, 44, 37, -182, 11, -56, -14, 41, -15, 180, 35, -107, -140, 101, -17, 2, 26, -61, -5]
7397eQ7m1j4J4O2j32J53m55L01j9J00j85J52J62m1j13mL40l69k35K16j67J45L9
7421ij4J1J89j15J65k23j6nQ2J63k37P5o1J89o4j10Q9l3l5j45j73K02N7r2J75
7446F5qj05K29k46L94k74k59J95lj65K15P3l7jK7O5k80Rj4P1L5L0j95J29P8r5
7472f7Q1J33k69P6j26J66J67k0N9j48p3q2j14L09l37L58K18k91p7K20j93J61J8
7495A69j38q6M05l97J56j25q8J22j38P6Q9J66l36J11j7k2O1M1p7J97j91N4k63
7518b31J16j30k47M83J54j02P6j92O5J70p0M4j69NP3r1J59O8j78M0K67l11J66
7541A65k60J70O8q4n6j56n9J28l9J42k40R5J74l0j18K29j57J36Nn6j42K25l22
7564a82J96K94n75L29M3j74n3J89q2J06L6j44M7k74L02qL48l37qk56K50q1l18
$$ y = [-5, 82, 41, 27, 41, 103, -29, 124, -331, -30, -49, 51, -134, 18, 180, 139, 26, 22, 362, -7, -242, -26, -193, -48, -9, -23, -12, 177, 62, 227, 4, -12, -17, 65, 228, -9, 66, 5, 194, 130, 20, 109, 76, 41, -104, -277, -75, -18, -110, 65, 57, -48, 181, -65, 329, 55, -204, -9, -12, -177, 38, 111, 74, 73, 100, 165, -115, -106, -120, -49, -14, 16, -179, -50, 28, -67, 14, 147, -122, -46, -172, -6, 161, 141, 200, 52, -21, -103, -217, 92, -245, 113, 331, 40, -37, 183, -10, 151, 169, 31, -55, 350, -47, 109, -16, -104, 18, -120, -44, 45, 211, -125, -14, -31, -53, 8, 49, -28, 169, -22, 32, -231, -115, -245, -492, -9, 145, 43, 119, -73, -8, 162, 92, 136, -33, -28, 45, -46, 113, 181, 3, 43, 310, -1, 165, -95, 75, 143, 59, 3, -153, -212, -84, -123, 19, -221, -126, 48, 18, -100, 129, -28, 108, 113, 57, -85, 140, -182, 14, 308, -267, 62, 105, -69, -122, 67, -15, 91, 127, -17, 30, -244, 58, 50, 398, 61, 53, -203, 47, -34, -352]
7587c52K11P4pJ58k99Q9j3J18k84K21J51j11K2r5J75k40O9j58L43K17k68M2N6
7610A19j13k7j00j8J81R3j44p8J32J8o8l6K78k10O1k92K07n1j21J08k90L59Q4
7633I2l22J42J14K44k47k24j1j54M37j00p1q4L07R7k69l4K67l15K00oj78j6P9
7656e2J5J47p4K33m18J16R3k39k24J53J51Q8j56J11J09q9O6k36J49l2L10m2P7
7679B56j15k39J43N8k79P6kR0J76l62K22j68m7K60Q2k60Q8K1m9j16L9K52p0k39
7703a83K09j00R4q1P7J84n8k67k16L94q0J29j59J82j90O7l4J88J50k93J45j39
7725A9K7R1l32L77r9j58K36k41R7J01R0l19J00J8K05j97m9j3jK75j62N2j12J5
7749B0j72J06O4l35K48o3p4L29Jj54m2J35j56K95j45l6l35K40M72l50J54j95k8
$$ y = [-352, -141, -67, -74, 84, -215, -126, -139, -21, -305, -84, 67, -44, -22, -117, 58, -182, -113, -271, 72, 289, 21, 63, 119, 6, -21, -121, -139, 42, 135, -9, -87, 45, 63, -5, -41, 237, 27, 88, -204, 3, -48, -169, -61, -351, 8, 92, -230, -88, 26, 270, 23, -201, -212, -366, 71, -29, -100, -184, 123, 220, -49, -83, 184, -131, 69, 63, -115, -131, -52, -37, 110, 36, 269, -149, -33, 60, -179, -403, -250, -99, -11, -167, -56, 53, -36, 30, -206, -57, -89, 221, 179, 256, 141, -98, 45, 103, -176, -100, -102, -12, 164, -198, 24, -144, -191, 69, 151, -109, -21, 0, -49, -165, -126, 126, 56, -183, 26, -74, 20, -61, 16, 200, 142, -125, -341, 53, -27, 102, -57, 125, -65, 2, -32, 156, 306, 13, 158, 19, 46, 137, -195, 182, 83, -75, 161, -80, 17, 118, 208, -111, -11, 7, 212, 15, -34, -47, -48, 227, 65, 117, 5, 20, -152, -46, 18, -317, -69, -132, -206, 123, 124, -30, -72, 63, -93, 202, 57, 21, -314, -74, 398, 48, 202, 7, -21]
7772b1j28J43p3j46J48P8k41K25L4Kp8L3J92j45j96L28m83K27L11l41K38k46J99
7795F0p5P0l5k63K69M0J66l65R0n3J80o1Q7p8k25L22n1m4k04J34J89j86j74J83
7819b4l9J39n8J43m12J13O8N4N9J12j62K7Q7j32Q7j80K15L7k97L26j97nK53ml66
7844a56J07L3m6K4J91l06R2j01rM34l89p9J41J13j54j5j51K94n6K04k09m7K57
7867A72m55L99r3k4o7Q3J55n13L46N6o1L2j89R4j58K67k26K20J7N8j75k03L49
7890H4k10j4K3M5p8N7J06q3J52J77k85o2J90J0Nj28mJJ78j41O4k91L25pm5k2j63
7917a16P1m4J10l1q8K27k61J21j1K9k31J03o1K57j90J60N8j3j87J26j40K83j18
7940E4J2k24K6L50j80r9j8J76L3ll01m9L74j03j01J80n2j45R4p2n2K3m0L49l38
$$ y = [-21, -149, -6, -79, -225, -77, 1, -240, -15, 19, 21, -57, -24, 168, 23, -173, 155, -328, -101, 210, -131, 107, -139, 60, -15, 55, 20, -243, 26, 66, 232, -133, -43, -96, 84, 23, 110, 32, -193, 129, 78, 34, -170, -36, 153, -33, -207, -24, -63, 76, 18, 161, -251, -138, -70, -16, 43, 155, -7, 20, 107, -25, 62, -118, 97, 134, -163, 163, -34, -39, 214, 210, -156, -49, -16, -62, -38, 153, -153, -61, -162, -171, 263, -126, -205, -64, 49, -105, -120, -271, 23, -33, 171, -38, -85, 172, -283, 116, 23, -1, -68, 15, 170, -343, 3, 59, -2, 30, -159, -65, -223, 44, -182, 38, 55, 113, -62, -265, 84, -126, -140, -117, -72, -150, -93, 13, -70, 82, 259, -26, -88, 102, 112, 117, -11, -15, -14, 164, 23, 87, -204, 121, 114, 69, 47, -116, -45, -89, 21, -10, -98, 129, -132, -11, -22, 7, -224, -121, -182, 75, -115, 45, 103, 90, -97, 29, -111, 172, 54, 66, -158, -132, 218, 38, -61, -79, 97, 130, 127, -174, -223, 151, 48, -53, 127, 75, -70, 24, -48, -100, -77, -117, 232, -106]
7965a06R7j23L21p9Mj67J98k14QJ36m1j03j3P1n4N8N2J7lk1M6k71K73k57K86o3
7991E2j67J24K12j38j84K31j1k11qj2K9K90j54j07j58K53R3R4k65J42j15K54m54
8014b10K15j93K88k22L53l99J44j7l1L11j9k66q2J01J0j09J18P6J12j83M7J33
8036A77j52j99L40k23J42nk63K9j6K70O8j73LJ41P7j53l11M78j31O7k16j13J87
8059B4n3J75l63J45P0J11j73J38j67l4K5O2M3j25K14kj80J29m1j48R2r8O22l86
8083H0j45J41J76l13J75L8p3Qj98J29M19q18K87j0M9l7j85K57j98J94j02K51j47
8106b2J58k58J05J19R9l15N5j26J97l74K19J93k05K1J13J22j70j14K39k2j05J54
8128H3r4R8m8K29k44P0n8O3R0k84J76o9k64N09l00J24j50Q1Q5m8J18l81K01P0
$$ y = [-106, -9, -132, 189, 110, 114, -53, 145, -69, -61, 75, 34, -69, -82, -11, -65, -7, 45, 62, 59, 38, 84, -187, 86, -171, 115, 52, -115, 9, 221, 83, -101, 130, 119, -92, -100, -112, -83, 207, 53, -54, -212, 41, 134, 228, -37, 105, -10, 244, -210, 5, -188, 100, -122, 231, -168, -24, -41, -72, 239, 220, -46, -128, -27, -17, -126, -8, 68, 180, -3, 44, 177, 25, -174, 166, -57, 85, 80, -183, -154, -170, 100, 168, -5, -2, 139, 216, 63, -248, 230, 99, 166, -50, -163, 24, -29, 146, -217, -72, -2, 109, -64, 74, -93, -127, -102, -40, 3, -122, 92, 90, -90, 39, -2, -150, -58, -156, 466, 80, -65, 76, 252, -61, 114, 152, 79, 87, -111, 18, 437, -381, -94, -104, -55, -92, -277, -20, -218, -24, -126, 125, -22, 136, -122, -17, 102, 201, -114, -59, -185, 12, -362, -143, 50, -155, -134, -21, 101, -69, -183, 56, 34, -71, 83, -11, 87, 39, 268, 24, 94, 36, 99, 189, -95, 81, 12, -252, 257, -43, 81, -69, 12, 97, 49, 167, -214, -13, 57]
8152E7k13J34j50J66J16jK39q5m75L22k78K23Q7j05k38J45J20n1K94m47M05l26
8174f1Nn4j32L35j86L10k94K09j1k75N9J47r1N9J78j00k51
$$ y = [57, -156, -22, -172, -6, 110, 109, 348, 263, -212, 110, -168, 55, 142, 37, -201, -56, 64, 13, 307, -140, 265, -61, -56, -110, -242, 93, -93, 217, -77, 132, 121, -154, -95, 52, -39, 20, 198, 98, -153]
8191a53
$$ Imaginary data points
##PAGE= N=2
##DATA TABLE= (X++(I..I)), XYDATA
0@%%%%%%%%%%%%%%%%%qJ6j6J6j6K1k9L2l2M0m8N3o1O9p9R0j01J14j29J44j60J78
39I4j98K20k43K69l00L32l64M00m41M86n35N90o51P16p90Q75r71J082j210J359
59G20j539J759k031K383k855L518m519O187r430J7844p5322j60072K92391J39731
73B08765k90242j09455K90576P1555k76188l9397K63164L231k42015K7661K21629
84A29284o2613j97880R2958J73987j24981j49152J50247J25827j75589j02826
94a40738J94687Q1444k10825o0958K22151M2823k28224k4830K30010J0299k25709
105a09870M417K18349j6642k05561K9106J90638m0538j72554N2299J51349o4726
116C6267j28208P5966J01927q7462p5957R5320M9795j03079k6661J08245M976
$$ y = [0, 0, 0, 0, 0, 0, 0, 0, 0, 0, 0, 0, 0, 0, 0, 0, 0, 0, -8, 8, -8, 8, -8, 13, -16, 16, -16, 24, -24, 29, -32, 37, -42, 48, -53, 61, -68, 76, -84, 94, -104, 116, -127, 142, -158, 174, -190, 210, -231, 255, -280, 310, -341, 375, -415, 460, -511, 571, -639, 720, -819, 940, -1091, 1292, -1563, 1955, -2564, 3623, -5807, 12037, -63285, -223357, 69034, 208765, -81477, -190932, 99644, 171199, -104989, -144386, 118778, 122009, -120006, -92345, 129284, 66671, -131209, -38251, 135736, 10755, -138397, 11850, 137677, -37912, -140738, 53949, 135393, -75432, -136390, 85761, 128584, -99640, -124470, 105540, 115839, -109870, -105453, 112896, 96254, -109307, -80201, 110437, 69899, -102655, -50356, 100993, 36267, -91941, -15975, 85952, -1510, -77467, 17853, 67648, -35431, -62092, 46153, 51129]
127E1129j12477J2713J15427k6960j16157L8517J15819m5135j13264N0105J10485
138H0202n0967j04541N0274R8678m7319r1305M4320Q1924l9906p2340L5314O1033
150D5367l2197n0229K8023L8843k7040k8652K6277J8213k8471q031L1247j323
162A2027l5524J0826M0743j8465m5346K5627N1123l0475n5090L5379N8707l6723
174A2809o1724L8097O3225l8191o2763L6103O1459l4727n8809L1962N3876l0476
186A0841m8806K7981M1957k7704l4771K8363K5844k9898j5932L2206O095l5151
198a8975M979L9156j5034m2267K6033M5865l4996m8167M3946N0101n1415n0905
210e1679N8102N0047o2961m8156O4990M3973o7029l9334O7127L1455o6060k3173
$$ y = [51129, -61348, -48635, 66792, 39832, -76325, -37808, 78011, 32876, -80388, -30283, 80202, 29235, -75306, -25032, 73646, 26327, -64978, -20658, 61266, 21360, -50980, -15666, 45367, 13170, -37059, -9036, 29807, 2767, -25885, 392, 18605, -9866, -17897, 13350, 12027, -23497, -12671, 28072, 9607, -35739, -10112, 41011, 10536, -44554, -9175, 49532, 12809, -48915, -10818, 52407, 14216, -48547, -12444, 49015, 14288, -44521, -12559, 41317, 10841, -37965, -9984, 31973, 4269, -30502, -2139, 23705, -6193, -22125, 10081, 16176, -18975, -13996, 25160, 10126, -32141, -6108, 39757, 4761, -43406, 540, 50641, -774, -51679, 6423, 56470, -6491, -54647, 10343, 54316, -12713, -52047, 15080, 46535, -19525, -42698]
222d2698O2923J2902n8741k242N3930r176m7589K0704M1445l0921l4243M1159
234G453K8094m9004k1898N6788J6765o2185j2396O6939P753o9554m321P1069r1
247C5412p1415L663O8914p981o6091J2182O0202j6711n3638K0843M5622k4583
259F419l7026K8909K7908l2132j8477L6259R771l8827r02M1917p281m3413J4978
272a1897M4648k1266m4756K7049M2632l0912m0838L3451L6260l4310l2198L3166
284A029K6611l1291k1591K8142J5737k4425j0390K0187O061j6577j125J3628k776
297C220j0247P148Q525j0702o179J4392M681j6611l258J8072K410j9365j957J9228
311I357J276j8835j731J6748J625j5411j989J3003J385r742j592O704J477l808
$$ y = [-42698, 20225, 33127, -25614, -27856, 26074, 16898, -30691, -9987, 31458, 537, -33706, 7453, 35547, -13457, -35355, 21433, 38198, -23987, -36383, 30556, 38309, -31245, -35566, 35503, 35412, -36003, -32340, 36574, 28593, -37498, -25316, 34886, 18175, -35463, -14620, 31002, 6419, -30607, -1698, 26210, -5922, -24399, 11860, 21631, -17196, -18098, 23819, 16538, -26875, -11897, 32751, 11485, -33271, -6222, 36410, 5498, -35340, -1889, 34371, 61, -32137, 1029, 27640, -3651, -25242, 2900, 18637, -5788, -16178, 4009, 10070, -6507, -7632, 5996, 3220, -7027, 121, 8646, -2056, -8235, 6157, 10838, -5773, -9031, 9041, 11451, -7914, -9871, 9357, 10633, -8202, -9933, 6815, 8440, -6971, -8960, 4043, 5428, -4314, -5906, 798, 2275, -1533]
325a533j94N27k87L505R84o251j144J0079J477j2118j143J4092O18j4930M41J3816
341G939j144j3124J946J0574k857q278K711N066l243k605L240J0l736K505L618
356B622m056l952O004M798p234m324Q169N543q661n283Q400O110q266n841P161
371A190O075o201o315M924O154m003o753L150N643k356n959J892M812j677m103
386c527J737K678j596j184J902K71j803J232K673k310j948L213K301l326k808
401b495L528L189l205l816K731M061k391m723J193N556q15p079K93P445m68q086
417e082M17Q238l03q421J097Q380j843p453K522P246l137o076M941M854n655l317
433c592O593K157p858l60Q706j857r061L107Q622m901q510N366Q079o286p772
$$ y = [-1533, -1727, -1200, -1487, 2018, 3002, -3249, -4393, 5686, 7163, -4955, -6098, 7994, 8612, -6318, -5877, 7939, 6795, -6329, -4383, 6191, 3334, -4944, -2233, 2833, -410, -3015, 225, 235, -3501, -996, 2622, -1434, -5386, 618, 5416, -1818, -6142, 2027, 7570, -1091, -6374, 2026, 8136, -130, -5971, 1190, 7265, 1064, -5251, -327, 5827, 1824, -4929, -1779, 3864, 1508, -4451, -2559, 2253, 576, -3527, -1790, 888, -708, -1892, 10, 281, -1522, -290, 2383, 73, -1875, 1338, 3639, 313, -2495, 1033, 4222, 1017, -2799, -68, 3993, 1602, -3121, -1928, 3628, 2813, -4266, -3973, 3472, 3004, -5082, -4665, 3573, 3270, -5151, -4054, 4326, 2483, -4970, -2448, 4798, 1661, -4415, 526, 5380, -275, -3592, 3001, 5158, -2700, -3060, 5646, 3789, -5272, -2165, 6457, 1556, -6954, -1588, 6491, 205, -7567]
448g567O588O300o220n776O233N505n512n103N939M328n468l380N639K993n814
463a315j501O078N42o087Q50N833k269n341L070M889m674m926N296L868o236l120
479e043O466J951o243j939P020O64o613L94O320j145n762K628M990l173l437M457
495A535K086m506m46M175n89m041J820L618l327k823L086J719l295j721L038J309
511A638l411p99K814N76k756j99K600J62k470M06K896q06j945J300K012j357j673
528a012K135J244k277q35K247R02l156m27K822J2l198l81M008r09m405J502L923
545B195k204m144L268L359l734k483M510J795m412m92M462l06l622J388L576k191
561I65k671K488K211k916j486K649N43k410m99K394k97k341L11J351j28j765J52
$$ y = [-7567, -979, 5321, -899, -6675, -442, 5063, -449, -5552, 387, 4715, -753, -4133, 1506, 4499, -1315, -2816, 3262, 3804, -2283, -1433, 4400, 2131, -3210, -140, 4749, 75, -4851, 445, 4313, -1923, -5043, 1423, 3374, -2869, -4808, 2212, 2876, -3737, -3343, 2977, 1832, -3930, -1302, 3688, 515, -2922, 1535, 3621, -885, -1331, 2844, 2255, -1786, 34, 3652, 325, -2498, 588, 2307, -988, -2709, 329, 1638, -1773, -2572, 242, 818, -1938, -2137, 463, 625, -1845, -1439, 1457, 651, -1294, 6, 2018, 661, -1012, 1123, 2367, 90, -745, 1502, 2404, -752, -1179, 1643, 1655, -1543, -1924, 2084, 1175, -3230, -1728, 2195, -9, -4153, -885, 2474, -1260, -3743, 767, 2562, -1850, -2342, 2120, 1814, -1808, -420, 3156, 965, -1706, 782, 2993, 77, -1409, 1240, 1783, -627, -1126, 1268, 971, -1370, -1059, 292, 164, -1601, -1449]
578a449J738n55j097L85J298l70r87N22J145o65m00J008L24n34j8J86P96o71m91
597A65N73K25r45m20J262m51j265M48J048j069j129J470N15k136j4K304m13k209
615b041J499J919j805r67K019J019k000k3K135m27k129J195J730j439j612J639
631G12R61j662j026J511O95j757p50J618l5j534K3J627m74j496O15Q92N5q08M58
650c75Q75n22l39L43O25L36q99O5J194n4j318k30J740j75k218R22J560j625j517
669a612J941P68k375m17K072j73j872L45J949n98j548Q31J569p82j082J204P17
686I37p61n20P80O32m81l39L63L06l39k66n7L61l09n06o7K92k22k94m45Q09J84
707E8j579M33J707q66j592J838J221j875m58J826O47k068M41J734o64j208O58
$$ y = [-1449, 289, -266, -1363, -978, 320, -50, -1037, -515, 630, -35, -435, 573, 897, 363, 345, 531, 1327, 656, 165, 738, 963, 18, -402, 860, 409, -856, -408, 640, -429, -1558, -88, 427, -1709, -1723, 581, 168, -2041, -542, 1377, -428, -1395, 624, 1643, -357, -380, 1755, 1328, -801, 394, 2124, 685, -927, 712, 1673, 11, -1015, 496, 1191, -566, -1316, 302, 267, -1267, -1244, 383, -91, -1587, -972, -80, -25, -833, -375, 500, -22, -361, -18, 607, 943, 44, 109, 1303, 1249, -69, -299, 1441, 1266, -952, -30, 1530, -95, -1612, 329, 1097, -1278, -1695, 377, 204, -1668, -1323, 626, 28, -1520, -689, 880, 98, -984, 220, 937, 176, -344, 436, 1068, 587, 248, 611, 917, 578, 312, 255, 616, 307, -199, -266, 26, -196, -490, -935, -126, 58, -1521, -1088, 619, -247, -1839, -1, 1220, -655, -1113, 713, 1360, -708, -267, 1467, 803, -405, 253]
724B53J496j197r93J028N89j043l73M88J45q06m83P94N4n82n12O92K89m71j33
743g65L46N66m85k71Q92J87n70m40J261N47j513k07J779j74j782O47J810q91j946
762a009Q50J902j932j362J800Q63k384J7J945l44k071N43J794p19j369J221Q77
779F22r83n28J164O88j059rQ27M25q69m02R92O4o45m41P99K86j260k31Q20J54
799D14q80m15J307j68j254j96J161O0j457L29J701k72j536P08J975j177j574J868
817E94J289k100o58K234L90k571L52K194r75j703R71J385j489j098J135O40j045
834d55q82J264K38q50k35O15M60q11p3K75P76l96l27O82M31n12l47Q22L18q53
854A40k15R79m4j205L3J203n15j146J75Q88n12j070R16R38j186r47J526Q06j705
$$ y = [253, 1749, 552, -441, 587, 1176, 133, -240, 248, 393, -413, -896, -102, -48, -630, -1142, -450, -161, -632, -765, -419, 147, -338, -609, 283, 470, -100, -540, 721, 1268, -245, -452, 1327, 1153, -629, 18, 1828, 937, -1009, -159, 1743, -189, -1551, 249, 1112, -1272, -1255, 690, 346, -1725, -1182, 612, -107, -1476, -255, 622, -361, -889, 275, 963, -96, -105, 722, 1147, 278, -124, 868, 932, 287, -154, 645, 931, -329, -560, 260, 414, -466, -881, 426, 258, -996, -1192, -31, 29, -1428, -1099, 602, 330, -1206, -498, 1477, 300, -1274, 594, 1883, -217, -875, 1359, 1749, -822, -470, 1724, 749, -954, 17, 1402, -87, -1185, -50, 590, -455, -1337, -73, 165, -685, -920, -305, 155, -656, -729, -454, 322, -74, -401, 281, 712, 200, -147, 675, 993, 140, -75, 904, 860, -345, -312, 891, 376, -770, -595, 293, -219, -1289, -373, 565, -621, -1568, -42, 764, -941]
873i41j94J533N7j481O47J396q44o42O24Q75p89k99P64k7m99j29M38l9n45J44
893D9O6o1k38j03J40J36j80q19M39M57j43o64O32L95n07j76P06K40m78q9Q77k53
915D26l41r9R77m29r64N68R93q26r26J520l49j174L85N04o31o05O74L71p26l1
935f83O28k09m00N79n2j25L14K70m50L10Q0L48j87k89N63j1o30M34J21l99j67
956D5J59n0n78M64Q0m35k77M63J07j71m49L59M94r19K55P05k74n10P15K86m77
977hk71Q46r8k08LN10o87n2M99j65n46L03J95o06j90N16j41o49M50J7k63Q9J21
1000c35L7l84K74Q69o52l35O80L33m00k74P24N6n29K25N48k43m99K03K67n30r6
1021f1L32j51n49P2K94O0l22Q0k1k99K17J84l63K23L90k29k44L54N66m97k53Q72
$$ y = [-941, -1135, 398, 455, -1026, -379, 1017, 173, -469, 155, 1030, 241, -58, 706, 679, 180, 51, 489, 450, -95, 49, 115, 54, -184, -287, -147, -11, -191, -1010, -571, -114, -257, -921, -289, 106, -401, -577, 129, 369, -109, -198, 679, 426, 85, -14, 963, 534, -430, 138, 1131, 305, -621, 899, 550, -624, -239, 265, -366, -971, -297, 74, -652, -683, -55, -264, -664, -85, -137, -262, 52, 322, -128, 182, 262, 610, 423, 134, 697, 686, 56, 490, 611, 212, 45, 204, 154, -424, 40, 120, -315, -592, -129, -22, -193, -642, -283, 211, -708, -453, 252, -22, -532, 183, 469, -8, -279, 567, 469, 261, 264, 774, 87, 35, 534, 369, -177, 126, 321, -285, -475, 41, -100, -749, -299, -282, -545, -456, -335, -298, -682, -408, 461, -191, -526, 154, 487, 87, -187, 537, 593, 64, 289, 837, 594, 95, 298, 565, 35, -61, 271, 120, -429, -357, -63, -3, -325, -245, -266, -565, -348, -164, -527, -304, 86, -143, -387, -33, 533, 36, -217, 655]
1043F55Rr01O24N28o36l21N24L70j061l27J145m23p34M26L36m20m20J89N99p90
1063f28n0O25m2l97k6N74M27o87m5N80n0j73K1M93j09k11N2L8j7k01l78J00N11
1086D07l12n75M76L04n36o50J048l08q38L94J085o72p53O18Q37q44m73J331N5
1105E94p80j44R23L12j153J60Q37k98p79K90O59k29p07K91K59j56l28J4J58m43
1125e20K46qJ50j85J22j27N1j05j56K40O30p8n73R38J69p03l65O88M38j370K82
1146b36J156J54j511L41P66n69p70N41M06r57k61R11J68o28J63M95l9p69M77M36
1166B74k42k22M0M38l31J2N33J69m55k30K24J98J0j98k28J18M4j20l26K25K00
1187A33p17M75J36j65m37J18P08l95l26N31nl55J27N70Q2o85L64P01o96m15P63
$$ y = [655, 664, -237, 387, 915, 279, -42, 482, 852, -209, -536, 609, 186, -548, -122, 214, -206, -626, -437, 162, -628, -678, -53, -95, -492, -518, 56, 483, -204, -249, 331, 281, 108, 129, 622, 513, 302, 354, 392, 375, 174, -204, -104, 407, 95, -480, -4, 300, -236, -886, 162, -146, -984, -590, 495, -177, -930, -312, 525, -319, -792, 539, 594, -186, -330, 593, 905, -248, -88, 749, 451, -328, -38, 621, 392, -315, -24, 235, 79, -249, -235, -77, -520, -274, -282, -132, -317, -195, -322, -271, -376, -532, -292, 338, 260, -313, 625, 794, 91, -274, 414, 852, -518, -236, 920, 1074, -437, -96, 670, 101, -669, -128, 278, -679, -940, -29, 139, -489, -326, 169, 130, -639, -162, 274, 32, -190, -150, 288, -43, -31, 502, 671, 216, -14, 210, 408, 418, 220, -8, 110, 154, 34, -292, -67, 133, -584, -109, 27, -138, -575, -457, 251, -144, -470, 61, 56, -299, -172, 398, 480, -205, 159, 860, 164, -251, 512]
1208E12K12q75K14N18k68k51j39k5L28k86j16J63j81j93J19k0J33p7l63N10o9
1229a54KJ20j12K58J83m28L60k7J11k55K61K57p58L61M15j52p56L95N68q97m74
1250g22J068j12q90J72Q93m36o54K20P63p70P4L96L57o84K20M78j46l54J35K38
1270B46L92k55Qj23j14J9m5J9J56l64j58J10J52j60j91J20l3o5k96P42l61l02
1292e03R3O63n3o56M31M66m50j30L20L78m87R5M74k91m23J82N69n24l15P4N13
1313D26m29k45L34J8m59r6P3L57j40m6k48J33K87L4k24L09j9k61J20M48k35o8
1335F9m4M25l36J35J95K57o18k1J23M0m99RL07Mm54K89N57q42k55N01L28o30O0
1358d00M72m7j30j68J79K27j79J04k4j99N51Q3o58L58L36n01j26M02Mo52K29J70
$$ y = [512, 724, -151, 63, 581, 313, 62, -77, -102, 226, -60, -176, -13, -194, -387, -268, -288, -155, -232, -595, -85, -154, -152, -32, -144, 114, 297, -131, 229, 202, 313, 58, 319, 576, -182, 179, 594, 442, -314, 81, 649, -248, -722, 346, 234, -656, -484, 409, -27, -681, -461, 302, -468, -394, 2, 359, -325, -105, 373, 227, -127, 8, 246, 638, 383, 391, 268, 154, 173, 128, 147, 303, -61, -219, -109, 43, -117, -308, -188, -221, -286, -582, 160, -201, -503, -410, 253, 200, -456, -25, 441, -9, -139, 181, 559, 72, 167, 641, 350, -73, 109, 678, 154, -161, -87, 426, -3, -248, 86, 104, -355, -451, -378, -21, -161, -207, -455, -322, -35, -1, -225, 84, 65, -196, -76, 372, 137, 69, 25, 450, 114, 249, 444, 701, 83, 62, 185, 225, -274, -265, 42, 46, -408, -119, 438, -404, -659, -158, 170, -460, -400, 72, 25, -105, -273, -94, 133, -46, 58, 34, -165, 386, 469, -189, 169, 505, 4, -122, 280, 284, -368, -139, 31]
1380C1r3m31L07j1k62K4L46k5j65j15M13k06J59k75N62j40l24N37M8j47k14M24
1402D43j5k24J05p3l10J90K76j71n13L46J67o71L50k9j64p2O9L86l51k95O94q7
1424E1k38m7O18k71j96K03kK30n02N07J1l21K20L4l31l6L2J57Kl8j9M0l62L53
1448I5j27l53L17M3l20K5L36J1o8j44M85k97k69M61N27j030J77M79K30r57K88
1469i1M31l16k14M11p6q4l27K78R2m60L10R4j3l12P6L28ll68J10j5L9K88j25k33
1493a80M17k78q5K29M72n3n98K02K81j88l21M11k09k36j73L42q8j58N4K7k7j96
1515c55K53J17k96j81N54K18m35J01J53Ql29L79J56j41n8J59l01L93k16k60%J23
1537D2J57m41J76m4K92l18K4J18k19j08L30Qk52Q4J57L5k41J97J57l38K72l22
$$ y = [31, -62, -493, -186, -197, -459, -435, -89, -114, -279, -394, 19, -187, -28, -303, 259, 119, -205, 332, 380, 233, 19, 443, 428, 204, 309, 236, -74, 116, 392, 221, -292, 54, 221, -450, -100, -129, -293, -365, -296, 90, -261, -556, 138, 51, -187, -234, 384, 113, -83, 120, 118, 348, -154, 353, 364, 43, 263, 297, -34, -70, -38, 119, 121, 83, 64, 104, -258, 95, -32, -385, -68, -25, -345, -320, 16, 27, -41, -185, 300, 3, -266, 195, 722, -308, -131, 348, 578, -379, -91, 340, 24, -190, 221, 145, 61, -266, 12, 104, -356, -46, 48, 35, -277, -201, 127, 124, -244, -134, -149, -110, 178, 53, -180, 237, -41, -126, 103, 575, 522, -76, 126, 407, 219, -102, 309, 100, -136, -309, 33, -55, -213, -159, -132, -159, -355, -102, 15, -281, -462, 92, 310, -125, -24, 129, 137, -192, 187, 343, 202, 144, 303, 2, 395, 179, -81, -81, 42, 199, -242, -66, -110, 182, -136, -112, 6, -213, -321, 9, 17, -235, -151, 6, 41, -200, -3, 154, -184, 88, -234]
1559b34K71o2rO11j79l00M4K03j58j02K14j67k67l2N12m50j51J08L2k07J86J22
1581a5l87J61q4M72o71M50J5p6r0L41O1j40K26J40k72j26L72k07j37r7J16J30
1603A82r3k07K01j69M6q4qL0k2K6j2l15J52N81m21k51L33K74j04k3QR9j69J10
1627A64J42j08p5J41j71l5K0J2J82m68K80N4n13K54Q1n4j96L28l7k71J2N22n79
1650c15K18J72p9p8M2K50j61j41M93j01q1p3J06L09n65Q5K26p6m40K7M38j15m33
1673b92J57J67k91J28q8J06p1J22P3n1K50j0j73l33M19j30j61K29N7J22pn0J99
1696C72n43nL32j85j24J62J60j30l71K41J16j13k69L38mj27J11J29l24L00L4J5
1718A15j02j5J94j16j49M52l11NK52m4n8m41K77J82m5l22J9q3j49J35L03n16K31
$$ y = [-234, 37, -25, -34, 577, 398, 98, 142, 345, 187, 85, 299, 132, -135, -167, 345, -105, -256, -148, -116, -323, -137, -15, -402, -241, -325, 147, -524, -74, -59, -135, -225, 116, 177, 37, 263, 403, 131, 5, 377, 170, 33, -64, 52, 182, 89, -118, 83, -86, -40, -124, -132, -102, -124, -98, -110, -425, -273, 308, -113, -364, -31, 243, 139, 116, 124, 223, 54, 164, 306, 198, 123, 264, 93, 58, 78, 90, 272, -196, 84, 138, -375, -121, -40, -94, -290, 38, 1, -270, -258, 264, -315, -97, 75, -4, -82, -40, 210, 49, -92, 401, 300, 219, 146, 252, 561, -4, 81, 307, 231, -209, -182, 256, 141, -292, -135, 32, -259, -131, -219, -113, -184, -62, 11, -40, 210, 200, 27, -306, 113, -17, -178, 51, 108, 230, 223, 173, 372, -171, -176, 156, -29, -153, 9, 169, 39, -332, -91, 25, -88, -357, -19, -23, -150, -39, 90, -234, 66, 100, 115, 13, -2, 192, 76, -73, 379, 68, 73, 325, 281, 223, -218, 59, 241, 196, -126, -107, -190, -339, -204, 99, -417, -186]
1741a86J46q8n6O1O0k06n8J45L63k27N5L01j04m20N14n8j24k57K82j26N9k05L03
1764A74m00J30o7K68k11L24k94l04K50j55K47j99j29L60l67J0K93Lj69J89K20
1785A73J06j88j92J96K5j03J90k8l93L19J49k10j26J99k01k9p9K46l64j25K43
1806a92K64k53L01o8K64l75j12Q7L37j68j70L28l46k5N57k23j22p7L18k25o3O8
1828A05O3k98K43N3l22OK69L5k29j44J56l76K62q1N24p45K12M35l9l46J72M67
1850D22l33j06K66j0m63L21K97o64M15J38j46j68j48L69m30L3K35Pn26M95P7k38
1872a57j29j35L93q8k86L88k3j20J08M8R2j40Q1K47l25J32K42j73k61K55L32m97
1894a6j14J01J09m60J92L52k9m06Q5K77m1l19J54K5j76K80J05J90m7j68J34j01
$$ y = [-186, -40, -128, -184, -123, -63, -269, -327, -182, 181, -46, 9, 310, 206, -214, 300, 242, 118, -139, 143, 17, 76, -129, 174, -226, -96, -163, 105, -106, 218, -76, -380, -130, -285, -38, -237, -366, -6, -373, -363, -70, -67, -236, -47, 173, 279, 91, -101, 95, 120, 17, 207, 179, -214, 105, 254, 44, -82, 117, -84, -113, -192, 54, -310, -435, -192, 72, -181, 120, 52, 316, -59, -171, -84, 253, 85, -85, 243, -103, -128, 429, 206, 84, 7, 325, 100, 37, 105, 168, -130, 113, 166, -156, -150, 119, 154, -75, -219, -63, -439, -177, -258, 266, -479, -267, 168, 129, -217, -45, 422, 89, -17, 249, 239, -224, 97, 394, -270, 145, 283, 137, -31, -179, 190, -240, -207, 28, 35, -491, 4, 81, -157, -286, -421, -28, -116, -402, -14, -37, -157, -49, -1, 91, -49, 32, 279, -46, 86, 328, 155, -106, 149, 481, -16, -130, -29, 80, -380, -188, 164, 135, -271, -186, 91, 50, -269, -115, -90, -266, 14, 119, 309, 262, 94, 228, 127]
1916A27j31J78m4p1K14j50k4j44K28k31J07lj7k68K08o0m4m5K19j97M8j20K25
1939Ep2k65K66Q5R1j13K78J2n19J46L38l15J16j37K81j94jJ74j54j28P4J88j62
1962fP2m38L97m61K70J30O3p8J40j29k85L50L1k82L24Q8p1r5P3j15J48J58j36
1985A48o4J25n58L64K13l97K0J65qm13J04J10J15J68j95j4o3L33r1k76M88l42
2007f8J85l84K39r9l3n5L33o7MK18j89O6j59J38j11l33K49J75j41q4P5k32NJ76
2031i2j26L88p9M5m3j45p9J79J64L31n53L13l65P6m8Nj65L15j0R5K9j92J34j95
2055a8k49M14n8j02Qq6n9K84j00M9m25K48Mo6k80N67o3k11L11K15j33k13j20J51
2079F8j75L9K41J14m90J68L04m95J72K79Q2l33n6PK84l61J58N0L9l57L1L86j19
$$ y = [127, -4, 174, 130, 59, 273, 123, 99, -45, 183, -48, 59, 56, 39, -229, -21, -81, -125, -170, 49, -148, -100, -220, 5, -67, -332, -66, 19, 110, -3, 275, 287, -232, -86, 252, -63, 53, -84, 197, 3, 2, 176, 22, -106, -32, 156, -6, 66, -372, 25, -436, -166, -36, 27, -51, 89, -40, -325, 25, 56, -226, 98, 186, 115, 20, 93, -22, 126, 284, 148, 84, 209, -349, 15, 228, -169, -149, 16, 8, -405, -301, -191, -76, 92, -103, -117, -180, 153, 62, -214, 274, -68, 117, -267, -28, -127, -160, -215, 118, 51, 55, 273, 84, 150, -9, 129, 18, -315, -66, 109, -32, -116, -41, -273, -268, -92, -218, 170, 91, 136, 93, -52, -131, 48, 212, 543, -10, 303, -62, 14, -34, -29, -194, 121, 111, 206, 235, 43, 177, -18, -267, 147, 89, -13, -5, -91, -150, 134, 34, 83, -342, -94, -90, -156, -436, 131, 68, -143, 168, 383, 250, 37, -83, 68, -107, -68, 173, 287, -203, -35, 269, -226, -54, 225, 307, -26, -82, -75, 209, -152, 6, 56, 95, -262, -231, 155, 36]
2102C6j92L44j66p3K08j12Q1j24O4J79k08K76l85J64k44M30j4l66K31n2j68J35
2124D4n9j68Q5J20L89m77k20J65J34l4k29J34Q1k5L71l07J37k42R2L35k10k08
2146i2J63K20l60K98l06J18p1O7j30o5P4K33r1l05K79J2j82J57j40j46L51j91
2168a07J1J63j25K79k52L2nM63k36j22R1m5k43O5M26k40k71K49k3l25Nj85P5k8
2192c48M42j23K6k50K17J4L0q8J68n6r8L64o6j81J86j71j92J39M42k27k29o8K99
2215B30j70j22K07j0j82j90K48J05m5R2k60k9J09j16M02j25k02P5J99j90j61J95
2237F0J4Rp4Rj8K03j86j53K73o6K16r8j54J1K4o9l86K52O1J39l70L38N8k50K91
2262A34l58J70j02L18l41K53J16m0k39J67n5L1k96L12k29K02J65j77k9j3l7K07
$$ y = [36, -156, 188, 22, -51, 157, 45, 126, 2, 66, 245, 37, 313, -72, 92, -152, 278, 264, -102, 129, 77, -91, 44, -15, -183, -98, 22, 411, -66, -286, -121, 13, -21, -250, -116, -35, -60, 311, 4, 141, -101, -9, 326, 116, -92, 71, 291, -69, 229, -77, 41, -30, 37, -93, -158, -84, 149, 58, -247, 32, 44, -138, 19, -121, -267, 84, -107, -96, 67, -58, 221, -31, 1, -4, 459, 223, 101, 192, 147, -96, -31, 395, 155, -116, 133, 110, -215, -210, -395, -320, -348, 94, -29, -3, -253, -36, -22, 8, -80, 88, 32, -66, 298, 232, 51, 237, 66, -126, 13, 455, 228, -1, -69, 230, 60, -62, 145, 135, -47, -237, 11, 116, 71, 163, -97, -126, -17, -133, 269, 144, -58, 17, 216, 26, -135, 60, 74, 83, 9, 18, 0, 203, 17, -136, 137, 71, 287, 189, 35, 46, 70, 1, -385, -133, -72, 67, -303, 35, 93, -157, 134, -224, -54, -156, 162, -179, 74, 190, 150, -89, 78, 23, 54, -242, 70, -159, 43, 208, 31, 2, -11, -48, 159]
2284A59j76L44m86J82q3o2J05j07N1M5n5M35l41k99J54K6K59k51R3j20K65r0J39
2307A87M2k18m3k18J08J78j38K55k13K8n6j55L11j27J13o4P2l51L40P8j78j51
2329b00M83m16j1J59L4nJ59l15J98J35l37O1O7R8k9r1qK8j52K22O9k6m3j66J61
2354G5j26n8P4j2J99j31r0P3kJ8n7J06N6l8j80R3NQ4J61j43P2k77L08k04j01m0
2380a35r2K94l3k2j53M1N4j00J04J13o1o0Q6k48J30K2L5p4j7J95KK7m7L7n2J17
2406A63m98L10Q1j15j75J47r8M50n35L05N7j03K67q3j96k14K50m0Q7l45N10j52
2428G3l6j10K32j8l4J58l18K33j9K8o3l51K54q9O7q3RK1l9m7N5l6m6M01k49N1
2454D4J72j82Oj67O3O2J66r7q2k18j7J7K39O1k3O1K4p9j22J09mj38L18k95J30
$$ y = [159, -17, 327, -159, 23, -60, -122, -17, -124, -73, -28, -83, 352, 11, -288, -134, -108, 151, -100, -7, -127, 138, 48, 187, 229, 11, -32, -250, -142, 36, -102, 153, -60, -32, -88, -243, 68, -59, 54, -10, 62, -289, 51, 129, -49, -200, 283, -133, -144, 15, 49, 44, 203, -112, 86, 221, -116, -55, 12, 110, 81, -10, -18, 10, -142, 80, 149, 123, 80, -86, 75, -51, -109, -35, -47, 152, 21, -69, 4, 2, 20, -37, 69, 125, 87, -93, 0, 5, 89, 250, 107, 179, -98, 210, 6, -95, -135, -227, 67, 34, 12, -141, -100, -46, -146, -42, 71, 10, -50, 36, -212, -82, -60, -25, -99, -116, 79, 81, 108, 61, 98, 46, 163, -335, -25, 56, -59, -234, -87, -185, 265, -270, 35, 92, -11, 256, 173, -23, -237, 13, -27, 60, -285, 225, 73, 37, -73, 159, 141, 107, 265, -53, 180, 161, 189, 126, -225, 29, -60, 7, -76, -67, -46, -85, -132, -77, -113, -159, 242, -7, 44, 216, 34, 40, -127, -64, -2, 164, 67, -15, -233, -250, -233, 6, 67, 44, 105, 129, 50, -72, 37, 33, -105, 213, -82, 48]
2479D8r9j42J04O2j73M13k89J72k9l0j40K23p4RoKj60M8K16p8j20Q9j55J43K50
2504B84l03K30j51j63O2k8J43k34J79n5jK03l15N8L68j47j9j20k02K92Rk11R1
2527c0J88j63K12j12m2j95J48J13n20L17J77J32j08Kj1r3o9%J78r1m8L34l86J95
2551A28j15j05m1J13j27J24l1N2R7K9pj86P4l4J90k52J98r6k3L0N2q7k40K71r3
2576g9J01j94n0O0K26j57L4K2Mj16j83N33k42r7J50l9J93j68N3j01J49M5k21L27
2600B50m40J02J50j12N8J04K1l41j90L81nJ70j09Kj5j04n8l2NJ09J7n4j26M25
2624B08j92Oj09JL01j54Rl3O4r5K47k86K10k39P5k4P4j38k10K35P8j20J81j02
2648a3N4Q0R9l48K57k23j51N03p0k34J01j9l82L84j2j81J2M16l92J06N3j13N6
$$ y = [48, -51, -193, -89, -27, -200, 213, -76, 96, 67, 37, -103, 120, 46, 55, 49, 51, -109, -61, 155, 77, -43, 46, -109, 34, 284, -19, 211, 60, -103, -41, -69, 74, -160, 19, -36, -37, 166, -149, -91, 277, 130, 111, -9, -211, 81, 90, -121, -30, 158, -5, 207, 95, 53, -142, 6, 119, -401, -84, 93, 225, 117, 119, 108, 15, -54, -54, 124, 33, -15, 319, -67, 128, 13, -92, -133, -20, -147, -23, -54, -2, 95, 124, 117, -69, 5, -29, 161, -91, 107, 11, -12, 18, 70, -17, -257, 14, -79, 22, -172, -222, -162, 64, -93, -59, -37, -33, -149, -332, 201, -41, -138, 12, -27, 166, -2, 51, -50, 99, 144, -77, 250, -190, -88, 62, -50, 8, 112, 133, -208, -398, -17, -22, 148, 39, 41, 26, -78, -136, -168, -163, -54, -37, -91, -217, 208, 16, 22, -87, -86, 215, 61, 70, 37, 101, 6, 253, -33, 177, -62, 13, -11, 63, -75, -285, -50, 28, -92, 89, -13, 41, 121, 220, -128, 129, -94, -245, 258, 188, -46, 55, 36, -346, 38, 26, -155, -143, 273, -119, -13, 40, -73, -17]
2671a7m5o0J69k1J00k29L47l27J23j24Q1N8qO7m5K2R1k21RJ63l97L59k09O4K52
2696B02j85J1j2K56r4K34m99J76l35J94Q0k62K45r3n7n7K67j16o4J37r9M7l0Q5
2720C1j22K18M1r6k92Q4J94K08j09q2k7LK67l27PP8J6j0j64J2J70Kj24J08L6p1
2746E1k15m3K4K56j38K67j80M7j32m0j3K37j32J46k24N4J40j1J20o37M00j74M03
2769B06q2j35j80QL31j68j18K79qK1j59j93K94k47L37j72K00j67j43J75J11K4
2791B14j36r0q1J56p9NNO6K4j39n6K43j27m1J85k81K96k95J53M3p1J5k7R6q7j14
2817a23J31p8k7J01R7m1l63M58n2p0K35n57K37k25L85l68J77Lm8K51k96ol4Q0
2841a33l24J96L99K3l40K34j27J05j60Q9K06j44K25m23o7M86k54L17j13j49m6
$$ y = [-17, -62, -122, 47, 26, 126, -103, 244, -83, 40, -84, -3, 55, 47, 114, 69, 91, 182, -39, -30, 133, -264, 95, -114, -50, 202, 17, 28, 16, 272, 178, 412, -87, 89, -246, -52, 28, -234, 11, -82, -139, -196, 71, -45, -109, 28, -71, -24, -54, 31, -91, 127, 168, 72, -220, -136, 58, 266, 157, 75, 48, 51, 318, -9, -2, 76, 92, 82, -82, -70, 100, 102, -22, 86, 122, 51, -164, -207, -183, 73, -65, 202, 22, 69, -63, -103, -116, 121, -11, 135, -89, -35, 105, 94, 214, -423, -23, -197, 206, 124, -11, -191, -183, 148, -20, -138, 141, 133, 154, -5, -198, 96, -151, 186, 14, 214, 47, -96, 79, 190, 214, 78, -12, -93, 63, -16, -11, -6, 60, 84, -55, -111, 132, 5, -36, 149, -132, 164, -131, 22, 65, -6, 9, -18, 78, -9, -123, 8, -70, -97, 4, 101, 60, -303, 155, 103, 33, 268, -289, -52, -277, 108, -260, -83, -80, -128, 123, -173, -179, -213, -133, -457, -261, 138, 161, -179, 55, -72, 33, -127, -38, 168, 24, 249, -174, -241, 245, -9, 308, 195, 46, 0]
2862@J61m39L43k47M9O8j4J84J04j24k95L15o5Np1L6J3k09J38K40J15j44N8j77
2886D4j27j05K73m8K75j97j47n8M1K34j79j70K16j20j20J92J09j03n9o9L8lk46
2909c29L49L6j83qO2J57j86L41j33j9j17O3q1J27J90k84M1P7M4r6l1q2L1k0j24
2934a75J66R8j92J07j35l5m6J46o6J04q3o6K36k4j35L06k04J4Q3j33J33m4J63
2957B18j36rM4j88L69l99J05K25l23o5M55m84L01k33K52j49k55M33o2j28p6M30
2979C25j13k96J42K99l58J57l40j17K92K09k48J90k56K10j61QK37k18P9o1K5K13
3001B18j25J04k92L4j3J07k75J0J40J39j27J1K27k13q2K69J5k24J14Q7r1q0l2
3024g9J32q7j60K12j14J09r2L12m40m6K29j15J41J77m03J27K37m8J40n58M55k09
$$ y = [0, 161, -278, 65, -182, -133, -65, -79, 105, 209, 85, -210, 105, 40, 45, -26, 10, 23, -186, -48, 192, 307, 163, 221, 44, -83, -188, 85, 37, 312, 115, -32, -90, -49, 185, 6, -164, 52, -68, -188, 4, 113, 10, -49, -118, -80, -83, -329, 20, 56, -127, -135, -73, 84, -102, 239, 106, 87, -30, 33, -48, 79, 269, -15, 26, 103, 147, 51, 20, -62, -31, -51, -175, -9, 89, -103, 4, -131, -166, -212, -66, -132, -28, -111, -177, 59, 35, -100, 206, 2, 16, 99, -34, 99, 55, 218, 82, 73, 117, -71, 298, -101, 4, 229, -94, -159, 296, -188, 113, -120, 132, -17, -272, 161, 99, -29, -105, 325, 212, -84, 58, 357, -1, 156, -184, -301, -9, 200, -48, 142, -114, 96, -65, -57, 180, -38, 41, -20, 5, 218, 93, 197, -95, -61, -74, 33, -242, -232, -92, 47, -80, -69, 158, -55, -137, 132, 147, -77, 37, 124, 33, -47, -79, 53, -34, -194, 18, -96, 13, -79, 233, -207, -253, -24, -139, 2, 179, -224, -97, 140, 92, 232, -326, 129, -80]
3046h0L7J75l03J82n7J72N7j89J37k5k46J39P5P7j22Lj37M2K20M8l85R5P9Q3o1
3071A6M6L8jO5j45R8RJ17k75M3k6L69m64Q6k4J4j14M4K17m1j82q9o2J05L20k39
3097g5MK09o3j64K2P0J05k38J23K70j21q8j53l8K1L4R1O3K29k19P5k02J00n0Q2
3122H7j23J13j75J06J00j48K20m9l3j22n9J02K69l64r3l8J08J7K03k22L26j19
3144A06J5m3k5k65K00J47k28J74J93l26oO1j76J90jJ65j38M3p1j71K20O5j73J22
3168G8P7k62J23m08O74n32L88k01J15k25L40j18J37j01l88O80k35k99N8N7j07
3189a49L22k92JL10k87J44k9j08K45l92M37k19r8L3O3L6j12L11q8j44J5K29j79
3212D9k8J81j96j10J52k92L22k00P2J71r3j70j32N43l42J15m1k6K9K6k00K20k16
$$ y = [-80, -43, 132, -171, 11, -46, 126, 183, -6, 131, 106, -140, -1, 74, 151, 29, 32, -105, -63, 157, 205, -180, -85, -6, 77, 16, 62, 100, 99, 164, 19, 117, 126, 243, -32, 11, -15, 354, -110, -24, -48, -34, -148, -104, 113, 72, -110, -199, -261, -156, 164, -75, -71, 138, 75, -89, -67, 3, 108, -130, -7, 263, 142, 54, -99, -137, -116, -82, 9, 72, 301, 82, 157, -45, 55, 5, 87, -36, 77, -98, 8, 108, -40, 180, 131, 98, -24, -83, 19, 288, -76, -169, -207, -99, -82, 121, -101, 225, 106, 121, 78, 53, -212, -12, 135, -93, 81, 274, -52, -58, 3, -173, 17, 16, 181, 43, 86, 15, -156, 64, 129, -44, 78, 155, -107, 16, -392, 282, -250, 138, -63, 52, -173, 167, 49, 186, 85, -303, 377, 142, -157, -99, -42, -149, 173, -119, -118, 192, -95, 49, 20, -88, 157, -235, 202, -17, -115, -82, -19, 17, -95, 216, 128, -16, -1, 228, 49, 21, 202, 6, -104, 48, -244, 78, -122, -50, 121, 28, -142, -274, 269, -73, 42, 1, -25, 4, 30, -170, 50, -166]
3235a66L29j44n9k25L28J7N2J14j89r2pK11o8Mj02J88m09J7J41r1M61l92OK81
3259B05l63K81o8l07L59l7r4K41j29Q5k07o3l2O9K87j47j35J33oj68K68j84Q5
3282G3j24M8j55j09L67q4j21J50k8k88K47K30k41J13k13J45J46j10k3Rj23J3J97
3305A19k29L1K18l26P5L84l0l29o0o6J95K30qrl55K83j16n1J55m20K77j84M96
3328B80k88L47l05J47r1l3j65J39k3k13K02R4K38l81j41O0J70o7k8M5k46K87j28
3351a00R7K46k28j1P8P6j57j2K48j94j95K47o1k9j76J29j95M13j96r4K67k68J75
3374F0lO4m0J42k99j1m3K36k7j58j15M19j53j69n8J99P5j40M3j26O8L21l90J28
3398B3o7K68j89O9p7K2J73k40l0n9J44jk5Lm4qJ55j83J09k03J91k8O6p3J26j79
$$ y = [-166, 163, 19, -40, -265, 63, 80, 132, 246, 57, -35, -42, 169, 101, 105, 3, 191, -218, -201, -60, -151, 310, -82, -76, 205, -158, 123, 55, -252, 107, 70, -24, 217, 88, 173, -34, -97, -129, -60, 227, 80, -55, 78, 72, -96, 172, -12, 73, -51, -3, -158, -267, 100, 16, -105, 45, 17, -271, -24, 206, -35, 78, -135, 10, 156, 46, 23, 32, -91, -78, 119, -110, -79, 139, -187, -112, 272, 242, -87, -147, -213, -18, 212, 204, 195, -160, 123, 7, -44, 111, -309, -32, -216, 280, -8, 339, 34, 181, 90, 57, -108, 31, 8, -205, -3, 91, 329, -52, -193, -133, 37, -30, -58, -13, -259, 28, -100, -3, 243, 15, 4, 82, 158, 1, -11, 237, 43, -152, 95, 34, 5, -171, -42, -237, 176, -20, -114, 153, -115, 60, 57, 121, 81, 223, -76, -87, -130, 106, 79, -79, -194, 225, 72, -97, -155, 44, 119, -21, 22, -104, -36, 285, -105, 23, -44, 224, 35, 104, 27, 49, 222, -18, -48, -107, 37, 36, 11, 14, -30, -38, 117, -66, 43, -160, 31, 3, 69, -4, 122, -57]
3424e7P7Oj86K30j55L7L56l31J75k13p9Q4j62P6J74J05j09p7K18k08K25k41K65
3447B10k69J66LR6k13K2R9r9O2l36K91J89j72L3o8K34l26mJ11k44K56k28J78j68
3471a77J67J4n1K1N0J04l21K64k66J31J21o6j17Q5k3L8k7J1L8m9m7M3j9K23n0
3496I7R0m48K18j30K46J08l23k9K97l2K4l8M3jj7J65j87J0j3J01k28N8r8J04l13
3521b96M10k52J89k59J95K01m5l8p0J09l62K92j0Jj04J81k34P4r7K06j06L4Nk53
3545b29L45j22J44j31o3J20Q1J53n40J15J82n9r5J4J2L75l69Q9k38J65J87k04
3567f8J7K4J28k0K72o60N5K80km4K2M7j42J1J89K4r3m1o8o0J05KM7J7k27K43j30
3594g2K8No8L34j70M3j7j71O0J10J44j38j53l4J76j79J75k54K42l77J85M10l51
$$ y = [-57, 20, 26, -160, 70, -85, -48, 308, -23, 152, -61, -140, -56, -218, -142, 32, 137, 28, -49, 169, -39, 186, -55, 210, -59, 107, 110, 206, -7, 15, 114, 15, 77, -259, 32, 221, 49, 82, 14, 248, -78, -82, 29, -215, 41, -187, -9, -177, -10, 4, -47, -26, 24, 128, -193, 71, -195, -64, 57, -9, -126, -41, -64, -26, -53, -42, -4, -53, -100, -57, -76, 147, 97, 187, -261, -43, -173, 73, 181, -142, -171, 126, 94, 118, 80, 123, 122, 105, 270, 83, 93, 80, 181, -47, 11, -87, 17, -296, 114, -138, 51, -208, -13, 188, 143, 105, 35, 144, -218, 74, 64, 65, -39, 142, -92, -18, -115, 91, -15, 19, 24, -229, 116, -6, 138, 7, -56, 64, 145, 298, -242, -127, 55, -4, -99, -85, -73, 302, -67, 22, -216, -51, 136, -68, -51, -27, 101, 81, 353, -307, -252, 28, 26, -18, 4, 51, -91, -80, 109, 133, 40, -1, -69, -129, -24, -22, 25, 42, -185, 58, -72, -44, -39, -107, 227, 57, 100, 83, -88, -28, 82, 226, 88, -65, -99, 77, -102, 73, -181, 61, -316, -131, 279, -72]
3617g2J20J62k82K43j97j24l2K05q7K8J75Q8j70l1j29J28J10j18Q9J20j74k22
3639a70K61k13Q3k08M18k89J17KK94l03j1j2p9L8n1L11k10j45J74j04L11j06K02
3662C10k79J47l22N23l98J75j79M9J23j49r0mJ36K7q3L7J9k28R4j80K97j18J77
3685H4q9J72l41M8N6K22r5j71J07r4J19k87K60r2K9j41K46k02K17R0j07j82J23
3708b8P2k70l1J74J04J18L5k79L19k10p2J17O1j58L7p8J65k31J44L51j26l09n4
3731a49J95o9K39k35j81K62J2l41K63k08R1L1k3J64j52j9m8J73j87o2J40O7M2
3754EJ66m83M21j07J0j04J36J17j23J24j46J5j93K25k7j9m0L6j38l9K29K8O6l90
3778b31K56J51l25J57k06M01j57j76J11m2J6R0K5J1J1pj47K26k8j57Q9j97QM6
$$ y = [-72, 48, 210, -72, 171, -26, -150, -182, 23, -64, -36, 139, 227, 57, 26, -103, 25, 135, 17, 106, 226, 52, -170, 91, -122, -39, -247, 171, -118, -1, 1, 295, -8, -19, -31, -110, -72, -123, 188, -22, -167, 7, -97, 214, 108, 310, 31, 178, -144, 379, -19, 156, -23, 26, 149, 0, -90, -94, 42, 69, -14, 23, 42, -186, -92, -272, 25, -93, 84, -5, 167, -174, -126, -70, 152, 57, -114, -7, -101, 18, -269, -9, -101, -72, -213, 33, -169, 48, 138, 31, -151, -28, 44, -226, -257, -83, 21, 139, 174, -105, 214, 4, -68, 49, 110, -48, -11, -89, 76, -155, -11, 340, 214, -95, -149, 46, -23, 216, -19, -200, 62, 74, -267, -4, -212, -121, -90, -113, 51, -101, -120, -168, 5, -182, -244, -104, -37, 5, 171, -312, 109, 2, 12, -92, 44, 161, 38, 162, 16, 31, -162, 63, 36, 17, -23, 13, -125, -164, 65, 93, 159, -231, 25, 176, -149, 8, -198, 203, 46, -130, -19, -61, -45, 45, 70, 81, 92, 85, -62, 164, 136, -21, 68, -129, -121, -75]
3802g5R2j1L03k97j52J55K56J3l82n1J75J18j6j55J60k90K25K3p7qq0L54p9j88
3826A3l4M7q2K26M1k71p3M12l69J72j3mj04j84L29k26n3r3J06M03J15l13J89k54
3850b0J01M0L1k82K72k03mk1n4m4K19r5P3J06l30K72J98j46M7p0J08O7k82J07
3874I0j40k98K03K69j37K00j51J28k21J62j35k26L86Q3L76m68j76J35o7k12J25
3895g4J22j1J94k81P6L2j71J43j81K12P4j95J84k17J50q4j7n3j7L2J15J31k09
3918d5J07k29L38l6k18J93j43j4O6J55k18j68L22j41J28L8j42K38k44R5j35l18
3940c71N16P3l95J82l45M74N4k34L09j29k61K01rk62L04O1j05j00j28K75p3o1
3962b4J95l32k39L92N19o12k9n0M7o3P7N3N6J3N1k47J33K1P7P2o5q7K2K82q2l8
$$ y = [-75, 17, 6, 309, 12, -140, 15, 271, 284, -98, -149, 26, 144, 128, -27, 133, -157, 68, 91, 14, 6, -74, 280, 201, 13, -21, 26, -56, 170, 211, -60, -133, 279, -90, 82, 69, 65, -39, -223, 106, -120, -173, -266, -160, 243, 358, 45, 234, -20, 81, 121, 152, -130, 142, -61, -65, -86, -140, -184, 35, -60, 13, 119, -211, 61, 259, 113, 160, 90, 198, 265, -17, 90, -50, -348, -145, 124, -13, 187, 36, 164, -57, 105, -30, -256, 130, 213, 589, 121, -55, 80, 13, -199, -74, 48, 37, 231, -50, 26, 58, -113, 30, -151, 61, 135, -60, 124, -93, 57, -27, -44, -97, -114, -82, 33, 164, -45, 62, -167, 171, 135, -83, 110, -33, -47, 19, 174, -44, -212, 110, -31, 97, 135, -7, 231, -13, 82, -53, -371, 145, 218, -177, 5, -340, 134, 188, -46, 263, 134, -127, 74, 65, -197, 107, 168, 63, -37, -165, 110, 37, -24, 171, -161, -400, -8, 511, -101, -130, -180, -133, -196, -119, -66, -10, 3, 54, -193, -60, -39, 38, 110, 45, -42, -20, 262, 180, 142]
3988A42j77J15J09p6lr5j21K0M6J18o0k42K00L3k65L19Q5j41k4OM0j71L1M1J6
4013e4J15j47Rk05K19l17K98k28J59J4j06O9j1P2j07M10k10M6k28N0P9K18p5k45
4037a75K60K37l17k11J88M11k18k35N0K6N8l2k7r3K08j6O7q6j35K50l02J25N0
4060H3j37Q8M9j10j74J76J36p8J6j79J25Ok14K28J08k44J74J51j65J3p0J73l20
4083a65K72j25J9J87k92J70k78K97j95J14P4O4j20j24J95j11p6r0l3K51o2k09
4105b37R4NK42j09M0q3Q7j17j0k3K54k16M5n4K68k21n7J33R8k8J4j95J11j5j5
4130A1k54J07k2j79K67l5N9nJ98j89Q8n7j32K87p5N2n8Q8j61k29L28rj06p4L9
4155f1j62L46j61kQ4J14J8j6q4j77J89j91Lj11K94m9j30K54p8p4J00J02k90J32
$$ y = [142, -35, 80, 189, 113, 110, 15, -106, -86, -40, 78, 18, -224, -24, 9, -256, 63, 148, 7, -17, -11, 29, -142, -111, -70, -54, 61, -86, -77, -282, -63, -380, -82, -310, -151, -137, -243, -174, -185, -113, -220, 190, -20, 26, -202, -152, -73, 145, 70, -175, 85, 322, 5, -206, -18, 393, 175, -60, -10, 16, 74, 42, 15, -78, 130, 114, 181, 95, -40, 210, -92, 33, 83, -54, 34, 83, -27, -201, -25, 111, 33, 49, -130, -5, 1, -213, 15, 123, -121, 53, 204, 39, 52, -18, 155, -165, 107, -18, 1, 188, -104, 66, -212, 85, -110, 4, 78, 142, 22, -102, 93, -18, -94, -184, -217, 34, -28, -237, -143, -138, 104, -5, 35, -48, 39, -78, -88, -111, 143, -73, -28, -82, 186, -35, -92, 41, 139, 111, 125, -70, 41, 26, 11, -243, -136, -158, -337, -70, -105, -46, -51, 147, -42, 46, -11, -143, 144, 69, 121, 63, 151, -10, -239, 89, 80, -26, -100, -61, -223, 123, -38, -40, 44, 158, 176, 160, 76, -101, 88, -103, -100, -211, 83, 34, -96, 158, 80, 6, 106, 208, -82, 50]
4179E0J33k67R6J16j49K06m70L33L46k49k63R0J92k91n6L48k00O8J43r0n2j68
4201a34R3p8K37N3L5r8j2J5j09j32J27J77j8l36K03n4j47J29J70o5k26J33m8M17
4225C32l22J34J09L0k79j29J82j67Q6n2P6j18K99n9j46j75J10K22K1p7Q5l1j47
4248a6k50K06j28K65j02J18j61K53k22J66l11O4P7M0Q8r9n3R4k52M34k85K01m2
4271H5j48P6j78K89N5r2j77K33j07J99l50Q3L2Ok8q6k7J60jj06J48j59J97n6n3
4296eo2N9k47K64L65k29K6k48J46k68K91O8j10j91J49j5J43j58j06K23j02m7J82
4319A28j21J40l5l55K6J64L6j2J80l84J79n0L3P4K32m33K84q7k5J23q0J14j30
4342AJ00j59J48K2m6O3l83K35M3o3K40k55P1j88J48m0j53K89kj65j5R5o0k0K17
$$ y = [50, 183, -84, 12, 128, -21, 185, -285, 48, 394, 145, -118, -28, 164, -127, -183, 165, -35, 33, 176, 86, 34, -134, -41, -119, 118, 171, 206, 108, 96, 111, 2, -130, -3, 174, 156, -180, 23, -31, -178, -49, 121, 56, -170, -37, -85, 332, 10, 144, 253, 283, 4, -125, 57, -110, -24, -76, 0, -118, 181, 122, -24, -199, -89, 133, 154, 77, 162, 131, -16, -266, -60, -188, 77, -25, 93, -68, 185, -37, 129, -182, -118, -41, -1, 87, -12, -65, 29, -223, 211, -74, 127, 85, -63, 13, -165, 124, 179, 87, -90, 143, 36, 235, -115, -32, 0, 6, -22, -108, -135, 25, 24, -82, 66, -93, 104, 48, -5, -67, -8, -255, 9, 374, 145, 171, -77, 69, -199, 92, 160, 50, -141, 8, -7, 136, -22, -128, 95, -7, -54, 128, 7, 147, 112, -243, -217, -53, -17, -29, 151, -233, -54, -104, -71, 3, 235, -198, 86, -1, -26, 97, 17, 131, 1, 101, -58, 90, 112, 66, 129, -254, -19, 24, -39, 201, -54, 17, -171, -23, -63, -216, 73, 71, -94, -109, -14, -74, -94, 123]
4367A23j46M1J86l85J91P4n2O2j79J97j87J92rj25L29n42nJ99K7K41l13K02l43
4390b22L37m9j27J11J78j12k91J56K13m14K55j70l6K24J27j82N0Lj03K82k7k27
4412b4k36K53K45q9P5j5k76N4L9k79R4K14j0L0N6l34K19r0K9K34m2k9rJ09k51
4437c3K25l13J13m4K2N2k64K23k45K55j35K19k35Q4J90k11j53M53k96J88j78%
4459h3L88l13P5l68J00N53k46j08J14k19J73l24K82J0K6K64m10K73j37j23j0j20
4481b03K78j0J2L81n51L33k82j97K58J06j86J55j28J24P9r8j17K18k54K07KJ4
4503A41k84L3K45Mk02n2J80l6j38R8k35O6L84k90R8j26J35J11kK33j37k16kK16
4527B24k63K47k39o1O9pj73J40j2%J6O7N6r7k4j36K50j35J08J35n3k35J28k05
$$ y = [123, -23, 18, 204, -181, 10, 84, 32, 94, -85, 112, -75, 117, 108, -17, 312, -230, -235, -36, -9, 232, -81, 121, -222, 115, 66, -61, 50, 228, 116, -175, -19, 194, -220, 35, -135, -171, 53, 180, -2, 48, 51, -52, 230, 203, -24, -260, -7, 238, 149, 224, 209, -67, -13, 26, -253, -159, 55, 45, 75, 131, -203, 16, -74, -45, 189, 147, 118, 109, 218, -33, 192, -121, -8, -52, -30, 22, -242, -19, -264, -9, -144, 75, -160, -76, 114, -97, -250, 203, -93, 95, -83, -83, 305, -8, 67, -301, -201, 352, 106, -2, 112, -107, 66, -258, 24, 34, 60, 324, -86, 187, 50, -73, -83, -203, 75, 65, 77, 458, -93, 240, -42, -239, 19, 125, -61, 94, -34, 90, 169, 71, -46, 172, -82, 125, 127, 141, -143, -110, 135, 139, -63, -115, 65, 29, -109, -11, -246, -180, 204, -86, 12, -114, 21, 132, 130, 363, 226, 10, 8, 224, -39, 208, -31, -92, -23, -30, -203, -63, -75, -75, -59, 8, 64, -33, -57, -193, 57, -78, 30, 165, 112, -123, 5, -200]
4551b00L6M46k82j78MJ4P3j49r0M39k11o7m1L66o7l0J24K55m13JL09l42j30J72
4575C9K14j21k49R2O8j9p1q5K0K78l4J6l65J77K89k09m7J03j77J5J01j61K71j76
4599c1J16j98J3J60J32l10J21r3J85r8j77Q9J76p3P2k46L05k59L5K35l1r3O4j31
4623c7j73M89l5j81K1j2J49k37L55k94j20J15M0r3J60k66J71jr1oO5p9q5R2j00
4648a53J69o3R1K25J37o60L65n7j47J21n4R6j7J21r9lm9R2n35N52j33P4J43j04
4672A12k35K04m9O6P5j98l9K3l6L1n2q4K23R4j62J94q4J09k68R2m8J33j24j76
4696a99M37j22L4P1M0m09J93L3P7l79J47O1RJ0jm5J4J30j13P8j13K98m34J72K13
4721B02j39r8q1LJ45R8j44k8R2j61Q8J22j0p9J0J49k91Q8Q4j93J84k60P2J79J6
$$ y = [-200, -164, 282, 0, -178, -174, -160, -87, -236, -326, 113, -98, -165, -206, 160, 93, 63, 187, 442, 29, 30, 339, -3, -133, 39, 253, 132, -117, -25, 43, 24, -47, -132, -112, 166, 132, 148, -217, -40, 249, 40, -7, 96, -81, -66, 35, -126, 145, -31, 85, -113, -100, 60, 192, -118, 3, -90, 95, -3, -180, -91, 85, 12, 84, -162, 143, -116, -81, 154, 123, 30, 94, -37, -210, 279, 244, 63, 84, 72, 221, -16, 339, 45, -75, 40, 80, -13, 147, -119, 52, 51, -40, -46, 19, -60, -145, -53, -153, 16, -47, 44, 269, 406, -254, 111, 54, -93, 28, -26, 70, 53, 174, 75, 72, 23, 115, -420, 132, -1, 73, 216, 112, -123, 81, 32, 98, 173, -25, -64, -41, -77, -46, -98, -182, 41, 135, -27, 167, 83, 192, -76, 16, -32, 101, -23, -199, 238, 116, 150, 221, 261, -148, 45, 78, 155, -224, -77, -16, -7, 3, 2, -43, -29, 101, -12, 66, -47, 251, -183, -11, 202, 63, -35, -116, -113, 32, 130, -14, -42, 50, -111, -23, 99, 89, 10, 20, 169, -122, -34, 50, -143, 41, -219, -147, 32, 48]
4746D8P8k59J75o7N4j72o6J72l6o2p9J93q2K5O7J19k03K02k58M4J79o3P1k96J53
4771f3J62q2oP1l09J48qk5J1J3L3J03Qk82K05P8J36k76J19j11R4J29j28Q7k30
4796a23Q0J14K00k70p0j66K39K20m19R3J93k44O7K76k92Q8N7J1n0L8j71J79M3
4819I3j60L09k52J24J05q5k66J47J26q7o2L5q6J35P2j99m6LJ72j63q1M7K3l4J57
4844B7kj84J95j08J66j95QQ4r2J43M7j23j81Q7J33p6m8P2r3J38J0q3M00l74m1
4869i0q3L1J91n3J35n02M52j32%J8J70j91M0Lk23L16j87L50m69L25l29Q1K69j67
4893d5r9M48l36K32m4k2k00j50L87o1q3m20M68j62J4K55q6J46l37J15P7o6j0J06
4917A27l36K48J37j10j74R3J44j25j35Q9q7J43o1N5j58L40l04r4M1J2l3M3J34
$$ y = [48, 126, -133, 42, -25, 29, -143, -209, -37, -73, -135, -214, -21, -103, -78, -11, 108, -95, 107, -151, -107, 72, 9, 80, -216, -63, 99, 17, 11, 82, -227, -79, -87, -112, -101, -88, -55, 48, 56, -226, -21, 57, 193, -83, 36, -75, 19, 148, 20, 107, -123, -43, 71, 271, 1, -69, -235, 4, 224, -195, -102, 91, -153, -86, 190, -102, -14, 43, 54, 4, 42, -129, 50, 93, -67, 242, -10, 114, 219, 134, -132, 15, 141, 54, -8, 27, -59, 76, 148, -51, -97, -94, 78, -85, -166, -119, -96, -130, 27, 25, -159, 36, -72, 94, -101, -93, -9, -101, 42, 89, -34, -215, -128, 5, -71, -119, -47, -140, -2, 8, -75, 325, -49, -90, -173, -142, 49, -4, 131, -371, 81, -51, -51, -33, 137, -54, -14, -11, -234, 82, -105, 245, -224, 101, -228, -147, 122, -45, -144, 304, -32, 200, 156, 134, -66, -216, 171, 110, 27, -393, 75, -87, -73, 182, 96, 242, -95, 20, 97, 31, 21, 127, -209, 39, 176, 66, -108, -15, 129, 4, -131, -42, -129, 14, -47, 8, -150, 190, -114, -208, -167, -155, -188, -145, -11]
4940a1K88k45J30j11j11L37k77j4p8J37m28O53m14K08j50LK28j09j89jL12j78
4962b0J15p2J57j80OK9j00J71j89j65K49K03j86L5M7k37O5J79j80J66P3j71K18
4985B13j53J48L5l42R3j15K58k15J74J19R2l71J13j2j16k5K15l69K66l0J55l80
5007b47L81l9n9P4O7k69J90q0m5L7k72M8P8J87pO0k37m1K08N6l09K66J12k68J8
5032i1R5K44k39j10k9J91k04M5Q7k46m0L76J51Jl78K21j29J58K5m13M3L75k49
5055a16K83k33J15J80m25K33l5j05J23J52m26L54j91j71M13j35K04r8N3j03p9
5076gK07k72O8M1J8j01J56j89M41l25Q5j68R6M5j69j0J9M8r7K7J63k02K81j95
5100d0r6L33l87J26O8N4k10J08J59j52l1n0j23M81k67J4Q8n1K7%m41M09j49J91
$$ y = [-11, 277, 32, 162, 51, -60, 277, 0, -14, -92, 45, -383, 270, -144, 64, -86, -83, 145, 36, -153, -154, 158, -20, 95, 23, 180, 0, 6, 35, -65, 106, -83, -248, 1, 204, 18, 53, 100, -137, -72, 107, -73, 93, 166, -5, 213, 60, 208, 243, -99, -6, -121, 137, -78, 96, 215, 307, -64, 49, 37, -79, -104, 111, -258, 8, -22, 133, -247, 134, 95, 36, 110, 177, -92, 98, 18, -27, 10, -262, -214, -136, 51, 44, 104, -133, -174, 34, 90, -219, 47, 159, -109, -91, 4, 248, 9, -101, -130, 61, -143, -98, -11, -257, -297, 79, 230, 231, -147, 74, -55, 103, 128, -285, -242, 133, -116, 167, -66, 49, 229, -196, 37, 2, -103, 20, 172, -254, 100, -91, -262, 151, 16, 220, 122, 175, 72, -7, 200, -72, -4, 37, 55, -46, 110, -79, 362, 37, 122, -46, 50, 95, -74, -84, -65, -17, -114, -87, 76, -126, 155, -40, -136, 197, -190, -64, 4, 58, -152, -44, 115, -37, -68, -118, -241, 240, -27, -13, 75, 24, 51, 51, -390, 19, -130, 61]
5124F1J66l32Q0Q4k36o8K59R2k23K25J73n07L08k15J03Q4M4q3K6P4J55l05j77
5147b12M13k63J63J57j47p4N1j41J54n8P2j44Q8j06p7Q2J64o8j18j79M33l88K91
5170I3j11N2l2j02K10r9p3Q4K6n4J04j04Q6j30L6k5R3M2J25k3k52l8K95l78N5
5195a20r9K33l8k05J26L1J34K24l07j58M16k78L33j48Nk51Q6mM5J05k90R8n0K49
5219A37j79%K6J33j60m8p1L25j46j77Q4K61j49j17L0j02L37j46j28O4j02J55J
5242B8j2j9l0J75k06o9J27K63k48l49J31K66l8k23K83j74M8mQ0j6k33J00L35q7
5266A28j75N7O1o2l1O5j63L31j56J53j67k65L33N2j33r1K36j82k44J34l8J45n9
5289g1K35j66l26K93j62L24j95p5l8M3K23q2J32q7j10J06O6j03J60k63J8N4K02
$$ y = [61, 227, -105, -25, 59, -177, -245, 14, 106, -117, 108, 281, -226, 82, -133, -30, 54, 98, 15, 41, 115, 270, -35, -212, 201, -62, 101, 258, 111, 37, 88, -53, 101, 43, 115, -29, 59, -47, -124, -42, 122, 54, -64, -243, 190, -198, 93, -18, 34, 2, -100, 110, 11, -62, 22, 48, -6, 98, -6, 80, -50, -14, -39, 54, 96, 221, 198, -54, -92, 203, -175, -120, -219, 14, -24, -229, -103, -72, 62, 286, -21, -179, 237, -41, 292, 144, 149, -102, -16, -20, 25, 130, -160, -62, -112, 137, -42, -42, -16, 117, -43, -91, -162, 163, 17, -160, -76, 185, 36, -81, -51, -153, 184, 38, -90, -26, -128, 27, 28, 16, -3, -33, 142, -64, -133, -6, 257, 9, -340, -209, 57, 19, -204, 79, -95, -47, -51, 29, 13, -220, -120, 215, 128, -47, 10, 71, 9, -22, 43, -120, 211, 55, 208, 41, -224, 109, 161, 28, -63, 173, -9, -253, -119, -157, -12, -71, 164, -2, -328, -35, -197, 127, -68, -143, -181, -138, 85, 3, 135, 48, -62, 44, 110, 7, 167, -96, -78, -24, 178]
5312A78j66j16lR3J87j90K44k92K29k27J38P6j91K54l79K50J12k36m4J83N7l00
5334a43J82J6J58k66J08j5P1Nk11J7Kj46L82n4l76K52k99K55K15k11O5O8j9k12
5358a56J59j50J57n4J29k21j09M37p9j19j7n6M3K61o9K0r4r3j28L43n23N9J42
5381a18K56Qj49Q3PK7j01m1K25k49K7k02K80P7k18K98k97M3Q7O0k23J14J36n9
5405G1k04P2N4R0l32N13k49M1j57m6P8J20M6k96R4r8J78l0J4k6O1K8J20m38K07
5430h9J97j94j2L01j43O9R7J50m06j25J53qo2J72l0j26J23j73J96j47J8r6J54
5453A9j2r6L0K08K0k72L7j88K69l5J20J5Q1k58j50K71%n9j2k2kJ13On1m8L24k52
5480E6l3o0K30n36L54J4k7N4j40J11J70k5j80k2l3J64j21o2K78k04L8l3l05L03
$$ y = [178, 12, -104, -107, -14, 173, -17, 227, -65, 164, -63, 75, 151, -40, 214, -165, 85, 197, -39, -83, 100, 157, -143, 39, 55, 213, -53, 55, 40, 111, 116, -95, -78, -76, -222, 160, 106, -270, -18, -317, -62, 153, -58, 7, 75, 56, -156, 3, -147, 10, -44, 85, -136, -245, 192, 113, -6, -23, -79, -36, 225, 156, 176, 82, -11, -139, 204, -319, -260, -118, 138, 146, -3, 80, 87, 114, 13, -28, 197, -52, -25, -227, 53, 130, -88, 210, -87, -44, 43, 103, -120, -6, 130, 71, -133, -61, -7, 83, -249, 264, 15, 56, -101, -147, -69, 51, 97, -199, -105, -203, -25, -55, -41, -67, -6, 22, 142, -296, -89, 108, -86, -98, 203, 60, 129, 226, 376, -30, -155, -2, -10, -72, 100, 70, -56, 67, -106, 90, -57, -39, -135, 19, 7, -89, -59, 149, 169, -103, -66, -254, 15, -20, 100, 115, 196, -62, -212, 59, 59, 0, -12, -34, -36, 77, 83, 32, -16, 308, 56, 23, -37, 193, -343, 11, 25, -2, 52, -88, 23, 193, 168, -12, -34, -67, 97, -24, -86, 192, -12, 26, -7, -312, -9]
5504iJ75j41J42l08J42n7j38K36n6O0P0p1j23J20K1l29K35l5J98o9q0LL8l14J85
5529a05K03J35Qj28k08K96j50j03K5K61j00k6J65p3j75l1R3l93K50k7J25k25j22
5552c05K59J14N2k81k3K00j32lm1K40j1O3j14P2p7q0K25k75J55j03J6j78N07j85
5576I5j1r5k6j14J15L37k92R8n75M89j81J65J15M6N7l14J51k43N78j73j3l01K68
5599A76l36L73k14o3J03J05lNj40O7j94j6K46k29j4M3J37N1k72N8J51J1k11J34
5623c2M9M0j89K4K00m8Q2k89J67m0L39m77J65J4K07J41p3k41k59J34l1J17J87
5646A87k06Q3O5j07n5J18j83J78k90k6J54o1K46J55j42j68J60n6J2J3J10j20R
5669G6Q5L9q8j99J38nN6j5m3j03j1K19j07k20K12k72J25m8K52k62J21J12l41K97
$$ y = [-9, 166, 25, 167, -141, 1, -56, -194, 42, -14, 46, 116, 45, -78, 42, 63, -266, -31, -66, 132, 63, -17, -14, 24, -290, -105, 98, 233, 241, 113, -95, 201, 51, -52, -27, 234, 134, 108, 273, 200, 25, -6, 87, -306, -56, -83, 42, -183, -305, -46, 68, 120, -161, -184, 16, -116, -119, -160, 80, 69, 132, 18, 90, 13, -67, 158, -117, 38, -65, -49, -227, 280, 95, 84, -11, -37, -151, -36, 301, 9, 107, -468, 21, -160, 5, 120, 166, 223, -91, 60, -183, 395, 222, 209, -92, 176, -160, 213, -1, -64, 39, 144, 141, 146, 6, 73, -121, -137, 109, -120, -134, -91, 46, 97, -175, -117, 34, 45, -166, -32, 17, 57, -132, -108, 92, 44, 126, -163, 4, -36, 303, -174, -9, 5, 212, 353, 280, 39, -220, -86, -117, 0, 187, -19, 64, 129, 22, -33, 85, -98, 80, -210, -236, -82, -143, 103, 258, 116, -52, 108, 52, 64, 77, 187, 67, 76, 161, 200, 112, -87, 51, 46, 102, 87, 44, -59, -70, 149, 42, -178, 34, -238, -113, -161, 91, -171, -50, 62, -279, 18]
5693A8r8J15k36J54j08J19p9K95k74J13k14j5j59L83m6Kq5J15j7m2K38j97J54
5716A36k01P8k45K38Q8j45J99mJ23l89L1M8k97M37j3r7m7O5o9nJ11Rj79n6K2K51
5742H9m0k15J03K94m30j3P6K5j8N1R1J0q3J75O4Kj07M9k49mJ0R7M9j2R2k24N2
5769f6R2k3J00j15L2j47L09o65N51l18L60j22J93k69j84M82p8k02rK36k86L91
5791B62l04j01J68K70k65N5m3kl19K59K17p3l9L1J30k01j50q3K31J56j26m7r2
5814f6j29L75j23K46k11j63K00j01Qj8K5l1L5j38J57k40Q5J02o6o5M3N7O2p1j03
5839a30J42K1j60n2L5J49q3k8K08j61j62K75k89K76J00J34k92j20K91n6M0m1o9
5862B8K54l11J1n7j67K59p7L8M3j42n6j8k7M18l28K42k04J41m9J86l24O6k4k18
$$ y = [18, -80, 35, -201, -47, -155, -36, -115, 180, -94, 19, -195, -210, -369, 14, -32, -30, -115, 0, -17, -59, 179, -18, 136, -65, 13, -232, 6, 94, -51, 148, 144, 267, -122, -91, -43, -340, 97, 84, -13, -60, 5, -64, -69, 42, 51, -128, -184, -162, 89, 49, -166, -63, 231, -199, -212, -136, -111, -129, -78, 13, 23, -60, 115, 179, 181, 74, 123, -126, -130, -120, -23, 26, 14, 106, -118, -66, 26, 3, 103, -12, 20, -127, 182, -483, 68, -250, 110, -12, 181, -88, -272, 210, 132, -70, -79, 157, -129, 262, -42, -143, 25, 295, 30, 85, 42, 40, -279, -20, 197, 124, 85, 116, 246, 45, -105, -188, 43, 199, 73, 26, -66, -195, 180, 57, 303, 92, -71, 129, 28, 36, 18, 43, 12, 47, -91, 66, -174, -89, 13, -53, -118, -75, -18, 44, -27, -130, 12, 33, -127, -179, -144, 5, -78, -106, 102, -59, -221, 54, -235, 41, 141, 275, -17, -137, 154, 98, 138, 97, 28, 282, -29, -18, -75, -242, 17, -60, -22, 21, -121, -177, -195, -222, 196, -132, 110, -94, 47, -2, 184, -140, -74, -98, -316]
5886c16M76r5j24L11L1j64k3J5k33r1K30O9j49O9J43k3L2j48m0j06j4P0Q5N5j45
5911h5Rj58L20j14n0m7J26j49K9J25l1O7l17K56J72j37j27K85r0k05J87k81L01
5934H6Q7Rl36J95J02N4k81K2J55l27L76j50J91k04j40M85k11M2o4Q0J9l27O0n5
5958a32L55o9l70J8J39K14l13J65M7j72J52K86k24j45J83n46J05K69J92O9k78
5979e5J03J48K9k74J14o6j09L07m43J81J3J96J70l21O6J71k95K78j90L0k1j20
6001h8L21j9j43j88K03n7p4J42p7k17L91j01L3j83k96M49k90K17j11L9J81o3N2
6024A21j44J27j77p1l8L46J4k59jJ57n2k67l4K45M8k0k0J0n5l7o5K37k51J14P2
6049@k75K64Q9K6j05M1L2n4J26j5l2k73M64l11J61n2j71Nk5L46p3Jm82K42J59
$$ y = [-316, 160, 65, -59, 252, 283, 119, 96, 111, -122, -213, 17, 86, -63, 6, 149, 126, 158, 10, -30, -136, -150, -80, 5, 60, -85, -76, -234, 86, -28, -78, -125, 1, -148, -119, 6, -25, 42, -275, -19, 153, 16, -111, 174, 84, -121, 66, -215, 86, 173, 182, -154, 41, 143, 197, -84, -62, 93, -234, 142, -8, 183, -21, -161, 324, 113, 155, 91, 171, 190, -137, -77, -132, 223, 154, -216, -198, -59, 155, -158, 7, 54, -118, 34, 320, 96, -49, 134, -412, -307, -38, 154, 223, -55, 48, 196, 225, -49, 65, -1, -110, 197, -246, -65, -52, 144, 314, -7, 59, 230, -65, 213, 23, 53, 32, -88, 233, 214, 71, -117, 86, 29, -45, 97, 20, -197, 194, 93, 126, -57, -353, 96, -194, 23, -88, -49, 132, 69, 121, -23, 104, -73, -144, -182, 164, 178, -81, -82, 75, 23, -244, -278, -33, 15, -5, -25, -15, -70, -107, -172, 65, -186, -72, 0, -275, -11, 78, 104, -1, 40, 72, 18, 144, 129, 97, -176, 288, -23, 138, 86, -85, -80, -105, 241, 168, 169, -313, -71, 88]
6074H8n6k47P4K26k66K22k67K48j6j24J90j02l7M4J42j46J76j90nJR1N4k5N2k20
6099i3L1j67J42o0j1J70J56k01n1J18O5j02j40K36m09L65n2m0K19k54K0Q6N5j78
6123i5R9R0k2P7j80J77k22j11L13j06l5j62L23j31P4j6j02M0k79J74P2O0j8J41
6147A61L5l6j79j94K03P3n21N86j86j0k7Q6j20M5M50n33K75J65k30M1O9j63j42
6170a52P7n1K22j72K16l43K09p2j93K46k16K18M2k16M06l12O9J20J6k5K32m21
6192a00J40p7j72K69m24K24J80j36k53J97K31K79j59j48k2j37n6K37p6J29j57
$$ y = [88, 32, -215, -141, 85, -181, 41, -226, 22, 6, -118, 72, -30, -67, -23, 119, -27, 149, -41, -46, -45, 46, 100, 75, 127, -93, -62, -229, -87, -147, -158, 12, 168, -33, -84, 34, 99, -3, -143, 93, -316, 49, -3, -43, 176, -78, -58, 28, 83, -95, 4, 94, 72, 149, -31, 146, -76, -187, 126, 20, -15, -177, 146, 15, 89, 73, -29, 11, -268, -94, -22, 38, 20, 161, 196, 160, -19, -213, -10, 63, -458, 128, -58, -68, -95, -9, -129, -84, 366, -167, 108, 273, 43, 84, 153, -10, -152, -75, -126, 96, -76, 140, -203, 6, -66, -259, -13, -229, -11, 31, -185, 221, -91, -22, 98, 114, 89, 321, -100, 40, -37, -209, 60, -364, -140, 40, -96, -349, -152, 79, 358, 199, 51, 29, -108, -164, 73, -3, 126, -31]
$$ [...]
8191F
##END NTUPLES=NMR FID
##END=
