##TITLE=1H_Ad=0(bat3)-benzol-part
 CDCl3
 8 sc, 
 24.1.2023
##JCAMPDX= 6.0         $$ Bruker NMR JCAMP-DX V2.0
##DATA TYPE= NMR FID
##DATA CLASS= NTUPLES
##ORIGIN= UXNMR, Bruker Analytische Messtechnik GmbH
##OWNER= root
$$ XWIN-NMR		Version 3.5
$$ Tue Jan 24 14:02:06 2023 Russian Standard Time (UT+4h)  she@DPX200
##.OBSERVE FREQUENCY= 200.13135
##.OBSERVE NUCLEUS= ^1H
##.DELAY= (6, 6)
##.ACQUISITION MODE= SIMULTANEOUS
##.ACQUISITION SCHEME= undefined
##.AVERAGES= 8
##.DIGITISER RES= 18
##SPECTROMETER/DATA SYSTEM= spect
##.PULSE SEQUENCE= zg30
##.SOLVENT NAME= CDCl3
##.SHIFT REFERENCE= (INTERNAL, CDCl3, 0, 15.7039)
##AUDIT TRAIL= $$ (NUMBER, WHEN, WHO, WHERE, WHAT)
$$ ##TITLE= Audit trail, XWIN-NMR		Version 3.5
$$ ##JCAMPDX= 5.01
$$ ##ORIGIN= Bruker BioSpin GmbH
$$ ##OWNER= she
$$ F:/spectra/data/she/nmr/H-F/1/audita.txt
$$ ##AUDIT TRAIL=  $$ (NUMBER, WHEN, WHO, WHERE, WHAT)
(   1,<2023-01-24 14:00:56.39 +0400>,<she>,<DPX200>,
      <created by zg, POWCHK disabled, PULCHK disabled
       configuration hash MD5:
       00 E9 B6 7A A2 85 ED C7 34 08 36 98 17 FE 4E 26
       data hash MD5: 16K
       35 5E 9F F8 C1 52 75 31 D5 73 90 58 4F 4D 60 43>)
$$ ##END=
$$ 
$$ hash MD5
$$ 64 8A 32 BF FD 5E 23 2D FA 2B 61 82 DA 86 CC 40
##$RELAX= 
##$RELAX= 
##$RELAX= 
##$RELAX= 
##$RELAX= 
##$RELAX= 
$$ Bruker specific parameters
$$ --------------------------
##$DU= <F:/spectra>
##$EXPNO= 1
##$NAME= <H-F>
##$PROCNO= 1
##$TYPE= <nmr>
##$USER= <she>
##$AMP= (0..31)
100 100 100 100 100 100 100 100 100 100 100 100 100 100 100 100 100 100 
100 100 100 100 100 100 100 100 100 100 100 100 100 100 
##$AQSEQ= 0
##$AQ_mod= 1
##$AUNM= <au_zg>
##$AUTOPOS= <>
##$BF1= 200.13
##$BF2= 200.13
##$BF3= 200.13
##$BF4= 200.13
##$BF5= 200.13
##$BF6= 200.13
##$BF7= 200.13
##$BF8= 200.13
##$BYTORDA= 1
##$CFDGTYP= 0
##$CFRGTYP= 5
##$CHEMSTR= <none>
##$CNST= (0..31)
1 1 145 1 1 1 1 1 1 1 1 1 1 1 1 1 1 1 1 1 1 1 1 1 1 1 1 1 1 1 1 1 
##$CPDPRG= <>
##$CPDPRG1= <>
##$CPDPRG2= <>
##$CPDPRG3= <>
##$CPDPRG4= <mlev>
##$CPDPRG5= <mlev>
##$CPDPRG6= <mlev>
##$CPDPRG7= <mlev>
##$CPDPRG8= <mlev>
##$CPDPRGB= <>
##$CPDPRGT= <>
##$D= (0..31)
0 1.2 0 0 0 0 0 0 0 0.06 0 0.03 0 0 0 0 0.0002 0 0 0 0 0 0 0 0 0 0 0 0 
0 0 0 
##$DATE= 1674554455
##$DBL= (0..7)
120 120 120 120 120 120 120 120 
##$DBP= (0..7)
150 150 150 150 150 150 150 150 
##$DBP07= 0
##$DBPNAM0= <>
##$DBPNAM1= <>
##$DBPNAM2= <>
##$DBPNAM3= <>
##$DBPNAM4= <>
##$DBPNAM5= <>
##$DBPNAM6= <>
##$DBPNAM7= <>
##$DBPOAL= (0..7)
0.5 0.5 0.5 0.5 0.5 0.5 0.5 0.5 
##$DBPOFFS= (0..7)
0 0 0 0 0 0 0 0 
##$DE= 6
##$DECBNUC= <off>
##$DECIM= 32
##$DECNUC= <off>
##$DECSTAT= 4
##$DIGMOD= 1
##$DIGTYP= 9
##$DL= (0..7)
0 120 120 120 120 120 120 120 
##$DP= (0..7)
150 150 150 150 150 150 150 150 
##$DP07= 0
##$DPNAME0= <>
##$DPNAME1= <>
##$DPNAME2= <>
##$DPNAME3= <>
##$DPNAME4= <>
##$DPNAME5= <>
##$DPNAME6= <>
##$DPNAME7= <>
##$DPOAL= (0..7)
0.5 0.5 0.5 0.5 0.5 0.5 0.5 0.5 
##$DPOFFS= (0..7)
0 0 0 0 0 0 0 0 
##$DQDMODE= 0
##$DR= 18
##$DS= 0
$$ [...]
##$SUBNAM2= <"">
##$SUBNAM3= <"">
##$SUBNAM4= <"">
##$SUBNAM5= <"">
##$SUBNAM6= <"">
##$SUBNAM7= <"">
##$SUBNAM8= <"">
##$SUBNAM9= <"">
##$SW= 18.05172834244
##$SWIBOX= (0..15)
0 0 2 0 0 0 0 0 0 0 0 0 0 0 0 0 
##$SW_h= 3612.71676300578
##$TD= 16384
##$TD0= 1
##$TE= 0
##$TE2= 300
##$TE3= 300
##$TEG= 300
##$TL= (0..7)
0 120 120 120 120 120 120 120 
##$TP= (0..7)
150 150 150 150 150 150 150 150 
##$TP07= 0
##$TPNAME0= <>
##$TPNAME1= <>
##$TPNAME2= <>
##$TPNAME3= <>
##$TPNAME4= <>
##$TPNAME5= <>
##$TPNAME6= <>
##$TPNAME7= <>
##$TPOAL= (0..7)
0.5 0.5 0.5 0.5 0.5 0.5 0.5 0.5 
##$TPOFFS= (0..7)
0 0 0 0 0 0 0 0 
##$TUNHIN= 0
##$TUNHOUT= 0
##$TUNXOUT= 0
##$USERA1= <user>
##$USERA2= <user>
##$USERA3= <user>
##$USERA4= <user>
##$USERA5= <user>
##$V9= 5
##$VALIST= <valist>
##$VCLIST= <CCCCCCCCCCCCCCC>
##$VD= 0
##$VDLIST= <DDDDDDDDDDDDDDD>
##$VPLIST= <PPPPPPPPPPPPPPP>
##$VTLIST= <TTTTTTTTTTTTTTT>
##$WBST= 1024
##$WBSW= 4
##$XGAIN= (0..3)
0 0 0 0 
##$XL= 0
##$YL= 0
##$YMAX_a= 130161
##$YMIN_a= -146315
##$ZGOPTNS= <>
##$ZL1= 120
##$ZL2= 120
##$ZL3= 120
##$ZL4= 120
##$ABSF1= 10
##$ABSF2= 0
##$ABSG= 5
##$ABSL= 3
##$ALPHA= 0
##$AQORDER= 0
##$ASSFAC= 0
##$ASSFACI= 0
##$ASSFACX= 0
##$ASSWID= 0
##$AUNMP= <proc_1d>
##$AZFE= 0.1
##$AZFW= 0.1
##$BCFW= 1
##$BC_mod= 2
##$BYTORDP= 1
##$COROFFS= 0
##$CY= 11.3945322036743
##$DATMOD= 1
##$DC= 2
##$DFILT= <>
##$DTYPP= 0
##$F1P= 2.36226072786647
##$F2P= -0.459571619588291
##$FCOR= 0.5
##$FTSIZE= 0
##$FT_mod= 4
##$GAMMA= 1
##$GB= 0.15
##$INTBC= 1
##$INTSCL= 1
##$ISEN= 128
##$LB= 0.24
##$LEV0= 0
##$LPBIN= 0
##$MAXI= 10000
##$MC2= 0
##$MEAN= 0
##$ME_mod= 0
##$MI= 1.114404
##$NCOEF= 0
##$NC_proc= 0
##$NLEV= 6
##$NOISF1= 3.799351
##$NOISF2= 2.8
##$NSP= 1
##$NTH_PI= 0
##$NZP= 0
##$OFFSET= 15.70392
##$PC= 1
##$PHC0= -19114.93
##$PHC1= 13.80079
##$PH_mod= 1
##$PKNL= yes
##$PPARMOD= 0
##$PSCAL= 0
##$PSIGN= 0
##$REVERSE= no
##$SF= 200.130013532006
##$SI= 16384
##$SIGF1= 3
##$SIGF2= 2
##$SINO= 400
##$SIOLD= 16384
##$SREGLST= <1H.CDCl3>
##$SSB= 0
##$STSI= 0
##$STSR= 0
##$SW_p= 3612.71676300578
##$SYMM= 0
##$S_DEV= 0
##$TDeff= 0
##$TDoff= 0
##$TI= <>
##$TILT= no
##$TM1= 0
##$TM2= 0
##$TOPLEV= 0
##$USERP1= <user>
##$USERP2= <user>
##$USERP3= <user>
##$USERP4= <user>
##$USERP5= <user>
##$WDW= 1
##$XDIM= 8192
##$YMAX_p= 0
##$YMIN_p= 0
$$ End of Bruker specific parameters
$$ ---------------------------------
##NTUPLES= NMR FID
##VAR_NAME=  TIME,          FID/REAL,        FID/IMAG
##SYMBOL=    X,             R,               I
##VAR_TYPE=  INDEPENDENT,   DEPENDENT,       DEPENDENT
##VAR_FORM=  AFFN,          ASDF,            ASDF
##VAR_DIM=   8192,          8192,            8192
##UNITS=     SECONDS,       ARBITRARY UNITS, ARBITRARY UNITS
##FACTOR=    0.0002768,     1,               1
##FIRST=     0,             0,               0
##LAST=      2.2672688,     0,               0
##MIN=       0,             -146315,         0
##MAX=       2.2672688,     130161,          0
$$ Real data points
##PAGE= N=1
##DATA TABLE= (X++(R..R)), XYDATA
$$ [...]
1803i3l71L35j6j44K49K00l04L45J1k0k56L55j95M38m44J23RO1j79l9j05P0r6
$$ -93 -464 -129 -145 -289 -40 160 -144 201 212 192 -64 291 96 534 90 213 222 283 104 65 -40 30 -66
1826f6P5k24J95j35l58R8P6O5j32J56k01L65k40M00k1rk0K88j1n03N36K74l64
$$ -66 9 -215 -20 -155 -513 -415 -339 -274 -406 -250 -451 -86 -326 74 53 44 24 312 301 -202 334 608 244
1849B44mJ91j46K16m73j7P9l09J95j6j89O7k51K16Jn6j41j10J86K51l85K44M8
$$ 244 240 431 285 501 28 11 90 -219 -24 -40 -229 -162 -413 -197 -196 -252 -393 -503 -317 -66 -451 -207 -159
1872a59j16K60J40K35m81M50k47K00L5K88k90j28K11k32L67m37j27oJ9n2k46Q5
$$ -159 -275 -15 125 360 -121 329 82 282 317 605 315 187 398 166 533 96 -31 -37 -18 -70 -316 -231
1894b31j22k63K91J84k50M31k32l6K35l28K47O3j05L22j3J91k38J3M8j35M21l38
$$ -231 -353 -616 -325 -141 -391 40 -192 -228 7 -321 -74 -11 -116 206 193 384 146 159 207 72 493 155
1916A55j39K62l74L29k35J70j02j19L0kj41j51J25l25k1K58K22j00j50L96r5k14
$$ 155 16 278 -96 233 -2 168 66 -53 -23 -25 -166 -317 -192 -517 -538 -280 -58 -158 -308 88 -7 -221
1938b21Q8J07J88n7j22M06j46k20K42p8j52L10k87l8j21K5J01k42R9%j82K35j4
$$ -221 -133 -26 162 105 -17 389 243 23 265 187 35 345 58 20 -101 -76 25 -217 -118 -118 -300 -65 -79
1961g9l5l88K83q9J9j48K93K19j86K30O9l27L60m3j15J52M1k4L1j39o8N7M8j53
$$ -79 -114 -502 -219 -308 -289 -437 -144 75 -111 119 188 -139 221 178 63 215 256 232 263 124 56 113 161 8
1985HJ61k86r0K7L7M0qj17q1J55k36J55o7JJ83J02l02L63J80j79L25m08L55n8
$$ 8 169 -117 -207 -180 -143 -103 -111 -228 -309 -154 -390 -235 -302 -301 -118 -16 -318 45 225 46 371 -37 318 260
2009B60m6J41j02j87k55M78l93J76k94L47k47o3J57l00P6kJ3o1N1l5K13l24K71
$$ 260 214 355 253 66 -189 289 -104 72 -222 125 -122 -185 -28 -328 -252 -254 -241 -302 -251 -286 -73 -397 -126
2032a26l4J61j17K98o2K16j97m4J20J15j68J93j30K10m2k37J01r7l7l44J42q0
$$ -126 -160 1 -116 182 120 336 139 95 215 330 162 355 225 435 393 156 257 160 123 -221 -79 -159
2054a59j78O3J85Ok48J16j50R3J23mN6j12k9M46R4m46N17k01j52j74L89L6J68
$$ -159 -337 -274 -89 -83 -331 -215 -365 -272 -149 -153 -97 -209 -238 208 302 -144 373 172 20 -154 235 271 439
2077D39%k51J20j8k6p5r3q3J0m0k5L0J53o61L57N5m72K89J80N1r3MJ69n5m9K70
$$ 439 439 188 308 290 264 189 96 13 23 -17 -42 -12 141 -520 -163 -108 -580 -291 -111 -60 -153 -149 20 -35 -84 186
2103A86j93J41K8J28n2j63J42L30m39qL09m92L46p11K72R5J6k9j17K7k28L06j69
$$ 186 -7 134 162 290 238 75 217 547 108 100 409 -83 263 -448 -176 -81 -65 -94 -211 -184 -412 -106 -275
2126b75K50O2k26q8L15q6l9K6K37K77n08K72J25nj74K82j36k94M12k56J27j45
$$ -275 -25 37 -189 -277 38 -48 -87 -61 176 453 -55 217 342 337 163 445 309 15 427 171 298 153
2148A53j20O1k17j78J20m1N1O4n1J77l88m0M30n8j49K68R1p4J39k21j9L22J9k80
$$ 153 33 94 -123 -301 -181 -222 -171 -107 -158 19 -369 -409 21 -37 -186 82 173 99 238 17 -2 320 339 59
2172E9J09j34K88k64J14q7j83K55R0l83J42m17M14j85j61K30n7J11k00pJ94j19
$$ 59 168 34 322 58 172 85 -98 157 247 -136 6 -411 3 -182 -343 -113 -170 -59 -259 -266 -72 -191
2194a91q4K91J40k10J87J3%K6J49k18k9o0K63j76R7j43j20K1J69Pk01J01k89N7
$$ -191 -275 16 156 -54 133 146 146 172 321 103 74 14 277 101 198 55 -65 -44 125 132 -69 32 -257 -200
2218b00j6m7L94l27J00k09K18P3J03p5k28M10j45L6k42L09NO7p1o9L56l52L2J18
$$ -200 -216 -263 131 -196 -96 -305 -87 -14 89 14 -214 196 51 87 -155 154 159 226 155 86 442 90 122 240
2242B40j85o5p4L20k17M8j71l8p0m5P0J12k62M25j66N0Ok35L48p3K3l1M7q5J88
$$ 240 55 -10 -84 236 19 67 -104 -142 -212 -257 -187 -75 -337 88 -78 -28 -22 -257 91 18 41 10 57 -28 160
2267A60J40ok01O7L15k41N2n7j77J09k63K76j46k33J6P8n7J05l36PM60j32l45
$$ 160 300 294 93 160 475 234 286 229 52 161 -102 174 28 -205 -189 -111 -168 -63 -399 -392 68 -64 -409
2290d09L61j26O7K26l02K12N0K09j48K04j40j16J40j6J39j77j29N0O2p7j65R9
$$ -409 -48 -174 -107 119 -183 29 79 288 140 344 204 88 228 212 351 174 45 95 157 80 -85 14
2312A4j83J24r7k8R0n0j43m9K19j40K69j14l9J12r9K08n2P2k24K07j38J46J86
$$ 14 -169 -45 -142 -170 -80 -130 -273 -322 -103 -243 26 -88 -127 -15 -114 94 42 114 -110 97 -41 105 291
2335B91k2j29m8M5J19k62K48j39o6P5r2J47l63Q4K13r4l6j08r4J01J7K9R0K6j15
$$ 291 269 140 92 137 256 -6 242 103 37 112 20 167 -196 -112 101 7 -29 -137 -231 -130 -113 -84 6 32 -83
2360h3M0J95o3K99j48j45J64k47J61k66J63R5o0K3J24l30j19K77m8M3k82J72j35
$$ -83 -43 152 89 388 240 95 259 12 173 -93 70 165 105 128 252 -78 -197 80 32 75 -207 -35 -170
2383a70J48j37j70M2nK91K02r8j41K17q0O6O3j58J27K19l33r4K87l14L33m03K82
$$ -170 -22 -159 -329 -287 -292 -1 201 103 -38 179 99 165 228 70 197 416 83 -11 276 -38 295 -108 174
2406A74k06J06o9J40k32k61L25l17K73j62J65k91J86R4j13R7n4j13M01k77J01
$$ 174 -32 74 5 145 -87 -348 -23 -340 -67 -229 -64 -355 -169 -75 -188 -91 -145 -258 143 -134 -33
2427c3Q7q9J81M7j68J34K07l16k20K81l2j06J41l3l7j32J7j08J20o3j15RJ50j75
$$ -33 54 -35 146 193 25 159 366 50 -170 111 79 -27 114 81 44 -88 -71 -179 -59 -122 -237 -228 -78 -253
2451b53K75j6K55l58j82L40J92k99K97k76J84L20m65L26l65J10J26lQ0k06j40
$$ -253 22 6 261 -97 -279 61 253 -46 251 -25 159 479 14 340 -25 85 211 208 288 82 -58
2472e8L80p73J73L15k68M6k55L91j20K40k00K0J54j48J05J2j36J51k16K14q7M54
$$ -58 322 -451 -278 37 -231 -185 -440 -49 -169 71 -129 -109 45 -103 2 14 -122 29 -187 27 -60 394
2494C94l02J03j55q1K70n4k67J59J54k06k32L17j70nQ3r3k0O1j71Q1mJ18J4j7
$$ 394 92 195 40 -41 229 175 -92 67 221 15 -217 100 -70 -75 8 -85 -105 -44 -215 -134 -138 -20 -6 -23
2518b3k88J36RJ02K51j57K1k7m4J46j23L64l7j44j68q6J22r5J1Mj9m0n0Q7J07
$$ -23 -311 -175 -166 -64 187 30 51 24 -20 126 3 367 330 186 18 -68 54 -41 -30 -26 -45 -85 -135 -48 59
2543E9m26P2L32p8k73J56K98j91l0K5K34m7j33K09k0k54K92q2o6K19j62j78J18
$$ 59 -367 -295 37 -41 -314 -158 140 -51 -81 -56 178 131 -2 207 187 -67 225 143 77 296 134 -44 74
2566G4J35o5j48J31j58N1K5j39J47l5j16j90L17RJk06K14j57J47k40K27K93n30
$$ 74 209 144 -4 127 -31 20 45 -94 53 18 -98 -288 29 38 39 -167 47 -110 37 -203 24 317 -213
2589b13j7M53jk84%jK23j60K75j78r3l9P7J26l95rJ05R5l8j73j89L49r8K51P9
$$ -213 -230 223 222 -62 -62 -63 160 0 275 97 4 -35 42 168 -227 -236 -131 -36 -74 -247 -436 -87 -185 66 145
2614A45j28J62l6m37K86J82l92M0J84K52j61J58p3jO4q7j49r9J65J73k43m3rm0
$$ 145 17 179 143 -294 -8 174 -218 -178 6 258 97 255 182 181 245 158 9 -90 75 248 5 -38 -47 -87
2638h7J42K2j19p1j76L0K87j56LK34J3j96K27k05M9K05l7K31m93L19k31J98K00
$$ -87 55 77 -42 -113 -289 -259 28 -128 -125 109 122 -74 153 -52 -3 202 165 396 -97 222 -9 189 389
2661C89k65J6j34l8k9m9J8q9K0o6K65l55J52l31K56K18j0K4j87K43k76K70k8J33
$$ 389 124 140 6 -32 -61 -110 -92 -181 -161 -227 38 -317 -165 -496 -240 -22 -32 -8 -195 48 -228 42 14 147
2685A47j76J73J26l40M5J56Q4k27LJ82j0j59r5k94K99l4j78L47j35j40N1o2K4
$$ 147 -29 144 270 -70 -25 131 215 -12 -9 173 163 4 -91 -385 -86 -120 -298 49 -86 -226 -175 -237 -213
2708b13J22k27K72J56k23l3J88l8n6R5R9P8j00R8k0R2j25P2l63J85j58N89l90
$$ -213 -91 -318 -46 110 -113 -146 42 4 -52 43 142 220 120 218 198 290 165 237 -126 59 -99 490 100
2731A00j72k4K23Q9m47J02M26n46k61N67q0m7k9O7k01J32N7J0j3k7J03m2O0j21
$$ 100 -72 -96 127 216 -231 -129 297 -249 -510 57 -23 -70 -99 -32 -233 -101 -44 -34 -47 -74 29 -13 47 -74
2755g4K61j04L76k13k79QJ42j75j22p2J38L60j50l29L29k07j13N5K21q0j09J34
$$ -74 187 83 459 246 -33 -25 117 -58 -180 -252 -114 246 96 -233 96 -111 -224 -169 52 -28 -137 -3
2777cl66J47L88l14P9J25j4J66j13K86j39p9k67J28npl7M3K4j10m7J86j75M6k39
$$ -3 -369 -222 166 -148 -69 56 42 208 95 381 242 163 -104 24 19 12 -25 18 42 -68 -115 71 -104 -58 -297
2802b97J93P7j2l67M26n83O15k40J39K1q1J41J2m2k13K75m1m2M3L56k30m3L7K5
$$ -297 -104 -27 -39 -406 20 -563 52 -188 -49 -28 -109 32 44 2 -211 64 23 -19 24 380 150 107 144 169
2826A69l96J63K2o0RQ5J08J57r9l05m2M3Q2J77k79j8K23l1N5k01J08j85J04L09
$$ 169 -227 -64 -42 -102 -93 -8 100 257 158 -147 -189 -146 -64 113 -166 -184 39 8 63 -138 -30 -215 -111 198
2850A98q7n5OJ88k27r8K19l90J69%j18J19N3J29j85R5j6L6j26K9j46j2M16L9k44
$$ 198 111 56 62 250 23 -75 144 -246 -77 -77 -195 -76 -23 106 -79 16 0 36 -90 -61 -207 -219 197 236 -8
2875hk31K20m8R0J53J39k14l07N12n17L90J3j92J71M2j93q1PK08l44J91l7q9J60
$$ -8 -239 -19 -67 23 176 315 101 -206 306 -211 179 192 0 171 213 20 -61 -54 154 -190 1 -36 -125 35
2899C5m6j20j96j20M18k7K04l21L59O1l51K65q0L4K72l12r9Q5J92m17K52O6l02
$$ 35 -11 -131 -327 -447 -29 -56 148 -173 186 247 -104 161 81 115 387 75 -24 61 253 -164 88 154 -148
2922a48K45r4j5j10P3j56J60N0J8j72j29J06Q6J65k55K55k70Q2J00Om31M13J45
$$ -148 97 3 -12 -122 -49 -205 -45 5 23 -149 -278 -172 -86 79 -176 79 -191 -109 -9 -3 -434 -21 124
2945A24j70R8J56j71j7J85j60l7Pj04K30k69j3L00p9o7j60J38k78J46K40j71J18
$$ 124 -46 52 208 37 20 205 45 8 15 -89 141 -128 -141 159 80 13 -147 -9 -287 -141 99 -72 46
2968D6k1j9J5j66R1K22o5m5oJ3J45k93K72P3j24l48j29M67K7l2l8M4M5k60J84
$$ 46 25 6 21 -145 -54 168 103 58 52 65 210 -83 189 262 138 -210 -339 128 155 123 85 129 174 -86 98
2993I8L4M8l89K61l5l9K71l34k30n8K77O7N7Ml0J45l17J87J08j8RnM6J30l61L82
$$ 98 132 180 -209 52 17 -22 249 -85 -315 -373 -96 -29 28 32 2 147 -170 17 125 107 116 111 157 287 -74 308
3019C08l15K75N1k97j62L6J38j33J40m7k60k54M63J1j19K35j60Q8mp6J94l1oj7
$$ 308 -7 268 319 22 -140 -104 34 -99 41 -6 -266 -520 -57 -46 -165 70 -90 -2 -6 -82 112 81 75 58
3043E8k32K73pL0j91J69j66L35m0l35P9j25Q1r3K09o8L0J32k10j19P4m6R1j05
$$ 58 -174 99 92 122 -69 100 -66 269 229 -106 -27 -152 -71 -164 45 -23 7 139 -71 -190 -116 -162 -71 -176
3067a76K21k28J24J25l10L32j45Q9k07L90Q4k58J50J12m5k98J42k50M36k64k5
$$ -176 45 -183 -59 66 -244 88 -57 32 -175 215 299 41 191 303 258 -40 102 -148 288 24 -1
3088aJ03j92J04R5l72M20l3j10p5j36J4j58L25P7o2l1N5J38k6n1%rm6K36l29R9
$$ -1 102 -90 14 109 -263 157 124 14 -61 -197 -183 -341 -16 61 -1 -32 23 161 135 84 84 75 29 265 -64 35
3114C5J80k31N4K47k36J37j38j9Q9k39K41l92K21m0pj2L9O1kO9J29n7j13l57M48
$$ 35 215 -16 38 285 49 186 48 29 118 -121 120 -272 -51 -91 -98 -110 -71 -10 -12 57 186 129 16 -341 107
3139A07j60j51L70kj60K75M5k15j23M8j95L25J10n14J48r6J61j01J06j7j40JR
$$ 107 -53 -204 166 164 4 279 324 109 -14 34 -161 164 274 -240 -92 -188 -27 -128 -22 -39 -179 -178 -169
3162a69K48o1K2k78L0K65M0j9l4J45k03K21l26M53l29K16J5k03kJ46l10j6J65
$$ -169 79 18 40 -238 -208 57 97 78 44 189 -14 207 -119 334 5 221 236 33 31 177 -133 -149 16
3185A6j61L33l17L5j51J61j99J71l3J16P2J20j82o6oJ7J15j25k4K69j55K87k39
$$ 16 -145 188 -129 -94 -245 -84 -283 -112 -145 -29 43 163 -19 -85 -91 -74 41 -84 -108 161 6 293 54
3208E4MJ3N3k84K42j39k4K53k48k2j6Ol23J30j52K50K44k57J26K5R1j93j33j2
$$ 54 58 71 124 -160 82 -57 -81 172 -76 -98 -114 -108 -431 -301 -453 -203 41 -216 -90 -65 26 -167 -300 -312
3232c12K28J07p2k6K77K3j73P3L0j29K13j34l5k7J07q9k34K84q3Q0j40j51L01
$$ -312 -84 23 -49 -75 202 225 52 125 155 26 239 105 70 43 150 61 -173 111 28 108 -32 -183 118
3255A18l33l4L41l16K23j56K09j14j29J15J41p7j23rj4N38l42J09r0J82rL8l23
$$ 118 -215 -249 92 -224 -1 -157 52 -62 -191 -76 65 -12 -135 -144 -158 380 38 147 57 239 230 268 -55
3278e5J70j44p9K06k42J91p0j17J77q6J76k05K06k30k36K97j59K0K7R5k5J38k7
$$ -55 115 -29 -108 98 -144 47 -23 -140 37 -49 127 -78 128 -102 -338 -41 -200 -180 -153 -58 -83 55 28
3301B8O2N6k67J99j70J72M4j08L78j73k91oJ65k76J40o9l5j41N1K52L5k32J48
$$ 28 90 146 -121 78 -92 80 124 16 394 221 -70 -76 89 -187 -47 -116 -151 -292 -241 11 46 -186 -38
3324c8k61k4P09o28J45L5o0K71Q1j50j79J84J19q3r6p9L14p1L4k72J93k77K72
$$ -38 -299 -323 386 -242 -97 -62 -122 149 230 80 -99 85 204 121 25 -54 260 189 223 -49 144 -133 139
3347A39j7p2k7m9j71J64K9J8j13l8rJ94j76j71N26j85mK02k16N0J40mj60O9q6
$$ 139 122 50 23 -26 -197 -33 -4 14 -99 -137 -146 48 -128 -299 227 42 38 240 24 74 214 210 50 119 33
3372C3J91k77J87q5k17L25nr5j02K24q7l7k60m0K97pJ67m46L70k01J30M1k05K85
$$ 33 224 -53 134 49 -168 157 152 57 -45 179 92 55 -205 -245 52 45 212 -234 136 -65 65 106 -99 186
3396A86J92k75k92M07l62N7R7J5j69J82K25l23K53J24m53R0J49l51L09j07L7p6
$$ 186 378 103 -189 218 -144 -87 10 25 -144 38 263 -60 193 317 -136 -46 103 -248 61 -46 -9 -85
3418h5rNj62L18l59K46L5P4l45K57rr7JK62k88M18j77J03m3r8J90Or7k64K27j01
$$ -85 -94 -89 -251 67 -292 -46 -11 63 -282 -25 -34 -131 -130 132 -156 262 85 188 145 47 237 243 146 -118 109 8
3444HP7lj36j38j20J35K31j89r1R9m2J27J3K75l79j32N41J0k08k65K28O4P4R3
$$ 8 85 82 -54 -192 -312 -177 54 -135 -226 -127 -169 -42 -29 246 -133 -265 276 286 78 -187 41 105 179 272
3468B72k68Q0k69K55P7J0Rl26K16j80J97r4j01K08j21O1j24j25J00j4J54l3j58
$$ 272 4 84 -185 70 147 157 166 -160 56 -124 73 -21 -122 86 -35 26 -98 -223 -123 -137 17 -16 -174
3491a74k18L68m1J84l2J20k98n7N25k31l99O64j00j00j50M0k98M12j42j13K26
$$ -174 -392 -24 -65 119 87 207 -91 -148 377 146 -253 411 311 211 61 101 -197 215 73 -40 186
3512A86k97P6k20Q1J10P9q0J7m4n9J86j60j29L48j73J66j30K85P0m05J37j72L31
$$ 186 -111 -35 -255 -174 -64 15 -65 -48 -92 -151 35 -125 -254 94 -79 87 -43 242 312 -93 44 -128 203
3535B03mn5k5m5J0j75Qj04K0j34K55q7j34J57j05n1K52j46K4L8j46R1J09J58k00
$$ 203 199 144 119 74 84 -91 -83 -187 -167 -301 -46 -133 -267 -110 -215 -266 -14 -160 -136 -98 -244 -153 -44 114 -86
3560h6K81O4j00j21p7J22J16j22k37L10l33R3R4M3n9P3j53j12N6M8J98l56L44
$$ -86 195 259 159 38 -39 83 199 77 -160 150 -183 -90 4 47 -12 61 -92 -204 -148 -100 98 -258 86
3583H6r7k50K44j71L53j45j65K67P6Lk14J1K74l15O7j88L20K2j61kK88l12k6J17
$$ 86 -11 -261 -17 -188 165 20 -145 122 198 201 -13 -2 272 -43 24 -164 156 178 17 15 303 -9 -35 82
3607H2q2J86m89K26o1kJ90l93N01j56j08K9J07o9j6L44K9m24R4l1K35m0n4j10
$$ 82 0 186 -303 -77 -138 -140 50 -343 158 2 -106 -77 30 -39 -55 289 318 -106 -12 -43 192 152 98 -12
3631a2o2J60o3R1J5J32l29P9j32K8p8M24n29K16l8k69K58k34J38L00k7k97J26
$$ -12 -74 86 23 114 129 261 -68 11 -121 -93 -171 253 -276 -60 -98 -367 -109 -343 -205 95 68 -229 -103
3654a03o5K07P7Q2q9j02l12M07nk06R1L9J06j64K90k25p0Q3Qj21J67j47L1l0N9
$$ -103 -168 39 116 198 109 7 -305 102 97 -109 -18 21 127 -37 253 28 -42 41 49 -72 95 -52 -21 -51 8
3679Hr7P3P2j94M1j22K86oj31K54k39R9J08o8J64Kk71L57m05J94o8L7J7K7k51
$$ 8 -89 -16 56 -138 -97 -219 67 61 -70 184 -55 44 152 84 248 250 -21 336 -69 125 57 94 111 138 -113
3704a13K4J37j09K52k75j14o9o9J53J21P5r9j24J6J00K11p1J8j09O0K28j82M7
$$ -113 -89 48 -61 191 -84 -198 -267 -336 -183 -62 13 -86 -210 -194 -94 117 46 64 -45 15 243 61 108
3727A08J5k49K40j5j02n6K66k47L6p2N4j53N5K00j97kl2k19L25rk05J69k48Q4
$$ 108 123 -126 114 99 -3 -59 207 -40 -4 -76 -22 -175 -120 80 -117 -119 -151 -370 -45 -54 -259 -90 -338 -254
3751b54P1K24l2J27j92o2J22J89J57o20J55J13J12q5l2l2P0M1j39J33j24J91k75
$$ -254 -183 41 9 136 -56 -118 4 193 350 -270 -115 -2 110 25 -7 -39 31 72 -67 66 -58 133 -142
3774a42L5J10j57J7R3j01P5j19K75J16l55M9J56L8K40k94P3n4J42L9k73L8K04
$$ -142 -107 3 -154 -137 -44 -145 -70 -189 86 202 -153 -104 52 90 330 36 109 55 197 236 -37 1 205
3797B05o9J39k15J5j02j83K3J28k07J2M8J37J58p2l95N63k03q4J23P5k10K13l15
$$ 205 136 275 60 75 -27 -210 -187 -59 -266 -254 -206 -69 89 17 -378 185 -18 -102 21 96 -114 99 -216
3820b16O18k43O5m20Q9J02J7K81o22L61k61L82j45j96J42J04L6k60K16j41K1J11
$$ -216 402 159 224 -196 -107 -5 12 293 -329 32 -229 153 8 -188 -46 58 94 -166 50 -91 -70 41
3842D1m05J22K55o5o6J11l6N7O7J82j49k45K02M5M9m5n5P1k66K39K2k61J98J21
$$ 41 -364 -242 13 -52 -118 -7 -43 14 81 263 114 -131 71 116 165 120 65 136 -130 109 131 -130 68 189
3866A89k58L25k08o1j66J93n1QN8R5j81k18L36k87L66K40m30J16l3L64m66J09
$$ 189 -69 256 48 -13 -179 14 -37 -29 29 124 -57 -275 61 -226 140 380 -50 66 33 397 -69 40
3888D0j31J89O1n9K10m11J37J13k48P7q1L8J65j82K93l93j47K31Lj19J94J30j83
$$ 40 -91 98 159 100 310 -101 36 149 -99 -22 -103 -65 100 -82 211 -182 -329 -98 -95 -214 -20 110 -73
3911g3j03J27K1N3P8J01l34j11M03j35L82m40n4J66j85J0R7R5k29J75k54L12J70
$$ -73 -176 -49 -28 25 103 204 -130 -241 162 27 409 -31 -85 81 -104 -94 3 98 -131 44 -210 102 272
3934B72l58J89l85L44n9N5j2J5k4j0k46R3R3M4q8M05m49K44K8M5p2n8j58J89J65
$$ 272 -86 103 -282 62 3 58 46 61 37 27 -219 -126 -33 11 -77 328 -121 123 151 196 124 66 -92 97 262
3959B62m13J04K44j71j13oK11k52J35q2j29r0j6J36J52p3J28j49L6n5OJ49J04
$$ 262 -151 -47 197 26 -87 -93 118 -134 1 -81 -210 -300 -316 -180 -28 -101 27 -122 -86 -141 -135 14 118
3982A18o5L5LO5J31O6j83NP2l75R2o2L61m22oK4QK90l57J57J23m9m9Q3N9k94J25
$$ 118 53 88 91 156 287 353 170 175 247 -128 -36 -98 263 -159 -165 -141 -133 157 -200 -43 80 31 -18 65 124 -170 -45
4009d5QK11m16K26K0Q7J52l80Q4n1K48p7J31r9j26J74M0k86O6l6K0j57k5M54m40
$$ -45 -37 174 -242 -16 4 91 243 -137 -53 -104 144 67 198 99 -27 147 187 -99 -33 -69 -49 -206 -231 223 -217
4034b17J74j40J10j70J54M16n29J82J41k4j30j8J96m4J16k20K06n5j92o3J39q3
$$ -217 -43 -183 -73 -243 -89 327 -202 -20 121 97 -33 -51 145 101 217 -3 203 148 -44 -107 32 -51
4056e1K33p2j68m8K13l25O5J00K00j40K8k73J35Lo2O3m1P3O7L7k5J80j00M4j28
$$ -51 182 110 -58 -106 107 -218 -153 -53 147 7 35 -238 -103 -100 -162 -99 -140 -67 0 37 12 192 92 136 8
4081HjJ6N5o5Lj20J11j93j2N4L30J27l31k66R8J12J9J0K16m31K21k17m4kK72J13
$$ 8 7 23 78 13 16 -104 7 -186 -198 -144 186 313 -18 -284 -186 -74 -55 -45 171 -260 -39 -256 -300 -302 -30 83
4107H3OK16j50J60l77j71L39J22j61j02J72o5oO9R4j40m7j3k10J38J65j33k21
$$ 83 89 305 155 315 -62 -233 106 228 67 -35 137 72 66 135 229 89 42 29 -181 -43 122 -11 -232
4130b32K46j87K53l15J46R7l5J78r9j00J22J34k71L4j77L46n9J7k30K1J44k9k4
$$ -232 14 -173 80 -235 -89 8 -27 151 52 -48 74 208 -63 -29 -206 140 81 98 -132 -111 33 4 -20
4153b0J21J51j10k49j75L15j90J39k04J90m6r2j11L16k62J40n0J00ll3NK43j9
$$ -20 101 252 142 -107 -282 33 -157 -18 -222 -32 -78 -170 -281 35 -227 -87 -137 -37 -40 -73 -68 175 156
4176A56k08K85k07j10J93J3j39K62j85J18Kk25J28J76j95m35M24lj02l24K85O6
$$ 156 -52 233 26 -84 109 122 -17 245 60 178 180 -45 83 259 64 -371 53 50 -52 -376 -91 -25
4198b5Lm4j56J24Q6n7J26k2n6j1J65j86R8K29k51J48J06k95J24k87K8K26q8O2
$$ -25 -22 -66 -222 -98 -12 -69 57 35 -21 -32 133 -53 45 274 23 171 277 -18 106 -181 -153 73 -15 47
4222D7k05K98p3l5j93J67K48o15K81J67p3r4J1qNJ05k09K91k6R4k15J81p7j43
$$ 47 -158 140 67 32 -161 6 254 -361 -80 87 14 -80 -69 -77 -72 33 -176 115 89 183 -32 149 72 -71
4246g1L27j19k69L24O0L7k83m8p9J13n4q8J73K10l77Jk02L61k11P2L25m83J6J95
$$ -71 256 137 -132 192 252 289 6 -42 -121 -8 -62 -150 23 233 -144 -143 -345 16 -195 -123 202 -281 -265 -70
4270g0L7K7J5J55J05j78Q1j26K47l44P1P8j2j07k1J78k95K78R0l28j68M31n07
$$ -70 -33 -6 9 164 269 91 172 46 293 -51 20 98 86 -21 -42 136 -159 119 209 -119 -287 144 -363
4293c63J50J48J59j64j69M2o5Q0J07N12o0l46K86j70k3l35J92p5K28J9k17K75
$$ -363 -213 -65 94 -70 -239 -197 -262 -182 -75 437 377 31 317 147 124 -211 -19 -94 134 153 -64 211
4315B11j41l5J41j58q3Q4J33l27l0N0l8m0P4K27M7N6j60J1j9p5K12J6L8r3j07
$$ 211 70 35 176 18 -65 19 152 -175 -205 -155 -193 -233 -159 68 115 171 11 22 3 -72 140 156 194 101 -6
4340fm6O3J39j40L4j22K8O2l8J28k02J50K2K2j69M6k34J86j05L18j28Oj23M1K1
$$ -6 -52 11 150 10 44 -78 -50 12 -26 102 -100 50 72 94 -75 -29 -263 -77 -182 136 8 14 -109 -68 -47
4365d7L8o3J70R8r4J07j43j98J95J36j15M6J04k11QNL6o5P1N1l29J86%K13j35
$$ -47 -9 -72 98 196 102 209 66 -132 63 199 84 130 234 23 31 36 72 7 78 129 -200 -14 -14 199 64
4390F4n7q3q7o6J64j73K15j7J47l69L68o4r8q1J53J48J01k28n8J73n0j0j45Kj81
$$ 64 7 -76 -163 -229 -65 -238 -23 -40 107 -262 106 42 -56 -137 16 164 265 37 -21 152 102 92 -53 -51 -232
4415b32L60j06N1n6j74J90j58J54L3j09k4R7J10m25K31K00k35J08L1k30K05K48
$$ -232 128 22 73 17 -157 33 -125 29 62 -47 -71 26 136 -289 -58 142 -93 15 46 -184 21 269
4437B69k30j2k7lq9K14k39J64j08P3k2P7P8q6J9R5r8j55J01P4j80m2L94l02k0
$$ 269 39 27 0 -3 -92 122 -117 47 -61 12 -10 67 145 59 78 173 75 -80 21 95 -85 -127 267 -35 -55
4462e5J92j93Q1o1Q2J32k86J28K8J81L9k71K52l88P3k44N23l32J13k10p4L39J2
$$ -55 137 -56 25 -36 46 178 -108 20 48 229 268 -3 249 -139 -66 -310 213 -119 -6 -216 -290 49 61
4485F1k02J14J27j04r0j42K13R8J2J50l70L25K7k12L95l91Q3O9l34J13O0Q3k42
$$ 61 -141 -27 100 -4 -94 -236 -23 75 87 237 -133 192 219 7 402 11 94 163 -171 -58 2 85 -157
4508a57M74k64q1J72j02j59m4K58j63j22K35j40K07m8K6m26L94j85r5J46J95m2
$$ -157 317 53 -28 144 42 -117 -161 97 -66 -188 47 -93 114 66 92 -334 60 -125 -220 -74 121 79
4530G9q5J07j61RM76n46p6P1J32m8J68J9L10l07j05j12P7j39l1K2J99p9O1K8k59
$$ 79 -6 101 -60 -51 425 -121 -197 -126 6 -42 126 145 455 148 43 -69 8 -131 -162 -140 59 -20 41 69 -190
4555a90K24R2k6j96J23R5J41J2j95o4PR6k03j13K84p5k36j2L76j71J25j46K25
$$ -190 34 126 100 -96 27 122 263 275 80 16 23 119 -84 -197 87 12 -224 -236 140 -31 94 -52 173
4578A73m48J0L39k31K6j67J91J63j40k0L2j88K55j62P1M8J71l1k20J48O7JR2j73
$$ 173 -275 -265 74 -157 -131 -298 -107 56 -84 -104 -72 -260 -5 -167 -96 -48 123 92 -128 20 87 88 180 7
4602GJ45R1k50J3M6M4l75N13j94j72J13j38J82P4l18K31J08k56J48l0J50J3J4
$$ 7 152 243 -7 6 52 96 -279 234 40 -132 -19 -157 25 99 -219 12 120 -136 12 -18 132 145 159
4625A59j00O2k22R2o5L76o13K05j00K6L37m52L58k7p3K57m2j39Q8k22K7R5k56
$$ 159 59 121 -101 -9 -74 302 -311 -106 -206 -180 157 -295 63 36 -37 220 178 39 127 -95 -68 27 -229
4648b29N2J0P3j10K66J3l49mN11k27J48k02J25j02k03L47L2k30J49K2k40J34J75
$$ -229 -177 -167 -94 -204 62 75 -274 -278 233 6 154 -48 77 -25 -228 119 151 -79 70 92 -148 -14 161
4671A61j19J73j87J29j12J11j62pj47J54j14Q3J02K2m9N1L0l18J45L6O6j58j6
$$ 161 42 215 28 157 45 156 -6 -13 -160 -6 -120 -37 65 87 38 89 119 -199 -54 -18 48 -110 -126
4694a26J70J32j96P0J36k76R7j41J0J00q6kJ8J71j46K66m42L35k48K32m02M50
$$ -126 44 176 -20 50 186 -90 7 -134 -124 -24 -110 -112 -94 77 -69 197 -245 90 -158 74 -328 122
4716A22j39O2j20J15J40k16J18l39P4K13R3J10j78j38J58m7K28l47J16o2n5J37
$$ 122 -17 45 -75 40 180 -36 82 -257 -183 30 123 233 55 -83 75 28 256 -91 25 -37 -92 45
4738D5Q1Qk16j10J46O5j53L58n90J91q7K63J41j75J88k28J61Q9JJ18k22j5k0J29
$$ 45 126 134 -82 -192 -46 19 -134 224 -366 -175 -262 1 142 -33 155 -73 88 177 178 296 74 59 39 168
4762A68o8j58%j8Rk9L16l9l36j13L92J8k95J34j38J62J5K4j50R7j8l54K76K63
$$ 168 100 -58 -58 -76 -67 -96 220 181 -155 -268 124 142 -153 -19 -157 5 20 44 -106 -9 -27 -381 -105 158
4786A58n4k64j0J03K43j36j45J18R2K32n19M8K12O3J77n22K90j64J22l29J76o6
$$ 158 104 -160 -170 -67 176 40 -105 13 105 337 -182 -134 78 141 318 -204 86 -78 44 -285 -109 -175
4808a75K51J7O9j86l1p8K7j53o1K98l75M93Q6k86K54l53K39j04O1J32l81P6L31
$$ -175 76 93 162 -24 -55 -133 -106 -259 -320 -22 -397 96 182 -104 150 -203 36 -68 -7 125 -256 -180 151
4831A51p7L3o9l40K75M0k71J85k76J85q0J93J3M1M2j07K01J3k75L26k21j14K80
$$ 151 74 107 38 -302 -27 13 -258 -73 -349 -164 -244 -51 -38 3 45 -62 139 152 -123 203 -18 -132 148
4854A48k10j47M64k42N1K16j21J29j02j46R7J33j97j49R4N0j17J07j54J72q1j11
$$ 148 -62 -209 255 13 64 280 159 288 186 40 137 270 73 -76 18 68 -49 58 -96 76 -5 -116
4876a16j66R6R4J27j60q8J88j71K6K43N4j02J41r7J79l49J30m2J41l42L64k70
$$ -116 -282 -186 -92 35 -125 -213 -25 -196 -170 73 127 25 166 69 248 -101 29 -13 128 -214 150 -120
4898a20L39k81L2j60l0J24L7J15Rmj69J92j45n9k54M83l13K05R4j54J27k09j1
$$ -120 219 -62 -30 -190 -220 -96 -59 56 65 61 -108 84 -61 -120 -374 109 -204 1 95 -59 68 -141 -152
4921a52K2J06l08N11k11k19J81n3L4K11k34K06k69J56ml11J35p1K75k33Q5J55
$$ -152 -130 -24 -332 179 -32 -251 -70 -123 -89 122 -112 94 -175 -19 -23 -334 -199 -270 5 -228 -143 12
4943A2L03l46L71l66Q8P8o0K7l4l33K89r8J24m43J30M20J58m32%O2J82J51k18
$$ 12 315 -31 340 -26 62 140 80 107 73 -260 29 -69 55 -388 -258 162 320 -112 -112 -50 132 283 65
4966F5k25Q8k1mj20K97N4m7J41m63M47l02J5k62M41j16K47m07L55j34M2j77K13
$$ 65 -160 -72 -93 -97 -217 80 134 87 228 -235 212 -90 -75 -337 104 -12 235 -172 183 49 91 -86 127
4989A27q4P2q1k22J80l5P9L42j79q4j79j00O4P7L8J68j00k80J14j8J84j86K0J11
$$ 127 43 115 34 -188 -8 -43 36 378 199 115 -64 -164 -100 -23 15 183 83 -197 -83 -101 83 -103 -83 28
5013B8m8k78L56j01K34j44N3J10j27P7k15j08K4J46K07k99O6l7j39mJjJ88J96
$$ 28 -20 -298 58 -43 191 47 100 210 83 160 -55 -163 -139 7 214 -85 -19 -56 -195 -199 -198 -199 -11 185
5037A85l38L18l32K21j0j65l5j09j2L94m6k9O4k2l3Q6L0j24J54k90O5J95k37J08
$$ 185 -153 165 -167 54 44 -121 -156 -265 -277 117 71 42 106 84 51 137 167 43 197 -93 -28 167 -70 38
5061C8j36L4J22M3r6r3R2J42k30jJ01q5k77L88j03J91N7jk75L03k53j91M07j12
$$ 38 -98 -64 58 101 5 -88 4 146 -84 -85 16 -69 -346 42 -61 130 187 186 -89 214 -39 -230 177 65
5085F5r5K30o9k97L58j70j56J90P4k19q5J70p3J09n2k32J42N5Q7k4p1P8N9k19
$$ 65 -30 200 131 -166 192 22 -134 56 130 -89 -174 -4 -77 32 -20 -252 -110 -55 32 8 -63 15 74 -145
5109a45J29k67L23n3K7N3M0P9j01k86K8L74k60K75n1n4k33N6J67p9n7j36J08q0
$$ -145 -16 -283 40 -13 14 67 107 186 85 -201 -173 201 -59 216 165 111 -122 -66 101 22 -35 -171 -63 -143
5133a43L4J29k62J57j06K30P6j72O4j6r3J99n6k55K23P9j03Q4J45l45J58Q0q3
$$ -143 -109 20 -242 -85 -191 39 115 -57 7 -9 -102 97 41 -214 9 88 -15 69 214 -131 27 107 24
5156B4R6O8l25K16K6q9o9J75j54m9j57J46M07n18L83l60J66j97L06r7r0M7R1L
$$ 24 120 188 -137 79 105 16 -53 122 -32 -81 -238 -92 315 -203 180 -180 -14 -211 95 -2 -92 -45 46 49
5180D9l45N23l57J76K76l87J83m3j09j1k3j29m9L52l40L02M0k14lr8J04L25l06
$$ 49 -296 227 -130 46 322 -65 118 75 -34 -45 -68 -197 -246 106 -234 68 108 -106 -109 -207 -103 222 -84
5203h4K10k53J20k74P5L45R2K0q4j38J15j63R5J30m5qk56K63K1k01k68L40M1o0
$$ -84 126 -127 -7 -281 -206 139 231 251 167 29 144 -19 76 206 161 153 -103 160 181 -20 -288 52 93 33
5227C3k22R2m2m3K01k77K77l59K68jL6Q1J77l17K37j10j27J69k77J81J22L8J46
$$ 33 -189 -97 -139 -182 19 -258 19 -340 -72 -73 -37 44 221 -96 141 31 -96 73 -204 -23 99 137 283
5250B83l44J30q1j0qK05j72j89J03O7l44j3M6N48l42j9J25K96l40o8L43l54L64
$$ 283 -61 69 -12 -22 -30 175 3 -186 -83 -16 -360 -373 -327 221 -121 -140 -15 281 -59 -127 216 -138 226
5273B26k21n8Q5l26J50J66m0K47r4LP0j98J5q8J65j72K88m1k16l4K6o4K63l70
$$ 226 5 -53 32 -294 -144 22 -18 229 135 138 208 10 25 -63 102 -70 218 177 -39 -73 -47 -111 152 -218
5297b18J99k54L82l59K72p2J18j49Ml1L50m00J96K58l67J35l3j19J54j32K8j64
$$ -218 -19 -273 109 -250 22 -50 68 -81 -77 -108 242 -158 38 296 -71 64 31 -88 66 -66 -38 -202
5319b02M2K05j93K50j88r9K12j79M56m92j36qJ69K26M8k5n5L30k79J2j23O6N6
$$ -202 -160 45 -148 102 -86 -185 27 -152 304 -188 -324 -332 -163 63 111 86 31 361 82 94 -29 37 93
5342I3k31K54j52j45L53j57k21K03O4J02j29P7r5j18M18l65l6J37j9RM8j14p8
$$ 93 -138 116 -36 -181 172 15 -206 -3 61 163 34 111 16 -102 316 -49 -85 52 33 42 90 -24 -102
5365a02K6K08k80M61m74K52J6q2q0L77l89O9k8M8R5L9k16N0J45Q2k75L2j18OK38
$$ -102 -76 132 -148 313 -161 91 107 25 -55 322 -67 2 -26 22 117 156 -60 -10 135 217 -58 -26 -144 -138 100
5390A00%r0k67K06k05R7J06q9L5j60L01M1o5j04J03Q8l3M2j32K04j10j65K52q3
$$ 100 100 10 -257 -51 -256 -159 -53 -142 -107 -267 34 75 10 -94 9 97 64 106 -26 178 68 -97 155 72
5414G2j2J2p5k05J79J46j1qq4K20k35j65J48j32J75K14k62J35k9j00j0Q9K6k74
$$ 72 60 72 -3 -208 -29 117 106 98 14 234 -1 -166 -18 -150 25 239 -23 112 83 -17 -27 62 88 -186
5438a86J80R2K5L08l07r6J42j96J90l2r7qj25J2l3J4J85k95M82m62K41j44J53
$$ -186 -6 86 111 419 112 16 158 -38 152 120 23 15 -110 -98 -131 -117 68 -227 255 -207 34 -110 43
5461D3k6j0J70k56J06k43N8J7L18l9k69P6J67j77K07j84J57j65J16k18K53o9K9
$$ 43 17 7 177 -79 27 -216 -158 -141 177 138 -131 -55 112 -65 142 -42 115 -50 66 -152 101 32 61
5484F1j30j24L10N3l2m48K58N4k65K61j51K16J08m08L36O7m9J51l49M0j72M24
$$ 61 -69 -193 117 170 138 -310 -52 2 -263 -2 -153 63 171 -237 99 166 117 268 -81 -41 -213 211
5506B11l00K04j1l55O3J87j40K81j16o5j13J37mkJ99m01J55k5P9O8o9J29l47J11
$$ 211 -89 115 104 -251 -188 -1 -141 140 24 -41 -154 -17 -21 -23 176 -225 -70 -95 -16 52 -17 112 -235 -124
5530a24J65k30L31l79K33Mj17J47R1Q0k24J34k82J10N3L6J58q2o1j54L50l11J97
$$ -124 41 -189 142 -237 -4 0 -117 30 121 201 -23 111 -171 -61 -8 28 186 104 43 -111 239 -72 125
5553A25k96K34Jk32J51K0J56j01Q6n7l77K37k08K93K7OQ5k19P9J17j29Q9k02J5
$$ 125 -171 63 64 -168 -17 3 159 58 144 87 -290 -53 -261 32 59 65 150 -69 10 127 -2 87 -115 -100
5577a00K86n33L03O7j87M36o1j89j08Q2J01J9j23j8J97j96Q5j67Q2P1j26R0j8
$$ -100 186 -347 -44 23 -164 272 211 22 -86 -4 97 116 -7 -25 172 -24 61 -106 -24 47 -79 11 -7
5600gM9l1j33L7L03l0k76J82r4k13J41K08k64K57l68K28p7K65j60Ql6j97J55J82
$$ -7 42 11 -122 -85 218 188 -88 94 0 -213 -72 136 -128 129 -239 -11 -88 177 17 25 -11 -208 -53 129
5624A29p0L20m35j2L52m83ML77m61K59j42J65J40k18nj22M79k23M5l38K86o5R4
$$ 129 59 379 -56 -68 284 -199 -195 182 -279 -20 -162 3 143 -75 -80 -202 277 54 99 -239 47 -18 76
5647G6Qm8O9m81M56p4o3K6j77J64J3rJ16nM3k37L48l11K58j24o6K79k90J17j82
$$ 76 84 36 105 -376 80 6 -57 -31 -208 -44 -31 -40 76 71 114 -123 225 -86 172 48 -18 261 -29 88 -94
5672i4j6J31O9k14J09p9j37L74lJ1R6q4j41k29L53j19P9j46ML8p5QJ26l00J86
$$ -94 -110 21 90 -124 -15 -94 -231 143 140 151 247 163 22 -207 146 27 106 -40 -36 2 -73 -65 61 -239 -53
5697e3k2L02k82L1k66N49Jk47n4J34o9J86k93JK9j29P6n0J30k33K77k6l4J08n9
$$ -53 -75 227 -55 -24 -290 259 260 13 -41 93 24 210 -83 -82 -53 -182 -106 -156 -26 -259 18 -8 -42 66 7
5722GQ2K07l26k60J64p1L46j38k0J05j36l4K23n7k42L06j97R5r3P1K16m58k0R4
$$ 7 89 296 -30 -290 -126 -197 149 11 -9 96 -40 -74 149 92 -150 156 -41 54 -39 32 248 -210 -230 -136
5746a36k6r0K61M2J24L0k97K38k70j34L23k2m3j82M36o4m3J66k13mk03K09J84
$$ -136 -162 -252 9 51 175 205 -92 146 -124 -258 65 43 0 -182 254 190 147 313 100 96 -107 102 286
5769B86l86L24j88P3k8j07j84J78J01r8j47RL28k78J83nj93n2K25J55k5j61l2
$$ 286 -100 224 36 109 81 -26 -210 -32 69 -29 -176 -167 161 -117 66 61 -132 -184 41 196 171 10 -22
5792b2J20J62l70L12k07J78Q1k07J12O1l32oK37p9M1n2Lj86J97j99O9J61L0k68
$$ -22 98 260 -110 202 -5 173 254 47 159 220 -112 -118 119 40 81 29 32 -154 43 -156 -87 74 104 -164
5816a64J31P8J32m46L77L3r5j17j82K77n1M2j92J12K21J2j32M9K33l21JN6N1k64
$$ -164 -33 45 177 -269 108 141 46 -71 -253 24 -27 15 -177 -65 156 168 36 85 318 -3 -2 54 105 -159
5840a59J99p7P6j07J95k52J44K5j14J54L0q6J6J06j64q6K13m1j93j4L21J35k96
$$ -159 40 -37 39 -68 127 -125 19 44 -70 84 114 28 44 150 -14 -100 113 72 -121 -135 186 321 25
5863B5j01J21P9K0M6j85j97K71K80n74M8L23k49L30l93K17j86R1j55L02J5q4P0
$$ 25 -76 45 124 144 190 5 -192 79 359 -215 -167 156 -93 237 -156 61 -125 -34 -189 113 128 44 114
5886A14j9j37K28k46K52k7j09P4j37J76o4l45J81n5L89jn25L31R7j7j31J9k09
$$ 114 95 -42 186 -60 192 165 56 130 -7 169 105 -240 -59 -114 275 274 -251 80 177 160 29 48 -161
5909a61J57k19K89m3m4K5Q5n2P0j82j59J60O7K10k19p2J19l4p7j0J42k15N2Q8
$$ -161 -4 -223 66 23 -21 4 89 37 107 -75 -234 -74 -7 203 -16 -88 31 -3 -80 -90 52 -163 -111 -23
5933b3J23k23L10l16j73J95j65L96k01q3J65L2l16K19L2j03J13J98l05J63K28
$$ -23 100 -123 187 -129 -302 -107 -272 124 -77 -160 5 37 -279 -60 -28 -131 -18 180 -125 38 266
5954B66k99K3J43l16K25j45J27n1K11K58n89Q0K15l53K21J20j4l05L08k67N8o9
$$ 266 -33 -10 133 -183 42 -103 24 -27 184 442 -147 -67 148 -205 16 136 122 -183 125 -142 -84 -153
5976a53m3R9M4J0k32K98J05k43M3J55j26p6J16J12R3j03j11q7KJ38M05m04R7m4
$$ -153 -196 -97 -53 -43 -275 23 128 -115 -72 83 -43 -119 -3 109 202 99 -12 -99 -97 41 446 42 139 95
6000I5Rl5l8K69lj89l1j27j17L8J18J43p3k61L8l7M51j83l67K67j61M35j76l1
$$ 95 104 69 31 300 297 108 77 -50 -167 -129 -11 132 59 -202 -164 -201 250 67 -300 -33 -194 241 65 34
6024C4Q0j25q9o8L10j57J1r0J33Rj25n4K51p2q4P7j18n6L48m14K72k26J84l5R8
$$ 34 114 -11 -100 -168 142 -15 -4 -94 39 48 -77 -131 120 48 -36 41 -77 -133 215 -199 73 -153 31 -4 94
6049I4P7k57J77l47N16j72j53K85l24K93k80J97K05k88J42J9n3j45j91J82K40
$$ 94 171 -86 91 -256 260 88 -65 220 -104 189 -91 106 311 23 165 184 131 -14 -205 -23 217
6070B17l04J05l7Pj48q2J46n0J11J69k23L02k40j0P2n4O2k96M71M3p9K1j86l06
$$ 217 -87 18 -19 -12 -160 -242 -96 -146 -35 134 -89 213 -27 -37 35 -19 43 -253 218 261 182 203 17 -289
6094b89K28Q0j5j73K74L8k6k40J80Nk3k50L54j78L2p0K75r6r7L3q2J08R1o1r4
$$ -289 -61 19 4 -169 105 143 117 -123 57 62 39 -211 143 -35 -3 -73 202 106 9 42 -40 68 159 98 4
6119DM6K28j08M9k22K4j41k9R3N1P7l3m0j00n1J77P2Q9m80Q5M1n3L70k2k81P3
$$ 4 50 278 170 219 -3 21 -120 -149 -56 -5 72 39 -1 -101 -152 25 97 186 -294 -209 -168 -221 149 127 -154 -81
6145h1K63j95K17j84n0p3J99J59j53j54L0r1RJ00l6J24j49P3j34j43L48j97K61
$$ -81 182 -13 204 20 -30 -103 96 255 102 -52 -22 -113 -104 -4 -40 84 -65 8 -126 -269 79 -118 143
6168A43J26j52j94K19j22k25M92o78N39j69l4p2L6J42j32j94M01M0ml12L49j43
$$ 143 269 117 -77 142 20 -205 287 -391 148 -21 -55 -127 -91 51 -81 -275 126 166 162 -150 199 56
6190E6J62l29J32J26k38m1J73N4k45L27k49L7r9J86j31O0k81L14j03K9M3J2q2
$$ 56 218 -111 21 147 -91 -132 41 95 -150 177 -72 -35 -134 52 -79 -19 -300 14 -89 -60 -17 -5 -87
6213h7OL28p3n91L77O9J79k98N9J04N4j17m9mK8P4j19J46o1k8j04J89k42J61k49
$$ -87 -81 247 174 -417 -40 29 208 -90 -31 73 127 10 -39 -43 -15 59 -60 86 25 -3 -107 82 -160 1 -248
6238b48J67j94K18N9O9K15l40jK49p5P0k58J36J09k88J00k26J37J86j99K53l74
$$ -248 -81 -275 -57 2 71 286 -54 -55 194 119 189 -69 67 176 -112 -12 -238 -101 85 -114 139 -235
6260b35L22j63O6j57L18p0L6k27L8m9O8j13J08K00j76l5K60m2l28M08k11L9k22
$$ -235 87 -76 -10 -167 151 81 117 -110 -72 -121 -53 -166 -58 142 -34 -69 191 149 -179 229 18 57 -165
6283a65K88J52k54k12K68j60K09o1K66k77Kp5l4J21l00P8J28N5M4j84q4K98k40
$$ -165 123 275 21 -191 77 -83 126 65 331 54 56 -19 -53 68 -232 -154 -26 29 73 -111 -195 103 -137
6306a37R8J60j89K04j70J27k3j00J03j64J11N5k7J15k18L4K49j46k3j9j46P2k50
$$ -137 -39 121 -68 136 -34 93 70 -30 73 -91 20 75 48 163 -55 -21 228 82 59 40 -106 -34 -284
6329b84M35k21nJ70m7j46n8J20j16k7J66J58k98M9j15J41J82R6k07J25k48K65
$$ -284 151 -70 -75 95 48 -98 -156 -36 -152 -179 -13 145 -153 -104 -219 -78 104 200 -7 118 -130 135
6351A35j92J38l09J34k0R8n7j05J91j51J73k44K40J4N2j78J28k45M8O9K28k45
$$ 135 -57 81 -228 -94 -114 -16 -73 -178 13 -138 35 -209 31 45 97 -81 47 -198 -150 -81 147 -98
6373i8J58j16N0P7j09p3J33j27J40j19J72j65M0rK27l55l6lJ90O1k9j78J55o8
$$ -98 60 -56 -6 71 -38 -111 22 -105 35 -84 88 -77 -37 -46 181 -174 -210 -213 -23 38 9 -169 -14 -82
6397h2r1J39K52j19k7n0O1k57QP1j35J60l9K50O6j91P5Pn2j13mJ17j79K21J07
$$ -82 -173 -34 218 99 72 22 83 -174 -166 -95 -230 -70 -109 141 207 16 91 98 46 -67 -71 46 -133 88 195
6422A95j13J26q8jn5j01K29k00M5j18j22K96j4p5J58k93K45L19l90n2q7lL08l49
$$ 195 82 208 120 119 64 -37 192 -8 37 -81 -203 93 79 4 162 -131 114 433 43 -9 -96 -99 209 -140
6446a40K25k82N63m34q6R3m1K7M0mJ9k6l1J75l33M10k09l1L4J01n6j84QJ29K3
$$ -140 85 -197 366 -68 -154 -61 -102 -75 -35 -39 -20 -46 -77 98 -235 175 -34 -65 -31 70 14 -170 -162 -33 -10
6471a0M6N8k91K8P8K0Q2P4Kj84J96k22MJ58R0o1L2k81L08j95o7J65J48j64j01
$$ -10 36 94 -197 -169 -91 -71 11 85 87 -97 99 -123 -119 39 129 68 100 -181 127 -68 -135 30 178 14 -87
6496h7j43M1K09M7m5k46j1J71m0K06j20j86M24j70K8mL6j32L6J01p9J39n0O0l71
$$ -87 -230 -189 20 67 22 -224 -235 -64 -104 102 -18 -204 220 50 78 74 110 -22 14 115 36 175 125 185 -186
6521a86K68j46K53l2k17kp2pR1J54q2r3M2J8j01J29oJ9K5q1O9k2P8K23k06m2N5
$$ -186 82 -64 189 157 -60 -62 -134 -141 -50 104 22 -71 -29 -11 -112 17 11 30 55 -26 43 21 99 322 116 74 129
6548A29l20J34J9n7L15m50M87j33j73j55M34l85J63j16j2q8M47k42pk4K85m9m41
$$ 129 -191 -57 -38 -95 220 -230 257 124 -49 -204 230 -155 8 -108 -120 -208 239 -3 -10 -34 251 202 -239
6571b39L62j55J10l25L56P4l8r2j06L61k99J3O1l01J73J35l03K30L01l25L7r4
$$ -239 123 -32 78 -247 109 183 145 53 -53 308 9 22 83 -218 -45 90 -213 17 318 -7 30 -64
6593f4J27K04k64J01l1k09L50j35m1j73L60l28J82l4k26R5k5q4J46k7J98j59p4
$$ -64 63 267 3 104 73 -136 214 79 38 -135 225 -103 79 45 -181 -86 -111 -195 -49 -76 122 -37 -111
6616a11J56L0n0J44m50L95l80J26N2k24L82Q4n8l17NJ23k1P5k2O6L0P9p1m6j22
$$ -111 45 75 25 169 -281 114 -266 -140 -88 -312 70 154 96 -221 -216 -93 -114 -39 -61 5 35 114 43 -3 -125
6641a25M30j74j04m0l94L93j01J61p6m5J30J98k04J91k38m0p3R9j04K61j57l5
$$ -125 305 131 27 -13 -407 -14 -115 46 -30 -75 55 253 49 240 2 -38 -111 -12 -116 145 -12 -47
6663d7k46K72l07M41m0O0k76J48O5j7K20k46o4J10K9o9j23mJ20L1n4o9N0P4L5
$$ -47 -293 -21 -328 113 73 133 -143 5 70 53 273 27 -37 73 102 33 -90 -94 26 57 3 -66 -16 58 93
6688I3k17L13j83J56j26K79m89J19j06p9K27j53J99j14K34K31m88j58L65o5K8
$$ 93 -124 189 6 162 36 315 -174 -55 -161 -240 -13 -166 33 -81 153 384 -104 -262 103 38 66
6709F6Q0K1J5l4m5k04jJ19j10n0k7L62k07o9J18j99R4M8j9k9jP3j64K49L6k21
$$ 66 146 167 182 148 103 -101 -102 17 -93 -143 -170 192 -15 -84 34 -165 -71 -23 -42 -71 -72 1 -163 86 122 -99
6735i9Q6p0k51L23j1O7qJ1n8J8l9j04J04Kj0K8r2J65Q9k38J99j45O7J9K00rk93
$$ -99 -13 -83 -334 -11 -22 45 37 48 -10 8 -31 -135 -31 -29 -39 -11 -103 62 151 -87 112 -33 34 53 253 244 -49
6762d9n8J88j87J2J55j92O7K36k65Q4j0J2%R8k42K63oj61q7J57k76L08j14K51
$$ -49 -107 81 -106 -94 61 -131 -64 172 -93 -9 -19 -7 -7 91 -151 112 106 -55 -142 15 -261 47 -67 184
6786A84l6k11N6q0j3j39K66J28j93J26k4m1L9K16m03j54L61K2j63l1O2N0k07J59
$$ 184 148 -63 -7 -87 -100 -239 27 155 -38 88 64 23 62 278 -125 -279 82 104 -59 -90 -28 22 -185 -26
6810b6K13k43P9j12j98L15o2j77K32n2J04l55R2K51L6j92J73l4o4j9J23j58J78
$$ -26 187 -56 23 -89 -287 28 -34 -211 21 -31 73 -282 -190 61 97 -95 78 44 -20 -39 84 -74 104
6833A04k44M4k2or3M28k23P5j74M50l01k87Q4Q3k18N61m04K18n6j69K89o52N98
$$ 104 -140 -96 -118 -124 -217 211 -12 63 -111 339 38 -249 -165 -82 -300 261 -143 75 19 -150 139 -513 85
6856H5m05L54j7J64k9l09M9o1M3O3R9l8J51K9k87K10Q2k30J72j74Mj91K32P5r6
$$ 85 -320 34 17 181 152 -157 -108 -169 -126 -63 36 -2 149 178 -109 101 183 -47 125 -49 -45 -236 -4 71 -25
6881b5k4j5N9J79Q7k13Q3k77K55j44j64J78M6J54j65k56KO93l73M2j9K76l07j25
$$ -25 -49 -64 -5 174 261 48 131 -146 109 -35 -199 -21 25 179 14 -242 -240 453 80 122 103 379 72 -53
6905e3K85j29j58j10J70%J67k63Q1OJ53m14J99N8j17J5M07l59R6J18k22J00m0
$$ -53 232 103 -55 -165 5 5 172 -91 -10 -4 149 -265 -66 -8 -125 -110 297 -62 34 152 -70 30 -10
6928a0J56j44j7J90j88M9l5J34l88L96m1Kl9j94p1K05p0J90P0k87K35k54L44k44
$$ -10 146 2 -15 175 -13 36 1 135 -253 143 102 104 65 -129 -200 5 -65 125 195 -92 143 -111 233 -11
6952a1j8R3N5K5l71L66k36M48m83P1Q9j96J77j24j22N73m62L10k18K54j99r9L57
$$ -11 -29 64 119 144 -227 139 -97 351 -132 -61 28 -168 9 -115 -237 336 -126 184 -34 220 21 -78 279
6975B79p21M94k86K29J48O6k26j32r9J02J58k86J25Q9l2j9L77k94J06j99M63m23
$$ 279 -442 52 -234 -5 143 209 -17 -149 -248 -146 12 -274 -149 -60 -92 -111 266 -28 78 -121 342 -81
6997h1J59j33j08qK07n1p9Q4K5J80k42J43j61j03J85J30j98R5L4K2k60K39q8M5
$$ -81 78 -55 -163 -171 36 -15 -94 -10 15 195 -47 96 -65 -168 17 147 -51 44 78 100 -160 79 -9 36
7021C6j09J65j72K6m5O3J30j74R0K17k27o1K27Jj91K6K2L0j5j49J28O9K74m34
$$ 36 -73 92 -80 -54 -99 -36 94 -80 10 227 0 -61 166 167 -24 2 24 54 39 -110 18 87 361 -73
7045g3n5P3j48L24q6r8K26k07J1J26J0k0Mj75J52kJ19j21J23m02L33J35l26J52
$$ -73 -128 -55 -203 121 35 -63 163 -44 -33 93 103 83 87 -88 64 62 181 60 183 -219 114 249 -77 75
7069G5P0j42N6o7j37j42J12OL10l71K70l0k60J01K87Rl07K66k61M61o7k75O9k55
$$ 75 145 3 59 -8 -145 -287 -175 -169 141 -230 40 10 -250 -149 138 147 -160 106 -155 306 239 -36 33 -222
7093b22L29M4j92J83J3M8q5K2k82J21k3j66L5K54oj58n7L40k41J98j12l0q2Ml8
$$ -222 107 151 -41 142 155 203 118 140 -142 -21 -44 -210 -175 79 73 -85 -142 198 -43 155 43 13 -69 -65 -103
7118a03P6P0J66j12K6l43K41R7p4M7KK52k98J03j70Kq9O0r8J30jP9k87J57j00
$$ -103 -27 43 209 97 123 -220 21 118 44 91 93 345 47 150 -20 -18 -107 -47 -145 -15 -16 63 -224 -67 -167
7143a67J21j20K07k22j9L98k95K53j41l8k36K62N9ll3J31k73K43j74L15m53K67
$$ -167 -46 -166 41 -181 -200 198 -97 156 15 -23 -259 3 62 59 26 157 -116 127 -47 268 -185 82
7165H2r8J24k96K48q9j54j6J16O0N6l1R3L02m94K28j10K3p6M1J44m4l5n45M83
$$ 82 -16 108 -188 60 -29 -183 -199 -83 -23 33 2 95 397 -97 131 21 44 -32 9 153 109 74 -471 12
7189A2LK85k60j4K5j5lj28k1O2J69l14Q8QK18k48J06j10J54J5m8Q9L4j26L30j96
$$ 12 15 300 40 26 51 36 33 -95 -116 -54 115 -199 -111 -103 115 -133 -27 -137 17 32 -16 73 107 -19 311 115
7215A15r6k05L72j75K62l82lj15J89L25p3j84j77K50r6P5p3j5pj64K24J8j20J23
$$ 115 19 -186 186 11 273 -109 -112 -227 -38 287 214 30 -147 103 7 82 9 -6 -13 -177 47 65 -55 68
7239F8QMm3M4K8j3m7J23k17J63p9kk10J43L9J86qn00K20M9J11m0j68N6K71k03
$$ 68 76 80 37 81 109 96 49 172 -45 118 39 37 -173 -30 9 195 187 -313 -93 -44 67 27 -141 -85 186 -17
7265a7k6J83j25p9K48j7l45M40j08O8r2k76J02j76J05J76j05k6mK60j17j97K18
$$ -17 -43 140 15 -64 184 167 -178 262 154 222 130 -146 -44 -220 -115 61 -44 -70 -74 186 69 -128 90
7288I0j50J53J7O3k63r3Q1j81N07k34K20k89R7R7j95K13j21n6J02l68J46L56j18
$$ 90 -60 93 110 173 -90 -183 -102 -283 224 -10 210 -79 18 115 -80 133 12 -44 58 -310 -164 192 74
7311G4Nm5j95J17K64j56j24OR9MO4l78N68m02J79K0lj14k4Nq0R5n8J65q8j84J85
$$ 74 79 34 -161 -44 220 64 -60 -54 45 49 113 -265 303 -99 80 100 97 -17 -41 -36 -116 -21 -79 86 -2 -186 -1
7338aR6K5j26N0j29J26K6l66K99k57K65n4J9K6l1J34j33m4K47k81K82l18J47J72
$$ -1 95 120 -6 44 -85 41 67 -299 0 -257 8 -46 -27 -1 -32 102 -31 -75 172 -109 173 -145 2 174
7362A74l77J2J51K49n05K51L11m57J31L61k39N0l04Q4J04L2j34J43k06L81j36
$$ 174 -203 -191 -40 209 -296 -45 266 -191 -60 301 62 112 -192 -108 -4 28 -106 37 -169 212 76
7383G6o8O1k94L00l5j4O6Q5r8r1j37K37J75l28J82k99Q0k6J67k27K08j07m9j27
$$ 76 8 69 -225 75 40 26 92 177 79 -12 -149 88 263 -65 117 -182 -102 -128 39 -188 20 -87 -136 -263
7407b63L88n1k20R0l2k3J1k67L29K14k65R6j66k29J41M43j64j88N4K14r7p0J08
$$ -263 125 74 -146 -56 -88 -111 -100 -367 -38 176 -89 7 -159 -388 -247 196 32 -156 -102 112 15 -55 53
7430E3L8k51P1k5J55K5o4K71k46r4O5r8J84j10j84K04Q4J25j67RJ56l98L32K9
$$ 53 91 -160 -89 -114 41 66 2 273 27 -67 -2 -100 84 -26 -210 -6 78 203 36 45 201 -197 135 164
7454A64o4j89j54J68RK34m05J75j7P3K61n73J41M07l54M00j80j67J23o6j72J98
$$ 164 100 -89 -243 -75 -66 168 -237 -62 -79 -6 255 -318 -177 230 -124 276 96 -71 52 -14 -186 12
7476A2Lk2J47k07J03l2Q3k18J25N2k6j12P3K8p1pj63J42OM0M21o86J00J29k30
$$ 12 15 -7 140 -67 36 4 87 -131 -6 46 20 -92 -19 9 -62 -69 -232 -90 -84 -44 377 -309 -209 -80 -310
7501c10L85m04P0J60K41j68L3J52j95J87j63m0n4O0J4k52J76J56O0k21K96j95
$$ -310 75 -329 -259 -99 142 -26 7 159 -36 151 -12 -52 -106 -46 -32 -284 -108 48 108 -113 183 -12
7523a2%R2n4j13L3O7K3J0J1O7l10J73J62J24l87J19j78J71j45J23K97l70J37j30
$$ -12 -12 80 26 -87 -54 13 36 46 57 124 -186 -13 149 273 -114 5 -173 -2 -147 -24 273 -97 40 -90
7547i0l3K04k03J88k2Q8k75J91k48L26k33J36o7J5j83K91l03Q0L8k03L83j20J46
$$ -90 -123 81 -122 66 44 132 -143 48 -200 126 -107 29 -38 -23 -206 85 -218 -138 -100 -303 80 -40 106
7570A06j24p0K8K6J18J23k95L9k6OJ50J09m13l8L09j07J18p9j49K31j48m4K55
$$ 106 -18 -88 -60 -34 84 207 -88 -49 -75 -69 81 190 -223 -261 48 -59 59 -20 -169 62 -86 -130 125
7593A25l4k46p7J68M0O8J5L8m4k8j28J03k55J97J00L4k77R3K29j30j65M36l29
$$ 125 91 -155 -232 -64 -24 44 59 97 53 25 -103 0 -255 -58 42 76 -201 -108 121 -9 -174 262 -67
7616f7L4R0j28K66k27n7J72j3k70J36K10j99k49K14K30k61K21j62N7J38j63k3
$$ -67 -33 57 -71 195 -32 -89 83 70 -200 -64 146 -53 -302 -88 142 -119 102 -60 -3 135 -28 -51
7638e1J39m8J2N2j16K27k18J27k17j46L48l04K95J02n06M08j0O8mk19o4J44j92
$$ -51 88 40 52 104 -12 215 -3 124 -93 -239 109 -195 100 202 -304 104 94 162 158 -61 -125 19 -173
7661a73J44q9J87r5L1Q9j10L5j67l4L05k81J94J33jr4J09k37j9J04j17M1J85M
$$ -173 -29 -118 69 -26 5 94 -16 19 -148 -182 123 -158 36 169 168 74 183 -54 -73 31 -86 -45 140 144
7685A44m7j3j76r9P3J15j02J16O2j27j52K86j04J9m7L4K16k24R1k9N3JJ02j45
$$ 144 97 84 -92 -191 -118 -3 -105 11 73 -54 -206 80 -24 -5 -52 -18 198 -26 65 36 89 90 192 47
7709D7J03k79k69N03l98R4K84j38j43K85k0r6K29m33p9M46p6j53J23K47j23j47
$$ 47 150 -129 -398 105 -293 -199 85 -53 -196 89 69 -27 202 -231 -310 136 60 -93 30 277 154 7
7731Gl0K05k43K2j66K81l54L50m17M52j72j34J59m7l5K73j49J07j69R7Q1J5k04
$$ 7 -23 182 -61 -39 -205 76 -278 72 -345 107 -65 -199 -40 -87 -122 151 2 109 -60 37 118 133 -71
7754g1O8j11N9k7n8J77j08K06l17M4K54m3k73O9J20L3p0O8J37k12N5K81k5Mk41
$$ -71 -3 -114 -55 -82 -140 37 -71 135 -182 -138 116 73 -200 -131 -11 22 -48 20 157 -55 0 281 256 260 19
7779A9J50r9j57J11p6L68l76n2p8P8J32o6J29k65J58o2j5mm1P4r4L14l6o8p4M3
$$ 19 169 70 -87 24 -52 316 -60 -112 -190 -112 20 -46 83 -182 -24 -86 -101 -105 -146 -72 -166 148 112 44 -30 13
7805A3j39r7J8K37j51M9m9M8J33n6jO6r0j65K82k27j46L61k23p3J29n7N3J96j62
$$ 13 -126 -223 -205 32 -119 -70 -119 -71 62 6 5 71 -19 -184 98 -129 -275 86 -137 -210 -81 -138 -85 111 -51
7830e1J65n8K9J77l44J54r3n8M36n25j5M6K51j33K6K33k83P8k29K81j56K28j01
$$ -51 114 56 85 262 -82 72 -21 -79 357 -168 -183 -137 114 -19 7 240 -43 35 -194 87 -69 159 58
7853E8l05L09j16k27M3J01J58K93l03K33m14J71j25j60N40k62N2J3J69j27j03
$$ 58 -247 62 -54 -281 -238 -137 21 314 11 244 -170 1 -124 -284 256 -6 46 59 228 101 -2
7874bkJ14j66L5K9m2L34j72j26J26j70J42Q8k75Q4j5M3p2K49K6l95L75n87M27
$$ -2 -4 110 -56 -21 8 -34 300 128 2 128 -42 100 188 -87 -3 -18 25 -47 202 228 -167 208 -379 48
7898D8j38J15M22m71N2j96K7m4K39Q5j81R9J36l3l20J44q8K38l12J72J56k54j54
$$ 48 -90 25 447 -24 28 -168 -141 -185 54 139 -42 57 193 160 -160 -16 -104 134 -178 -6 150 -104 -258
7921b58K92J04j40J08k87J52J47j22J0J4k88J75l8j38L89k17L57j19k97L66k84
$$ -258 34 138 -2 106 -181 -29 118 -4 6 20 -268 -93 -131 -269 120 -97 260 141 -156 210 -74
7942g4J96j88J12n7M6j28O8j42J3L3J88P9k01K39j75j85J22l4K79k35j83J70J83
$$ -74 122 -66 46 -11 35 -93 -25 -167 -154 -121 67 146 -55 184 9 -176 -54 -88 191 -44 -227 -57 126
7965A26K6L0j55k16K31j53K29j10J38l1l2j08q3j3K3K85Mk01j33K98K47m83J66
$$ 126 152 182 27 -189 42 -111 118 8 146 115 83 -25 -108 -121 -98 187 191 -10 -143 155 402 -81 85
7988H5j59k6L72k90K65m05J55k3O7J06j76k62K44j55L04q1j0r8q9k1K76J9K3K05
$$ 85 -74 -100 272 -18 247 -158 -3 -26 41 147 -29 -291 -47 -202 102 21 11 -87 -176 -197 79 98 121 326
8012C26m84J99j45o1O9j03J04K56l74J55m3j35M04P0l18Q5L8J0j64J50O6j44k36
$$ 326 -158 41 -104 -165 -96 -199 -95 161 -213 -58 -101 -236 168 238 -80 5 43 53 -111 39 105 -39 -275
8035b75K33O9P6j49L9j45K06j76J62M3j07m3J88J85l15Q0j63R7Lj7J63l74K75
$$ -275 -42 27 103 -46 -7 -152 54 -122 40 83 -24 -67 121 306 -9 71 -92 5 8 -9 154 -220 55
8058E5K13n35L86k07m3J43J44k72j78L36K1j49q6L11j7k40K96j73N8j80j69M80
$$ 55 268 -267 119 -88 -131 12 156 -116 -294 42 63 -86 -172 139 122 -118 178 5 63 -117 -286 194
8080A94l5q0K1j32j14L83j57J09k61j24K07j50Q2K23k36r2K82j41K8R1j71p0K25
$$ 194 159 79 100 -32 -146 237 80 189 -72 -196 11 -139 -57 166 -70 -162 120 -21 7 98 -73 -143 82
8103H2j27l73K62J32K76j71k1k33K98l0m72L63l5J80l10L45p3N7j69nP5o0J33
$$ 82 -45 -418 -156 -24 252 81 60 -173 125 95 -377 -14 -49 131 -179 166 93 150 -19 -24 51 -9 124
8126A24j74K81j47%O2k84r3J81j62J4N40r7m58K51l8L5j44L15n4k76k11M25l23
$$ 124 -50 231 84 84 146 -138 -231 -50 -212 -198 342 245 -213 38 0 35 -109 206 152 -124 -335 90 -233
8149b33L1J16K25q5j58N2j9K13r9Q5k17R7J90j13L53o53K95j84J19Q5L3l16J58
$$ -233 -202 -86 139 54 -104 -52 -71 142 43 128 -89 8 198 85 438 -215 80 -104 15 100 133 -183 -25
8172b5J47l09J54O6j42N4NrL4Q5J26l36J93OJ71k85P4J11l01
$$ -25 122 -187 -33 33 -109 -55 -50 -59 -25 60 186 -150 43 49 220 -65 9 120 -181
8191a81
$$ Imaginary data points
##PAGE= N=2
##DATA TABLE= (X++(I..I)), XYDATA
0@%%%%%%%%%%%%%%%%%qJ6j6J6j6J6k4L2l2L9m7N0n8O7p5Q7r8J09j23J37j53J72
$$ 0 0 0 0 0 0 0 0 0 0 0 0 0 0 0 0 0 0 -8 8 -8 8 -8 8 -16 16 -16 23 -24 26 -32 35 -40 47 -51 58 -65 72 -81 91
39I1j92K14k36K61k92L24l57L91m30M75n23N76o35P01p73Q54r48J053j176J320
$$ 91 -101 113 -123 138 -154 170 -187 204 -226 249 -274 302 -333 368 -405 449 -499 554 -622 698
59F98j488J693j948K271k697L290m168N599q304J5084n9952r6393K09581O6895
$$ 698 -790 903 -1045 1226 -1471 1819 -2349 3250 -5054 10030 -49922 -146315 63266 130161
73A30161j98139m8662J97773K3442j81646n448J71611j6512j54892L3890J39984
$$ 130161 -67978 -116640 81133 104575 -77071 -82519 89092 72580 -82312 -48422 91562
84I1562n6284j21917P2467J03249r2270q5546J04449O8282j18369n4015J27179
$$ 91562 35278 -86639 -14172 89077 -3193 -88739 15710 83992 -34377 -88392 38787
95C8787M1538j36858k9273J43729J8956j47717p049J49955j014j46237J1354J42175
$$ 38787 80325 -56533 -85806 57923 76879 -70838 -77887 72068 71054 -75183 -63829 78346
107G8346j7780j33615K6260J24624l3072j12619M0726R8005m9507q2176N6120
$$ 78346 60566 -73049 -46789 77835 44763 -67856 -27130 70875 21368 -60808 -4688
118d688O2751o3000m5370O5374K6827o9729j2223P1057k141p2742J2914P3815
$$ -4688 58063 -4937 -50307 15067 41894 -27835 -40058 30999 28858 -43884 -30970 42845
130D2845k1718p3562K9019P3654l2714p0301L5505O9230l3824o5175L3320O2583
$$ 42845 21127 -52435 -23416 50238 17524 -52777 -17272 51958 18134 -47041 -13721 48862
142D8862l0320n8053K8101N3176k5519m7855K2398M0349k1047l4737J8394K6736
$$ 48862 18542 -39511 -11410 41766 16247 -31608 -9210 31139 10092 -24645 -6251 20485
154B0485j8967k1149J8938J2830k1346n609K3284k195k5311R637K7789j4333k9017
$$ 20485 1518 -19631 -693 12137 -9209 -14818 8466 6271 -19040 -9403 18386 4053 -24964
167b4964J9301L2294k0842l3476K3093L6862k2613l7936K2651L9424k1487m0077
$$ -24964 -5663 26631 5789 -27687 -4594 32268 9655 -28281 -5630 33794 12307 -27770
179b7770J9558L9765j8604l9858J6236L7122j6600l5775J6077L0810j8266k5617
$$ -27770 -8212 31553 12949 -26909 -10673 26449 9849 -25926 -9849 20961 2695 -22922
191b2922J9216J9206k0755j2828K3525N877k5344K053K9370q967l1251J7855L3789
$$ -22922 -3706 15500 -5255 -18083 5442 11319 -14025 -11972 17398 8431 -22820 -4965 28824
204B8824k3721l4392L1111L5039l6018l3903L9194L2272m1660l0672M1446K7164
$$ 28824 5103 -29289 1822 36861 843 -33060 6134 38406 -3254 -33926 7520 34684
216C4684m2284k4305M0149J9161l9071j5287L5898R744l3802l973L0808j502k8373
$$ 34684 -7600 -31905 8244 27405 -11666 -26953 8945 18689 -15113 -19086 11722 10220 -18153
229a8153Q876K6361j4043k3684K1538K2578k7139j9562L4059J7691l8758j4982
$$ -18153 -9277 17084 3041 -20643 895 23473 -3666 -23228 10831 28522 -10236 -25218
241b5218M3203J2611m6800r967M8036O409m9688l340M7835j344m6954M863M2562
$$ -25218 17985 30596 -16204 -26171 21865 28274 -21414 -24754 23081 21737 -25217 -20354 22208
254B2208r427l8068J2943L1915j6776k4980J9736J8950k1923j1340K4438O453
$$ 22208 12781 -25287 -12344 19571 2795 -22185 -2449 16501 -5422 -16762 7676 14129
266A4129k5297K34K6930m422k6641Q722K7604j1544k7788J3780K6598j5057k6722
$$ 14129 -11168 -10934 15996 11574 -15067 -6345 21259 9715 -18073 -4293 22305 7248 -19474
279a9474J5465K4392j6417k3052J4651K0729j5239j8351J3649J5151j3284j1990
$$ -19474 -4009 20383 3966 -19086 -4435 16294 1055 -17296 -3647 11504 -1780 -13770
291a3770J2819Q595j1740m328J1297J312r629L451R800o554p892J0084P358j2511
$$ -13770 -951 7644 -4096 -8424 2873 4185 -5444 -1993 7807 1253 -6639 3445 10803 -1708
305a708n328J4041M045j5012l266J4349J511j3676j626J1523q8r764m06O362L51
$$ -1708 -7036 7005 11050 -3962 -7228 7121 8632 -5044 -6670 4853 4765 -4999 -5405 957 1308
320A308m567m29J632R70O24j195k034J829M565j130n248J834O713o82o139O47
$$ 1308 -3259 -3688 -2056 -1086 -462 -1657 -3691 -1862 2703 1573 -3675 -1841 4872 4190 -1949 -1302
336a302O668m1o217q08N695R55n209k246M258J590m437k013K722J236l217m75
$$ -1302 5366 5325 -892 -1700 3995 4950 -259 -2505 1753 3343 -1094 -3107 -385 851 -2366 -2841
352b841J906r23j064K293N0l274J295M950j930n487M097O802m330o232N394P039
$$ -2841 -935 -1858 -2922 -629 -579 -3853 -2558 2392 462 -5025 -928 5874 1544 -4688 706 7745
368G745n372o392N722N340n220n050M389L559l826l166K220J458j893j301k1Q8
$$ 7745 2373 -4019 1703 7043 1823 -3227 1162 4721 895 -2271 -51 1407 -486 -1787 -1808 -1720
384a720Q23l5j717j78K346n8k138J003J808m96k99J349m4n56J944J073k902n63
$$ -1720 -897 -932 -2649 -2827 -481 -539 -2677 -1674 134 -362 -661 688 644 88 2032 3105 203 -360
402c60M045O30n197L5N289p08o233L35N845j576o193Q27M960r46m772K74M134
$$ -360 3685 4315 -882 -847 4442 3734 -2499 -2164 3681 2105 -4088 -3261 1699 753 -4019 -3745 389
419C89M8m103J97L718N70k936j08L654O4k527M94L457p64k824K174K761k847l073
$$ 389 437 -3666 -3469 249 819 -2117 -2225 1429 1493 -1034 -540 2917 2153 -671 1503 4264 1417 -1656
437a656M142K054n314k009N957M85p540k17P549j334q049K069P148l230o708L968
$$ -1656 2486 4540 -774 -2783 3174 3659 -3881 -4098 3451 2117 -5932 -3863 3285 55 -6653 -2685
453b685N948m154m324M788L659l867k540N075J251l836l94M267j34l278P93K754
$$ -2685 3263 -891 -5215 -427 3232 -635 -3175 1900 3151 -685 -1079 3188 3054 -224 569 3323
469C323j111l186J526K422k482k467J872K192k553k849K051K416k987k619L208
$$ 3323 2212 -974 552 2974 492 -1975 -103 2089 -464 -3313 -1262 1154 -1833 -4452 -1244
484a244K429k878k185L810J946l633o13L992N17l661J349L383j672k195K869J394
$$ -1244 1185 -1693 -3878 -68 1878 -1755 -2368 1624 2141 -1520 -171 3212 1540 -655 2214 3608
500C608l203q72L496m23l732R97K911k274l309K385K127l338j917L013Q03k928
$$ 3608 405 -467 3029 2606 -1126 -129 2782 508 -2801 -416 1711 -1627 -3544 -531 272 -2656
516b656l53L172m83k206R39K331q84j272J512J254j144j49J416K53j156K29R41
$$ -2656 -3009 163 -320 -2526 -1587 744 -140 -1412 100 1354 210 61 1477 1730 574 803 1744
533A744K34j235l84J138J22j568o72J191R8k213r80K298J43k470k39K792m95k579
$$ 1744 1978 743 359 1497 1619 51 -621 570 668 -1545 -2525 -227 -84 -2554 -2793 -1 -496 -3075
551c075J438K828j791j823K481J930k405p83L207O21k804J90L161j383k430K081
$$ -3075 -1637 1191 -600 -2423 58 1988 -417 -1200 2007 2628 -176 14 3175 1792 -638 1443
567A443J565k331j873K278L64k382m36K137j036j662L19J000n70j120J235k6l50
$$ 1443 3008 677 -1196 1082 1446 -936 -1372 765 -271 -1933 -1614 -614 -1184 -2304 -1069 -1095 -1445
584a445L97O84j94K7O13J76M32L37k6l76P67J62n52J0Q64n75j038R12m39j064
$$ -1445 -1048 -364 -558 -531 82 258 690 1027 1001 625 1392 1554 1002 1012 1876 1301 263 1175 736 -328
604c28j78P35m34j089L7J127r46q68Q58P22j711j53K395m60j364J073J580j302
$$ -328 -506 229 -205 -1294 -1257 -130 -1076 -1944 -1086 -364 -2075 -2228 167 -293 -1657 -584 996 -306
622c06l38J947N52j804M68J768l94j506M84J462j468j015Q06P25j573r74J223
$$ -306 -644 1303 1855 51 519 2287 1893 387 871 2333 865 -150 656 1381 -192 -1166 57
639E7k57j598N86Q38q85n10N62P6J40j02J44K19L10N45m58L86J019l62m31Q35
$$ 57 -200 -1798 -1212 -374 -1259 -1769 -1207 -1131 -991 -1093 -949 -730 -420 125 -333 53 1072 710 279 1114
659A114P55r52l75J203J56j847M98J097r03j758P02J089j473j075J305P8j405
$$ 1114 1869 917 542 1745 1901 54 552 1649 746 -1012 -310 779 -694 -1769 -464 -386 -1791
676a791k69J478j88j081N16J480r09k77P00P62n43K61R07m15L53K10j79K8K74
$$ -1791 -2060 -582 -770 -1851 -1335 145 -764 -1041 -341 421 -122 139 1046 631 984 1194 1015 1043 1317
695A317J80r27m2Q04r09q14M62L43j499mO78J96j607L71J233n88j282J585P30
$$ 1317 1497 570 528 1332 423 -391 71 414 -1085 -1089 -411 -215 -1822 -1451 -218 -806 -2088 -503 227
714B27j434j51J475O23j024L19J247j04j020J093L18m61o33O99K1m91j18j15l23
$$ 227 -1207 -1358 117 740 -284 35 1282 1178 158 1251 1569 1108 475 1174 1195 704 586 471 148
733A48o0k50o94J59N32r86n06R21L46j158j81J472N0j172M82J871j100r26J721
$$ 148 88 -162 -856 -697 -165 -1151 -1657 -736 -390 -1548 -1729 -257 -207 -1379 -897 974 -126 -1052 669
752F69J058j482m52J858J02j582M08J336r57j106P19J089j467q90R27M39j649
$$ 669 1727 245 -207 1651 1753 171 579 1915 958 -148 571 1660 193 -697 230 669 -980
769i80j40O67Jj254J06Q95j02n01J23O66K38L2l41N86O28r8l32P70L70o20l45
$$ -980 -1120 -453 -452 -1706 -1600 -705 -807 -1308 -1185 -519 -281 -249 -590 -4 624 526 194 964 1334 714 369
790C69J130K06j326KJ273n02j944R29R65j351j253J054Q48k043m60J592P2j420
$$ 369 1499 1705 379 381 1654 1152 -792 137 1102 -249 -1502 -448 400 -1643 -2103 -511 -439 -1859
808a859L74J519l08j276R90J360q76m96J103O22r32J84P30Rk95k51M01L2k38m57
$$ -1859 -1485 34 -274 -1550 -560 800 -76 -572 531 1153 221 405 1135 1144 849 598 999 1031 793 336
828C36j32L88n66n17K66J28p58o56R38L15q99j14N54N13j025J46J539l28r34O84
$$ 336 204 592 26 -491 -225 -97 -855 -1511 -573 -258 -1157 -1271 -717 -204 -1229 -1083 456 128 -806 -122
848a22J281p20n51J407M85j505l79J594j07j064j50J061n72j083M23L28o87o21
$$ -122 1159 439 -112 1295 1780 275 -104 1490 1383 319 169 1230 658 -425 -2 326 -361 -982
866i82M07J96o86j4N7K5j50L81k69M90L54j03p1P00mj16K01M98m2o70O62N75p30
$$ -982 -575 -379 -1065 -1079 -1022 -997 -1147 -766 -1035 -545 -191 -294 -365 335 331 215 416 914 872 202 864 1439 709
889G09q13J327R8j190k93O64m61j219P80P72j051n82O53L35j048p4O20L08n04
$$ 709 -104 1223 1321 131 -162 502 41 -1178 -398 374 -677 -1259 -606 -271 -1319 -1393 -773 -465 -969
908i69O04K98k15k2N53K20l12O82K2k51j43N86k04l06M61l30l22k67M97o07n26
$$ -969 -365 -67 -282 -304 249 469 157 839 861 610 467 1053 849 543 1004 674 352 85 582 -25 -551
929e51L64L5o90k00Q25j98j021M88N60m00m84R96N24o08O5O77jl49M20L93k96
$$ -551 -187 -152 -842 -1042 -217 -415 -1436 -948 -388 -788 -1272 -276 248 -360 -295 382 381 32 452 845 549
950E49QN39K38r02o1L88l44m15O68l68m58mK0j94m69J84K4n75J37L66j37m94R73
$$ 549 557 1096 1334 432 371 759 415 0 668 300 -158 -162 -142 -336 -805 -621 -597 -1172 -1035 -669 -806 -1300 -327
973c27J52l47K61Q39j18k64K44P43o15l42O82K66r91M07M03k65p38M58M0o86m48
$$ -327 -175 -522 -261 578 460 196 440 1183 568 226 908 1174 183 590 993 728 -10 448 488 -198 -646
994f46M87k29m20J39K51m31j66N95o21J40K81K03j73O23K61K3m18N49M03n61L18
$$ -646 -159 -388 -808 -669 -418 -849 -1015 -420 -1041 -901 -620 -417 -590 33 294 317 -101 448 851 290 608
1015F08N41j61o10M62J29q09k6K14m2n62P8j56j51k43l0L45l07l67M31J34k81
$$ 608 1149 988 378 840 969 160 134 348 306 -256 -178 -334 -485 -728 -758 -413 -720 -1087 -656 -522 -803
1036h03J53M39q8N7J73J78l8K40K49k22L62K33k63j70K96K27o03l94O71o9q69
$$ -803 -650 -211 -299 -242 -69 109 71 311 560 338 700 933 670 500 796 1023 420 26 697 628 -241
1057b41k3J49m00k83O37M6r56l5R85j75o43N0Q42j56m32Q17K13j48k58P41O6m69
$$ -241 -264 -115 -515 -798 -161 -115 -1071 -1106 -121 -296 -939 -889 -47 -203 -635 182 395 247 -11 730 796 327
1079C27J84J23j4K49n1j76k87K78m36J73l78p3k09k92O13n78m64M05K81l24k88
$$ 327 511 634 620 869 818 642 355 633 197 370 -8 -81 -290 -582 31 -547 -1011 -606 -325 -649 -937
1100i37O21M31q81L02P39J04m91J14J020m09m88K37J002q74o7N34l3p23j9M98
$$ -937 -316 115 -766 -464 275 379 -112 2 1022 613 125 362 1364 490 423 957 924 201 182 680
1120F80l21q06K55m5k06l16J50M38n11n7J22q4RkL76O8J39M06n55N25L00l29J71
$$ 680 359 -447 -192 -237 -443 -759 -609 -171 -682 -739 -617 -701 -692 -694 -318 -250 -111 295 -260 265 565 236 407
1143D07L86K19r65M96N77l53q18M03O09j109j21K62L87j122r6Q33m09o37K93K76
$$ 407 793 1012 47 543 1120 767 -51 352 961 -148 -269 -7 380 -742 -838 -5 -414 -1051 -758 -482
1163d82k02k76N14K76k36P3N26k25lM98J32O1l47J47J02O7ml71Q3L27l62n17L31
$$ -482 -684 -960 -446 -170 -406 -333 193 -32 -35 463 595 656 309 456 558 625 621 250 333 660 298 -219 112
1186A12r4m50j22K38L8n30R0L47j59m08m1O25j25j64N89o2l21N55N36j81q8k47
$$ 112 18 -432 -554 -316 -278 -808 -718 -371 -530 -938 -979 -354 -479 -643 -54 -116 -437 118 654 473 385 138
1208A38P08k43j90L62j5l46j19J47l1m31J75n77K49k53J38j99k19L93n26K0M74
$$ 138 846 603 413 775 760 414 295 442 411 -20 155 -422 -173 -426 -288 -487 -706 -313 -839 -819 -345
1229c45Rj00j39N28J2l13K87N84l75j40O13Q2m68q1P34J27q29n4N26n85l58O73
$$ -345 -336 -436 -575 -47 -35 -348 -61 523 148 8 621 703 235 154 888 1015 186 132 658 73 -285 388
1251C88N1r82j75O85l51l48j02M70m65K7M87j44l1K57K49Q9j81J82K63j68K88
$$ 388 439 -543 -718 -33 -384 -732 -834 -364 -829 -802 -315 -459 -490 -233 16 105 -76 106 369 201 489
1272D89Q0Oq7J32M4k53J68J0n89j9K44r0o10K22K92k49o34JO39o24j97O22K75
$$ 489 569 575 488 620 664 411 579 589 0 -19 225 135 -475 -253 39 -210 -844 -843 -204 -828 -1025 -403 -128
1295a28o54K66P55l23l59M38M79j57O0L54j86j25L1J10K88l12r3j31j61k69Q4
$$ -128 -782 -516 239 -84 -443 -5 474 317 377 731 545 420 451 561 849 537 444 313 152 -117 -33
1316c3l41K95r0m41M7K63J1m19R8M17l14k29M22L84m23J30L40J13j73j21Q49m05
$$ -33 -374 -79 -169 -610 -563 -300 -289 -708 -610 -193 -507 -736 -314 70 -353 -223 117 230 57 -64 785 380
1338C80P5Q5J89m40m2M05n6l29j8m8k32k03j56j06j13P9J23j9k62K32j40j12O17
$$ 380 455 540 729 289 247 652 596 267 249 201 -31 -234 -390 -496 -609 -530 -407 -426 -688 -456 -596 -708 -91
1361i1jj15m7L33J36l24N57K06l81K32q0J66pl93L00q1m99M03n9j92m63L69q1
$$ -91 -92 -207 -254 79 215 -109 448 654 273 505 425 591 584 191 491 410 -89 314 255 63 -400 -31 -112
1384a12l54J3J8j32j03N08K3n43K07LL14J00m0M52l49L32J02o7M6K86L16n38l19
$$ -112 -466 -453 -435 -567 -670 -162 -139 -682 -475 -472 -158 -58 -98 354 5 337 439 372 418 704 1020 482 163
1407A63N12m05k61P0rr1j34r6J16l52J8pJ23k83L67k47L4J08J65J22j37K60K08
$$ 163 675 270 9 79 70 -21 -155 -251 -135 -487 -469 -476 -353 -636 -269 -516 -482 -374 -209 -87 -224 36 244
1430B44j22L82J31k65j52O15l19k32k8K72Q1o57J14L98m59n05Q0L04m73k12M67
$$ 244 122 504 635 370 218 833 514 282 254 526 607 -50 64 462 3 -502 -422 -118 -591 -803 -336
1451c36l2j0m8K06l46J36R9M60k57P5K18k29K46K62j07j65L38m5l62K51K1q7p0
$$ -336 -368 -378 -426 -220 -566 -430 -331 129 -128 -53 165 -64 182 444 337 172 510 465 103 354 375 288 218
1474B18R3R8k71l20M1j66o3j59K10j63n0q5M39m24J30M64k94p4K66P25n86K01
$$ 218 311 409 138 -182 -141 -307 -370 -529 -319 -482 -532 -617 -178 -602 -472 -8 -302 -376 -110 615 29 230
1496B30J70K11l8k34J01nk76L58kl37J76l78K65l04j15O0k06M7J7k41K25p4j74
$$ 230 400 611 573 339 440 435 159 517 515 178 354 -24 241 -63 -178 -118 -324 -277 -260 -501 -276 -350 -524
1519e24r3OM83J55k02L31k0m1p1L77J42l73R4M22j34n65L81L24k92n14K04L34
$$ -524 -617 -611 -128 27 -175 156 136 95 24 401 543 170 264 686 552 -13 368 692 400 -114 90 424
1541D24n87Q2L7j60j41K55m53p5J92p2L4k4K90Ok0J21K9K71j24N37j18j97k76
$$ 424 -163 -81 -44 -204 -345 -90 -543 -618 -426 -498 -464 -488 -198 -192 -212 -91 -62 209 85 622 504 307 31
1564C1O18k27j03K87j27k65j87M81k13r1m26J25k19o0P4%j69o2L96l62L17l92
$$ 31 649 422 319 606 479 214 27 508 295 204 -222 -97 -316 -376 -302 -302 -471 -533 -137 -499 -182 -574
1586e74N22j76N0J81P7l07L49L35k28K01j61K95l07r5J31k0J14R6j10l08J17j83
$$ -574 -52 -228 -178 3 80 -227 122 457 229 430 269 564 257 162 293 273 387 483 373 65 182 -1
1608aj48j91Q9n6o2j53K9j83K58K09K51m18j77P70l25J63j45L93J09k34K67k56
$$ -1 -149 -340 -251 -307 -369 -522 -493 -676 -418 -209 42 -376 -553 217 -108 55 -90 303 412 178 445 189
1630A89K78k17K1J18K0j82j92m1k02L79l05n8J21k66Q7J3J7k41L6j08M55j55j3
$$ 189 467 250 271 389 409 227 35 -6 -208 171 -134 -192 -71 -337 -250 -237 -220 -461 -425 -533 -78 -233 -246
1653b46J18M1q8N75q4k04J74K86k66M5K28q7k39j18K51k10q1j7l0q6j03r1J7m33
$$ -246 -128 -87 -175 400 316 112 286 572 306 351 579 492 253 135 386 176 95 78 48 -38 -141 -232 -215 -648
1677f48O0Q7O8N4O9PL27k96K83k5J4K64k70J38Q7L3O7L9K95j67l64J50K19m29
$$ -648 -588 -501 -433 -379 -310 -303 24 -272 11 -14 0 264 -6 132 219 252 319 358 653 486 122 272 491 62
1701F2J17k11K57j12k75j0K0m44J91Q0J24k98K94J57k66K81o8j10J31K91o4M2
$$ 62 179 -32 225 113 -162 -172 -152 -596 -405 -325 -201 -499 -205 -48 -314 -33 -101 -211 -80 211 147 189
1723A89p3J91j69K18K28k57j82J31J98j72n25Q3N0J71l56J06j10k18J90J29j5
$$ 189 116 307 138 356 584 327 145 276 474 302 -223 -140 -90 81 -275 -169 -279 -497 -307 -178 -193
1744a93m44N57l62J16J05pK14R3j1J29p5J8L23k70J2K3J54k43p4O8J67k13j31
$$ -193 -637 -80 -442 -326 -221 -228 -14 79 68 197 122 140 463 193 205 228 382 139 65 133 300 87 -44
1767d4J96j59r1j65K05l25N2K6J45l14J17P9j65J71k0J37j48L68K11J1NN9k27
$$ -44 152 -7 -98 -263 -58 -383 -331 -305 -160 -474 -357 -278 -443 -272 -292 -155 -303 65 276 287 292 351 124
1790A24J95j82J97K4l01L09j73K11m66L01l52K7j04L24r1l82K06k55K43l04K94
$$ 124 319 137 334 358 57 366 193 404 -62 239 -113 -86 -190 134 43 -339 -133 -388 -145 -449 -155
1811a55Q5k49K98k9J7N4K34j34j24J66J22j24J41N35m96j29n7M7k35K62j07j21
$$ -155 -70 -319 -21 -50 -33 21 255 121 -3 163 285 161 302 837 341 212 155 202 -33 229 122 1
1833Aj40J09J55j54m47N00j6rj66j45j48k7N84j88n5N3K42m8N9j2J12j8j41M03
$$ 1 -139 -30 125 -29 -476 24 8 -1 -167 -312 -460 -487 97 -91 -146 -93 149 101 160 148 260 242 101 504
1857E04j80k4l87K42L16m68mJ84k84O8l09k3P4J21j76r3K22O8l12N1M68m64K38
$$ 504 324 300 -87 155 471 3 -1 183 -101 -33 -342 -365 -291 -170 -346 -439 -217 -149 -461 -410 58 -406 -168
1880a68K96L09o19K86J91P2j88j38K52o3k6k7J28j46q9K03l40K49l69P4j84j90
$$ -168 128 437 -182 104 295 367 179 41 293 230 204 177 305 159 70 273 -67 182 -187 -113 -297 -487
1902d87J93K14k22Q8L8L2KJ46j56j08L71k50L24k94L72L0k24K52j40J44k72N3
$$ -487 -294 -80 -302 -214 -176 -144 -142 4 -152 -260 111 -139 185 -109 263 293 69 321 181 325 53 106
1924A06J51l5j03N1J14m37J26K3k83R0k3j5j93l2O2J99l1M9L21l27J62M0M50k19
$$ 106 257 222 119 170 284 -153 -27 -4 -287 -197 -220 -235 -428 -460 -398 -199 -230 -181 140 -187 -25 15 465 246
1948B46K6k00r1J94K1J2p7J96j12N3p7j65J03l06N7M5j31k4M4L61l25j32J5K80
$$ 246 272 72 -19 175 196 208 131 327 215 268 191 26 129 -177 -120 -75 -206 -230 -186 175 -150 -282 -267 13
1972A3m31M63k57j01J95J53M2q7K86j02J00l37J55J87o9K03j31j01Lr2L02k93
$$ 13 -418 45 -212 -313 -118 35 77 -10 276 174 274 -63 92 279 210 413 282 181 184 92 394 101
1994A01j75M84m86r4J94q2l9l64K41K01j11q3m6O9o1Q1M0K11J1M6l8m6jK68l05
$$ 101 -74 410 -76 -170 24 -58 -97 -461 -220 -19 -130 -213 -259 -190 -251 -170 -130 81 92 138 100 54 53 321 16
2019A6J14K06j40j87k38K85j42J09j03M0k66J60N7k38J00m3J81p1L24m97L04l05
$$ 16 130 336 196 9 -229 56 -86 23 -80 -40 -306 -146 -89 -327 -227 -270 -89 -160 164 -333 -29 -334
2041c34L22qr6K36o1L81n06O30l57p4m9L74k36j65M4N5k00r0K27m17L21m6k50
$$ -334 -12 -20 -116 120 59 440 -66 564 207 133 84 458 222 57 101 156 -44 -134 93 -324 -3 -49 -299
2064b99k94J61L01j96J73qJ55j36l25O52j82N7L37j92k15L69q6j40K12J62m77
$$ -299 -593 -432 -131 -327 -154 -162 -7 -143 -468 184 2 59 396 204 -11 358 272 132 344 506 29
2085B9K56j49q0O2j66P0j94J33k01J23J59j90q1M5oj98LL79l1p0J88r4k39o8N75
$$ 29 285 136 56 118 -48 22 -172 -39 -240 -117 42 -148 -229 -184 -190 -388 -385 -6 -37 -107 81 -13 -252 -320 255
2110B55k92p2K74J00l0j92K81j00J17j93k7j42J80k97J94l74L19j57j49J21l56
$$ 255 -37 -109 165 265 235 43 324 224 341 148 121 -21 159 -138 56 -318 1 -156 -305 -184 -540
2131e40L47j32K72k62O2J12N0J21J1k43Q9J22J17j2L68n02L45k53j50O16l44K49
$$ -540 -193 -325 -53 -315 -253 -141 -91 30 41 -202 -113 9 126 114 482 -20 325 72 -78 538 194 443
2153D43k39k33p0K8j41K59k86J15j79M9J9q0J56k2j22K50Pr6pJ77lJ70j92k17
$$ 443 204 -29 -99 -71 -212 47 -239 -124 -303 -254 -235 -315 -159 -181 -303 -53 -46 -142 -149 28 25 195 3 -214
2177b14M29j44O4L57l21k61K11J16j13k99J69j02p9l5J20j75J16j79J22K11k3
$$ -214 215 71 135 492 171 -90 121 237 124 -175 -6 -108 -187 -222 -102 -277 -161 -340 -218 -7 -30
2198c0k36O2l1K68K0J02l78K71J19j86L05Oq5j15j9m4j52K4J26J69J31m3j31k11
$$ -30 -266 -204 -235 33 53 155 -223 48 167 -19 286 292 207 92 73 29 -123 -99 27 196 327 284 153 -58
2222e8j19n7M1K1J26Q6K0k99J48J00j73J44O2l50K71J84k14M3pJ35n8J95j09K74
$$ -58 -177 -234 -193 -172 -46 40 60 -239 -91 9 -164 -20 42 -308 -37 147 -67 -24 -31 104 46 241 132 406
2246D06l18j48K72j31M3k02qo0K48n4r8k56N2N1l8M1K36j18L19m28j60J9J48J3
$$ 406 88 -60 212 81 124 -78 -86 -146 102 48 -50 -306 -254 -203 -241 -200 36 -82 237 -191 -351 -332 -184 -171
2270a71K69K58l47J55K4k27r3L96N8k16j7K60k00j03l4J5kJ50k07k66K56r5o8
$$ -171 98 356 9 164 188 -39 -132 264 322 106 89 349 149 46 12 27 25 175 -32 -298 -42 -137 -205
2293b05K73j19oj45o5J17R9Kj05J72R6j01o6J42N7p2O1j95L1J18m0r4K53m36J32
$$ -205 68 -51 -57 -202 -267 -150 -51 -49 -154 18 114 13 -53 89 146 74 135 -60 -29 89 49 -45 208 -228 -96
2318i6M0j5o8j56L7oL14l81K42k30J82j84K17k1J30j28J11l0J04k42K79K21j30
$$ -96 -56 -71 -139 -295 -258 -264 50 -331 -89 -319 -137 -321 -104 -125 5 -123 -12 -42 62 -180 99 320 190
2341A90m5mrk1K2j6J58j9n9k05J34k74K06k77J09j57Ln3L56j98J0K49j45j26K78
$$ 190 145 141 132 111 133 117 275 256 197 -8 126 -148 58 -219 -110 -267 -264 -317 39 -159 -149 100 -45 -171 107
2366A07j67J00MQ4l1q5K61m19K12n7R6j25L14m99N09k44K3j11k23K41k41m4K18
$$ 107 -60 40 44 128 97 12 273 -146 66 9 105 -20 294 -205 304 60 83 -28 -251 -10 -251 -295 -77
2389g7m5m1J57o7R4k27K4j60L30J63l74K90K7K24j77J86k54K90j96j31Q4l00K57
$$ -77 -122 -163 -6 -73 21 -206 -182 -342 -12 151 -223 67 94 318 141 327 73 363 167 36 120 -180 77
2412G7J99k55l73L42k0j27R0j90Q0O1j9O7m1l22J24J80k04J85J55k61J68J59j8
$$ 77 276 21 -352 -10 -30 -157 -67 -257 -177 -116 -135 -68 -109 -431 -307 -127 -331 -146 9 -252 -84 75 57
2435E7Q2n4J21j70r2K37J94l79N7P0J47l29K73j88J32k01K9j70q5J51k92K02m1
$$ 57 139 85 206 36 -56 181 375 -4 53 123 270 -59 214 26 158 -43 -14 -184 -269 -118 -410 -208 -249
2458b49J22J14l6j78N6k0J85K64r3l32o7L74m7n1K43k21N3R3j19R4m32K54k92
$$ -249 -127 -13 -49 -227 -171 -191 -6 258 165 -167 -234 140 93 42 285 64 117 210 91 185 -247 7 -285
2481b85K58J11k97R1J99m65k0o6M15J7k06J86Q3k1k2j27L94j19j21N5j55K74j19
$$ -285 -27 84 -213 -122 77 -388 -408 -474 -59 -42 -248 -62 21 0 -22 -149 245 126 5 60 -95 179 60
2504F0r2K33J15k90K66p3l44m0J76J02n2p9M5j51J51k15J22N1J17l08R7N2k12
$$ 60 -32 201 316 26 292 219 -125 -165 11 113 61 -18 27 -124 27 -188 -66 -15 102 -206 -109 -57 -269
2527b69n7K81Q5j20L53m32L13j3k35L60L7l17J47O6p2k35P7q1j2k05J23R4j41
$$ -269 -326 -45 40 -80 273 -159 154 141 -94 266 303 -14 133 199 127 -108 -31 -112 -124 -329 -206 -112 -253
2550b53J3J29l35K88K42j93l3o0J14P0j23n7L33Np2J33j62j51K68j07JK5J06k38
$$ -253 -240 -111 -446 -158 84 -109 -142 -202 -88 -18 -141 -198 135 140 68 201 39 -112 156 49 50 75 181 -57
2574e7J66j3k09J23k72J34m9R7M7k5K15n00J67J54j94R5J16N4k35M28L2l75k1
$$ -57 109 96 -113 10 -262 -128 -177 -80 -33 -58 157 -343 -176 -22 -216 -121 -5 49 -186 242 274 -101 -122
2597a22P9j13K63j36k0O0L11o1k20O0k9K2Q0n3K5k03k40J76R2k39k2K96o8J28
$$ -122 -43 -156 107 -29 -49 11 322 261 41 101 72 94 174 121 146 -57 -297 -121 -29 -268 -290 6 -62 66
2621F6j50K0j36J60j1K68l3k41L43j34j66K05k40K75j34J89M2j70O6q3O8j19j1
$$ 66 -84 -64 -200 -40 -51 217 184 -57 286 152 -14 191 -49 226 92 281 323 153 219 136 204 85 74
2644G4n1qq2J26o6j92J30J93l63L0M4K60j86k72J54k52P62j68j22mn4K65j69L61
$$ 74 23 15 -67 59 -7 -199 -69 124 -239 -209 -165 95 -91 -363 -209 -461 301 133 11 7 -47 218 49 410
2668D10l22K27m00k6J64M18l36k42k97K96j14K36k79J7J47k76J83J66k99j10J07
$$ 410 88 315 -85 -111 53 471 135 -107 -404 -108 -222 14 -265 -248 -101 -377 -194 -28 -327 -437 -330
2689c30M00k96J88k35K37M64k73O2J07n21J02M15j92j14j66O68m03j31k10J37
$$ -330 70 -226 -38 -273 -36 428 155 217 324 -197 -95 320 128 14 -152 516 113 -18 -228 -91
2709i1J56N5j15r8j66j00N1L30l09K42j20N1P6K01Kj89K47j82J08j29L04j37N2
$$ -91 65 120 5 -93 -259 -359 -308 22 -287 -45 -165 -114 -38 163 165 -24 223 41 149 20 324 187 239
2732B39K01j29p0m3K7k72m1m5P2q7J80j33q5O2l3J37j23q1KR4r7p4Q6K91J9j33
$$ 239 440 311 241 198 225 -47 -88 -133 -61 -148 32 -101 -186 -124 -157 -20 -143 -224 -222 -128 -225 -299 -213 78 97 -36
2758c6j7m5L9nP7MK83j4k42n3K6J06k25K7Qj1o7N8K4M6j04j02K04j24p6J72R7
$$ -36 -53 -98 -59 -64 13 17 300 286 44 -9 17 123 -102 -75 -67 -78 -145 -87 -63 -17 -121 -223 -19 -143 -219 -47 50
2785E0j88J08k25K13Q9j98O8K90J10J31m19L09m74L36k16K49k20j37J57J27k32
$$ 50 -138 -30 -255 -42 47 -151 -83 207 317 448 29 338 -136 200 -16 233 13 -124 33 160 -72
2806g2k31J15K32k00J89j09j99K78j55K3l1L4J97j9j45L02j14Mj34J93k10K66
$$ -72 -303 -188 44 -156 33 -76 -275 3 -152 -129 -160 -126 71 52 -93 209 95 99 -35 158 -52 214
2828B14N0M0j13k22O0k06M16m78K95j36K8L36m64J52j71K49j10J36j55j70K14
$$ 214 264 304 191 -31 29 -177 239 -239 56 -80 -52 284 -180 -28 -199 50 -60 76 -79 -249 -35
2849c5r6J5K98k24o1M2n9L85j86K83m91K92j3K3j92J45k09Q9OJ98q5R4l06J08
$$ -35 -131 -116 182 -42 -103 -61 -120 265 79 362 -129 163 150 173 -19 126 -83 6 12 210 125 219 -87 21
2873B1j70m1m9l8J29j81K16o9N4j98K53JJ44O3j96L40j38k0k05k9K80J34k14R7
$$ 21 -149 -190 -239 -277 -148 -329 -113 -182 -128 -326 -73 -72 72 135 -61 279 141 121 -84 -113 167 301 87 184
2897A84K3l08O8n8L40m53M80k72j83Q8J35J00k19j48L27j14j02K0k12jJ13J02
$$ 184 207 -101 -33 -91 249 -204 276 4 -179 -91 44 144 -75 -223 104 -10 -112 -92 -304 -305 -192 -90
2919i0K35j40k9K68j03j85j25J84l1K47k59O3j86Q9r6K17k31N5J50l7N2k64j47
$$ -90 145 5 -24 244 141 -44 -169 15 -16 231 -28 35 -151 -62 -158 59 -172 -117 33 -4 48 -216 -363
2942c63J86J66j14J37j29K07j68K95j34m7J77j08N4N4l5n6J98k91r9K16j38J69
$$ -363 -177 -11 -125 12 -117 90 -78 217 83 36 213 105 159 213 178 122 320 29 -70 146 8 177
2964A77k74J71j40k09L50J8k63O1k6K60k98j68L70k10p3J61K72l15K55oj01q1
$$ 177 -97 74 -66 -275 75 93 -170 -109 -135 125 -173 -341 29 -181 -254 -93 179 -136 119 113 12 -69
2986f9K13l58M03k3k79R7M26l80K03r8Oj10j49J42l55J08L5J8J78k92J63j92L56
$$ -69 144 -214 189 166 -113 -16 410 30 233 135 141 31 -118 24 -331 -223 -188 -170 8 -284 -121 -313 43
3009D3j11k98L78j97J03R3M3pJ77j93J04N3k8J56j42p0O7K12n81L83j34o9n1m1
$$ 43 -68 -366 12 -185 -82 11 54 47 224 31 135 188 160 316 174 104 171 383 -198 185 51 -18 -69 -110
3033a10M6j6J31j56p2J86l27K36J01j51p9K81K83l06L7J29k30j25K49j59L94l74
$$ -110 -64 -80 51 -105 -177 9 -318 -82 19 -132 -211 70 353 47 84 213 -17 -142 107 -52 342 -32
3055c2J53j49j87L09k65K18O3j16K10j05l63J87J15k27q3m6K87m9r9k02P15l90
$$ -32 121 -28 -215 94 -171 47 110 -6 204 99 -264 -77 38 -189 -272 -318 -31 -80 -179 -381 334 -56
3077e6l14M13l9L7j9N8j12L04Q4j87p1J81k80J11r8k41L19j59N3k4O9o4j09n3
$$ -56 -370 43 4 41 22 80 -32 272 356 169 98 279 -1 110 12 -229 90 -69 -16 -40 29 -35 -144 -197
3101a97J5M18mj97j36J70l85j6M25rj11P6o6p8J26j63L70j05K63l14J43j18l8
$$ -197 -182 236 232 35 -101 69 -316 -332 93 84 -27 49 -17 -95 31 -132 238 133 396 82 225 107 69
3124F9k08K67k3l73l3N80n65K68l2L0J70j00k75J63k55k99L75j5J80O0K62n2k28
$$ 69 -139 128 105 -268 -301 279 -286 -18 -50 -20 150 50 -225 -62 -317 -616 -241 -256 -76 -16 246 194 -34
3147c4K82j31j59J82k51K97k30K30j27L55k43J72l52kp8j34L73k59J23q7j55L31
$$ -34 248 117 -42 140 -111 186 -44 186 59 414 171 343 -9 -11 -89 -223 150 -109 14 -73 -228 103
3169A03k91q0K15l72K79n9N2J93K1J76k3o3j69J29M1r1l15K05L24k85n1N4K8R2
$$ 103 -188 -268 -53 -425 -146 -205 -153 40 61 237 214 151 -18 111 152 61 -254 -49 275 -10 -61 -7 21 113
3193A13k02j53K13J16J06l90j7J98j36K83r1l40K92N1k34j8L43j27k68K74j2L13
$$ 113 -89 -242 -29 87 193 -197 -214 -16 -152 131 40 -300 -8 43 -191 -209 134 7 -261 13 1 314
3215C14j27k13L2K42j43N3k87J47m6m6j2j84K57j05j65j1QK94Jn1j90J29j82J49
$$ 314 187 -26 6 248 105 158 -129 18 -28 -74 -86 -270 -13 -118 -283 -294 -286 8 9 -42 -232 -103 -285 -136
3239a36jL41j18ok54J9J64P5L92m65J66n0K50l35L47n24QJ38Nj79J8K32j73jK79
$$ -136 -137 204 86 80 -174 -155 9 84 476 11 177 127 377 42 389 -135 -127 11 16 -163 -145 87 -86 -87 192
3264A92k48l28L29n3j5J30k06N9l6Q6Q6K65j35j09J20Q1m45M27m0ml16R5RL3J23
$$ 192 -56 -384 -55 -108 -123 7 -199 -140 -176 -90 -4 261 126 17 137 218 -227 200 160 156 -160 -65 -56 -23 100
3289A00j24R9j67J49J28k4l35J9Q0r3L05Oj66J35j32K01j60q8R5k83N38k43j95
$$ 100 -24 75 -92 57 185 161 -174 -155 -75 -168 137 143 -23 112 -20 181 21 -67 28 -255 283 40 -155
3312a55M75k25k5R7R0k91j7K3J3RQ6J14j72J3j51N1J79m00K88l01J2K03k44K48
$$ -155 320 95 70 167 257 -34 -51 -28 -15 -6 80 194 22 35 -116 -65 114 -286 2 -299 -287 -84 -328 -80
3336h0K73j58R4l24L56j50M9r6N9N1J71j91K5J87k58K32l56L6Q8Q3l26K04j46
$$ -80 193 35 129 -195 161 11 60 -36 23 74 245 54 79 266 8 240 -116 -80 8 91 -235 -31 -177
3359a77Rp5j36L84j66P1J75j94j44K73KL7M9O5m7K68k6k57J33k50R4j07O7k9J50
$$ -177 -168 -243 -379 5 -161 -90 85 -109 -253 20 22 59 108 173 126 394 368 111 244 -6 88 -19 48 19 169
3384A69k6J6l3k16k09M1J81Q7J7l18R1R8K6j45J33j44K80k32J15j9J93R4P0j91
$$ 169 143 159 126 -90 -299 -258 -77 10 27 -291 -200 -102 -76 -221 -88 -232 48 -184 -69 -88 105 199 269 78
3408G8j0K14j27k35K67K0j25J75k18J07j94j38K70j7k79J89j49N6J37O7n03K89
$$ 78 68 282 155 -80 187 207 82 257 39 146 -48 -186 84 67 -212 -23 -172 -116 21 88 -415 -126
3430a26J68J43k64l2L3J11K83k17j01n0j9M5j74M66j10l28J99k15L89j09j92R6
$$ -126 42 185 -79 -111 -78 33 316 99 -2 -52 -71 -26 -200 266 156 -172 27 -188 201 92 -100 -4
3452dJ44m12J58K9m1J03n3N0o2j31K04J64o1k59K21J20l7l9j23O0q6j20K74m6
$$ -4 140 -272 -114 -85 -126 -23 -76 -26 -88 -219 -15 149 88 -171 50 170 133 94 -29 31 -55 -175 99 53
3476E3J26j89Q5m1L24m28K02K56l32k55Q0Q3l4k2J75j00l43M58r6j45Q9O2M1J0
$$ 53 179 -10 75 34 358 -70 132 388 56 -199 -119 -36 -70 -92 83 -17 -360 98 2 -143 -54 8 49 59
3500E9o9P4N6k41J84J01l16L19k10L9J38J84k01J7p0k07K42q4n9K71l1k88j20
$$ 59 -10 64 120 -121 63 164 -152 167 -43 -4 134 318 117 134 64 -143 99 15 -44 227 196 -92 -212
3523b12J49qk19K34j26lJ62K03k42J61m0M2j72M07j91l76K57J60k8j3j74M16k05
$$ -212 -63 -71 -290 -56 -182 -185 -23 180 -62 99 59 101 -71 336 145 -231 26 186 158 145 -29 387 182
3546A82r3Qj5Mk31R0j90K22p4L06j93Q7R0l86L29m5Lk76J82l4m6L43m77K53J95
$$ 182 89 97 82 86 -145 -55 -245 -23 -97 209 16 103 193 -193 136 91 94 -182 0 -34 -80 263 -214 39 234
3571B34k36J75k41L10j5k62Q7j25N3K50k52L1j39N8j48K08O7l81N7K84l5R5J83
$$ 234 -2 173 -68 242 227 -35 52 -73 -20 230 -22 9 -130 -72 -220 -12 55 -326 -269 15 -20 75 258
3594B58l67K10m4k40K36l4j04rK97j74PN0j20J2L60l53j75L85j16k5l60L01k85
$$ 258 -109 101 57 -183 53 19 -85 -94 203 29 36 86 -34 -22 338 -15 -190 195 79 54 -306 -5 -290
3617b90K64p5q0Mj73L60K3j6P3k93J18Rl4K60o4K6j42J07p8K72k93K72l38L25
$$ -290 -26 -101 -181 -177 -350 10 33 17 90 -203 -85 -76 -110 150 86 112 -30 77 -1 271 -22 250 -88 237
3641B37q3n1j75Lj21L6J57j09J49Oj28Nr5J04o6J56n7J91j7k45L1Q4l8J09K82
$$ 237 154 103 -72 -69 -190 -154 3 -106 43 49 -79 -74 -169 -65 -131 25 -32 159 142 -103 -72 12 -26 83 365
3666C65k02j1Q6j33q1l0o3K58k10k83M29Nj07k6J58l14L16n4l99L61J3O5j86p3
$$ 365 163 152 238 105 24 -6 -69 189 -21 -304 125 130 23 -3 155 -159 157 103 -296 65 78 143 -43 -116
3690a16L47k72L7Q0k02J30Q3q4o7P2r8L39m83J95k42K29K02p9J52k85K65j71O0
$$ -116 231 -41 -4 76 -126 4 87 3 -64 8 -90 249 -234 -39 -281 -52 150 71 223 -62 203 32 92
3713I2oj29R3j8pj53r6R9j62jK74j90N9M15k62K6o9Mj09L94j94J07j20J20M5j43
$$ 92 86 -43 50 32 25 -128 -224 -125 -287 -288 -14 -204 -145 270 8 34 -35 -31 -140 254 60 167 47 167 212 69
3739F9l4p2J95k26J25J74l92J99K4k77K97r9K1k05J15l9J11j83L21k10l9j9K21
$$ 69 35 -37 158 -68 57 231 -161 38 62 -215 82 -17 4 -201 -86 -125 -14 -197 124 -86 -125 -144 77
3762G7j69KL84k90J05P8k33m4L17k23J60j25L2K0O3l10j19L83l69K96j66L25m11
$$ 77 -92 -90 294 4 109 187 -46 -90 227 4 164 39 71 91 154 -156 -275 108 -261 35 -131 194 -217
3785b17L6J10j83J48J89q7j4J02J24l89L18nk32k62N28j8p6j3K2K1L7j54J5M0
$$ -217 -181 -71 -254 -106 83 -4 -18 84 208 -181 137 132 -100 -362 166 148 72 59 81 102 139 -15 0 40
3809D0K4j31j00J49K2N5r8j11J91j47J39R0j93q5J90Q9k67J01K2O0j54n1J73R8
$$ 40 64 -67 -167 -18 4 59 -39 -150 41 -106 33 123 -70 -155 35 124 -143 -42 -20 40 -114 -165 8 106
3833A06P3j50J82o0k31K26o3k65P6J5Q1R3n2J15k62P7j69K25j95L12K7j78L8J30
$$ 106 179 29 211 151 -80 146 83 -182 -106 -91 -10 83 31 146 -116 -39 -208 17 -178 134 161 -17 21 151
3857A51r5J42j10l9k8r6L91k26K40m50O8J05J21m12M96l84K31k29J15R0l78J90
$$ 151 56 198 88 49 21 -75 316 90 330 -120 -52 53 174 -238 258 -126 105 -124 -9 81 -297 -107
3879a07nJ02J21p3j85J09N8Rk0K4k4J64j46J72k07L4O1N9j43K64k1j05J29k23
$$ -107 -112 -10 111 38 -147 -38 20 29 9 33 9 173 27 199 -8 26 87 146 3 267 246 141 270 47
3903D7M6l6j11R7r7P4N5j88j78L35k29K84j17j29J85j20o0pN9j46L01J28o6l16
$$ 47 93 57 -54 43 -54 20 75 -113 -291 44 -185 99 -18 -147 38 -82 -142 -149 -90 -236 65 193 127 -189
3927a89L09j3j09j27J83M46n93K19o2LLj16j54j6J01K38o3n3r7J56k93K85l2j52
$$ -189 120 107 -2 -129 54 500 -93 126 64 67 70 -46 -200 -216 -115 123 60 7 -90 66 -227 58 26 -126
3951a26R5M1O1j35j64k5M40o8O5k26K26L0r5lj96L11j30m8o9j54LLL1K52m29M40
$$ -126 -31 10 71 -64 -228 -253 187 119 184 -42 184 214 119 116 -80 231 101 53 -16 -170 -167 -164 -133 119 -310 130
3977A30j40J18k14M6j03J90q3K76p9j08OQ3qq3Q7j25r4L81j84l7M8K5n2l4J9J23
$$ 130 -10 108 -106 -60 -163 27 -56 220 141 33 39 122 114 31 118 -7 -101 280 96 59 107 132 80 46 65 188
4003A88j99l49J89K13J23l57L13k82J8J57j41K5K09l00P0J4J82J30l58L35j79
$$ 188 -11 -360 -171 42 165 -192 121 -161 -143 14 -127 -102 107 -193 -123 -109 73 203 -155 180 1
4024AK13j65k70L31k07K10j49L8N8K3j41lj50K28j50l1q9J64M0p2R2K2J76j92
$$ 1 214 49 -221 110 -97 113 -36 2 60 83 -58 -61 -211 17 -133 -164 -253 -89 -49 -121 -29 -7 169 -23
4048b3J4j34P4qJ44M7J89k26j58J15J61j0J5l25P8r5L46o9l9j73K74m02J46k56
$$ -23 -9 -143 -69 -77 67 114 303 77 -81 34 195 185 200 -125 -47 -142 204 135 96 -77 197 -205 -59 -315
4072c15L00K2O8k61K16j18k0J02k07L77m1J6l45L40J51q4l65Q5M27k78r9K38n2
$$ -315 -15 7 75 -186 30 -88 -108 -6 -213 164 123 139 -206 134 285 201 -164 -79 348 70 -29 209 157
4095A57J45j86j68m5K87k71J2k4j24J88j3K54l41j40J95K22k15Q4K3N8m64M14
$$ 157 302 116 -52 -97 190 -81 -69 -93 -217 -29 -42 212 -129 -269 -74 148 -67 17 40 98 -366 48
4117D8j02R2n0J33N3j02K12p5k63J36J0k3J09n6J16k69n6J79j27MJ02p7j40p0
$$ 48 -54 38 -12 121 174 72 284 209 -54 82 92 69 178 122 238 -31 -87 92 -35 -31 71 -6 -146 -216
4141b16J41M8l0J84j88p0L59j83K7q2O0J29j2Ll31K56k12K11R3j78J42k22K8k18
$$ -216 -75 -27 -57 127 -61 -131 228 45 72 -10 50 179 167 170 -161 95 -117 94 187 9 151 -71 -43 -261
4165b61K40K00k25jo0P7mk81K87j31l2J79n8K9O2k77L04J6j00J43m1k26M07k71
$$ -261 -21 179 -46 -47 -107 -30 -34 -315 -28 -159 -191 -12 -70 -41 21 -256 48 64 -36 107 66 -160 247 -24
4189b4R7j5N3p9L10l30k06L97j74J80l53L17j08m2l44K94M7o9K00k98q5J30J29
$$ -24 73 58 111 32 342 12 -194 203 29 209 -144 173 65 23 -321 -27 20 -49 151 -147 -232 -102 27
4212B7j60L69j20k59J82J48mq5N4j3j1j73J72j41l2K2j05O1N8j9q8J45r5m6J38
$$ 27 -133 236 116 -143 39 187 183 98 152 139 128 -45 127 -14 -46 -24 -129 -68 -10 -29 -117 28 -67 -113 25
4237B5J14k77J94j0n9n5J79Pj82Q4O5j34O9Q9j78L04M7j31k3R3m35K52m0ol6q2
$$ 25 139 -138 56 46 -13 -68 111 118 -64 20 85 -49 20 109 -69 235 282 151 128 221 -214 38 -2 -8 -44 -126
4263a26j48J03N4j5K4j89M24k98o2J18j48L32p0k01O56o04L47j58j90O06m57J35
$$ -126 -274 -171 -117 -132 -108 -297 127 -171 -233 -115 -263 69 -1 -202 454 -150 197 39 -151 455 -2 133
4285A33j34O8M9p1M0n8L6p6K7r1R4j39k46J97K58j59k16M64j8j76j19K3J87j10
$$ 133 -1 67 116 45 85 27 63 -13 14 -77 17 -122 -368 -171 87 -72 -288 176 158 -18 -137 -114 73 -37
4309c7L02j38j68j04N73j05k18O7l95L2o7L31J35j46k8M7j7J54k64L96n35R7L8
$$ -37 265 127 -41 -145 428 323 105 172 -223 -191 -258 73 208 62 34 81 64 218 -46 350 -185 -88 -50
4332e0J4m9K18j33L2k0r8K9N5J45j38K35j63J1n4N9j95J44J31j19j43K64q8j82
$$ -50 -36 -85 133 0 32 12 -86 -57 -2 143 5 240 77 88 34 93 -102 42 173 54 -89 175 87 -95
4356i5N6J78j04J25k33J86j23oj69K08k96M79qm89m2J98J02J97k93M1K94k72J40
$$ -95 -39 139 35 160 -73 113 -10 -16 -185 23 -273 206 198 -291 -333 -135 -33 164 -129 -88 206 -66 74
4379G4P9l05J17K20n8R0j80K50j54l01K10l53J51K55J82j45m05L39o5m1j77J73
$$ 74 153 -152 -35 185 127 217 37 287 133 -168 42 -311 -160 95 277 132 -273 66 1 -40 -217 -44
4401d4m0o2J9Q9j06J65P0o0nK48k12k28L43j69m9k40L49J24l10K8j27J32N5j62
$$ -44 -84 -146 -127 -38 -144 21 91 31 26 274 62 -166 177 8 -41 -281 68 192 -118 -90 -217 -85 -30 -192
4425a92L17l25J33Q8j15J50j48K26Q6l20j07J10J92J39n04L57l3j52K32N9j12
$$ -192 125 -200 -67 21 -94 56 -92 134 220 -100 -207 -97 95 234 -270 87 54 -98 134 193 81
4446H1j41J61j56K4m1j0J63j97K88Pr6j99J56n1J61r7o5j1j24L7J31j12o1l8O6
$$ 81 -60 101 -55 -31 -72 -82 81 -116 172 179 83 -116 40 -11 150 53 -12 -23 -147 -110 21 -91 -152 -190 -124
4471a24J26k29K71n5o9J62J08rQ0l30m7J35L8jO7k22M15l66N6K00n28J55R6j10
$$ -124 2 -227 44 -11 -80 82 190 181 261 -69 -116 19 57 56 123 -99 316 -50 6 206 -322 -167 -71 -181
4495a81J90k43J41J41q2L4j4J50j47M7j24K01j70K23n4o7OO7k2o9P6K6k09J01
$$ -181 9 -234 -93 48 -34 0 -14 136 -11 36 -88 113 -57 166 112 45 51 118 96 27 103 129 -80 21
4519B1j30J66j65K48L0j36k28J25K01m13K72l06K93N6p2k2q5M9J01j1O5j28k0
$$ 21 -109 57 -108 140 170 34 -194 -69 132 -281 -9 -315 -22 34 -38 -60 -145 -96 5 -6 59 -69 -89
4542h9J44M1Q6k50q9K82Q7m23L70j53J50l13oK20O3n17L60j95j09M00o4R4l35
$$ -89 55 96 182 -68 -157 125 212 -211 159 6 156 -157 -163 57 120 -397 -37 -232 -341 59 -5 89 -246
4565b46p3M91k60K3L20k13K0J8j29K42l6n0L1k93L33l24r3L15j50p4J38J43k07
$$ -246 -319 172 -88 -65 255 42 62 80 -49 193 157 107 138 -155 178 -146 -239 76 -74 -148 -10 133 -74
4588g4j13J03Q6o5q9Nn3J47K41j56oJ60k08j40K07P1k06J85R6k05J74l46K04J62
$$ -74 -187 -84 2 -63 -152 -147 -200 -53 188 32 26 186 -22 -162 45 116 -90 95 191 -14 160 -186 18 180
4612A80j6l95J60K49j07ok50K70j71n6j68L24p3k02M5J56J75j34q3J1%J61R4k18
$$ 180 164 -231 -71 178 71 65 -185 85 -86 -142 -310 14 -59 -261 -216 -60 115 -19 -102 -91 -91 70 164 -54
4636e4K66j18j24M05j83q4k3P0L3k57Q4N0n4q4K22m51P9M5Q2O2n7K54r3p9J47
$$ -54 212 94 -30 375 192 108 85 155 188 -69 15 65 11 -73 149 -302 -223 -178 -96 -34 -91 163 70 -9 138
4661A38j62J25o7j46L68l73j11L14O0M0k03O5j60j12M9K50M0k18J21r1o0J40o0
$$ 138 -24 101 34 -112 256 -117 -228 86 146 186 -17 48 -112 -224 -175 75 115 -103 18 -73 -133 7 -53
4684e3j8n3J8K10k08JM8P4k05N35n30K61k46N5J06Nj83K61j6J66k13o2J57j62
$$ -53 -71 -124 -106 104 -104 -103 -55 19 -186 349 -181 80 -166 -111 -5 0 -183 78 62 228 15 -47 110 -52
4708e2J71N0J83j56J15j87l28J21M9J2n2q1k08K36j75L87m74O44m30J4K60p3p8
$$ -52 119 169 352 196 311 124 -204 -83 -34 -22 -74 -155 -363 -127 -302 85 -389 255 -175 -161 99 26 -52
4731e2J46J80k57K74l45J37J12k75P2L58l33N9J86m93L51j80P9n7l0L7Q2j28K6
$$ -52 94 274 17 291 -54 83 195 -80 -8 350 17 76 262 -231 120 -60 19 -38 -68 -31 51 -77 -51
4754e1p0L3R4K4j09jQ4RJ9J3k05L34j90J67M4N3k11l0J91j72J46Q4j45k60K46
$$ -51 -121 -88 6 30 -79 -80 4 13 32 45 -160 174 -16 151 195 248 37 7 198 26 172 256 111 -149 97
4779I7j17K37n05M69k70O0n2K0p1K21k84j50K84k46J76N0J5N0N1M8m5j93L29Q3
$$ 97 -20 217 -288 181 -89 -29 -81 -61 -132 89 -195 -345 -61 -307 -131 -81 -66 -16 35 83 38 -155 174 257
4803B57l10L6J33k09M6J77Pk12r4L18k47QL0J24k60J41NQJ42j52J64m30N67k82
$$ 257 -53 -17 116 -93 -47 130 137 -75 -169 149 -98 -90 -60 64 -196 -55 -50 -42 100 -52 112 -318 249 -33
4827c3M6R7J19j57P5j66O9l5m8J99j38j10k8J35KMj15m0L3K64K6k35J22j81J14
$$ -33 13 110 229 72 147 -19 50 15 -33 166 28 -82 -110 25 27 31 -84 -124 -91 173 199 -36 86 -95 19
4852A9k6q4N5l0J05k3o4p5Q9J98J5j57J10j29K03j29j49Q8J91j60k59M62m8l48
$$ 19 -7 -91 -36 -66 39 16 -48 -123 -34 164 179 22 132 3 206 77 -72 16 207 47 -212 250 202 -146
4876a46L24n8o0j12O9j99J50J94k7j3j46j98L35j06p5J50j03J3K16r6k92J21P7
$$ -146 178 120 60 -52 17 -182 -32 162 135 122 -24 -222 113 7 -68 82 -21 -8 208 112 -180 -59 18
4899A8k2j8M9j1L65j57n3k95J47Oj57J19J45j76J44j42j68K04J4j08Q5M5o2Nn6
$$ 18 -4 -22 27 16 381 224 171 -124 23 29 -128 -9 136 -40 104 -38 -206 -2 12 -96 -11 34 -28 -23 -79
4924g9K11k95J10K87l35l7J09L2k7K01j12j64J49l77M00l07K8J69Q7nj33j10K91
$$ -79 132 -163 -53 234 -101 -138 -29 3 -24 177 65 -99 50 -327 73 -234 -206 -37 50 45 -88 -198 93
4947I3j03O9k76M8j27N8j12M99n1N3J09l34J76k16R9j92K79Q4N2j25O5q9k46J54
$$ 93 -10 59 -217 -169 -296 -238 -350 149 98 151 260 -74 102 -114 -15 -207 72 156 208 83 148 59 -187 -33
4971c3k3m3K27k7j87L03k43q8L4K72k70J4J19M7J73j79l32J06k8J07O3j26M60
$$ -33 -56 -99 128 101 -86 217 -26 -114 -80 192 -78 -64 55 102 275 96 -236 -130 -158 -51 12 -114 346
4994C46o05K78j49J35pL7J38j77j05N8j85j94N40q0k12j27K59j84K22L19l03j00
$$ 346 -259 19 -130 5 -2 35 173 -4 -109 -51 -236 -430 110 30 -182 -309 -50 -234 -12 307 4 -96
5016i6Q9M5j68ml9J19J85m1Q0l54J96m6Q6J02j14l5J64k19M14l97k72J36J97j67
$$ -96 -7 38 -130 -134 -173 -54 131 90 170 -184 12 -34 52 154 40 5 169 -50 364 -33 -305 -169 28 -139
5040a39j9k9L45n37L42l25K23K08j00J24L0k77l7R4l4J93N0L01k53l5M2Nn0j53
$$ -139 -158 -187 158 -379 -37 -362 -139 69 -31 93 123 -154 -191 -97 -131 62 112 413 160 125 167 172 122 -31
5064c1O1J48r3l4j48J19j17j26j3r7J49K63l41J01K60k46k3R0Qp9L73o1j08l13
$$ -31 30 178 85 51 -97 22 -95 -221 -234 -331 -182 81 -260 -159 101 -145 -168 -78 -70 -149 224 163 55 -258
5088b58J79L9oJ29J21j14l36K53nm5K16m9j02k19J88K44m8q8p2nn5%n6j41J69
$$ -258 -79 -40 -46 83 204 90 -246 7 2 -43 173 124 22 -197 -9 235 187 99 27 22 -33 -33 -89 -230 -61
5113f1J35k8l9L0O5n4p8N05m39O9M0j20m6L53l05M4m9pM34k54j78j42O7J43k71
$$ -61 74 46 7 37 102 48 -30 475 36 105 145 25 -21 332 27 71 22 15 449 195 17 -125 -58 85 -186
5138a86J53N5k6J20k36J28M1j57j46L47K6j49K38J29l85N1pj18Q7L10m71R0J42
$$ -186 -33 22 -4 116 -120 8 49 -108 -254 93 119 -30 208 337 -48 3 -4 -122 -35 275 -196 -106 36
5161C6k18K49j91J30N8P6k93J87o3P4j67l2K39j98q1J68nOj00J84l18J32L46m19
$$ 36 -182 67 -124 6 64 140 -153 34 -29 45 -122 -154 85 -113 -194 -26 -31 -25 -125 59 -259 -127 219 -200
5185b00K93k54J51L8p7k21M07k20J95J06l73J02p6K4J32r7l1o3K5O0k07Q8L35
$$ -200 93 -161 -10 28 -49 -270 137 -83 112 218 -155 -53 -129 -105 27 -70 -101 -164 -139 -79 -286 -198 137
5208A37k72J60r2jr6k9K80J45j77O7k44J84R6j41j22l4J68k15j52M79n1M7j8j90
$$ 137 -135 25 -67 -68 -164 -193 87 232 55 122 -122 62 158 17 -105 -139 29 -186 -338 141 90 137 119 -71
5232g1l5J8J48j66Q3j32K16L4J5j39O7o6n0j53m6K52l4Q8m0K89l37N2K87m02L64
$$ -71 -106 -88 60 -106 -23 -155 61 95 110 -29 38 -28 -78 -231 -277 -25 -59 29 -11 278 -59 -7 280 -122 242
5257B42j46j63J09J02k91K11l32K15J73l6n5N6P7l31j48L23Kk47K15r4J20R5L1
$$ 242 96 -67 42 144 -147 64 -268 -53 120 84 29 85 162 -169 -317 6 8 -239 -24 -118 2 97 128
5280A28k45N5Q0k4j09K15rJ65k91J40k08M7J06k3J92j71Ml4J35k30m9L08k41L2
$$ 128 -117 -62 18 -6 -115 100 91 256 -35 105 -103 -56 50 27 219 48 52 18 153 -77 -126 182 -59 -27
5304b7J02N1k17k9j36J76P2k65L79l6l23K23K9K4K70n34J78J48l66K78J70j86
$$ -27 75 126 -91 -120 -256 -80 -8 -273 106 70 -253 -30 -1 23 293 -241 -63 85 -281 -3 167 -19
5326a9L4J7p6J54k63K11j05j20O1R6J0m8N6J46k35j0k92M39j60r1K08j10L36m07
$$ -19 15 32 -44 110 -153 58 -47 -167 -106 -10 0 -48 8 154 -81 -91 -383 56 -104 -195 13 -97 239 -168
5350a68L32j72M6K02l69J60j92J16K40l12J57m5Q9k43Q8j1k5j76k2K22m3j60L3
$$ -168 164 -8 38 240 -129 31 -161 -45 195 -117 40 -5 84 -159 -71 -82 -107 -283 -305 -83 -126 -286 -253
5373b53K41l3N8K4J99l09Q1J8j77K65j88o2K91J86j28k05J78m17L34k27q0P6J13
$$ -253 -12 -45 13 37 236 -73 8 26 -151 114 -74 -136 155 341 213 8 186 -231 103 -124 -204 -128 -15
5396a5j22K63k56j46L92q6o4N4j49K61k04l19K83q6J34R2j50OL78l01o6m2L47
$$ -15 -137 126 -130 -276 116 30 -34 20 -129 132 -72 -391 -108 -194 -60 32 -118 -112 266 -35 -101 -143 204
5419B04m15J82o3L46l83K19l7j20o9p8M59p8j20J30k10L8L6L6l26K28j5N7J17
$$ 204 -211 -29 -92 254 -129 90 53 -67 -136 -214 245 167 47 177 -33 5 41 77 -249 -21 -36 21 138
5442A38j72Q8p1qK0J54J9k80K02k07j32p2N9M42k35K47j86l50O6K91M3O9k95J39
$$ 138 -34 54 -17 -25 -5 149 168 -112 90 -117 -249 -321 -262 180 -55 192 6 -344 -278 13 56 125 -170 -31
5466c1O2P3k82J73k04K82l5k49J91j92K84k52J10K28n4j74K3N77n51P6MJ22k82
$$ -31 31 104 -178 -5 -209 73 38 -211 -20 -212 72 -180 -70 158 104 -70 -47 530 -21 55 59 181 -101
5489a01O9j3J00j49K9K26k1p7j79J34m0K7P7j58k7J3k4J98k%q7J50j66R9m4j1
$$ -101 -32 -45 55 -94 -65 161 140 63 -116 18 -22 5 82 -76 -103 -90 -114 84 82 82 -5 145 -21 78 34 23
5515B3j00Q7J20m9M8l8J2k38Q8K0K3L59n67L5K46j35r4J49j49K09P9j16j95N04
$$ 23 -77 10 130 81 129 91 103 -135 -47 -27 -4 355 -212 -177 69 -66 -160 -11 -160 49 128 12 -183 321
5539C21m04P4j17K97k12m3n5m1J00K98j65j29J90l39K18k01L30m33J32K9KJ07
$$ 321 -83 -9 -126 171 -41 -84 -139 -180 -80 218 53 -76 114 -225 -7 -208 122 -311 -179 -150 -148 -41
5561d1k72k1L94k98K8K04Q0q0j1J67j00L15n71K82j4M2j40J89k87K26J00j33m2
$$ -41 -313 -334 60 -238 -210 -6 74 -6 -17 150 50 365 -206 76 62 104 -36 153 -134 92 192 59 17
5584A7k2k13K38K96l65N2k62M7P5kJ5J30n9j02K34j34m6J17rj79J78J82k52k12
$$ 17 -5 -218 20 316 -49 3 -259 -212 -137 -139 -124 6 -53 -155 79 -55 -101 16 7 -172 6 188 -64 -276
5608b76J08K42M13m67J19P4m13L17j07l8L72l51r2j08K62k2m6j32j16J53K48k29
$$ -276 -168 74 487 20 139 213 -200 117 10 -28 344 -7 -99 -207 55 33 -13 -145 -261 -108 140 -89
5630h9k57N64m14k6K05J48j33k1j7m4J6j93K27L3L5O5j01L7P9j63P6J45j18j23
$$ -89 -346 218 -196 -222 -17 131 -2 -23 -40 -84 -68 -261 -34 -1 34 99 -2 35 114 -49 27 172 54 -69
5654f9m3J12Mk23mJ64n5jj6mL68m15J11J72k56J30J77M5Lq7m18K68L02l92J15
$$ -69 -112 0 4 -219 -223 -59 -114 -115 -131 -135 233 -182 -71 101 -155 -25 152 197 200 113 -305 -37 265 -127 -12
5679a2J11J82j74J63m05r8J94l1j22K66j28K78l99L79j33j29j26L84k32J22j55
$$ -12 99 281 107 270 -135 -233 -39 -70 -192 74 -54 224 -175 204 71 -58 -184 200 -32 90 -65
5700f5Q2L23l93O5R2j44j33J97n8L7O7rp8N5j1n6n3K87k72k39M31j78j05L1r3
$$ -65 17 340 -53 12 104 -40 -173 24 -34 3 70 61 -17 38 27 -29 -82 205 -67 -306 125 -53 -158 -127 -220
5725b20M33j30k17RL03j77r9M81m02Q5l7K71m22J52P5M7m6J57l47L15j36K6j47
$$ -220 213 83 -134 -125 178 1 -98 383 -19 66 29 300 -122 30 105 152 106 263 -84 231 95 121 -26
5748b6J54j58j3K24j75j5L29o39N4L68j69R9L0L8l9j55Q1KJ03j8lj37J28k96P0
$$ -26 128 -30 -43 181 6 -9 320 -319 -265 103 -66 33 63 101 62 -93 -12 -10 93 75 72 -65 63 -233 -163
5773a63J46l9K84l43M38j33j72J19m62L34j6p1l2J45k48J25O7q8l8K41l6N0r2
$$ -163 -17 -56 228 -115 323 190 18 137 -325 9 -7 -78 -110 35 -213 -88 -21 -109 -147 94 58 108 16
5796A6k59K23K0J88k22L25l16l8J31L3j1O5k18K18l50M1K36p3J50o4k05L7qr8
$$ 16 -243 -20 0 188 -34 291 -25 -63 68 101 90 155 -63 155 -195 -154 82 9 159 95 -110 -73 -81 -179
5820a79J77J1j20P1j24O0N6R6L0n0j3j72J46o7K58k46q3M08k21o5j62J91K29r5
$$ -179 -2 9 -111 -40 -164 -104 -48 48 78 28 15 -157 -11 -78 180 -66 -149 259 38 -27 -189 2 231 136
5844A36k27lK18k26j91M33k93L77n7l82L12j7j55N8K2k6M0N2j8J21j84j32K64
$$ 136 -91 -94 124 -102 -293 140 -153 224 167 -215 97 80 -75 -17 5 -21 19 71 53 174 -10 -142 122
5867A22j78L5L9L5nj2R1o5J5k70LJ56J50j18k63J4J98J66m79K37J96o2N1R4k87
$$ 122 -56 -21 18 53 48 36 127 62 77 -193 -190 -34 116 -2 -265 -251 -53 113 -366 -129 67 5 56 150 -137
5892a37N8j23J85J56k05j14J74J32k99l4K63k69K95OJ3J9Q3O9l16L23j67k06r
$$ -137 -79 -202 -17 139 -66 -180 -6 126 -173 -207 56 -213 82 88 101 120 203 272 -44 279 112 -94 -103
5915a03o4K33n06N03j73R1l38K57J01O6k44J62J64Ol67J43J58Q4j07k69L10k30
$$ -103 -167 66 -440 63 -110 -19 -357 -100 1 67 -177 -15 149 155 -212 -69 89 173 66 -203 107 -123
5937a23J71j63K0j2J86k65L42k17K73j7j57P4j95J8L24j00j04N5j61Q5J18Ll73
$$ -123 48 -115 -95 -107 79 -186 156 -61 212 195 38 112 -83 -65 259 159 55 110 -51 34 152 155 -218
5960b18K60j6J8M4n5N3J4o9r2j67J05j13K61l93K84R9L1J24l56J01L42k91j14
$$ -218 42 26 44 88 33 86 100 31 -61 -228 -123 -236 25 -368 -84 15 46 170 -186 -85 257 -34 -148
5983a48J20j64J71j87q7Q3L33j12j12K88j19j04K58k49J12j72J0K33qj69o5P0
$$ -148 -28 -192 -21 -208 -295 -212 121 9 -103 185 66 -38 220 -29 83 -89 -79 154 146 -23 -88 -18
6005a8q1J21p3O8j1j60K08j2J80m71L47K4l41L85j62K19j28o3l7K1l12L42J71
$$ -18 -99 22 -51 17 6 -154 54 42 222 -249 98 122 -219 166 4 223 95 32 -5 16 -296 46 217
6028B17k96j57m1K45j44M16k18K8q1k2J55k02J30j5q5O4j6j28K38Q0j99p1k1K30
$$ 217 -79 -236 -277 -32 -176 240 22 50 -31 -53 102 -100 30 15 -70 -6 -22 -150 88 168 -31 -102 -123 107
6052A07j95J5j63J14K12k32N1P8L13n43J63m8J58O7j46Q5O8j89R5Q7k38L13l50
$$ 107 -88 -73 -236 -122 90 -142 -91 -13 300 -243 -80 -128 30 97 -49 36 104 -85 10 97 -141 172 -178
6075a78K83n2K0n1J3J1j91j0L91j05l09J28K98m07K3Q2K59j86J10m9J84j04k22
$$ -178 105 53 73 22 35 46 -145 -155 236 131 -178 -50 248 -159 -136 -54 205 19 129 80 264 160 -62
6098f2J23L7n8MN9k88o8K44J8J06k40k6Q7K61j84j08J18k04K35q5J02O9k3j16
$$ -62 61 98 40 44 103 -185 -253 -9 9 115 -125 -151 -64 197 13 -95 23 -181 54 -31 71 140 117 1
6122AJ24j00q3n5K07q5j93N5K27M4k01J21j07P3j6L1R7r2%m4j3k41K86Q9j29K01
$$ 1 125 25 -58 -113 94 9 -184 -129 98 142 -59 62 -45 28 12 43 140 48 48 4 -9 -250 36 125 -4 197
6148A97k76j7r3M18j67N7j45J09j73L3L32j84l12J77K03j60J45q6j84J87N0j28
$$ 197 -79 -96 -189 229 62 119 -26 83 -90 -57 275 91 -221 -44 159 -1 144 58 -126 61 111 -17
$$ [...]
8191h8
##END NTUPLES=NMR FID
##END=
