##TITLE=1H_Ad=0(bat2-aceton-ag)-pr
 CDCl3
 8 sc, 
 13.12.2022
##JCAMPDX= 6.0         $$ Bruker NMR JCAMP-DX V2.0
##DATA TYPE= NMR FID
##DATA CLASS= NTUPLES
##ORIGIN= UXNMR, Bruker Analytische Messtechnik GmbH
##OWNER= root
$$ XWIN-NMR		Version 3.5
$$ Tue Dec 13 14:47:17 2022 Russian Standard Time (UT+4h)  she@DPX200
##.OBSERVE FREQUENCY= 200.13135
##.OBSERVE NUCLEUS= ^1H
##.DELAY= (6, 6)
##.ACQUISITION MODE= SIMULTANEOUS
##.ACQUISITION SCHEME= undefined
##.AVERAGES= 8
##.DIGITISER RES= 18
##SPECTROMETER/DATA SYSTEM= spect
##.PULSE SEQUENCE= zg30
##.SOLVENT NAME= CDCl3
##.SHIFT REFERENCE= (INTERNAL, CDCl3, 0, 15.7039)
##AUDIT TRAIL= $$ (NUMBER, WHEN, WHO, WHERE, WHAT)
$$ ##TITLE= Audit trail, XWIN-NMR		Version 3.5
$$ ##JCAMPDX= 5.01
$$ ##ORIGIN= Bruker BioSpin GmbH
$$ ##OWNER= she
$$ F:/spectra/data/she/nmr/H-F/1/audita.txt
$$ ##AUDIT TRAIL=  $$ (NUMBER, WHEN, WHO, WHERE, WHAT)
(   1,<2022-12-13 14:45:48.64 +0400>,<she>,<DPX200>,
      <created by zg, POWCHK disabled, PULCHK disabled
       configuration hash MD5:
       00 E9 B6 7A A2 85 ED C7 34 08 36 98 17 FE 4E 26
       data hash MD5: 16K
       4B 43 82 4E 3C 6C 6E 83 76 0A 78 9E 9B 72 72 EB>)
$$ ##END=
$$ 
$$ hash MD5
$$ F5 F9 0E 79 FF 11 8F C0 A7 29 8B 59 EC 74 60 78
##$RELAX= 
##$RELAX= 
##$RELAX= 
##$RELAX= 
##$RELAX= 
##$RELAX= 
$$ Bruker specific parameters
$$ --------------------------
##$DU= <F:/spectra>
##$EXPNO= 1
##$NAME= <H-F>
##$PROCNO= 1
##$TYPE= <nmr>
##$USER= <she>
##$AMP= (0..31)
100 100 100 100 100 100 100 100 100 100 100 100 100 100 100 100 100 100 
100 100 100 100 100 100 100 100 100 100 100 100 100 100 
##$AQSEQ= 0
##$AQ_mod= 1
##$AUNM= <au_zg>
##$AUTOPOS= <>
##$BF1= 200.13
##$BF2= 200.13
##$BF3= 200.13
##$BF4= 200.13
##$BF5= 200.13
##$BF6= 200.13
##$BF7= 200.13
##$BF8= 200.13
##$BYTORDA= 1
##$CFDGTYP= 0
##$CFRGTYP= 5
##$CHEMSTR= <none>
##$CNST= (0..31)
1 1 145 1 1 1 1 1 1 1 1 1 1 1 1 1 1 1 1 1 1 1 1 1 1 1 1 1 1 1 1 1 
##$CPDPRG= <>
##$CPDPRG1= <>
##$CPDPRG2= <>
##$CPDPRG3= <>
##$CPDPRG4= <mlev>
##$CPDPRG5= <mlev>
##$CPDPRG6= <mlev>
##$CPDPRG7= <mlev>
##$CPDPRG8= <mlev>
##$CPDPRGB= <>
##$CPDPRGT= <>
##$D= (0..31)
0 1.2 0 0 0 0 0 0 0 0.06 0 0.03 0 0 0 0 0.0002 0 0 0 0 0 0 0 0 0 0 0 0 
0 0 0 
##$DATE= 1670928348
##$DBL= (0..7)
120 120 120 120 120 120 120 120 
##$DBP= (0..7)
150 150 150 150 150 150 150 150 
##$DBP07= 0
##$DBPNAM0= <>
##$DBPNAM1= <>
##$DBPNAM2= <>
##$DBPNAM3= <>
##$DBPNAM4= <>
##$DBPNAM5= <>
##$DBPNAM6= <>
##$DBPNAM7= <>
##$DBPOAL= (0..7)
0.5 0.5 0.5 0.5 0.5 0.5 0.5 0.5 
##$DBPOFFS= (0..7)
0 0 0 0 0 0 0 0 
##$DE= 6
##$DECBNUC= <off>
##$DECIM= 32
##$DECNUC= <off>
##$DECSTAT= 4
##$DIGMOD= 1
##$DIGTYP= 9
##$DL= (0..7)
0 120 120 120 120 120 120 120 
##$DP= (0..7)
150 150 150 150 150 150 150 150 
##$DP07= 0
##$DPNAME0= <>
##$DPNAME1= <>
##$DPNAME2= <>
##$DPNAME3= <>
##$DPNAME4= <>
##$DPNAME5= <>
##$DPNAME6= <>
##$DPNAME7= <>
##$DPOAL= (0..7)
0.5 0.5 0.5 0.5 0.5 0.5 0.5 0.5 
##$DPOFFS= (0..7)
0 0 0 0 0 0 0 0 
##$DQDMODE= 0
##$DR= 18
##$DS= 0
$$ [...]
##$SUBNAM2= <"">
##$SUBNAM3= <"">
##$SUBNAM4= <"">
##$SUBNAM5= <"">
##$SUBNAM6= <"">
##$SUBNAM7= <"">
##$SUBNAM8= <"">
##$SUBNAM9= <"">
##$SW= 18.05172834244
##$SWIBOX= (0..15)
0 0 2 0 0 0 0 0 0 0 0 0 0 0 0 0 
##$SW_h= 3612.71676300578
##$TD= 16384
##$TD0= 1
##$TE= 0
##$TE2= 300
##$TE3= 300
##$TEG= 300
##$TL= (0..7)
0 120 120 120 120 120 120 120 
##$TP= (0..7)
150 150 150 150 150 150 150 150 
##$TP07= 0
##$TPNAME0= <>
##$TPNAME1= <>
##$TPNAME2= <>
##$TPNAME3= <>
##$TPNAME4= <>
##$TPNAME5= <>
##$TPNAME6= <>
##$TPNAME7= <>
##$TPOAL= (0..7)
0.5 0.5 0.5 0.5 0.5 0.5 0.5 0.5 
##$TPOFFS= (0..7)
0 0 0 0 0 0 0 0 
##$TUNHIN= 0
##$TUNHOUT= 0
##$TUNXOUT= 0
##$USERA1= <user>
##$USERA2= <user>
##$USERA3= <user>
##$USERA4= <user>
##$USERA5= <user>
##$V9= 5
##$VALIST= <valist>
##$VCLIST= <CCCCCCCCCCCCCCC>
##$VD= 0
##$VDLIST= <DDDDDDDDDDDDDDD>
##$VPLIST= <PPPPPPPPPPPPPPP>
##$VTLIST= <TTTTTTTTTTTTTTT>
##$WBST= 1024
##$WBSW= 4
##$XGAIN= (0..3)
0 0 0 0 
##$XL= 0
##$YL= 0
##$YMAX_a= 154908
##$YMIN_a= -149067
##$ZGOPTNS= <>
##$ZL1= 120
##$ZL2= 120
##$ZL3= 120
##$ZL4= 120
##$ABSF1= 10
##$ABSF2= 0
##$ABSG= 5
##$ABSL= 3
##$ALPHA= 0
##$AQORDER= 0
##$ASSFAC= 0
##$ASSFACI= 0
##$ASSFACX= 0
##$ASSWID= 0
##$AUNMP= <proc_1d>
##$AZFE= 0.1
##$AZFW= 0.1
##$BCFW= 1
##$BC_mod= 2
##$BYTORDP= 1
##$COROFFS= 0
##$CY= 11.3945322036743
##$DATMOD= 1
##$DC= 2
##$DFILT= <>
##$DTYPP= 0
##$F1P= 2.36226072786647
##$F2P= -0.459571619588291
##$FCOR= 0.5
##$FTSIZE= 0
##$FT_mod= 4
##$GAMMA= 1
##$GB= 0.15
##$INTBC= 1
##$INTSCL= 1
##$ISEN= 128
##$LB= 0.24
##$LEV0= 0
##$LPBIN= 0
##$MAXI= 10000
##$MC2= 0
##$MEAN= 0
##$ME_mod= 0
##$MI= 1.114404
##$NCOEF= 0
##$NC_proc= 0
##$NLEV= 6
##$NOISF1= 3.799351
##$NOISF2= 2.8
##$NSP= 1
##$NTH_PI= 0
##$NZP= 0
##$OFFSET= 15.70392
##$PC= 1
##$PHC0= -19119
##$PHC1= 18.80072
##$PH_mod= 1
##$PKNL= yes
##$PPARMOD= 0
##$PSCAL= 0
##$PSIGN= 0
##$REVERSE= no
##$SF= 200.130013532006
##$SI= 16384
##$SIGF1= 3
##$SIGF2= 2
##$SINO= 400
##$SIOLD= 16384
##$SREGLST= <1H.CDCl3>
##$SSB= 0
##$STSI= 0
##$STSR= 0
##$SW_p= 3612.71676300578
##$SYMM= 0
##$S_DEV= 0
##$TDeff= 0
##$TDoff= 0
##$TI= <>
##$TILT= no
##$TM1= 0
##$TM2= 0
##$TOPLEV= 0
##$USERP1= <user>
##$USERP2= <user>
##$USERP3= <user>
##$USERP4= <user>
##$USERP5= <user>
##$WDW= 1
##$XDIM= 8192
##$YMAX_p= 0
##$YMIN_p= 0
$$ End of Bruker specific parameters
$$ ---------------------------------
##NTUPLES= NMR FID
##VAR_NAME=  TIME,          FID/REAL,        FID/IMAG
##SYMBOL=    X,             R,               I
##VAR_TYPE=  INDEPENDENT,   DEPENDENT,       DEPENDENT
##VAR_FORM=  AFFN,          ASDF,            ASDF
##VAR_DIM=   8192,          8192,            8192
##UNITS=     SECONDS,       ARBITRARY UNITS, ARBITRARY UNITS
##FACTOR=    0.0002768,     1,               1
##FIRST=     0,             0,               0
##LAST=      2.2672688,     0,               0
##MIN=       0,             -149067,         0
##MAX=       2.2672688,     154908,          0
$$ Real data points
##PAGE= N=1
##DATA TABLE= (X++(R..R)), XYDATA
0@%%%%%%%%%%%%jRj6J6j6J6k4L2l3M1m9N7p2Q7r8J09j28J51j70J93k23K53k86
35a52L21l60M05m54N08n67O31o99P73q55R46j045J152j271J401j543J701j876
53i84K069k282K524k798L108l466L884m382M984n727O676p935R694j2338J6810
68I837k6297Q3672j21450q5928K63220k9965k24070P3370K12519j44978j56970
79a47040J75725J09570k09809m1221K07837j4624k01209P3899J70303j16101j34867
90a27537J53078Q4716j68237l4714J73325j6029j58424N9048J37414r5957j02807
101i6124J21467O4492j36146k1180J35680j9064j26290N5095J05195q4905p8171
112g9951J05142M3491j15239q924J13273k4380j02684N3125Q4048p6309n8339
$$ plain form
0 0 0 0 0 0 0 0 0 0 0 0 0 0 -1 8 -8 8 -8 8 -16 16 -17 24 -25 32 -40 47 -51 58 -70 81 -89 104 -119 134 -152
35 -152 169 -191 214 -240 268 -299 332 -367 406 -449 497 -548 604 -667 734 -809 892 -984
53 -984 1085 -1197 1327 -1471 1637 -1829 2055 -2327 2657 -3070 3606 -4329 5365 -6973 9837
68 9837 -16460 67212 -54238 -140166 123054 93089 -130981 -57611 154908 9930 -147040
79 -147040 28685 138255 -71554 -112775 95062 80438 -120771 -46872 123431 7330 -127537
90 -127537 25541 110257 -57980 -92694 80631 64602 -93822 -34774 102640 6683 -96124
101 -96124 25343 89835 -46311 -67491 68189 49125 -77165 -22070 83125 -1780 -79951
112 -79951 25191 68682 -46557 -55481 57792 33412 -69272 -16147 67901 -8408 -66747
123f6747R2618K8447r7813L547R4403l1889q1716N7316O2825p5976l7403Q7368
135C4980Q457q8437K0165P9812m5249o4507O4468M2166p8291j5939Q2355j2975
147B7005p7095L8332O3416o0024m3194P4785J8330q1708R009Q0392l5874o8657
159e5283N8903N0700p5206k6929Q5412L39q6885K8419P9307n4765o1994P4904
171A6922L9005q8569j2171R4027j7176r1307M5473P8488p0793n8427Q8475L2093
183E6040r8773l789J00303k5249r3931N3424P8165p6073n4846R1949K8382r8842
195d3240J14R9702k8377r1028N5102P4779p5786n2609Q9888K7320r7057m70R6310
208E4648k7134q8524N1548P1908p1948n0856Q4871K5908r2141M54R1633k7242
$$ plain form
123 -66747 25871 54318 -43495 -39948 54455 22566 -59150 -1834 60991 -14985 -52388 34980
135 34980 43437 -45000 -24835 54977 9728 -54779 9689 51855 -26436 -42375 39980 27005
147 27005 -50090 -11758 51658 -8366 -51560 23225 41555 -40153 -31144 49248 13374 -55283
159 -55283 3620 54320 -20886 -47815 37597 37936 -48949 -20530 58777 4012 -57982 16922
171 16922 55927 -32642 -44813 49214 32038 -59269 -13796 64692 -6101 -64528 23947 56040
183 56040 -42733 -46522 53781 28532 -65399 -11975 66190 -9883 -64729 27220 55602 -43240
195 -43240 -43126 56576 28199 -62829 -7727 67052 -8734 -61343 28545 55865 -41192 -41662 54648
208 54648 27514 -61010 -9462 62446 -9502 -60358 24513 50421 -41720 -41266 50367 23125
220B3125q3041N1681O8012p0869m6069Q3888K2820q9819L615Q9312k9437p9201
232e5983N2517O3056o9848m2228Q1092J7621q5921P353Q2671l2929p2444N3409
244a634N4739o9028l3969P7679J0322p9666J3158P4808l5172o1992N2845M5086
256D7176o3858k4393O9703L862o8616J7443O1654l5332m8594M8717L2479n7402
268a7161j4261N9172m090n7032K0752M8823l5783l7042M5612K1332n0545n674
280b5897N0694r981m6141K4443L7783l5586k4905M2878J1158m4702L184M3726
292B6654j6701l7632K8496K8460l7156j6295M1220L211m1429R047L8327k1677
304D525l1618L1215K1230l7666j0163M0608k831l9756J4629L5496k5393k8198
$$ plain form
220 23125 -59916 -8235 59777 -11092 -57161 26727 49547 -40272 -36657 52655 23218 -55983
232 -55983 -3466 59590 -10258 -52486 28606 46227 -39694 -32341 50330 17401 -55043 -1634
244 -1634 53105 -15923 -49892 27787 38109 -41557 -28399 46409 11237 -50755 2090 47176
256 47176 -16682 -41075 28628 32490 -36126 -18683 42971 7639 -40955 7762 40241 -17161
268 -17161 -31422 27750 23660 -33372 -12620 36203 420 -36622 8990 30322 -20223 -25897
280 -25897 24797 14816 -31325 -6882 30901 -4685 -29590 13288 24446 -20256 -17072 26654
292 26654 9953 -27679 817 29277 -7879 -24174 17046 20257 -21172 -12125 26202 4525
304 4525 -27093 4122 25352 -12314 -22477 18131 15300 -24456 -9827 25669 276 -27922
316b7922L4726J7705l9517n977M1819o578l9025J8148L4491k8773k5514L6998
328A0581J4223m1000j667M1199j0869l8292K2402L1702l2834k1596L8753R687
340B2289m1997K636M0687j4963l6191K5626K8339l4196j8052L9910N479m1138
352b1571P367L8619j8211l2472K8188K4191l5010j3105L8903J134l8179J0212
364i934L4618j9886k8513K7489J9651l3148r629L4776j452l3737J0847K9310j9111
377A281k3449K5359J5499k9488o369L0994l118k8658J1280K5281j7851j9321K4005
390E445J2426k7010m148K8009m026k5971J1622K2020j8008j6768K2362R712k5725
403a0060k131K5296n618k3922J2299J9461j7620j4958K2211Q150k4228j55K4047
$$ plain form
316 -27922 6804 24509 -15008 -20985 20834 14256 -24769 -6621 27870 -903 -26417 10581
328 10581 24804 -16196 -17863 23336 12467 -25825 -3423 28279 -4555 -26151 12602 22289
340 22289 -19708 -17072 23615 8652 -27539 -1913 26426 -7770 -25822 14088 19567 -21571
352 -21571 -14204 24415 6204 -26268 1920 26111 -8899 -22004 16899 18033 -20146 -9934
364 -9934 24684 4798 -23715 3774 23425 -9723 -19352 15424 13972 -19765 -8918 20392 1281
377 1281 -22168 3191 18690 -10798 -17167 13827 10709 -17949 -6669 18612 761 -18560 5445
390 5445 17871 -9139 -13287 14722 10696 -15275 -3653 18367 359 -16409 5953 15665 -10060
403 -10060 -12191 13105 7487 -16435 -4136 15325 -2295 -17253 4958 13108 -11120 -11275 12772
416A2772o582k0989J2762J7135j7395j1272K0994N192k2302K134K1295q427j8150
429a2833J3538J3549j7938q215J9945J494k0441M641J8001j0795j4415J4410J0000
442A0941j7487m269J8702j354j7867P420J5181j1174j1238J4940O932j6520j846
455g639J7247l328j5680Q359J2519j1887q556J3180M523j4981l28J4724m629j2899
469i375P637J0091j0603o788J2182L287j2989P35J2675m493j0640P595Q259r522
483a949n160J1077K378j1258R70J1205m034j0036O999P646r353m523J0065J903
497E930j1226J233J0462m464r187P117O437q768m229R779J339j0084J837R428
511E604m662p671P242N378q415k724R638j42q994L277P916n786n895P620L458
$$ plain form
416 12772 6190 -14799 -2037 15098 -2297 -13569 7425 12617 -9685 -7551 13744 5317 -12833
429 -12833 705 14254 -3684 -11899 8046 9540 -10901 -6260 11741 946 -13469 941 10941
442 10941 -6546 -10815 7887 6533 -11334 -3914 11267 93 -11145 3795 10727 -5793 -7639
455 -7639 9608 6280 -9400 -1041 11478 -409 -8965 4215 8738 -6243 -6571 8153 3524 -9375
469 -9375 -1738 8353 -2250 -9038 3144 6431 -6558 -5823 6852 2359 -8281 -686 7573 -1949
483 -1949 -7109 3968 6346 -4912 -3942 7263 3229 -6807 192 7838 -1515 -6038 4027 5930
497 5930 -5296 -4063 6399 1935 -7252 -135 6302 -2466 -6695 3084 4423 -5661 -3824 5604
511 5604 942 -6729 513 5891 -2524 -5248 4390 4248 -4746 -1469 6447 661 -5234 2386 5844
526E844q254j153Q275j636q018L951O051n803m277O717J879p121n5O933k023o286
542d976M090M501m602l220N670J506n543N67N322j750m507L202L754l915k390
557b291M343J059m193j87L912j254m148K537K879l358k270L399J381m266k97M216
573A462j155l729K346L190l000j687L445J448l796P8M137r41l542K241K813k796
589E14k218L297J217m114N9L528j306l322K289J947k981j361K966M96l621R03
605a707L159j873k347K945J478k654m65K921r8k842J596K418k227j300K827P8
621A909k215P9K036q94k228J415J170j681r76J586j87j164J73Q98k18j191N80
638i08R08n18k65P59M94l68k51M30K88n18O0O13j14m77L07M81k40q55L70L96q85
$$ plain form
526 5844 -2410 -3563 4712 3076 -4942 -991 5060 -743 -5020 1697 3576 -3545 -3600 3333 1310 -4976
542 -4976 -886 3615 -987 -4207 1463 2969 -2574 -2007 3315 1565 -2942 260 4014 99 -2291
557 -2291 2052 3111 -1082 -1269 2643 1389 -2759 -222 2657 -701 -2971 428 1809 -2457 -2754 1462
573 1462 307 -3422 -1076 2114 -886 -2573 872 2320 -1476 -1398 2739 1798 -1744 497 3310 514
589 514 -1704 1593 2810 -1304 -1245 2283 977 -2345 -56 1891 -1090 -2451 515 1011 -2610 -1707
605 -1707 1452 -421 -2768 177 1655 -999 -1464 1457 1359 -1483 113 2531 304 -996 1831 1909
621 1909 -306 -227 1809 915 -1313 102 1272 -409 -1385 201 14 -1150 -977 -79 -297 -1488 -908
638 -908 0 -518 -783 -24 470 102 -149 281 569 51 111 724 610 133 440 921 681 -174 196 592 -293
659b93k81J003k18r99J96Q85n39j051J170N83j554rJ691m51j349Q90J303j019
677d2q37J596Q1j033K06J139p69p18J042N53j270k94J517p50j044J259N1j044
695c57k69R91k21j098K91P44p90l55J184k71q66P21N95p15j51J005Q4p74N01P26
715I75p37j15R03k31m58K15K59n49j16M34l69n68L06K5p00R2P14n36p90M58P50
736c8o86l10P92Q9n22L15P85k62k70O57J93l33Q6N20j84l92M14l88l3p4k58k12
758a11O3J3p4o29M04k2n73J63N30m71J00K99j84p9N47L95n06m6J084m65m27P97
780H08M20j038j30Q56lj277N21Q98j361q74J883j61j925M43J506j018j503J731
798b24Q18j795l84K473q55j520J260J648j694o38K145R9k049O64J958j317j400
$$ plain form
659 -293 -574 429 211 -788 -592 293 -246 -1297 -127 456 -1098 -1107 584 133 -1216 -326 977 -42
677 -42 -879 717 798 -235 -29 1110 341 -377 665 1218 -52 -346 1171 421 -623 636 687 -357
695 -357 -626 365 144 -954 -663 81 -709 -1064 120 -151 -1017 -296 299 -416 -567 438 522 -252 249 975
715 975 238 123 1026 795 337 552 811 262 146 580 211 -357 -51 -26 -726 -634 80 -456 -1246 -788 -38
736 -38 -724 -1034 -242 -153 -675 -360 425 163 -107 550 743 410 496 1016 832 440 854 466 433 359 101 -111
758 -111 -48 -35 -109 -738 -334 -356 -929 -766 -236 -707 -607 -308 -492 -571 -24 371 -135 -181 903 438 11 808
780 808 1228 190 60 916 913 -364 157 1055 -306 -1180 703 542 -1383 -940 566 -452 -1955 -224
798 -224 594 -1201 -1585 888 33 -1487 -227 1421 -273 -911 1234 1333 -716 -52 1906 589 -811
815h11J666P65k071l45J977k22k462R70J864k008r96J880K28j827J66J876l06
832C44k229J308J685j359p88J854K54j492k21J851k90j682J052J238j274j137
848h86J671L93j245q56J813q7k040O44J580o72j801J556R10j839r41K888k32k762
866a906J154K453j975j907K472J425k677l84L164l88l399J999K488k588j688L155
882A398R90l613l8L862j862l372K632K045k880j659L576L0l556P82L709k423k728
899c107L507J754l619n45L842l87l906K098L361l062k012L754J125m164O5M025
915B729r86m046K368K770l397k083L622O62l768L73L307j314l059K216K362k758
931a002j927L913P33l706O66L444j049l212K610K421k969j638L500N52l503Q4
$$ plain form
815 -811 855 1620 -451 -796 1181 959 -1503 -533 1331 -677 -1673 207 435 -1392 -1226 650 344
832 344 -1885 -577 1108 -251 -1039 815 1069 -423 -644 1207 917 -765 287 1525 251 -886
848 -886 785 1178 -67 -923 890 803 -1237 -593 987 315 -1486 70 980 -859 -1800 1088 856 -1906
866 -1906 -752 1701 -274 -2181 291 1716 -961 -1345 1819 1431 -1968 31 2519 -69 -1757 1398
882 1398 2388 -1225 -1263 2599 737 -2635 -3 2042 -838 -2497 1079 1109 -2447 -1665 2044 -379 -3107
899 -3107 400 2154 -1465 -2010 1832 1445 -2461 -363 2998 -64 -2076 1678 2803 -1361 -1296 2729
915 2729 1743 -2303 65 2835 -562 -2645 977 1639 -2129 -1756 1551 237 -2822 -606 1756 -1002
931 -1002 -2929 984 1717 -1989 -1323 2121 1072 -2140 470 2891 -78 -1716 1784 2336 -1167 -1083
947a083L831j678l672K538K589l580j667L975O89m484N62M179j754l769L010L312
963B998m260j808M829O40m654N71N088k447l995M169K639n001j083N170n13m895
979b552J551M382l400l409M503J821n428l16N555j611m856K738M291m377k735
994c843N549J088n550M12N249j906m543L876L512m740j999N545L34n294O77N139
1010C506k585m016L433K884m606j362M819O8n079J515M270k764l646L929K397
1025B763m306j259M823m13m648K001M241l054l364L991K421m876n71N087l79n239
1041b782J868M605l265l678M610K106n519o79N587j166n045K269M605l915l757
1056d156N404J861n977J16N623j637n167L529M207m626k911N746J190n817P09
$$ plain form
947 -1083 2748 1070 -2602 -64 2525 -1055 -2722 1253 1942 -2542 -1980 2199 445 -3324 -314 2998
963 2998 -1262 -3070 1759 2399 -2255 -1684 3404 957 -3038 1131 3770 -1231 -2314 2856 2343 -2552
979 -2552 -1001 3381 -19 -3428 1075 2896 -2532 -2848 2707 1096 -3760 -1022 3269 -1108 -3843
994 -3843 1706 2794 -2756 -2344 2905 999 -3544 332 3844 -896 -2895 2650 2984 -2310 -1633 3506
1010 3506 921 -3095 338 3222 -1384 -2746 2073 2141 -2938 -1423 2847 83 -3563 366 2763
1025 2763 -1543 -2802 2021 1608 -3040 -1039 3202 148 -3216 775 3196 -1680 -2251 2836 2457 -2782
1041 -2782 -914 3691 426 -3252 1358 3464 -2055 -2734 2853 1687 -3358 -1089 3516 -399 -4156
1056 -4156 1248 3109 -2868 -2752 2871 1234 -3933 -404 3803 -823 -3734 2012 3202 -2615 -1906
1071a906O021k630n178M224L947n363k194N809K77o256J517N534l407m372M242
1086B65L364n746j496N899k65o130K787M794l648l775M857K689n470q54N849r52
1102B168n164K490M696m005l435M959J815n418m55N550j708m850K836L599l905
1117h27k800M448J919n666M7N765j721n012L191M048m264k633N118J274n149L02
1133a960N522j877m699L326L703m573k508N030R39n499O33N285k397m498L482
1148i1L026m403k089N455M41n857J605N109l042l857M366K639n162j040O004q52
1164B252n472K767M656m287k746M557J504n066m12N376j402n283K776M190m327
1179i17k671N012Q96m997N09M994j965m299K951L562m336j663M486N32m457R34
$$ plain form
1071 -1906 4115 1485 -3693 531 4478 -885 -3079 2730 3007 -3249 -1732 3802 395 -3977 265
1086 265 3629 -2117 -3613 2286 2021 -4109 -1322 3472 -176 -3951 906 3595 -1875 -2729 3120 2168
1102 2168 -2996 -506 4190 185 -3250 1709 3524 -1894 -2349 3201 1493 -3357 -521 3078 -827
1117 -827 -3627 821 2740 -2926 -2879 2886 1165 -3847 -656 3392 -872 -3505 1613 2887 -2262 -1960
1133 -1960 3562 1685 -3014 312 4015 -558 -3066 1964 2903 -2596 -1963 3322 925 -3573 -91
1148 -91 2935 -1468 -3557 1898 2339 -3518 -1913 3196 154 -3703 663 3302 -1860 -2900 3104 2252
1164 2252 -3220 -453 4203 -84 -2830 1727 3231 -1835 -2247 3129 1727 -3556 -780 3410 -917
1179 -917 -3588 1424 2320 -2677 -2168 2826 861 -3438 -487 3075 -1261 -2924 1562 2094 -2363 -1429
1195a429M339k030l820L489K567m203j246M381M21m599Q95M311k364l700L429
1210D41K520m500j052M392M0m687J580M205k773l532L748K293m471r47M677k12
1226A722m643J788M497l079l241M033K170m940j31M595n79n070K450L675l385
1241a38k883M257J568n100K25M721j303m890L155L266m090j921M630N41m640Q04
1257a798M417j601m248L255K880l580j620M477J75m420J202L867k206l282L107
1272F25K146l763j170L877k93m070J288L418k131k796L187J501l403n34L692n85
1288I89l259J694K833k219k288L189J441l645m4L287l32l254J274K785k327k260
1304b136K750J388l513j6L206r24k932J455K569k067k448L012J227l181L9L249
$$ plain form
1195 -1429 2910 880 -2940 549 3116 -1087 -2333 2048 2469 -2130 -1235 3076 712 -2988 441
1210 441 2961 -1539 -2591 1801 1841 -2846 -1266 2939 166 -3366 382 2675 -1796 -2743 1934 1722
1226 1722 -2921 -1133 3364 285 -2956 1077 3247 -1693 -1824 2771 2192 -2878 -428 3247 -138
1241 -138 -3021 1236 2804 -2296 -2071 2650 1347 -3543 -388 2878 -1212 -3133 1497 2038 -2602 -1798
1257 -1798 2619 1018 -3230 25 2905 -675 -2295 2182 2357 -2063 -861 3006 800 -2482 625
1272 625 2771 -992 -2162 1715 1422 -2648 -1360 2058 -73 -2869 318 1819 -1584 -2118 1574 989
1288 989 -2270 -576 2257 38 -2250 939 2380 -1265 -1309 1978 1646 -1608 -334 2451 124 -2136
1304 -2136 614 2002 -1511 -1527 1679 755 -2177 -722 1847 -220 -2668 344 1571 -1610 -1571 1678
1320A678r86k942K027K600k760j724L331O36l227M28L481j698k883K379K299l440
1336h01r02L397l48l329R92K940k055k254K668J555k926r70L352n41k833J549
1352e06K329j868j911K595J175l219M41K594p69k475J906J421k027j089K304P68
1368A669k786K75K215r32k106J459J484j762j412K463M19k253L52K154q40k123
1384a724J467J874j997j273K082P12k027K92J864n56j940J195J917k007j031J809
1400F57O69k348J70K189r96j765J366J322j644j104K157K40k268N42J810j047
1416e0j592J705J213j970l53K181j25k127N66K252j550j558K132O68j949l81K145
1433A207n26k064J125J517j550r68J655M13k052J97J779n37j662J087J094j119
$$ plain form
1320 1678 692 -2250 -223 2377 -383 -2107 1224 1860 -1367 -939 2542 844 -2039 340 2639 -801
1336 -801 -1703 1694 1346 -1983 -991 1949 -106 -2360 308 1863 -1063 -2033 1319 778 -2055 -506
1352 -506 1823 -45 -1956 639 1814 -1405 -964 1630 861 -1614 292 1713 -314 -1403 901 1669
1368 1669 -1117 -842 1373 441 -1665 -206 1278 -484 -1896 567 986 -1267 -915 1239 399 -1724
1384 -1724 -257 1617 -380 -1653 429 1141 -886 -594 1270 714 -1226 -31 1886 -121 -1152 657
1400 657 1326 -1022 -852 1337 341 -1424 -58 1264 -380 -1484 673 913 -1355 -813 997 -50
1416 -50 -1642 63 1276 -694 -1047 1134 1009 -1118 -552 1700 150 -1408 724 1392 -557 -938 1207
1433 1207 681 -1383 -258 1259 -291 -1259 396 809 -1243 -1046 733 196 -1466 -379 715 -404
1449d04n13J327r0j123K55J552o06j110J108M72r66l57R95K06o87l50Q88j81r19
1468e03N61N54j055j80N88M40j270J65P64p5j020P54P12o86n62J047K68j071J43
1487d26J112l84q38O22J103q97j096J367K63j209k46J368p74p51P43M86o89n20
1505g66R50j22r62L68J236q27o98P84P85j306l8J128J73j200K66J232r55n35R24
1524D37M16j064j05J080l03j164Q54N38j007j64O54%o82J8P05j29o18J84K31k01
1544c20k09K40K90k61j93O35p2k96J50N67k59m16K26L39k08l09K86J79m65q3O30
1565D51k48n73J69N73p15j53M77L13r19J20N94J11q98K69Q30o54n30P37M71o28
1585b03l3Q79m17o04M79O51o17m53R34o0o34N3P97o66m02N51O0p30j38Q35m46
$$ plain form
1449 -404 -917 410 320 -803 -548 1004 398 -712 396 868 -98 -455 540 746 59 -291 597 416 -503
1468 -503 58 612 -443 -623 -35 405 -865 -700 64 -11 -1031 -277 435 -251 -813 234 502 -569 -426
1487 -426 686 302 -536 86 1189 292 -804 563 826 -383 -629 739 -35 -786 -43 443 -246 -766
1505 -766 184 62 -900 -532 704 -123 -821 -37 748 -558 -596 532 705 -495 -229 1003 48 -487 437
1524 437 853 -211 -316 764 461 -703 151 689 -318 -482 172 172 -510 -492 213 84 -534 -350 -119 -320
1544 -320 -529 -289 1 -260 -453 182 110 -186 -36 531 272 -144 82 421 213 -96 190 369 -96 -179 451
1565 451 203 -370 -201 372 -343 -496 -19 294 -625 -505 89 200 -698 -429 401 -253 -783 -46 425 -203
1585 -203 -236 643 226 -378 101 752 135 -318 616 556 -78 -25 772 106 -296 255 315 -415 -553 282 -164
1606a64m90M67M27m84l84O68J83n51J93N30k04j07J2K20n2l19K25L28o6m35J34
1627A31l7m42K55K15o5j39p0J85k67R5j51J04j32Q2L60j36l82M18L49l10k86M36
1649B13M06n42k95Q84k84n33L15L83l56n82P90Q8p31j89R13m85n25K12P58q26
1669c86p6N71n6o11Q9O94l12l22P65J99r00L49K45%n27M98M30m58n68R95l70n45
1691b96L12K71k49m25N63j06m55Q1M44K4m02O2K81J7k99k9M61j69j77K32j24%
1713A7L2R3J69l45J49K46m84P5j0L43n9j37n9K52m67k74M36om00J47N18l93l39
1736d96N74J34o06K41N19j66n89L51N69o29J61L83r6n74K98L67n12k03O24K43
1756E93q05J78L67m0o23M65O4m96j26M04J18m40K84K22m40Q8O07j68n43J10L01
$$ plain form
1606 -164 -654 -187 240 -244 -628 40 223 -328 -135 395 191 84 96 316 264 -55 170 498 432 -3 131
1627 131 94 -348 -93 122 57 -82 -152 33 -234 -139 -290 -186 -318 -236 124 -12 -394 24 373 63 -223 213
1649 213 619 77 -218 666 382 -151 164 547 191 -391 399 487 -244 -433 480 -5 -530 -318 440 -386
1669 -386 -462 109 53 -558 -469 225 -87 -409 356 555 -345 4 249 249 -278 220 650 192 -376 619 249 -296
1691 -296 16 287 38 -387 176 70 -385 -304 140 164 -238 -176 105 122 -177 -206 255 86 -91 141 17 17
1713 17 49 142 311 -34 115 361 -123 -48 -58 285 226 89 30 282 -185 -459 -23 -29 -429 -282 236 -157 -496
1736 -496 78 212 -394 -153 366 200 -389 -38 531 -98 63 446 350 -224 74 441 -71 -274 350 593
1756 593 -212 -34 333 293 -330 135 199 -297 -423 -19 99 -341 -57 165 -275 -187 420 252 -291 -181 120
1777A20l7m23M84K91j79k26K50N8l92J96J60l76p0m2N21m50j75K82k2k23o4M8
1799b69J0J09j31L96o7n38L67K34k2O4k77N17k73K75j03M0M3o8j50j4JJ72q2n1
1823A83l29M07q2o34M30j63K9j58K18K46o91L57M70k92m03M23O4j76J39J99K85
1844E22o99L57L9l9l77N72m70K14R5j16k05K7J60l51K55j84J34k35NJ39j0k8j66
1867c61M46j36P1R9nk63K02R5j80R5o0M6j31K22J87k44j4Q7k45K26N1k1j89o5
1891h7L50l75j29K28J87n33K32K29l35J24O5J99k13rL99j76m73K67L14k68j46
1912a50L97j06k25L31p4l1k61K98l75j8O5K39j17l53L10J20j31r0L47k59j33M3
1934a73R5P0jJ59j4j41P8Q2j80J10j4K09l0j27J68j77J97k52k34l0M73m53J61
$$ plain form
1777 120 83 -340 144 435 256 30 280 338 -54 142 302 -74 -144 -186 335 -115 -290 -8 -30 -253 -317 -269
1799 -269 -259 -150 -281 115 48 -490 -123 111 89 153 -124 393 120 395 292 332 375 307 157 143 144 316 234 183
1823 183 -146 261 179 -455 -25 -188 -159 -317 -99 147 -544 -187 283 -9 -412 11 75 -101 38 237 522
1844 522 -177 180 219 180 -197 375 -95 119 214 98 -107 -80 80 -271 -16 -200 -66 -301 -296 -157 -167 -195 -361
1867 -361 85 -51 20 119 114 -149 53 148 -32 63 3 49 -82 140 327 83 69 156 -89 137 188 167 -22 -87
1891 -87 263 -112 -241 -13 174 -359 -127 102 -233 -109 -44 155 -58 -67 332 156 -317 -50 264 -4 -150
1912 -150 247 141 -84 247 173 142 -119 179 -196 -214 -149 90 -27 -380 -70 50 -81 -171 176 -83 -216 -173
1934 -173 -78 -8 -9 150 136 -5 73 155 -25 85 71 280 250 123 291 114 311 59 -175 -205 268 -185 -24
1957b4r0r4j99J45L11k37k04K10J56j65Q0J87j43K3O6J88l92L56M3J30n95O70
1979D22j33o0l48M49J78j090N58K10l11o6K89K47o45J17J23j23j19J31N10n72
1999b33R2L57J51n30K2M55l0m13L77J14o71Q9O45j44m70L93L06m99j61K79j74
2020d5j36m8K76k38j94L18J74j69l40L97J04j62N2K5J14j05k4J09J64l68K79%
2042A83k00k44O09j17j81m3k9j55R4NK08n26Q0N33n9n83O4Q23p51N2K29Q2j87
2065a13j84O39p0m93J64L71k45k91L34O0m59K76L76k85l25J24O80n97p6K23J41
2086B50p70O21K45l75k03M67lm53J16J78k1k78J0N08l93l57O69J58m10n5M02J11
2108D17o62J65K55N3j48K33l0l09k1Q4j69j80J25L70k26m14L58J42J42m68J30
$$ plain form
1957 -24 -114 -208 -407 -262 49 -188 -392 -182 -26 -191 -111 76 -67 -44 22 210 -182 174 217 347 -248 422
1979 422 289 229 -119 330 508 -582 -24 186 -125 -191 98 345 -300 -183 -60 -183 -302 -171 339 -233
1999 -233 -141 216 367 -163 -141 314 284 -129 248 362 -309 -220 425 281 -189 204 510 11 -150 129 -45
2020 -45 -181 -229 47 -191 -385 -67 107 -62 -402 -5 99 -63 -11 14 128 23 -1 108 272 -96 183 183
2042 183 -17 -261 348 231 50 7 -22 -177 -83 -78 130 -396 -316 217 158 -425 -361 462 -289 -237 -8 74 -113
2065 -113 -297 342 272 -221 -57 314 69 -222 112 172 -287 -11 365 80 -245 -121 559 -38 -114 109 250
2086 250 -520 101 346 -29 -232 235 232 -221 -105 73 52 -226 -216 292 -101 -458 211 369 -41 -96 306 417
2108 417 -245 -80 175 228 80 313 283 -26 -47 37 -132 -312 -187 183 -43 -457 -99 43 185 -283 -153
2129a53N38n59r5N65k79j66K16L87m06j13M63P3m57m9L62l81l16M97P9m06j52
2150c52K95j4m98M98K28n19k31N06M30r13J64P73k76l93K87L41m75q1N16P5q70
2171e09L40O55n49j84M07K06m42l73Q72m99k07j3P62m10n66N93J63m99j56M62
2191E3j69l43N44J32J9m17M99k73j51P5N36j61k08j41M94l80k18K24K66m52K09
2212A38l3j80j90j71O32m61k4L14K63l71k14Q28n76j01J15L92m84m7M14l4l48
2233a38L3N48k02m89L60L96p91L36K69k3o31m3O79k41m00N70J2l88l06N59q8l57
2255c35K09L66m18J32K70J58n20o1N76m8o70K31N11o64n7O54L4o77J97N63l62
2276H9k37N4L77j63m67K11L29m41O8M5m3j29J59N14m70l01L35J77k23J52LL24
$$ plain form
2129 -153 385 -174 -269 296 17 -149 67 454 48 -65 398 471 14 -35 327 -54 -370 127 206 -200 -352
2150 -352 -57 -71 -569 -71 157 -362 -593 -87 343 -570 -406 367 91 -302 -15 326 -149 -230 286 361 -509
2171 -509 -169 486 -63 -247 160 366 -76 -449 423 -76 -283 -296 466 56 -510 83 246 -253 -409 53
2191 53 -116 -459 85 217 236 -181 318 45 -106 -31 505 344 136 -5 489 109 -109 115 381 -71 138
2212 138 105 -75 -265 -436 196 -265 -289 25 288 -83 -297 531 -45 -146 -31 361 -123 -170 244 210 -138
2233 -138 -105 443 241 -248 112 508 -283 53 322 299 -332 -375 304 63 -337 233 245 -143 -449 110 22 -335
2255 -335 -126 240 -178 -46 224 382 -138 -199 377 329 -341 -110 401 -263 -320 334 368 -309 -112 451 89
2276 89 -148 -94 283 120 -347 -136 193 -248 -180 -135 -178 -307 -148 366 -104 -405 -70 107 -116 36 39 363
2298C63m33O1M50m66o4L33N6m24OM49j65k41j98O10m46l05N71j73l59K03M08l70
2320a34k10K38M75l41m60O57k38j4J38M65l65l27J84N08n28l73N79j0n38K15K88
2341B09k58k22R6J81l69J98L46j16k59R4L17n58P2L89J10m88J87K69j42k26L65
2362A95L00l56m07N45j61j79J70L46n85j35K80l5J04l84M66j74m28J44L46o7k32
2383b47J28J25j40oj6L22m67L75K86j31j46J5K66m27l18L47K07j33j45L56l92
2404a41n8J25K79j33m29N14j24l10L7L93k51j85K69P3k82m2L58O2m63qL88p6M
2427@J15K20j38M3O4j28k09K34J6l16j71M04o5l01J84J50j15r1K09o2j82P9l1
2450i1l8K9J05P0l96K81j7J44j14K4J39P6l30k2L03p5j31K07j02p2J11k58K50
$$ plain form
2298 363 -70 -9 441 -25 -89 244 300 -124 -118 331 166 -75 -273 337 -109 -414 157 -16 -375 -172 236 -134
2320 -134 -344 -106 369 28 -432 225 -13 -27 111 576 211 -116 68 576 48 -325 254 244 -294 -79 209
2341 209 -49 -271 -175 6 -363 -165 181 65 -194 -100 217 -341 -269 120 230 -258 -71 198 56 -170 195
2362 195 495 139 -268 277 116 -63 107 453 -132 -267 13 -22 82 -302 164 -10 -438 -294 52 -15 -247
2383 -247 -119 6 -134 -140 -156 166 -301 74 360 229 83 98 364 -63 -381 -34 173 40 -105 251 -141
2404 -141 -199 -74 205 72 -357 157 33 -277 -240 153 -98 -283 -14 59 -223 -265 93 155 -308 -316 72 -4 0
2427 0 115 335 197 240 304 176 -33 201 217 -99 -270 134 69 -232 -48 102 -13 -104 105 43 -139 -60 -91
2450 -91 -129 -100 5 75 -321 -40 -57 87 -27 -3 136 212 -118 -140 163 88 -43 164 62 -10 101 -157 93
2473I3r8m07K18K22n01M24K02j69j09K3K86l90J77J45Q0l17J5J81J26n3j6J14
2495B46l79K2K97kn89L90L79k09n89M62P1n59M05l7j11j5J93j2k51J82K92l18
2517a32j85J78K04j78O2M88l02j34M5j79K03L6Q3L9l72n7K84O7o7k14J47k39P5
2540a48J13j11J93Mp0J18k46J37L4NJ57k94K28j37J26k04K26j09K54j11q9k05
2562a29M2P7K24m72M22p3j30j82P5J90l22K99n9o1J3J74j19j61j34M86M5l81R8
2585g8L06l04k15M47J63l61j5K46m0o21O64P7m01J6L11l07p8K03J62p4j40r1M47
2608C17l15J32j76j26J81p4L14k10j17N9J88l17o0M14Ql59j47L70j05M9J18j59
2630a5J35l13R9P9j7j50K91j07o2n1L12p2o9M5j79l18J26M31l02LM8M47l80Q2
$$ plain form
2473 93 -5 -412 -194 28 -473 -49 153 -16 -125 -102 184 -206 -29 116 196 -121 -106 75 201 148 132 246
2495 246 -133 -111 186 184 -405 -15 364 155 -434 28 99 -460 -55 -92 -203 -218 -25 -37 -288 -106 186 -132
2517 -132 -317 -139 65 -113 -51 437 135 1 46 -133 70 106 189 228 -144 -201 83 150 83 -131 16 -223 -148
2540 -148 -35 -146 47 51 -19 99 -147 -10 24 29 186 -108 120 -17 109 -95 131 22 276 165 76 -129
2562 -129 -87 -10 214 -258 164 91 -39 -221 -146 44 -278 21 -38 -99 -86 88 -31 -192 -326 160 205 -176 -78
2585 -78 228 -76 -291 156 319 -42 -57 189 149 -472 192 269 -132 -116 195 -112 -190 13 175 101 -39 -130 317
2608 317 2 134 -42 -168 13 -61 253 43 -74 -15 173 -144 -204 210 218 -141 -288 82 -23 26 144 -15
2630 -15 120 -193 -94 -15 -32 -182 109 2 -60 -111 201 129 60 105 -74 -392 -266 165 -137 -134 -86 361 -19 63
2654F3L2K49p3l51N22l59k04K08o6k6n3M7j18L47j86rj06K48n01L90K2k70L82
2677A88j67j39M30l73K68l73N9Q6j26J23KJ97k12O0K30j49J48j84J9%k21J08l90
2700d16L66J25l0L4k1j75K13j12l4j11J41j62J19m3J50L33l37k5n0j26O8L26k69
2723c6J26l2k4J11j4J25l20J8o8j08m0J48K52k37j07J39K06l87L05jk11K08n2
2746Aj41J63k0O4p3J15j45K24m38m7M63m8j66n6K96J03o07O24q2j96j74K5K66
2769A51l37l1K56K46k21j68J66j96K28N2j63J2k39J71K42R5k53M9q3Q9M7j67L0
2792b4L9o8k23m4M31k75j21O1K87q6J69j34J70l30J46k23M20p7k47O9J84l4j37
2815d7J8L31l17j21J48J1mj15K66o8J2k82k1K0P0K32l6l54J87J27l3j43J76Q2
$$ plain form
2654 63 95 344 271 -80 442 83 -121 87 21 -5 -58 -11 -129 218 32 23 -83 165 -336 54 76 -194 188
2677 188 21 -118 312 -61 207 -166 -107 -21 -147 -24 -22 175 -37 23 253 104 252 68 87 87 -134 -26 -416
2700 -416 -50 75 45 79 58 -117 96 -16 -50 -161 -20 -182 -63 -106 44 377 40 15 -35 -161 -93 233 -36
2723 -36 90 58 34 145 131 256 -64 -46 -114 -222 -262 -114 138 -99 -206 -67 139 -248 57 56 -155 53 1
2746 1 -140 23 3 67 -6 109 -36 188 -250 -297 166 118 -48 -104 192 295 -312 312 230 34 -140 -115 151
2769 151 -186 -217 39 285 64 -104 62 -134 94 146 -17 -5 -244 -73 169 264 11 60 -23 66 113 -54 -24
2792 -24 15 -53 -276 -320 111 -164 -285 -224 63 -23 146 12 182 -148 -2 -225 195 118 -129 -60 124 90 -47
2815 -47 -29 302 -15 -136 12 23 19 -96 170 102 114 -168 -189 -169 -99 133 97 -257 -70 57 24 -119 57 139
2839A39j38l5n3J53r6J01o8k28L41J70j34k45j5K87l03J19R6j96J0p9J22L2j31
2862a51J73J44j37k98J02n9J77K5M9l3J48j85j73Q8J57j98M49m21J87l3K60r9
2884A72q8J31p9j45K5K08k62K22l05k42N8K76Q0O5k65L80m60k2L79l38K8N07l93
2907f8L09k91K64j24M9j99j09J40J08N1j23J33k10n4K80j68j13O5r4k9K07j67
2929a43P1o6k29K39K28k48K14Q4k66O8K96l95P3K3K97j59l56N07j78j14j11O8
2951i7J79k11K36p9m3P7n2r8J14j66k6M1k60L39k1j8J09k4l6j88J44M2J46j41
2975c3p1K30p1L2j24O7k49K58j03Pj8j8l8L08k86l8L22o7k53J65P8l93L25j69
2999a39K42k64K08K00j01j21p4K78l28J53j3k8P1N9O6j14k64K44j07j5l3K63l20
$$ plain form
2839 139 1 -34 -87 66 -30 71 3 -225 116 286 152 -93 -108 179 -124 -5 91 -105 -95 -174 -52 -20 -151
2862 -151 22 166 29 -269 -167 -226 -49 -24 25 -8 140 -45 -218 -130 27 -171 278 -143 44 11 271 172
2884 172 84 215 136 -9 16 224 -38 184 -121 -363 -305 -29 51 116 -149 231 -229 -251 128 -210 -182 325 -68
2907 -68 241 -50 214 90 139 -60 -169 -29 79 130 7 140 -70 -124 156 -12 -125 -60 -154 -183 24 -143
2929 -143 -72 -138 -367 -128 100 -148 66 150 -116 -48 248 -147 -74 -51 246 87 -269 238 60 -54 -165 -97
2951 -97 82 -129 107 28 -15 62 10 -88 26 -140 -166 -125 -385 -46 -67 -85 24 0 -36 -224 -80 -38 108 -33
2975 -33 -104 126 55 87 -37 30 -219 39 -64 -57 -75 -93 -131 177 -109 -147 175 108 -145 20 98 -295 30 -139
2999 -139 103 -161 47 247 146 25 -49 229 -99 54 41 13 84 143 209 95 -169 75 -32 -47 -80 183 -137
3022a37O4p9K18j77J26J06k88j04N5L69k40p9O4K00p6Nj72J09J00L4j09J13j04
3045bQ2q6J1N1o8p3M1j55R3K0O4p9K83q1k36m9L86k71K0L21k88l9J12R3l2j58
3071d0J47O1m13M25j14o9J56j08q3k3KJ20j73L5q0K93l3o7N0J22l58J74j62J92
3095E4r1j16K24M2j39O0Q4m37M70o5J4q4j26K12O8l81K27J57r9R8k38n3J86m9
3119A8K09k46j47M45P9l61j48K83j4j08oJ42j48n2J77q2L2j91L11M2k87JJ44J61
3143B54m38K85K3j44l33L32K12l63M7j04J17j26K10J10j44L7r6K03j47m5K03j63
3165g0L2J22q6O4j88J11l2o6N50k94J3j89K30j59p4nK06j75l2P5Q9k96P4m8r9
3190b47R1J42n6J83j08J03J83k71j03O7L05k33m3Q3J42j60p7r5J83r4m1J42j27
$$ plain form
3022 -137 -73 -152 66 -111 15 121 -167 -271 -216 153 -87 -166 -102 98 22 27 -145 -36 64 98 -11 102 -2
3045 -2 80 -6 5 56 -12 -85 -44 -199 -106 -86 -22 -101 182 101 -135 -184 202 -69 -49 272 -16 -55 57 150 118 -40
3071 -40 107 168 -245 180 66 -3 153 45 -38 -61 -59 61 -112 -77 -157 136 103 36 86 208 -150 24 -138 54
3095 54 -37 -153 71 113 -26 34 118 -319 151 86 100 16 -110 102 170 -211 16 173 74 172 -66 -119 67 18
3119 18 227 -19 -166 279 358 -3 -151 132 118 10 4 146 -2 -54 123 41 73 -118 193 235 -52 -51 93 254
3143 254 -184 101 124 -20 -353 -21 191 -172 -125 -229 -112 -238 -28 82 -62 -25 -121 82 -65 -110 93 -70
3165 -70 -38 84 -2 62 -126 -15 -47 -113 437 143 156 -33 197 38 -36 -41 165 -10 -42 33 122 -174 -100 -148 -247
3190 -247 -156 -14 -70 113 5 108 291 20 -83 -16 289 56 13 96 238 78 1 -94 89 -5 -46 96 -31
3213c1L8j32J06j98L19j22P1q7j3j95K48J4j54L10k48Q8n7N6j05J86K16l17M7
3236D0N9j10k06K84L0j79J59q1k5k77J22J96Q2k05p1L07j78J91k13n2%J93J17
3259A83k64j41K26Q8j75J2J14j00J11j61J05Q5J54j29k6j40J63j8l13J93K7J56
3281A50j27L5o9j10n0J48L32m64J99j72l8L66k77R5j52j61J30L40j25K6q5J72
3303A63Lm10L56j16m0O2j45K04J23k86L49l29J13k2j43K09N1J58j66k82R6Pl67
3326d12M07J36k84J47j19J82K6P8K34k80k47L02l4n1q5O8J2j37KJ23J36j25k85
3349b06L65k35o4J87L2j27r7L6N6qj7M4j67O5L39j68q2mJ82J8j9L6k05J79j39
3374AJ10R3j32j06R4m35J43M11l2j55J33q9m5m2j06M00j39m10K97J18L4P2M8q
$$ plain form
3213 -31 7 -125 -19 -217 102 -20 51 -36 -49 -244 4 18 -136 174 -74 14 -43 13 -92 94 310 -7 40
3236 40 99 -11 -217 67 97 -82 77 -4 -29 -306 -184 12 94 -111 -182 125 -53 138 -75 -127 -127 66 183
3259 183 -81 -222 4 92 -83 -71 43 -57 54 -107 -2 83 237 108 82 -58 105 87 -226 -33 -6 150
3281 150 23 58 -11 -121 -171 -23 309 -155 44 -128 -166 200 -77 18 -134 -295 -165 175 50 76 -9 163
3303 163 166 -244 112 -4 -44 18 -127 77 200 -86 263 -66 47 25 -118 91 142 300 134 -148 -52 -45 -412
3326 -412 -5 131 -153 -6 -125 57 83 161 395 115 -132 170 136 85 0 68 80 -57 -55 68 204 79 -206
3349 -206 159 -76 -140 47 79 -48 -145 -109 -53 -61 -78 -34 -201 -136 203 35 -47 -51 131 149 130 166 -39 140 1
3374 1 111 204 72 -34 60 -375 -232 179 147 -8 125 36 -9 -51 -157 243 104 -306 -9 109 143 215 263 255
3398B55m53J89K30m24K6L6J23j39L79k37J93j52m6N7M6k95J00K71l54%J77P1p1
3421a8l1K36j71l28K11P7K42k23J90l7k78K39q5p7K89k34j26J17p3j23K08K20
3443B25l48J58k0J70q7k48J40k64J62Q8O3l1K13ko1k30Q7q5J6K44l33N8L28k15
3467B8M3j87J99M2K6k83K8K68r3m3K54j96l64K8L3J39o9J28j15P5J36O1l1j21
3491a4L5j68L7J36M3J58k01K06L2j82Rj31K18j60M5J11k48O0j31K51l86m8L39
3514A1r4K74m27N49l34M7j59J43j09R0J72l09K04J28j69k28L72J1j27P6o2k9k34
3537b04J10K55l33l4M43k51n1m7J94J57l66J02M9j4J16k7j03pN5r0K96j58j64
3560g2K49j24j66J50j09o5P9j9J88l91K41M3J09Mj86j53LK39q6L3j03m5J30J80
$$ plain form
3398 255 -198 -9 221 -203 -177 -141 -18 -157 222 -15 178 26 -20 37 83 -212 -112 159 -195 -195 -18 53 -18
3421 -18 -49 187 16 -312 -101 -24 218 -5 185 148 -130 109 24 -53 236 2 -124 -7 -80 -203 5 225
3443 225 -123 35 15 185 98 -150 -10 -274 -112 -24 39 8 221 219 158 -72 15 -70 -54 190 -143 -85 243 28
3467 28 71 -116 83 125 151 -132 -104 164 71 28 282 86 -278 -250 -217 -78 -147 -19 -134 -59 77 138 107 -14
3491 -14 21 -147 -110 26 69 227 26 232 264 82 91 -40 178 18 63 174 -74 -14 -145 106 -280 -328 11
3514 11 -83 191 -236 313 -21 26 -133 10 -99 -9 163 -146 58 186 17 -211 161 172 45 121 59 30 -204
3537 -204 -94 161 -172 -206 237 -14 -65 -112 82 239 -127 -25 24 10 126 99 -4 -11 44 -46 250 92 -72
3560 -72 177 53 -113 37 -72 -137 -58 -77 111 -280 -39 4 113 117 -69 -222 -219 20 -66 -33 -136 -181 -51 129
3584A29j42m0K89l32r2O9J32j02J31j63N8K9k31J84J68j4k61M50m42K56Op6Kp1
3608f3P4j01K2J95k31Nj16K19J6k22K64l6P0j67N2q0n6L43j24j43J87m1r0J96
3632A73j08Q2l34R3J5l34M05j30K60k37K96p3p1k8M1J06k0k26k34M34k55J84K73
3655C12k25j43q9K54j18J21J06lk24K55m9K6l7k87k5pL06n2j27R8Ql13J06J57
3679E0o4k81K62L5j48n5L52k5j55J82O6k36K09j40J12j25Q1m3k04r4M54n14P6
3702b05P1J0j05L40j0j11J07j02J42j60j42J08Q7l42K55J54O5k6j46J14k85K32
3724E1P4J83n61K03K11j48Q3k03j6J38j91J48n6J5k4m4MJ11K50m16K28R0J6q9
3748E7J1O3k10K8kj65K49J15n0K36j47m04J40K43j90L16k38j04L07k87r8M15l85
$$ plain form
3584 129 -13 -53 236 -96 -188 -119 13 -89 42 -121 -63 -34 -265 -81 87 73 -188 262 -180 76 82 6 8 -63
3608 -63 11 -90 -68 127 -104 -99 -215 4 20 -202 62 26 96 -71 -19 -99 -155 188 64 -79 108 67 -23 173
3632 173 65 147 -187 -94 -79 -413 -8 -138 122 -115 181 108 37 9 50 156 136 -90 -324 110 -145 39 312
3655 312 87 -56 -145 109 -9 112 218 215 -9 246 197 223 186 -101 -126 -133 173 121 -6 92 100 -213 -107 50
3679 50 -14 -295 -33 2 -146 -201 151 126 -29 153 219 -17 192 52 164 39 120 77 -127 -221 233 -281 -205
3702 -205 -134 -124 -229 111 101 -10 97 -5 137 -23 -165 -57 30 -312 -57 97 162 136 -10 104 -181 51
3724 51 125 308 -253 -50 161 13 96 -107 -123 15 -176 -28 -84 -69 -93 -137 -133 -22 228 -188 40 130 146 57
3748 57 68 131 -79 -51 -53 -218 31 146 96 332 185 -219 -79 164 -26 290 52 -52 255 -32 -130 285 -100
3771a00j44K89j10k6R7j38r9K04r8K24k45j49J19K13j98M8L4K07p9J76j34n7j19
3794h5J05J69j25m4k88K82j32K60l0J01l2j12K8j32K3L44m45O0o0JK1J48k6J00
3818A31j70p6L4J57j49J56%P1j32j41J84l51M34j79M5j18K06J3j88R6r2J24j80
3841a25K47j7J35j45o7m8Q9r5n8O4M2j36Q9Q8j16J4J64o6OL1k08J11J41n6j40
3866e6n5M3O5l84K98K5M49o93L38M8j76J92o8J5k26M65n90L17R4q6k4J21k11K68
3890A69k13k63J48K63l05o4K29P7k27L8K22k49J91l4K53l61k20J57J94J27j54
3911b2J05j27l2K24n9j96K61j00k37J26j14K45j42L16l40j43L29l9k49J68q0j02
3933b08J43J72r7k34K20M9k79K84j20R7n2J08j02J06j29K14o0k5k2j61J92k7k0
$$ plain form
3771 -100 -244 45 -65 -91 6 -132 -231 -27 -125 99 -146 -295 -176 37 -161 -113 -79 128 49 225 91 34 -85
3794 -85 20 189 64 20 -268 14 -118 142 112 213 181 69 97 -35 -12 332 -113 -53 -113 -112 -91 57 31 131
3818 131 -39 -115 -81 76 -73 83 83 154 22 -119 65 -286 148 -31 14 -104 102 115 -73 23 -69 55 -125
3841 -125 122 105 240 95 28 -20 69 -26 -84 -20 22 -114 -25 63 -53 -39 125 59 65 96 -112 -1 140 84 -56
3866 -56 -111 -68 -3 -387 -89 -64 385 -308 30 78 -98 94 26 41 -185 280 -310 7 101 15 -9 112 -99 169
3890 169 -44 -307 -159 104 -201 -265 -36 41 -186 -148 74 -175 16 -18 235 -126 -346 -189 5 132 -22
3911 -22 83 -44 -76 148 89 -107 154 54 -183 -57 -171 74 -68 248 -92 -235 94 55 -194 -26 -106 -208
3933 -208 -65 107 10 -224 -4 45 -234 50 -70 27 -25 83 -19 87 -42 172 112 87 65 -96 96 69 49
3956D9j52K30k80J59k18J53J4J26j59k07N24l03NM1k41J69J04k69L51j41p5o6
3978a86K10j28L61k06j75lL83m22M1J00K9p3K05L2l06J62j84m0M42m80L48l9J95
4001B66l04J89k19J52k42L13Qr7m4L41l60K0j8M3M4j05j0L54pm37O2L4J26q0M9
4026G8J2R8o16L94R4K5J6J30j86l10M25N2j26j25J46j29J97l02k6j21K78R4j10
4049a2J1J48M3J8k29j80lK61j61K02j66l8O5J91k13K25k2k53J64Oj39J01k6j68
4073a75K41N7j0K17j52j34N2j5j58j22q6K53l8J94p9j37J03J39M4j83j04K90l08
4096a11K58k63J80k2j15Q4K95l90K79p5l00L89k68O3j46K80j67K4j17J95j33L88
4118C28j70j47q3J65k1Nj62j24J56l6k7PJ41O2K7l99L82K2k32J56p3l8L8j18J60
$$ plain form
3956 49 -103 127 -153 6 -212 -59 -45 81 -78 -285 239 -64 -59 -18 -259 -90 14 -255 96 -45 -120 -186
3978 -186 24 -104 257 51 -124 -127 256 -166 -125 -25 4 -69 136 168 -138 24 -160 -200 242 -238 110 71 266
4001 266 -38 151 -68 84 -158 155 163 66 22 363 3 23 5 48 92 -13 -23 331 324 -113 -51 -17 109 29 78
4026 78 90 188 -428 -34 60 85 101 231 45 -265 160 212 86 -39 107 -22 175 -127 -153 -274 4 98 -12
4049 -12 -1 147 190 208 -21 -201 -204 57 -104 98 -68 -106 -41 150 -63 162 140 -113 51 57 -82 19 -7 -175
4073 -175 66 123 113 330 178 44 96 81 -77 -199 -285 -32 -70 124 45 -92 11 150 194 11 -93 197 -111
4096 -111 147 -116 64 42 -73 11 306 -84 195 120 -180 209 -59 4 -142 138 -29 -5 -122 73 -60 328
4118 328 158 11 -72 93 72 77 -85 -209 -53 -89 -116 -109 32 94 121 -278 104 126 -106 50 -23 -61 -23 -141 19
4143A9P5r0M4k97N01k4k55L3R1j43n2P8j91K73j37J31k43J22o0J74Q9j40j45K46
4167I9l01K31LM5j65J84k32J16j40m6K41J55q8o8J19r1k89J32J58j0k33R7K37
4190A54m3j95k2J25m7k05K80k54j5L54r3K7j03P3M2M8j73J22n1j0n4J54J35l70
4214a21J02j8L15r8P6k13L8O6k03J61j75r3L3K26j01p0K53j8l20K21L3n8M9n0
4238C5J5M4j31J23L0j50j32J96L9J01l04L27j01L5n8oj72kj38J87K6kJ34p9j06
4263h9p7k9K15J90j47j11q4P5J16j07J28q0j3L03k02J20l93K32L21k04j62J89
4285A91k30J52k15J5K8l2o4J97k49K44j58J42N4P0j24j58K84j21p1O1L5o0L4k39
4309b14K69k34J48N3l0J56k94J32J94k18J49j01m1O9k4N2j29K01l33J8J38q2K26
$$ plain form
4143 19 94 4 48 -249 252 228 -27 6 97 -46 -98 -20 -211 62 -75 56 -187 -65 -125 49 138 -2 -147 99
4167 99 -202 29 32 77 -88 96 -136 -20 -160 -206 35 190 102 34 153 62 -227 -95 63 53 -180 -83 154
4190 154 111 -84 -106 19 -28 -233 47 -207 -222 132 39 66 -37 36 78 126 -47 75 24 14 -40 114 249 -121
4214 -121 -19 -37 278 180 256 43 81 147 -56 105 -70 -163 -130 96 -5 -75 178 160 -160 61 94 36 85 35
4238 35 50 94 -37 86 116 -34 -166 30 69 170 -134 193 92 127 69 63 -109 -111 -249 -62 -36 -38 96 17 -89
4263 -89 -166 -195 20 210 63 -48 -132 -57 59 -48 80 0 -13 290 88 208 -185 47 368 164 2 191
4285 191 -39 113 -102 -87 -59 -91 -155 42 -207 37 -121 21 75 145 21 -137 147 26 -45 16 51 -9 25 -214
4309 -214 55 -179 -31 22 -8 148 -146 -14 180 -38 111 10 -31 38 14 66 -63 138 -195 -177 -39 -121 105
4332A05k38L90k54K2j57r1J38r3L21k75K28j13n5N6K0J20k31K5O0r5p6R3J13J38
4356A51j48k16K56L8k11J40L49p8k66J44p2O5J01k08krj32j01L40n5MP4l31J51
4380a6m9J86j76P2l78M02j0P5M8j42n0J42j46J2J39k42Q6J31j8J25k59K15l8N4
4404A63k05K56k10j1L52k58J30k28J80l51J94k44M04k56p7o0K88J70k46J01R7
4425A89k54K5J5K50k14k51K60M2K4j78J81J39j60l31J41L7K28J4j85R3mj58J36
4448C9k27J96P4l3l43J40J64l72K84r8M19l74N2J21O7j71K4J31J29n5k76K3J6
4471g0o5L04j45J36k23q3J85l9O3l5R4lp1O3j24J28j79j5P8l5m2j66J60L2j08
4496a60L64j66l42L08N9oL3j14P9K51k92k14J59m7r4J84o3K10k97K20O6j09q2
$$ plain form
4332 105 -133 257 3 25 -132 -223 -85 -178 143 -132 96 -17 -72 -16 4 124 -107 -82 -22 -117 -193 -100 13 151
4356 151 3 -213 43 81 -130 10 359 281 15 159 87 152 253 45 43 34 -98 -199 141 86 90 164 -167 -16
4380 -16 -65 121 -55 17 -361 41 31 106 154 12 -38 104 -42 -30 109 -133 -47 84 66 191 -68 147 109 163
4404 163 -42 214 4 -7 345 87 217 -11 169 -182 12 -232 172 -84 -161 -221 67 237 -9 92 189
4425 189 -65 -40 -25 225 11 -240 20 62 86 -92 89 228 68 -263 -122 -85 143 157 -28 65 61 -97 39
4448 39 -188 8 82 49 -294 -154 10 -362 -78 -176 243 -131 -79 42 109 -62 -38 93 222 167 -109 -86 -70
4471 -70 -135 169 24 160 -63 -146 39 0 63 28 122 119 48 111 -13 115 -64 -79 -1 -36 -78 -244 -84 -52 -160
4496 -160 204 38 -304 4 63 57 90 -24 55 306 14 -200 -41 -88 -182 2 -61 149 -148 72 138 29 -53
4519e3r1J80l4k9N0l2M2Q8k44K34k89K21J33j54M1p2j17J01KK8Q8j33N4q2j04
4544a72K14r4j5l5K0Mk7j39K45p7o3K78J15l52j2R4J25n4j99J83J00j26J78l1
4568A60j7rj4K2j35K42j89k54O9J87o6j29N5N9r1k10J49J47M3j21K70jm8j26K16
4593B09k54n3q1K36J37p0j69j9J37o9oJ40k19J69O9l91M37l02j0n7K67J2k69L29
4617A73k73R5J38j63J3k20K55Q0k28K63l25J99OJ99j01P0k62l7J09K8j53K56k59
4640a37K39L8k92Q2K37o1O1k29M4j1J19j08j20j3J43m8J2L27j85n0J9J35k31r3
4664a22J43p1P2j56j90L84l8o7n9L16k81q6L4N7N7M1j16NP2L0K0k4l10J97L6n4
4690a10r5J88m0q6R2P9J12j31n4j28M09p0k98oK92k22j00K61K3N3j62K76n33L94
$$ plain form
4519 -53 -144 36 2 -27 23 -9 33 121 -123 111 -178 43 176 22 63 -9 -126 -25 -23 5 93 -40 14 -68 -172
4544 -172 42 -52 -67 -102 -82 -78 -105 -244 1 -76 -139 139 254 -98 -110 -16 109 55 -144 39 139 13 191 160
4568 160 143 134 120 142 7 249 60 -194 -125 62 -4 -133 -78 -19 -110 -320 -171 -24 19 -102 168 167 119 -7 209
4593 209 -45 -98 -179 57 194 124 -45 -64 73 4 -2 138 -81 88 157 -234 203 -99 -109 -166 101 113 -156 173
4617 173 -100 -5 133 -30 -17 -237 18 98 -130 133 -192 7 13 212 111 181 -81 -118 -9 19 -134 122 -137
4640 -137 102 140 -152 -70 167 106 167 -62 -18 -29 90 -18 -138 -151 -8 -56 -44 283 98 48 67 202 -29 -122
4664 -122 21 -50 22 -134 -324 60 22 -45 -104 212 -69 -155 -121 -64 -7 34 -82 -77 -5 25 45 21 -289 -92 -56 -110
4690 -110 -205 -17 -57 -143 -51 28 140 9 -45 -173 236 166 -132 -138 154 -68 -168 93 116 169 7 283 -250 144
4714A44j02k19P9K37k09J12r9J13K43l92J52j63K36Mk67P8l00M24L3j12Q5k47
4736a70J57o8K28k11N8Q3n6k9J25k41J39k41K47M2K19k29j44J81R4j82J9K23l64
4759a20J22m9N3J84j36p7J42j54K03k82K96l09J99k23O6J26M7m2J23m1j29j42
4781a43J19J00J19j81l1q2K22j69J21jj01J95k23R3j7J05q0k4j45M1K70m93L07
4804BPJ51j41l5j66K79j42K96m17N5j5K17L5k95K40l2j42K55l0J8k14j43L36L16
4828D35m17K09k75j47J85J82n3j56l3J25J15k32N0K11l48k00L15k7j39N9K27k6
4850F0k8qk76M2JK24K32l68L17k60m9Q9J45j41n6L0O5K5L8k8j31L3L9J15k47j98
4876c35J46J07P1o9K23P8l93K45J1j48J39n2o2o8J85j26J33j52K25L4l6r1j23
$$ plain form
4714 144 42 -177 -98 139 -70 42 -57 56 299 -93 59 -104 132 136 -131 -53 -353 71 104 -8 77 -170
4736 -170 -13 -81 147 -64 -6 77 21 -8 117 -124 15 -226 21 63 282 53 -91 90 184 2 21 244 -120
4759 -120 2 -47 6 190 54 -23 119 -35 168 -114 182 -127 72 -151 -85 41 88 46 169 128 -1 -143
4781 -143 -24 76 195 14 -17 -99 123 -46 75 74 -27 168 -55 38 21 126 46 22 -123 -82 188 -305 2
4804 2 9 160 19 -16 -182 97 -45 251 -166 -111 -126 91 126 -169 71 39 -103 152 122 140 -74 -217 119 435
4828 435 18 227 -48 -195 -10 172 119 -37 -70 55 170 -62 -12 199 -149 -349 -34 -61 -200 -141 86 60
4850 60 32 24 -252 -210 -209 15 247 -121 196 -64 -113 -24 121 -20 -76 -46 19 44 82 54 -77 -44 -5 110 -137 -335
4876 -335 -189 -82 -11 -80 143 221 -172 73 84 -64 75 23 -39 -107 78 -48 85 -67 158 192 156 65 -58
4899e8J86O3k01l3L9j78L40P9r5k24J57r9l6j12J89K8m4np2l8K90k74K71j77M5
4924D1k35J68j6j06L47pj96J54k44L25k67R7j54N0L3p7K7K5J31o0j29j56M25j62
4948A4m5p5qp3K10N3p6r3j4L7j2k5L50j96K19l81L00l17J39L0J44l31K13l6j03
4973g6K55k50J25j43j04N05l24j15L3K4J86k56Q3PJ99j20qj58J51j29Lj31K14
4996b9J8p5J71j25r3K05j60R0N8l0J02k07M5L47n08K48j07J64k63J48R0j05k20
5019b36J85J17J65n26K81J98J04k51q1J81N3j43j42p4j78K00K60Kk87K27j81j01
5041b27J16L18j67K3j7r1L49m70K00K19k39P0o3j14J69j79j02J00J6K08j13J78
5063A84l78J94q0R8R8o0j32J05n2K8j30K31j57K92k49J58j63p9R7K5Q1N9k78P3
$$ plain form
4899 -58 128 191 -10 -43 -4 -182 158 237 142 -82 75 -24 -60 -172 17 45 1 -4 -76 -114 176 -98 173 -4 41
4924 41 -194 -26 -42 -148 199 192 -4 150 -94 231 -36 61 -93 -43 -10 -87 -60 -35 96 36 -93 -249 176 14
4948 14 -31 -106 -114 -187 23 76 0 -93 -107 -70 -82 -107 243 47 266 -115 185 -132 7 37 181 -150 63 27 -76
4973 -76 179 -71 54 -89 -193 312 -12 -127 -94 -70 116 -140 -57 -50 149 29 21 -137 14 -115 -112 -243 -29
4996 -29 -11 -86 85 -40 -133 72 -88 2 60 30 132 -75 -30 317 -191 57 -50 114 -149 -1 89 -16 -236
5019 -236 -51 66 231 -295 -14 184 288 37 -44 137 190 47 -95 -169 -347 -147 113 115 -172 55 -126 -227
5041 -227 -111 207 40 63 46 -45 304 -166 34 253 14 84 21 -93 76 -103 -205 -105 -89 119 6 184
5063 184 -194 0 -80 18 116 56 -76 29 -23 5 -125 106 -51 241 -8 150 -13 -92 5 30 111 170 -108 -35
5087c5J3O2p6m4J77l48K25J68l6k38K38j6l7j12K9M8n2O1j40L72k31m2J09k46
5111a51N9J69j26J35j16Kj30M93m26L09j08j00J22ml18R7l9M1K42j14m4nk9k4
5135f5P8K4k03j71M77k72J41n6J15o2Ml3J7J56k40J28r9jj00J86R0j97N8J8k12
5160b19L2M72m21PJ47j66q5J65k11L75m5K8J89j34j78J80q5J16J28l81K99j88
5182B5q1l8l2J35K9p0J52l21J96l6J27P1k60k2J0jo9J26K04k18L7P5l38L71j98
5207a26L48k28K34j69Q6K0j88m5k1J20N1j40J80k37L9k6Q8k05L6K30O1j25J41
5230A24l44L1J18J16J43j35M7n8RJ4j28J63j02J35l00J54j16P8o9M2Q4N9j20n3
5254a08L3N5j24K79j66j30K35K1l34P7J21J01p3L8q6p5J74j5J49l50K09k37K50
$$ plain form
5087 -35 -22 40 -36 -80 97 -251 -26 142 106 -132 106 90 53 -59 -30 18 -34 27 -113 259 28 -14 95 -151
5111 -151 -92 77 -49 86 -30 -28 -158 335 -91 218 110 10 132 128 -190 -93 -132 -91 151 37 -7 -12 -41 -65
5135 -65 13 37 -166 -337 140 -132 9 -47 68 6 10 -23 -6 150 -90 38 -61 -62 -162 24 114 -83 -25 -7 -219
5160 -219 -187 285 -136 -129 18 -148 -233 -68 -279 96 51 79 268 134 -44 136 51 167 295 -86 213 25
5182 25 -56 -94 -126 9 38 -32 120 -201 -5 -41 86 157 -103 -125 -115 -116 -185 -59 145 -73 -36 39 -299 72 -126
5207 -126 222 -6 228 59 145 165 -23 -68 -89 31 82 -58 122 -115 -76 -102 -14 -219 -183 47 108 -17 124
5230 124 -220 -189 -71 45 188 53 100 42 51 65 -63 100 -2 133 -167 -13 -129 -51 -120 -78 6 65 -55 -108
5254 -108 -75 -20 -144 135 -31 -161 74 95 -239 -162 -41 60 -13 25 -61 -136 38 23 172 -178 31 -206 44
5277D4M0k30J63l19J84J96J17J2j99J56k18P0R0J34k03j57j37L57m6l9j00l6J69
5300D8L2k9n7M3J62j26m46M53J30l40P2k1p3K37l6J34k37K7K44p1j3l04n9Q7J78
5325C5r7J9J7j04K70l26QN9J00J54k47R6J56O3j72O2k10K02M0k08k0K36nk90J08
5350e4jO3M4j52K7L74l66l35J98K04j56J48n5K43j57J05j79J55j56J96r8J08k53
5373i7J33j89K23J07q9k65J19J09o6k01K13O9J88m78J24J59n8l3M2l4K11l53L53
5396A87%l80J71j76K57p0k50K97qj4q0O6P4J20j37l58M83n28K56J27k3M1L7k24
5420a32K07m09L36K26k37J4k04K70j53R0m2J6KK51n2k34K65l10q2J93LJ04k3k51
5444a52L75j61j02j40K06l80M43j51O3mR5l2j36K69l03K03j79L8J28p9J2k72L38
$$ plain form
5277 44 84 -146 17 -302 -118 78 195 207 8 164 -54 16 106 240 37 -120 -257 100 54 15 -85 -121 48
5300 48 80 51 -6 37 199 73 -373 80 210 -130 -58 -79 -152 85 49 183 -54 -27 217 146 133 -171 -230 -143 35
5325 35 -62 -43 -26 -130 140 -186 -178 -119 -19 135 -112 -16 140 203 31 93 -117 85 125 -83 -103 133 128 -162 -54
5350 -54 -55 8 52 -100 -73 301 -65 -400 -202 2 -154 -6 -61 182 25 130 -49 106 -50 146 48 156 -97
5373 -97 36 -153 70 177 88 -177 -58 51 -15 -216 -3 66 254 -224 -100 59 1 -32 10 -24 187 -166 187
5396 187 187 -193 -22 -198 59 -11 -261 36 28 14 -66 0 74 194 57 -301 182 -346 -90 37 14 55 92 -132
5420 -132 75 -334 2 228 -9 5 -199 71 -82 8 -34 -18 -16 235 183 -51 214 -96 -178 15 18 122 99 -152
5444 -152 223 62 -40 -180 26 -354 89 -62 1 -3 92 60 -76 193 -110 93 -86 -48 80 1 13 -259 79
5467G9j04m3K98n13K48J87jo7k06J94j4J55k60m4K18p0j57J2P5r0l7J90J57l98
5491a91K21M2P4l91J67N3K13j66m0K2M9k99M51J81j92L9k04R0J27j32j10j1L1
5514B4l2o6J15LJ34k06j38j54L57j24J46K9J4j24p5J68M3j32lj40l2Q1M7J01J52
5539A88m5k47j55L29o8j3Q5k12n4M37k28j43K45k53K23j04J36m22K85m1J52j15
5561b0K5l28K98N6n0K57K3j72k75L7K15J8j02K03j33j1K0J17q6r2J30k62Q6R1
5585D5N0n7M9j67j68M98k95J45q7N2j50J24J02j98j5J74J90k78j4K4J09j82q7
5608a36J58Nr4ORk19K77j5K9j5j50K27Mq4J71k60J55n5J39m9p2j25L10j89j2n2
5634c7j57J48k2Q6O4k71J26L27k17j56J13J00l33J09r2k1J96j43J77J36o4N6j70
$$ plain form
5467 79 -25 -68 230 -283 -35 152 151 84 -122 72 58 213 -47 -91 127 57 -100 -88 -13 -103 -140 50 207 -191
5491 -191 30 72 146 -245 -78 -25 188 22 -18 4 53 -246 205 386 194 233 29 119 246 114 4 -7 24
5514 24 -8 -74 41 44 178 -28 -166 -320 37 -87 59 88 102 -22 -97 71 114 -18 -21 -161 -193 -112 -65 36 188
5539 188 143 -104 -259 70 2 -11 74 -138 -192 245 17 -126 119 -134 89 -15 121 -301 -16 -57 95 -20
5561 -20 5 -323 -25 31 -19 238 261 89 -186 -149 66 84 -18 185 52 41 61 178 92 0 130 -132 -46 45
5585 45 95 38 87 -80 -248 250 -45 100 13 65 -85 39 141 -57 -72 102 292 14 0 24 133 -49 -136
5608 -136 22 27 -67 -61 -52 -271 6 -9 20 5 -145 82 86 2 173 -87 68 13 152 103 31 -94 216 27 15 -37
5634 -37 -194 -46 -68 18 82 -189 -63 264 47 -109 4 104 -229 -120 -212 -233 -37 -180 -3 133 69 125 -45
5657d5K6j16K77Oj89M6K8j9L37l10k8q2P7o2J88J6q0o4l0q1J14Pj3J05j29j32
5683a53K97k4j12k75M09k13P0O9J67n4j13j08p7P7O3j84K19J85k23Q4K6o7k49
5706a86J07M1k2R9Q8n6j76J73r2k7j26K80k1k17L40r1j68l8Q7K7l9J62j95J02
5730E2J69j77l2j02J89M9R2k94j50L34J64k87j51L38k05p7j85J93J54j91P1J72
5752A26l83K91J01k9j20j8L1k13L87p1L6k46K38q6J35j57n3M6k9j49l6R6K5N6
5776b2L6l8m2Or1O9R8p7L10np6l58M89j87k39J3j61K99Q8k23J28j93K47n9J49
5801A61j67k07L07k35j03J95K0K23o8Kj21J0m0M3j09l1K44j18M8j66K3pm3L35
5825A96l71L24O0nm27J40J26J14j39K04k18j28J66l82L67p8K72m51J17K86j84
$$ plain form
5657 -45 -19 -135 142 148 -41 5 33 14 351 41 13 -69 8 -54 134 150 70 6 -24 -105 9 16 3 108 -21 -153
5683 -153 144 120 8 -267 142 -71 -1 68 235 181 68 -40 -117 -40 23 -161 58 243 20 104 130 63 -186
5706 -186 -79 -38 -60 39 127 71 -105 68 -24 -51 -177 103 82 -135 205 114 -54 -92 -5 22 -17 145 -50 52
5730 52 221 44 12 -90 99 148 240 -54 -204 130 294 7 -144 194 -11 -88 -273 -80 74 -117 -46 126
5752 126 -257 34 135 106 -14 -32 -1 -214 173 102 138 -108 130 44 179 22 -31 15 -14 -163 -199 -103 -78 -22
5776 -22 14 -24 -66 -60 -151 -82 16 -61 249 244 168 -190 299 112 -127 -114 -275 24 112 -111 17 -176 71 12 161
5801 161 -6 -213 94 -141 -244 -49 -29 194 126 128 7 17 -23 20 -89 -120 124 6 54 -112 -89 -96 -139 196
5825 196 -175 149 209 204 -223 -83 43 157 18 222 4 -124 42 -340 27 -51 221 -230 -113 173 -11
5846a1j26J59j65P0J04K50k36j5m5J45J25k27J77k20Q7K2k83J59Q9j74J53p4K31
5869A95l52K97j14q2J4mp7%J71J32k4pM8k32mJ16k57L05n7m6QJ11k30j72L67P3
5895A79j22l0K1Q5j68l5j79J83J28r9J17jq1Q5k81J20N5j05n9K28l9M19m61L46
5919C06l98R7K58j48k66k9K36k04P9K04j02J51k51J96k5j02Ok17L20k47K68j72
5941d0l25L49M3j22N9J46l7j67j6j5J6K38l31J18m7J9J82J64k76j2j19%R7k2j40
5966b38O7K92j56R5k32O1QR4r7k3K22o9Oj74l5K17r8K42j90J90j41Nr7R7p0K51
5992B27j09R9Qk27K8J39k26j64J47R8p7j00J61l7p4J05j02N3O3j06P1j11K46J13
6016B25k22J44l86K42l7j4P3j12Q4l39M3K27MK34k08L7K0K4K41l28K81q9j10l
$$ plain form
5846 -11 -137 22 -143 -73 31 281 45 30 -15 130 255 28 205 -15 72 94 -189 -30 59 -115 38 -36 195
5869 195 -157 140 26 -56 -42 -46 -123 -123 48 180 156 149 197 -35 -39 77 -180 125 68 22 30 141 -89 -261 106 179
5895 179 57 27 48 133 -35 -70 -249 -66 62 -37 80 79 -2 83 -198 -78 -23 -128 -187 41 2 421 -40 306
5919 306 -92 5 263 115 -151 -180 56 -148 -69 135 33 184 -67 129 104 2 8 -209 111 -136 132 -40
5941 -40 -365 -16 27 -95 -36 110 73 -94 -110 -125 -109 129 -202 -84 -131 -112 70 234 -42 -54 -173 -173 -76 -98 -238
5966 -238 -171 121 -35 60 -172 -111 -103 -9 -106 -129 93 24 30 -144 -179 38 -60 182 -8 182 41 46 -51 46 -24 227
5992 227 118 217 225 -2 26 165 -61 -225 -78 20 -57 -157 4 -33 -107 -2 -104 -51 12 -94 -23 -134 112 225
6016 225 3 147 -239 3 -34 -48 25 -87 -3 -342 -299 -72 -68 166 -42 -5 15 39 280 -48 233 144 34 31
6040C1qj8j85J92L42k78j12NM4j18J01J14j70o9J88L6j39k94M69k00J88j63p8
6063a22J05j30J11L7Lj37L27j96o0O2L9n9j53L14j01J87k90k02P5P3K06K0k20
6086a11K73n6j25J29k53J57j8j66J53K16P8n11L37k57J84q3L3p3j1J56n8J78k25
6109e3K47j95J19m9p4j01p4J49o4K40L6j06j29K7l0n1K05k88J15M19k48k86K26
6132C5q2n5K69j83R2J08p6n9m8MJ21j06o6Q9L8p6l8J8K8o1K00m6j19M4k8n3J0
6159d0NJ81J11m13R3J2J64j52q5J03K7J67k85NK65k91K83j02j28l2J11L09l48
6182d0P0m0j37R6J15Rn7l65J67L90j39q9R3P2j28p4r1L57M0m55J89M4k2L5J44
6207A84j0K4j03k29J43m9j00L80k47J03k41J90K05j12L6r0m3l9N3k63K83M9j34
$$ plain form
6040 31 23 5 -180 12 354 76 -36 -31 13 -105 -4 110 -60 -129 59 95 -44 -338 131 -69 119 -44 -122
6063 -122 -17 -147 -36 1 4 -133 194 -2 -62 0 39 -20 -173 141 40 227 -63 -265 -190 -117 89 109 -111
6086 -111 162 106 -19 110 -143 14 -4 -170 -17 199 277 -234 103 -154 30 -53 -20 -93 -104 52 -6 172 -53
6109 -53 194 -1 118 69 -5 -106 -180 -31 -95 145 181 75 -54 -27 -57 -108 97 -191 -76 343 95 -191 35
6132 35 -47 -102 167 -16 76 184 108 49 1 5 126 20 -46 43 81 5 -33 -15 13 -48 152 106 -13 31 3 -50 -40
6159 -40 -35 146 257 -156 -63 -51 113 -39 -124 -21 6 173 -112 -107 158 -133 150 48 -80 -112 -1 308 -40
6182 -40 30 -10 -147 -51 64 73 16 -349 -182 208 69 -20 73 145 17 -57 -148 209 249 -206 -17 27 5 40 184
6207 184 174 198 95 -134 9 -40 -140 240 -7 96 -145 45 250 138 174 84 41 2 55 -208 75 124 -10
6230a0j15p6J21K17j76k5J12Mj32q7J18j07K92j89o6K78r0O6n1M8n3k05J72o5
6254a9j22J55O6l5m5J1l7J03l89K03j55J31RQ3k80L53J82k79J07l17L21jl0j4
6278Aj87K00K18l12J30q1j86K40J01j24r3J17j06r5J83O7j21k21K60j89K24j6
6300A0r7j06J58l2m8JJ41j50J59j97J93p4q4L03j08j19J01J75j26j10k90J66K50
6323A16j22J27j08j00R1k21L41j33j94N6K72j14n2J9m0n9K58j26l7p2Q1J67j66
6346a6J91k37L5Mn4OJ58j04l1j2n0o5O4J18j18K52L8l3k60K0K48j40j14O1j21
6371a60K69O5j79J60j33K8lK22j90J7k1K5j37j31K00m1l2j13L03j15j71n4K39
6394D8j57J32k5L7k02J98j02jn4J03p5K03j18l6N5KJ10l07M36k67K54j37K62m28
$$ plain form
6230 -10 -125 -201 -80 137 -39 -64 48 52 -80 -167 -49 -156 136 -53 -119 159 69 135 84 132 79 -126 46 -19
6254 -19 -141 14 80 45 0 11 -26 77 -312 -109 -264 -133 -124 -41 -321 32 214 -65 42 -275 46 45 15 1
6278 1 -186 14 232 -80 50 -31 -217 23 124 0 -93 24 -82 -177 6 73 -48 -269 -9 -198 26 10
6300 10 -87 -193 -35 -67 -115 -114 27 -123 36 -161 32 -42 -126 177 69 -50 51 226 100 -10 -300 -134 116
6323 116 -6 121 13 -87 4 -217 124 -9 -203 -147 125 11 -41 -22 -62 -121 137 11 -26 -98 -17 150 -16
6346 -16 175 -62 -27 -23 -77 -71 87 -17 -48 -60 -110 -175 -111 7 -111 141 179 146 -114 -94 154 14 -100 -39 -160
6371 -160 109 174 -5 155 22 50 47 269 79 96 75 100 -37 -168 32 -9 -41 -154 149 34 -137 -191 48
6394 48 -109 23 -2 35 -167 31 -71 -72 -126 -23 -98 105 -13 -49 6 8 118 -189 247 -20 234 97 359 -69
6418f9L5K20o8j54j9q5nK95k30j38n0L74j82M14l91L0j02J09J96k52R1Mj30J47
6442D0k0j3L2j51q3L14j95K8J90j31P9o2R5j34L28l54J1N6j15J08n5L70m48qJ26
6467Hj75J72j60j02K68J55k00p8K06j64l5J14P4j9j41p4J69k87M36l1l40K82m3
6490C5P1J5P2k63q1rJ34j26K3p8J95k74J73J68j2k40K30k07K86j72J43l70L58
6513G1j04j2L21k59J51k70J66j78J51M2l6J03k69J06J09q4K24l08o3K01j75L35
6535B22n6k16J78k57K6KK22Q5l96J84j60l0K88o9j01JK05l75J76K15J34j0l33
6558f5N5Q5j81P0J10L7l53L30l62L48j6k29L3J06J29k20J70l05L27j95Nm1L04
6581A42j64j38M7K09j32J30q7J05j55O2N2N2k95J27L7j92J87j65L53k86L2J00
$$ plain form
6418 -69 -34 186 118 -36 -55 -140 -145 150 -80 -218 -268 106 -76 338 -53 -23 -125 -16 180 -72 19 23 -107 40
6442 40 20 7 39 -112 -195 119 -76 -48 142 11 90 28 123 -11 317 -37 -26 30 -85 23 -32 338 -110 -118 8
6467 8 -167 5 -155 -257 11 166 -34 -112 94 -70 -105 9 83 64 -77 -151 18 -269 167 136 -204 78 35
6490 35 106 121 193 -70 -151 -160 -26 -152 -129 -207 -12 -286 -113 55 43 -197 33 -174 112 -60 83 -287 71
6513 71 -33 -45 276 17 168 -102 64 -114 37 79 43 146 -123 -17 92 8 232 -76 -139 62 -113 222
6535 222 166 -50 128 -129 -103 -101 121 206 -190 -6 -166 -196 92 23 -78 -77 128 -247 -71 144 278 268 -65
6558 -65 -10 75 -106 -36 74 111 -242 88 -274 74 58 -171 -138 -32 97 -123 47 -258 69 -126 -121 -162 142
6581 142 -22 -160 -113 96 -36 94 7 112 -43 19 71 123 -172 -45 -8 -200 -13 -178 175 -111 -79 21
6603B1jK53l32p4L13j74L11l06L84o34L06kj67J98j91K07J56j98M9k0K2k74J03
6626e0J80j31Mm6K40j66l7K38k04j00J03R0o0J02q6k15J79j64J94j93L56k27J3
6649B0j43L16j44j94J96P7j40j04M5R5l4R8j17%OR4K29n23L68O8l35J29m7k59
6673b99L64m0J49m10J06J51k3jJ70k19M7o1lM1j59J75l50M27L62l64J8r9J02J31
6697B15k26k7p7K75l51K83p1L8j66j09K71r1Q9n5p9J39j40%Jk91K81n1L2K01k41
6722a50K07L6l13K15J23k53O9J89k07K12k99oJ73j16J75l52L27k7l08K50J27j22
6744e0M0j63J07j74K95l63L73Q2K8j68L8o4J49j16r6q1J14J84j4K8P3k14R8J05
6768B11k70l1M17l37k71N8j31M05J4N8k09K05j99K71o1j40R4l6k36K06J46j81
$$ plain form
6603 21 20 273 -59 -133 180 6 317 11 395 -239 67 65 -102 96 -95 112 268 70 119 99 121 -153 -50
6626 -50 130 -1 3 -43 197 31 -6 232 28 -72 31 121 61 163 77 -138 41 -123 71 -122 234 7 20
6649 20 -123 193 49 -145 51 128 -12 -116 -71 24 -10 88 -29 -29 -23 71 300 -223 145 213 -122 7 -40 -299
6673 -299 65 25 174 -236 -130 21 -2 -3 167 -52 -5 -66 -69 -28 -187 -12 -362 65 427 63 81 -18 84 215
6697 215 -11 -38 -115 160 -191 92 21 59 -107 -216 55 -36 53 -2 -81 58 -82 -82 -81 -372 -91 -142 -110 91 -150
6722 -150 57 93 -220 -5 118 -135 -66 123 -84 128 -171 -177 -4 -120 55 -297 30 3 -305 -55 72 -50
6744 -50 -10 -173 -66 -240 55 -308 65 147 175 7 45 -19 130 14 -82 -163 -49 135 121 149 222 8 106 211
6768 211 -59 -90 327 -10 -281 -223 -354 51 65 123 -86 119 -80 191 130 -10 84 48 -188 18 164 -17
6790a7J74j11l62N72k37J09k57J44j73J35M7k9j3K39l50k3K27q7J01j37K0M4j85
6813a69L19l27J35K1j36K01Nj90K69J12l16J96r6jj11K4K15p8j62J59k0k89J30
6836a09K03j09L9j81K49M6k19L13k57n1J6J87l15J30P6ml04L77o2q7QK89j44j66
6860g5K01l91K58K16n13K30M96l61K75j84j42K05j71j0P4k66J28j3J51j96K47
6881A59k47k7K54l18oJ98n3J48k30L16k26J54J08k48q3J64j38K9l1M1J04q9k57
6904b78J87j30J56J25LOl46J79m3J37K42p9K0j07k4p0M5j75M5l3K51L1j01j18
6928g7J80J8m0j26j1J31J02k44J17j01j7N9r3L0K86l82L05j58j58J71Pj31J35
6951CM4Q5j77J02K8k71K75k22j1k6M50k74J60k24L38k26j19%j01J35M9M9l1p0
$$ plain form
6790 -17 157 46 -316 256 19 128 -129 15 -158 -23 24 -5 -18 221 -129 -152 75 -12 89 -48 -28 16 -169
6813 -169 150 -177 -42 -21 -157 44 49 -141 128 240 -76 120 24 23 -88 -64 151 73 -89 70 50 -239 -109
6836 -109 94 -15 24 -157 92 138 -81 232 -25 -76 -60 127 -188 -58 18 14 -290 87 25 -62 -54 235 91 -75
6860 -75 126 -265 -7 209 -304 -74 422 61 336 152 10 215 44 34 108 -158 -30 -43 108 -88 159
6881 159 -88 -115 139 -179 -185 13 -40 108 -122 194 -32 122 230 -18 -101 63 -75 -46 -77 -36 68 -21 -278
6904 -278 -91 -221 -65 60 63 69 -277 -98 -141 -4 238 159 179 72 48 -22 23 -152 -107 -140 111 142 41 -77
6928 -77 103 121 81 -45 -56 75 177 -67 50 -51 -68 -9 -102 -72 214 -168 137 -21 -179 -8 -1 -132 3
6951 3 47 132 -45 57 85 -186 89 -133 -144 -170 280 6 166 -58 280 54 -65 -65 -166 -31 18 67 36 -34
6975c4%J1j2O8j03K73R1j61k69K62j89K8L7j43k0L74j47K60k72R1m6j76J11K78
6999C12m42j36N7K54Q6l98Q7K84l2n3K6l20N19l04j11O1J82j35J29k34M86k98
7021B0N9Q6k9k14P0Q8j05o2J03q5K06j70R7j0j38J69j19oK56l78L60j13j81P8
7045a8r2J83j99j61L31R6K6k41m0J05o9Q0j34L00k00J19l8k5K2j39r1J77j35J22
7069b1k47L15K9k9k67K77J07k01l4J00J05M9j04K03k97mJ20j04j79K57l49J91
7091h3R1R0o6R6o0Q8j4k98J75L0K6p8N2p6J97q4M1j05O3k0p3l4j57Q9L4L47l55
7118h4M6L19l04rk0J11m3l4M2j16J95k04K38k18p4m1M22l95K19J18m66L20j86
7141a64K18j5N7k15L43k44j21L25j01K2m9M3j88K08P7k22Nl1k30K41K35r1l37
$$ plain form
6975 -34 -34 -23 -35 33 -70 203 294 133 -136 126 -63 -35 2 -141 -161 213 66 326 54 145 99 -77 34 312
6999 312 -130 -266 -209 45 131 -267 -180 104 72 19 45 -275 244 -60 -171 -110 72 -63 66 -168 318 20
7021 20 79 165 136 -78 -8 80 -25 -87 16 -69 137 -33 64 54 -84 85 -34 -40 216 -162 198 85 -96 -18
7045 -18 -110 73 -126 -287 44 140 166 -75 -115 -10 -79 1 -133 167 -33 86 48 23 45 -94 -185 -8 -143 -21
7069 -21 -268 47 76 47 -220 57 164 -37 -71 29 134 183 79 282 -15 -19 101 -3 -182 75 -274 -83
7091 -83 8 98 32 128 68 156 142 -156 19 49 75 -3 49 -27 170 86 127 22 85 65 -8 -42 -199 -110 -76 271 -84
7118 -84 -38 281 -23 -32 -52 59 16 -18 24 -92 103 -101 137 -81 -155 -196 226 -169 50 168 -298 22 -164
7141 -164 54 39 96 -119 224 -20 -141 184 83 105 56 99 -89 119 196 -26 -21 -52 -282 -41 194 103 -234
7164b34M41j09k1K9J4k60L02k61Q2L9m3j61K6L62l83K48k43P6J07J30j15J19k51
7187a06K56l47K92M4k03K21o1j8l5k92J33m0K90Lk08J14l34K99n4J51K1k50L18
7210A94j31R3k52N4L2k7J50r5k9J61o4j90K15j19j14Q4J1P6j08j49L54k16J91
7233A21j44k8q8q1N07k27J22j29J28m8n6q3k3j85J24k8L96m9l19K4O4k31K01J39
7257A07k41N4m6J52K7J19k70J33J7J41l7R2l79r4O3J24K2O1k7j4Jj4r9O8p2K11
7283I9OM7n8j04j43l6J89J28p3K04j50J47l74M9J81k41K79r2j59qK92l76K9RJ99
7308D4j45KJ07r8J52j14j29J13q1J57J87j17m1j12J11j42j53J60J33j29O2J43
7330A10k14M0J56LJ15j69K9J01l5j37k12K29J11j03Q2k04K02R9k4k90J74K9J4
$$ plain form
7164 -234 207 98 77 106 120 -140 162 -99 -17 22 -21 -182 -156 206 -177 71 -172 -96 11 141 26 145 -106
7187 -106 150 -197 95 139 -64 157 96 78 43 -249 -116 -156 134 137 -71 43 -291 8 -46 105 126 -124 194
7210 194 63 156 -96 -42 -10 -37 113 18 -11 150 86 -104 111 -8 -122 -38 -27 49 -59 -208 146 -70 121
7233 121 -23 -51 -139 -220 287 60 182 53 181 133 77 -6 -29 -214 -90 -118 278 229 -90 -66 -2 -233 -32 107
7257 107 -134 -80 -126 26 53 172 -98 35 52 193 156 248 -131 -225 -162 -38 -16 45 18 4 5 -9 -108 -40 -112 99
7283 99 105 152 94 -10 -153 -189 0 128 55 259 109 256 -118 -69 112 -129 150 58 -101 -109 183 -193 -164 -155 44
7308 44 -101 -99 8 -90 62 -52 -181 -68 -149 8 195 78 37 -75 36 -106 -259 -99 34 -95 -33 110
7330 110 -104 -64 92 95 210 41 70 171 136 -1 -213 16 127 24 106 -98 104 203 179 -111 63 92 106
7353A06j6R5l1p3o7L9r2j06K02O8j25k38J22J27J1J6j23m8j4J55M46m12N5m7j33
7378h3pJ69k48J85N4L1J03m17K74L5p8O5j85P2J77k42l6K50k36j3J16j6J25k93
7402a98P3qJ46J89j34j94J95r1J01p5j51M4R3K0n5L03j71K21l52J49o3n4K69j90
7426F7J8p7nO5N5k42J13j68J62K39j67J35p3J24k13J39J00k33k0l1j95K00M1j18
7450h4L3J49j53K38k97K09j9j15rj61K03l2O4N3j39J71l3k32J64R3J16m2l62J93
7474Hk4J12J2j49j62K48j76N6K24l69K08Q6n5O1o7j82Q1J97l52L64Lj55k57M32
7498A44k71Q4j14K3K54j12J00k72nJ40J90Pl87J42J29M5k63K28l4K9j87KK36k01
7522i3J37j01o9P6j90L13k99L20j62j9K93j23j00J21j94J29P0q1N0J5j17P1o0
$$ plain form
7353 106 90 185 154 81 14 53 -39 -145 57 125 0 -238 -116 11 22 38 -85 -133 -147 8 454 42 97 50 -83
7378 -83 -90 79 -169 16 70 101 204 -213 61 96 18 83 -102 -30 147 -95 -131 119 -117 -130 -14 -30 95 -198
7402 -198 -125 -133 13 202 68 -126 69 -22 79 4 -147 -103 -10 10 -45 258 87 308 -44 105 42 -12 257 67
7426 67 85 8 3 68 123 -119 -6 -174 -12 227 60 195 122 246 33 172 272 39 19 -12 -207 -7 34 -84
7450 -84 -51 98 -55 183 -114 95 76 -39 -48 -209 -6 -38 26 79 -60 111 78 -154 10 103 219 177 -185 8
7474 8 -16 96 108 -41 -203 45 -131 -75 149 -220 -12 74 19 80 13 -169 -88 109 -243 121 124 -31 -288 144
7498 144 -127 -43 -157 -134 120 8 108 -164 -169 -29 161 168 -219 -77 52 97 -166 62 28 57 -130 -128 108 -93
7522 -93 44 -57 -126 -50 -240 73 -226 94 -68 -87 206 83 -17 104 -90 39 109 28 78 93 -24 47 -13
7545a3j14J77q3J6J20k14J78l19K03K38k72L4j5J96j89J26K9k8j98P4k63J34j
7568a84J01J27j44K69j73j56K55k51K48J9M9k23K68l12l0J24k73L81r8k40J57
7589h6J77j66j6j22J45L50j53j70J33p0j88K50k40M59j89l94J74l4L20k85j67
7610b72K79j19L18K6j95j66L1J4r2Q0J61l58L93r5K22k70J96j14Kj69L36k28j15
7633a35K11p5o9M4j51k7M48m34K06J10k35l5L2M6K5j57J70o6Q4L6k08K5P6o3Q
7658a34L91m53J92k21K48N5O3k29k2O6o8Q4j02K91K1k32Q0j59M4K17l40N2L03
7681A47j94Nj1j16J44K42j99r6J30k71N1rj1J55M6J44j70L04l06q0J34K2k41J59
7705b1K24k02O7l1k27J61J94j6k35L10j00j59L2J53l27L0J65Q8PK0n9p6L4K08
$$ plain form
7545 -13 -127 50 -33 -17 103 -111 67 -252 -49 189 -83 -49 -64 132 -57 69 98 70 -128 -54 -317 -183 -184
7568 -184 -83 44 -100 169 -4 -160 95 -156 92 111 160 -63 205 -107 -137 -13 -286 95 -3 -243 -86
7589 -86 91 -75 -91 -213 -68 282 129 -41 92 22 -166 84 -156 303 114 -280 -106 -140 180 -105 -272
7610 -272 7 -112 206 232 37 -129 -98 -84 -176 -96 65 -293 100 5 227 -43 153 39 41 -128 208 -20 -135
7633 -135 76 1 -68 -24 -175 -202 246 -188 18 128 -107 -142 -110 -64 -39 -196 -26 -92 -8 28 -180 -155 -79 -142 -134
7658 -134 257 -196 -4 -225 23 78 141 -88 -110 -44 -112 -28 -130 161 182 -50 30 -129 -85 132 -208 -156 147
7681 147 -47 -42 -53 -169 -25 217 18 -78 52 -219 -168 -177 -188 -33 13 157 -13 291 -15 -95 39 61 -180 -21
7705 -21 203 1 68 37 -190 -29 165 149 -86 224 124 -35 -3 150 -177 -147 18 106 113 133 74 -2 32 240
7729B40l87OQ0j38Q6O5k8J53R8k31o8K39l16K95J14k31j15J57q9k3l8J32k08M69
7753B62k67J04j18J48J7q0q5p1j57J49K96j13j26L15k72J47p0l03K29n7j6P5M6
7776E3jk3k36M96k63P3q1p1J4k96K16J41k8j6J01k39J64j46M70j03j58k3r5K0
7800c1j34J41L6k2R5j11Q7K8j96M2L9p9J74M8N3j85K9p7m1N2pJ82j09j5K08j23
7826H4k64J25O1p0M5j8N2K9J67j81j5Q1j9PL5j24j38L0K15p0p1M5J87j04p2l6
7852a9J07j46J79q9j07J15j87R5k5n1n1K22P4r5J69k76K12k22k4K05j80j51J16
7875a29n0J82K97l65K9r4K06j2J98j37k23J59M6j44o0J65l32K37k41L45o2K2J69
7898B06m6k13J29j17kK99k17J47l93L76J9j71j35K15J01k73l4K56l00J69k8R6
$$ plain form
7729 240 -147 -141 -61 -199 -113 -48 -76 77 175 -56 -124 115 -201 94 208 -23 -138 19 -70 -93 -131 1 -207 262
7753 262 -5 99 -19 129 146 66 -19 -90 -247 -98 198 85 -41 274 2 149 79 -224 5 -52 -68 7 53
7776 53 52 29 -207 289 26 99 18 -53 -39 -335 -119 22 -6 -22 79 -160 4 -142 328 225 67 44 -51 -31
7800 -31 -165 -24 12 -10 85 -26 61 89 -107 -65 -26 -105 69 117 170 -15 14 -63 -104 -52 -59 123 14 -1 207 84
7826 84 -180 -55 6 -64 -19 -37 15 44 211 30 15 96 77 84 119 -5 -143 -113 102 32 -39 6 193 89 17 -19
7852 -19 88 -58 121 32 -75 40 -147 -52 -77 -128 -179 43 117 22 191 -85 127 -95 -119 86 -94 -245 -129
7875 -129 -179 3 300 -65 -36 -130 76 64 262 125 -98 61 107 -37 -97 68 -264 -27 -268 77 15 37 206
7898 206 160 -53 76 -41 -43 256 39 186 -207 169 188 17 -118 97 198 -75 -109 147 -153 16 -12 84
7920H4k92J50j46J06M8o8O2l9K23j6k57L30k55M8Q1J09k77J52j81K76j36l1K64
7943B35o2m10M13k33K73P0o5l83J81J44K0kj80P4j04J7rJ7K30o7q0j7N5k34M9
7968f8J36k29K84j10J72J50l82K4Q2N2k25J25j15N3j29J96r2K2K23k31J87L2k61
7991a04LJ61o3n4J1J08J6o2j51J37R6j38K49j69J5P7j54J49O1j75p9J85p4p7j22
8016a54k3m1K74J20m66J11K55K01k18k4J06j9j82J87j44J18j40J58k26J67l63
8037c03O4L36j00J01j16q1K31p9j13J9L9k86J63K7J5J11Nj91J58J24p4j55M23
8060C18j66j50J07j08o3Q6r9R8j09J11j9M3J75k56J82k56J31j23K92l13J00J3
8082fo3K8j60K27J0j14O1Lj52J89j22J22J18K6N3l59J63J16K8j53p8J18k31L52
$$ plain form
7920 84 -208 -58 -204 -98 -50 -118 -56 -95 128 112 -145 185 -70 -22 59 168 -109 43 -138 138 2 -29 235
7943 235 173 -237 176 -57 216 286 221 -162 19 163 183 181 1 75 -29 -12 -21 -4 226 159 79 62 117 -117 -68
7968 -68 68 -161 123 13 185 335 -47 -23 59 111 -114 11 -104 -51 -180 16 -76 -54 169 -62 125 157 -104
7991 -104 -101 60 -3 -57 -46 62 78 16 -135 2 98 -40 209 40 55 132 -22 127 188 13 -66 119 45 -32 -154
8016 -154 -177 -218 56 176 -290 -179 76 277 59 35 141 122 -60 127 -17 101 -39 119 -107 60 -303
8037 -303 -239 97 -3 98 -18 -99 132 53 -60 -41 -2 -288 -125 -98 -83 28 33 -158 0 124 50 -105 318
8060 318 152 2 109 1 -62 24 -75 23 -86 25 6 49 224 -32 150 -106 25 -98 194 -119 -19 -6
8082 -6 -69 -41 -201 26 36 -78 -17 -14 -166 23 -99 23 141 167 220 -139 24 140 168 15 -63 55 -176 176
8106A76k79P3M8K44l38j9n2K93r3j75J81j05K62j43J06k90K09k16Q2K50k07j9
8128a2J32k55K0J65k19J36J99j05Pj52K33p0M0j96J26l49K33J48k13K56j05k60
8150b41J48K40j29j0j14k4L4J66p3K49k34J05k15J87j76j38L47r9J8q0J62j19
8172DL2J97k10Qr6o4m2J37m9l5L84j49q6J58o0n1q9j03k5
$$ plain form
8106 176 -103 -30 18 262 -76 -95 -147 146 53 -122 59 -46 216 73 179 -111 98 -118 -36 214 7 -12
8128 -12 120 -135 -115 50 -169 -33 166 61 68 -84 149 79 119 -77 49 -300 -67 81 -132 124 19 -241
8150 -241 -93 147 18 8 -106 -130 -96 70 -3 246 12 117 -98 89 -87 -225 122 23 41 -39 123 4
8172 4 36 233 23 31 -65 -129 -171 -34 -83 -118 266 117 31 189 129 78 -11 -114 -139
8191a39
$$ Imaginary data points
##PAGE= N=2
##DATA TABLE= (X++(I..I)), XYDATA
0@%%%%%%%%%%%%%%%nJ3j6J6j6J6j6K3l1L2l9M7n1N9p0P9q8J02j16J29j45J65j84
38i6K02k26K52k79L10l42L78m18M62n08N59o17O79p49Q26r12J009j116J239j384
58g31J552j751J993k293K673l176L875m907O588r755J7632p0659r0108K47450
72I8383J4988k37663M8031K24633j13451j83543J59934J37243j97467p4430K09241
83H5899J3927k08143M5996J85590r5974j55318J36570J10131j63060o0620J72794
94F7792Q649j67226L7963J50085p8477j20839J10252Q5230j30209m2044J37886
105E9062R64j31886L8137J16696p0652r2647R6419O1044j11643k6579J15214q682
117D5447j09196L8980R4178o6228p2279Q5300M3543r6744j2527R7335j7975q8902
$$ plain form
0 0 0 0 0 0 0 0 0 0 0 0 0 0 0 0 0 -5 8 -8 8 -8 8 -8 15 -16 16 -23 24 -27 32 -38 41 -47 55 -61 68 -77 88 -96
38 -96 106 -120 132 -147 163 -179 199 -219 243 -265 294 -323 356 -393 433 -479 530 -586 653 -731
58 -731 821 -930 1063 -1230 1443 -1733 2142 -2765 3823 -5932 11700 -58959 -149067 98383
72 98383 113371 -124292 -76261 148372 34921 -148622 11312 148555 -48912 -123342 85899
83 85899 99826 -108317 -62321 123269 27295 -128023 8547 118678 -44382 -105002 67792
94 67792 76441 -90785 -52822 97263 18786 -102053 8199 93429 -36780 -78824 59062
105 59062 60026 -71860 -33723 82973 12321 -80326 16093 77137 -34506 -61085 54129 45447
117 45447 -63749 -24769 69409 3181 -69098 16202 59745 -36999 -49526 47809 29834 -59068
129e9068M5280P3307o7200n0570Q2999K3491q8842O493Q5446l2908p2978N5903
141A353N4196p2308k9646Q1832J264q1382K6130P1070n0276n4165O7821L1391
153D7280p9662n033Q2331k3443p5417M7818O0271o8158l8958Q1387J3696q6846
165d4734J4279Q4078m1598p1340O5984N1391q2695k5788R2648k110r3776L1764
177b1897Q6123n9066o9087Q0519M5421r4786j8486J00251j1023r8458L9727Q6471
189F5709o5752o7363Q4570M2093r6373j4383J00493j4334r6272M2533Q4127o5942
201h94o3945Q3782M0666r3716j3913R7711j3359r2836L9508Q1189o2844o1807
213f0458P9104L8312q9790j3014R2308j4400q8427L9733P6031o2175n7937P7663
$$ plain form
129 -59068 -13788 59519 -7681 -58251 24748 48239 -40603 -34110 51336 18428 -54550 1353
141 1353 55549 -16759 -46405 35427 36691 -44691 -18561 52509 2233 -51932 15889 47280
153 47280 -32382 -37415 44916 21473 -53944 -6126 54145 -14013 -52971 28416 42112 -44734
165 -44734 -30455 53623 12025 -59315 6669 58060 -24635 -50423 42225 40115 -53661 -21897
177 -21897 64226 5160 -63927 16592 62013 -32773 -51259 48992 37969 -60489 -20762 65709
189 65709 -43 -67406 17164 59257 -37116 -51499 48994 34660 -61612 -19079 65048 -894
201 -894 -64839 18943 59609 -34107 -48020 49691 36332 -56504 -16996 64193 1349 -60458
213 -60458 18646 56958 -32832 -45846 46462 32062 -56365 -16632 59399 -2776 -60713 16950
225A6950L5251q7609r854R0674j6197q4954M1655P2348o1803n2852P7009L0397
237E1015q4308n153Q5633k0163p8446M3575O4070o2041m5305P3984K2451q0115
249c4803O29P7933k4653o9460M4561N3850n9146l5029O7493J4113o9670P241O6014
262C9073k6490n5663M3312M1189n3635k3052N9098N397n8831J2636N4070k9242
274G862m3180M0792K9383m8966j3841N0971k503m9344J7190M2230l0741l1677
286c1824L9602J8520m4509m063M4872r940m0921K2772L3998l3056k2434M0098
298A3115R807m1903L544M0424j5524l5329K6475K7114l5162j5772L9396L239m0570
311b1146Q354L8320k0468l2500L0501K2678l7423j2139M1388o42m0782J2361L7205
$$ plain form
225 16950 52201 -35408 -45262 45412 29215 -55739 -14084 58264 -3539 -56391 20618 51015
237 51015 -33293 -38446 47187 27024 -51422 -7847 56223 -5818 -51123 22861 45312 -34803
249 -34803 -34174 43759 19106 -50354 -5793 48057 -11089 -46118 21375 35488 -34182 -26941 39073
262 39073 12583 -43080 232 41421 -12214 -35266 23832 29229 -29602 -16966 37104 7862
274 7862 -35318 5474 34857 -14109 -27950 23021 20518 -28826 -11636 30594 -147 -31824
286 -31824 7778 26298 -18211 -22274 22598 12658 -28263 -5491 28507 -4549 -26983 13115
298 13115 22922 -18981 -15437 24987 9463 -25866 609 27723 -7439 -23211 16185 19424 -21146
311 -21146 -12792 25528 5060 -27440 3061 25739 -11684 -23823 17565 16923 -23859 -11498 25707
324B5707k3658l0120L3066K0442l9376p682M1915m619l9976J6648L5502k7379
336D70k6942L5775J6217m1149l192M1683r256l9043K0521L2559l0635k3526L7278
349A0760J1781m0985O44M0033j2693l6046K3269K8716l1800j8805L7594P399l8603
362a8736M155L7294j5073l1646K4477K4554l0607j5246L4525M275l4757O433L1456
375B1104j5428k6629K2784J8865k7948j1396L0733J425l0655P282K7283j4855
387B565k2651K1324J6116k5510q452K7975Q8k6637Q055K4214j4656j9078K0330
400C683J3494k4024o051K5639j790k4834Q867K1782j5139j7547J9909J0984k3658
413h685m530K4213l215k2705R682J9126j5292j4465J9939Q559k1975j043K1894
$$ plain form
324 25707 2049 -28071 4995 25437 -13939 -21621 20294 15675 -24301 -7653 27849 470
336 470 -26472 9303 25520 -15629 -18821 22862 13606 -25437 -4916 27643 -2992 -26518 10760
349 10760 22541 -18444 -17800 22233 9540 -26506 -3237 25479 -6321 -25126 12468 19867 -18736
362 -18736 -14581 22713 7640 -24006 471 25025 -5582 -20828 13697 17972 -16785 -10352 21104
375 21104 5676 -20953 1831 20696 -7252 -18648 12085 13510 -17145 -9863 17420 2565
387 2565 -20086 1238 17354 -8156 -16608 11367 11455 -15182 -7127 17087 2431 -16647 3683
400 3683 17177 -6847 -12898 12741 10951 -13883 -5016 16766 1627 -15920 3989 14973 -8685
413 -8685 -13215 10998 7783 -14922 -5240 13886 -1406 -15871 4068 12627 -9348 -10391 11503
426A1503n291j9515J1381J6733j6262j0695J9035N154k0683J393J9820p774j6727
439a1928J2282J2445j6704p425J8274J578j9077M713J6398r626j3300J3277R331
452A0238j5825m317J6802l89j6444O190J4210r729j0627J2785O883j4174k428
465f825J4904k378j3557O026J1260r269q220J0879M992j2676j364J2532k785j1859
479h340O028R360q142o764R774L923j0921m98J1401k511j0684O189Q662p863o356
494f742R610L851j0854l33J0861k588j0035N539P983q185n347R384K564j0213
508d505K94R730l616q653O109O408p771m138Q626J598r470J910Q868m770o663
523f043O760M545p423k181Q171J6q208K980P333n172n421O564L212p153j220O840
$$ plain form
426 11503 6212 -13303 -1922 14811 -1451 -12146 6889 12043 -8640 -7247 12573 4799 -11928
439 -11928 354 12799 -3905 -11330 6944 8522 -10555 -5842 10556 930 -12370 907 10238
452 10238 -5587 -9904 6898 6509 -9935 -3745 10465 736 -9891 2894 9777 -4397 -6825
465 -6825 8079 5701 -7856 -1830 9430 161 -8059 2820 7812 -4864 -6228 6304 3519 -8340
479 -8340 -2312 7048 -1094 -7858 1916 5839 -5082 -5580 5821 3310 -7374 -1185 7477 -386 -6742
494 -6742 2868 6719 -4135 -4468 6393 3805 -6230 -691 7292 -893 -6240 3144 5708 -4505
508 -4505 -4211 5519 1903 -6750 -641 5767 -2004 -6142 2484 4082 -5388 -3478 5390 620 -6043
523 -6043 717 5262 -2161 -4342 3829 3845 -4363 -1383 5950 778 -4643 1921 5133 -2020 -3240 3600
539C600j042o954L183N480m881l778N195J885n779n50N829j149n041K805M077
554B880l356k931M445J641l816q98M578k40m234J803L491k709k681L488J496l728
570g71j102M073q04m003J528L380k929k625L305J614l706j085M295l38l860J710
586a318L604k485k210L274J982l685o18M096m47l764J824K840k587k197K937J292
602B538l867k8L095j385k959K024J985k902r86K927J24k836R39K507j497j981
618b302K614J168k308j43K471j14k132R77J847j712q28J657N4j372K9J166m65
635F07j229J90Q60p51p77Q01K11q13L6M42M43q44J03P28p4j18L8O47j06n96N29
656C27P87r22k54J168j35j076K9J170l66j442Q44R66j779n27J843m33j562M42
$$ plain form
539 3600 2558 -4396 -1213 4267 -614 -4392 803 2688 -3091 -3641 2188 1039 -4002 -1197 2880
554 2880 -476 -3407 1038 2679 -1137 -2035 2543 2303 -1931 -128 3363 654 -2027 1461 2957 -771
570 -771 -1873 2200 1396 -2607 -1079 2301 -628 -3253 52 1666 -2040 -3125 1170 832 -3028 -1318
586 -1318 2286 -199 -2409 865 2847 -838 -1456 2640 2193 -1571 253 3093 506 -1691 1246 2538
602 2538 -1329 -1357 1738 353 -2606 -582 1403 -1499 -2485 442 566 -2270 -1331 1176 -321 -2302
618 -2302 312 1480 -828 -971 1500 1386 -746 231 2078 366 -462 1195 1249 -123 -94 1072 607
635 607 -622 -432 428 -323 -1100 -299 -88 -901 -865 -423 20 -824 -721 7 -67 -185 -147 500 394 -202 327
656 327 1114 192 -62 1106 971 -105 -76 1094 728 -714 130 1096 -683 -1210 633 200 -1362 -920
674i20J452q78j214J711L78j629J40J617o71j199R56J171j262j18J442j47j242
691d13J012O35j323L7Q68K7j005M37M60n87m62O97R6j395M38N96o29m38N31K70
711a48p99J12J196q14l00J076j87j49j05L93K12n19O84k0n05L97L55l99m77R11
731I14k88p46J05N24p56n77P51K31j255K78N48m07k63M44K63n31L90L52K81m59
751b01N11K39l11L22L1Q4K74l24J01m39K32n2m13J16J56p37R7K91m53l67M31K80
773a32n91k24Q56l42o69Q42P22o72k35J196N7j195K95J505p16j139J493P43k267
792d73L67J356n76j830J298J064k049m63K005k74k400J232J583j626j026J844
808C2Q16k231K93K260q47j472J426Q63j665m03K337rk289O84K199j723j442J777
$$ plain form
674 -920 532 -346 -1560 151 529 -1100 -960 657 -14 -1213 -257 914 -348 -466 976 829 -413
691 -413 599 1234 -89 -52 816 843 -162 275 735 148 -314 383 479 -916 -478 118 -511 -949 -418 -148
711 -148 -947 -835 361 -453 -753 323 136 -13 -118 275 487 -32 652 632 127 524 879 480 3 914
731 914 626 -120 -15 509 -247 -824 -73 158 -1097 -819 -271 -678 -941 -497 -234 -765 -375 -23 258 -201
751 -201 310 549 238 560 591 675 949 625 726 287 519 467 54 170 326 -411 -314 -23 -476 -843 -412 -132
773 -132 -723 -947 -91 -433 -1102 -260 462 -210 -445 751 808 -387 -92 1413 697 -442 1051 1794 -473
792 -473 -106 1250 674 -1156 142 1206 -843 -1306 699 425 -1975 -743 840 -786 -1812 32
808 32 848 -1383 -1090 1170 323 -1149 277 1140 -525 -928 1409 1400 -889 -205 1994 271 -1171 606
826F06P34j795m38J985p20j796O44J976j377j261J562O74j768m02J893l07j323
843a113N40J729r77j141J342Q64j377p57J943J51j864M56J896j227j620J646J128
860A619k132q28K319L3k576P03K210j553k146K201J750k733j044L348k72l362
876b463J566K992k062k503L384J474l430p67M231q33l785K087L417l261j852L289
892A484P21l680k36M301j700l719K779K264l739q81L700J24m093J075L905k598
908b93k826L402J774l555k75M043o87l796K025L389k807k287L205J605m127J29
924a081L250o57l879J793K870k794k124L204J016l520n15L523j52l824J781L155
940B046k562k014L577J146l624M9L712q99l619K054L355l021k417L666J492m222
$$ plain form
826 606 1340 -455 -893 1092 372 -1424 -780 1196 -181 -1442 120 794 -974 -1376 517 210 -1113
843 -1113 -573 1156 179 -962 380 1244 -133 -890 1053 1204 -660 -204 1692 465 -1155 491 1619
860 1619 -513 -1341 978 1011 -1565 -862 1348 -205 -2351 -150 1600 -1133 -2177 1171 899 -2463
876 -2463 -897 2095 33 -2470 914 2388 -1042 -1809 2422 1589 -2196 -109 3308 47 -1805 1484
892 1484 2205 -1475 -1711 2590 890 -2829 -50 2214 -1525 -2406 1294 1418 -2675 -1600 2305 -293
908 -293 -3119 283 2057 -1498 -1773 2270 1583 -2213 -188 3201 394 -1893 1312 2917 -1210 -1081
924 -1081 2169 1512 -2367 -574 2296 -498 -2622 582 1598 -1922 -2437 1086 934 -2890 -1109 2046
940 2046 -516 -2530 1047 2193 -1431 -1382 2330 1431 -2188 -134 3221 200 -2217 1449 2941 -1281
956a281n02M544j536m415K480L538l669k354M077J046m670K65N308k095m621L677
972b08L551m479k128N266O69n187J286M738k549m181M308K827n177j188N361q66
988B043n250K398M512m058l343M710J903n417k73N554j592m837K733M330m231
1003h18k681M959J406n040L29M736j649m285L136L501m000k500N225M38m994O67
1019a570M529k015m052L293K912m000j846M573R8m952J269M511k346l990L278
1034c08L227m575j566N226K44n190J451M856k579m188M052K995m947j419N757
1049C036k49n676J566N213l284m139M446K612n411j154O002j223n416K245M881
1064C449l958l831N183K602o279j04N965j599n670L932M509m812l014N783J203
$$ plain form
956 -1281 -1783 2761 1225 -3190 -710 2828 -841 -3195 882 1928 -2742 -2477 2831 736 -3885 -208
972 -208 3343 -1136 -3264 2002 2671 -2516 -1230 3508 959 -3222 1086 3913 -1264 -2452 2909 2043
988 2043 -3207 -809 3703 -355 -3698 1012 2915 -2502 -2775 2779 1187 -3650 -917 3413 -818
1003 -818 -3499 1460 2866 -2174 -1845 2891 1242 -3043 93 3594 -406 -2906 2319 2757 -2237 -1570
1019 -1570 2959 944 -3108 185 3097 -903 -2749 1824 1922 -3030 -1761 2750 404 -3586 -308
1034 -308 2919 -1656 -3222 2004 2248 -2942 -1491 3365 786 -3402 650 3645 -1302 -2721 3036
1049 3036 2787 -2889 -1323 3890 606 -3533 913 3525 -1886 -3040 2962 1739 -3677 -1432 3449
1064 3449 -509 -4340 843 3445 -2834 -2938 3027 1428 -4242 -310 4199 -613 -3627 2156 3359
1079C359o003P41O151k864m976M150L618n048k558N990M49o326J149N531l240
1094A23m065L957L074m974j691N656k8n456J905N136l487l732M374K577m821j185
1110b637N763o24n213K235M338l472l363M091K382n359q48N250p41n507K522M240
1126C057l325l480M331K172m997o69N548r89n192K835M045l687k903M752J779
1141C277n198j03N329j624m900L129L891m366k557N044Q63n483P71N187k456m694
1157c890L911L075m833j905N454L24n278J512N100l459l735M702K430n163o01
1172b356N347r14n029K399M453l783l190M520J570n124l76N327j137n045K912
1187d26L518l786k614M378J204m645L68M274j265m187K841L368l876k022M482
$$ plain form
1079 3359 -2644 -1903 4248 1384 -3592 558 4176 -872 -3430 2560 3009 -3317 -2168 3363 123
1094 123 -3942 15 3089 -1885 -3576 2080 2052 -3404 -1499 3637 150 -3582 792 3369 -1452 -2637
1110 -2637 3126 2502 -2711 -476 3862 390 -2973 1118 3500 -1859 -2707 2543 1802 -3705 -1183 3057
1126 3057 -268 -3748 583 2755 -2242 -2911 2637 1648 -3544 -709 3336 -351 -3254 1498 3277
1141 3277 -1921 -2024 3305 1681 -3219 -90 3801 -565 -3122 1922 2785 -2698 -1927 3260 804 -3890
1157 -3890 21 3096 -1737 -3642 1812 2136 -3142 -1630 3470 11 -3724 978 3408 -1755 -2356
1172 -2356 2991 2077 -2952 -553 3900 117 -3073 1447 3017 -2107 -2483 2844 1707 -3338 -426
1187 -426 3092 -694 -3308 1070 2274 -2371 -2003 2271 1006 -3181 -340 3028 -848 -2870 1612
1202A612R05m488N94M119j386m171K989L232m124j660M469L67m515N16M366k063
1218G62m001L523K765m094k097M684M62m775R32M580k287l924L736K745m430j425
1234b844M871Mm650J732M379l080l120L716J955m462o13M664n43m490J889L952
1250C360l373l036M274J405m852k51M818j509m413K797L522l558k226M019J078
1265B055m376N60M270j417l989K888L211l818j511L980M51l921Q13L644k089l052
1281b301K557K234l444j077L353j49l823J133L462j879k720K576K107l213r95
1296b179L767k05l415J220L120j973k318K968J803l329r31L094L6l377J158K879
1312B318k197k339K644J746l712l78L129l21l202J575K476k295k035L135J384
$$ plain form
1202 1612 2517 -1971 -1377 2742 1356 -2815 174 3406 -718 -2378 2091 2458 -2057 -1541 2825 762
1218 762 -3239 284 3049 -1045 -3142 1542 2004 -2771 -1839 2741 454 -3470 266 3011 -1419 -2844
1234 -2844 2027 2031 -2619 -887 3492 412 -2708 1008 2963 -1499 -2112 2552 2009 -2481 -592 3360
1250 3360 -13 -3049 1225 2630 -2222 -2473 2345 836 -3577 -780 2742 -816 -3042 977 2055
1265 2055 -2321 -1761 2509 1092 -2897 -9 3202 -616 -2127 1853 2304 -1617 -804 2840 751 -2301
1281 -2301 256 2490 -954 -2031 1322 1173 -2650 -1517 1945 66 -2654 -78 2029 -1184 -2179
1296 -2179 1588 1383 -2032 -812 2308 335 -1983 985 2788 -541 -1472 1622 1658 -1719 -561 2318
1312 2318 121 -2218 426 2172 -1540 -1918 1211 890 -2312 -737 1739 -556 -2591 544 1928
1327A928l709K66L248q80k731J638K574k460j878L492K62l069O27K865j254k960
1343b041K337J897k934j161L093n4k988P46K704j905j942K488J293k597n16K809
1359A229k64k672J064K283j725j466K243R28k443k54K398m40k273J409J512j503
1375B6j418K066P85k462j92K528q92j829R61J820j717j248J890P99k126l57K090
1392G24j06k166J250J736j413j438J768J033k051q0K209n85k170J131J875j617
1408A00j231J853N21k161J83J899n82k171J559J410k016r68K062K43k119M56K078
1425A116r39j717J545J323j711o26K037m4j855P50J841j474r74J257Q90j946m09
1442i36J960j95j761O66J253j466q04J601M68j445l87J585o79o82N01R48j034
$$ plain form
1327 1928 -1781 -1515 1733 853 -1878 -240 2334 -126 -2004 1488 1750 -1319 -692 2173 919 -2041
1343 -2041 296 2193 -741 -1902 1191 1137 -1851 -1105 1599 -306 -2248 240 1533 -1064 -1580 1229
1359 1229 965 -1707 -643 1640 -85 -1551 692 1620 -823 -1077 1321 881 -1392 17 1529 26
1375 26 -1392 674 1459 -1003 -1195 1333 441 -1388 -427 1393 -324 -1572 318 1117 -1009 -1366 724
1392 724 618 -1548 -298 1438 25 -1413 355 1388 -663 -743 1466 881 -1289 -158 1717 100
1408 100 -1131 722 1243 -918 -735 1164 582 -1589 -30 1380 -636 -1604 458 701 -1418 -962 1116
1425 1116 177 -1540 5 1328 -383 -1009 1028 984 -871 -121 1720 246 -728 529 1419 -527 -936
1442 -936 1024 829 -932 -266 987 -479 -1283 318 786 -659 -1046 539 -140 -822 -321 627 -407
1459d07j14Q60L00r85J82R43k34r31N20Q14p56m72Q03M20j150k53J110o5j419
1478h34N02N76m96o70P76M56p09m41J166k41q70K34J212o39m89P56N04j107l4
1497c48J246l79q04M91P08q44o34J015K07j259K88R22l87j541J237O71q24q41
1515a076J268K79j453O54R12n55o20N80M32o50j61R01o6q88O38N77p77l22P07
1534C80L16q35j84P60k97n30K93L85n00k01M08P1n29j12N98j05m40J76L56l43
1554c33m0L88K73j86l35N83j38r9l42N46R0m67l3O98m39n66Q13L22q43m29O06
1575F9K25q75M59O20o61m33N72L34o92l04P92j53n21M62O66q58p7Q84j75n20L33
1596A47O19o60l79M40L59n49m83R58j14p04J95N43k79n41K56M18o86N5L83J01
$$ plain form
1459 -407 -521 339 639 -346 -164 779 545 -386 134 948 192 -280 523 943 -207 -460 650 585 -834
1478 -834 -332 244 -252 -922 -146 310 -399 -840 326 85 -785 -551 661 22 -467 289 793 -314 -348
1497 -348 898 519 -285 206 914 70 -564 451 658 -601 -313 609 222 -1319 -82 589 -235 -1076
1515 -1076 192 471 -982 -328 584 29 -591 -11 421 -229 -390 511 445 -443 195 772 -5 -327 380
1534 380 696 -139 -323 437 140 -390 -97 288 -212 -413 -5 66 -463 -575 23 -82 -522 -346 10 -333
1554 -333 -373 15 288 102 -233 350 212 113 -229 317 407 -60 -93 605 166 -400 413 735 -108 -537 69
1575 69 294 -581 -122 498 -163 -596 -24 310 -382 -686 106 -47 -568 -106 560 -298 -375 509 334 -186 147
1596 147 766 106 -273 167 526 -23 -506 452 338 -366 -171 372 93 -448 -192 226 -460 -405 -22 79
1616G9m27J04M80k48m23N18O3k55J10K50N5j42r2L41N5k58J60q7j3l09J43J17
1638B21l87j02K75J17o19P5L61k15k48N88J55m23j84O25n4m12J45M20mo11M60
1659A83L24n21m07J244o00m76N80K65n68l33N65L04p31j51N53k82o00O17J29m84
1679c89j21O58j42m48K06N33l21k46N81R6n24q3O25j20l48J89L84n10j59K42L4
1700A37m98K23J57O6l92j6J00M8k20L28L3k74O4K15J32j18k19L85j87n3K66N0
1722B27k15N0j01N93o10m2M86l00j55K82J36o02J69J40N8l17k31P74j14r32N05
1743a99M32o80P3L60N9p32N55M37k28l67N17M34p82P8O56k39o29P10M4j42m44
1764h7L49K32p25NN47l56l29L86j52j64p7M84k45k19q4N91j93l30L46M08l45J59
$$ plain form
1616 79 -348 -244 236 -12 -435 83 146 -109 1 251 306 164 72 413 468 210 370 283 270 -39 104 221
1638 221 -166 -268 7 124 -495 -420 -59 -274 -522 66 221 -202 -386 239 185 -227 -82 338 334 -277 183
1659 183 507 -14 -421 823 223 -253 327 592 24 -309 256 560 -171 -322 231 -51 -651 -34 95 -389
1679 -389 -510 148 6 -442 -236 297 -24 -270 311 407 -117 -200 425 305 -43 146 530 20 -139 103 137
1700 137 -361 -138 19 85 -307 -323 -223 -175 -395 -67 -34 -308 -244 -29 103 -15 -234 151 -36 -89 177 227
1722 227 12 62 -39 554 -56 -98 388 88 -67 215 351 -251 -82 58 116 -201 -432 342 228 -704 -199
1743 -199 233 -447 -374 -14 45 -687 -132 305 77 -290 227 661 -121 -43 613 374 -255 455 499 357 -87
1764 -87 262 494 -231 -226 321 -35 -364 22 -130 -294 -371 113 -132 -351 -435 156 -37 -367 -21 387 42 201
1786B01R1j33n6J27K02j43j93K01jr7j36j90J21J27j64K04q0n08q2M59j71m4r2
1809c57K5k7L71n9L8k80j2M99Q3k04J39N7k62K56J24j93m28N73j78j17k07J88
1831B9J82n99J57L65j02m25J17L10l12q9J41j89Q2N6N58l76j7K48M0l22K4K72
1853A50K46k74K33p7j69j9Q9K4l63J16K79o56J42J74j79J08M7J90m05j10L88k08
1875b74K36j44J08m8J03J37l11P5K97J21k23N0K32k20k41N05k29k44L33j50k00
1896h7J0J07j5k67K26n3K6o8J8Q3l88M15K0k43L08J9Mk40K0K17m6k23K34R2k03
1921c4K43Qj38k59p3K22M6j46L46j49r1R6j80n1j9L9k5j18ML72nj71m9l4K07o1
1947b0J91Nj21J84l64N00j40j59j50J87Q6k09J4K41m39J20%k38mJ49L20l82j05
$$ plain form
1786 201 292 159 103 230 432 289 96 297 296 199 63 -127 -6 121 -43 161 81 -427 -509 -50 -221 -265 -357
1809 -357 -332 -359 12 -47 -9 -289 -301 198 281 77 216 273 11 267 391 198 -230 343 165 48 -159 29
1831 29 211 -388 -231 134 32 -393 -276 34 -278 -367 -226 -415 -333 -277 281 -95 -112 136 176 -146 -122 150
1853 150 396 122 355 278 109 90 179 203 -160 -44 235 -421 -279 -105 -284 -176 -129 61 -344 -454 -66 -274
1875 -274 -38 -182 -74 -122 -19 118 -193 -118 179 300 77 127 359 139 -102 403 174 -70 263 113 -87
1896 -87 -77 30 15 -252 -26 -79 -53 -121 -103 -20 -408 7 27 -216 92 111 115 -125 -105 112 66 -157 77 169 -34
1921 -34 209 217 79 -180 -253 -31 15 -131 215 66 -25 71 -109 -160 -179 -140 -165 -283 -279 93 88 -83 -132 -166 41 -20
1947 -20 171 176 55 239 -125 375 235 76 -74 113 199 -10 4 245 -194 -74 -74 -312 -316 -167 153 -229 -334
1970c34K22J37k67J7J95J06k04L37j84j95M4K99L85o42K35N07k92n06M12kk74
1991dj61L98l15l90N53R4n17K52j5j88N4m1N72m05k20L85K12l08R6K99k04K1j19
2014D9K92l91L0j16M95n07M09r6J30m82J32L4k98Q3J48J88j45k85M51O7m78l3
2036c23N44j59l20N0L32nl68N54n0l94L04L3kj18k10N54m60r2L53j51k20j49N16
2059B19j09m97K94M13n35j70N02k52j88n8P46l08n03M82K75n15n0O69m36k74J73
2080a22N37l97l56N45l8k81R1K40j83l25M37P0n17j46N49q2l21J47M48l73n40
2101f17M33M05m97n6M54K00o34L37m0j42L33j76K57j93k99M66n9k67k9K20P5l64
2123a93J43L04l92J28R4M9k08l79Q76l75n82L36L22l05j57N61J18o92K63M00k81
$$ plain form
1970 -334 -112 25 -242 -225 -30 76 -128 209 25 -170 -126 173 558 -84 151 658 366 -140 272 270 -4
1991 -4 -165 233 -82 -472 81 175 -342 -90 -105 -293 -239 -280 292 -113 -333 52 264 -44 52 351 147 168 49
2014 49 341 -50 -20 -136 359 -148 261 165 295 -187 -55 -21 -319 -236 -88 100 -45 -330 121 188 -290 -323
2036 -323 221 62 -258 -208 124 119 -249 305 255 -139 165 198 196 78 -132 422 -38 -130 223 72 -148 -297 219
2059 219 110 -387 -93 320 -215 -385 117 -135 -323 -381 365 57 -446 36 311 -204 -254 415 -21 -295 -122
2080 -122 415 18 -338 207 169 -112 -21 219 36 -289 148 218 -299 -445 104 22 -299 -152 296 -77 -617
2101 -617 -184 221 -276 -332 122 322 -312 25 -15 -157 176 0 257 64 -235 231 172 -95 -124 96 171 -193
2123 -193 -50 254 -138 -10 84 133 -75 -454 422 47 -535 -199 123 -182 -339 222 340 -352 -89 311 30
2144C0l20P46j65k88k99P26j58n92K99L30m68j24J94L15m88l05Q23m51k61K36
2164b20M18n93m8M00J43l08P7N72l91n49N48K57j87j72M59j09m83K35K56k79j96
2185a70K34J95n11K84J04l11l07L52M24m88L5j5M59p21J42L36P3m26K96M30n30
2206a15M8L86j6m20J1K60K62l74k08L53k42q7K85Pk33r3L81j62j87j03M39l39
2228a47n18N93J50k66K21M53k41n86K84K81l56r6L72M57p80m9N06q7n64L87L41
2249C55o08m6O33M6q76K93O36n33m03N67L03o47K22P2J91n94P2L92k55k35Q18
2270D03k7p02J04O21l04k03L23K50o07k65O51p3j95JQ6j72k18K61m0m1O1M0Q1
2293C5k64L2L03l2j66j08J86j4l45N15N3l35O9N80O6n35k68K16N3k2J7L45o34
$$ plain form
2144 30 -290 456 291 3 -296 430 272 -320 -21 309 -159 -283 -89 226 -262 -567 256 -195 -456 -220
2164 -220 198 -395 -443 -43 100 -208 -131 441 50 -499 49 306 119 -53 406 297 -186 49 305 26 -170
2185 -170 64 259 -252 32 136 -175 -482 -130 294 -194 -159 -174 285 -436 -294 42 115 -311 -15 415 -115
2206 -115 -67 319 303 -117 -106 154 416 42 -166 187 -55 -142 143 150 -83 -176 205 43 -144 -247 192 -147
2228 -147 -665 -72 78 -188 33 486 245 -341 -57 224 -132 -228 144 601 -179 -228 278 191 -373 14 355
2249 355 -253 -299 334 380 -496 -203 433 -100 -503 64 367 -280 -58 14 205 -389 -317 75 -180 -415 403
2270 403 376 -326 -222 399 95 -108 215 465 -142 -407 244 171 -24 -23 63 -109 -327 -66 -106 -147 -86 -46 35
2293 35 -229 -197 106 74 -92 -200 -14 -28 -373 142 195 -140 -71 509 575 40 -228 -12 41 19 36 381 -253
2316b53p4N05m5n61M54K01m99J2Q0K61n84K08N02j8o33M15L37l48j31N30j90k88
2338a19j10P50k24m79M48O6n10K04J56jm87K41K07m47m9N67nl91k19M39j91n3
2360b07J49K25k53M9N4J19j44K23J04l56l3K41j15O5k02K25L3j88j39J62J54m39
2382b73J76MP2k43J92K8q6j57M21j95k51J03L21N4m49K93R3o4o7N15l40p6mJ69
2406B36l58K4L42m5k64RK77k17m27K86L76o31J38L73P5l30l60Q21k93m49N13N2
2428A48k87N9K61o3l22J67J71j21Q8O6K8m03J88K99k1l92K31k3j75K33J70k05
2450I7k75K03k41J3J40j23K78j39l1K09m22K39M4J71p1P1K79m89K23m11J78J57
2472A00k57J80L24o6r4k45J10J80n48K91j4J3k18K24j23j48K90J77j72l66L40
$$ plain form
2316 -253 -327 178 133 -428 26 227 -272 -260 -180 81 -503 -295 207 189 -444 -29 308 -40 -171 359 169 -119
2338 -119 -229 521 297 -182 266 332 -178 26 182 181 -306 -65 142 -305 -354 213 208 -183 -402 37 -154 -207
2360 -207 -58 167 -86 -37 17 136 -8 215 319 -37 -70 171 56 121 -81 144 177 -11 -150 12 166 -273
2382 -273 -97 -93 -21 -264 -72 -44 -130 -287 134 -61 -312 -209 112 166 -283 10 103 39 -28 487 147 71 67 236
2406 236 -122 -98 244 199 -65 -56 221 4 -423 -137 239 -392 -254 119 194 -136 -496 325 32 -417 96 148
2428 148 -139 -80 181 118 -204 -37 134 13 101 167 195 -208 -20 279 258 -134 97 74 -101 132 302 97
2450 97 -178 25 -216 -203 -63 -186 92 -47 -78 131 -291 -52 -8 163 92 163 442 -47 176 -235 -57 100
2472 100 -157 23 347 281 187 -58 52 232 -316 -25 -39 -26 -244 -20 -143 -291 -1 176 4 -362 -22
2493b2M2j37J36J07r7%N1K22j69k84J17L31j08k60M52m04L7P5j77Mj48l0K47o8
2517h3j00J22k01K5p0K70k59J66M4R6l4J02L02k32k96M27k29j32L03o0k55J52
2539E8K4m6J2r4L9J35k38P1j7m2O4j48J27J66j86j78M76j56k06K07L8J8k8j15
2563a9J81j92J4J72J17l55J70J92m56K20J10mj89j09L48l81J71J57l45m1J14J52
2585B7J26l80J26L19j74p3j70L16n6NK3J96l83J21j05j05J51M03j46k45j29K21
2607F8j7k08J97n2J6j20P6K79l92N6j01J66Ml0M19m58J47j59J13J90mq8J69l73
2631a02J60J19l42J61K81j16m2KJ12j93r2k3J80m14L28k41L78k05k77M65j46m6
2653e3O5K47m37L2K31j34P1J75k05K84l69K26oj38p0L21k64p9J2J71O2k76K13
$$ plain form
2493 -22 20 -117 19 126 29 29 80 302 133 -151 -34 297 189 -71 381 -23 14 89 -88 -84 -232 -262 -15 -83
2517 -83 -183 -61 -262 -237 -307 -37 -296 -130 -86 10 -24 78 380 148 -148 279 50 -82 221 161 -94 58
2539 58 82 36 48 -46 -7 128 -110 -39 -56 -98 -34 -182 -55 111 -75 -253 223 67 -139 68 106 124 96 -19
2563 -19 162 -30 -16 156 273 -82 88 280 -176 44 154 150 -39 -148 200 -181 -10 147 -198 -239 -125 27
2585 27 153 -227 -101 218 44 -29 -199 117 61 66 89 285 -98 23 -82 -187 -36 367 221 -24 -153 68
2607 68 51 -157 40 -12 4 -116 -40 239 -153 -97 -198 -32 -28 -58 361 -97 50 -109 4 194 190 102 271 -102
2631 -102 58 177 -165 -4 277 161 119 121 233 40 -52 -75 105 -309 19 -222 156 -49 -326 139 -7 -53
2653 -53 12 259 -178 -146 85 -49 22 197 -8 276 -93 133 127 -11 -81 240 -24 -103 -91 80 142 -134 79
2676G9j57J04j32J76p5j98J02j6L59l57p0K86k09Q3K19j76K8R5K4k59K10m4rK03
2700B66l34J43j28N4J5lO7o0j47J77n9k43J66J8j13K73j16j1N7K40j83j19J26
2723H6ll8j26K79j55J84k43NK76j60j38p8K77j56J0J43k25p3K7K59l25m3K91k33
2747a59j1J89R5k37L4R3j93K41m7L60l82K7J46j54R2j19J02Lj68J07J66k69J13
2770B9J84m5k66N8K78k91m8J77j69kK16j43J20j10M7J68n04K17K13R7m62J26K07
2793I7R7j74m9j56K07J50J95m20L30j49m0k5j39J06j86j27K54p6m1L01j13M9p9
2816A2l8K2J61J23l55J3M44k05k89L24l1j90J96p9k2k49K19m5k7j6l6K1j45Jq
2841a99J95j58K14j24j1q8J53J97l03J37m7j42M7L59p9M3k51J34j18K22j32OR6
$$ plain form
2676 79 -78 26 -106 70 -5 -203 -101 -117 242 -115 -185 101 -108 -25 194 18 46 141 165 -94 116 72 63 266
2700 266 -68 75 -53 1 16 13 80 20 -127 50 -9 -252 -86 -68 -181 92 -24 -35 22 262 79 -40 86
2723 86 83 45 -81 198 43 227 -16 -11 265 105 -33 -111 166 10 20 163 -62 -135 -108 151 -174 -217 74 -159
2747 -159 -170 19 114 -123 -89 4 -189 52 5 365 -17 10 156 2 94 -25 77 80 -88 19 185 -84 29
2770 29 213 168 -98 -40 238 -53 -101 76 -93 -95 121 -22 98 -12 35 203 -301 -84 129 226 -236 -110 97
2793 97 194 20 -29 -185 22 172 367 -53 277 128 88 63 -76 30 -156 -283 -29 -105 -146 155 42 91 12
2816 12 -26 -4 157 280 -75 -62 382 177 -112 212 181 -9 187 108 86 -163 56 11 -16 -32 -68 -47 -192 -191 -199
2841 -199 -4 -162 52 -72 -83 -171 -18 179 -124 13 -34 -176 -129 230 151 194 -57 77 -41 181 49 55 151
2864A51j27J68k01m9J38k62J62p3O0j42J34j17M48l46j22K60J84j94k10k2K28
2885F8j21j0L80k75m0r3Q2J52m0M2r2k70J29l04L83R5k99L5L47l41K93J6mk99
2909a66K44J54l17k1L05m08J4K86J12n4q9j07J81k34L0K68k58NK3J09q1p1J19
2932D4j20j0J06K3j93K1J12KPQn4J25m8j47O5o6j18J68O7M5J58M5k18Q8J42p9
2958A73k21O5q9K17j20K33j80k56K70j76J94j13L3k23O28o08l6L45j01q6P9P4
2980A02n4J0L1mj47R1M5J59j2k61K11J6l2k33N6j48R1J17j7k82L29n4r3l36K81
3005a34n2N7J87n6J98k43j24K37k22j72L44j20L65l65K14j09K00l7r6j11J0J57
3027A28j28k31J59O3q5j96J43O3p1j8J39J44q4J33j76K24k11J13r2Q1P2j11m8
$$ plain form
2864 151 24 192 -9 -58 80 -182 -20 -93 -33 -175 -41 -158 290 -56 -178 82 266 72 -138 -160 68
2885 68 -53 -63 317 42 2 -91 -9 143 103 145 53 -217 -88 -392 -9 86 -213 -178 169 -172 121 137 133 -166
2909 -166 78 232 -85 -106 199 -209 -195 91 203 149 60 -47 134 -100 -70 198 -60 -55 -32 77 -4 -75 44
2932 44 -76 -86 20 43 -150 -129 -17 -15 -8 0 -54 71 23 -124 -59 -125 -243 -75 -8 37 195 240 22 110 252 173
2958 173 -48 17 -72 145 25 258 78 -178 92 -84 110 -3 30 -193 435 -173 -209 136 35 -51 28 102
2980 102 48 58 89 85 -62 29 74 233 221 -40 171 187 155 -78 -22 -170 -79 38 21 -261 68 14 -79 -415 -134
3005 -134 -186 -129 58 2 200 -43 -167 70 -152 -324 20 -100 265 -100 114 5 205 168 72 -39 -29 128
3027 128 0 -231 -72 -9 -94 -290 -147 -84 -155 -173 -34 110 26 159 -17 207 -4 109 17 98 170 59 11
3050A1J37j65J21K22k09j91o3M5J6Q4j16O8lq9L6K93j75N3J41m06L45j87j41P5
3074i8L70j87j19J4n2J21j20K07j72O5j21L37l34L3j4L15m04J89k1p2J2M2k52
3097b61J62N8p4M3N2n7M6j6j17K74l3k0j41j4J37o2M0P2o5Q5k17K48l78K36k1
3122b3L1J44m2k86M04l50J26j19J78j2k23l2p6M3L4o8L14j19l2K2K35J8k54J82
3146I5j75L33m0m07N71l66r0j25K59O2j61O1j33J84j31R5L3j12K10k17j1r3L21
3169A63l8j95j42J11J20j07K29p0N6R4j50k8Q8O5j87J37rN1M7l63J63J5LK38n06
3194b15J97K35k19q0J6o0K7j57K76J33k59L11k26j17J29J57k40K17p1j46K50k25
3216f7K0J9k7m2J64k52P6k5J75JL2j51K11j77J88j19L4j32J66l6k57Q6J69J49
$$ plain form
3050 11 148 -17 104 326 117 -74 -137 -92 -76 8 -108 -40 -43 -132 -96 197 22 75 216 -190 155 -32 -173 -98
3074 -98 272 85 -34 -20 -72 49 -71 136 -36 29 -92 245 -89 -56 -70 245 -159 30 9 -63 -51 -9 -261
3097 -261 -99 -41 -115 -72 -20 -77 -31 -47 -164 110 77 57 -84 -98 39 -23 17 89 24 109 -108 140 -238 -2 -23
3122 -23 8 152 110 -176 228 -122 4 -115 63 51 -172 -204 -280 -237 -203 -271 43 -76 -108 -86 149 167 -87 95
3146 95 -80 253 213 -194 377 11 -79 -204 55 117 -44 17 -116 68 -63 32 65 -47 163 -54 -65 -158 163
3169 163 125 -70 -212 -101 19 -88 141 71 127 221 71 43 131 196 9 146 137 188 235 -128 35 50 53 291 -215
3194 -215 -18 217 -2 -82 -66 -126 -99 -256 20 153 -106 205 -21 -138 -9 148 -92 125 54 -92 158 -67
3216 -67 -47 -28 -55 -97 67 -185 -109 -134 41 42 74 -77 134 -43 145 26 60 -72 94 58 -199 -113 56 205
3240B05n33L72J53j31k57K18L01n47K95J24r4m2r1N0j77m6P5K12j19j39J88k60
3262b43K3J82J13K1k46K03l36P9J17k6J13j3q2J73M8k21J71m5J63k45J0J85l09
3285a65M6K41j46k3MJ46j90J4J35j26J09n5r2o4K25j01L13j36j93K1K39J6j22
3308I6N2j94K15k54L40l42J7k8M8L9j16K98p1k74j9L42m4l12J42J61l6l4N7L2
3332A15r2qP4k19L28l61J42Q6j70K81p8k83L84j92n1J66l2O4l77O48k69j94m9
3355h7L2Kj24L59j14j05O4j25l40M95K2n6k66rK64L00j74l77O4J97k5j42M84m42
$$ plain form
3240 205 -328 44 197 66 -191 27 328 -219 76 200 106 64 -27 23 -154 -200 -125 87 -32 -171 17 -243
3262 -243 -220 -38 75 96 -150 53 -283 -204 -87 -113 0 -13 -95 78 126 -95 76 31 194 -51 -41 144 -165
3285 -165 -119 122 -24 -47 -43 103 -87 -73 62 -64 45 -10 -102 -166 59 -42 271 135 -58 -37 202 218 96
3308 96 148 -46 169 -85 255 -87 -70 -98 -50 -11 -127 171 100 -174 -193 149 105 -207 -65 96 60 26 83 115
3332 115 23 15 89 -130 198 -163 -21 65 -105 176 98 -185 199 7 -44 122 90 154 -223 425 156 -38 -87
3355 -87 -55 -53 -177 182 68 -37 27 -98 -438 57 79 23 -243 -252 12 312 138 -239 -175 22 -3 -145 339 -103
$$ [...]
8191a05
##END NTUPLES=NMR FID
##END=
