##TITLE=1H_Ad=0(bat2-aceton-ag)-lig
 CDCl3
 8 sc, 
 13.12.2022
##JCAMPDX= 6.0         $$ Bruker NMR JCAMP-DX V2.0
##DATA TYPE= NMR FID
##DATA CLASS= NTUPLES
##ORIGIN= UXNMR, Bruker Analytische Messtechnik GmbH
##OWNER= root
$$ XWIN-NMR		Version 3.5
$$ Tue Dec 13 14:40:40 2022 Russian Standard Time (UT+4h)  she@DPX200
##.OBSERVE FREQUENCY= 200.13135
##.OBSERVE NUCLEUS= ^1H
##.DELAY= (6, 6)
##.ACQUISITION MODE= SIMULTANEOUS
##.ACQUISITION SCHEME= undefined
##.AVERAGES= 8
##.DIGITISER RES= 18
##SPECTROMETER/DATA SYSTEM= spect
##.PULSE SEQUENCE= zg30
##.SOLVENT NAME= CDCl3
##.SHIFT REFERENCE= (INTERNAL, CDCl3, 0, 15.7039)
##AUDIT TRAIL= $$ (NUMBER, WHEN, WHO, WHERE, WHAT)
$$ ##TITLE= Audit trail, XWIN-NMR		Version 3.5
$$ ##JCAMPDX= 5.01
$$ ##ORIGIN= Bruker BioSpin GmbH
$$ ##OWNER= she
$$ F:/spectra/data/she/nmr/H-F/1/audita.txt
$$ ##AUDIT TRAIL=  $$ (NUMBER, WHEN, WHO, WHERE, WHAT)
(   1,<2022-12-13 14:39:24.54 +0400>,<she>,<DPX200>,
      <created by zg, POWCHK disabled, PULCHK disabled
       configuration hash MD5:
       00 E9 B6 7A A2 85 ED C7 34 08 36 98 17 FE 4E 26
       data hash MD5: 16K
       08 CF CD 09 AB 4E 33 9E FB 05 46 3F 96 11 AD 90>)
$$ ##END=
$$ 
$$ hash MD5
$$ 2E FF AA 2E FF 66 06 EA AB C9 4D 4D 39 2F AE 35
##$RELAX= 
##$RELAX= 
##$RELAX= 
##$RELAX= 
##$RELAX= 
##$RELAX= 
$$ Bruker specific parameters
$$ --------------------------
##$DU= <F:/spectra>
##$EXPNO= 1
##$NAME= <H-F>
##$PROCNO= 1
##$TYPE= <nmr>
##$USER= <she>
##$AMP= (0..31)
100 100 100 100 100 100 100 100 100 100 100 100 100 100 100 100 100 100 
100 100 100 100 100 100 100 100 100 100 100 100 100 100 
##$AQSEQ= 0
##$AQ_mod= 1
##$AUNM= <au_zg>
##$AUTOPOS= <>
##$BF1= 200.13
##$BF2= 200.13
##$BF3= 200.13
##$BF4= 200.13
##$BF5= 200.13
##$BF6= 200.13
##$BF7= 200.13
##$BF8= 200.13
##$BYTORDA= 1
##$CFDGTYP= 0
##$CFRGTYP= 5
##$CHEMSTR= <none>
##$CNST= (0..31)
1 1 145 1 1 1 1 1 1 1 1 1 1 1 1 1 1 1 1 1 1 1 1 1 1 1 1 1 1 1 1 1 
##$CPDPRG= <>
##$CPDPRG1= <>
##$CPDPRG2= <>
##$CPDPRG3= <>
##$CPDPRG4= <mlev>
##$CPDPRG5= <mlev>
##$CPDPRG6= <mlev>
##$CPDPRG7= <mlev>
##$CPDPRG8= <mlev>
##$CPDPRGB= <>
##$CPDPRGT= <>
##$D= (0..31)
0 1.2 0 0 0 0 0 0 0 0.06 0 0.03 0 0 0 0 0.0002 0 0 0 0 0 0 0 0 0 0 0 0 
0 0 0 
##$DATE= 1670927963
##$DBL= (0..7)
120 120 120 120 120 120 120 120 
##$DBP= (0..7)
150 150 150 150 150 150 150 150 
##$DBP07= 0
##$DBPNAM0= <>
##$DBPNAM1= <>
##$DBPNAM2= <>
##$DBPNAM3= <>
##$DBPNAM4= <>
##$DBPNAM5= <>
##$DBPNAM6= <>
##$DBPNAM7= <>
##$DBPOAL= (0..7)
0.5 0.5 0.5 0.5 0.5 0.5 0.5 0.5 
##$DBPOFFS= (0..7)
0 0 0 0 0 0 0 0 
##$DE= 6
##$DECBNUC= <off>
##$DECIM= 32
##$DECNUC= <off>
##$DECSTAT= 4
##$DIGMOD= 1
##$DIGTYP= 9
##$DL= (0..7)
0 120 120 120 120 120 120 120 
##$DP= (0..7)
150 150 150 150 150 150 150 150 
##$DP07= 0
##$DPNAME0= <>
##$DPNAME1= <>
##$DPNAME2= <>
##$DPNAME3= <>
##$DPNAME4= <>
##$DPNAME5= <>
##$DPNAME6= <>
##$DPNAME7= <>
##$DPOAL= (0..7)
0.5 0.5 0.5 0.5 0.5 0.5 0.5 0.5 
##$DPOFFS= (0..7)
0 0 0 0 0 0 0 0 
##$DQDMODE= 0
##$DR= 18
##$DS= 0
$$ [...]
##$SUBNAM2= <"">
##$SUBNAM3= <"">
##$SUBNAM4= <"">
##$SUBNAM5= <"">
##$SUBNAM6= <"">
##$SUBNAM7= <"">
##$SUBNAM8= <"">
##$SUBNAM9= <"">
##$SW= 18.05172834244
##$SWIBOX= (0..15)
0 0 2 0 0 0 0 0 0 0 0 0 0 0 0 0 
##$SW_h= 3612.71676300578
##$TD= 16384
##$TD0= 1
##$TE= 0
##$TE2= 300
##$TE3= 300
##$TEG= 300
##$TL= (0..7)
0 120 120 120 120 120 120 120 
##$TP= (0..7)
150 150 150 150 150 150 150 150 
##$TP07= 0
##$TPNAME0= <>
##$TPNAME1= <>
##$TPNAME2= <>
##$TPNAME3= <>
##$TPNAME4= <>
##$TPNAME5= <>
##$TPNAME6= <>
##$TPNAME7= <>
##$TPOAL= (0..7)
0.5 0.5 0.5 0.5 0.5 0.5 0.5 0.5 
##$TPOFFS= (0..7)
0 0 0 0 0 0 0 0 
##$TUNHIN= 0
##$TUNHOUT= 0
##$TUNXOUT= 0
##$USERA1= <user>
##$USERA2= <user>
##$USERA3= <user>
##$USERA4= <user>
##$USERA5= <user>
##$V9= 5
##$VALIST= <valist>
##$VCLIST= <CCCCCCCCCCCCCCC>
##$VD= 0
##$VDLIST= <DDDDDDDDDDDDDDD>
##$VPLIST= <PPPPPPPPPPPPPPP>
##$VTLIST= <TTTTTTTTTTTTTTT>
##$WBST= 1024
##$WBSW= 4
##$XGAIN= (0..3)
0 0 0 0 
##$XL= 0
##$YL= 0
##$YMAX_a= 188752
##$YMIN_a= -218610
##$ZGOPTNS= <>
##$ZL1= 120
##$ZL2= 120
##$ZL3= 120
##$ZL4= 120
##$ABSF1= 10
##$ABSF2= 0
##$ABSG= 5
##$ABSL= 3
##$ALPHA= 0
##$AQORDER= 0
##$ASSFAC= 0
##$ASSFACI= 0
##$ASSFACX= 0
##$ASSWID= 0
##$AUNMP= <proc_1d>
##$AZFE= 0.1
##$AZFW= 0.1
##$BCFW= 1
##$BC_mod= 2
##$BYTORDP= 1
##$COROFFS= 0
##$CY= 11.3945322036743
##$DATMOD= 1
##$DC= 2
##$DFILT= <>
##$DTYPP= 0
##$F1P= 2.36226072786647
##$F2P= -0.459571619588291
##$FCOR= 0.5
##$FTSIZE= 0
##$FT_mod= 4
##$GAMMA= 1
##$GB= 0.15
##$INTBC= 1
##$INTSCL= 1
##$ISEN= 128
##$LB= 0.24
##$LEV0= 0
##$LPBIN= 0
##$MAXI= 10000
##$MC2= 0
##$MEAN= 0
##$ME_mod= 0
##$MI= 1.114404
##$NCOEF= 0
##$NC_proc= 0
##$NLEV= 6
##$NOISF1= 3.799351
##$NOISF2= 2.8
##$NSP= 1
##$NTH_PI= 0
##$NZP= 0
##$OFFSET= 15.70392
##$PC= 1
##$PHC0= -19112.66
##$PHC1= 10.00072
##$PH_mod= 1
##$PKNL= yes
##$PPARMOD= 0
##$PSCAL= 0
##$PSIGN= 0
##$REVERSE= no
##$SF= 200.130013532006
##$SI= 16384
##$SIGF1= 3
##$SIGF2= 2
##$SINO= 400
##$SIOLD= 16384
##$SREGLST= <1H.CDCl3>
##$SSB= 0
##$STSI= 0
##$STSR= 0
##$SW_p= 3612.71676300578
##$SYMM= 0
##$S_DEV= 0
##$TDeff= 0
##$TDoff= 0
##$TI= <>
##$TILT= no
##$TM1= 0
##$TM2= 0
##$TOPLEV= 0
##$USERP1= <user>
##$USERP2= <user>
##$USERP3= <user>
##$USERP4= <user>
##$USERP5= <user>
##$WDW= 1
##$XDIM= 8192
##$YMAX_p= 0
##$YMIN_p= 0
$$ End of Bruker specific parameters
$$ ---------------------------------
##NTUPLES= NMR FID
##VAR_NAME=  TIME,          FID/REAL,        FID/IMAG
##SYMBOL=    X,             R,               I
##VAR_TYPE=  INDEPENDENT,   DEPENDENT,       DEPENDENT
##VAR_FORM=  AFFN,          ASDF,            ASDF
##VAR_DIM=   8192,          8192,            8192
##UNITS=     SECONDS,       ARBITRARY UNITS, ARBITRARY UNITS
##FACTOR=    0.0002768,     1,               1
##FIRST=     0,             0,               0
##LAST=      2.2672688,     0,               0
##MIN=       0,             -218610,         0
##MAX=       2.2672688,     188752,          0
$$ Real data points
##PAGE= N=1
##DATA TABLE= (X++(R..R)), XYDATA
$$ [...]
$$ plain form
1700 -227 13 -247 -412 -44 -368 -20 -350 99 64 -54 -70 292 -16 -283 8 34 294 99 176 91 281 86
1722 86 366 61 -72 -16 -126 412 -54 111 126 -266 -275 -36 -265 -58 -276 -303 -37 -96 -88 -120 6 -61 335 125
1746 125 21 139 105 251 175 115 192 140 425 401 161 170 123 160 -102 -209 253 -54 -193 -76 109 -347 -412 -233
1770 -233 -9 -347 -108 -69 14 -200 166 91 153 8 168 154 -178 19 314 332 104 366 402 155 -112 26
1792 26 101 -106 -166 -105 -71 -247 58 -107 -119 -250 -49 -196 -187 -74 -98 -8 56 22 1 -98 184 105 339 72 475
1817 475 315 -128 15 214 159 60 167 -109 186 -362 -131 -126 -108 -95 -321 -201 -346 -183 -262 -184 -167 33 72
1840 72 -120 -25 -52 211 209 -5 109 127 276 208 249 136 197 171 175 -55 -232 27 -577 -94 -84 -165 -49 -42 -86 -207
1866 -207 -302 -65 -28 -109 -77 -39 -40 153 -43 216 211 224 440 192 195 115 89 21 34 23 30 111 -40 -44 3 -75 -344 67
$$ packed form
1700b27K40k60j65L68l24L48l30M49l5j18j6L62l08k67K91K6K60j95P7q5J90j95
1722H6K80l05j33N6j10N38m66J65J5l92rK39k29K07k18k7K66n9Ql2J26o7L96k10
1746A25j04J18l4J46p6o0P7n2K85k4k40Rm7L7k62j07M62l07j39J17J85m56o5J79
1770b33K24l38K39L9Q3k14L66p5O2j45J60j4l32J97K95J8k28K62L6k47k67J38
1792B6P5k07o0O1L4j76L05j65j2j31K01j47RJ13k4R0O4l4k1r9K82p9K34k67M03
1817D75j60m43J43J99n5r9J07k76K95n48K31NJ8J3k26J20j45J63p9P8J7K00L9
1840G2j92R5k7K63kk14J14J8J49o8M1j13O1k6Mk30j77K59o04M83J0q1J16Pm4j21
1866b07r5K37L7q1L2L8jJ93j96K59nJ3K16k48Lq0k6o8J3j1PQ1j51mM7p8k69M11
$$ plain form
1894 67 -129 -190 -16 -93 -348 -59 -111 -14 -5 -92 160 218 83 63 81 26 175 -177 167 131 215 149 210 -7 169
1919 169 95 -73 86 -361 41 118 -237 -153 -156 -139 -205 -215 67 25 -100 -242 3 -82 -240 -117 255 31 -64 26
1943 26 122 238 193 165 178 107 -63 127 -311 -23 -57 247 7 -84 -140 -189 -143 -56 -270 -231 -4 -376 -403 -335 -95
1968 -95 -60 -97 111 238 -157 117 251 -44 135 -13 37 249 239 368 150 415 -95 -120 118 -252 10 -65
1990 -65 37 -240 -126 -117 -103 154 -16 -104 -410 -131 10 66 167 303 201 51 125 229 255 160 100 120 165 7
2014 7 74 171 163 188 -163 -4 -47 -352 64 37 -400 -238 -57 -333 -86 -179 114 -30 -221 157 214 -187 -86 237
2038 237 143 359 -39 526 79 218 388 -107 108 149 195 -128 -149 -36 -69 -52 -232 -19 -300 -455 -111 -284
2060 -284 -231 -112 -182 -278 77 -177 96 263 75 234 99 -130 162 390 139 48 -78 240 -57 274 51
$$ packed form
1894F7j96o1J74p7k55K89n2R7Rq7K52N8j35k0J8n5J49l52L44l6Q4o6O1k17J76
1919A69p4j68J59m47M02P7l55Q4lJ7o6j0K82m2j25j42K45q5j58J23L72k24r5R0
1943B6R6J16m5k8J3p1j70J90m38K88l4L04k40r1n6m9M6Q7k14L9K27l72k7O8K40
1968i5L5l7K08J27l95K74J34k95J79j48N0K12j0J29k18K65n10k5K38l70K62p5
1990f5J02k77J14RJ4K57j70q8l06K79J41N6J01J36j02j50P4J04K6r5o0K0M5j58
2014GO7R7qK5l51J59m3l05M16k7m37J62J81k76K47r3K93j44j91L78N7m01J01L23
2038B37r4K16l98N65m47J39J70m95K15M1M6l23k1J13l3J7j80K13k81j55L44j73
2060b84N3J19p0r6L55k54K73J67j88J59j35k29K92K28k51r1j26L18k97L31k23
$$ plain form
2081 51 5 -139 55 99 -228 -79 -28 111 -302 -138 -200 -24 -93 7 125 -43 -205 39 141 -6 21 95 178
2104 178 -176 284 309 185 -38 203 361 4 114 -49 -26 116 -7 -23 -60 -257 -28 67 -143 -417 -138 -17
2126 -17 -99 -12 18 18 -171 34 -64 66 24 73 164 113 -32 -45 121 -155 158 69 -372 -102 69 223 -251 53
2150 53 -20 -107 -251 -49 -1 -462 135 45 38 -273 -70 -86 -79 -342 149 264 -128 74 11 98 128 -29 215 168 36
2175 36 -75 230 41 -54 -24 -48 -16 -123 -39 45 -239 -17 -143 -6 -137 -69 -145 -11 -71 -24 60 145 66 -26 122
2200 122 254 312 -77 229 81 326 65 106 98 108 -96 -73 -46 -292 -238 -209 -225 -56 -224 -29 -43 -183 -237 -20
2224 -20 -115 2 -75 212 50 319 317 25 -78 36 270 -134 -52 226 196 -21 -136 188 -138 118 36 -116 101
2247 101 -141 -96 18 -164 -328 153 -113 -303 -333 -39 -166 -156 252 43 71 20 131 -158 54 259 97 -29
$$ packed form
2081E1m6j44J94M4l27J49N1J39m13J64o2J76o9J00J18j68j62K44J02j47K7P4Q3
2104A78l54M60K5j24k23K41J58l57J10j63K3J42j23j6l7j97K29R5k10k74K79J21
2126a7q2Q7L0%j89K05r8J30m2M9R1n1j45j3J66k76L13q9m41K70J71J54m74L04
2150E3p3q7j44K02M8m61N97r0pl11K03j6Pk63M91J15l92K02o3Q7L0j57K44m7j32
2175C6j11L05j89r5L0k4L2j07Q4Q4k84K22j26J37j31O8p6J34o0M7Q4Q5p9r2J48
2200A22J32N8l89L06j48K45k61M1qJ0k04K3K7k46N4K9j6J69j68J95j4j40n4K17
2224b0r5J17p7K87j62K69kk92j03J14K34m04Q2K78l0k17j15L24l26K56q2j52K17
2247A01k42M5J14j82j64M81k66j90l0K94j27J0M08k09K8n1J11k89K12K05j62j26
$$ plain form
2269 -29 73 189 351 125 203 214 5 -195 199 40 9 -11 -113 -86 -90 107 70 -334 -88 -78 -97 -106 137 -121
2293 -121 -155 -103 45 -125 -30 -97 80 29 -89 152 196 -61 115 167 -124 -144 -71 75 -407 -244 -18 -102 -287
2316 -287 -164 -114 -68 -10 -132 98 -108 -4 77 102 67 206 61 -122 206 192 185 100 90 6 301 135 55 37 -111
2341 -111 -66 -25 139 102 -176 -164 -107 -251 -126 189 36 -217 -114 63 -32 -261 365 -178 -48 -146 141 31
2363 31 32 18 225 147 28 119 113 -81 60 70 19 -33 -322 -116 -30 -221 -306 -88 -37 -35 -206 -145 -34 -38 118 -210
2389 -210 103 195 131 178 -56 295 -13 -85 -11 160 -99 177 -63 90 44 337 80 -149 -29 -75 155 -270
2411 -270 -162 26 -176 -323 -30 157 -340 -74 -26 -117 -87 109 208 84 297 -68 97 173 124 103 -37 55 4
2434 4 -75 213 -208 -176 88 27 -259 -85 27 -165 -170 -85 -71 -299 175 210 -94 -17 317 78 -24 111 174 163
$$ packed form
2269b9J02J16J62k26P8J1k09k00L94j59l1k0j02K7mJ97l7m04K46J0j9rK43k58
2293a21l4N2J48j70R5o7J77n1j18K41M4k57J76N2k91k0P3J46m82J63K26q4j85
2316b87J23N0M6N8j22K30k06J04Q1K5l5J39j45j83L28j4pq5j0q4K95j66q0j8j48
2341a11M5M1J64l7k78J2N7j44J25L15j53k53J03J77r5k29O26n43J30r8K87j10
2363C1Jj4K07p8j19R1oj94J41J0n1n2k89K06Q6j91q5K18N1Kj71O1J11mJ56l28
2389b10L13R2o4M7k34L51l08p2P4J71k59K76k40J53m6K93k57k29J20m6K30m25
2411b70J08J88k02j47K93J87m97K66M8r1L0J96R9j24K13l65J65P6m9k1j40R2n1
2434Dp9K88m21L2K64o1k86J74J12j92nQ5J4k28M74L5l04P7L34k39j02J35O3j1
$$ plain form
2458 163 109 -1 50 -182 164 130 81 315 115 -18 -86 5 29 154 -70 -160 64 -90 -294 134 -119 -193 -218
2481 -218 199 -6 -531 -108 107 -6 -246 -192 -5 77 79 -55 -56 268 170 252 116 -83 201 -14 -190 43 22
2504 22 29 19 -52 -255 -121 -37 -61 -207 -188 -3 -130 33 -157 -166 -31 25 43 243 4 -45 208 429 172 54
2528 54 -82 315 156 -71 40 27 -144 -29 189 45 -205 -72 218 -22 -188 23 -59 -126 -131 208 -199 -125
2550 -125 81 27 15 -35 23 59 -16 84 35 -52 -49 99 22 -16 121 -64 -162 226 -26 224 -119 -45 -9 -42 -49 -35
2576 -35 -76 283 4 -140 67 -179 169 50 46 41 90 -41 396 159 91 -39 103 112 287 -99 -165 125 -38 -30
2600 -30 -126 -186 -27 -96 -214 -80 -68 -199 -193 -125 95 -175 180 -126 76 -8 -107 2 51 167 -264 204 73 -24
2624 -24 -54 7 120 -147 -2 -90 196 -55 65 66 108 -56 39 -209 -173 93 -226 -89 -148 -128 -166 -131 -140 2 61
$$ packed form
2458A63n4j10N1k32L46l4m9K34k00j33o8R1K4J25k24r0K24j54k04M28k53p4k5
2481b18M17k05n25M23K15j13k40N4J87Q2Kj34jL24r8Q2j36j99K84k15j76K33k1
2504B2Pj0p1k03J34Q4k4j46J9J85j27J63j90rJ35N6J8K00k39m9K53K21k57j18
2528E4j36L97j59k27J11j3j71J15K18j44k50J33K90k40j66K11q2o7nL39m07P4
2550a25K06n4j2n0N8L6p5J00m9q7LJ48p7l8J37j85r8L88k52K50l43P4L6l3pJ4
2576c5m1L59k79j44K07k46L48j19mnM9j31M37k37o8j30J42RJ75l86o6K90j63Q
2600c0r6o0J59o9j18J34J2j31OO8K20k70L55l06K02q4r9J09M9J16m31M68j31r7
2624b4l0O1J13k67J45q8K86k51J20JM2j64R5k48L6K66l19J37n9K0l8L5rJ42N9
$$ plain form
2649 61 201 -25 -13 110 259 28 7 32 122 -93 82 101 -88 -40 135 35 -44 -64 66 196 -413 -200 86
2672 86 49 -322 -116 -4 -83 -210 -13 -166 -132 -54 -78 39 -3 2 75 88 -299 157 -34 -139 40 -59 91 68
2696 68 -45 71 -222 18 -208 169 -258 -195 29 -186 -232 -251 59 34 65 188 -54 68 291 -69 -127 -168 22
2719 22 36 65 145 355 -26 -223 -131 -200 206 -47 -61 50 81 -442 145 -142 -212 -112 -113 39 -35 18 98 -107 228
2744 228 -96 -14 -39 181 -31 -10 -26 179 102 -59 -69 132 122 -164 152 -81 -93 8 0 -11 27 -60 -78 -7 -38
2769 -38 30 60 -120 -324 95 107 -158 128 224 209 172 -5 123 86 97 30 59 19 153 257 80 129 121 -114 15
2794 15 316 -45 -179 -20 -29 -125 47 -193 -206 -4 115 -129 -58 -154 -95 -39 70 147 -185 210 137 63 122 189 -61
2819 -61 141 32 -40 -109 -95 -53 -21 -13 27 -63 146 -159 -274 -33 116 -253 -329 -105 -165 -25 8 -16 289 32 131
$$ packed form
2649F1J40k26J2J23J49k31k1K5R0k15J75J9j89M8J75j00p9k0J30J30o09K13K86
2672H6l7l71K06J12p9j27J97j53L4P8k4J17m2NP3J3l87M56j91j05J79r9J50k3
2696F8j13J16k93K40k26L77m27O3K24k15m6j9L10k5L1J23k42J22K23l60n8m1J90
2719B2J4K9Q0K10l81j97R2o9M06k53j4J11L1n23N87k87p0J00jJ52p4N3Q0k05L35
2744B28l24Q2k5K20k12K1j6K05p7j61j0K01j0k86L16k33j2J01qj1L8q7j8P1l1
2769c8O8L0j80k04M19J2k65K86R6j5l7j77J28l7J1o7K9m0J34J04j77M9qk35J29
2794A5L01l61j34J59rr6J72k40j3K02J19k44P1r6N9N6J09P7l32L95p3p4N9O7k50
2819f1K02j09p2o9J4M2L2QM0r0K09l05j15K41J49l69p6K24o0J40L3k4L05k57R9
$$ plain form
2844 131 -41 25 -65 -181 -57 30 88 135 -73 111 211 -52 -82 -47 -79 -2 100 24 60 151 6 -36 66 89 16
2869 16 -119 -174 -34 141 50 191 153 -24 110 78 102 -8 181 147 -116 -9 102 125 61 -155 -17 0 78 -184
2893 -184 -61 26 -44 -84 -160 -56 -357 -234 -237 -234 72 -62 -141 -88 -136 58 -37 120 -67 50 183 39 242 232
2917 232 7 112 50 72 -135 108 12 -312 -160 -11 82 -251 -32 105 -166 -138 96 30 -185 58 -255 3
2939 3 -1 41 183 -107 -102 -64 -2 -143 -155 -31 149 -23 -38 13 -116 -57 151 -175 19 17 -186 -81 -224 -194 -163 78
2965 78 -212 166 163 135 190 -16 -130 -105 -81 41 23 102 147 -221 13 146 -45 24 165 85 44 -65 164 58
2989 58 -153 9 -137 -17 -112 -58 -356 -77 -57 -198 -126 82 -93 -203 -63 -142 175 -158 -45 127 -127 129
3011 129 -115 194 261 250 117 12 95 211 67 35 -238 156 129 136 103 70 96 -14 9 55 100 -248 38 -195
$$ packed form
2844A31j72O6r0j16J24Q7N8M7k08J84J00k63l0L5l2P7J02p6L6R1j45m2J02K3p3
2869A6j35n5J40J75r1J41l8j77J34l2K4j10J89l4k63J07J11K3o4k16J38J7P8k62
2893a84J23Q7p0m0p6J04l01J23lLL06j34p9N3m8J94r5J57j87J17J33j44K03j0
2917B32k25J05o2K2k07K43r6l24J52J49R3l33K19J37k71K8K34o6k15K43l13K58
2939CmM2J42k90NL8O2j41j2J24J80j72j5N1j29N9K08l26J94kk03J05j43L0L1K41
2965G8k90L78lk8N5k06j14K5K4J22j8P9M5l68K34J33j91O9J41q0m1j09K29j06
2989E8k11J62j46J20r5N4k98K79K0j41P2K08j75j10J40p9L17l33J13J72k54K56
3011A29k44L09O7j1j33j05Q3J16j44l2k73L94k7Pl3l3K6j10K3M6M5l48K86k33
$$ plain form
3035 -195 175 -221 164 238 133 -45 59 15 112 200 -68 257 30 60 -32 -85 -106 -24 -209 70 124 86 112 112 97
3060 97 158 54 189 -30 25 -80 74 -106 -286 13 221 -80 -43 -23 -8 106 74 179 -192 -162 231 150 168
3083 168 239 -30 -44 -17 4 31 -164 161 -200 -66 40 -110 1 16 29 144 11 -209 -126 84 240 -66 -120
3106 -120 329 -33 91 66 138 204 -96 86 215 -161 -213 109 52 76 259 -129 -115 -72 -190 -91 26 101 8 57
3130 57 187 -71 167 99 -40 -43 -59 31 142 -19 -141 126 -64 -4 164 56 218 6 240 -95 -107 174 12
3153 12 250 -116 -55 -212 -125 -99 -144 -148 97 49 -63 159 29 -259 -155 -32 23 -96 -23 215 22 0 -15 56
3177 56 -71 -13 -3 108 -62 -73 -24 8 27 85 114 -44 146 -179 -17 -103 -162 0 56 -116 106 49 153 25
3201 25 293 42 58 219 21 2 223 -81 -250 -202 50 146 104 -9 -96 -141 -3 -108 99 128 -46 -64 -17 -269
$$ packed form
3035a95L70l96L85P4j05j78J04m4R7Q8k68L25k27L0r2n3k1Q2j85K79N4l8K6%j5
3060I7O1j04J35k19N5j05J54j80j80K99K08l01L7K0J5J14l2J05l71L0L93q1J8
3083A68P1k69j4K7K1K7j95L25l61J34J06j50J11J5J3J15j33k20Q3K10J56l06n4
3106a20M49l62J24k5P2O6l00J82J29l76n2L22n7K4J83l88J4M3j18R9J17P5r3M9
3130E7J30k58K38o8j39lj6R0J11j61j22K67j90O0J68j08J62k12K34l35j2K81j62
3153A2K38l66O1j57Q7K6m5mK45m8j12K22j30k88J04J23N5j19P3K38j93k2j5P1
3177E6j27N8J0J11j70j1M9L2J9N8K9j58J90l25J62q6n9J62N6j72K22n7J04j28
3201B5K68k51J6J61j98j9K21l04j69M8K52R6m2j13q7m5J38j05K07K9j74j8M7k52
$$ plain form
3225 -269 11 105 -318 -77 44 51 -118 191 150 -210 -211 112 238 -136 -24 -49 72 285 -62 -106 50 82 -21
3248 -21 297 -57 14 309 -41 -51 102 -9 0 -107 -240 349 -73 15 92 224 79 -69 77 3 -251 83 159
3271 159 9 -11 49 -26 -132 74 -7 -136 -65 -113 -15 188 -231 -145 -210 321 -79 112 -79 76 -166 -306 -127
3294 -127 -76 -95 44 -60 -47 6 59 375 189 52 223 0 -72 253 24 -100 -260 -4 -241 -61 37 -209
3316 -209 89 -106 -151 -19 -193 35 57 -132 -247 -32 -117 -146 -1 -39 -29 23 183 11 13 166 75 117 -60 248
3340 248 -28 17 -63 -125 -376 -169 64 14 23 182 147 157 -60 133 42 95 -90 -143 -132 117 -15 -166 -149 60
3364 60 -174 -218 -168 -29 99 76 -66 -42 -137 -25 145 -53 119 161 -200 -91 90 11 23 6 44 84 44 -102
3388 -102 -51 -131 248 154 -35 -105 -100 -150 -99 -230 -242 19 5 236 -98 155 -94 -156 -28 -12 170 9 2 -42 -22
$$ packed form
3225b69K80R4m23K41J21Pj69L09m1l60jL23J26l74J12k5J21K13l47m4J56L2j03
3248b1L18l54P1K95l50j0J53j11Rj07j33N89m22Q8P7J32j45j48J46p4k54L34P6
3271A59j50k0O0p5j06K06q1j29P1m8R8K03m19Q6o5N31m00J91j91J55k42j40J79
3294a27N1j9J39j04J3N3N3L16j86j37J71k23p2L25k29j24j60K56k37J80R8k46
3316b09K98j95m5J32j74K28K2j89j15K15q5k9J45l8J0N2J60j72KJ53r1M2j77L08
3340B48k76M5q0o2k51K07K33n0RJ59l5J0k17J93r1N3j85n3J1K49j32j51J7K09
3364F0k34m4N0J39J28k3j42K4r5J12J70j98J72M2l61J09J81p9J2j7L8M0m0j46
3388a02N1q0L79r4j89p0Nn0N1j31j2K61j4K31l34K53k49o2J28J6J82j61pm4K0
$$ plain form
3413 -22 42 85 -6 53 -417 -133 101 -348 -40 -143 99 66 -177 -176 -154 32 212 -68 61 95 124 -47 172 -255
3437 -255 -36 -50 31 166 119 0 -54 -19 -197 -205 178 -195 42 100 19 38 -53 5 74 -174 31 170 -165 54
3461 54 12 117 -163 2 24 -147 53 -53 -396 80 65 30 -325 -22 59 -91 108 62 86 38 183 5 115
3484 115 -83 -55 -205 -63 122 74 -224 163 -117 -25 -86 -135 58 171 -270 -67 319 40 -251 26 98 69
3506 69 -33 -179 111 5 -40 -16 -1 -102 -68 138 175 -42 71 45 -222 -35 123 84 -16 92 99 111 139 134 -67
3531 -67 -260 99 -1 -99 30 -92 -57 -110 -134 109 87 18 -230 -116 9 182 -207 168 -166 -26 -176 74
3553 74 -125 -45 -108 -47 11 31 223 153 29 -83 -106 -22 46 159 -9 131 -122 109 55 16 -73 46 -35 -64 2
3578 2 129 32 58 -68 -135 -41 -69 51 -178 -96 -106 227 -65 -79 104 -109 222 -28 65 12 -35 -228 -199 -84 -92
$$ packed form
3413b2O4M3r1N9m70K84K34m49L08j03K42l3k43JK2J86J80k80J29L4K9j71K19m27
3437b55K19j4Q1J35m7j19n4L5j78qL83l73K37N8q1J9r1N8O9k48K05J39l35K19
3461E4m2J05k80J65K2j71K00j06l43M76j5l5l55L03Q1j50J99m6K4m8J45j78J10
3484A15j98K8j50J42J85m8k98L87k80R2o1m9J93J13m41K03L86k79k91K77P2k9
3506F9j02j46K90j06m5K4J5j01L4K06L7k17J13k6k67J87J58l9j00J08PJ2K8nk01
3531f7j93L59j00r8J29j22L5n3k4K43k2o9k48J14J25J73l89L75l34J40j50K50
3553G4j99Q0o3O1N8K0J92p0j24j12k3Q4O8J13j68J40k53K31n4l9q9J19q1k9O6
3578BJ27r7K6j26o7R4k8J20k29Q2j0L33k92j4J83k13L31k50R3n3m7j93K9J15q
$$ plain form
3603 -92 -155 -111 -18 22 -141 -129 -22 -51 71 106 -112 94 -96 21 -105 285 28 -97 87 -5 96 47 40 -109
3627 -109 -75 120 -97 46 123 68 -90 98 -169 -10 62 8 164 -46 -1 -52 -231 232 -152 2 -115 -74 -22
3650 -22 -91 -114 223 -174 -216 -46 185 -4 93 -54 198 -35 158 9 7 136 -89 -106 60 224 -194 109 84
3673 84 17 -71 -113 -139 -166 -64 -82 -82 55 -291 152 -67 337 32 -109 2 193 103 263 -214 78 142 59 -5
3697 -5 177 140 17 -159 -32 86 -109 -65 -268 73 -20 197 -127 3 -9 -102 -91 30 -269 -185 -93 39 -85
3720 -85 -166 -45 137 -147 71 -73 -164 69 125 -40 84 -17 117 -96 -80 -167 16 -205 -128 40 80 -139 6
3743 6 -18 -49 -141 62 37 81 199 44 101 -80 58 92 -48 5 -140 -69 13 -268 50 103 -6 -102 103 46 -1
3768 -1 -89 -63 92 82 -122 144 -97 -61 64 -115 164 -154 20 -108 40 -132 210 168 -18 -139 44 73 -10
$$ packed form
3603i2o3M4R3M0j63J2J07k9J22L5k18K06j90J17j26L90k57j25J84r2J01m9pj49
3627a09L4J95k17J43P7n5j58J88k67J59P2n4J56k10M5n1j79M63l84J54j17M1N2
3650b2o9k3L37l97m2J70K31j89R7j47K52k33J93j49kJ29k25j7J66J64m18L03k5
3673H4o7q8m2k6k7J02j8%J37l46M43k19M04l05j41J11J91r0J60m77K92O4q3o4
3697eJ82l7j23j76J27J18j95M4k03L41r3K17l24J30j2r3J1J21k99Q4R2J32j24
3720h5q1J21J82k84K18j44r1K33N6j65J24j01J34k13J6q7J83k21P7J68M0k19J45
3743Fk4l1r2K03k5M4J18j55N7j81J38L4j40N3j45P1Q2k81L18N3j09r6K05n7m7
3768aq8K6J55j0k04K66k41L6J25j79K79l18J74j28J48j72L42m2j86j21J83K9q3
$$ plain form
3791 -10 -4 -73 26 58 -101 43 63 -62 86 -15 145 28 -65 37 155 -10 -108 -86 -34 36 2 -51 -231 38 110
3816 110 241 98 62 -31 131 51 75 -56 2 -155 153 -7 -39 156 2 132 -150 -32 -42 -41 -138 -218 -246 -44
3840 -44 202 40 -144 -69 -73 121 50 -224 124 -29 -26 -25 38 -114 8 -110 -126 7 -195 54 -90 -77 199 154
3864 154 -342 -111 157 -38 -94 -91 120 -7 -173 155 -65 54 -124 -52 -8 -7 -220 22 -160 -139 95 -112 10
3887 10 96 -101 -245 -81 -30 -89 171 -354 -224 9 -160 101 38 30 -78 -181 -103 92 65 -88 230 55 73
3910 73 -109 43 39 45 64 -228 67 0 -25 103 -75 33 138 116 -98 -99 -32 -4 6 -42 -180 25 -257 -72 161
3935 161 31 -144 -33 42 -27 148 33 -8 150 84 111 -25 -89 -27 208 209 -31 -60 9 124 42 -74 -6 -162
3959 -162 -19 -65 -79 -79 -8 -49 -62 -107 -25 80 178 54 -190 45 1 -32 62 -82 239 18 104 -52 163 149 58
$$ packed form
3791a0Oo9R9L2j59J44K0j25J48j01J60j17r3J02J18j65r8K2N2P0l4n3j80K69P2
3816A10J31j43l6r3J62q0K4j31N8j57L08j60l2J95j54J30k82J18j0Jr7q0k8K02
3840d4K46j62j84P5mJ94p1k74L48j53LJO3j52J22j18j6J33k02K49j44J3K76m5
3864A54m96K31K68j95n6LK11j27j66L28k20J19j78P2M4Jk13K42j82K1K34k07J22
3887A0Q6j97j44J64N1n9K60n25J30K33j69K61o3qj08j03P8J95k7j53L18j75J8
3910G3j82J52mOJ9k92K95o7k5J28j78J08J05k2k14jO7K8J0m8j38K05k82J85K33
3935A61j30j75J11P5o9J75j15m1J58o6K7j36o4O2K35Jk40k9O9J15q2j16O8j56
3959a62J43m6j4%P1m1j3m5Q2J05R8j24k44K35m4l3R4j44L21k21Q6j56K15j4r1
$$ plain form
3984 58 -206 -67 109 -87 -133 -75 -114 -309 -174 -111 124 -37 57 -78 -218 -127 -220 -38 -100 90 -123 116 112 -5
4008 -5 186 72 -102 -101 -211 153 113 15 -130 186 -70 105 -16 173 97 -39 100 144 -66 -115 224 -4 100
4031 100 -102 114 50 -40 -48 56 -94 209 196 4 16 71 -11 -131 -89 -213 -58 185 -19 23 -8 87 -154 -83
4055 -83 59 20 -77 125 -9 116 -53 -25 17 36 -216 267 20 41 6 240 16 -29 -3 -257 19 104 -54 147
4079 147 -16 -83 -14 85 17 108 -16 155 122 -49 -406 -38 -62 252 -10 45 1 108 -13 -160 -122 110 -47
4102 -47 -271 -111 -26 -113 -40 153 14 -157 -9 -43 -99 116 -3 -10 -258 209 -45 141 -134 -283 -73 160 -157
4125 -157 0 -188 164 -144 -66 -163 10 -156 24 -182 -24 138 26 71 67 -86 -32 58 34 -168 166 -207 -60
4148 -60 36 -63 -145 -120 291 66 83 -14 30 -18 -245 146 119 -21 -200 -61 96 153 133 -268 83 63 86 103 140
$$ packed form
3984E8k64J39J76j96m6N8l9j95J35O3K35j61R4j35j40R1r3J82o2J90k13K39mj17
4008eJ91j14j74Jj10L64m0r8j45L16k56J75j21J89p6j36J39M4k10m9L39k28J04
4031A00k02K16o4r0qJ04j50L03j3j92J2N5q2j20M2j24J55K43k04M2l1R5k41P1
4055h3J42l9r7K02j34J25j69K8M2J9k52M83k47K1l5K34k24m5K6k54K76Q5j58K01
4079A47j63o7O9R9o8R1j24J71l3j71l57L68k4L14k62N5m4J07j21j47L8K32j57
4102d7k24J60Q5q7P3J93j39j71J48l4n6K15j19pk48M67k54J86k75j49K10K33l17
4125a57J57j88L52l08P8r7J73j66J80k06J58J62j12M5mj53N4R0k4k02L34l73J47
4148f0R6r9q2K5M11k25J7r7M4m8k27L91k7j40j79J39J57N7k0m01L51k0K3J7L7
$$ plain form
4173 140 77 147 -3 -70 183 47 66 -148 125 -182 88 81 298 -159 257 135 -96 26 20 187 97 40 -117
4196 -117 -118 21 -43 207 51 -217 -136 -159 65 -34 100 -23 54 17 277 125 -138 -31 -121 60 -352 155 123
4219 123 25 -96 -83 188 1 -105 -77 -44 122 151 58 -96 22 -6 -63 107 -3 257 -87 155 103 107 236 44
4243 44 -213 52 -205 74 -290 138 -156 61 38 -54 84 -176 -176 -196 81 172 -171 -235 82 -116 -102 64 -14
4266 -14 99 236 -147 153 -60 91 -7 98 120 60 199 -12 -58 148 61 -72 117 30 24 -124 77 -30 -10
4289 -10 46 -109 26 -97 -32 38 -1 -191 -35 -23 158 -208 -109 99 -22 106 -7 25 100 5 -130 84 -4 24
4313 24 22 -87 90 201 -94 209 173 -105 184 -131 -55 -177 86 -230 -63 16 47 -110 -188 -24 -31 52 41 43 -125
4338 -125 -59 160 233 -49 35 72 -102 103 -29 -87 111 100 45 -61 126 -9 -205 40 -47 37 235 -161 -146
$$ packed form
4173A40o3P0j50o7K53j36J9k14K73l07K70pK17m57M16j22k31J22oJ67r0n7j57
4196a17jJ39o4K50j56k68Q1k3K24r9J34j23P7l7K60j52k63J07r0J81m12N07l2
4219A23r8j21J3K71j87j06K8L3J66K9r3j54J18k8n7J70j10K60l44K42n2MJ29j92
4243D4k57K65k57K79l64M28k94K17k3r2J38k60%k0K77R1l43o4L17j98J4J66p8
4266a4J13J37l83L00k13J51r8J05K2o0J39k11m6K06q7j33J89q7oj48K01j07K0
4289a0N6j55J35j23O5P0l9j90J56J2J81l66R9K08j21J28j13L2P5r5j35K14q8K8
4313B4kj09J77J11k95L03l6k78K89l15P6j22K63l16J67P9L1j57p8J64pQ3j1Kj68
4338a25O6K19P3k82Q4L7j74K05j32n8J98j1n5j06J87j35j96K45q7Q4J98l96J5
$$ plain form
4361 -146 225 -66 28 -36 -220 -21 -45 86 207 57 159 81 -7 264 -17 79 275 -100 -208 164 149 89 -37
4384 -37 -70 190 50 -25 40 24 25 64 62 2 -162 -38 36 158 -170 83 38 -216 -272 19 -62 -23 57 -53 262 -108
4410 -108 -143 4 1 29 -32 -174 240 148 -102 148 -116 -335 175 -107 29 123 183 0 6 142 -162 -26 -13 96
4434 96 227 157 -46 5 -251 -16 -139 -166 124 165 56 -241 57 -211 2 -397 -51 -164 -49 32 115 4
4456 4 -127 -77 -201 59 40 150 -122 139 118 -125 62 141 47 -71 204 153 -44 40 -221 159 -190 -159 -68 -36
4480 -36 108 104 135 -130 -118 -129 -25 -334 -217 102 87 45 124 89 64 21 -28 -67 227 -88 -43 159 -4 96 128
4505 128 -121 4 46 109 -123 198 -176 -27 23 -183 -47 -98 -4 -116 -41 -25 59 -76 105 37 -21 188 -68
4528 -68 -236 -204 119 304 -105 -85 163 142 -339 -15 -254 -174 -86 -151 -156 -68 -92 192 -66 -99 -30 167 153 -26 6
$$ packed form
4361a46L71k91R4o4j84J99k4J31J21j50J02p8q8K71k81R6J96l75j08L72j5o0j26
4384c7l3K60j40p5O5j6JL9ko0j64J24P4J22l28K53m5k54n6K91q1L9Q0j10L15l70
4410a08l5J47lK8o1j42M14r2k50K50k64k19N10k82J36R4O0j83OJ36l04J36J3J09
4434I6J31p0k03N1k56K35j23k7K90M1j09k97K98k68K13l99L46j13J15Q1Q3j11
4456Dj31N0j24K60j9J10k72K61k1k43J87P9r4j18K75n1j97Q4k61L80l49L1R1L2
4480c6J44mL1k65J2j1J04l09J17L19j5m2P9l5k5m3m9l9K94l15M5K02j63J00L2
4505A28k49J25M2O3k32L21l74J49N0k06J36n1R4j12P5J6Q4j35J81o8n8K09k56
4528f8j68L2L23J85m09K0K48k1m81L24k39Q0Q8o5nQ8k4K84k58l3O9J97j4j79L2
$$ plain form
4553 6 105 -3 141 -71 -163 146 -42 -130 -29 105 -139 104 185 140 -325 265 -45 153 92 -8 294 -134 -54
4576 -54 -133 60 -17 -88 35 -264 112 6 -17 -43 -46 -119 -145 -67 -31 203 3 -39 182 122 -44 101 168 -31 -48
4601 -48 41 90 -8 -102 -87 75 -89 -121 192 -130 38 -120 179 133 -17 53 149 -18 39 95 -192 193 459 -125
4625 -125 -54 -116 191 -127 -67 -76 -102 -36 116 -48 80 -65 -134 27 149 -51 -73 -33 140 -14 -10 177 142 -127
4649 -127 -67 -143 141 55 185 -134 -124 164 -76 52 372 -5 260 -194 -137 110 -104 64 3 -28 48 -162 98
4672 98 61 88 136 -26 57 -40 122 -239 -87 -119 -64 -256 -7 -297 14 -29 39 83 -41 -238 54 149 31 100
4696 100 -70 -64 157 -86 54 -194 -121 -20 36 40 -81 23 77 91 74 125 319 100 -73 -67 225 -91 -18 -193
4720 -193 30 140 -321 199 310 -115 -127 -201 -206 -91 51 -137 76 28 136 19 171 -108 -16 -31 109 195 -61
$$ packed form
4553FR9j08J44k12r2L09j88q8J01J34k44K43Q1m5m65N90l10J98o1j00L02m28Q0
4576e4p9J93p7p1J23k99L76j06k3k6lp3k6P8L6K34k00m2K21o0j66J45O7j99j7
4601d8Q9M9r8r4J5J62j64l2L13l22J68j58K99m6j50P0R6j67N7N6k87L85K66n84
4625a25P1o2L07l18O0rk6O6J52j64J28j45o9J61J22k00k2M0J73j54MJ87l5k69
4649a27O0p6K84q6J30l19J0K88k40J28L20l77K65m54N7K47k14J68o1l1P6k10K60
4672I8l7K7M8j62Q3r7J62l61J52l2N5j92K49k90L11m3O8M4j24j97K92R5j18O9
4696A00j70OK21k43J40k48P3J01N6Mj21J04N4J4j7N1J94k19j73OK92l16P3j75
4720a93K23J10m61N20J11m25j2p4nJ15J42j88K13m8J08j17J52k79R2j5J40Q6k56
$$ plain form
4743 -61 -17 -95 -46 -275 -36 -148 26 33 -65 72 125 -22 38 -91 116 129 298 -69 -43 62 -43 -63 217 166
4767 166 -129 123 -14 54 4 -263 -9 -150 -88 50 -72 -150 -140 -33 162 -3 -51 -96 103 -96 -18 -171 127
4790 127 -133 -69 72 151 -108 -134 5 -16 40 -111 -204 26 -40 66 -256 -11 190 76 -109 -224 -81 6 68
4813 68 38 98 -93 209 -28 16 -88 42 95 -81 63 45 219 -83 60 41 -17 150 -71 -63 49 -190 227
4836 227 2 -164 -315 29 -80 60 -39 -128 47 68 163 52 -80 -7 271 200 -131 150 -171 83 -62 52
4858 52 -4 -20 64 -251 94 28 112 -58 209 112 66 95 -61 -192 115 -122 -134 113 64 -149 42 60 -80 118
4882 118 -144 -24 -82 76 149 66 -186 -129 179 117 116 -173 -61 -166 -42 -20 -85 145 -80 -287 142 164 161 12
4906 12 -204 105 321 -151 -100 -140 8 -17 186 -203 81 155 -105 -37 18 155 19 100 54 -131 -34 138 108 -13
$$ packed form
4743f1M4p8M9k29K39j12J74Pr8J37N3j47O0j29K07J3J69l67K6J05j05k0K80n1
4767A66k95K52j37O8n0k67K54j41O2J38j22p8J0J07J95j65m8m5J99j99P8j53K98
4790A27k60O4J41P9k59k6J39k1N6j51r3K30o6J06l22K45K01j14j85j15J43Q7O2
4813F8l0O0j91L02k37M4j04J30N3j76J44j8J74l02J43j9n8J67k21QJ12k39M17
4836B27k25j66j51L44j09J40r9q9J75K1R5j11j32P3K78p1l31K81l21K54j45J14
4858E2n6j6Q4l15L45o6Q4j70K67r7m6K9j56j31L07k37j2K47m9k13J91J8j40J98
4882A18k62J20n8J58P3q3k52N7L08o2jk89J12j05J24K2o5K30k25k07M29K2lj49
4906A2k16L09K16m72N1m0J48k5K03l89K84P4k60O8N5J37j36Q1m6j85R7J72l0j21
$$ plain form
4930 -13 40 -50 72 113 178 -158 104 43 55 -63 58 -89 5 69 0 -58 108 87 -53 18 46 -147 -25 36 4
4955 4 197 -106 -132 -56 -17 11 -200 86 62 28 -135 -31 -162 -45 36 92 7 38 3 -131 -39 -174 -141 -59 85
4980 85 10 -23 15 -192 2 -140 -228 9 31 -31 -119 -49 10 -83 -9 343 61 15 166 56 61 109 -302 199 -87
5005 -87 -114 -52 -307 -86 -85 119 -201 216 44 -166 292 -88 -284 -35 -153 105 165 37 -11 96 104 -84 -53
5028 -53 150 -6 44 157 90 81 95 -34 -49 10 145 -148 -117 -73 -34 149 -17 12 68 68 105 -87 -21 -362 -125 63
5054 63 -61 -222 68 62 -187 -53 263 35 77 -89 -142 -144 -166 -143 68 -72 -55 -1 -100 172 170 -128 -294 183 82
5079 82 35 46 -5 295 99 -19 145 150 -23 -68 149 -178 -375 -76 -37 -144 -1 -155 -247 98 -249 131 -26
5102 -26 -185 -53 -102 -91 116 -142 174 169 -69 77 -60 72 150 79 -185 315 4 -123 49 -112 206 46
$$ packed form
4930a3N3r0J22M1O5l36K62o1J2j18J21j47R4O4o9n8J66k1j40P1K8j93J22O1l2
4955DJ93l03k6P6L9K8k11K86k4l4j63J04j31J17Q1N6q5L1l5j34R2j35L3Q2J44
4980H5p5l3L8k07J94j42q8K37K2o2q8P0N9r3P4L52k82m6J51j10NM8m11N01k86
5005h7k7O2k55K21JK04l20M17j72k10M58l80j96K49j18K58O0j28m8J07Qj88L1
5028e3K03j56N0J13o7rJ4j29j5N9J35k93L1M4L9J83j66K9N6%L7j92O6l41K37J88
5054F3j24j61K90ok49J34L16k28M2j66n3kk2K3K11j40J7N4r9K72kk98j66M77j01
5079H2m7J1n1L00j96j18J64Nj73m5K17l27j97K99L9j07J43j54r2L45l47L80j57
5102b6j59J32m9J1K07k58L16nk38J46j37J32P8p1k64N00l11j27J72j61L18j60
$$ plain form
5124 46 -80 -14 67 -290 -33 66 91 -14 70 150 -80 40 -197 268 -63 -2 -8 -239 -20 168 84 -8 67 68 94
5149 94 111 -31 -8 -303 53 -184 -209 117 -166 -3 55 -16 -202 -180 35 -33 -114 57 -11 -4 -98 17 -77 -66 0
5174 0 122 4 -36 156 87 -96 -330 -19 -145 -106 270 204 67 41 154 63 4 -38 81 -47 -109 -43 113 218
5198 218 44 20 -159 13 -85 -14 11 -176 -34 55 157 -83 -150 -209 -13 -252 -1 61 276 111 127 37 -110
5221 -110 51 53 -122 -13 -76 88 -17 -116 35 -23 104 73 -109 -174 54 52 -88 -165 203 142 -173 51 156 113
5245 113 -35 2 20 66 323 188 -158 -279 269 -171 -166 -73 -99 -82 210 -323 15 100 -54 76 55 -114 10
5268 10 -219 -63 176 -63 -86 -170 31 181 -67 190 103 -113 166 1 4 -30 -1 184 20 69 61 -237 104 126
5292 126 182 -3 12 -175 -110 -70 85 -102 -23 -273 -220 -38 35 70 -43 173 167 246 140 -82 -56 -5 69 -4 -69
$$ packed form
5124D6j26O6Q1l57K57R9K5j05Q4Q0k30J20k37M65l31O1ok31K19J88q4r2P5JK6
5149I4J7j42K3k95L56k37k5L26k83J63N8p1j86K2K15o8q1J71o8Pr4J15r4J1O6
5174@J22j18m0J92o9j83k34L11j26L9L76o6j37k6J13r1n9m2J19j28o2O6J56J05
5198B18j74k4j79J72r8P1K5j87J42Q9J02k40o7n9J96k39K51O2K15j65J6r0j47
5221a10J61Kj75J09o3J64j05r9J51n8J27l1j82o5K28kj40p7L68o1l15K24J05m3
5245A13j48L7J8M6K57j35l46j21N48m40NR3k6J7K92n33L38Q5j54J30k1j69J24
5268A0k29J56K39k39k3q4K01J50k48K57q7k16K79j65Ll4K9J85j64M9qk98L41K2
5292A26N6j85J5j87O5M0J55j87P9k50N3J82P3L5j13K16oP9j06k22K6N1P4p3o5
$$ plain form
5317 -69 -165 -178 -149 48 -23 167 -77 115 98 98 242 -3 142 -46 -19 201 -36 -83 81 113 -50 95 187 25
5341 25 -228 -30 -209 54 27 74 24 -54 -24 -222 19 -160 -161 62 -58 -98 7 190 -31 -228 -73 -107 59
5364 59 -76 21 111 -30 -97 109 -54 236 156 -253 253 -29 -99 106 -279 7 -68 154 -181 -16 68 67 -45
5387 -45 72 -74 -51 -119 -179 11 -7 -185 -141 9 -105 -111 194 -79 149 -85 33 178 60 220 -132 48 -121
5410 -121 -155 158 36 -198 216 -20 0 -212 -238 49 10 30 87 -203 101 88 211 -119 -36 69 -53 68 241
5433 241 -26 127 -37 -36 -103 -21 -66 -38 84 342 -138 165 91 253 -20 -100 -243 166 97 -122 -22 75 73 -100
5457 -100 -83 150 -254 -134 -27 -206 -170 159 326 18 125 -125 30 -356 -11 4 -108 36 -3 285 274 -59
5479 -59 -91 25 132 -3 5 -225 179 -103 -5 104 -97 37 130 132 69 86 32 -2 -213 -59 -88 -58 -348 -30 -30
$$ packed form
5317f9r6j3K9J97p1J90k44J92j7%J44k45J45j88K7K20k37m7J64L2j63J45R2j62
5341B5k53J98j79K63k7M7n0p8L0j98K41j79jK23j20m0J05J83k21j97J55l4J66
5364E9j35R7R0j41o7K06j63K90q0m09N06k82p0K05l85K86p5K22l35J65Q4jj12
5387d5J17j46K3o8o0J90j8j78M4J50j14oL05k73K28k34J18J45j18J60l52J80j69
5410a21l4L13j22k34M14k36K0k12k6K87l9K0N7k90L04j3J23l30Q3J05j22J21J73
5433B41k67J53j64Jo7Q2m5K8J22K58m80L03p4J62k73q0j43M09o9k19J00R7kj73
5457a00J7K33m04J20J07j79L6L29J67l08J07k50J55l86L45J5j12J44l9K88j1l33
5479e9l2J16J07j35Qk30M04k82R8J09k01J34R3Ko3J7n4l4k11J54k9L0k90L18%
$$ plain form
5504 -30 -1 9 111 -186 66 5 -105 -10 -13 -173 -64 -78 -152 -78 -149 -90 37 -247 -110 -153 -67 6 -209 -103 122
5529 122 2 -28 -75 -241 283 -158 -188 -8 -72 161 53 -168 220 -131 -3 142 103 81 99 -2 278 90
5551 90 -333 -67 -65 77 -27 49 4 31 -31 -187 -24 -172 156 100 28 -268 17 185 -100 92 105 161 44 -29
5575 -29 104 -27 -149 -138 -114 12 -130 -75 215 58 -11 114 -103 -19 -59 -12 -13 138 8 49 82 36 -158 163
5599 163 -26 36 236 216 -20 -186 97 196 13 -146 11 212 -36 46 16 -96 -31 -180 166 66 66 -99 -74
5622 -74 -28 -80 80 64 -10 -55 90 49 -65 114 297 178 56 76 159 73 75 -83 147 -7 5 -4 -177 77 -130
5647 -130 -58 148 124 23 -109 -44 172 84 -21 -56 -246 -169 -60 7 -44 -68 -84 -281 -138 -160 -231 108 -169 38
5671 38 -77 -133 28 -47 -133 58 156 65 -37 -13 54 11 -183 -66 234 63 61 -106 47 -202 -110 -131 -101 33 74
$$ packed form
5504c0K9J0J02k97K52o1j10R5lj60J09j4p4P4p1N9J27k84J37m3Q6P3k15J06K25
5529A22j20l0m7j66N24m41l0J80o4K33j08k21L88l51J28J45l9k2J8j01K80j88
5551I0m23K66KJ42j04P6m5K7o2j56J63j48L28n6p2k96K85J68k85J92J3N6j17p3
5575b9J33j31j22J1K4J26j42N5K90j57o9J25k17Q4m0M7jJ51j30M1L3m6j94L21
5599A63j89O2K00k0k36j66K83R9j83j59J57K01k48Q2l0j12O5j49L46j00%j65K5
5622g4M6n2J60j6p4m5J45m1j14J79J83j19j22K0Q3q6Kj58K30j54J2rj73K54k07
5647a30P2K06k4j01j32O5K16q8j05l5j90P7J09O7n1k4j6j97J43k2p1L39k77K07
5671C8j15n6J61p5q6J91R8r1j02K4O7m3j94J17L00j71kj67J53k49R2k1L0J34M1
$$ plain form
5696 74 133 52 87 191 47 78 107 -92 -97 92 247 -10 -85 132 -89 -77 78 -171 110 -13 -29 111 170 -61
5720 -61 -170 76 -91 -130 -193 47 -56 36 54 -39 26 -140 33 135 27 -97 156 -23 -97 197 23 45 -205
5743 -205 -20 -30 -220 -164 62 417 -185 -106 31 -54 -99 80 211 91 35 57 3 -173 -104 26 106 49 233 157
5767 157 -88 -21 51 -216 39 108 -194 33 -117 -23 -29 -88 -77 28 23 -110 -65 -170 -50 30 -4 120 90 184 -123
5792 -123 -58 0 -24 -103 189 -84 5 61 -19 105 117 -117 -231 49 140 87 128 129 -17 -116 -216 7 -228 -171 -314
5817 -314 135 165 36 -59 98 28 124 128 126 256 116 33 192 -110 31 77 -124 29 -27 -36 -139 -208 93 -44 -70
5842 -70 -20 -13 158 13 -174 -8 171 -218 -162 -222 -102 100 123 -12 -153 149 -3 170 5 -4 -100 98 -117
5865 -117 268 84 21 -130 175 -22 224 26 -20 -158 -23 198 20 -29 -179 -47 21 -200 -117 78 270 -43
$$ packed form
5696G4N9q1L5J04j44L1K9j99nJ89J55k57p5K17k21J2J55k49K81j23j6J40N9k31
5720f1j09K46j67l9o3K40j03R2J8r3O5j66J73J02j08j24K53j79p4K94j74K2k50
5743b05J85j0j90N6K26L55o02P9J37q5m5J79J31j20n6K2n4j76O9J30Q0n7J84p6
5767A57k45O7P2k67K55O9l02K27j50R4on9J1J05nj33M5j05J20Q0l4J24l0R4l07
5792a23O5N8k4p9K92k73Q9N6q0J24J2k34j14K80R1n3M1Jj46r9j00K23k35N7j43
5817c14M49L0j29r5J57p0R6MkJ30j40q3J59l02J41M6k01J53n6rj03o9L01j37k6
5842g0N0PJ71j45j87J66J79l89N6o0J20K02K3j35j41L02j52J73j65rr6J98k15
5865a17L85j84o3j51L05j97K46j98m6j38J35K21j78m9j50J32O8k21Q3J95J92l13
$$ plain form
5887 -43 4 -302 -210 -68 -77 -18 -96 156 56 48 -178 -189 124 -46 81 70 -192 98 -44 147 -38 51 -249 -57
5911 -57 144 198 49 -265 174 -256 143 -157 101 120 -18 52 6 66 33 -81 -20 86 -85 198 4 -27 -35 -10
5935 -10 267 138 -100 -134 -201 12 101 -86 70 -5 -142 9 -84 49 -252 -31 -30 99 -253 132 -104 68 202
5958 202 142 181 -169 -310 -55 67 294 189 -135 61 217 -150 110 137 -120 81 137 153 -74 -13 1 15 4
5981 4 93 -121 -27 21 -32 41 237 168 101 -12 109 97 367 -146 -71 -20 -48 -90 69 -198 24 -91 -157 -42 13
6006 13 9 68 18 -14 258 4 -74 -9 31 -152 208 202 254 30 -133 -229 -131 34 106 80 90 -25 240 -3 -81 199
6032 199 86 -17 97 -179 -290 -32 -31 71 -76 299 -234 54 -85 196 50 12 114 -112 -108 -61 142 40
6054 40 17 100 32 -40 248 -26 -59 98 -235 229 377 84 88 138 76 -2 -66 -114 -23 120 -238 -217 36 18 -57 -214
$$ packed form
5887d3M7l06R2J42rN9p8K52j00qk26j1L13j70J27j1k62K90j42J91j85Q9l00J92
5911e7K01N4j49l14M39m30L99l00K58J9j38P0m6O0l3j14O1J06j71K83j94l1qK5
5935a0K77j29k38l4o7K13Q9j87J56p5j37J51r3J33l01K21JJ29l52L85k36J72J34
5958B02o0L9l50j41K55J22K27j05l24J96J56l67K60K7k57K01N6J6k27O1J4J4j1
5981DQ9k14R4M8n3P3J96o9o7j13J21j2K70n13P5N1k8m2J59k67K22j15o6J15N5
6006A3mN9n0l2K72k54p8O5M0j83L60oN2k24j63r6R8J65P2k6J0j15K65k43p8K80
6032A99j13j03J14k76j11K58JJ02j47L75n33K88j39K81j46l8J02k26MM7K03j02
6054D0k3Q3o8p2K88k74l3J57l33M64J48k93MN0o2p8o4m8R1J43l58K1K53j8p5j57
$$ plain form
6080 -214 78 -6 -85 1 -176 -179 -79 68 -164 -13 53 -9 -82 19 -56 -140 226 51 146 -108 21 -3 -112 -53
6104 -53 1 -27 39 204 -106 -38 167 -195 -172 -18 111 -107 -27 29 50 -14 16 -86 -250 -74 73 -271 -43 13
6128 13 140 98 -84 138 -167 -16 -308 -24 34 25 104 242 25 10 95 -55 177 -93 -6 13 59 -24 -135 -80
6152 -80 31 -14 211 126 -245 14 83 47 144 15 -60 111 -11 -28 -77 19 12 -97 -206 -100 -148 1 -50 -69 -36
6177 -36 -36 -114 60 37 103 -128 116 42 294 -37 -58 100 -20 201 173 36 27 -50 187 -7 -26 174 63 -30 -121
6202 -121 -4 89 -167 -4 -114 226 246 166 61 -79 -33 -216 -61 -135 -71 206 139 -121 -9 114 217 -25
6224 -25 47 -148 189 159 -151 165 234 -25 142 21 16 12 -73 -194 -120 34 32 -43 27 66 45 50 207 42 39 34 -155
6251 -155 81 -58 8 119 58 108 72 217 -196 -167 -40 28 165 27 -90 -346 10 -96 -51 -27 -96 -34 115
$$ packed form
6080b14K92q4p9Q6j77lJ00J47k32J51O6o2p3J01p5q4L66j75R5k54J29k4j09N9
6104e3N4k8O6J65l10O8K05l62K3J54J29k18Q0N6K1o4L0j02j64J76J47l44K28N6
6128A3J27m2j82K22l05J51k92K84N8rP9J38k17j5Q5j50K32k70Q7J9M6q3j11N5
6152h0J11m5K25q5l71K59O9l6R7j29p5J71j22j7m9R6pj09j09J06m8J49n1j9L3
6177c6%p8J74k3O6k31K44p4K52l31k1J58j20K21k8j37rp7K37j94j9K00j11r3r1
6202a21J17R3k56J63j10L40K0q0j05j40M6j83J55p4O4K77o7k60J12J23J03k42
6224b5P2j95L37l0l10L16O9k59J67j21nmq5j21P4J54kp5P0L9k1NJ57j65lnj89
6251a55K36j39O6J11o1N0l6J45m13K9J27O8J37j38j17k56L56j06M5K4o9O2J49
$$ plain form
6274 115 -95 6 28 -193 83 -23 -96 66 -197 170 174 121 89 18 -66 -224 -39 -225 93 -205 -67 -48 -76
6297 -76 -140 -128 16 -123 -42 55 -114 25 154 -22 -8 -43 141 82 -25 130 15 168 339 29 105 -20 -24 -2
6321 -2 -49 -52 -50 28 -153 136 31 79 10 -150 -346 -239 124 -110 60 -80 -55 38 26 -52 134 192 -64 96 -89
6346 -89 -306 20 -295 -54 225 -91 88 -98 58 3 37 48 -298 -189 139 -155 -50 162 -21 -297 -75
6367 -75 -209 67 175 20 -10 -105 -284 -46 -48 -57 209 299 84 3 177 -91 25 -180 -1 10 361 -24 -185
6390 -185 145 143 32 -122 81 16 -100 -92 -75 192 -59 -256 -54 40 46 -70 72 66 77 10 109 59 -4 -275 208
6415 208 -25 -10 52 62 -146 -112 38 16 -154 -85 -182 -162 13 -155 -165 -57 -189 131 -182 -70 32 -187 -159
6438 -159 -189 -51 11 -40 270 -54 -96 58 81 51 -21 -210 398 -10 -43 86 165 161 -11 -287 0 -242 -47 94
$$ packed form
6274A15k10J01K2k21K76j06p3J62k63L67Mn3l2p1q4j58J85j86L18k98J38J9k8
6297g6o4J2J44j39Q1R7j69J39J29j76J4l5J84n9j07J55j15J53J71l10P6j25mK2
6321bm7lKP8j81K89j05M8o9j60j96J07L63k34J70j40K5R3j2p8J86N8k56J60j85
6346h9k17L26l15K41K79l16J79j86J56n5L4J1l46J09L28k94J05K12j83k76K22
6367g5j34K76J08j55l0r5j79K38krK66R0k15q1J74k68J16k05J79J1L51l85j61
6390a85L30kj11j54K03o5j16QJ7K67k51j97K02R4Oj16J42oJ1o7R9n0o3k71M83
6415B08k33J5O2J0k08L4J50k2j70O9r7K0J75j68j0J08j32L20l13J12J02k19K8
6438a59l0J38O2n1L10l24m2J54K3l0p2j89O08m08l3J29P9mj72k76K87k42J95J41
$$ plain form
6462 94 -136 69 -108 -60 -274 -22 214 -115 -158 -130 -5 63 -173 -153 -229 56 174 -434 -196 177 -4 102
6484 102 81 82 -69 5 -21 50 112 152 -190 -8 -55 -80 -31 -66 273 12 -71 -234 -163 -64 39 -61 -107 -145 -38 86
6510 86 -22 18 -251 5 -219 80 -64 195 -107 35 3 -142 -9 -29 45 -183 -61 2 -269 206 94 65
6532 65 30 -201 -189 -5 -48 -112 101 271 25 -198 -67 46 163 -188 -344 -242 142 -145 -12 -93 16 82
6554 82 107 -15 112 1 -37 0 17 197 218 59 268 -43 38 -224 -6 54 -38 -22 217 -3 3 155 -20 -75
6578 -75 1 -178 26 -30 145 5 -161 -131 132 -67 -20 -50 -116 -78 126 11 -55 209 -8 93 -66 137 109
6601 109 -17 -141 -25 137 -134 -57 -79 -11 87 -62 54 83 55 133 25 -204 100 -84 -131 53 120 46 19 153
6625 153 186 107 89 30 -27 -77 -62 106 -48 229 -14 167 108 -64 126 63 152 60 48 70 8 -55 -64 -16 -194 -127
$$ packed form
6462I4k30K05j77M8k14K52K36l29m3K8J25O8k36K0p6K85J18o08K38L73j81J06
6484A02k1Jj51P4k6P1O2M0l42J82m7k5M9l5L39k61q3j63P1R9J03j00m6l8J07J24
6510H6j08M0k69K56k24K99j44K59l02J42l2j45J33k0P4k28J22O3k71M75j12k9
6532F5l5k31J2J84m3o4K13J70k46k23J31J13J17l51j56J02L84k87J33q1J09O6
6554H2K5j22J27j11l8L7J7J80K1j59K09l11Q1k62K18O0r2J6K39k20OJ52j75n5
6578g5P6j79K04n6J75j40j66L0K63j99M7l0o6L8K04j15o6K64k17J01j59K03k8
6601A09j26j24J16J62k71P7k2O8R8j49J16K9k8P8j08k29L04j84m7J84O7p4k7J34
6625A53L3p9j8n9n7n0J5J68j54K77k43J81n9j72J90o3Q9r2j2K2o2o3rM8j78O7
$$ plain form
6651 -127 30 13 -58 -74 -204 -13 263 -249 -43 -69 -81 66 -26 45 106 -168 -71 62 23 157 -99 -178 -105 14
6675 14 6 -74 -211 2 101 23 141 -159 177 86 25 -22 -191 192 103 14 6 1 -89 27 -71 -11 -247 -13 22 -32 57
6702 57 -83 201 56 -259 -29 110 -3 116 25 227 13 193 -109 -8 -41 283 78 14 -1 133 136 -64
6724 -64 -2 -113 -204 -260 140 80 -19 84 121 -135 41 -57 178 -244 173 99 27 -4 90 190 52 -234 -12 77
6748 77 45 72 -27 -165 44 -27 49 -124 42 -264 -243 60 27 277 -39 222 -304 167 -42 105 140 -61 272
6771 272 223 33 -34 -218 -54 91 158 -112 122 55 -112 -193 8 -117 42 179 4 199 -52 1 99 -89
6793 -89 -17 -200 117 13 -149 44 81 44 83 33 -218 154 161 32 160 206 -77 57 -150 -91 105 147 131 -168
6817 -168 -40 74 -61 8 94 -154 -311 -55 183 -22 10 -202 -5 157 -278 92 76 -311 16 -280 352
$$ packed form
6651a27J57j7p1j6j30J91K76n12K06k6j2J47r2P1O1k74R7J33l9J34k56p9P3J19
6675A4qq0j37K13R9p8J18l00L36r1o1m7j69L83q9q9qnr0J16r8O0k36K34L5n4Q9
6702E7j40K84j45l15K30J39j13J19r1K02k14J80l02J01l3L24k05o4j5J34Lk00
6724f4O2j11r1n6M00o0r9J03L7k56J76r8K35m22M17p4p2l1R4J00j38k86K22Q9
6748G7l2K7r9j38K09p1P6j73J66l06K1L03l3K50l16K61n26M71k09J47L5k01L33
6771B72m9j90o7j84J64J45O7k70K34o7j67q1K01j25J59J37j75J95k51N3R8j88
6793h9P2j83L17j04j62J93L7l7L9n0k51L72Pj29J28M6k83J34k07N9J96M2j6k99
6817a68J28J14j35O9Q6k48j57K56K38k05L2k12J97J62m35L70j6l87L27k96O32
$$ plain form
6838 352 20 125 92 153 160 -184 109 159 169 -84 -58 -44 -23 -64 34 -151 149 2 -76 31 56 33 179 -41 149
6863 149 16 -84 1 90 88 44 109 -12 -62 103 -91 -231 285 122 -184 117 -183 -409 -43 114 248 64
6885 64 -184 378 87 -29 -135 -176 313 -190 -99 -67 16 233 159 35 -95 -7 13 69 130 18 -48 55 -400 148
6909 148 -232 51 -26 -9 99 0 -88 -175 239 16 -39 29 -61 65 -128 -93 96 -24 -122 -154 89 -44 48 102
6933 102 74 0 -75 -31 -42 -53 -93 173 -195 -72 -207 -228 131 -198 -262 73 -145 170 83 -73 91 -68 -86 -75
6957 -75 12 -59 452 -24 152 -12 -101 171 183 42 97 -65 56 30 51 -5 -340 179 104 19 -11 -266 51 12
6981 12 87 22 65 -126 230 -153 38 -312 -87 -91 -37 56 54 123 54 -67 -106 -8 -219 118 -64 -188 -192 70 -165
7006 -165 110 37 133 30 -78 109 -213 -17 16 -19 20 -120 40 161 9 -213 74 68 11 31 -7 12 31 0
$$ packed form
6838C52l32J05l3O1Pl44K93N0J0k53K6J4K1m1R8j85L00j47p8J07K5k3J46k20J90
6863A49j33j00Q5Q9km4O5j21n0J65j94j40N16j63l06L01l00k26L66J57J34j84
6885F4k48N62k91j16j06m1M89n03R1L2Q3K17p4j24j30Q8K0N6O1j12o6J03m55N48
6909A48l80K83p7J7J08r9q8q7M14k23n5O8r0J26j93L5J89j20r8l2K43j33R2N4
6933A02k8p4p5M4j1j1m0K66l68J23j35k1L59l29o4L35k18L15q7j56J64j59j8J1
6957g5Q7p1N11m76J76j64q9K72J2j41N5j62J21k6K1n6l35N19p5q5l0k55L17l9
6981A2P5o5M3j91L56l83J91l50K25mN4R3kO9o9j21l9R8k11L37j82j24mK62k35
7006a65K75p3R6j03j08J87l22J96L3l5L9j40J60J21j52k22K87on7K0l8J9J9l1
$$ plain form
7030 0 165 20 4 -81 43 -82 -117 -17 -48 -167 -106 -214 135 -114 -21 32 -124 56 161 -174 19 75 -60
7053 -60 -86 96 147 104 188 -45 58 113 -34 80 53 106 -66 -156 140 -42 54 -92 -283 -3 312 55 -275
7076 -275 -277 90 -83 -460 301 70 36 -271 112 18 309 -100 -11 465 2 42 106 239 -317 -47 25 30 27 -46
7100 -46 124 -192 97 113 4 -64 -183 -114 -16 -205 -139 72 -36 -122 130 -84 -22 106 38 -71 67 22 103 -154
7124 -154 -99 81 -136 -42 26 -68 16 2 -158 -10 11 -92 3 -42 125 11 80 -171 102 -212 13 -152 84
7147 84 57 1 129 -77 -7 17 30 -414 158 292 66 171 -199 -182 -69 12 209 83 102 135 -122 51 -69
7170 -69 -172 111 164 3 -244 -42 -96 -45 -276 130 -50 228 142 25 6 -18 265 -40 34 -133 -290 -23 217
7193 217 -12 161 -18 -79 -263 40 -98 -175 -4 68 -207 -90 150 -110 148 -107 21 -190 -193 195 156 262
$$ packed form
7030@J65j45j6q5J24j25l5J00l1j19O1j08L49k49R3N3j56J80J05l35J93N6j35
7053f0k6J82N1m3Q4k33J03N5j47J14k7N3j72r0K96j82R6j46j91K80L15k57l30
7076b75kL67j73l77P61k31l4l07L83r4K91m09Q9M76m63M0O4J33n56K70P2Nlp3
7100d6J70l16K89J6j09o8j19O9R8j89O6K11j08q6K52k14O2J28o8j09J38m5Q1k57
7124a54N5J80k17R4O8r4Q4j4j60J48K1j03R5m5J67j14O9k51K73l14K25j65K36
7147H4k7n6J28k06P0K4J3m44N72J34k26J05l70J7J13Q1J97j26J9L3k57J73j20
7170f9j03K83N3j61k47K02n4N1k31M06j80K78q6j17j9k4K83l05P4j67j57K67K40
7193B17k29J73j79o1j84L03j38p7J71P2k75J17K40k60K58k55J28k11lL88l9J06
$$ plain form
7215 262 39 192 60 24 -143 215 -68 208 -99 -135 153 -28 177 -418 -6 49 38 -105 -40 44 148 30
7237 30 -44 61 19 -169 -16 198 -66 126 70 -216 -31 0 -35 228 -136 -60 -70 113 -38 -52 69 -12 -186
7260 -186 139 93 -100 226 -164 -125 164 293 16 -89 -214 84 -138 -110 140 -44 32 353 -107 108 -136
7281 -136 24 290 14 146 15 64 69 -2 -59 76 16 -135 162 -75 -131 82 -6 -107 -64 19 -49 136 57 48 -112
7306 -112 -131 -141 137 -13 29 -61 135 33 -178 29 -65 73 29 -262 -63 52 140 -138 44 146 16 87 -145
7329 -145 -90 -87 218 -68 -79 -279 -52 54 -187 -43 100 -248 60 28 74 17 127 36 -38 225 57 -110 100
7352 100 165 76 105 -107 -83 114 -7 -128 111 49 82 113 57 -227 54 133 -345 -25 49 98 -433 -174 262 102
7376 102 -115 36 -158 -98 139 160 -31 214 73 114 -145 22 -216 -253 178 -9 381 97 -24 151 -116
$$ packed form
7215B62k23J53j32l6j67L58k83K76l07l6K88j81K05n95M12N5j1j43O5Q4J04j18
7237C0p4J05m2j88J53K14k64J92n6k86J85L1l5K63l64P6j0J83j51j4J21q1j74
7260a86L25m6j93L26l90L9K89J29k77j05j25K98k22K8K50j84P6L21m60K15k44
7281a36J60K66k76J32j31M9Np1n7J35o0j51K97k37n6K13q8j01M3Q3o8J85p9rj60
7306a12j9j0K78j50M2r0J96j02k11K07r4J38m4k91J99J15Q8k78J82J02j30P1k32
7329a45N5LL05k86j1k00K27J06k41J44J43l48L08l2M6n7J10r1p4K63j68j67K10
7352A00O5q9K9k12K4J97j21j21K39o2L3L1n6k84K81P9m78L20P4M9n31K59M36j60
7376A02k17J51j94O0K37K1j91K45j41M1k59J67k38l7M31j87L90k84j21J75k67
$$ plain form
7397 -116 86 50 -62 0 -40 -75 34 14 -112 56 -111 160 124 130 -100 -124 -54 85 -44 -132 -100 -1 29 7 2 8
7423 8 245 13 35 -75 43 -7 177 -59 49 -332 -193 352 199 -37 55 121 -101 -135 -201 83 -171 34 -72
7446 -72 72 169 69 -117 103 20 -3 -268 -71 134 -20 28 11 -103 -226 -115 201 -60 205 -57 15 310
7468 310 -207 -47 -67 36 1 33 -244 -92 -255 168 -56 99 273 -38 80 46 46 136 127 15 -41 -119 -95 -5
7492 -5 -76 60 117 -16 -67 102 53 150 -54 -51 19 -70 -192 10 -416 -85 -248 -260 49 -123 -40 -68 -88 -154 186
7517 186 264 -55 205 23 -70 183 -13 37 194 6 59 -282 -202 -166 62 -83 111 -74 -161 287 86 48 -85
7540 -85 138 61 96 158 105 -107 -34 183 80 -13 -39 110 79 -159 -18 -203 7 -21 -24 -174 -18 146 25 -286
7564 -286 -267 -266 -86 -10 -245 54 -7 -121 58 -52 79 98 -54 -108 -9 -177 28 203 -190 -72 83 -63 -165
$$ packed form
7397a16K02l6j12O2m0l5J09k0j26J68j67K71l6Ok30k4P0J39j29q8L2R9L0k2nO
7423HK37k32K2j10J18n0J84k36J08l81J39N45j53k36R2O6k22l4o6K84k54K05j06
7446g2J44R7j00j86K20q3k3k65J97K05j54M8j7j14j23J11L16k61K65k62P2K95
7468C10n17J60k0J03l5L2k77J52j63M23k24J55J74l11J18l4%R0rj12n6p8K4R0
7492ep1J36N7j33n1J69m9R7k04LP0q9j22K02m26L31j63j2L09j72Q3k8k0o6L40
7517A86P8l19K60j82r3K53j96N0J57j88N3l41Q0L6K28j45J94j85q7M48k01l8j33
7540h5K23p7L5O2n3k12P3K17j03r3k6J49l1k38J41j85K10k8lj50J56J64j21l11
7564b86J9JJ80P6k35K99o1j14J79j10J31J9j52n4R9j68K05J75l93J18J55j46j02
$$ plain form
7587 -165 34 -202 -19 52 41 42 -228 177 -261 -75 136 -89 5 -84 61 64 73 -24 -53 128 -98 -64 -54 104 235
7612 235 93 109 -83 218 149 121 -81 14 55 -219 -152 34 -4 -16 -14 80 185 47 101 -158 216 308 90 -303
7636 -303 -107 201 -177 178 418 -122 -99 156 -56 134 -122 -161 188 66 13 31 77 122 -78 -36 97 -181
7658 -181 -64 -90 73 352 6 163 9 198 115 -32 52 41 105 3 -126 60 150 -120 -21 16 15 133 -98
7681 -98 59 -21 -53 124 -152 -140 147 -10 43 -299 24 -56 78 93 19 -159 201 274 71 49 24 123 39 57 -127
7706 -127 217 -116 -2 -162 -124 31 -111 -168 98 270 1 40 -256 74 7 156 -182 -135 73 3 60 108 -206
7729 -206 35 -185 116 -13 -18 -56 -81 157 -95 174 87 61 -105 -64 31 31 -310 -121 207 -117 -4 30 -317 -13
7753 -13 -333 -154 -338 190 -66 -74 -93 240 -107 50 -183 173 -310 -94 -42 -187 36 -192 -195 -154 -37 37 146
$$ packed form
7587a65J99k36J83P1j1Jk70M05m38J86K11k25R4q9J45LRr7k9J81k26L4J0J58J31
7612B35j42J6j92L01o9k8k02R5M1k74O7J86l8j2KR4J05j38N4k59L74R2k18l93
7636c03J96L08l78L55K40n40K3K55k12J90k56l9L49j22n3J8M6M5k00M2J33k78
7658a81J17k6J63K79l46J57j54J89q3j47Q4j1O4j02j29J86R0k70R9L7jJ18k31
7681i8J57q0l2J77k76J2K87j57N3l42L23q0J34J5p4j78L60P3k03k2k5R9q4J8j84
7706a27L44l33J14j60L8J55j42n7K66J72k69L9k96L30o7J49l38M7K08p0N7M8l14
7729b06K41k20L01j29nl8k5K38k52K69q7k6j66M1R5%l41J89L28l24J13L4l47L04
7753a3l20J79j84N28k56qj9L33l47J57k33L56m83K16N2j45K23k28lM1J17P4J09
$$ plain form
7776 146 -136 27 -64 108 -88 -8 -299 -257 -195 111 137 -208 -49 -37 53 -25 -78 -157 4 -18 -24 -37 -16 -84 0 -130
7802 -130 79 15 -37 -22 -117 -119 60 -102 -51 -75 -263 366 8 111 21 -2 -349 -59 -44 -45 -222 -215 -152 -54 -105 236
7828 236 176 140 277 59 61 209 64 15 217 -20 122 -87 -91 233 -100 2 62 -106 -83 -8 -270 112 -109
7851 -109 -47 107 -197 5 38 198 29 33 190 -14 -43 19 -23 -31 -78 54 257 58 59 153 226 -183 29 121 -259
7876 -259 -106 47 -136 16 -2 69 20 12 -98 -63 154 77 112 -129 7 27 -89 49 -141 -45 -320 38 -100
7899 -100 194 -216 -76 117 -36 -130 55 220 -228 22 234 -167 43 30 -58 -245 2 132 139 72 -75 -156
7921 -156 -28 -212 -90 58 -354 313 33 49 89 -102 28 -335 178 105 124 -161 -44 -18 56 62 138 136 11 152
7945 152 219 195 -90 3 200 168 27 -34 31 166 166 74 -172 255 -41 -169 98 423 -15 51 -156 -36 189
$$ packed form
7776A46k82J63r1J72j96Q0k91M2O2L06K6l45J59J2R0p8n3p9J61k2oj3K1o8Q4j30
7802a30K09o4n2J5r5kJ79j62N1k4j88O29l58J03r0k3l47K90J5jj77PO3R8n1L41
7828B36o0l6J37k18KJ48j45m9K02k37J42k09mL24l33J02O0j68K3P5k62L82k21
7851a09O2J54l04K02L3J60j69MJ57k04k9O2m2qm7J32K03j99JR4P3m09K12R2l80
7876b59J53J53j83J52j8P1m9qj10L5K17p7L5k41J36K0j16J38j90R6k75L58j38
7899a00K94m10J40J93j53r4J85J65m48K50K12m01K10j3q8j87K47J30Po7j47q1
7921a56J28j84J22J48m12O67k80J6M0j91J30l63N13p3J9k85J17K6P4OP6kj25J41
7945A52O7k4k85R3J97l2j41o1O5J35%r2k46M27k96j28K67L25m38O6k07J20K25
$$ plain form
7968 189 -60 -323 -49 94 176 19 178 -209 -35 67 -292 -103 -153 -24 30 154 94 -90 14 182 25
7989 25 112 89 -71 12 -26 120 168 -81 67 -168 -140 -158 -208 -152 -96 14 -83 43 -20 35 256 239 -40 -146 47
8014 47 99 238 53 -61 -159 -72 21 -63 50 -124 -110 150 -21 -220 -54 206 -75 117 -239 20 114 31 -172
8037 -172 35 -151 -87 55 -157 150 -37 104 136 -337 10 41 72 13 -122 38 -39 -188 -92 92 -39 -153
8059 -153 -65 169 261 -88 151 221 72 64 72 160 42 -88 -161 190 27 -94 49 -264 -16 -119 13 -37 50 50
8083 50 -142 -115 -262 2 -1 -177 -59 -104 -9 -15 119 277 119 132 40 -126 107 -170 -144 297 100 -17 -132 -173
8107 -173 -148 -144 58 -51 -27 87 -64 -84 63 -52 -272 155 -3 -266 -9 -70 -133 -176 -164 80 -248 -106 -108 25
8131 25 124 -260 86 -313 63 212 83 98 -7 120 203 -122 390 21 9 98 -194 79 134 119 210 -276 117
$$ packed form
7968A89k49k63K74J43Q2j57J59l87J74J02l59J89n0J29N4J24o0j84J04J68j57
7989B5Q7k3j60Q3l8J46M8k49J48k35K8j8n0N6N6J10r7J26o3N5K21j7k79j06J93
8014D7N2J39j85j14r8Q7R3q4J13j74J4K60j71j99J66K60k81J92l56K59R4q3k03
8037a72K07j86O4J42k12L07j87J41L2m73L47L1L1n9j35J60p7j49R6J84j31j14
8059a53Q8K34R2l49K39P0j49qQQ8j18j30p3L51j63j21J43l13K48j03J32n0Q7%
8083E0j92K7j47K64lj76J18m5R5oJ34J58j58J3r2j66K33k77K6M41j97j17j15m1
8107a73K5MK02j09K4J14j51k0J47j15k20M27j58k63K57o1o3m3J2K44l28J42kJ33
8131B5R9l84L46l99L76J49j29J5j05J27Q3l25N12l69j2Q9k92K73N5j5R1m86L93
$$ plain form
8154 117 78 -176 -166 -3 116 -137 -345 118 -37 35 -47 120 -94 -75 -30 26 195 160 29 17 15 -272 -78 52
8178 52 139 227 54 -71 -23 -8 50 -56 -30 -71 21 -104 -62
$$ packed form
8154A17l9k54J0J63J19k53k08M63j55P2q2J67k14J9M5N6J69l5j31j2kk87J94J30
8178E2Q7Q8j73j25M8J5N8j06K6m1R2j25M2
8191f2
$$ Imaginary data points
##PAGE= N=2
##DATA TABLE= (X++(I..I)), XYDATA
$$ plain form
0 0 0 0 0 0 0 0 0 0 0 0 0 0 0 0 8 -8 8 -8 8 -8 14 -16 16 -23 24 -28 32 -39 41 -48 56 -63 71 -80 92 -103 115
37 115 -127 143 -159 177 -196 218 -242 266 -291 323 -354 391 -430 476 -524 576 -636 705 -783
56 -783 870 -972 1093 -1238 1415 -1636 1921 -2305 2850 -3680 5084 -7901 15640 -78677 -218610
71 -218610 109370 188752 -124563 -163157 143602 130485 -143204 -94862 150420 64485 -139355
82 -139355 -30717 135771 3769 -121926 21249 111573 -42481 -99595 56211 87492 -69917
93 -69917 -80758 72863 69603 -80959 -68085 77611 61095 -79827 -61039 75932 59478
104 59478 -72339 -57483 70444 59141 -65264 -54140 66374 53469 -61835 -43994 64024
115 64024 38624 -60797 -25627 61555 14345 -60029 -1484 57321 -14644 -57941 26314 51777
$$ packed form
0@%%%%%%%%%%%%%%Qj6J6j6J6j6K2l0L2l9M7n2O0p1Q0q9J04j19J34j51J72j95K18
37A15k42K70l02L36l73M14m60N08n57O14o77P45q21R06j000J100j212J341j488
56g83J653j842K065k331K653l051L557m226N155o530Q764j2985K3541r4317j39933
71b18610L27980P9382l13315l8594L06759j3117k73689M8342K45282q5935k03840
82a39355J08638J66488j32002j25695J43175R0324j54054n7114J55806L1281j57409
93f9917j0841J53621l260j50562J2874J45696j6516j40922J8788J36971j6454
104E9478j31817J4856J27927j1303j24405J1124J20514j2905j15304J7841J08018
115F4024k5400r9421L5170Q7182m7210p4374N8545N8805p1965m3297Q4255K5463
$$ plain form
127 51777 -43358 -50755 53047 43452 -65950 -39872 71568 31400 -76524 -24853 77594
138 77594 18800 -73847 -10506 70882 7704 -59457 -227 53087 -160 -40008 3966 30931
150 30931 -3479 -20677 3924 12093 -4348 -6427 2719 140 -4986 -392 3433 -3368 -8046 -1332
164 -1332 8030 2327 -12851 -7081 16794 12275 -20924 -15887 27596 21762 -31202 -22889 38685 26842
178 26842 -40943 -23723 46977 23628 -46833 -18065 48137 11904 -47020 -6014 42231 -3742
190 -3742 -39287 9785 30447 -20381 -25070 25381 14833 -33390 -8204 37086 -1080 -40733
202 -40733 8008 42517 -12817 -40571 19657 41572 -19636 -35997 23100 34464 -20192 -28498
214 -28498 19887 25398 -16083 -21013 12535 17094 -9639 -15789 5187 11129 -5932 -12347 2436
$$ packed form
127E1777r5135p397J03802r595j09402K6078J11440m0168j07924N1671J02447
138G7594n8794r2647O3341Q1388o3178o7161N9230N3314n3247l9848M3974K6965
150C0931l4410j7198K4601Q169j6441k079R146k579n126M594L825o801m678O714
164a332R362n703j5178N770K3875m519l3199N037M3483n834n2964Q313O1574j1843
178B6842o7785J7220P0700k3349p0461K8768O6202l6233n8924M1006M8245m5973
190c742l5545M9072K0662n0828m689N0451j0548m8223K5186M5290l8166l9653
202d0733M8741L4509n5334k7754O0228K1915o1208j6361N9097J1364n4656q306
214b8498M8385N511m1481m930L3548M559k6733o150K0976N942j7061o415J4783
$$ plain form
227 2436 8344 -5779 -9232 6373 7039 -10619 -5558 15963 4099 -20420 124 27661 -1817
240 -1817 -30997 8332 37547 -10623 -38264 18285 41706 -21916 -39921 27271 36924 -32377
252 -32377 -33320 33925 24461 -37738 -18811 35634 8081 -36641 -1154 31934 -9238 -29528 15921
265 15921 24027 -22340 -18051 28636 14109 -30069 -6645 34201 4373 -31696 2041 32387
277 32387 -3189 -28078 6297 24713 -6704 -20333 6027 15238 -6441 -12585 2793 6709 -3343
290 -3343 -5935 -479 1689 70 -1760 -1745 501 1424 40 115 1100 -352 12 3820 1808 -4226 344
307 344 8564 1429 -9056 763 11548 -538 -12707 1462 12425 -3270 -13257 2657 10602
320 10602 -5186 -10323 3815 6156 -5882 -4565 4530 187 -4529 2771 3307 -5426 -1021 9333
$$ packed form
227B436N908j4123l453J5605O66j7658N061K1521j1864k4519K0544K7537k9478
240a817k9180L9329K9215m8170k7641N6549K3421o3622j8005O7192R653o9301
252c2377r43O7245r464o2199J8927N4445k7553m4722L5487L3088m1172k0290M5449
265A5921Q106m6367M289M6687j4527m4178K3424M0846k9828l6069L3737L0346
277C2387l5576k4889L4375J8416l1417j3629K6360R211k1679o144J5378L916j0052
290c343k592N456K168j619j830J5K246R23j384P5R85j452L64L808k012o034M570
307C44Q220p135j0485R819J0785j2086j2169J4169J0963j5695r987J5914P945
320A0602j5788n137J4138K341j2038J317R095m343m716P300N36q733M405J0354
$$ plain form
334 9333 954 -9460 2726 12348 -2705 -10908 6179 11543 -6596 -9422 8123 7473 -8605 -5179
348 -5179 8422 1234 -9008 555 6258 -5204 -6912 6450 3116 -10084 -2362 10611 -478
361 -478 -11351 2532 11400 -3754 -10058 5754 9772 -5109 -5991 6921 5850 -4319 -1723 4859
375 4859 1274 -2311 993 1127 -2645 -110 2842 -2920 -4158 2640 2384 -5507 -3250 4688 840 -6062
391 -6062 -733 4710 -1768 -4279 2982 2767 -3849 -282 5946 -295 -4937 3892 6632 -3995 -4908
406 -4908 6903 5244 -6978 -3594 8129 2886 -8112 -1949 6547 162 -7330 -361 4531 -2094
420 -2094 -5191 840 1833 -2252 -1593 1664 228 -1299 1052 1346 -520 313 1727 472 339 1497
436 1497 754 -206 1702 1213 -1319 117 3110 -736 -4407 1258 3980 -3244 -5370 3222 4292 -5916
$$ packed form
334I333q379j0414J2186R622j5053q203J7087N364j8139k826J7545o50j6078L426
348e179J3601p188j0242R563N703j1462j708J3362l334j3200P722J2973j1089
361d78j0873J3883Q868j5154o304J5812M018j4881q82J2912j071j0169K596O582
375D859l585l585L304J34l772K535K952n762j238O798k56p891K257P938l848o902
391f062N329N443o478k511P261k15o616L567O228o241m642Q829K740j0627r13
406d908J1811j659j2222L384J1723n243j0998O163Q496o385p492O969M892o625
420b094l097O031R93m085O59L257j436j527K351K94j866Q33J414j255j33J158
436A497p43r60J908m89k532J436K993l846l671N665K722p224k126Q592J070j0208
$$ plain form
452 -5916 -5059 5098 2778 -7151 -2532 6534 666 -6752 790 6912 -1261 -5031 3967 5397 -3894
467 -3894 -2345 5990 2136 -5517 134 5975 -844 -5364 2132 4452 -3238 -4832 2747 2349 -4996
482 -4996 -3310 2797 496 -4224 -1239 2571 -396 -2703 629 2136 -742 -702 1851 1047 -886 255
498 255 2337 710 -809 1276 2104 -107 -873 889 1001 -697 -1187 -2 242 -775 -1280 -493 261
515 261 -675 -1509 -549 141 -858 -1207 -499 515 -227 -726 607 1206 -111 -73 1464 1242 -316 232 2009
534 2009 680 -1155 541 1940 -131 -2052 786 1877 -1616 -2235 1396 832 -3058 -2149 1770 504
550 504 -3105 -680 2465 -425 -2637 589 2247 -953 -1909 1998 2013 -1398 -403 2917 1511 -1855
566 -1855 579 3061 97 -1904 1093 2106 -1395 -1957 1383 906 -2380 -1154 1334 -406 -2346 -296
$$ packed form
452e916Q57J0157k320r929M619R066n868p418P542O122q173l770Q998J430r291
467c894J549Q335l854p653N651N841o819m520P496K320p690j594P579l98p345
482d996J686O107k301m720K985L810k967k307L332J507k878M0K553q04j933J141
498B55K082j627j519K085Q28k211p66J762J12j698m90J185K44j017n05P87P54
515B61r36q34R60O90r99l49P08J014p42m99J333N99j317L8J537k22j558N48J777
534B009j329j835J696J399k071j921K838J091l493o19L631n64l890R09L919j266
550E04l609K425L145k890k212L226J658l200r56L907J5l411R95L320j406l366
566a855K434K482k964k001K997J013l501n62L340m77l286J226K488j740j940K050
$$ plain form
582 -296 1057 -1415 -1782 715 529 -965 -656 1393 259 -503 669 1604 328 27 868 1063 -185
599 -185 77 966 874 -97 139 292 -277 -124 -252 -533 -582 -463 -606 -767 -420 -365 -812 -478 114 -482 -551 167
621 167 420 -222 -75 955 612 -163 819 1760 281 -79 1109 1357 -259 -248 1177 190 -1273 -482 527
640 527 -539 -1471 -122 327 -765 -1368 -111 170 -1522 -1024 339 402 -839 -230 1095 701 -271 300
658 300 1168 742 16 500 1302 489 -60 430 827 76 -518 34 648 -458 -848 -333 71 -758 -1478 -260
678 -260 58 -847 -719 118 53 -646 -373 555 218 -384 108 938 435 56 428 1316 695 92 342 507 270
699 270 -488 15 -92 -454 -583 -459 -87 -269 -716 -561 103 -310 -1063 -324 492 -359 -1024 61 895 -239
719 -239 -582 619 1176 -277 26 1140 1062 -8 80 1001 599 -364 60 783 150 -683 -497 261 -300 -1016
$$ packed form
582b96J353k472l67K497j86j494L09K049j134p62J172R35j276l01Q41J95j248
599a85K62Q89r2r71K36J53n69J53j28k81m9J19j43j61L47N5m47L34N92n96o9P18
621A67K53o42J47J030l43p75R82R41j479l60J188K48j616J1J425r87j463P91J009
640E27j066r32J349M49j092o03J257K81j692M98J363O3j241O09J325l94r72N71
658C00Q68m26p26M84Q02q13n49M90L97p51n94N52O14j106l90N15M04q29p20J218
678b60L18r05J28Q37o5o99K73R28l37o02M92Q30n03l79L72Q88o21o03K50J65k37
699B70p58N03j07l62j29J24L72j82m47J55O64m13p53P39Q16q51o65J085Q34j134
719b39l43J201N57j453L03J114p8j070Q8R21m02r63M24P23o33q33J86P58n61p16
$$ plain form
739 -1016 -453 -39 -770 -785 -146 93 -252 -890 140 435 -405 -774 456 940 -204 -173 1027 1132 -2
758 -2 -40 1230 1032 -668 -313 1128 145 -944 -19 798 -292 -1369 -310 655 -939 -1418 -140 -14
776 -14 -1199 -1046 223 -40 -957 -564 898 376 -501 60 1087 421 -367 585 982 508 81 311 821
795 821 453 -292 8 567 -11 -974 -183 431 -679 -1482 -334 534 -952 -1430 508 468 -1311 -669 1100
814 1100 69 -1147 -202 1333 253 -795 769 1915 -49 -622 1388 1217 -401 -399 1165 591 -1065
831 -1065 -217 877 -153 -1421 143 387 -764 -1286 -142 69 -1062 -586 156 -49 28 180 511 328
849 328 302 307 332 836 632 300 343 782 573 -115 444 597 35 -539 -29 411 -694 -924 48 -38 -1134 -911
871 -911 180 -237 -929 -667 599 -138 -1064 157 766 -59 -748 828 1044 -486 -138 1409 620 -565
$$ packed form
739a016N63M14p31j5O39K39l45o38J030K95q40l69J230M84j144L1J200J05j134
758bl8J270j98j700L55J441r83j089R25Q17j090j077J059R65j594m79J278J26
776a4j185J53J269k63r17L93J462n22q77N61J027o66p88R52L97m74m27K30N10
795H21l68p45L00N59n78r63P91O14j110q03J148Q68j486m78J938m0j779O42J769
814A100j031j216R45J535j080j048J564J146j964n73K010j71j618KJ564n74j656
831a065Q48J094j030j268J564K44j151n22J144K11j131M76P42k05P7J52L31j83
849C28k6NK5N04k04l32M3M39k09o88N59J53n62n74N10M40j105k30R72q6j096K23
871i11J091m17o92K62J266p37r26J221O09q25o89J576K16j530L48J547p89j185
$$ plain form
889 -565 449 995 283 -679 206 634 -370 -562 572 373 -1029 -548 98 -189 -1162 -526 31 -291 -750
908 -750 -186 135 -366 -271 793 197 -135 535 565 -71 108 911 268 -183 485 670 -139 -83 508 124 -664
929 -664 -351 238 -762 -758 -199 88 -881 -808 320 -73 -967 -188 672 -256 -686 496 734 -436 -412 1095
949 1095 716 -766 512 1403 -40 -589 693 877 -520 -408 880 304 -1090 -150 581 -368 -1133 179
967 179 265 -912 -840 279 -447 -1383 61 895 -500 -642 803 548 -978 406 1307 68 -498 1033
985 1033 1326 -430 -89 1484 473 -1055 165 982 -553 -1020 196 176 -1239 -866 805 -269 -1615
1002 -1615 91 894 -735 -1399 330 630 -815 -338 1023 349 -833 783 1230 29 -299 1260 826
1019 826 -614 22 1257 -143 -739 368 854 -722 -611 699 -25 -1444 -1 231 -873 -1396 99
$$ packed form
889e65J014N46p12r62Q85M28j004j92J134j99j402M81O46k87r73O36N57l22m59
908g50N64L21n01R5J064n96l32O70L0o36J79Q03o43m51O68J85q09N6N91l84p88
929f64L13N89j000MN59K87r69P3J128l93q94P79Q60r28m30J182K38j170K4J507
949A095l79j482J278Q91j443n49J282J84j397J12J288n76j394R40P31r49p65J312
967A79Q6j177P2J119p26r36J444Q34j395j42J445k55j526J384R01j239n66J531
985A033K93j756L41J573j011j528J220Q17j535m67J216k0j415L73J671j074j346
1002a615J706Q03j629o64J729L00j445M77J361o74j182J616M47j201l28J559m34
1019H26j440O36J235j400n96J107M86j576J11J310p24j419J443K32j104n23J495
$$ plain form
1036 99 455 -1304 -214 926 -82 -958 489 1125 -494 -438 1283 819 -763 -144 1661 287 -853
1053 -853 609 1430 -475 -862 695 431 -1206 -553 940 -262 -1464 -37 838 -776 -1042 363 404
1070 404 -1208 -332 833 214 -673 294 894 -365 -367 833 828 59 324 818 -70 -227 677 395 -505 -163
1090 -163 851 -247 -1191 111 479 -952 -1034 167 -11 -1417 -326 634 -626 -1155 589 1079 -804
1107 -804 -455 1271 634 -1219 379 1811 144 -973 925 1427 -497 -659 1124 872 -1292 -474 1186
1124 1186 -432 -1483 23 739 -691 -1172 613 181 -1424 -657 824 -125 -964 66 891 -284 -309
1141 -309 660 851 -295 443 1002 225 -95 765 663 -338 168 662 -231 -528 443 333 -883 -432 567
1160 567 -269 -1063 -301 775 -1014 -1144 667 441 -1033 -153 1247 33 -919 546 1481 -459 -757
$$ packed form
1036I9L56j759J090J140j008q76J447O36j619N6J721m64j582O19J805j374j140
1053h53J462Q21j905l87J557k64j637O53J493j202j202J427Q75j614k66J405M1
1070D04j612Q76J165o19q87R67O00j259kJ200np69K65M94q88j57R04k82r00L42
1090a63J014j098r44J302L68j431q2J201j78j406J091R60j260n29J744M90j883
1107h04L49J726o37j853J598J432j667j117J898N02j924j62J783k52k164Q18J660
1124A186j618j051J506P16j430m81J785m32j605P67J481r49q39J030Q25j175k5
1141c09R69J91j146P38N59p77l20Q60j02j001N06M94q93k97R71j10j216M51R99
1160E67q36p94P62J076j789j30J811k26j474Q80J400j214r52J465R35j940k98
$$ plain form
1177 -757 1201 1128 -806 -375 1780 600 -865 53 1205 -580 -1172 502 594 -1169 -599 594 -75
1194 -75 -1302 -204 654 -475 -836 478 159 -934 -287 884 -38 -633 664 965 -265 -47 1181
1211 1181 481 -499 420 804 -281 -330 423 376 -999 -269 879 -213 -987 -95 334 -630 -894 259 101
1230 101 -1157 -60 810 -313 -710 576 1239 -399 -329 1148 689 -758 148 1376 314 -455 769
1247 769 1093 -371 -640 711 369 -758 -620 846 190 -1179 -149 346 -728 -877 441 258 -717
1264 -717 -155 461 202 -689 248 690 -14 -19 847 413 -327 313 846 -35 -498 308 285 -283 -92 321 -168
1285 -168 -616 68 286 -762 -831 318 -111 -1113 -552 588 -303 -965 549 657 -554 -651 890 429
1303 429 -671 -64 954 -144 -712 759 1162 -269 -533 548 636 -808 -193 634 -239 -763 44 386
$$ packed form
1177g57J958p3j934M31K155j180j465R18J152j785n92J674R2j763N70J193o69
1194g5j227J098Q58j129l61J314l19j093O47J171r22n95J297L01j230K18J228
1211A181p00r80R19L84j085m9P53m7j375P30J148j092p74Q92M29r64k64J153j58
1230A01j258J097Q70j123l97J286O63j638P0J477m59j447R06J228j062p69J224
1247G69L24j464k69J351l42j127J38J466o56j369J030M95j074j49J318j83r75
1264g17N62O16k59q91R37M42p04nQ66m34p40O40N33q81m63Q06k3n68J91M13m89
1285a68m48O84K18j048o9J149m29j002N61J140q91o62J514J08j211r7J541m61
1303D29j100O07J018j098n68J471M03j431k64J081Q8j444O15Q27q73n24Q07L42
$$ plain form
1321 386 -718 -484 81 235 -899 -450 352 -242 -383 67 314 -496 -79 852 6 -292 521 637 -31
1340 -31 -171 804 233 -277 76 586 -355 -459 194 256 -656 -661 485 -305 -854 -26 436 -573 -962 226
1360 226 467 -559 -281 809 28 -252 127 723 -50 -280 470 792 144 -66 790 242 -230 366 477
1379 477 -133 -389 292 6 -656 -394 158 -270 -663 -53 -92 -761 -542 174 -170 -434 94 360 -158 -172 586
1400 586 508 -166 48 863 277 -31 304 526 308 -139 577 271 -111 -318 187 26 -511 -565 -16 -314 -654
1421 -654 -68 45 -367 -174 220 -51 -194 -122 280 244 -44 210 275 -59 113 205 165 116 544 302 -118 -10
1443 -10 364 -44 -297 -266 198 -176 -528 -29 191 -341 -496 327 -21 -458 -282 147 -141 -342 2 446 11
1464 11 -154 179 359 -191 207 358 494 -61 257 283 189 -198 297 138 -204 -118 81 -142 -233 -628 -65 -34
$$ packed form
1321C86j104K34N65J54j134M49Q02n94j41M50K47q10M17R31q46k98Q13J16o68
1340c1j40R75n71n10L53N10r41j04O53O2r12nJ146p90n49Q28M62j009l89J188
1360B26K41j026K78J090p81k80L79N96p73k30P50L22o48k10Q56n48m72N96J11
1379D77o10k56O81k86o62K62N52m28l93O10l9o69K19P16l44k64N28K66n18j4P58
1400E86p8o74K14Q15n86l08L35K22k18m47P16l06l82k07N05j61n37n4N49k98l40
1421f54N86J13m12J93L94k71j43P2M02l6k88K54O5l34J72R2m0m9M28k42m20J08
1443a0L74m08k53L1M64l74l52M99K20n32j55Q23l48m37J76M29k88k01L44M44m35
1464A1j65L33J80n50L98J51J36n55L18K6r4l87M95j59l42Q6J99k23r1l95N63L1
$$ plain form
1486 -34 -240 -193 2 -184 -37 -32 -148 175 197 126 -168 160 438 251 88 187 285 24 -32 385 327 -306 119
1509 119 160 122 -730 -147 80 -419 -378 153 -76 -802 -380 195 -128 -482 -243 151 -102 -218 293 179 67
1530 67 -76 488 234 183 118 438 184 146 -125 246 -34 75 156 -189 -132 51 -370 -294 -355 -307 -292 -415 -78
1553 -78 -231 -270 -186 -97 -83 -214 249 150 147 153 189 460 33 354 359 261 -33 12 -67 87 -13 -132 151 -109 -119 -117
1579 -117 18 -191 -260 -383 -364 -355 -216 -252 -48 -176 -9 7 -7 235 354 -4 8 -144 434 207 85 282 149
1602 149 -43 -39 93 386 28 -156 -229 -31 -312 -39 -4 -207 -173 14 -51 -129 -132 56 -145 24 101 -21 -9 -123
1626 -123 209 118 336 -50 296 181 197 427 327 36 -51 127 -86 -282 117 -89 -247 -401 103 -341 -254
1647 -254 -320 -6 -161 -536 65 6 -19 -354 43 405 -48 -47 180 327 69 151 235 -50 -53 -46 94 168 75 96 -132
$$ packed form
1486c4k06M7J95j86J47Nj16L23K2p1k94L28K78j87j63R9R8k61n6M17n8o33M25
1509A19M1l8q52N83K27m99M1N31k29p26M22N75l23l54K39L94k53j16N11j14j12
1530F7j43N64k54n1o5L20k54l8k71L71k80J09Q1l45N7J83m21P6o1M8J5j23L37
1553g8j53l9Q4Q9J4j31M63r9lOL6K71m27L21Nr8k94M5p9J54j00j19K83k60j0K
1579a17J35k09o9j23J9RJ39l6K04j28J67J6j4K42J19l58J2j52N78k27j22J97j33
1602A49j92MJ32K93l58j84p3J98k81K73L5k03L4J87o5p8lJ88k01J69P7j22J2j14
1626a23L32r1K18l86L46j15J6K30j00k91q7J78k13j96L99k06j58j54N04m44Q7
1647b54o6L14j55l75O01n9k5l35L97L62m53JK27J47k58Q2Q4k85lPJ40P4r3K1k28
$$ plain form
1672 -132 -233 -244 -113 -293 -118 -212 -284 -148 -271 -106 -104 -104 104 -169 -129 -18 -157 -112 33 388 146 -12 70
1695 70 517 197 -300 170 289 114 -28 -155 118 -15 -48 204 131 -455 -374 -24 -302 -389 -56 93 -55 -126
1717 -126 -9 -70 -167 -108 163 99 172 312 325 70 187 220 79 282 -8 244 314 154 17 -101 -235 -3 -186
1740 -186 -29 -272 -238 -179 -122 -94 14 46 -166 -19 -29 134 76 20 -8 123 263 393 136 70 207 386 24
1763 24 139 11 27 34 -118 -48 -178 -101 -190 -102 -331 -235 -315 -196 -141 -304 -23 66 -67 -73 -186 -31 -103 336 237
1788 237 195 271 333 295 75 260 157 203 126 221 -37 254 -3 -60 -271 -128 -175 -279 -111 31 -83 14 -248
1811 -248 110 -60 -91 -254 -164 -141 -19 311 -71 -159 62 265 209 348 381 260 474 72 -61 11 57 -45 16
1834 16 129 15 47 -222 -73 -148 -263 -333 -18 15 -151 52 -87 -186 -9 6 313 95 149 14 363 143 209
$$ packed form
1672a32j01j1J31j80J75r4p2J36j23J65K%K08k73M0J11j39M5J45L55k42j58Q2
1695G0M47l20m97M70J19j75j42j27K73j33l3K52p3n86Q1L50k78q7L33J49j48p1
1717a26J17o1r7N9K71o4P3J40J3k55J17L3j41K03k90K52P0j60j37j18j34K32j83
1740a86J57k43L4N9N7K8J08L2k12J47j0J63n8n6k8J31J40J30k57o6J37J79l62
1763B4J15j28J6Pj52P0j30P7q9Q8k29R6q0J19N5j63K81Q9j33oj13J55p2M39r9
1788B37m2P6O2l8k20J85j03M6p7R5k58K91k57n7k11J43m7j04J68J42j14R7k62
1811b48L58j70l1j63R0K3J22L30l82q8K21K03n6J39L3j21K14m02j33P2M6j02O1
1834A6J13j14L2k69J49p5j15p0L15L3j66K03j39r9J77J5L07k18N4j35L49k20O6
$$ plain form
1857 209 186 80 29 57 340 -72 339 -43 -29 77 -131 -180 -234 -50 -62 -88 -198 -89 -33 -10 -41 -76 -213 -45
1881 -45 242 -42 120 162 127 95 -171 282 343 143 68 205 -9 -195 -111 -176 138 -77 -276 -58 -110 -107 -41 -16
1905 -16 -362 -247 -175 -305 81 -97 -132 -130 210 38 235 74 126 259 424 309 47 13 158 50 0 185 -5
1928 -5 -92 -92 267 -24 22 -127 -3 -276 -545 -259 21 -106 -151 68 11 -163 -367 162 224 38 48 303 40
1951 40 140 154 -131 0 -108 63 -136 163 225 28 -40 -84 74 -293 -313 -3 19 20 36 -160 -245 -123 -95 128
1975 128 42 -244 6 127 3 50 57 214 197 -36 -35 90 127 -95 270 54 61 133 236 61 -171 -12 -169 -241
1999 -241 -172 7 -235 -207 -67 -223 -248 -110 65 174 -182 100 276 59 150 145 52 148 312 191 134 -9 159
2022 159 143 166 31 320 -118 -46 -78 -286 -115 -401 121 -82 -252 -223 -11 -131 -201 -220 157 -57 176 135 -63
$$ packed form
1857B09k3j06n1K8K83m12M11l82J4J06k08m9n4J84j2k6j10J09N6K3l1l5j37J68
1881d5K87k84J62M2l5l2k66M53O1k00p5J37k14j86Q4o5L14k15j99K18n2LO6K5
1905a6l46J15P2j30L86j78l5KL40j72J97j61N2J33J65j15k62l4J45j08n0J85j90
1928eq7%L59k91M6j49J24k73k69K86K80j27m5K19n7j74k04N29O2j86J0K55k63
1951D0J00J4k85J31j08J71j99K99O2j97o8m4J58l67k0L10K2JJ6j96q5J22K8K23
1975A28q6k86K50J21j24M7PJ57j7k33JJ25L7k22L65k16PP2J03j75k32J59j57p2
1999b41O9J79k42K8J40j56k5J38J75J09l56K82J76k17R1nr3R6J64j21n7j43J68
2022A59j6K3j35K89m38P2l2k08J71k86N22k03j70K9K12j20p0j9L77k14K33m1j98
$$ plain form
2045 -63 -110 63 148 130 -95 183 212 150 -106 34 346 -390 112 160 -210 -8 2 243 -209 -147 -359 -22 -163
2068 -163 -95 64 -61 -217 85 -123 139 -216 -136 15 5 53 72 -3 70 294 116 19 -74 -38 56 209 244 -118
2092 -118 -69 204 66 -177 -212 140 123 -337 -53 -90 -141 -166 -148 -16 126 -81 197 301 129 -122 56 74 -116
2115 -116 -9 149 205 -129 110 10 -98 7 18 28 -26 -23 -150 -284 -54 127 -206 -266 -194 7 -18 -139 38
2138 38 22 -62 116 0 380 162 274 350 142 149 -17 268 4 -126 195 111 -239 37 120 -220 -118 -68 211
2161 211 -218 -238 -156 -68 -265 -253 145 -35 50 91 302 156 -39 189 -79 266 50 406 284 -154 224 58
2183 58 -36 -49 133 53 -81 -216 -30 209 -174 -198 -133 109 -146 -320 47 -117 37 -166 -229 -69 140 -70
2205 -70 -215 -68 220 32 22 177 146 66 191 230 126 106 -4 501 169 -45 -19 228 -164 23 -34 52 -205
$$ packed form
2045f3m7J73Q5j8k25K78K9o2k56J40L12p36N02M8l70K02J0K41m52O2k12L37j41
2068a63O8J59j25j56L02k08K62l55Q0J51j0M8J9p5P3K24j78r7r3L6R4J53L5l62
2092a18M9K73j38k43l5L52j7m60K84l7n1k5J8J32J42k07K78J04j72k51J78J8j90
2115a16J07J58N6l34K39j00j08J05J1J0n4Lj27j34K30J81l33o0P2K01k5j21J77
2138C8j6q4J78j16L80k18J12P6k08Pj66K85k64j30L21q4l50K76Q3l40J02N0K79
2161B11m29k0Q2Q8j97J2L98j80Q5M1K11j46j95K28k68L45k16L56j22m38L78j66
2183E8r4j3J82q0j34j35J86K39l83k4O5K42k55j74L67j64J54k03o3J60K09k10
2205g0j45J47K88j88j0J55l1q0J25L9j04k0j10N05l32k14K6K47l92J87n7Q6k57
$$ plain form
2228 -205 -328 -105 -144 -263 53 176 -15 -277 -59 98 -153 21 33 207 -93 191 227 166 189 222 -59 -26
2250 -26 -18 162 -117 -329 -103 55 -260 -153 86 -273 -277 72 184 111 -266 -81 312 -284 58 -19 146 156 137
2273 137 131 270 175 177 104 34 118 247 55 -119 86 115 -18 195 -98 117 27 -376 -123 -152 -238 -37 -109 -11 -57
2298 -57 -28 -164 -77 250 71 74 165 101 63 5 -5 380 79 -139 189 -153 -137 152 71 -7 -39 -115 -5 -367 -184
2323 -184 -196 -182 -263 -84 -123 215 -132 -5 161 -52 65 -53 275 -91 48 79 303 244 217 69 119 98 103 329
2347 329 61 68 -43 -179 -187 73 100 -17 -60 78 -114 -115 -29 81 -139 -71 135 133 63 -39 199 165 -68 107 34
2372 34 286 -242 267 -20 191 70 75 -73 92 -129 67 144 -9 83 -112 -36 1 -121 141 -118 -197 -93 -220
2395 -220 -181 17 47 -266 -16 220 249 47 -21 5 -227 -27 343 44 194 62 164 -144 -50 -202 -108 206
$$ packed form
2228b05j23K23l9j19L16J23j91k62K18J57k51J74J2J74l00K84L6o1K3L3k81L3
2250b6QJ80k79k12K26J58l15J07K39l59mL49J12p3l77J85L93n96L42p7J65J0j9
2273A37oJ39r5Kp3p0Q4J29j92j74K05K9j33K13k93K15r0m03K53k9q6K01p2R8m6
2298e7K9j36Q7L27j79LR1o4l8n8j0L85l01k18L28l42J6K89q1p8l2p6J10l62J83
2323a84j2J4q1J79l9L38l47J27J66k13J17j18L28l66J39L1K24n9k7j48N0k1NK26
2347C29k68Pj11j36qK60K7j17m3J38j92jQ6J10k20O8K06kp0j02K38l4k33J75p3
2372C4K52n28N09k87K11j21Nj48J65k21J96P7j53R2j95P6L7j22K62k59p9J04j27
2395b20L9J98L0l13K50K36K9k02o8K6k32K00L70k99J50j32J02l08R4j52R4L14
$$ plain form
2417 206 -36 -258 -201 -105 -354 29 -12 -50 124 -256 177 163 82 95 206 251 -54 130 195 12 190 20 -36
2440 -36 194 53 -12 112 45 -93 -290 -254 -57 -64 -50 191 -352 -232 -123 -97 -119 -1 -192 23 12 -187 -109 69
2464 69 286 111 243 214 -4 23 -118 -123 245 131 -119 -76 131 -14 -20 199 15 -122 -57 -163 -111 93 112 -255
2488 -255 222 -131 -201 -154 -147 -85 59 -166 105 -276 -48 -37 311 -58 24 -121 18 82 37 12 -253 137 51 3
2512 3 -55 -29 17 -3 -233 -267 -131 -193 -65 -70 23 -182 -1 -171 -89 96 -72 165 -71 50 273 -2 -158 104
2536 104 196 216 -301 140 -20 -4 -31 -7 -51 -157 -68 -80 -123 -1 46 -366 -45 -117 32 -196 -139 -80 -65 79 -4
2561 -4 104 90 -11 -36 234 33 75 -78 70 28 97 167 19 -92 133 -95 -143 132 53 -242 -298 -71 -214 -309
2585 -309 57 -85 132 -44 65 179 159 97 88 -26 -95 -189 242 -12 -16 -252 183 39 4 -2 62 -8 224 45
$$ packed form
2417B06k42k22N7R6k49L83m1l8J74l80M33j4q1J3J11M5l05J84O5j83J78j70n6
2440c6K30j41o5J24o7j38j97L6J97pJ4K41n43J20J09K6k2J18j91K15j1j99P8J78
2464F9K17j75J32k9k18K7j41nL68j14k50M3K07j45oK19j84j37O5j06N2K04J9l67
2488b55M77l53p0M7PO2J44k25K71l81K28J1L48l69Q2j45J39O4m5k5k65L90q6m8
2512Cn8K6M6k0k30l4J36o2J28nR3k05J81j70Q2J85j68K37k36J21K23k75j56K62
2536A04R2K0n17M41j60J6k7K4m4j06Q9j2m3J22M7m12L21p2J49k28N7N9J5J44q3
2561dJ08j4j01k5K70k01M2j53J48m2O9P0j48j11K25k28m8K75p9k95n6K27j43r5
2585c09L66j42K17j76J09J14k0o2rj14o9r4M31k54mk36M35j44l5oO4p0K32j79
$$ plain form
2609 45 -228 109 -112 -161 -217 -19 -1 212 -2 60 110 -111 -11 149 18 81 26 27 85 243 174 -15 -56 -36 -142
2634 -142 -4 144 171 46 124 -197 -259 119 -26 196 -154 -106 22 -125 -124 17 -25 187 -126 -414 -131 -85 46
2657 46 68 -39 375 311 -153 141 -40 -63 -13 39 139 -21 -217 112 43 -273 58 42 -37 -22 -63 5 -24 -266
2681 -266 -162 -101 176 -148 109 -70 -41 -9 -35 63 30 -52 6 -93 21 88 57 175 55 46 63 -25 -188 45 -228
2706 -228 61 -127 -185 -204 106 110 -161 -73 -131 163 -132 -136 -109 -47 169 35 121 69 -240 128 -32 -178 25 80
2730 80 -5 84 157 -164 -19 -216 -33 40 88 -199 61 -181 98 -28 8 -218 -174 -52 -82 -51 -259 -53 -181
2753 -181 -15 49 56 -125 35 71 124 46 -16 128 84 -165 -138 82 -107 -142 149 30 -54 -82 -55 86 -278 -362 17
2778 17 -6 18 6 -89 -2 147 107 214 -33 42 -38 28 178 161 107 -290 151 113 -22 -243 9 -45 -56 50 -75
$$ packed form
2609D5k73L37k21m9n6J98J8K13k14O2N0k21J00J60j31O3n5JN8J58o9j89m1K0j06
2634a42J38J48K7j25P8l21o2L78j45K22l50M8J28j47JJ41m2K12l13k88K83M6J31
2657D6K2j07M14o4m64K94j81k3N0N2J00j60j96L29o9l16L31j6p9J5m1O8k9k42
2681b66J04O1K77l24K57j79K9L2k6R8l3q2N8r9J14O7l1J18j20rJ7q8j63K33k73
2706b28K89j88n8j9L10Mk71Q8n8K94k95mK7O2K16j34Q6n2l09L68j60j46K03N5
2730H0q5Q9P3l21J45j97J83P3M8k87K60k42K79j26L6k26M4J22l0L1k08K06j28
2753a81J66O4Pj81J60L6N3p8o2J44m4k49K7K20j89l5K91j19q4k8K7J41l64q4L79
2778A7k3K4j2r5Q7J49m0J07k47P5q0O6J50j7n4l97M41l8j35k21K52n4j1J06j25
$$ plain form
2803 -75 -111 -249 -233 -32 -261 -187 -130 -47 -107 -44 -24 -121 -138 -162 52 -110 128 -233 -208 282 145 11 163 42
2827 42 -37 162 -24 -42 227 64 204 72 -28 -106 -286 132 -245 42 -83 169 -157 -104 -359 -201 118 -302
2849 -302 24 -64 59 -98 147 -148 13 -1 116 120 333 168 284 95 281 -8 -114 59 153 215 -119 -230
2871 -230 1 -207 -151 -238 -162 -89 -66 23 -194 -46 45 40 60 150 278 56 120 -3 225 126 115 93 -139 118 -2
2896 -2 134 240 -16 62 106 26 -167 -216 72 15 102 -167 -145 40 -196 140 80 -148 -14 8 62 67 -260 254 35
2921 35 19 197 282 -151 75 207 90 118 -45 -64 86 -125 -65 90 47 8 -92 111 -47 118 -120 -67 -126
2944 -126 -37 228 -121 38 78 -60 190 140 104 19 -131 99 149 -104 238 188 140 67 125 125 96 -74 -31 -288 -188
2969 -188 17 -91 -197 -122 -92 289 342 -40 173 -165 8 51 -60 17 90 -20 74 59 11 -75 -55 150 -218 319
$$ packed form
2803g5l6j38J6K01k29P4N7Q3o0O3K0r7j7k4K14j62K38l61K5M90j37j34J52j21
2827D2p9J99j86j8K69j63J40j32j00p8j80M18l77K87j25K52l26N3k55J58L19m20
2849c02L26q8J23j57K45k95J61j4J17MK13j65J16j89J86k89j06J73R4O2l34j11
2871b30K31k08N6q7P6P3K3Q9k17J48R1nK0R0J28k22O4j23K28r9j1k2k32K57j20
2896bJ36J06k56P8M4q0j93m9K88n7Q7k69K2J85k36L36o0k28J34K2N4Nl27N14k19
2921C5j6J78Q5m33K26J32j17K8j63j9J50k11O0J55m3l9j00K03j58J65k38N3n9
2944a26Q9K65l49J59M0j38K50n0l6q5j50K30N0k53L42n0m8p3N8%k9j70M3k57J00
2969a88K05j08j06P5L0L81N3l82K13l38J73M3j11P7P3j10R4j5m8q6K0K05l68N37
$$ plain form
2993 319 17 -132 -62 -177 -132 75 83 43 -84 -5 21 9 -242 77 -134 -46 -78 -86 25 133 -144 -75 95 32 -251
3018 -251 66 -128 18 76 -117 54 -42 25 -23 -87 -12 -22 142 -24 27 -213 17 -158 -163 5 -54 -84 -273 13
3042 13 144 181 -72 -240 145 30 80 -123 362 191 93 -96 124 -91 -187 -1 167 32 69 8 -63 -29 -90
3065 -90 -128 -39 -130 35 128 227 -126 -50 -205 84 267 -32 -3 206 -58 440 238 50 30 126 302 59 -317
3088 -317 -173 198 42 -1 109 90 -138 -29 162 -76 -99 -236 42 -192 -87 -26 -271 -1 -377 44 -103
3109 -103 336 -249 25 6 61 58 -109 190 -213 122 184 90 -24 -212 -4 -175 -105 136 -105 -132 -147 243 -167
3132 -167 -43 -47 -92 -231 -179 -221 -263 -35 9 22 29 143 42 -61 191 116 197 223 44 23 -131 376 -145 -8 88
3157 88 -341 -140 54 241 -145 -55 -236 -120 104 -35 21 -19 -241 15 121 -110 132 54 141 13 50 84 129
$$ packed form
2993C19l02j49P0j15M5K07Qm0j27P9K6j2k51L19k11Q8l2qJ11J08k77O9J70o3k83
3018b51L17j94J46N8j93J71r6O7m8o4P5j0J64j66N1k40K30j75nJ68n9l0j89K86
3042A3J31L7k53j68L85j15N0k03M85j71r8j89K20k15r6J86J68j35L7o1p1L4o1
3065i0l8Q9r1J65R3R9l53P6j55K89J83k99K9K09k64M98k02j88k0R6J76k43l76
3088c17J44L71j56m3J10j9k28J09J91k38k3j37K78k34J05O1k45K70l76M21j47
3109a03M39n85K74j9N5lj67K99m03L35O2r4j14j88K08j71P0K41k41k7j5L90m10
3132a67J24mm5j39N2m2m2K28M4J3PJ14j01j03K52p5Q1K6j79k1j54N07n21J37R6
3157H8m29K01J94J87l86R0j81J16K24j39N6m0k22K56J06k31K42p8Q7j28L7L4M5
$$ plain form
3180 129 135 29 130 -159 174 91 -108 -400 -146 -77 -265 -75 -57 84 -337 160 -161 -24 -252 -252 110 -145
3202 -145 48 -82 25 -207 35 -36 -139 7 -58 264 176 -127 23 217 -121 -22 361 221 31 -59 48 -101
3224 -101 -65 -52 96 -55 -116 -107 -42 133 40 -152 -192 4 -64 -29 -310 42 92 -70 13 117 -77 -52 301 94
3248 94 -19 -111 142 71 -35 -175 -229 17 -427 -104 51 -11 -261 -128 -104 -93 -88 -114 -75 -236 -45 -114 130 -37
3272 -37 105 41 -3 120 -65 140 48 33 236 116 -107 -31 -24 -219 -147 -35 0 250 -163 14 -42 -144 -81 -41
3296 -41 90 132 71 -23 21 -161 -202 16 -12 17 74 -128 181 62 -123 131 5 93 -68 -210 -20 -88 68 -30
3320 -30 -47 166 -124 25 -94 -88 -54 -179 -43 -214 27 -224 20 80 -205 244 117 -73 92 235 80 71 177
3343 177 -10 -38 20 85 6 33 -111 165 101 185 104 83 -91 -128 -167 171 -72 -91 -195 -141 51 1 13 199 -59
$$ packed form
3180A29Oj06J01k89L33q3j99k92K54O9j88J90J8J41m21M97l21J37k28%L62k55
3202a45J93j30J07k32K42p1j03J46o5L22q8l03J50J94l38R9L83j40j90r0J07j49
3224a01L6J3J48j51o1RO5J75r3j92m0J96o8L5k81L52N0j62Q3J04j94K5L53k07
3248I4j13r2K53p1j06j40n4K46m44L23J55o2k50J33K4J1Nk6L9j61J91o9K44j67
3272c7J42o4m4J23j85K05r2j5K03j20k23P6Pj95P2J12L5K50m13J77n6j02O3M0
3296d1J31M2o1r4M4j82m1K18k8K9N7k02L09j19j85K54j26Q8j61j42J90o8J56r8
3320c0j7K13k90J49j19OL4j25J36j71K41k51K44O0k85M49j27j90J65J43j55rJ06
3343A77j87k8N8O5p9K7j44K76o4Q4q1k1j74l7l9L38k43j9j04N4J92n0J2J86k58
$$ plain form
3368 -59 19 99 -201 65 -248 86 213 73 116 25 -21 173 234 -71 49 139 -25 -50 10 -166 59 -25 -37 -75
3392 -75 -157 -28 -334 -217 401 -56 -122 297 -123 -68 47 -41 28 13 118 52 -26 -31 -102 -106 118 250 -81 85 104
3417 104 101 96 -224 -24 -38 -55 -143 202 -203 -43 166 90 152 -121 -273 12 50 330 37 -191 137 97 103 -60
3441 -60 -4 -83 85 -221 133 -5 -81 406 -110 -116 97 98 -46 -144 59 -59 -202 118 -3 -76 -279 -47 18 4
3465 4 -59 -126 81 -22 92 -44 -148 -114 -38 129 48 -73 84 -236 33 -37 -7 128 -10 230 145 -175 48
3488 48 20 1 137 -238 -109 -70 -39 -202 -178 30 -42 -129 174 148 49 92 81 105 39 -17 7 -211 -251 170 -235 4
3514 4 269 -53 -17 -25 15 -47 -194 -45 24 167 60 -136 7 -80 -5 -36 125 -64 -47 212 -261 -31 -46 -174
3538 -174 103 -120 -38 -190 30 -158 -64 242 -273 -86 -9 16 87 -12 191 235 43 76 -65 89 199 24 -201
$$ packed form
3368e9P8Q0l00K66l13L34J27j40M3r1m6J94O1l05J20R0j64k5O0j76K25q4j2l8
3392g5q2J29l06J17O18m57o6M19m20N5J15q8O9j5J05o6p8np1mK24J32l31J66J9
3417A04lnl20K00j4j7q8L45m05J60K09p6O2k73j52K85L8K80k93k28L28m0Oj63
3441f0N6p9J68l06L54j38p6M87n16oK13Jj44r8K03j18j43L20j21p3k03K32O5j4
3465Do3o7K07j03J14j36j04L4P6J67q1j21J57l20K69p0L0J35j38K40q5l20K23
3488D8k8j9J36l75J29L9L1j63K4K08p2q7L03k6r9M3j1K4o6n6K4k18m0M21m05K39
3514DK65l22L6qM0o2j47J49O9J43j07j96J43q7P5l1J61j89J7K59m73K30j5j28
3538a74K77k23Q2j52K20j88R4L06n15J87P7K5P1r9K03M4j92L3j41J54J10j75k25
$$ plain form
3561 -201 151 -185 22 -73 -89 -107 -27 -40 127 51 -287 117 202 -5 -220 244 -292 85 119 -67 -55 189 90
3584 90 39 12 -192 75 65 146 77 -149 52 -127 185 150 219 213 40 -82 12 313 -83 124 -152 -71 -88 103
3608 103 314 -51 -91 -121 -79 25 -17 -131 -145 -70 39 -160 -48 -117 -213 -37 -28 13 -173 -81 -36 67 -156 84
3632 84 -161 123 84 12 -182 57 -12 97 67 149 -48 18 105 96 14 -155 89 -193 -23 7 197 -168 121 103
3656 103 81 92 84 92 49 24 68 -112 -5 26 10 -130 -80 97 -16 98 -131 62 196 0 194 307 51 -46
3680 -46 -99 -121 -32 -4 -31 27 192 -112 -160 19 -134 -80 -52 -175 169 170 180 -115 164 -89 -131 259 -141 179 -12
3705 -12 -220 -135 74 -210 93 134 -72 -158 -10 -103 198 -13 -161 -85 -8 233 100 -81 68 -12 -150 -30 82
3728 82 -304 -22 269 106 -44 110 128 -13 25 -153 13 -196 -126 -226 174 20 -17 15 74 -50 57 -291
$$ packed form
3561b01L52l36K07r5j6j8Q0j3J67p6l38M04Q5k07k15M64n36L77L4j86J2K44r9
3584I0n1k7k04K67j0Q1o9k26K01j79L12l5O9oj73j22R4L01l96K07k76Q1j7J91
3608A03K11l65m0l0M2J04m2j14j4P5J09j99J12o9r6J76RM1j86R2M5J03k23K40
3632H4k45K84l9p2j94K39o9J09l0Q2j97O6Q7rq2j69K44k82J70L0J90l65K89j8
3656A03k2J1qQm3k5M4j80J07L1j6j40N0J77j13J14k29J93J34j96J94J13k56r7
3680d6n3k2Q9K8k7N8J65l04m8J79j53N4K8j23L44JJ0k95K79k53m2L90m00L20j91
3705a2k08Q5K09k84L03M1k06q6J48r3L01k11j48P6P7K41j33j81J49q0j38J20J12
3728H2l86K82K91j63j50J54J8j41L8j78J66k09P0j00M00j54l7L2N9j24J07l48
$$ plain form
3750 -291 -144 -205 76 75 -48 -113 -94 -234 274 97 79 100 -123 75 -109 3 57 70 162 120 -168 28 -272 -19
3774 -19 -78 142 -116 -136 325 0 204 191 -31 70 -83 -33 26 -115 -341 -1 -140 -57 -31 -79 253 -61 87
3797 87 119 13 78 302 -33 55 66 -102 123 100 -100 54 -35 20 25 79 110 -123 -36 153 127 -126 79 170 145
3822 145 -171 0 -219 332 -124 184 73 -8 142 307 142 -237 -57 135 6 225 66 -46 99 -132
3842 -132 -210 37 -23 -242 14 -170 183 204 -166 -60 -21 28 -82 -85 168 90 223 221 -145 21 -27 -76 -44 -46 -11
3867 -11 169 24 273 85 -235 -60 73 -87 46 -59 -86 33 -154 -152 -86 75 43 -93 -143 -134 -195 -133 315 -13
3891 -13 161 69 37 173 -132 114 -130 334 98 70 -102 -52 -23 -160 223 -180 28 -50 -4 -100 -185 -124 -23 -239
3915 -239 60 -160 143 32 182 -108 -95 -125 92 -99 -48 -161 -190 225 235 207 -103 95 118 -62 107 -121
$$ packed form
3750b91J47o1K81jj23o5J9j40N08j77j8K1k23J98j84J12N4J3R2m2k88J96l00K53
3774a9n9K20k58k0M61l25K04j3k22J01j53N0N9j41k26L40j39Q3K6m8L32l14J48
3797H7L2j06O5K24l35Q8J1j68K25k3k00J54q9N5NN4L1k33Q7J89k6k53K05R1k5
3822A45l16J71k19N51m56L08j11q1J50J65j65l79J80J92j29K19j59j12J45k31
3842a32p8K47o0k19K56j84L53K1l70J06L9M9j10lK53p8J33kl66J66m8m9L2kL5
3867a1J80j45K49j88l20J75J33j60J33j05k7J19j87KO6J61l2j36n0Ro1O2M48l28
3891a3J74r2l2J36l05K46k44M64k36k8j72N0K9j37L83m03K08p8M6r6q5O1J01k16
3915b39K99k20L03j11J50k90J3l0K17j91N1j13k9M15J0k8l10J98K3j80J69k28
$$ plain form
3937 -121 8 18 -182 265 -190 38 -193 -8 61 -59 21 -96 51 -169 -94 -168 -74 -170 -86 4 58 -112 221
3960 221 -21 149 140 -250 -42 -22 -172 129 -50 73 73 107 -81 -44 266 -211 170 204 -91 -283 -101 138 230
3983 230 61 -23 9 36 -60 -250 184 52 -13 -40 -41 136 9 89 -173 56 -14 -155 145 40 212 73 79 56
4007 56 78 43 -75 -92 29 -196 -84 -87 -238 122 118 142 158 37 70 209 -6 60 -62 -17 -118 144 -151 -137 -271
4032 -271 18 220 -8 2 -189 -116 128 48 20 -105 113 -84 -106 -77 -184 209 73 -134 -134 94 148 -14 51
4055 51 -35 -45 147 -145 -103 55 -24 -103 -26 -94 87 219 -97 -112 172 18 116 -154 -66 19 -173 114 0 -82
4079 -82 -171 -57 239 -28 -129 51 -3 1 84 -95 23 -67 -20 130 -63 -30 173 -111 106 -123 74 -40 58
4102 58 192 -254 -8 -87 -276 71 -54 -26 84 -1 158 162 -199 72 74 -34 133 -20 137 -8 53 -59 77
$$ packed form
3937a21J29J0k00M47m55K28k31J85O9j20Q0j17J47k20P5p4R4r6Q4R0N4j70L33
3960B21k42J70rl90K08K0j50L01j79J23%L4j88L7L10m77L81L4k95j92J82K39R2
3983B30j69q4L2K7r6j90M34j32o5k7jJ77j27Q0k62K29p0j41L00j05J72j39Ok3
4007E6K2l5j18j7J21k25J12lj51L60mK4J6j21L3J39k15O6j22M5j01K62k95J4j34
4032b71K89K02k28J0j91P3K44q0k8j25K18j97k2K9j07L93j36k07%K28N4j62O5
4055E1q6j0J92k92M2J58p9p9P7o8J81J32l16j5K84j54R8k70Q8Q5j92K87j14q2
4079h2q9J14K96k67j01J80n4MQ3j79J18r0M7J50j93L3K03k84K17k29J97j14R8
4102E8J34m46K46p9j89L47j25K8J10q5J59Ml61K71Kj08J67j53J57j45O1j12J36
$$ plain form
4125 77 225 241 -2 -84 261 25 -19 110 -40 -44 -107 -4 28 -211 51 138 -15 34 -45 -242 -122 -82 -3 246
4149 246 -63 -73 87 137 218 163 205 -31 187 228 -79 164 -171 -21 -228 17 -213 82 -197 -136 -17 159
4171 159 -95 -52 -5 53 187 -50 66 65 -47 -44 201 -187 -42 12 -118 -119 -50 174 211 -57 18 -73 -134 64 3
4196 3 -265 -23 -142 -35 -251 236 -45 -100 -94 169 -15 -61 74 72 153 -112 79 -79 193 -16 90 213 77
4219 77 22 -6 -220 145 -88 126 -120 -144 50 15 -59 -260 90 -5 -141 -67 52 27 -79 79 65 72 243 37
4243 37 102 -29 -34 -56 -23 102 84 -147 86 -42 10 45 25 -174 16 20 -178 159 -1 -310 75 -215 95 -177
4267 -177 -78 -26 -146 -170 -311 23 -133 -134 -131 231 105 -139 -81 -108 68 -150 175 -10 13 54 -111 256 125 155
4291 155 112 -87 28 31 57 -152 6 109 -1 -55 41 -54 73 48 -165 25 -193 -222 -145 71 260 -248 75
$$ packed form
4125G7J48J6k43q2L45k36m4J29j50mo3J03L2k39K62Q7j53M9p9j97J20M0P9K49
4149B46l09j0J60N0Q1n5M2k36K18M1l07K43l35J50k07K45k30K95k79O1J19J76
4171A59k54M3M7N8J34k37J16jj12LK45l88J45N4j30jO9K24L7k68P5r1o1J98o1
4196Ck68K42j19J07k16M87k81n5OK63j84m6J35kQ1k65J91j58K72k09J06J23j36
4219G7n5k8k14L65k33K14k46k4J94l5p4k01L50r5j36P4J19k5j06J58j4PJ71k06
4243C7O5j31nk2L3J25j8k31K33j28N2L5k0j99J90Mj98L37j60l09L85k90L10k72
4267a77R9N2j20k4j41L34j56jLL62j26k44N8k7J76k18L25j85K3M1j65L67j31L0
4291A55m3j99J15LK6k09J58J03j10n4R6r5J27k5k13J90k18k9P7K16J89n08L23
$$ plain form
4314 75 54 -178 66 281 2 -74 160 20 -164 207 227 141 33 150 -179 -67 208 -74 38 266 305 -38
4336 -38 -197 79 -96 -188 -76 -130 35 -123 -157 23 -56 144 -151 1 1 150 6 27 71 -31 -25 -102 -208 123
4360 123 68 96 41 60 -13 -107 66 -156 14 -21 -206 13 13 137 -116 -9 -209 132 92 104 16 -211 -244 157
4384 157 -16 -210 -51 -173 -303 -28 58 -7 -176 -85 -16 -28 -160 -113 59 -253 349 -183 -55 310 -50 56
4406 56 223 181 222 140 223 50 145 319 33 -104 106 -202 166 11 72 75 18 165 -48 245 51 -141 -79 309
4430 309 -28 -130 -12 91 -15 114 20 -9 4 -59 -156 -132 73 16 143 -13 -49 -131 49 51 148 -2 -204 221
4454 221 -135 121 1 121 -64 -48 54 -185 166 -113 -26 -142 -23 129 -337 128 104 -31 60 18 -128 6
4476 6 46 72 -86 66 30 120 36 42 143 35 93 1 72 -330 -222 -94 148 -174 63 -155 -373 77 -196 -26
$$ packed form
4314G5k1k32K44K15k79p6K34j40j84L71K0q6j08J17l29J12K75k82J12K28L9l43
4336c8j59K76j75r2J12n4J65j58l4J80p9K00k95J52%J49j44K1M4j02Op7j06L31
4360A23n5K8n5J9p3r4J73k22J70l5j85K19%J24k53J07k00L41m0J2q8k27l3M01
4384A57j73j94J59j22j30K75Q6o5j69R1O9j2j32M7J72l12O02n32J28L65l60J06
4406E6J67m2M1q2Q3j73R5J74k86j37K10l08L68j55O1Ln7J47k13K93j94j92O2L88
4430C09l37j02J18J03j06J29r4k9J3o3r7K4K05n7J27j56l6q2J80KR7j50k02M25
4454B21l56K56j20J20j85J6J02k39L51k79Q7j16J19J52m66M65k4j35R1m2j46J34
4476FM0K6j58J52l6R0q4OJ01j08N8r2P1m02J08J28K42l22K37k18k18M50k73J70
$$ plain form
4500 -26 155 41 81 -84 16 160 61 -192 7 -97 -11 120 133 -146 269 250 -2 5 -81 -212 -331 120 -79
4523 -79 -49 6 -79 -79 -186 160 -384 149 129 -64 -131 -36 36 23 30 -98 -76 -23 73 217 -73 108 49 -5 2 47 39 41
4551 41 -149 -169 72 171 -58 17 -236 -202 -99 -22 33 19 -86 -150 58 -124 -163 86 105 46 8 -67 -71 -108 105 -254
4577 -254 -200 -181 -147 -70 -54 -5 -115 99 237 23 -142 -73 -8 52 -74 31 79 -71 14 5 -80 46 15 158 147
4602 147 -9 272 153 38 21 -158 38 30 -116 -167 -134 56 -162 -128 4 -99 20 -23 -38 -75 141 -123 -27
4625 -27 -60 121 -141 -81 58 140 -62 -64 129 -235 227 -50 -229 -249 -33 -103 -93 75 81 -94 -22 -164 -22 293
4649 293 -26 -108 104 -103 42 45 -92 85 -277 -337 -129 -339 -9 217 -95 173 -16 154 -118 61 224
4670 224 -21 163 111 109 74 -101 -24 -155 152 -44 -136 104 141 151 171 -236 84 -135 -225 149 -279 31 -38 14
$$ packed form
4500b6J81j14M0j65J00J44r9k53J99j04Q6J31J3k79M15j9k52Pq6j31j19M51j99
4523g9L0N5q5%j07L46n44N33k0j93o7R5P2j3Pj28K2N3R6J44k90J81n9n4PM5qK
4551D1j90k0K41R9k29P5k53L4J03P7N5j4j05o4K08j82l9K49J9n9l8p5ml7K13l59
4577b54N4J9L4P7J6M9j10K14J38k14j65O9O5O0j26J05M8j50Q5rq5J26l1J43j1
4602A47j56K81j19j15j7j79J96qj46n1L3J90k18L4J32j03J19m3j5l7K16k64R6
4625b7l3J81k62O0J39Q2k02kJ93l64M62k77j79k0K16p0J0J68Oj75P2j42J42L15
4649B93l19q2K12k07J45Lj37J77l62o0K08k10L30K26l12K68j89J70k72J79J63
4670B24k45J84n2kl5j75P7j31L07j96r2K40L7J0K0m07L20k19r0L74m28L10o9N2
$$ plain form
4694 14 56 -97 -75 -44 142 -18 93 68 185 37 -140 207 36 206 -20 159 21 -129 51 88 31 98 -193
4717 -193 -119 175 39 163 100 140 -134 53 -119 122 -61 -205 -27 -198 -255 -45 17 8 340 -13 162 18
4739 18 24 17 -95 96 190 -34 26 138 -103 -25 -261 -180 -51 294 -145 -127 -41 10 96 -13 201 223 -23 -5 191
4764 191 36 -67 9 14 -132 -168 264 16 92 -13 52 238 -167 -19 100 -146 87 135 -3 -76 -149 -13 2
4787 2 56 89 -95 -144 185 47 152 -38 -34 103 58 -42 -101 90 -19 159 -114 -85 254 229 -57 -140 128 -13
4811 -13 94 28 83 45 16 20 -155 136 228 61 41 64 144 197 197 -146 -1 140 91 201 17 -14 -188 -14 69 73
4837 73 95 -67 238 171 54 12 73 14 -126 -81 -128 -179 43 -41 31 -100 218 189 229 70 246 28 -230 107
4861 107 -95 228 -30 20 -276 110 179 -28 -151 60 -34 -43 117 -52 -63 -51 224 -53 101 25 145 -12 196
$$ packed form
4694A4M2j53K2L1J86j60J11k5J17j48j77L47j71J70k26J79j38j50J80L7n7O7k91
4717a93P4K94j36J24o3M0k74J87j72K41j83j44J78j71n7K10O2rL32l53J75j44
4739A8Opj12J91R4k24O0J12k41P8k36Q1J29L45m39J8Q6N1Q6j09K14K2k46J8J96
4764A91j55j03P6Nj46l6M32k48P6j05O5J86m05J48J19k46K33M8j38p3p3J36J5
4787BN4L3j84m9L29j38J05j90MJ37m5j00n9J91j09J78k73K9L39k5k86q3K68j41
4811a3J07o6N5l8k9Mj75K91R2j67k0K3Q0N3%l43J45J41m9J10j84l1j74J74Q3M
4837G3K2j62L05o7j17m2O1n9j40M5m7n1K22q4P2j31L18k9M0j59J76k18k58L37
4861A07k02L23k58N0k96L86O9k07j23K11r4rJ60j69j1J2K75k77J54p6J20j57K08
$$ plain form
4884 196 -68 295 64 76 -284 -32 132 56 -199 35 133 107 -151 36 -5 -24 399 -72 -83 -76 134 126 40 -155
4908 -155 -140 345 -145 -27 24 86 62 -61 -12 70 -127 -153 -148 -44 -25 -216 -100 80 -9 -162 -202 -88 -236 -12
4932 -12 -6 60 43 -301 16 14 28 -134 211 46 5 27 162 -46 -98 -297 -53 63 -131 -71 -7 132 -210 -160 -170
4957 -170 -103 1 5 16 -140 65 19 -207 -90 48 0 -188 -126 21 -98 334 -132 -291 -49 -147 -143 -31 -53 12
4981 12 29 72 -14 131 155 -175 144 -127 -10 -76 105 22 -171 38 68 -30 105 6 -213 214 183 -45 72 -181
5005 -181 -259 -190 -98 66 -99 179 -124 -59 58 127 -108 -191 -45 201 50 -143 -110 19 27 176 -53 -123 138
5028 138 191 34 -30 -75 89 147 39 3 -29 -4 -123 151 -196 154 29 -329 106 155 37 -73 75 -76 145
5051 145 244 -20 12 148 230 173 -173 181 -133 -19 134 88 186 -26 11 -107 28 -46 58 -97 -23 119 17
$$ packed form
4884A96k64L63k31J2l60K52J64p6k55K34R8k6k58J87m1j9M23m71j1PK10qq6j95
4908a55J5M85m90J18N1O2k4j23M9Q2j97k6NJ04J9j91J16J80q9j53m0J14j48K24
4932a2OO6j7l44L17kJ4j62L45j65m1K2J35k08n2j99K44J16j94O0O4J39l42N0j0
4957a70O7J04MJ1j56K05m6k26J17J38m8j88O2J47j19M32m66j59K42r8MJ12k2O5
4981A2J7M3q6J45K4l30L19k71J17o6J81q3j93K09L0r8J35r9k19M27l1k28J17k53
5005a81p8O9R2J64j65K78l03O5J17O9k35q3J46K46j51j93L3J29QJ49k29p0K61
5028A38N3j57o4m5J64N8j08l6l2K5j19K74l47L50j25l58M35M9j18j10J48j51K21
5051A45R9k64L2J36Q2n7l46L54l14J14J53m6R8k12L7j18J35p4J04j55P4J42j02
$$ plain form
5074 17 -177 241 3 -34 62 -74 77 -4 111 276 38 -20 -89 -207 49 -82 107 -68 157 -118 64 218
5096 218 88 120 -20 46 15 -106 184 30 -264 25 47 -63 -233 16 134 -101 234 176 10 191 -112 16
5118 16 177 -1 -108 -86 -107 -105 -12 -279 45 -74 -276 -105 56 202 150 20 -60 -52 -114 -56 -44 14 146 88 -89
5143 -89 58 37 210 -167 -93 -205 -17 88 173 -171 -281 81 17 225 -259 -81 -38 -73 -3 106 96 -56 125
5166 125 269 100 -21 -171 -136 -68 128 38 -113 325 49 -18 -2 22 60 -45 84 -248 61 -112 -25 129 139
5189 139 55 153 50 145 -90 13 271 42 -17 44 -31 -49 -21 371 114 72 41 -116 92 -162 -29 -107 -73 -176
5213 -176 118 7 -33 146 155 -280 35 130 -81 -84 200 -14 117 -32 -7 -83 -115 109 40 198 34 160 31
5236 31 3 55 218 100 -6 -188 -156 -31 4 -12 89 -97 -26 6 -20 -29 -121 124 16 329 -225 184 197 296 -142
$$ packed form
5074A7j94M18k38l7R6j36J51q1J15J65k38n8o9j18K56j31J89j75K25k75J82J54
5096B18j30L2j40O6l1j21K90j54k94K89K2j10j70K49J18k35L35n8j66J81l03J28
5118A6J61j78j07K2k1KR3k67L24j19k02J71J61J46n2j30q0Qo2N8J2N8J32n8j77
5143h9J47k1J73l77P4j12J88J05Q5l44j10L62o4K08m84J78M3l5P0J09j0j52J81
5166A25J44j69j21j50L5O8J96r0j51M38k76o7J6K4L8j05J29l32L09j73Q7J54J0
5189A39q4R8j03R5k35J03K58k29n9O1p5j8K8L92k57m2l1j57K08k54J33p8L4j03
5213a76K94j11m0J79Rm35L15R5k11lK84k14J31j49K5p6l2K24o9J58j64J26j29
5236C1k8N2J63j18j06j82L2J25L5j6J01j86P1L2k6rr2K45j08L13n54M09J3R9m38
$$ plain form
5261 -142 53 -25 -93 112 8 25 243 -23 -29 190 -42 307 -191 127 -53 160 93 63 -48 153 102 272 61
5284 61 41 -217 123 158 127 33 34 -60 -103 16 86 -189 -177 -58 -119 4 77 257 -4 -20 -175 92 61 -40 19
5309 19 62 -209 -148 87 -106 -112 24 11 -21 -6 -157 -32 -290 124 24 142 131 -272 -143 -195 -40 -267 -89
5332 -89 -275 76 -190 3 92 -172 -38 -220 149 -25 -42 -61 39 -66 3 181 -138 -144 91 93 65 126 192 75
5356 75 57 48 33 171 -6 -22 -107 333 -86 -165 -132 255 -161 18 -28 -200 104 15 -220 108 -188 -207 -110 35
5380 35 -141 136 -255 -67 -59 -93 -14 -56 120 -15 -125 -163 -90 234 11 -71 -30 -180 7 31 5 -108 7 116
5404 116 68 -103 -187 -134 54 34 43 -185 11 -139 288 316 145 -131 -7 367 25 -163 86 -75 -157 -129 -71
5427 -71 99 -108 -149 -135 56 72 0 37 106 -48 218 -8 60 180 -105 -84 61 4 90 -35 -141 -136 24 -37 9
$$ packed form
5261a42J95p8o8K05j04J7K18k66oK19k32L49m98L18j80K13o7l0j11K01n1J70k11
5284F1k0k58L40L5l1r4Jr4m3J19P0k75J2J19o1J23P3J80k61j6j55K67l1j01N9
5309A9M3k71O1K35j93oJ36j3l2J5j51J25k58M14j00J18j1m03J29n2J55k27J78
5332h9j86L51k66J93Q9k64J34j82L69j74j7j9J00j05O9J78l19oK35Kk8O1O6j17
5356G5j8rj5J38j77j6q5M40m19p9L3L87m16J79m6j72L04q9k35L28k96j9R7J45
5380C5j76K77l91J88Ql4P9m2J76j35j10l8P3L24k23q2M1j50J87K4k6j13J15J09
5404A16m8j71q4N3J88k0Rk28J96j50M27K8j71k76J24L74l42j88K49j61q2K8N8
5427g1J70k07m1J4J91J6p2L7O9j54K66k26O8J20k85K1J45n7Q6j25j06NJ60o1M6
$$ plain form
5452 9 -140 -4 51 214 -90 86 -183 -137 123 77 246 -142 225 -4 -122 -83 90 34 137 30 52 85 76 121
5476 121 188 -28 60 97 18 -98 -31 -126 -131 162 212 22 155 -8 341 13 -57 70 47 106 159 65 40 2 91 -210
5502 -210 42 5 120 -233 108 -252 -123 -8 -191 -115 -135 -16 381 98 -131 -13 17 -31 131 69 74 -109 51
5525 51 124 133 -56 -157 -75 -42 -205 2 94 -19 -13 -173 -26 43 46 335 260 -160 74 359 -12 74 262 162 160
5550 160 127 -118 190 28 -139 16 -103 -296 -232 -288 108 167 -93 -75 7 159 -26 211 25 -17 -120 19
5572 19 -16 -138 -45 -68 176 285 81 75 -77 121 73 64 -35 -142 166 -185 298 103 -271 147 -35 -124 124 -180
5596 -180 11 -62 82 47 40 72 86 -301 261 -29 53 -45 -56 227 -143 156 -75 -56 217 283 9 -137 -253 -105
5620 -105 -35 -35 -18 36 -71 165 50 128 -229 17 -84 -187 46 10 -262 -63 82 -279 8 -44 14 89 191
$$ packed form
5452Ij49J36N5J63l04J76k69M6K60m6J69l88L67k29j18L9J73n6J03j07K2L3rM5
5476A21O7k16Q8L7p9j16O7r5nK93N0j90J33j63L49l28p0J27k3N9N3r4k5l8Q9l01
5502b10K52l7J15l53L41l60J29J15j83P6k0J19L97k83k29J18L0m8J62o2Nj83J60
5525E1P3Rj89j01Q2L3j63K07R2j13Oj60J47O9LK89p5m20K34K85l71Q6J88j00k
5550A60l3k45L08j62j67J55j19j93O4n6L96N9k60J8Q2J52j85K37j86m2j03J39
5572A9l5j22R3k3K44J09k04oj52J98m8rr9j07L08l51M83j95l74M18j82q9K48l04
5596a80J91p3J44l5pL2J4l87N62k90Q2r8j1K83l70K99k31J9K73O6k74j46j16J48
5620a05P0%J7N4j07K36j15P8l57K46j01j03K33l6k72J99J45l61K87n2N8P5J02
$$ plain form
5643 191 157 109 -9 38 56 18 161 -8 -93 75 -68 -272 72 19 -20 37 -73 -197 -31 71 76 -49 56 75
5667 75 231 71 -93 -75 83 2 48 41 6 33 10 23 79 179 -19 -2 60 -60 -300 -111 -169 -174 -109 152 -48 -113
5693 -113 99 -95 50 -286 -196 54 32 -112 -36 95 145 76 -57 49 187 196 -125 -40 25 136 -247 266 41
5716 41 132 182 67 8 -87 -255 71 260 -163 98 -129 59 -170 -62 -133 -35 -169 -252 -81 167 -121 -17 130
5739 130 -53 29 140 -59 47 -57 0 204 -43 -37 217 77 -127 -5 -52 302 47 -12 -76 -136 49 144 8
5762 8 31 -146 -18 53 -103 -36 212 142 55 -60 141 -179 -42 -98 -73 -23 -190 171 -72 -118 -129 175 -98 19
5786 19 18 -36 -88 -33 135 265 -4 -47 105 194 -118 179 79 277 -9 161 -141 -5 -119 -57 -70 -201 -109 -21
5810 -21 119 171 68 153 12 31 208 -49 -79 -131 86 -58 315 -210 -58 -14 76 -58 -43 15 -36 -77 201 95
$$ packed form
5643A91l4m8j18M7J8l8J43j69q5J68j43k04L44n3l9N7j10j24J66J02Nj25J05J9
5667G5J56j60j64J8J58q1M6pl5K7k3J3N6J00j98J7O2j20k40J89n8nO5K61k00o5
5693a13K12j94J45l36R0K50k2j44P6J31N0o9j33J06J38Rl21Q5O5J11l83N13k25
5716D1R1N0j15n9r5j68L26J89m23K61k27J88k29J08p1R8j34q3J71K48k88J04J47
5739A30j83Q2J11j99J06j04N7K04k47OK54j40k04J22m7L54k55n9o4o0J85R5j36
5762HK3j77J28P1j56O7K48p0q7j15K01l20J37n6K5N0j67L61k43m6j1L04k73J17
5786A9jn4n2N5J68J30k69m3J52Q9l12K97j00J98k86J70l02J36j14O2j3j31R2Q8
5810b1J40N2j03Q5j41J9J77k57l0n2K17j44L73n25J52M4R0j34J5N8n1m1K78j06
$$ plain form
5834 95 -67 73 127 -17 -123 44 -126 -258 128 142 43 -152 -36 17 144 -159 90 30 -32 -14 -32 -115 13
5857 13 -210 -233 -65 208 77 -129 38 -39 53 -101 -220 -302 -12 53 -344 -130 133 125 150 232 114 -5 11 -8
5881 -8 -12 96 193 46 -129 106 50 -249 -190 -146 62 -43 -153 64 -53 -24 -12 -58 -142 -88 14 37 -111 243 41
5906 41 61 5 150 29 119 -34 20 -38 -27 -106 -28 94 67 102 -165 -29 103 152 -208 -39 -73 -18 -27 -148 -143 100
5932 100 -67 45 43 -10 -80 -51 125 -112 -5 21 -6 -141 33 -190 -89 43 16 -81 36 1 45 -303 -93 196
5956 196 73 -90 93 49 -9 9 -20 -134 -152 54 107 -63 -85 341 -144 60 245 93 -157 -101 -65 159 114
5979 114 45 85 3 116 64 144 -5 66 238 326 27 -298 61 -122 -155 -221 -245 -282 6 -165 29 -15 103 78
6003 78 167 48 13 -170 -33 -169 -33 -263 -18 148 33 119 -148 130 -117 20 38 127 137 -61 -86 39 20
$$ packed form
5834I5j62J40N4j44j06J67j70j32L86J4r9j95J16N3J27l03K49o0o2J8j8q3J28
5857A3k23k3J68K73j31k06J67p7R2j54j19q2K90O5l97K14K63qK5Q2j18j19J6j9
5881hmJ08R7j47j75K35n6k99N9M4K08j05j10K17j17K9J2m6q4N4J02K3j48L54k02
5906D1K0n6J45j21R0j53N4n8J1p9P8J22k7L5k67J36J32M9l60J69l4N5rj21NK43
5932A00j67J12kn3p0K9J76k37J07K6k7j35J74k23J01J32k7r7J17l5M4l48K10K89
5956A96j23j63J83m4n8J8k9j14j8K06N3j70k2M26m85K04J85j52k50N6L6K24m5
5979A14o9M0q2J13n2Q0j49P1J72Q8k99l25L59j83l3o6k4l7K88j71J94m4J18k5
6003G8Q9j19l5j83J37j36J36k30K45J66j15Q6k67K78k47J37J8Q9J0j98k5J25j9
$$ plain form
6026 20 180 -97 25 42 -239 -30 174 -40 -80 11 -152 -28 190 -98 -183 -184 -188 -18 -82 212 61 8 -61 -28
6050 -28 -117 -209 -22 -45 -141 40 148 -48 41 5 127 -18 170 -8 6 186 -86 -82 -72 -70 174 278 75 -24 -22
6075 -22 6 -33 -7 -111 228 -52 -10 41 139 -69 -36 12 -184 -204 -82 -200 55 6 -185 17 42 -103 -110 -191 45
6100 45 33 45 -25 -92 92 -47 -2 284 -105 11 212 32 31 111 -83 -215 273 19 -78 -24 -217 46 2 -25
6124 -25 4 101 205 -156 -228 13 208 58 46 -42 101 -85 22 -62 -87 -33 167 -108 152 -72 93 -132 -17
6147 -17 93 189 184 181 -1 -172 -47 -53 37 -317 -206 42 27 116 128 -126 -100 -66 116 261 -7 32 178 -195 -9
$$ packed form
6026B0J60k77J22J7k81K09K04k14m0R1j63J24K18k88q5jmJ70o4K94j51n3o9L3
6050b8q9r2J87k3r6J81J08j96Q9l6J22j45J88j78J4J80k72MJ0KK44J04k03r9K
6075b2K8l9K6j04L39k80M2N1R8k08L3M8j96k0J22j18K55m9j91K02K5j45pq1K36
6100D5j2J2p0o7J84j39M5K86l89J16K01j80jQ0j94j32M88k54r7N4j93K63m4k7
6124b5K9R7J04l61p2K41J95j50j2q8J43j86J07q4k5N4K00k75K60k24J65k25J15
6147a7J10R6nlj82j71J25oR0l54J11K48j5Q9J2k54K6L4J82J45k68L9J46l73J86
$$ [...]
8191A23
##END NTUPLES=NMR FID
##END=
