##TITLE=1H_Ad=0(bat1-aceton-ag)-pr
 CDCl3
 8 sc, 
 14.12.2022
##JCAMPDX= 6.0         $$ Bruker NMR JCAMP-DX V2.0
##DATA TYPE= NMR FID
##DATA CLASS= NTUPLES
##ORIGIN= UXNMR, Bruker Analytische Messtechnik GmbH
##OWNER= root
$$ XWIN-NMR		Version 3.5
$$ Wed Dec 14 13:50:14 2022 Russian Standard Time (UT+4h)  she@DPX200
##.OBSERVE FREQUENCY= 200.13135
##.OBSERVE NUCLEUS= ^1H
##.DELAY= (6, 6)
##.ACQUISITION MODE= SIMULTANEOUS
##.ACQUISITION SCHEME= undefined
##.AVERAGES= 8
##.DIGITISER RES= 18
##SPECTROMETER/DATA SYSTEM= spect
##.PULSE SEQUENCE= zg30
##.SOLVENT NAME= CDCl3
##.SHIFT REFERENCE= (INTERNAL, CDCl3, 0, 15.7039)
##AUDIT TRAIL= $$ (NUMBER, WHEN, WHO, WHERE, WHAT)
$$ ##TITLE= Audit trail, XWIN-NMR		Version 3.5
$$ ##JCAMPDX= 5.01
$$ ##ORIGIN= Bruker BioSpin GmbH
$$ ##OWNER= she
$$ F:/spectra/data/she/nmr/H-F/1/audita.txt
$$ ##AUDIT TRAIL=  $$ (NUMBER, WHEN, WHO, WHERE, WHAT)
(   1,<2022-12-14 13:48:52.68 +0400>,<she>,<DPX200>,
      <created by zg, POWCHK disabled, PULCHK disabled
       configuration hash MD5:
       00 E9 B6 7A A2 85 ED C7 34 08 36 98 17 FE 4E 26
       data hash MD5: 16K
       D1 F3 BF 5A F0 F6 38 F8 C7 15 5D 48 41 F8 06 38>)
$$ ##END=
$$ 
$$ hash MD5
$$ AE 0F 60 E9 19 96 40 CF 51 46 50 F3 CC 46 07 71
##$RELAX= 
##$RELAX= 
##$RELAX= 
##$RELAX= 
##$RELAX= 
##$RELAX= 
$$ Bruker specific parameters
$$ --------------------------
##$DU= <F:/spectra>
##$EXPNO= 1
##$NAME= <H-F>
##$PROCNO= 1
##$TYPE= <nmr>
##$USER= <she>
##$AMP= (0..31)
100 100 100 100 100 100 100 100 100 100 100 100 100 100 100 100 100 100 
100 100 100 100 100 100 100 100 100 100 100 100 100 100 
##$AQSEQ= 0
##$AQ_mod= 1
##$AUNM= <au_zg>
##$AUTOPOS= <>
##$BF1= 200.13
##$BF2= 200.13
##$BF3= 200.13
##$BF4= 200.13
##$BF5= 200.13
##$BF6= 200.13
##$BF7= 200.13
##$BF8= 200.13
##$BYTORDA= 1
##$CFDGTYP= 0
##$CFRGTYP= 5
##$CHEMSTR= <none>
##$CNST= (0..31)
1 1 145 1 1 1 1 1 1 1 1 1 1 1 1 1 1 1 1 1 1 1 1 1 1 1 1 1 1 1 1 1 
##$CPDPRG= <>
##$CPDPRG1= <>
##$CPDPRG2= <>
##$CPDPRG3= <>
##$CPDPRG4= <mlev>
##$CPDPRG5= <mlev>
##$CPDPRG6= <mlev>
##$CPDPRG7= <mlev>
##$CPDPRG8= <mlev>
##$CPDPRGB= <>
##$CPDPRGT= <>
##$D= (0..31)
0 1.2 0 0 0 0 0 0 0 0.06 0 0.03 0 0 0 0 0.0002 0 0 0 0 0 0 0 0 0 0 0 0 
0 0 0 
##$DATE= 1671011332
##$DBL= (0..7)
120 120 120 120 120 120 120 120 
##$DBP= (0..7)
150 150 150 150 150 150 150 150 
##$DBP07= 0
##$DBPNAM0= <>
##$DBPNAM1= <>
##$DBPNAM2= <>
##$DBPNAM3= <>
##$DBPNAM4= <>
##$DBPNAM5= <>
##$DBPNAM6= <>
##$DBPNAM7= <>
##$DBPOAL= (0..7)
0.5 0.5 0.5 0.5 0.5 0.5 0.5 0.5 
##$DBPOFFS= (0..7)
0 0 0 0 0 0 0 0 
##$DE= 6
##$DECBNUC= <off>
##$DECIM= 32
##$DECNUC= <off>
##$DECSTAT= 4
##$DIGMOD= 1
##$DIGTYP= 9
##$DL= (0..7)
0 120 120 120 120 120 120 120 
##$DP= (0..7)
150 150 150 150 150 150 150 150 
##$DP07= 0
##$DPNAME0= <>
##$DPNAME1= <>
##$DPNAME2= <>
##$DPNAME3= <>
##$DPNAME4= <>
##$DPNAME5= <>
##$DPNAME6= <>
##$DPNAME7= <>
##$DPOAL= (0..7)
0.5 0.5 0.5 0.5 0.5 0.5 0.5 0.5 
##$DPOFFS= (0..7)
0 0 0 0 0 0 0 0 
##$DQDMODE= 0
##$DR= 18
##$DS= 0
$$ [...]
##$SUBNAM2= <"">
##$SUBNAM3= <"">
##$SUBNAM4= <"">
##$SUBNAM5= <"">
##$SUBNAM6= <"">
##$SUBNAM7= <"">
##$SUBNAM8= <"">
##$SUBNAM9= <"">
##$SW= 18.05172834244
##$SWIBOX= (0..15)
0 0 2 0 0 0 0 0 0 0 0 0 0 0 0 0 
##$SW_h= 3612.71676300578
##$TD= 16384
##$TD0= 1
##$TE= 0
##$TE2= 300
##$TE3= 300
##$TEG= 300
##$TL= (0..7)
0 120 120 120 120 120 120 120 
##$TP= (0..7)
150 150 150 150 150 150 150 150 
##$TP07= 0
##$TPNAME0= <>
##$TPNAME1= <>
##$TPNAME2= <>
##$TPNAME3= <>
##$TPNAME4= <>
##$TPNAME5= <>
##$TPNAME6= <>
##$TPNAME7= <>
##$TPOAL= (0..7)
0.5 0.5 0.5 0.5 0.5 0.5 0.5 0.5 
##$TPOFFS= (0..7)
0 0 0 0 0 0 0 0 
##$TUNHIN= 0
##$TUNHOUT= 0
##$TUNXOUT= 0
##$USERA1= <user>
##$USERA2= <user>
##$USERA3= <user>
##$USERA4= <user>
##$USERA5= <user>
##$V9= 5
##$VALIST= <valist>
##$VCLIST= <CCCCCCCCCCCCCCC>
##$VD= 0
##$VDLIST= <DDDDDDDDDDDDDDD>
##$VPLIST= <PPPPPPPPPPPPPPP>
##$VTLIST= <TTTTTTTTTTTTTTT>
##$WBST= 1024
##$WBSW= 4
##$XGAIN= (0..3)
0 0 0 0 
##$XL= 0
##$YL= 0
##$YMAX_a= 146539
##$YMIN_a= -151563
##$ZGOPTNS= <>
##$ZL1= 120
##$ZL2= 120
##$ZL3= 120
##$ZL4= 120
##$ABSF1= 10
##$ABSF2= 0
##$ABSG= 5
##$ABSL= 3
##$ALPHA= 0
##$AQORDER= 0
##$ASSFAC= 0
##$ASSFACI= 0
##$ASSFACX= 0
##$ASSWID= 0
##$AUNMP= <proc_1d>
##$AZFE= 0.1
##$AZFW= 0.1
##$BCFW= 1
##$BC_mod= 2
##$BYTORDP= 1
##$COROFFS= 0
##$CY= 11.3945322036743
##$DATMOD= 1
##$DC= 2
##$DFILT= <>
##$DTYPP= 0
##$F1P= 2.36226072786647
##$F2P= -0.459571619588291
##$FCOR= 0.5
##$FTSIZE= 0
##$FT_mod= 4
##$GAMMA= 1
##$GB= 0.15
##$INTBC= 1
##$INTSCL= 1
##$ISEN= 128
##$LB= 0.24
##$LEV0= 0
##$LPBIN= 0
##$MAXI= 10000
##$MC2= 0
##$MEAN= 0
##$ME_mod= 0
##$MI= 1.114404
##$NCOEF= 0
##$NC_proc= 0
##$NLEV= 6
##$NOISF1= 3.799351
##$NOISF2= 2.8
##$NSP= 1
##$NTH_PI= 0
##$NZP= 0
##$OFFSET= 15.70392
##$PC= 1
##$PHC0= -19115.83
##$PHC1= 21.80072
##$PH_mod= 1
##$PKNL= yes
##$PPARMOD= 0
##$PSCAL= 0
##$PSIGN= 0
##$REVERSE= no
##$SF= 200.130013532006
##$SI= 16384
##$SIGF1= 3
##$SIGF2= 2
##$SINO= 400
##$SIOLD= 16384
##$SREGLST= <1H.CDCl3>
##$SSB= 0
##$STSI= 0
##$STSR= 0
##$SW_p= 3612.71676300578
##$SYMM= 0
##$S_DEV= 0
##$TDeff= 0
##$TDoff= 0
##$TI= <>
##$TILT= no
##$TM1= 0
##$TM2= 0
##$TOPLEV= 0
##$USERP1= <user>
##$USERP2= <user>
##$USERP3= <user>
##$USERP4= <user>
##$USERP5= <user>
##$WDW= 1
##$XDIM= 8192
##$YMAX_p= 0
##$YMIN_p= 0
$$ End of Bruker specific parameters
$$ ---------------------------------
##NTUPLES= NMR FID
##VAR_NAME=  TIME,          FID/REAL,        FID/IMAG
##SYMBOL=    X,             R,               I
##VAR_TYPE=  INDEPENDENT,   DEPENDENT,       DEPENDENT
##VAR_FORM=  AFFN,          ASDF,            ASDF
##VAR_DIM=   8192,          8192,            8192
##UNITS=     SECONDS,       ARBITRARY UNITS, ARBITRARY UNITS
##FACTOR=    0.0002768,     1,               1
##FIRST=     0,             0,               0
##LAST=      2.2672688,     0,               0
##MIN=       0,             -151563,         0
##MAX=       2.2672688,     146539,          0
$$ Real data points
##PAGE= N=1
##DATA TABLE= (X++(R..R)), XYDATA
$$ plain form
0 0 0 0 0 0 0 0 0 0 0 0 0 0 -1 8 -8 8 -8 9 -16 16 -20 24 -27 33 -40 47 -53 61 -72 81 -94 107 -120 137 -154
35 -154 174 -195 219 -245 272 -303 338 -375 415 -460 508 -561 617 -681 750 -826 910 -1004
53 -1004 1109 -1223 1355 -1502 1671 -1870 2103 -2381 2720 -3146 3697 -4447 5522 -7204 10223
68 10223 -17293 70659 -36782 -146550 107735 102316 -119453 -70632 146424 23853 -143832
79 -143832 13572 139477 -56701 -118824 82701 90997 -112075 -59725 119313 21133 -128365
90 -128365 12824 115853 -47181 -101672 74001 75642 -91612 -46772 104536 17713 -102576
101 -102576 15929 99250 -39980 -79420 65603 61631 -78347 -33998 87926 8795 -87776
112 -87776 17558 78029 -41758 -65347 56449 43087 -70594 -24494 71851 -1609 -72376
$$ packed form
0@%%%%%%%%%%%%jRj6J6j6J7k5L2l6M4n1O0p3Q7j00J14j33J53j75K01k27K57k91
35a54L28l69M14m64N17n75O41p13P90q75R68j069J178j298J431j576J736j914
53a004K113k332K578k857L173l541L973m484N101n866O843q144R969j2726J7427
68A0223k7516Q7952j07441j09768K54285n419k21769M8821K17056j22571j67685
79a43832J57404J25905j96178o2123K01525Q296k03072N2350J79038r8180j49498
90a28365J41189J03029j63034n4491J75673J641j67254M4840J51308q6823j20289
101a02576J18505Q3321j39230l9440J45023l972j39978M4349J21924p9131r6571
112h7776J05334O0471j19787k3589J21796j3362j13681M6100R6345p3460p0767
$$ plain form
123 -72376 20631 60774 -40799 -47137 53211 29268 -59942 -7454 62929 -10543 -55117 31923
135 31923 46510 -42966 -27962 54243 12445 -54696 7851 53046 -24719 -44043 39095 29129
147 29129 -50230 -13971 52238 -6789 -53249 21180 43409 -38772 -33672 48035 16255 -55033
159 -55033 777 55043 -18095 -48868 35329 40475 -46669 -23173 57994 8073 -58239 13171
171 13171 57930 -29264 -47539 46226 35208 -57513 -18254 63411 -2525 -64893 19756 57177
183 57177 -39756 -49034 51716 31356 -64077 -14889 66684 -6231 -65675 24801 58433 -40791
195 -40791 -45667 55677 31906 -62277 -10791 68290 -5627 -62856 26152 57846 -40118 -44838
207 -44838 53773 29747 -62000 -12077 63800 -7933 -62859 23419 53025 -41224 -43819 50896
$$ packed form
123g2376R3007M0143j01573o338J00348k3943q9210N2488P0383p3472m4574Q7040
135C1923J4587q9476J5004Q2205m1798o7141O2547M5195p7765j9324Q3138r966
147B9129p9359L6259O6209n9027m6460P4429K2229q2181N100Q1707l1780p1288
159e5033N5810N4266p3138l0773Q4197N146q7144K3496Q1167m9921o6312P1410
171A3171M4759q7194j8275R3765j1018r2721L9259Q1665o5936o2368Q4649L7421
183E7177r6933r278J00750k0360r5433M9188Q1573p2915n9444R0476L3632r9224
195d0791m876J01344k3771r4183N1486P9081p3917n7229Q9008L1694r7964m720
207d4838R8611k4026r1747M9923P5877p1733n4926Q6278K9606r4249k595R4715
$$ plain form
219 50896 26066 -60239 -10094 61272 -8522 -58575 25164 51675 -38650 -38628 51504 25758 -55838
232 -55838 -6426 59754 -8077 -53908 25633 48009 -37629 -35244 48072 20298 -53805 -5266
244 -5266 52793 -12376 -50344 24098 39519 -37881 -30406 43633 13944 -48711 -561 46155
256 46155 -13471 -40601 25809 32897 -33334 -19845 40975 9112 -40005 5977 39293 -15542
268 -15542 -31611 26454 24433 -32291 -13371 35751 1562 -36038 8253 30837 -19461 -26625
280 -26625 25177 15788 -31828 -7989 31544 -3911 -31355 12765 25925 -20480 -18750 27160
292 27160 11296 -28641 -140 30455 -7190 -25186 17237 21590 -21747 -12998 26974 5526
304 5526 -28074 3415 26724 -12867 -23730 18348 16146 -25212 -10937 26271 478 -28947
$$ packed form
219E0896k4830q6305N0145P1366o9794n0053Q3739K6511r0325K2R0132k5746q1596
232e5838M9412O6180o7831m5831P9541K2376q5638K385Q3316k7774p4103M8539
244e266N8059o5169l7968P4442J5421p7400P475P4039k9689o2655M8150M6716
256D6155n9626k7130O6410P088o6231J3489O0820l1863m9117M5982L3316n4835
268a5542j6069N8065k021n6724J8920M9122l4189l7600M4291K2584n0298p164
280b6625N1802r389m7616K3839L9533l5455k7444M4120J3160m6405J730M5910
292B7160j5864l9937K8501L0595l7645j7996M2423M353m3337Q749L9972k1448
304E526l3600L1489K3309l9591j0863M2078k202m1358J4275L7208k5793k9425
$$ plain form
316 -28947 6403 25396 -15692 -21601 21448 14740 -25692 -6372 28673 -958 -26932 10870
328 10870 25389 -16565 -18219 24058 12414 -26228 -3192 28083 -4434 -26445 12631 22194
340 22194 -20102 -16830 23354 8087 -27726 -1954 26265 -8243 -25426 14268 19359 -21284
352 -21284 -13556 24802 5986 -26305 2568 26233 -8938 -21815 17271 18199 -20362 -9410 24751
365 24751 4255 -24241 4333 23274 -10619 -19582 15816 13710 -20366 -8880 20612 765
377 765 -22522 3540 18682 -11226 -16975 14479 11012 -17784 -6054 19299 488 -18488 5941
390 5941 17613 -9584 -12755 15189 10081 -15913 -3006 18267 -785 -16992 6736 15526 -10993
403 -10993 -11931 13951 6794 -16588 -3488 15762 -3097 -16484 5797 12673 -11550 -10760 13164
$$ packed form
316b8947L5350J8993m1088n909M3049o708m0432J9320L5045k9631k5974L7802
328A0870J4519m1954j654M2277j1644l8642K3036L1275l2517k2011L9076R563
340B2194m2296L272M0184j5267l5813K5772K8219l4508j7183L9694N091m0643
352b1284P728L8358j8816l2291K8873K3665l5171j2877L9086R28l8561J0952L4161
365B4751k0496k8496K8574J8941l3893q963L5398k106l4076J1486K9492j9847
377G65k3287K6062J5142k9908n749L1454l467k8796J1730K5353j8811j8976K4429
390E941J1672k7197l171K7944n108k5994J2907K1273j9052j6207K3728Q790k6519
403a0993r38K5882p157k3382J3100J9250j8859j3387K2281O876k4223P90K3924
$$ plain form
416 13164 5345 -14919 -1239 15479 -2519 -13497 8041 12379 -10032 -7026 13857 4520 -12985
429 -12985 1479 14113 -4402 -11526 8474 9126 -11462 -6010 12092 557 -13383 1822 10997
442 10997 -7025 -10459 8515 5978 -11586 -3599 11378 -527 -11315 3838 10767 -6044 -7619
455 -7619 9547 6102 -9298 -884 11227 -599 -9147 4593 8931 -6240 -6140 8226 3208 -9291
469 -9291 -1024 8378 -2868 -8712 3873 5736 -7406 -5147 6959 1514 -8451 324 7425 -2635
483 -2635 -6472 4644 5829 -5587 -2943 7764 2125 -6592 1364 7834 -1737 -5684 4433 5264
497 5264 -5471 -3312 6521 1119 -7230 -210 6041 -2721 -6552 3405 3964 -6056 -3502 5634 406
512 406 -6483 954 5773 -2480 -4651 4419 4100 -4646 -1173 6389 373 -4971 2532 5563 -2969 -3548
$$ packed form
416A3164p819k0264J3680J6718j7998j0978K1538M338k2411L006K0883r337j7505
429a2985J4464J2634j8515p124K0000O52k0588N452J8102j1535j3940J5205R175
442A0997j8022l434J8974k537j7564P987J4977j1905j0788J5153O929j6811j575
455g619J7166l445j5400Q414J2111j1826q548J3740M338j5171J00J4366n018j2499
469i291Q267R402j1246n844J2585J863j3142K259J2106n445r965Q775P101j0060
483b635l837J1116J185j1416K644J0707n639q717P956O470r571l947J0117Q31
497E264j0735K159R833n402q349P020O251q762l831R957N59j0020K554R136n228
512D06o889P437M819q253k171R070l19q746L473P562o016n344P503L031q532n79
$$ plain form
528 -3548 4864 2979 -5225 -556 5414 -1187 -5612 1856 3921 -4159 -4048 3866 947 -5394 -891
543 -891 3953 -1423 -4349 2140 3491 -3090 -2083 3883 1584 -3153 821 4171 -417 -2026 2618
558 2618 2907 -1873 -943 3121 436 -2913 193 2444 -1391 -2674 1057 798 -2965 -2046 1933 -271
574 -271 -3401 13 1700 -1384 -2110 1364 2049 -1718 -730 2699 1460 -1394 794 2987 214 -1383
590 -1383 1535 2341 -1030 -663 2106 598 -2323 -585 1478 -757 -2377 127 855 -2102 -1847 1487
606 1487 -353 -2584 53 1483 -1146 -1414 1704 1360 -1528 -125 2353 403 -1117 1332 2386 -681
622 -681 -540 1752 1042 -1678 -33 1753 -393 -1789 230 785 -1322 -1415 135 -349 -1882 -733 531
639 531 -945 -1225 -10 337 -383 -348 778 495 -151 561 983 99 27 1011 755 71 223 1028 307 -226
$$ packed form
528c548Q412j885q204M669N970o601m425P468K065q080J11P914k919o341M503
543h91M844n376k926O489J351o581J007N966k299m737L974L350m588j609M644
558B618K89m780R30M064k685l349L106K251l835j283L731k59l763R19L979k204
574b71l130L414J687l084p26L474O85l767R88L429j239k854K188K193k773j597
590a383K918Q06l371L67K769j508k921J738K063k235j620K504P28k957K55L334
606A487j840k231K637J430k629k68L118l44k888J403K478j950j520K449J054l067
622f81J41K292p10k720J645J786k146j396K019N55k107r3J550m84j533J149J264
639E31j476k80J215L47p20L5J126k83o46P12M22q84p2R84k56o84J52Q05p21n33
$$ plain form
659 -226 46 445 -409 -511 39 -34 -530 -573 -61 -91 -953 -970 75 -273 -1026 -514 706 -109 -637 823 1150
680 1150 -7 -317 1110 914 232 145 1128 830 -427 748 418 -325 -153 485 -57 -511 -61 -123 -976
699 -976 -896 101 -574 -1154 -423 6 -713 -703 7 300 -552 83 884 234 -102 900 1106 2 337 828
719 828 778 43 327 429 -45 -53 231 -7 -661 -196 -204 -791 -627 -227 -780 -978 -354 -339 -895 -432 349 -190
741 -190 -305 345 1013 79 129 922 564 162 857 714 401 316 648 446 176 -103 336 -299 -421 -272 -304
762 -304 -945 -780 -422 -429 -490 -433 -155 -525 -303 214 307 -507 80 696 719 42 504 1009 426 0 411 722
784 722 367 -215 321 1161 -257 -641 442 392 -986 -622 -12 -358 -1205 -355 484 -904 -1292 482 537
803 537 -1165 -202 855 39 -696 750 1276 -440 -19 1500 800 -791 875 1675 -344 -895 1157
$$ packed form
659b26K72L99q54j02N50p3m96m3N12l0q62j7J045l48p53N12J220q15n28J460L27
680A150j157l10J427j96o82q7R83k98j257J175l30p43J72O38n42m54M50o2q53
699i76Q0R97o75n80P31M29p19J0P10K93q52O35Q01o50l36J002K06j104L35M91
719H28n0p35K84J02m74qK84k38o54M65qn87J64M00n53j98O24J5n56M63P81n39
741a90j15O50O68r34N0P93l58m02O95j43l13q5L32k02k70k79M39o35j22J49l2
762c04o41J65L58po1N7K78l70K22N17R3q14N87O16K3o77M62N05n83m26M11L11
784G22l55n82N36Q40j418l84J083n0j378L64O10l46q47Q50Q39j388l88J774N5
803E37j702R63J057q16p35J446N26j716M21J519p00j591J666Q00k019n51K052
$$ plain form
820 1157 1329 -1653 -394 1556 -392 -2058 64 1184 -1566 -1672 982 365 -2085 -514 1621 -442
836 -442 -1514 758 1140 -1017 -723 1699 774 -1262 670 1985 96 -892 1358 1031 -1096 -522 1790
853 1790 313 -1469 81 1295 -1153 -1588 787 476 -1787 -1190 1194 26 -2563 -55 1490 -999
869 -999 -1636 1106 1660 -1358 -617 2059 651 -1565 707 2334 -484 -1250 1576 1836 -1211 -950 1898
886 1898 460 -2236 106 1835 -1232 -1984 1031 553 -2523 -1337 1547 -344 -2393 665 1640 -1679
902 -1679 -1513 2418 1207 -2113 -16 3178 150 -2169 1838 2650 -1726 -1344 2731 1229 -2667 128
918 128 3019 -1069 -3021 1517 1943 -2697 -1703 2034 62 -3139 -547 2216 -1651 -2400 1745 1633
934 1633 -2207 -1004 2687 353 -2359 1178 2977 -1240 -1326 2502 1787 -2205 -265 3076 108 -2825
$$ packed form
820A157J72k982J259J950j948j666K122J120k750j06K654o17k450J571K135k063
836d42j072K272L82k157K94K422r25k036J932J315j889r88K250l27k127N74K312
853A790j477j782J550J214k448m35K375l11k263N97K384j168k589K508J545k489
869i99o37K742N54l018P41K676j408k216K272J627k818p66K826K60l047K61K848
886A898j438k696K342J729l067p52L015m78l076J186K884j891k049L058R75l319
902a679J66L931j211l320K097L194l028k319M007Q12m376L82M075j502l896K795
918A28K891m088j952M538M26m640R94L737j972l201K592K763l867p49M145j12
934A633l840J203L691k334k712L537J799m217q6L828p15l992J940L341k968k933
$$ plain form
950 -2825 1145 2474 -2077 -2286 2106 1019 -3115 -1359 2517 -399 -3201 819 2465 -2354 -2282 2333
966 2333 1276 -2780 -498 3203 -56 -2690 1525 3206 -1395 -1332 2904 1457 -2560 156 3198 -723
982 -723 -2934 1608 2249 -2704 -1835 2824 366 -3744 -339 2810 -1523 -3542 2055 2265 -3079 -1656
998 -1656 3126 502 -3558 566 3661 -1270 -2618 2910 2521 -2698 -942 3761 475 -3267 985
1013 985 3309 -1858 -2764 2552 1548 -3405 -872 3203 -889 -3958 1121 2326 -2936 -2329 2794 893
1029 893 -3663 -225 3566 -917 -3227 1903 2807 -2392 -1403 3629 1245 -3340 258 4001 -823 -3045
1045 -3045 2324 2740 -2934 -1636 3227 704 -3689 95 3071 -1602 -3502 1950 2081 -3360 -1709
1060 -1709 3131 286 -3398 619 3312 -1585 -2756 3046 2520 -2766 -940 3846 330 -2958 1262
$$ packed form
950b825L970J329m551k09M392j087m134J756L876k916k802M020J646m819P2M615
966B333j057m056K282L701l259k634M215J681m601O3M236j447m017K716L042l921
982g23k211M542O41m953Q69M659k458m110L405L149m333k019N597K10n344J423
998a656M782k624m060M124L095m931j348N528l89n219J756M703l286l742M252
1013I85K324n167r06N316j004m953K533M075m092l069N079J205n262O07N123j901
1029H93m556L438L791m483k310N130R04n199R89N032k384m585L598L743m824k222
1045c045N369M16n674J298M863k523m393L784K976m673j900N452J31n441J651
1060a709M840k845l684M017K693m897j171N802n26n286J826M786l516l288M220
$$ plain form
1075 1262 3724 -1876 -2764 3103 2158 -3601 -1183 3714 -254 -4194 1284 3277 -2906 -3017 2922 1487
1091 1487 -4170 -868 3739 -905 -3801 1956 3196 -2439 -2167 3857 1808 -3444 322 4023 -589
1106 -589 -3212 2569 3063 -2866 -1838 3556 421 -4073 381 3498 -1602 -3352 2271 2037 -3623 -1599
1122 -1599 3415 -13 -3862 692 3282 -1575 -2945 2724 2175 -2814 -880 3972 495 -3023 1727
1137 1727 3329 -1368 -2254 2678 2002 -2985 -607 3294 -603 -3469 1324 2569 -2614 -2263 2562 848
1153 848 -3815 -508 3180 -1118 -2996 1777 2374 -2699 -1851 3453 1246 -3295 287 3765 -784 -2875
1169 -2875 2248 2813 -2616 -1511 3844 869 -3416 390 3066 -1492 -3247 1715 2039 -3075 -1575
1184 -1575 3229 -288 -3563 666 2737 -1814 -2818 2708 1559 -3064 -451 3598 -112 -3249 1850
$$ packed form
1075A262K462n600q88N867r45n759K418M897l968l940N478J993o183j11N939j435
1091A487n657L302M607m644k896N757J240n635K72O024k049n252L766L701m612
1106e89k623N781M94n929J028N394l135m494M454L117n100j750N623k34n660K024
1122a599N014l428l849M554K590m857j370N669n49m989J934M852l477l518M750
1137A727J602m697q86M932o76m987K378L901l897k866M793J245n183L51M825j714
1153H48m663L307L688m298j878M773N97n073Q48N304k207m541L582L478m549k091
1169b875N123N65n429J105N355k975m285L806K676m558j755M962L24n114J500
1184a575M804l517l275M229K071m551j004N526j149m623K613M049l710l137N099
$$ plain form
1199 1850 3140 -1799 -2033 3155 1592 -2731 -151 3771 -491 -3033 1739 2698 -2732 -1976 2894 762
1215 762 -3593 -412 2926 -1361 -3239 1730 2264 -2620 -1869 2825 619 -3195 134 3084 -821 -2304
1231 -2304 2055 2478 -2121 -892 3264 897 -2753 488 3243 -1290 -2442 1967 1700 -2864 -1164
1246 -1164 2703 -72 -3033 370 2258 -1829 -2597 2209 1948 -2915 -1032 2839 65 -2928 834
1261 834 2891 -1387 -2037 2316 1707 -2322 -78 3054 141 -2684 1228 2304 -1917 -1803 2056 1037
1277 1037 -2819 -516 2522 -940 -2712 1154 2109 -2244 -1566 2276 421 -2924 84 2562 -667
1292 -667 -2057 1693 2165 -1882 -844 2741 560 -2208 634 2645 -818 -1977 1848 1702 -2205 -794
1308 -794 1900 12 -2476 151 1635 -1405 -1889 1222 1030 -2079 -634 1995 -343 -1875 841 2003
$$ packed form
1199A850J290m939k34N188j563m323K580L922m262k542M772R59n430P56M870k132
1215G62m355L181L338m287j878M969N34m884P51M694k206l814L329K950l905j483
1231b304M359M23m599J229M156k367l650L241K755m533j152M409k67m564J700
1246a164L867k775k961L403J888m087p68M806k61m863J883L871k774k993L762
1261H34K057m278o50M353o09m029K244L132k913k825L912J076m221J14L859j019
1277A037l856K303L038l462j772L866R55m353O78L842j855l345L008K478l229
1292f67j390L750M72m047J038L585k181k768K842K011l463j159L825j46l907J411
1308g94K694j888k488K627J484l040m84L111j92l109J445K629k338j532K716J162
$$ plain form
1324 2003 -1182 -1289 2063 808 -1557 60 2325 -110 -1841 1158 1860 -1329 -1297 2028 653 -1853
1340 -1853 -150 1820 -598 -2154 503 1300 -1471 -1446 1481 342 -1980 -123 1961 -375 -1657 1050
1356 1050 1495 -1218 -772 2017 329 -1470 409 1978 -843 -1139 1179 1409 -1368 -677 1774 188
1372 188 -1812 393 1437 -1081 -1561 1152 816 -1850 -627 1596 -420 -1941 435 1505 -1156 -1137
1388 -1137 1377 1032 -1447 -267 1813 131 -1203 923 1540 -822 -660 1441 801 -1282 33 1426
1404 1426 -384 -1256 357 793 -1088 -974 1091 254 -1453 -207 1048 -492 -1594 529 1084 -890
1420 -890 -707 1386 504 -1023 75 1384 -80 -586 1082 1027 -485 -355 1045 451 -1033 -55 978
1437 978 -488 -1107 292 524 -1072 -973 573 -144 -1203 175 954 -611 -703 576 794 -1026 -243 1291
$$ packed form
1324B003l185j07L352j255k365J617K265k435j731K999P02l189L2L325j375k506
1340a853J703J970k418j556K657P97k771K5K927j139k322J857K084k336j282K707
1356A050M45k713M46K789j688j799J879J569k821k96K318K30k777O91K451j586
1372A88k000K205J044k518m80K713l36k666J223K223k016j521K376J070k661J9
1388a137K514l45k479J180K080j682j334K126O17k362J62K101o40k083J315J393
1404A426j810q72J613M36j881J14K065q37j707J246J255j540j102K123N55j974
1420h90J83K093q82j527J098J309j464n06J668n5j512J30J400n94j484R78J033
1437I78j466o19J399K32j596R9J546p17j059J378P79j565r2J279K18j820P83J534
$$ plain form
1455 1291 36 -713 705 1237 -210 -388 964 776 -870 -32 1027 -127 -985 275 667 -684 -948
1472 -948 530 253 -1254 -632 711 -153 -999 11 855 -337 -704 580 129 -578 141 694 63 -297
1490 -297 614 578 -515 -169 927 419 -470 -6 594 -95 -436 295 536 -994 -526 313 -154 -878 -347
1509 -347 479 -400 -829 354 411 -539 -321 554 287 -634 28 863 227 -387 395 566 -37 -77 656 537
1529 537 -575 38 352 -83 -586 216 150 -328 -414 354 -115 -767 42 236 -116 -752 289 357 -608 -122
1549 -122 376 130 -411 70 746 110 -172 251 454 -124 109 609 116 -429 155 451 -99 -400 119 209
1569 209 -372 -549 273 -272 -501 -55 95 -234 -694 -93 368 111 -360 289 195 -300 207 589 -15 31 311
1590 311 175 -113 -172 415 19 -170 128 293 -82 -314 -48 264 -366 -416 144 0 -626 -372 281 -53 -847
$$ packed form
1455A291j255p49J418N32j447j78J352j88j646Q38J059j154q58J260L92j351k64
1472i48J478k77j507O22J343q64q46J010Q44j192l67J284m51p07P19N53o31l60
1490b97R11l6j093L46J096n08q89M64O00o89l41P31K41j530M68Q39m67p24N31
1509c47Q26q79m29J183N7r50K18Q75k67r21O62Q35o36o14P82J71o03m0P33j19
1529E37j112O13L14m35n03Q02o6m78q6P68m69o52Q09J94l52o36J041O8r65M86
1549a22M98k46n41M81O76o36k82M23K03n78K33N00m93n45N84K96n50l01N19R0
1569B09n81j77Q22n45k29M46J50l29m60O01M61k57m71O49r4m95N07L82o04M6K80
1590C11j36k88n9N87l96j89K98J65l75k32K66L12o30n0N60j44o26K54O53l34p94
$$ plain form
1611 -847 -61 308 -133 -232 481 368 2 -119 571 182 42 260 412 -298 89 522 117 -123 -38 122 -119
1632 -119 -439 41 110 -762 -178 251 -50 -454 -20 155 -207 -392 308 313 -493 -206 522 323 -158 295 650
1653 650 195 -228 266 517 62 7 415 277 -235 -320 423 -179 -394 -123 -243 -310 -384 317 -201 -329 -27
1674 -27 135 -95 24 209 256 -116 -3 394 11 -256 196 161 64 -95 502 451 -174 -88 411 -51 -350 58
1696 58 229 -351 -534 -88 234 -536 -381 281 133 -414 -259 287 -456 -314 251 220 -126 260 556 211 -164
1717 -164 463 343 -170 -149 290 271 73 358 394 -165 -258 32 128 -358 -118 145 -182 -439 -203 252 -413 -487
1739 -487 -99 113 -349 -220 429 388 -92 -94 484 13 -10 135 377 139 80 158 314 -206 129 95 -127 -74 62
1762 62 -440 -268 -51 188 -76 -456 -110 135 -277 -431 44 97 -364 -284 513 102 47 230 356 32 85 273
$$ packed form
1611h47P86L69m41r9P13j13l66j21O90l89j40K18J52p10L87M33m05k40Q5J60k41
1632a19l20M80O9q72N84M29l01m04M34J75l62j85P00Nq06K87P28j99m81M53L55
1653F50m55m23M94K51m55n5M08j38n12q5P43o02k15K71j20o7p4P01n18j28L02
1674b7J62k30J19J85M7l72J13L97l83k67M52l5r7j59N97n1o25Q6M99m62k99M08
1696E8J71n80j83M46L22p70J55O62j48n47J55N46p43J42N65l1l46L86K96l45l75
1717a64O27j20n13K1M39j9j98K85L6n59r3K90R6m86K40K63l27k57K36M55o65p4
1739d87L88K12m62J29O49m1m80kN78m71k3J45K42k38n9P8J56n20L35l4k22N3J36
1762F2n02J72K17K39k64l80L46K45m12j54M75N3m61Q0P97m11n5J83J26l24N3J88
$$ plain form
1784 273 409 -119 -101 145 18 -16 -44 123 29 -314 -19 9 -385 -314 -121 -278 -404 -347 133 -263 -298 365 212
1807 212 -163 -179 394 -2 170 265 249 -98 -4 462 208 -240 233 330 -3 -184 120 -17 -277 -118 73 -95
1829 -95 -139 -91 -237 -150 -182 -130 80 49 -384 83 275 15 144 273 176 263 614 181 205 194 313 79 141 -9
1853 -9 -45 125 244 35 95 -280 -229 -202 -198 -343 -281 -135 -213 -365 -26 124 -91 -11 179 153 -145 179 35 256
1877 256 380 56 345 8 9 393 295 -19 -89 6 -163 -111 -189 76 -246 -58 -219 -50 -60 -348 -59 -250 -181
1900 -181 11 -38 -191 -156 1 -43 94 73 56 394 159 -5 140 164 -55 3 205 -14 19 -35 21 50 -250 -161
1924 -161 38 -363 -353 28 -87 -309 -126 172 -245 -63 48 125 3 116 13 -42 284 25 181 131 88 374
1946 374 323 257 -28 107 -35 -110 10 146 -154 -98 -45 -223 -255 -75 119 -313 -45 -218 72 -278 -30 -31 73
$$ packed form
1784B73J36n28J8K46j27l4k8J67r4l43K95K8l94P1J93j57j26N7M80l96l5O63j53
1807B12l75j6N73l96J72R5j6l47R4M66k54m48M73R7l33j81L04j37k60J59J91j68
1829i5m4M8j46Q7l2N2K10l1m33M67J92k60J29J29r7Q7L51m33K4j1J19k34O2j50
1853il6J70J19k09O0l75N1K7Mj45O2J46p8j52L39J50k15Q0J90k6k98L24j44K21
1877B56J24l24K89l37JL84r8l14p0R5j69N2p8K65l22J88j61J69j0k88K89j91O9
1900a81J92m9j53L5J57m4J37k1j7L38k35j64J45K4k19N8K02k19L3n4N6K9l00Q9
1924a61J99m01J0L81j15k22J83K98m17J82J11P7j22J13j03n5L26k59J56n0m3K86
1946C74n1o6k85J35j42p5J20J36l00N6N3j78l2J80J94m32K68j73K90l50K48jJ04
$$ plain form
1969 73 -337 -147 66 192 238 264 419 11 174 240 164 200 -77 230 199 -158 -27 54 -120 -490 211 -35 -533
1992 -533 -112 -133 -561 -67 -306 117 -292 29 -7 -76 -136 149 400 -50 49 264 151 -333 -218 165 218 -134
2014 -134 -7 339 -109 -134 -99 170 -477 -397 28 -338 -348 -208 -83 -306 -156 57 85 -329 -104 165 11 -299
2036 -299 255 415 -305 -142 674 24 95 197 377 325 -259 92 295 -95 -115 123 -64 -421 -248 70 -13
2057 -13 -233 -96 17 -290 -408 165 -15 -384 -101 533 -44 -78 245 266 -50 133 428 196 149 -36 371
2078 371 126 27 241 44 -361 -263 -108 -7 -205 -129 55 -161 -218 311 89 -492 -175 179 -5 -429 140
2099 140 455 -71 -194 207 226 -140 -26 380 87 -172 411 432 -121 -313 375 -35 -283 -22 35 -31 -241
2120 -241 -43 87 -354 -431 174 48 -336 68 220 269 0 262 132 -457 -49 416 15 -174 13 497 39
$$ packed form
1969G3m10J90K13J26M6K6J55m08J63O6p6L6k77L07l1l57J31Q1j74l70P01k46m98
1992e33M21k1m28M94k39M23m09L21l6o9o0K85K51m50R9K15j13m84J15L83N3l52
2014a34J27L46m48k5L5K69o47Q0M25l66j0J40J25k23J50K13K8m14K25K69j54l10
2036b99N54J60p20J63Q16o50P1J02J80n2n84L51K03l90k0K38j87l57J73L18q3
2057a3k20J37J13l07j18N73j80l69K83O34n77l4L23K1l16J83K95k32m7j85M07
2078C71k45r9K14j97m05R8J55J01j98P6J84k16n7N29k22n81L17L54j84m24N69
2099A40L15n26j23M01J9l66J14M06k93k59N83K1n53j92O88m10k48K61N7o6k10
2120b41J98J30m41p7O05j26l84M04J52M9k69K62j30n89M08M65m01j89J87M84m58
$$ plain form
2141 39 -176 534 83 -289 -43 238 160 -355 -386 382 -88 -178 252 171 -199 -309 146 45 -451 188 335 -249
2163 -249 -350 347 297 -293 116 587 104 -131 452 6 26 -143 528 383 -214 102 455 -306 -530 -95 74
2184 74 -445 -406 200 -109 -739 -116 46 -183 -214 23 292 -91 -288 459 268 -16 104 57 72 -374 82 310
2206 310 -221 -192 470 -106 -217 51 234 -410 -159 209 171 -439 39 215 -52 -434 158 268 -51 -406 85
2227 85 190 -290 -86 241 -73 -471 -19 336 -223 -13 468 200 -57 -100 279 -64 -363 31 216 -34 -49
2248 -49 164 -83 -348 -196 337 197 -239 93 -95 -339 -410 398 -49 -230 -264 249 -34 -187 322 282 -69
2269 -69 -32 268 259 -337 86 449 21 -518 123 36 -381 -436 86 228 -504 97 89 -345 -227 58 173 -258 -79
2292 -79 337 -48 -113 321 221 -166 -27 312 436 5 164 200 -104 -83 58 3 -29 -42 119 55 -260 -109 5
$$ packed form
2141C9k15P10m51l72K46K81p8n15l1P68m70r0M30q1l70j10M55j01m96O39J47n84
2163b49j01O97n0n90M09M71m83k35N83m46K0j69O71j45n97L16L53p61k24M35J69
2184G4n19L9O06l09o30O23J62k29l1K37K69l83j97P47j91k84J20m7J5m46M56K28
2206C10n31K9O62n76j11K68J83o44K51L68l8o10M78J76k67l82N92J10l19l55M91
2227H5J05m80K04L27l14l98M52L55n59K10M81k68k57m3L79l43k99L94J85k50j5
2248d9K13k47k65J52N33j40m36L32j88k44p1Q08m47j81l4N13k83j53N09m0l51
2269f9L7L00rn96M23L63m28n39O41q7m17n5N22J42p32O01qm34J18K85J15m31J79
2292g9M16l85o5M34j00l87J39L39J24m31J59L6l04K1J41n5l2j3J61o4l15J51J14
$$ plain form
2315 5 -107 -52 92 429 -320 -111 91 -107 -339 -78 360 -58 30 163 308 42 -200 407 -68 -195 447
2336 447 226 58 -1 77 95 -335 -319 209 -178 -397 -155 19 -258 -261 199 -193 -220 -235 156 -260 -262 116 269
2359 269 -253 -154 334 18 -176 -220 444 146 -196 34 175 -209 -235 224 31 -365 -101 118 196 -149 319
2380 319 -115 -135 10 -101 -16 -258 -83 -56 -114 -257 228 306 -98 -45 398 210 6 -108 207 108 -158 -37
2402 -37 374 -117 -79 69 48 -105 241 352 -155 -339 20 84 -292 -27 -190 -4 -176 21 162 -39 -210
2423 -210 258 168 -190 246 146 232 -119 115 414 124 151 134 67 -175 38 -85 111 -194 7 -95 37 -308
2445 -308 51 -106 -84 -57 -198 -202 -158 -13 87 -56 -189 85 234 -257 -125 192 221 -70 101 303 105 -123
2467 -123 271 162 12 -132 -55 -254 -213 141 12 -194 -65 166 43 -58 -155 62 288 -290 136 201 147 -147
$$ packed form
2315Ej12N5J44L37p49K09K02j98k32K61M38m18Q8J33J45k66k42O07m75j27O42
2336D47k21j68n9P8J8m30J6N28l87k19K42J74k77lM60l92k7j5L91m16kL78J53
2359B69n22R9M88l16j94m4O64k98l42K30J41l84k6M59j93l96K64K19P8l45M68
2380C19m34k0J45j11Q5k42J75K7n8j43M85P8m04N3M43j88k04j14L15r9k66J21
2402c7M11m91L8J48k1j53L46J11n07j84L59O4l76K65j63J86j72J97J41k01j71
2423b10M68r0l58M36j00Q6l51K34K99k90K7j7o7k42K13j23J96l05K01j02J32l45
2445c08L59j57K2K7j41mM4J45J00j43j33K74J49m91J32L17K9k91J71K02j98k28
2467a23L94j09j50j44P7j99M1L54j29k06J29K31j23j01r7K17K26n78M26O5n4k94
$$ plain form
2489 -147 296 -133 -109 190 36 100 -113 -3 103 97 -508 -48 64 -115 -5 13 7 -114 -8 -71 -295 -175 37
2512 37 -239 -319 -21 15 -88 -34 104 -21 -25 -143 124 149 -62 104 89 -152 17 36 314 -14 -35 97 77 -130
2536 -130 -182 -38 -25 101 130 -124 -294 -111 -46 193 -40 185 -18 -5 117 28 -4 -164 71 146 57 -23 127
2559 127 -108 43 -83 -17 -28 72 23 125 33 66 204 118 -240 -158 140 -174 -53 -32 56 -54 -45 257 250 -2
2583 -2 8 65 123 55 -68 132 212 -86 152 336 -137 166 171 468 -89 -162 173 -88 -240 -70 -9 2 -176 171
2607 171 76 -210 -195 87 -130 -85 -201 32 228 75 1 269 55 120 288 236 -181 231 326 -139 -69 114 -97
2630 -97 -190 -71 -100 38 -120 110 137 38 -105 -178 0 -125 -121 -141 -172 -37 -22 148 -46 155 -2 196 4 -87
2654 -87 118 39 28 146 345 34 11 200 65 1 -26 19 98 -202 -113 -107 -178 -95 191 43 -161 -135 147 9 -103
$$ packed form
2489a47M43m29K4K99j54O4k13J10J06oo05M60J12j79J10J8oj21J06o3k24J20K12
2512C7k76q0K98L6j03N4J38j25mj18K67K5k11J66j5k41J69J9K78l28k1J32k0k07
2536a30n2J44J3J26K9k54j70J83O5K39k33K25k03J3J22q9l2j60K35P5q9q0J50
2559A27k35J51j26O6j1J00m9J02r2L3J38q6l58Q2K98l14J21K1Q8j10RL02pk52
2583bJ0N7N8o8j23K00Q0k98K38J84m73L03NK97n57p3L35k61j52J70O1J1j78L47
2607A71r5k86J5K82k17M5j16K33J96j53p4K68k14O5J68n2m17M12R5m65P0J83k11
2630i7r3J19k9J38j58K30K7r9j43p3J78j25Mk0l1J35J5J70j94K01j57J98j92r1
2654h7K05p9j1J18J99l11k3J89j35o4k7M5P9l00Q9Op1Q3K86j48k04K6K82j38j12
$$ plain form
2679 -103 99 273 -1 158 187 126 45 168 62 -24 28 -97 -168 -69 117 217 318 -100 83 178 -201 -135 -205
2702 -205 121 -360 -219 -187 -228 -8 127 87 12 -50 303 127 15 66 277 271 18 202 172 87 129 75 -40 115
2726 115 -115 31 31 -244 -46 -62 -61 -57 -26 30 -36 -329 -29 118 -5 -20 260 -43 -303 44 119 -15 116 346
2750 346 -165 -45 133 -23 -309 47 38 246 -9 165 297 104 -38 -6 224 -197 -20 18 13 77 -80 27
2772 27 14 131 201 -196 -177 97 40 280 -30 232 -68 87 43 -23 93 66 111 86 25 -65 232 156 150 -179 142
2797 142 103 115 -126 69 4 -256 -77 57 -24 -1 -6 159 -173 -65 50 240 -149 46 110 -5 91 305 153
2820 153 -2 55 126 -77 49 80 -42 -74 -24 -87 174 -181 -30 181 3 -182 78 47 -174 -125 -110 53 -34
2843 -34 -211 299 -15 6 88 198 136 177 102 172 -116 196 -85 -17 -134 -125 96 8 -27 -221 -109 25 -178 61
$$ packed form
2679a03K02J74k74J59K9o1q1J23j06q6N2j25p1R9J86J00J01m18J83R5l79O6p0
2702b05L26m81J41L2m1K20J35m0p5o2L53j76j12N1K11ok53J84l0q5M2n4j15J55
2726A15k30J46%k75J98j6JML1N6o6k93L00J47j23j5K80l03k60L47P5j34J31K30
2750C46n11J20J78j56k86L56rK08k55J74J32j93j42L2K30m21J77L8nO4j57J07
2772B7j3J17P0l97J9K74n7K40l10K62l00J55m4o6J16k7M5k5o1r0K97p6ol29L21
2797A42l9J2k41J95o5k60J79J34q1K3nJ65l32J08J15J90l89J95O4j15R6K14j52
2820A53j55N7P1k03J26L1j22l2N0o3K61l55J51K11j78j85K60l1k21M9J5J63q7
2843c4j77N10l14K1Q2J10o2M1p5P0k88L12k81O8j17RK21q8l5j94J12J34k03K39
$$ plain form
2867 61 83 176 -3 67 13 200 343 -183 -139 54 -83 -4 74 101 247 252 74 23 -3 83 -42 123 286 -187 -85
2892 -85 -57 189 -101 12 81 78 -46 -316 -173 -296 101 -35 -128 -123 -48 11 76 49 72 -82 84 252 57 -6 105
2917 105 66 135 130 93 186 -127 -279 -101 -69 -251 -135 -150 -51 -305 -178 92 -144 -43 -17 194 -147 -346 -62
2940 -62 243 49 32 164 16 -3 178 147 -65 35 42 243 -42 88 188 -24 -292 -43 -90 -48 87 116 -78
2963 -78 -145 21 32 0 -138 -11 -41 13 -18 236 -105 148 -118 229 -45 73 -17 39 -74 -78 237 237 -109 29
2987 29 76 241 -197 4 -190 -58 130 -214 -28 -150 13 65 -96 -116 31 91 -53 207 -108 -190 -2 433
3009 433 105 149 -81 140 245 215 241 -15 129 -224 -110 301 48 -171 130 85 -11 -111 -71 -279 -344 -174
3031 -174 122 -190 -206 2 194 173 104 103 -101 172 -4 215 0 -55 -113 181 -267 -181 38 -100 -67 109 -152
$$ packed form
2867F1K2R3j79P0n4J87J43n26M4J93j37P9P8K7J46Nj78n1k6Q6j25J65J63m73J02
2892h5K8K46k90J13O9lj24k70J43j23L97j36r3NP5N9O5k7K3j54J66J68j95o3J11
2917A05l9O9nl7R3l13j52J78L2j82J16j5R9k54J27K70k36J01K6K11l41j99K84
2940f2L05j94j7J32j48j9J81l1k12J00PK01k85J30J00k12k68K49m7M2J35K9j94
2963g8o7J66J1l2j38J27l0N4l1K54l41K53k66L47k74J18r0N6j13mL15%l46J38
2987B9M7J65m38K01j94J32J88l44J86j22J63N2j61k0J47O0j44K60l15q2J88M35
3009D33l28M4k30K21J05l0K6k56J44l53J14M11k53k19L01m5r6j00M0k08o5J70
3031a74K96l12j6K08J92k1o9jk04K73j76K19k15n5n8K94m48Q6K19j38L3J76k61
$$ plain form
3054 -152 -148 -260 -169 29 -120 -17 -53 -39 34 33 39 -311 -248 62 621 71 37 183 -157 -111 -166 188 -79 -88 -234
3079 -234 29 242 -119 17 -45 -155 91 -25 -182 -106 -29 -240 -164 -122 -5 -86 -79 183 -91 -79 -122 156 31
3102 31 67 67 169 28 -58 173 102 -23 -76 152 77 -31 94 29 138 24 92 -56 -186 69 -104 -235 -85
3125 -85 -156 -112 -176 9 87 -6 2 7 85 67 -94 163 36 -29 111 74 136 -160 -15 -47 -35 -95 60 -81 105 -224
3151 -224 198 -120 -231 -39 156 87 -91 107 210 149 31 195 -3 -222 -47 141 18 -95 104 24 67
3172 67 -178 97 338 -122 143 15 -38 81 8 -40 142 110 -132 -229 -263 -122 -30 -153 -38 -125 -137 -178 -172 -8
3196 -8 218 -86 278 -97 -73 -17 236 71 212 -78 -57 -151 -172 155 262 -313 262 -40 54 -77 -205 210 -288
3219 -288 -149 -20 14 -243 109 -105 -110 -163 -256 2 -26 -248 142 296 -15 -189 -77 119 -81 174 79 -11 -26
$$ packed form
3054a52Mj12R1J98j49J03l6J4P3jOl50O3L10N59n50l4J46l40M6n5L54k67rj46
3079b34K63K13l61J36o2j10K46j16j57P6P7k11P6M2J17q1PK62k74J2m3K78j25
3102C1L6%J02j41q6K31p1j25n3K28p5j08J25o5J09j14O8j48j30K55j73j31J50
3125h5p1M4o4J85P8r3QNP8j8j61K57j27o5J40l7O2k96J45l2J2o0J55j41J86l29
3151b24M22l18j11J92J95o9j78J98J03o1j18J64j98k19J75J88j23j13J99q0M3
3172F7k45K75K41m60K65j28n3J19p3m8J82l2k42r7l4J41R2j23J15q7j2m1OJ64
3196hK26l04L64l75K4N6K53j65J41k90K1r4k1L27J07n75N75l02R4j31j28M15m98
3219b88J39J29L4k57L52k14nn3r3K58k8k22L90J54l11j74J12J96k00K55r5r0j5
$$ plain form
3242 -26 -43 165 -160 -85 85 -29 39 -102 345 -96 -57 127 -74 -217 14 275 -184 -255 -228 59 -73 -381
3264 -381 112 -81 94 -157 161 -88 -93 109 149 -79 13 -79 86 50 93 30 47 -439 87 58 -308 -280 -203 -243
3288 -243 -147 45 117 -98 -94 147 -139 117 -14 -88 -32 -23 -86 124 40 -73 -6 4 113 -37 7 -24 170 -65 85
3313 85 -149 -267 -43 -47 -203 -111 -38 267 -229 -85 59 -61 -120 71 -93 -54 -72 -137 -109 -222 226 -84 47
3336 47 46 119 -78 70 239 72 -71 -158 -43 -23 -139 89 9 16 9 5 25 31 -127 165 61 -73 122 92 124 -120
3362 -120 200 239 91 -47 63 221 94 88 -129 114 124 7 152 -45 -240 -12 -26 93 -121 -125 98 -135
3384 -135 -118 37 -152 -89 128 71 -74 -76 -6 -168 -106 138 -126 -15 -168 259 273 -305 -106 -77 322 -167 135
3407 135 -82 -134 -181 -6 55 -125 -289 -76 -35 -123 -137 106 -147 79 -277 -282 209 113 -233 66 -183 113 76
$$ packed form
3242b6j7K08l25P5J70j14O8j41M47m41L9J84k01j43K31K61m59p1K7K87j32l08
3264c81M93j93J75k51L18k49nK02M0k28R2r2J65l6M3o3J7m86N26k9l66K8P7m0
3288b43R6J92P2k15MK41k86K56j31p4N6Ro3K10q4j13O7J0J09j50M4l1J94k35J50
3313H5k34j18K24mj56R2P3L05m96J44J44j20n9J91j64L9j8o5K8j13M48l10J31
3336D7jP3j97J48J69j67j43q7J15K0j16K28q0PpmK0Oj58K92j04j34J95l0L2k44
3362a20L20L9j48j38J10J58j27ok17K43J0j17J45j97j95K28j4J19k14mK23k33
3384a35J7J55j89O3K17n7j45kP0j62O2K44k64J11j53M27J4n78J99K9L99m89L02
3407A35k17n2m7J75O1j80j64K13M1q8j4K43k53K26l56nM91r6l46K99k49K96l7
$$ plain form
3430 76 -130 16 279 123 16 86 -39 -63 58 -156 -78 53 -118 88 93 -65 129 56 -120 -33 138 68 -78
3453 -78 -48 245 -151 -115 -113 150 -126 -30 -51 153 57 46 182 144 287 194 -109 76 3 -65 -57 -307 -93 -76 162
3478 162 50 -76 -92 -64 108 -6 -37 2 76 1 -64 -126 127 134 -143 -127 -1 36 -26 -36 55 -213 133 -141 9
3503 9 -214 -192 99 -30 -102 -29 330 -61 -26 -164 141 -133 -154 -54 -190 -375 -11 -71 -178 -15 84 36 -30 236
3527 236 -18 -8 417 -55 205 134 -51 77 49 76 -12 112 213 72 -83 -79 139 22 9 -10 -181 -348 -81
3550 -81 -46 -38 -202 -60 13 62 122 99 -123 -6 141 -39 144 170 -65 -114 0 -85 210 -206 127 -19 -22 -73 -168
3575 -168 191 -129 -156 92 -313 -51 -126 -281 177 10 -44 348 -144 -31 -36 -183 -20 -155 110 191 213 -64
3597 -64 85 201 -51 45 -10 -316 39 230 201 -51 15 -263 -119 -10 -4 -89 43 95 5 -109 88 67 -18 -130
$$ packed form
3430G6k06J46K63j56j07P0j25k4J21k14P8J31j71K06Nj58J94p3j76Q7J71p0j46
3453g8L0K93l96L6KK63k76R6k1K04r6j1J36l8J43r3l03J85p3o8Qk50K14J7K38
3478A62j12j26j6K8J72j14l1L9P4p5o5o2K53Pk77J6J26L7o2j0R1k68L46k74J50
3503Ik23K2K91j29p2P3L59l91L5j38L05k74k1J00j36j85L64o0j07J63R9m8o6K66
3527B36k54J0M25m72K60p1j85J28k8K7q8J24J01j41j55MK18j17j3j9j71j67K67
3550h1L5Qj64J42P3M9O0k3k22J17J47j80J83K6k35m9J14q5K95m16L33j46ln1r5
3575a68L59l20k7K48m05K62p5j55M58j67n4L92m92J13nj47J63j35K65Q1K2k77
3597f4J49J16k52R6n5l06L55J91k9k52O6k78J44J09Oq5J32N2r0j14J97k1q5j12
$$ plain form
3621 -130 104 -39 -141 -34 -79 -3 -115 138 -80 79 -238 146 -48 -28 243 46 -73 -215 10 -270 169
3642 169 -139 -59 -126 -184 -211 4 231 49 -77 79 29 -9 -55 58 -254 214 -70 167 -74 119 80 58 80
3665 80 -43 -99 -99 6 95 173 -101 -4 -76 -11 -92 -227 -106 31 -44 59 87 31 213 -93 98 -49 -30 116 -72
3690 -72 237 12 55 44 186 314 300 -97 -77 -95 176 -177 -51 -87 -196 -300 -12 134 -60 24 15 -30 -84 -173
3714 -173 138 12 -40 -138 89 111 -63 -122 42 214 -126 -3 53 -184 29 21 -19 198 46 12 -40 -14 -13 168
3738 168 -144 -36 132 -127 114 -250 -203 25 -65 -46 -142 137 -134 10 -142 199 -13 166 73 -63 28 -116
3760 -116 -167 -66 98 124 -75 -122 29 -75 -89 -162 -225 -48 152 92 155 -172 166 -40 75 -181 -105 15 5
3783 5 -23 171 33 146 24 30 -200 -20 -33 -118 -172 -13 -110 -136 25 -100 271 68 -152 -68 97 54 82 40 -37
$$ packed form
3621a30K34j43j02J07m5P6j12K53k18J59l17L84j94K0K71j97j19j42K25k80M39
3642A69l08Q0o7n8k7K15K27j82j26J56n0l8m6J13l12M68k84K37k41J93l9k2K2
3665H0j23n6%J05Q9P8k74R7p2O5q1j35J21J37p5J03K8n6J82l06J91j47J9J46j88
3690g2L09k25M3j1J42J28j4l97K0j8K71l53J26l6j09j04K88J46j94Q4rm5n4q9
3714a73L11j26n2r8K27K2j74n9J64J72l40J23N6k37K13qm0K17j52l4n2K6JJ81
3738A68l12J08J68k59K41l64M7K28r0J9r6K79k71J44j52L41k12J79r3j36R1j44
3760a16n1J01J64K6j99m7J51j04j4p3o3J77K00o0O3l27L38k06J15k56P6J20j0
3783Ek8J94j38J13j22Ok30J80j3q5n4J59r7k6J61j25L71k03k20Q4J65m3K8m2p7
$$ plain form
3808 -37 -15 -125 114 27 -36 40 230 -51 207 68 -163 183 -184 -224 102 215 102 67 -96 -14 27 -14 -24 39
3832 39 -121 -105 19 -19 -52 -184 302 45 253 -278 -57 -64 188 123 12 324 124 48 132 -24 80 120 -378
3855 -378 236 44 145 -96 196 -210 -71 -102 22 31 33 23 96 -115 -11 45 -158 -219 -36 24 6 -4 289 -143
3879 -143 151 89 -202 273 -55 183 115 146 200 -180 -27 71 -37 74 -348 -44 -53 -10 29 -89 62 -84 -144
3902 -144 -258 22 -104 -22 -21 219 -74 114 -10 -101 -131 -70 2 -90 -74 286 212 -42 -127 10 25 -40 48 -129 84
3927 84 38 -189 -101 -282 -213 -151 7 130 55 -237 206 52 21 -29 111 230 139 215 -51 218 65 91 322 -104
3951 -104 -106 200 227 138 -5 -233 73 -175 192 -173 -40 173 -84 408 -76 107 114 -260 27 -116 -46 41 -124
3974 -124 -176 -46 57 -147 -27 -148 -6 267 -166 -147 1 21 135 8 22 122 29 -32 -111 -1 26 109 45
$$ packed form
3808c7K2j10K39q7o3P6J90k81K58j39k31L46l67m0L26J13j13l5j63Q2M1m1j0O3
3832C9j60J6J24l8l3j32M86k57K08n31K21pK52o5j11L12k00p6Q4j56J04M0m98
3855c78O14j92J01k41K92m06J39l1J24RKj0P3k11J04N6k03o1J83O0j8j0K93m32
3879a43K94o2k91M75l28K38o8L1N4l80J53R8j08J11m22L04rM3L9j18J51j46o0
3902a44j14K80j26Q2JK40k93J88j24r1l0O1P2r2J6L60p4k54q5J37J5o5Q8j77K13
3927H4m6k27Q8j81O9O2J58J23p5k92M43j54l1n0J40J19r1P6k66K69j53K6K31m26
3951a04kL06K7q9j43k28L06k48L67l65J33K13k57M92m84J83Pl74K87j43P0Q7j65
3974a24n2J30J03k04J20j21J42K73m33J9J48K0J14j27J4J00r3o1p9J10K7Q3o4
$$ plain form
3997 45 4 -88 11 162 -98 222 12 -21 -89 -88 -246 85 4 117 43 71 149 -342 -142 -101 -151 -93 -147 -14 -78 127
4023 127 156 -69 -144 -294 38 153 -76 -355 4 36 -3 0 52 -257 107 160 -174 -63 -99 -98 -42 190 44 47 -149
4048 -149 46 -39 107 187 -435 129 -104 -157 -32 -201 -143 -261 -92 -125 39 127 -65 92 195 105 167 -117 180
4071 180 0 -18 236 -31 -71 -18 127 82 -54 97 -1 -32 -107 91 -20 -81 236 150 10 -12 118 107 -9 -50
4095 -50 32 -106 -109 -201 -70 -162 -79 247 57 -30 205 -205 219 -237 73 50 -48 26 -2 -73 -11 -83 74 -65 61
4120 61 -85 -233 56 160 -35 16 87 -42 16 -96 115 -20 41 -302 -59 34 -167 184 50 129 271 187 56
4143 56 -47 -21 4 99 -188 89 72 41 19 62 0 -191 -32 42 39 26 224 -106 106 -82 -177 17 -139 49 -138
4168 -138 69 -115 39 -105 -153 68 -128 78 -44 -50 30 69 118 -81 -91 -62 75 -60 9 -58 -273 -128 -131 -91
$$ packed form
3997D5m1r2R9J51k60L20k10l3o8Jj58L31q1J13p4K8P8m91K00M1n0N8n4J33o4K05
4023A27K9k25p5j50L32J15k29k79L59L2l9LN2l09L64N3l34J11l6JN6K32j46Lj96
4048a49J95q5J46Q0o22N64k33n3J25j69N8j18J69l3J64Q8j92J57J03r0O2k84K97
4071A80j80j8K54k67m0N3J45m5j36J51r8l1p5J98j11o1L17q6j40k2J30j1j16m1
4095e0Q2j38lr2J31r2Q3L26j90q7K35m10M24m56L10k3r8P4k8p1O2p2J57j39J26
4120F1j46j48K89J04j95N1P1j29N8j12K11j35O1l43K43R3k01L51j34P9J42q4j31
4143E6j03K6K5R5k87K77j7l1k2M3o2j91J59P4lj3J98l30K12j88r5J94j56J88j87
4168a38K07j84J54j44m8K21j96K06j22oQ0L9M9j99j0K9J37j35O9o7k15J45lM0
$$ plain form
4192 -91 166 -176 92 -51 121 231 6 139 -27 238 -200 -103 -18 -19 -38 177 -84 -243 -10 16 54 -37 -138
4215 -138 -66 389 -79 138 -70 153 33 -75 169 142 -209 -215 -3 7 -37 66 -78 165 32 58 105 -187 41
4238 41 17 12 18 -105 42 150 -12 -20 115 -142 -160 66 -201 151 -227 65 148 65 -137 -177 -145 -155 49 -122 102
4263 102 -60 155 115 -309 18 232 63 130 98 162 -19 -5 -150 104 68 -21 67 -51 22 -83 -59 14 148 -5
4287 -5 -233 21 34 31 151 -122 -39 56 142 97 100 -36 71 189 -52 12 16 172 -51 107 92 141 -51 148 121 235
4313 235 -35 244 51 3 155 -153 -157 206 93 96 -21 -136 -68 -163 -235 -145 128 190 -39 190 60 -32 -97 223
4337 223 149 133 -29 7 26 -150 169 64 229 -60 96 -96 -5 134 -148 27 21 32 -35 -275 115 55 -134
4360 -134 11 -70 -88 -43 -152 -68 -206 46 83 -48 -353 126 85 95 16 122 -59 -7 -12 138 88 -188 -266 78
$$ packed form
4192i1K57l42K68j43J72J10k25J33j66K65m38R7Q5jj9K15k61j59K33K6L8r1j01
4215a38P2M55m68K17k08K23j20j08K44k7l51oK12J0m4J03j44K43j33K6M7k92K28
4238D1k4nOj23J47J08j62qJ35k57j8K26k67L52l78K92Q3q3k02m0L2j0K04j71K24
4263A02j62K15m0m24L27K14j69O7l2O4j81J4j45K54l6q9Q8j18P3j05K4P3J34j53
4287ek28K54J3lJ20k73Q3R5Q6m5Lj36J07J18k41O4MJ56k23J58j5M9j92J99k7J14
4313B35k70K79j93m8J52l08mL63j13Lj17j15O8r5p2R0K73O2k29K29j30r2o5L20
4337B23p4j6j62L6J9j76L19j05J65k89J56j92R1J39k82J75oJ1o7k40L90o0j89
4360a34J45q1j8M5j09Q4j38K52L7j31l05M79m1J0p9J06j81N2nJ50n0k76p8L44
$$ plain form
4384 78 85 -195 260 -280 -60 107 40 60 -43 83 -178 84 -274 14 -120 77 145 31 -225 266 18 61
4406 61 -252 -110 160 -150 237 -132 146 26 -9 -31 47 127 70 126 -74 -99 61 245 -73 354 61 84 -8
4429 -8 -124 63 281 59 99 11 -190 50 68 259 2 281 -198 -274 75 -17 -152 13 163 -172 -90 -275 4
4452 4 48 72 -155 211 -15 64 -99 127 33 151 -27 363 79 158 29 102 -33 -203 -28 198 180 64 239
4475 239 156 124 -133 -70 -122 150 39 171 59 -3 175 -146 48 197 59 217 -94 -91 215 -168 -56 -63 35
4498 35 79 -93 133 -84 86 -60 -28 -41 86 7 -220 120 354 342 16 136 -93 -68 -60 -34 -90 52 -162 -36
4522 -36 34 4 -82 -238 15 -164 110 -296 132 75 141 2 -10 -25 275 65 32 -30 -145 95 -139 -62 155 47
4546 47 -46 -42 -117 -186 45 -32 -59 -109 90 -98 -210 61 -95 36 -54 -33 -106 119 159 149 -134 -139 180 174 104 -45
$$ packed form
4384G8Pk80M55n40K20J67o7K0j03J26k61K62l58K88j34J97O8j14k56M91k48M3
4406F1l13J42K70l10L87l69K78j20l5k2P8Q0n7N6k00k5J60J84l18M27k93K3r2
4429hj16J87K18k22M0q8k01K40J8J91k57K79m79p6L49r2j35J65J50l35Q2j85K79
4452DM4K4k27L66k26P9j63K26r4J18j78L90k84P9j29P3j35j70J75K26j8j16J75
4475B39q3l2k57O3n2K72j11J32j12o2J78l21J94J49j38J58l11LL06l83J12pR8
4498C5M4j72K26k17J70j46L2j3J27p9k27L40K34j2l26J20k29K5QK6n6J42k14J26
4522c6P0l0q6j56K53j79K74m06M28n7O6j39j2j5L00k10l3o2j15K40k34P7K17j08
4546D7r3Mp5o9K31p7k7n0J99j88j12K71j56J31r0K1p3K25M0j0k83nL19op0j49
$$ plain form
4572 -45 286 189 -48 35 -142 -59 115 -36 33 -15 -354 -36 -19 83 -105 -189 80 -43 -43 174 -22 176 420
4595 420 -221 101 189 -141 141 -233 -89 -23 148 -220 52 -6 188 110 -31 -58 -42 -440 -220 -224 -55 22 -113
4618 -113 100 -298 -20 -144 12 0 37 119 -19 -4 151 -68 -55 178 25 -73 -10 -107 161 105 2 62 -128
4641 -128 -171 -19 144 -122 -180 -27 10 -87 -17 142 24 2 -85 17 90 283 30 9 -59 243 -134 -131 -367 97
4665 97 62 101 248 51 95 -6 43 -176 22 -30 112 -167 -75 93 -30 23 0 4 52 -102 -20 118 54 149 118
4690 118 -110 27 -213 337 39 -219 65 12 57 58 21 94 -24 -100 163 94 -144 -174 159 -27 -147 5 -222
4713 -222 -109 2 -53 -77 -76 -225 195 -201 -168 339 -58 146 58 -89 -223 -37 -54 -112 131 335 225 71 23
4736 23 -62 -14 -83 -40 57 20 -157 101 -47 44 -108 -55 162 124 279 -88 -51 301 36 -162 24 -205 168 -23
$$ packed form
4572d5L31r7k37Q3j77Q3J74j51O9m8l39L18J7J02j88q4K69j23%K17j96J98K44
4595D20o41L22Q8l30K82l74J44O6J71l68K72n8J94p8j41k7J6l98K20mJ69P7j35
4618a13K13l98K78j24J56j2L7Q2j38J5J55k19J3K33j53r8O3r7K68n6j03O0j90
4641a28m3J52J63k66n8J53L7r7P0J59j18k2q7J02P3J93k53k1o8L02l77Lk36M64
4665I7l5L9J47j97M4j01M9k19J98n2J42k79R2J68j23N3k3MM8j54Q2J38o4R5l1
4690A18k28J37k40N50k98k58K84n3M5Jl7P3j18p6K63o9k38l0L33j86j20J52k27
4713b22J13J11n5k4Jj49M20l96L3N07l97K04q8j47j34J86j7n8K43K04j10j54m8
4736B3q5M8o9M3R7l7j77K58j48R1j52N3K17l8J55l67L7L52k65j98J86k29L73j91
$$ plain form
4760 -23 42 -29 -95 -10 58 -225 133 -45 43 -159 28 -154 70 -139 -157 160 -13 159 115 59 -56 61 -38 20
4784 20 -164 -14 348 -122 14 -3 -136 -56 -141 -252 78 98 2 21 80 -11 -77 17 -26 76 86 -79 -135 -6 -6
4809 -6 -296 230 152 -234 67 -170 -214 -109 75 -233 11 86 -218 -287 130 -66 178 28 -28 -160 247 201 -197
4832 -197 -71 -22 119 -316 172 141 -70 -249 -76 -155 -139 -164 -87 71 -27 -65 26 -108 146 -45 -119 -12 83 90
4856 90 126 -10 113 -125 3 30 -58 -48 101 11 8 330 -41 -17 -51 217 72 5 -83 -105 -87 -136 189 53 265
4881 265 -96 -13 114 89 -23 109 111 129 -112 25 111 205 -42 -242 -36 -113 -104 -213 275 -210 72 -155 100
4904 100 -117 -12 -121 -154 -57 -80 -38 88 71 -31 -136 85 -13 150 -54 -55 192 -129 185 -100 -221 31 -23
4927 -23 300 82 -104 -98 87 -116 24 -69 -246 -12 37 -12 126 68 -61 -65 -77 -156 27 -20 62 46 216 -78 27
$$ packed form
4760b3O5p1o6Q5O8k83L58j78Q8k02J87j82K24k09j8L17j73J72m4n6j15J17r9N8
4784B0j84J50L62m70J36j7j33Q0q5j11L30K0r6J9N9r1o6R4m3J02J0j65n6J29%
4809fk90N26p8l86L01k37m4J05J84l08K44P5l04o9M17j96K44j50n6j32M07m6l98
4832a97J26M9J41m35M88l1k11j79J73p9J6k5P7J58r8l8R1j34K54j91p4J07R5P
4856I0L6j36J23k38J28K7q8J0J49r0lL22l71K4l4K68j45o7q8k2J8m9L25j36K12
4881B65l61Q3J27k5j12J32KJ8k41J37Q6R4k47k00K06p7Rj09M88m85K82k27K55
4904A00k17J05j09l3R7k3M2J26j7j02j05K21r8J63k04jK47l21L14k85j21K52n4
4927b3L23k18j86OJ85k03J40r3j77K34M9m9J38n8j29mj2p9J83m7Q2j6J70k94J05
$$ plain form
4952 27 -241 221 61 -78 4 -73 -121 -148 186 162 83 -72 -28 -154 -167 -200 160 -94 -208 -61 103 -103 38
4975 38 -19 -49 179 27 130 -146 55 -81 -127 43 -137 -30 4 5 114 -162 83 -111 -157 139 -247 127 36
4998 36 307 -239 151 -5 -243 -236 12 -195 -77 -62 122 -105 -92 138 10 -338 -9 67 -202 4 -140 -199
5020 -199 -103 78 -101 -11 -1 81 -26 -78 69 179 -41 -97 -186 61 -89 84 94 -13 -157 12 -160 -50 281
5043 281 64 42 22 -21 -62 -2 -16 137 -143 32 -150 20 201 154 56 -9 0 24 -13 -104 17 -153 -231 -222 96 -111
5069 -111 -61 102 -177 -120 -144 -31 80 46 80 -23 306 90 28 166 -140 -91 119 -276 131 -73 7 232 218
5092 218 -176 -217 18 286 -71 -19 -201 -83 -62 131 -9 151 -107 -110 -86 167 62 15 400 -75 185 46
5114 46 187 11 -50 74 6 -93 -31 34 82 197 134 39 131 220 119 96 -24 50 24 86 -302 -140 15 -36 -64 197
$$ packed form
4952B7k68M62j60j39Q2p7m8k7L34k4p9j55M4j26j3l3L60k54j14J47J64k06J41
4975C8n7l0K28j52J03k76K01j36m6J70j80J07L4JJ09k76K45j94m6K96l86L74r1
4998C6K71n46L90j56k38PK48k07J18J5J84k27J3K30j28l48L29P6k69K06j44n9
5020a99R6J81j79R0J0Q2j07n2J47J10k20n6q9K47j50J73J0j07j44J69j72J10L31
5043B81k17k2k0m3m1O0j4J53k80J75j82J70J81m7r8o5RK4l7r1J21j70p8RL18k07
5069a11N0J63k79N7k4J13J11l4L4j03L29k16o2J38l06M9K10l95M07k04Q0K25j4
5092B18l94m1K35K68l57N2j82J18K1J93j40J60k58lK4K53j05m7L85m75K60j39
5114D6J41j76o1J24o8r9O2O5M8J15o3r5R2Q9j01k3j20P4k6O2l88J62J55n1k8K61
$$ plain form
5140 197 -249 118 56 116 0 115 142 -240 -117 78 52 175 73 139 130 -50 -33 -38 -160 -209 118 -155 -67 -131
5164 -131 30 23 -55 -179 -52 124 -94 -279 0 -88 159 -34 30 -231 9 75 166 18 -83 16 86 22 87 -49
5188 -49 -136 -107 11 -62 -44 -39 -152 -47 -104 -75 -171 -28 -151 4 190 29 118 334 -274 68 -49 -24 162 28
5212 28 -225 -84 -84 290 53 88 -259 -1 -44 -35 -85 -252 0 17 84 -103 -128 -337 -19 -67 -205 -94 -64 -114 -211
5237 -211 -52 -127 100 7 -201 -59 92 192 104 21 168 7 28 -10 -141 -146 -89 229 -84 -131 -148 92 -193 57
5261 57 33 -157 -121 97 36 -16 -29 109 -80 -235 -134 -221 -171 5 101 69 105 182 -7 -31 73 -71 42 -61
5285 -61 -263 -78 -11 -380 -10 -153 61 -71 167 -65 -126 99 206 -19 -129 63 -151 -293 -19 1 -70 68
5307 68 23 167 18 74 55 -112 15 -106 -131 -72 14 -146 -28 -89 -362 -66 -94 -117 80 -136 -96 31 -126 55
$$ packed form
5140A97m46L67o2O0j16J15K7l82J23J95k6J23j02O6rj80J7nj22m9L27k73Q8o4
5164a31J61pp8j24J27J76k18j85K79q8K47j93O4k61K40O6R1j48j01R9P0o4O5j36
5188d9q7K9J18p3J8Nj13J05n7K9r6J43j23J55J86j61Q9K16o08L42j17K5J86j34
5212B8k53J41%L74k37L5l47K58m3Rn0j67K52J7O7j87k5k09L18m8j38J11L0n0r7
5237b11J59p5K27r3k08J42J51J00q8q3J47j61K1l8j31nN7L18l13m7j7K40k85K50
5261E7k4j90L6K18o1n2j3J38j89j55J01q7N0J76R6l2L6P7j89k4J04j44J13j03
5285f1k02J85O7l69L70j43K14j32K38k32o1K25J07k25j10J92k14j42K74K0p1J38
5307F8m5J44j49N6j9j67J27j21k5N9Q6j60J18o1k73K96k8k3J97k16M0J27j57J81
$$ plain form
5331 55 19 -39 64 43 170 -71 16 115 -94 -9 87 17 -67 68 54 -58 18 -103 2 -112 -185 268 74 -46
5355 -46 -74 -80 55 155 66 106 -36 -159 162 -283 108 -47 -62 30 -146 -42 151 192 -254 -342 -6 -20 38 2
5379 2 15 -6 129 168 -86 213 -2 -82 -116 -165 39 -43 91 -98 33 219 -50 55 126 -289 118 256 63
5402 63 92 -140 141 48 -21 -183 210 69 69 81 189 107 -64 113 33 -91 -236 -68 -66 -85 -197 11 45 128 -40
5427 -40 -6 -72 -83 26 -322 246 55 62 -1 113 -22 14 204 -35 -29 35 -63 165 154 40 -137 203 136 -93 -53
5452 -53 -222 -190 35 -100 -19 -10 -223 6 6 6 69 -181 253 -112 21 -197 106 239 36 -189 -93 40 89 41
5476 41 -162 164 -92 -224 -214 -49 39 -312 -34 -34 -155 181 40 95 -326 -159 -134 -8 56 -141 25 -98 -316
5499 -316 35 280 0 -85 70 36 41 73 72 79 131 -123 -140 -172 8 268 116 33 -116 152 -276 135 -111 3
$$ packed form
5331E5l6n8J03k1J27k41Q7R9k09Q5R6p0q4J35j4j12P6j21J05j14p3M53j94j20
5355d6k8oJ35J00q9M0j42j23L21m45L91j55j5R2j76J04J93M1m46q8L36j4N8l6
5379BJ3k1J35L9k54K99k15q0l4m9K04q2J34j89J31J86k69J05P1m15M07J38j93
5402F3K9k32K81r3o9j62L93j41%J2J08q2j71J77q0j24j45J68Kj9j12K08L4Q3j68
5427d0L4o6j1J09l48N68j91Po3J14j35L6J90k39OO4r8K28j1j14j77L40o7k29M0
5452e3j69L2K25j35Q1Rk13K29%%O3k50M34l65J33k18L03J33k03k25R6J33M9m8
5476D1k03L26k56j32J0J65Q8l51K78%j21L36j41N5m21J67K5J26O4j97J66j23k18
5499c16L51K45k80q5J55l4NL2jPN2k54j7l2J80K60j52q3j49K68m28M11k46J14
$$ plain form
5523 3 72 63 6 -35 146 16 116 -17 -118 16 72 39 -40 79 -210 -120 14 -269 -43 94 73 -51 0 98 -10
5548 -10 -149 -39 29 -134 67 44 112 8 84 113 -1 -57 166 97 -118 1 76 55 -193 -63 16 84 -94 -151
5572 -151 29 -23 -128 159 -315 4 -65 111 1 30 -33 46 -32 -60 -53 -131 -105 -64 -72 -25 204 -15 -177 -80 435
5597 435 -180 -249 -47 173 16 -64 -172 -66 19 51 34 -64 -123 -27 175 -73 10 33 -54 -62 62 -217 -119 -98 -289
5622 -289 6 57 83 35 -56 90 33 -43 135 113 209 20 249 115 -8 116 45 124 152 -162 -108 82 42 -40 203
5647 203 203 144 67 74 157 -145 -91 -41 183 22 165 -47 -7 112 -77 -76 66 68 104 -6 -14 93 -17 -12 4 -181 -141
5674 -141 14 260 55 -184 103 -122 -36 2 -65 -54 -103 -68 6 -132 51 -23 -196 -115 7 72 -1 235 -163 -156
5698 -156 -174 55 119 -94 -82 -12 -83 -89 -146 -30 -62 -161 -49 247 -50 -128 143 -33 116 -110 -278 92 -1 -15
$$ packed form
5523CO9rn7m1J81j30J00j33j01J34N6l3p9J19k89R0J34k83K26J37k1j24N1R8j08
5548a0j39J10O8j63K01k3O8j04P6K9j14n6K23o9k15J19P5k1k48J30P9O8j78n7
5572a51J80n2j05K87m74L19o9J76j10K9o3P9p8k8Pp8K6M1qM7K29k19j62R7N15
5597D35o15o9K02K20j57q0j08J06Q5L2j7r8n9R6K02k48Q3K3q7qJ24k79R8K1j91
5622b89K95N1K6m8r1J46n7p6J78k2R6j89K29j34j23J24p1P9K8l14N4J90m0q2K43
5647B03%n9p7PQ3l02N4N0K24j61J43k12M0J19j89JJ42KL6j10qJ07j10NJ6j85M0
5674a41J55K46k05k39K87k25Q6L8o7J1m9L5P4j38J83p4j73Q1J22O5p3K36l98P
5698a56j8K29O4k13J2P0p1on7J16l2r9J12K96k97p8K71j76J49k26j68L70r3j4
$$ plain form
5722 -15 -75 -107 75 172 -108 -112 115 -50 -24 14 85 -448 269 27 -13 187 67 0 37 -125 117 64 -64 43
5746 43 -135 -44 -50 -66 192 -86 149 -58 -95 126 -13 -281 178 194 76 10 -12 206 57 33 -16 54 93 84 -248
5771 -248 -44 14 -62 23 81 -31 57 8 74 -148 -70 205 -37 -5 -114 -16 -37 70 -47 107 -18 61 -82 84
5795 84 51 206 64 99 -154 120 321 91 221 -13 11 69 59 67 6 -39 -164 120 105 140 29 8 3 57 -16 5
5821 5 127 6 132 -103 -24 180 88 -27 155 82 61 -55 110 -26 140 50 -166 -54 -145 -52 -62 -92 -63 -127
5845 -127 -113 -125 -12 -37 6 -206 26 -163 -107 -90 -59 -86 35 11 -3 131 97 5 -101 59 44 64 21 45 334
5870 334 176 313 -100 168 -112 120 -50 -144 -21 204 -135 11 -197 -126 164 133 157 149 -44 218 -24 -17 112
5893 112 -120 -174 -26 -39 -21 295 -152 206 -173 -109 -30 51 -136 -114 -172 138 -12 352 86 -202 -264 -136 280
$$ packed form
5722a5o0l2J82R7k80mK27j65K6L8P1n33P17k42m0K00j20o7L7j62K42n3j28J07
5746D3j78R1oj6K58k78K35k07l7K21j39k68M59J6j18o6k2K18j49k4m9P0L9rl32
5771b48K04N8p6Q5N8j12Q8m9O6k22P8K75k42L2j09R8k1J07j17J54j25P9j43J66
5795H4l3J55j42L5k53K74K01k30J30k34K4N8j0Qo1m5j25K84j5L5j11k1nN4p3K1
5821EJ22j21J26k35P9K04r2j15J82p3k1j16J65j36J66r0k16J12r1R3j0l0K9o4
5845a27J4j2J13k5M3k12K32j89N6J7L1k7J21k4j4J34l4r2j06J60j5K0m3K4K89
5870C34j58J37m13K68k80K32j70r4J23K25l39J46k08P1K90l1K4qj93K62k42PJ29
5893A12k32n4J48j3J8L16m47L58l79O4P9Q1j87K2n8L10j50L64k66k88o2J28M16
$$ plain form
5916 280 10 166 77 -53 47 78 97 56 -139 90 166 92 -37 -90 -57 125 -3 152 68 198 -106 -143 -78 -131
5940 -131 33 -141 -2 -12 -16 9 23 -209 -128 -114 146 0 -107 145 -129 40 291 -29 -270 132 124 -20 -161
5963 -161 17 183 -133 5 146 -99 -112 -152 220 -10 -171 18 -213 -18 -281 191 30 45 53 -38 71 112
5985 112 -193 47 5 122 253 35 54 24 83 -38 90 -334 -171 -279 -73 -192 -159 113 -134 -178 -190 80
6007 80 186 -39 -56 266 -29 69 -68 119 95 15 172 -67 80 31 125 -95 -163 45 17 -67 -44 -164 -164 -284
6031 -284 181 -119 30 212 36 -163 95 -94 70 -54 -14 -180 -20 -221 -136 40 286 97 -125 -37 79
6052 79 151 13 160 -49 -76 165 -83 111 -56 -191 62 178 185 -44 15 -251 -66 -118 -93 -56 -99 -11 -90 -60
6076 -60 28 -123 193 -195 -92 -255 -8 -21 57 -114 -8 19 38 120 -101 -19 -33 -205 -70 -93 26 33 62 -31 -35
$$ packed form
5916B80k70J56q9j30J00L1J9m1j95K29P6p4j29n3L3J82j28J55q4J30l04l7O5n3
5940a31J64j74J39j0mK5J4k32Q1J4K60j46j07K52k74J69K51l20k41M02qj44j41
5963a61J78J66l16J38J41k45j3m0L72k30j61J89k31J95k63M72j61J5Qr1J09M1
5985A12l05K40m2J17J31k18J9l0N9j21J28m24J63j08K06j19L3K72k47m4j2K70
6007H0J06k25j7L22k95R8j37J87k4q0J57k39J47m9R4k20o8K08k8q4K3j20%j20
6031b84M65l00J49J82j76j99K58j89J64j24M0j66J60k01Q5J76K46j89k22Q8J16
6052G9P2j38J47k09k7K41k48J94j67j35K53J16Pk29N9k66J85n2K5L7m3Q8p9L0
6076f0Q8j51L16l88J03j63K47j3P8j71J06K7J9Q2k21Q2j4j72J35k3J19PK9r3m
$$ plain form
6101 -35 -281 -67 -188 47 88 16 40 -169 -48 80 -7 34 -89 245 -38 -103 -99 -28 139 -11 31 -54 136 256
6125 256 -281 85 -139 94 210 2 -129 -163 -213 -42 2 -131 -127 -85 -104 3 -105 35 43 -130 123 110 7
6148 7 35 -129 134 -58 -121 221 26 376 -136 172 0 25 -90 -20 -286 115 305 -154 5 -15 -227 -149 178
6171 178 423 158 -156 124 114 -41 226 54 83 65 122 136 157 -161 -266 -31 214 -304 -54 85 52 -132
6193 -132 73 -74 -168 -55 286 42 48 111 59 183 -330 -143 -140 31 19 -128 356 -130 118 90 209 -4 133
6216 133 -113 4 -50 232 119 165 170 112 -197 -13 -285 27 -52 -136 -105 -116 -72 -74 139 -79 244 -162 165 -39
6240 -39 116 9 -136 74 218 -98 188 181 -17 -349 140 221 109 6 -238 205 193 256 -87 -28 -164 47
6262 47 -126 -7 55 -120 11 -40 181 231 -120 -11 41 -85 -5 38 -35 40 108 -54 130 100 -31 -38 31 30 -47 60
$$ packed form
6101c5k46K14j21K35M1p2K4k09J21J28q7M1j23L34k83o5MP1J67j50M2q5J90J20
6125B56n37L66k24K33J16k08j31l4n0J71M4j33MM2j9J07j08J40Qj73K53j3j03
6148GK8j64K63j92o3L42j95L50n12L08j72K5j15P0k66M01J90m59J59k0k12P8L27
6171A78K45k65l14K80j0j55K67j72K9j8N7J4K1l18j05K35K45n18K50J39l3j84
6193a32K05j47r4J13L41k44OO3n2J24n13J87LJ71j2j47M84m86K48k8J19k13J37
6216A33k46J17n4K82j13M6Nn8l09J84k72L12p9q4L1j1M4kK13k18L23m06L27k04
6240c9J55j07j45K10J44l16K86pj98l32M89Q1j12j03k44M43j2O3l43N9j36K11
6262D7j73J19O2j75J31n1K21N0l51J09N2j26Q0M3p3P5O8j62J84l0j31pO9jp7J07
$$ plain form
6288 60 -86 -87 -87 60 93 -91 -224 -230 -30 199 -71 166 202 213 -206 -229 -29 -44 208 108 169 12 292 130
6312 130 -88 -17 -50 116 -96 -57 14 68 -152 48 204 -20 -78 147 -92 46 -163 111 -4 -90 34 21 -143
6335 -143 134 277 -232 -123 169 -48 -157 31 -191 91 -107 -71 -157 -153 -107 -178 -176 159 -5 21 -66 -118 -163 203
6359 203 -119 -154 4 68 -303 -257 240 148 214 209 -34 -30 218 -11 -21 53 -131 -64 24 130 -192 331 119 -90
6383 -90 55 14 -89 138 99 -36 127 50 -8 -85 -41 -141 -28 94 -90 -311 -148 85 5 27 77 231 7
6406 7 -48 -140 -3 100 79 -38 94 275 121 46 -186 -28 2 -136 -299 -114 -105 -70 19 -59 -157 -71 -200 58 -69
6431 -69 178 282 209 -16 90 80 -175 134 23 60 -4 141 99 -60 -10 -32 34 30 112 -64 102 -39 -333 36
6455 36 14 -198 -111 52 -18 -129 -259 -147 -23 173 -52 -113 -278 -25 72 123 197 -146 73 -96 24 201 261
$$ packed form
6288F0j46j%J47L3j84j33oK00K29k70K37L6J1m19k3K00j5K52j00O1j57K80j62
6312A30k18P1l3J66k12L9P1N4k20K00J56k24n8K25k39J38k09K74j15q6J24j3j64
6335a43K77J43n09J09K92k17j09J88k22K82j98L6q6MM6p1KL35j64K6q7n2m5L66
6359B03l22l5J58O4l71M6M97r2O6nk43MK48k29j0P4j84O7Q8J06l22N23k12k09
6383i0J45m1j03K27l9j35J63p7n8p7M4j00J13J22j84k21J63K33q0K2N0J54k24
6406Gn5r2J37J03k1j17J32J81j54p5k32J58L0j38j63J85RL5Q9p8r8Q6j29K58j27
6431f9K47J04p3k25J06j0k55L09j11L7o4J45m2j59N0k2O6mQ2j76J66j41k94L69
6455C6k2k12Q7J63p0j11j30J12J24J96k25o1j65K53R7N1P4l43K19j69J20J77O0
$$ plain form
6478 261 -85 76 74 28 41 -9 151 128 -30 -253 143 -182 125 70 -141 31 81 64 -31 -16 142 -108 21 161
6502 161 228 172 18 -60 258 145 24 92 -277 123 -89 -180 44 -31 -35 -113 -159 68 -86 -114 -182 50 -104 -179
6526 -179 -115 -75 -127 198 -25 37 -152 -22 164 -172 197 -118 59 89 -97 -25 167 11 -42 -150 -185 -108 -285
6549 -285 -86 265 0 17 19 -122 85 -89 -41 -262 204 -195 -5 -20 -18 111 -66 -97 26 -219 215 -5 -50
6572 -50 74 93 -37 122 89 163 222 -232 -76 -93 34 -118 -3 130 295 40 2 33 -47 223 183 81 57 -136
6596 -136 -24 154 124 232 -45 -120 127 109 -159 114 143 -169 -53 53 116 -242 100 -164 -37 -15 9 -119
6618 -119 -112 -114 -128 -88 -125 23 51 99 87 121 -1 84 335 64 59 60 174 -9 123 153 -180 -143 -126 -102 -98 -118 -5 -28
6646 -28 -44 -12 169 -144 50 1 40 -287 -101 180 84 -37 54 -102 -117 93 257 62 44 -20 -181 81 223
$$ packed form
6478B61l46J61km6J3n0J60k3j58k23L96l25L07n5k11J72N0j7r5J5J58k50J29J40
6502A61O7n6j54p8L18j13j21O8l69M00k12r1K24p5mp8m6K27j54k8o8K32j54p5
6526a79O4M0n2L25k23O2j89J30J86l36L69l15J77L0j86P2J92j56n3j08l5P7j77
6549b85J99L51k65J7Kj41K07j74M8k21M66l99J90j5KJ29j77l1J23k45M34k20m5
6572e0J24J9j30J59l3P4N9m54J56j7J27j52J15J33J65k55l8L1q0K70m0j02k4j93
6596a36J12J78l0J08k77p5K47j8k68K73K9l12J16J06O3l58L42k64J27K2K4j28
6618a19Pkj4M0l7J48K8M8j2L4j22Q5K51k71nJJ14j83J32L0l33L7J7K4Mk0J13k3
6646b8j6L2J81l13J94m9L9l27J86K81r6j21R1j56j5K10J64j95j8o4j61K62J42
$$ plain form
6669 223 65 -11 96 136 71 -118 151 -20 12 -102 -247 48 -184 36 -63 -88 26 166 -42 160 -43 48
6691 48 30 100 14 -4 -108 -53 128 -131 160 -262 37 129 -178 178 81 -80 43 -229 156 97 2 -68 45 -29
6715 -29 334 -77 -374 -140 79 -96 65 49 -134 45 -279 -27 85 61 317 -20 -241 21 -148 -3 -91
6736 -91 -58 -89 56 98 -241 -5 38 -25 -53 -130 -28 -322 371 51 -223 58 -10 -97 213 -157 235 -108 -42 -224
6760 -224 293 123 3 33 292 -11 -46 -12 -149 230 20 -19 -188 -14 189 10 -48 -187 -125 -69 18 -84 29
6783 29 104 -94 210 -149 -394 -4 -167 -355 -18 -26 192 -131 103 173 -61 105 89 -251 -61 -69 -24 46 -86
6806 -86 31 5 -122 -195 175 55 122 122 182 155 -244 102 -40 89 60 -83 -51 -66 76 83 222 -206 -113 -114 42
6831 42 -242 -164 130 116 11 75 104 -44 -22 79 -112 171 -185 45 -232 -63 -233 -82 -115 0 -68 -53 -134
$$ packed form
6669B23j58p6J07M0o5j89K69j71L2j14j45K95k32K20r9k5J14J40k08K02k03R1
6691D8j8P0q6j8j04N5J81k59K91m22K99R2l07L56r7j61J23k72L85n9r5p0J13p4
6715b9L63m11k97K34K19j75J61j6j83J79l24K52J12k4K56l37k21K62j69J45q8
6736i1L3l1J45M2l39K36M3o3k8p7J02k94O93l20k74K81o8q7L10l70L92l43O6j82
6760b24N17j70j20L0K59l03l5L4j37L79k10l9j69J74K03j79n8j39O2N6Q7j02J13
6783B9P5j98L04l59k45L90j63j88L37qK18l23K34P0k34J66j6l40J90qM5P0j32
6806h6J17k6j27p3L70j20O7%O0k7l99L46j42J29k9j43L2j5J42PJ39m28R3jJ56
6831D2k84P8K94j4j05O4K9j48K2J01j91K83l56K30k77J69j70J51l3J15o8J5q1
$$ plain form
6854 -134 -32 -161 -121 -48 -164 -62 159 -36 -32 8 238 13 -234 -196 46 -411 -21 -49 -49 89 -160 164 -65
6877 -65 96 -148 -80 -11 48 -493 254 -47 -231 -143 -82 10 -13 96 -144 -9 -32 160 25 195 -5 113 81
6900 81 -45 -36 -155 19 -98 -193 -46 30 132 68 346 -13 280 81 185 50 162 82 -112 23 -75 -70 86
6923 86 90 37 -227 141 76 87 68 -74 109 -98 53 -46 -90 197 -178 -57 -131 -245 117 -76 -69 -214 124 163
6947 163 -119 58 -245 49 42 22 -1 177 61 190 -203 82 -36 -160 62 123 92 -266 -66 58 93 -103
6969 -103 -14 -276 -47 -188 -50 -281 -182 -48 219 -47 255 60 111 -64 116 104 -128 171 -8 229 119
6990 119 81 -6 -108 -8 -66 70 -84 91 269 25 -93 -6 191 -54 -44 76 -188 84 -236 -67 161 -282
7012 -282 -54 -213 167 42 73 -59 26 164 111 -6 80 -174 -20 89 -115 -125 48 -215 14 208 23 121
$$ packed form
6854a34J02j29M0P3j16J02K21j95MM0K30k25k47L8K42m57L90k8%J38k49L24k29
6877f5J61k44O8O9N9n41P47l01j84Q8O1R2k3J09k40J35k3J92j35J70k00J18l2
6900H1j26Rj19J74j17r5J47P6J02o4K78l59K93j99J04j35J12q0j94J35r8NJ56
6923H6Mn3k64L68o5J1j9j42J83k07J51r9m4K87l75J21p4j14L62j93Pj45L38L9
6947A63k82J77l03K94pk0k3J78j16J29l93K85j18j24K22O1l1l58K00J24L5j96
6969a03Q9k62K29j41J38k31R9J34K67k66L02j95N1j75J80j2k32K99j79K37j10
6990A19l8q7j02J00n8J36j54J75J78k44j18Q7J97k45J0J20k64K72l20J69K28m43
7012b82K28j59L80j25L1j32Q5J38n3j17Q6k54J54J09k04j0J73k63K29J94j85R8
$$ plain form
7034 121 163 28 -58 -123 -226 -178 20 51 83 112 196 44 72 4 56 105 -147 -150 -88 -52 -3 -114 40 11 88 48 11
7061 11 24 -8 -43 -28 -101 195 98 -72 -66 -66 319 -265 15 32 65 -221 95 -17 83 90 50 13 66 33 -117 30
7087 30 97 214 -34 -39 1 -157 -25 -221 150 102 37 44 125 22 26 19 -129 266 191 -212 47 -244 33 -56 -93 -28
7113 -28 115 -113 140 -181 -53 66 63 -109 -29 25 -58 188 -24 249 -161 351 -224 73 -153 62 -199 24
7135 24 -33 -215 -8 4 -161 41 295 -229 98 -106 -147 68 103 167 -143 -82 72 -19 -335 0 9 41 -50 -181
7159 -181 105 49 -15 -45 -31 -159 31 -5 -117 475 5 174 -60 -99 -154 205 7 -3 73 -150 24 17 -64 -48
7183 -48 300 -74 -87 118 180 -166 11 -174 48 -58 30 159 -191 23 57 -34 -21 -213 -63 -140 -24 -60 71
7206 71 -103 75 94 3 105 -153 -154 -35 -36 -192 -147 -26 -31 -25 184 80 89 -99 96 77 -66 -354 -218 149 -198
$$ packed form
7034A21M2j35q6o5j03M8J98L1L2K9Q4j52K8o8N2M9k52lO2L6M9j11J54k9P7m0l7
7061A1J3l2l5J5p3K96r7j70O%L85n84K80J7L3k86L16j12J00Pm0l7N3l3j50J47
7087C0O7J17k48nM0j58J32j96L71m8o5PQ1j03Mpj48L95p5m03K59k91K77q9l7O5
7113b8J43k28K53l21J28J19lj72Q0N4q3K46k12K73m10N12n75K97k26K15k61K23
7135B4n7j82K07J2j65K02K54n24L27k04m1K15L5O4l10O1J54r1l16L35RL2r1j31
7159a81K86n6o4l0J4j28J90l6j12N92m70J69k34l9n5L59j98j0P6k23J74pq1J6
7183d8L48l74j3K05O2l46J77j85K22j06Q8J29l50K14L4r1J3j92J50p7J16l6J31
7206G1j74J78J9r1J02k58jJ19jj56M5J21nOK09j04Rj88J95j9j43k88J36L67l47
$$ plain form
7231 -198 39 103 -217 -116 -77 -257 -6 -163 23 -197 -155 195 -14 36 -133 127 126 -31 48 -148 2 41 34
7254 34 -52 -214 -144 254 177 27 6 -161 -128 79 232 -254 -93 72 166 136 101 71 -94 -111 -140 -6 -41 33 94
7279 94 15 134 -5 13 -89 -89 39 -106 -2 40 6 16 -278 -174 -149 -121 92 -18 -44 63 138 39 -217 17
7303 17 106 89 185 66 136 13 -198 -246 -129 23 -157 163 23 62 104 182 129 -26 106 -10 -26 -83 1 -320
7327 -320 175 -43 -7 124 12 121 -71 196 159 -1 78 -95 268 62 86 287 71 199 304 107 197 20
7349 20 -46 139 23 -144 -92 136 -114 68 -230 -28 -66 -102 28 -212 -89 79 -45 -18 -75 -48 -126 106 37
7372 37 -213 -201 68 -217 -93 -13 -64 195 -129 -212 -193 -217 211 -47 -2 115 -138 -193 -183 -99 -301 51 189 19
7396 19 116 -153 -129 106 65 22 -200 29 -155 -39 -134 225 200 -315 11 2 -13 -29 -101 39 344 -95 -71 293
$$ packed form
7231a98K37O4l20J01L9j80K51j57J86k20M2L50k09N0j69K60jj57P9j96J50L9p
7254C4q6j62P0L98p7j50k1j67L3K07J53m86J61J65R4l0l5l0j65j7k9J34l5P4O1
7279I4p9J19j39J8j02%J28j45J04M2l4J0k94J04K5K8K13j10k6J07P5r9k56K34
7303A7Q9j7R6j19P0j23k11m8J17J52j80L20j40L9M2P8n3j55J32j16j6n7Q4l21
7327c20M95k18L6J31j12J09j92K67l7j60P9j73L63k06K4K01k16J28J05j97R0j77
7349B0o6J85j16j67N2K28k50J82k98K02l8l6J30k40J23J68j24K7n7K7p8K32o9
7372C7k50J2K69k85J24Q0n1K59l24q3J9k4M28k58M5J17k53n5J0Q4k02L52J38j70
7396A9R7k69K4K35m1m3k22K29j84J16r5L59k5n15L26rj5j6p2J40L05m39K4L64
$$ plain form
7420 293 -147 -136 -47 -9 58 -40 -275 -177 -83 -26 -54 -101 17 132 124 -127 87 151 119 -34 -43 27 67 17 10 -25 -70 -40
7448 -40 -6 -64 -131 150 131 -4 121 -92 -311 -6 74 170 -75 201 24 210 -68 218 5 -46 208 -59 197
7471 197 103 380 137 -228 97 -58 -197 -135 43 181 -66 137 87 64 -209 85 -153 -222 86 174 41 -63
7493 -63 -32 132 299 -213 -23 56 -135 17 47 69 -35 164 -140 -95 211 -63 15 124 35 53 -295 92 -146
7516 -146 65 -113 -10 76 155 -103 -63 105 -151 130 -128 -67 -269 -97 124 -211 -137 194 -11 83 -116 148
7538 148 9 -235 -65 206 355 54 -17 -93 138 -136 47 4 -104 149 -11 -136 13 -100 64 -182 -170
7559 -170 52 88 -37 -19 -25 67 24 91 32 115 179 49 297 107 -47 198 -6 -200 48 27 -33 164 97 78 -17
7584 -17 -88 103 82 -40 -138 -230 32 -177 77 -184 29 -17 113 87 -55 402 -115 -133 -27 -122 137 -88 -10
$$ packed form
7420B93m40J1Q9L8O7r8k35R8R4N7k8m7J18J15qk51K14O4l2j53rP0M0n0pl5m5L0
7448d0L4n8o7K81j9j35J25k13k19L05Q0R6k45K76j77J86k78K86k13n1K54k67K56
7471A97r4K77k43l65L25j55j39O2J78J38k47K03n0k3k73K94k38o9L08Q8j33j04
7493f3L1J64J67n12J90P9j91J52L0K2j04J99l04M5L06k74P8J09q9J8l48L87k38
7516a46K11j78J03Q6P9k58M0J68k56K81k58O1k02J72K21l35P4L31k05R4j99K64
7538A48j39k44J70K71J49l01p1p6K31k74J83m3j08K53j60j25J49j13J64k46J2
7559a70K22L6j25J8oR2m3O7n9Q3O4j30K48j90j54K45k04j94K48k1o0J97o7j9r5
7584a7p1J91k1j22r8r2K62k09K54k61K13m6J30k6j42M57n17j8J06r5K59k25P8
$$ plain form
7607 -10 -29 48 196 178 26 246 -152 86 110 72 20 -163 174 -108 35 -14 166 -47 -72 51 88 -1 -231 -78
7631 -78 -10 57 -4 -122 157 -25 -13 -75 353 -244 149 220 -185 -9 84 130 -310 -176 147 137 266 -260 -48
7654 -48 -130 -119 -77 -241 28 25 -51 -149 15 -26 -43 -106 37 -51 49 -134 415 -50 -166 -63 92 0 110 -260
7678 -260 -161 33 -130 172 18 85 2 175 -178 -76 -35 6 -136 -3 -350 -151 -224 -27 224 -185 -123 25
7700 25 -25 76 -70 -89 20 176 63 36 24 -126 6 -59 -191 -30 -114 224 -205 200 -6 135 198 122 -42
7723 -42 -201 69 272 -107 -123 25 -194 -82 15 -158 -155 -66 46 173 -7 153 -67 -69 -96 103 -42 -108 -51 -185
7747 -185 -73 -181 23 189 134 -207 67 -126 -52 150 -198 -64 7 49 18 67 46 -148 153 -183 55 186
7769 186 -321 26 78 113 51 49 323 165 -157 -225 -33 -74 134 95 51 286 37 -178 93 -114 6 -192 -269
$$ packed form
7607a0j9P7J48j8j52K20l98K38K4l8n2j83L37k82J43m9J80k13k5J23L7q9k30J53
7631g8O8O7o1j18K79j82J2o2M28n97L93P1m05J76R3M6m40J34L23j0J29n26K12
7654d8q2J1M2j64K69lp6r8J64m1j7o3J43q8J00j83N49m65j16J03J55r2J10l70
7678b60R9J94j63L02j54O7q3J73l53J02M1M1j42J33l47J99p3J97K51m09O2J48
7700B5n0J01j46j9J09J56j13k7j2j50J32o5j32J61q4L38m29M05k06J41O3p6j64
7723d2j59K70K03l79j6J48k19J12R7j73LQ9J12J27j80J60k20kk7J99j45o6N7j34
7747a85J12j08K04J66n5l41K74j93P4K02l48J34P1M2l1M9k1j94L01l36K38J31
7769A86n07L47N2L5o2kK74j58l22o8J92m1K08l9m4K35k49k15K71k07J20j98p7
$$ plain form
7792 -269 23 86 -192 -35 45 44 -73 -220 -53 21 19 -20 104 -305 6 110 -57 -58 152 -9 -50 121 24 -73
7816 -73 47 58 165 -161 79 43 -40 -65 29 68 85 170 -74 -72 9 -80 31 -40 -101 -33 17 -22 -35 -40 109 74 24 100
7844 100 -58 -10 67 -46 -53 -71 -100 110 -28 55 -68 -39 51 97 -92 77 179 -112 -90 -43 -272 -50 -107 -138 193
7869 193 191 80 -265 24 142 -89 48 -88 -192 199 15 -182 -139 131 -170 -242 -54 -52 153 -187 -91 45
7891 45 70 -73 127 279 3 -76 -146 2 110 -3 -133 -140 -17 147 44 185 198 88 -103 167 217 -120 -6
7914 -6 70 -69 116 89 -76 -78 -103 104 -35 61 84 53 -175 161 85 2 -64 -223 -104 286 -2 10 -2 -114 -98
7939 -98 -86 -143 137 -120 66 273 -85 176 40 21 18 -81 57 217 -98 -138 179 73 235 202 216 -104 -20 192
7963 192 -4 -72 -373 70 -137 -97 322 225 -278 234 10 -106 -26 16 -292 -94 154 -20 51 -17 -68 96 183
$$ packed form
7792b69K92O3k78J57Q0jj17j47J67P4kl9J24m09L11J04j67jK10j61m1J71r7r7
7816g3J20J1J07l26K40l6q3k5R4L9J7Q5k44KQ1q9J11p1o1O8N0l9j3nJ49l5n0P6
7844A00j58M8P7j13pj8k9K10j38Q3j23K9R0M6j89J69J02k91K2M7k29K22n7l1L31
7869A93kj11l45K89J18k31J37j36j04L91j84j97M3K70l01p2J88KK05l40R6J36
7891D5K5j43K00J52k76p9p0J48J08j13j30pJ23J64j03J41J3j10j91K70N0l37J14
7914fP6j39J85k7j65kk5K07j39R6K3l1k28L36p6q3o6j59J19L90k88J2j2j12J6
7939i8J2n7K80k57J86K07l58K61j36j9lr9J38J60l15m0L17j06J62l3J4l20Q4K12
7963A92j96o8l01M43k07M0M19r7n03N12k24j16Q0M2l08J98K48j74P1o8n1J64Q7
$$ plain form
7986 183 -42 -34 40 46 174 -60 -9 33 69 102 168 -91 -9 131 294 -171 -178 48 29 147 -22 74 -52 72 94
8011 94 140 82 172 -3 119 125 -130 -26 -135 -120 -30 82 208 78 175 49 104 -77 175 18 -71 140 -27 -213
8035 -213 -31 -180 -273 113 -42 -266 -31 -131 -201 3 -48 -29 105 83 -158 -19 265 79 28 100 -190 -163 -54
8058 -54 -229 -154 -38 -125 105 0 16 20 87 -137 -103 -16 114 118 140 184 -119 -114 16 72 10 -155 28 -145 42 141
8084 141 12 -3 23 -59 -90 98 128 -138 154 18 -97 -168 186 183 -131 153 58 11 -167 -51 255 -16 -46 37
8108 37 130 170 -82 -206 125 86 183 -246 -119 -71 86 88 -139 47 159 -32 -66 -11 -217 29 170 161 25 -61
8132 -61 -50 -27 68 3 -126 253 -54 27 -77 -11 -50 242 -49 -74 208 -166 170 12 -86 165 -12 -170 51
8155 51 -69 -264 99 75 -203 57 31 45 -277 -20 -23 103 313 -245 -6 -119 95 -36 -122 121 7 36 147
$$ packed form
7986A83k25QP4OJ28k34N1M2L6L3O6k59Q2J40J63m65pK26j9J18j69R6j26J24K2
8011I4M6n8R0j75J22Ok55J04j09J5R0J12J26j30R7j26N5j81K52j57q9K11j67j86
8035b13J82j49r3L86j55k24K35j00p0K04n1J9J34k2k41J39K84j86n1P2k90K7J09
8058e4j75P5J16q7K30j05J6MO7k24L4Q7J30MK2M4l03NJ30N6o2j65J83j73J87R9
8084A41j29j5K6q2l1J88L0k66K92j36j15p1L54ll14K84r5m7j78J16L06k71l0Q3
8108C7R3M0k52j24L31l9R7m29J27M8J57Kk27J86J12j91l4N5k06K46J41rj36q6
8132f1J1K3R5o5j29L79l07Q1j04O6l9K92k91k5K82l74L36j58r8K51j77j58K21
8155E1j20j95L63k4k78K60k6J4l22K57lJ26K10n58K39j13K14j31q6K43j14K9J11
$$ plain form
8178 147 -125 -38 6 292 -43 20 54 33 53 51 -181 94 103
$$ packed form
8178A47k72Q7M4K86l35O3L4k1K0kk32K75R
8191A03
$$ Imaginary data points
##PAGE= N=2
##DATA TABLE= (X++(I..I)), XYDATA
$$ plain form
0 0 0 0 0 0 0 0 0 0 0 0 0 0 0 0 0 0 0 0 8 -8 8 -8 8 -11 16 -16 16 -23 24 -27 32 -35 40 -46 51 -57 64 -71 80 -89
40 -89 99 -107 122 -132 146 -163 179 -196 216 -238 262 -290 320 -352 391 -434 482 -542 612 -694
60 -694 794 -921 1090 -1314 1638 -2138 3000 -4753 9665 -48817 -151563 80484 122301 -111512
74 -111512 -87465 137819 48731 -142916 -3244 146539 -33603 -127671 72233 108048 -97628
85 -97628 -74704 116916 40792 -126185 -5038 121727 -32516 -112243 59317 86595 -85881
96 -85881 -64484 97137 30599 -106481 -2160 101361 -28902 -90120 54399 72322 -71488
107 -71488 -46512 86244 23543 -86505 6982 85672 -28315 -70644 51128 55617 -63290
118 -63290 -33658 71931 10994 -73923 10131 65873 -33020 -56510 45925 36440 -59463 -19967
$$ packed form
0@%%%%%%%%%%%%%%%%%%Qj6J6j6J6j9K7l2L2l9M7n1N9o7P5q6R7j08J21j35J51j69
40h9J88k06K29k54K78l09L42l75M12m54N00n52O10o72P43q25R16j024J154j306
60f94J488j715K011k404K952l776N138p753J4418n8482j02746K32047M1817k33813
74a11512K4047K25284q9088j91647J39672J49783j80142r4068J99904L5815k05676
85i7628K2924J91620p6124j66977J21147J26765j54243p9727J71560K7278j72476
96h5881K1397J61621o6538j37080J04321J03521j30263o1218J44519J7923j43810
107g1488K4976J32756o2701j10048R3487P8690j13987m2329J21772M489j18907
118f3290K9632J05589o0937q4917Q4054N5742r8893k3490J02435r485r5903L9496
$$ plain form
130 -19967 60928 -2934 -60765 20909 51039 -37944 -37234 49795 21230 -54085 -966 56356
142 56356 -14771 -47130 34266 38641 -43991 -20459 52935 4313 -53193 13959 48887 -30712
154 -30712 -39854 42983 24004 -53569 -9395 53828 -11195 -54497 25493 44160 -42676 -33252
166 -33252 52625 15703 -58666 3228 59452 -20616 -52108 39700 43531 -50995 -25358 62903
178 62903 9115 -63804 12556 62586 -29232 -53373 45899 40369 -58949 -24192 65105 3050
190 3050 -68323 14431 61342 -35008 -54011 47442 37894 -60434 -21846 65376 2494 -66031
202 -66031 16799 61834 -32181 -50624 49076 39044 -56865 -19672 64912 3264 -62709 16920
214 16920 59082 -31927 -48659 46168 34614 -56971 -19406 60305 -580 -62029 15494 54167
$$ packed form
130a9967Q0895o3862n7831Q1674L0130q8983P10Q7029k8565p5315N3119N7322
142E6356p1127l2359Q1396M375q2632K3532P3394m8622n7506O7152L4928p9599
154c0712r142Q2837j8979p7573M4174O3223o5023m3302P9990J8667q6836R424
166c3252Q5877l6922p4369O1894N6224q0068l1492R1808L831r4526K5637Q8261
178F2903n3788p2919P6360N0030r1818k4141R9272n530r9318L4757Q9297o2055
190C050p1373Q2754M6911r6350j9003J01453r548r8328L8588Q7222o2882o8525
202f6031Q2830M5035r4015j8443R9700j0032r5909L7193Q4584o1648o5973P9629
214A6920M2162r1009j6732R4827j1554r1585L7565P9711o0885o1449P7523L8673
$$ plain form
226 54167 -33233 -47022 44540 31741 -54939 -16665 58460 -420 -56985 17853 52597 -30766
238 -30766 -40652 44871 29663 -50340 -11534 55221 -2552 -51078 18920 45476 -31703 -35473
250 -35473 40552 21578 -47813 -8275 46481 -8032 -45207 18744 35944 -31354 -27427 37006
262 37006 13897 -41498 -1439 40503 -10549 -35048 22377 29416 -28423 -17596 36124 8780
274 8780 -35245 4594 34832 -13506 -28515 22811 21474 -29226 -12270 31391 1001 -32781
286 -32781 7422 27682 -18342 -23862 23018 14138 -28754 -6713 29330 -3934 -28350 12492
298 12492 24378 -18847 -16637 25565 10688 -26910 173 29181 -7296 -24403 16583 21067
310 21067 -21785 -13148 26339 5537 -28338 2311 26673 -12054 -24567 17836 17281 -24667 -11955
$$ packed form
226E4167q7400j3789R1562j2799q6680L8274P5125n8880n6565P4838L4744q3363
238c0766r886Q5523j5208q0003L8806O6755n7773m8526O9998K6556p7179l770
250c5473P6025j8974o9391L9538N4756n4513l7175O3951J7200o7298L927O4433
262C7006k3109n5395M0059M1942n1052k4499N7425P039n7839J0827N3720k7344
274H780m4025L9839L0238m8338j5009N1326j337n0700J6956M3661l0390l3782
286c2781M0203K0260m6024n520M6880q880m2892K2041L6043l3264k4416M0842
298A2492J1886m3225K210M2202j4877l7598K7083K9008l6477j7107M0986M484
310B1067m2852Q637L9487k0802l3875L0649K4362l8727j2513M2403n55m1948J2712
$$ plain form
323 -11955 26620 1907 -28738 5328 26017 -14309 -21857 20917 15886 -24701 -7520 28547
335 28547 533 -26749 9867 26034 -15308 -18777 22724 13249 -25498 -4834 27260 -3478
347 -3478 -26418 10909 22049 -19140 -17662 22170 8723 -27134 -2951 25643 -6535 -24869
359 -24869 12828 19799 -19343 -13842 23146 7661 -23990 974 24842 -6193 -20689 14389
371 14389 18006 -17389 -10568 21227 5662 -21396 1442 20543 -7914 -18697 12244 13053 -17493
384 -17493 -9609 17988 1953 -20151 1661 17457 -8552 -15796 12414 11186 -15629 -6335 17809
397 17809 1684 -16946 4698 17064 -7802 -12496 13700 10440 -14560 -4458 16820 323
409 323 -16270 4421 14435 -9466 -12716 11474 7227 -15231 -4575 14252 -1945 -15320 4649
$$ packed form
323a1955L8575k4713l0645L4066K0689m0326p548M2774n031m0587J7181L6067
335B8547k8014k7282L6616J6167m1342l469M1501r475l8747K0664L2094l0738
347c478k2940L7327J1140m1189J478L9832j3447l5857K4183K8594l2178j8334
359b4869L7697O971l9142N501L6988j5485l1651K4964K3868l1035j4496L5078
371A4389L617l5395O821L1795j5565k7058K2838J9101k8457j0783L0941Q09l0546
384a7493P884K7597j6035k2104K1812J5796k6009p244K8210j228k6815R294K4144
397A7809j6125j8630K1644J2366k4866m694K6196l260k5000J0102K1278j6497
409C23j6593K0691J0014k3901l250K4190m247k2458J0656J8827j6197j3375J9969
$$ plain form
422 4649 12188 -9363 -9885 11915 6038 -13061 -1165 14440 -1977 -12166 7444 11574 -8681
435 -8681 -6476 12741 3862 -12338 1014 12669 -4024 -11208 7359 7988 -11016 -5782 10937
448 10937 491 -12622 1091 9801 -5770 -9701 7491 6323 -9894 -3503 10683 458 -10035
461 -10035 3186 9667 -4725 -6937 8339 5505 -8026 -1213 9759 -485 -7944 3438 7276
474 7276 -5506 -5699 7060 2765 -8619 -1445 7169 -2475 -8063 2685 5548 -5681 -5369 6013
488 6013 2302 -7521 -534 7255 -1219 -6451 3663 6191 -4199 -3766 6879 3126 -6011 189 7097
503 7097 -895 -5950 3188 5299 -4833 -3823 5577 1484 -6824 -328 5323 -2507 -5870 2776 3575
518 3575 -5380 -3189 5246 693 -6138 914 5351 -2293 -4071 4473 4063 -4462 -1192 6395 659
$$ packed form
422D649P539k1551n22K1800n877j9099J1896J5605j6417j0189J9610M130k0255
435h681K205J9217q879j6200J3352J1655j6693p184J8567O29j9004N234J6719
448A0937j0446j3113J3713Q710j5571l931J7192j168j6217O391J4186j0225j0493
461a0035J3221O481j4392k212J5276k834j3531O813J0972j0244p459J1382L838
474G276j2782j93J2759m295j1384P174Q614r644n588J0748K863j1229L12J1382
488F013l711r823O987P789q474n232J0114K528j0390M33J0645l753r137O200O908
503G097p992n055R138K111j0132J010R400m093q308O496N651p830l363Q646P99
518C575q955K191Q435m553o831P052M437p644j778Q544m10q525L270P587n736
$$ plain form
533 659 -4793 2356 5235 -2638 -3533 4240 2524 -5024 -1360 4492 -1011 -5005 1224 3207 -3327 -3270
549 -3270 2956 965 -4305 -685 3512 -1006 -3520 1635 2763 -1921 -1292 3342 1757 -2121 944
564 944 3504 -567 -1943 1847 2366 -1686 -1382 2276 593 -2920 -429 1961 -1439 -3149 293 1211
580 1211 -2206 -2096 1643 424 -2552 -698 1862 -398 -1877 722 2205 -581 -1192 2491 1706 -1337
596 -1337 293 2583 609 -1244 993 1990 -1107 -1275 1315 539 -2491 -448 1238 -1336 -2353 629
612 629 651 -2288 -1244 1420 -358 -2074 416 1661 -843 -1285 1665 1474 -881 1 2387 548 -1017
629 -1017 1145 1981 -349 -332 1457 750 -1185 -471 707 -448 -1448 -202 133 -911 -1035 -341 -267 -1162
647 -1162 -234 199 -330 -759 398 132 -321 -9 663 519 35 449 1262 517 89 839 626 415 -189 304
$$ packed form
533F59n452P149K879p873q95P773j716p548L664N852n503l994O229J983o534N7
549c270O226j991n270L620M197m518k514N155J128m684O29M634j585l878L065
564I44K560m071j376L790N19m052L04L658j683l513K491K390l400j710L442R18
580A211l417J10L739j219k976J854K560k260j479K599J483k786o11L683p85l043
596a337J630K290j974j853K237R97l097j68K590p76l030K043J686k574j017K982
612F29K2k939J044K664j778j716K490J245k504m42K950j91k355Q82K386j839j565
629a017K162Q36k330J7J789p07j935P14J178j155j000J246L35j044j24O94P4q95
647a162R28M33n29m29J157k66m53L12O72j44m84M14Q13p45m28P50k13k11o04M93
$$ plain form
667 304 589 -394 -554 310 -3 -959 -833 4 -119 -1429 -170 248 -995 -1123 147 220 -604 -530 543
686 543 292 -473 698 912 189 281 1049 497 133 597 519 246 -203 434 91 -439 -80 279 -651 -1017 -104
707 -104 -391 -1249 -617 134 -518 -988 -110 308 -537 -641 373 356 78 330 758 220 217 1072 561 318 865
728 865 299 275 313 352 6 -520 164 267 -818 -561 170 -613 -1233 -391 -140 -497 -905 -4 128 -596 -414
749 -414 409 142 -165 456 576 552 174 856 595 522 654 669 88 272 507 237 -229 -313 61 -383 -1039 -510
771 -510 -336 -749 -618 -324 -335 -725 -461 365 -55 -631 89 654 465 -107 513 946 315 -23 1013 1081 56
792 56 301 1035 403 -551 96 993 -360 -1466 333 107 -1286 -996 309 -558 -1302 -109 327 -1106
810 -1106 -1144 1007 215 -1365 450 1688 -229 -531 1279 1542 -701 -30 2045 468 -1057 683 1588
$$ packed form
667C04K85r83j60Q64l13r56J26Q37j23j310J259M18j243j28J270P3q24P4J073
686E43k51p65J171K14p23R2P68n52l64M64p8k73m49O37l43n30L59L59r30l66R13
707a04k87q58O32P51o52m70Q78M18q45j04J014j7k78K52M28n38lQ55n11k43N47
728H65n66k4L8L9l46n26O84J03j085K57P31p83o20Q42K51l57m08R01J32p24J82
749d14Q23k67l07O21J20k4l78O82k61p3J32J5n81J84K35k70m66q4L74m44o56N29
771e10J74m13J31K94j1l90K64Q26m20n76P20N65j89n72O20M33o31l38J036O8j025
792E6K45P34o32r54O47Q97j353j106J799k26j393K90J305q67p44J193M36j433
810a106l8K151p92j580J815J238j917l02J810K63k243O71K075j577j525J740R05
$$ plain form
827 1588 -688 -1317 1327 1055 -1673 -869 1723 -288 -2004 59 1080 -1324 -1540 699 172 -1624
843 -1624 -744 1160 -370 -1131 788 1436 -1189 -529 1961 1135 -1072 530 2010 -226 -823 1201 1423
860 1423 -1188 -593 1652 194 -1992 -244 1485 -1088 -2082 494 786 -1794 -1549 1295 307 -2346
876 -2346 -238 1781 -509 -1686 1190 1796 -981 -659 2119 1170 -1807 636 2346 -101 -1355 1408
892 1408 1880 -1439 -1086 1857 236 -2680 -156 1758 -1562 -2480 1044 772 -2804 -1025 2269 -401
908 -401 -2964 907 2282 -1723 -1985 2547 1658 -2089 38 3517 357 -2364 1638 2621 -1498 -1481 2716
925 2716 1153 -2762 -291 2776 -975 -2890 1393 1467 -2605 -1969 2123 122 -3200 -49 2382 -1605
941 -1605 -2534 1663 1846 -2432 -646 2995 731 -2420 1001 3202 -845 -1771 2498 2074 -2220 -1006
$$ packed form
827A588k276o29K644k72k728Q04K592k011j716K063J021k404k16K239n27j796
843a624Q80J904j530p61J919O48k625O60K490q26k207J602J480k236n97K024K22
860A423k611N95K245j458k186J748J729k573r94K576K92k580K45K844r88k653
876b346K108K019k290j177K876O06k777L22K778r49k977K443J710k447j254K763
892A408M72l319L53K943j621k916K524J914l320r18L524k72l576J779L294k670
908d01k563L871J375m005k62M532q89l747K127L479l160k721M002R83m119J7M197
925B716j563l915K471L067l751j915M283P4m072O36M092k001l322L151K431l987
941a605r29M197J83m278J786L641k264l151L421K201m047r26M269m24m294J214
$$ plain form
957 -1006 2780 187 -2871 462 2672 -1787 -2676 1589 1351 -2678 -1437 2598 -257 -3325 610 2730
973 2730 -1704 -2192 2435 1461 -2573 -346 3329 106 -2555 1739 3294 -1915 -1845 3275 1409 -3068
989 -3068 -293 3568 -798 -3596 1687 2538 -3038 -2280 2821 733 -3924 -343 3357 -1209 -3483 1837
1005 1837 2543 -2953 -1804 3520 764 -3551 712 3579 -1458 -2683 2866 2699 -2725 -765 3617
1020 3617 383 -3257 1184 3009 -1943 -2739 2812 1330 -3639 -769 3032 -721 -3648 884 2824
1035 2824 -2640 -2696 3031 1426 -3499 -284 3666 -437 -3052 1874 3269 -2239 -1890 3617 1530 -3164
1051 -3164 112 3482 -854 -3313 1873 2703 -2743 -2376 3295 578 -3862 -246 3094 -1614 -3396
1066 -3396 1555 2427 -3314 -1905 3392 545 -3790 657 3805 -1337 -2994 2862 3027 -2986 -652
$$ packed form
957a006L786k593l058L333K210m459q89M265k38m029J241M035k855l068L935K120
973B730m434m88M627r74m034K227L675l223k661M294J555n209P0N120j866m477
989c068K775L861m366k798N283Q51n576P58N101k088m657L581L700m566k274N320
1005A837P06n496J149N324k756m315M263K867n037j225N549j67n424J960M382
1020C617l234l640M441J825m952p96N551j482m969K870L801l753k927M532J940
1035B824n464n6N727j605m925L215L950m103k615M926J395n508L49N507k087m694
1051c164L276L370m336k459N186Q30n446L67N671k717m440L616L340m708j782
1066c396M951Q72n741J409N297k847m335M447L148n142j657N856J65o013K334
$$ plain form
1081 -652 4363 469 -3651 1114 3881 -1715 -3200 2824 2122 -3686 -1384 3596 -579 -4136 951
1096 951 3071 -2299 -3230 2769 1621 -4004 -1002 3644 -451 -3524 1771 3450 -2189 -2192 3796 1788
1112 1788 -3400 389 4116 -829 -3101 2091 2906 -2715 -1973 3113 555 -4343 312 3168 -1745
1127 -1745 -3425 1812 2278 -3264 -1931 3207 459 -3557 396 3260 -1270 -2785 2236 2364 -2689
1142 -2689 -602 3660 620 -2820 1024 3427 -1588 -2211 2681 1744 -3282 -978 3164 -603 -3609
1157 -3609 1013 2489 -2496 -2399 2408 1187 -3889 -628 3286 -957 -3429 1572 2972 -2330 -1960 3196
1173 3196 1346 -3319 143 3718 -766 -2705 2003 2675 -2472 -1563 3174 796 -3666 334 3070
1188 3070 -1700 -3045 1833 1681 -3231 -1472 2813 54 -3779 536 3096 -1905 -2394 2773 1876 -3075
$$ packed form
1081f52N015l894m120M765K767n596j485O024p02n808K302M980m175l557N087
1096I51K120n370r31N999j148n625L002M646m095l073N295J679n639lN988k008
1112A788n188L789L727m945k272N192Q15n621P42N086k558m898M655K856m913
1127a745j680N237M66n542J333N138k748m016L953K864m530j515N021J28n053
1142b689K087M262l040l440L844K403n015o23M892r37n026K304M142l767l006
1157c609M622J476m985R7M807j221n076L261L914m243k472N001J400n302L70N156
1173C196j850m665L462L575m484j939M708O72n147R09M737k378m462M000K736
1188C070m770j345M878j52m912J759M285k759l833M315K560n001m89N167q97m951
$$ plain form
1204 -3075 -508 3764 -112 -2913 1622 3474 -1703 -1869 3184 1707 -2852 -524 3461 -585 -2850
1219 -2850 1328 2354 -2460 -2194 2434 699 -3222 -459 2887 -1115 -3171 1400 2369 -2529 -1514
1234 -1514 2671 762 -2854 61 3059 -529 -2269 1898 2133 -1947 -823 2913 974 -3008 153
1249 153 2815 -1354 -2689 1574 1842 -2857 -1434 2558 289 -3277 -8 2600 -1322 -2685 1860
1264 1860 1822 -2448 -1070 2960 486 -2768 885 2805 -1153 -1700 2292 1576 -2156 -254 2774 -113
1280 -113 -2279 1150 2108 -2145 -2059 2398 738 -2717 -643 2374 -668 -2711 914 1764 -2025 -1555
1296 -1555 2160 690 -2432 113 2652 -628 -2041 1604 1982 -1302 -979 2313 613 -1839 313
1311 313 2172 -654 -1801 1453 1126 -2001 -1014 1507 -182 -2399 172 1540 -1234 -1956 1380 924
$$ packed form
1204c075K567M272l876k801M535J852n177j66N053j477m559K328L985m046k265
1219b850M178J026m814K66M628j735l921K763L346m002k056M571R69m898J015
1234a514M185j909l616K915K998l588j740M167K35m080J124L736j939l982L161
1249A53K662m169j335M263K68m699J423L992k269l566L269K608l922j363M545
1264A860l8m270J378M030k474l254L653J920l958n47L992p16l732J902L028k887
1280a13k166L429R58m253Q6M457j660l455K074L017l042k043L625Q50l789M70
1296a555L715j470l122K545K539l280j413L645L78l284L23L292j700k452K152
1311C13J859k826j147L254l27l127R87K521j689k217K571J368k774p22L336m56
$$ plain form
1327 924 -2081 -756 1895 -106 -2066 917 1795 -932 -1276 2096 1216 -1717 -115 2240 110 -1817
1343 -1817 858 1903 -1118 -1230 1580 932 -2107 -480 1547 -635 -2140 359 1324 -1297 -1364 1432
1359 1432 555 -2059 -82 1968 -427 -1424 1249 1569 -1105 -503 1691 587 -1405 376 2158 -512
1375 -512 -1515 1250 1258 -1605 -759 1637 -18 -1990 27 1407 -876 -1553 885 624 -1785 -1018 1438
1392 1438 -126 -1778 636 1286 -696 -904 1153 852 -1003 -530 1552 169 -724 961 1300 -678
1408 -678 -785 1000 605 -1193 -288 1432 -430 -1335 88 815 -1261 -1260 556 382 -1425 -291 1073
1425 1073 -326 -1306 548 980 -622 -771 1142 840 -1054 152 1421 -64 -793 760 1126 -664
1441 -664 -420 1069 505 -1162 -54 869 -560 -1179 313 362 -950 -841 654 -103 -1276 19 704
$$ packed form
1327I24l005J325K651k001j960K983Q78k727l44L372q80k933J602K355k130j927
1343a817K675J045l021j12K810o48l039J627K027k182j505K499R65k621o7K796
1359A432q77k614J977K050k395r97K673L20k674O02K194j104j992J781J782k670
1375e12j003K765Qk863Q46K396j655j972K017J380k283o77K438k61k409P67K456
1392A438j564j652K414O50j982k08K057l01j855M73K082j383q93J685L39j978
1408f78j07J785l95j798R05J720j862r05J423P27k076JJ816j74j807J134J364
1425A073j399r80J854M32j602j49J913l02j894J206J269j485p29J553L66j790
1441f64K44J489n64j667J108R23j429o19J492M9j312J09J495p57j173J295O85
$$ plain form
1458 704 -562 -903 705 462 -919 -550 1308 284 -1024 611 1216 -310 -692 972 883 -763 -361
1475 -361 927 -66 -998 16 378 -506 -923 156 138 -653 -457 426 -158 -869 41 474 -334 -167 638
1494 638 196 -341 201 855 -165 -217 531 705 -260 -293 783 363 -833 -207 500 -278 -683 80 598 -778
1514 -778 -615 311 32 -647 -340 488 -266 -546 206 600 -345 -269 378 355 -416 61 502 405 -238 613 679
1535 679 -8 16 534 257 -409 -107 697 -279 -567 -65 247 -503 -486 296 -305 -917 -318 295 -696 -383 136
1556 136 427 -320 -224 542 401 -289 -23 505 16 -367 522 703 -199 -115 334 307 -427 -39 271 -232 -473
1577 -473 -4 127 -564 -435 380 -169 -481 39 37 -81 -319 283 49 -32 -164 363 123 -205 135 817 257
1598 257 144 -24 500 -206 3 137 89 -144 -191 185 -378 -409 -200 161 -589 -734 -293 179 -729 -379 43
$$ packed form
1458G04j266l41J608k43j381L69J858j024j308J635O05j526l82J664q9j646M02
1475c61J288r93r32J014L62q84m17J079j8p91J96Q83n84p11R10M33q08J67Q05
1494F38m42n37N42O54j020n2P48J74r65l3J076m20j196O26P07p78m05P63N18j376
1514g78J63R26k79o79L07Q28p54k80P52L94r45P6O47k3p71M77M41r7o43Q51O6
1535F79o87K4N18k77o66L02Q04r76k88N02L12p50J7P82o01o12N99O13r91L13N19
1556A36K91p47R6P66j41o90K66N28m89l83Q89J81r02Q4M49k7p34L88L10n03k41
1577d73M69J31o91J29Q15n49l12N20kj18k38O02k34q1j32N27k40l28L40O82n60
1598B57j13j68N24p06K09J34m8k33m7L76n63l1K09L61p50j45M41M72r08L50M22
$$ plain form
1619 43 6 -293 -29 340 -192 7 279 132 123 299 547 -22 -66 334 182 -31 -84 311 150 -379 -161 34
1641 34 -316 -288 -156 -10 -576 -405 -95 -168 -465 -284 287 68 -159 200 418 5 -74 495 24 -38 195 519
1663 519 206 82 174 241 -132 -163 123 -36 -253 -18 121 -259 -447 -96 -266 -459 -235 205 -77 -144 -156 311
1685 311 -151 -157 119 -6 -326 43 465 133 -34 125 552 -30 -200 260 466 -224 -175 91 -83 -353 -2
1706 -2 118 -263 -531 -141 45 -381 -408 172 -39 -396 -107 280 -12 -196 364 73 -290 -28 398 197 -187
1727 -187 308 702 55 -118 326 190 -296 76 353 -306 -558 -65 23 -622 -426 50 -47 -261 -253 91 -209
1748 -209 -348 -171 26 -1 51 312 272 -138 105 367 243 -3 267 399 122 161 229 -18 93 -50 289 -157
1770 -157 -436 20 -127 -557 -362 -73 -289 -322 -66 180 -4 -439 220 258 -95 22 363 88 67 348 700
$$ packed form
1619D3l7k99K64L69n32J99K72j47rJ76K48n69m4M00j52k13n3L95j61n29K18J95
1641C4l50K8J32J46n66J71L10p3k97J81N71k19k27L59K18m13p9N69m71o2K33L24
1663E19l13j24R2O7l73l1K86j59k17K35J39l80j88L51j70j93K24M40k82o7j2M67
1685C11m62oK76j25l20L69M22l32j67J59M27n82j70M60K06o90M9K66j74k70L51
1706bJ20l81k68L90J86m26k7N80k11l57K89L87k92j84N60k91l63K62M26k01l84
1727a87M95L94o47j73M44j36m86L72K77o59k52M93Q8o45J96M76r7k14QL44l00
1748b09j39J77J97k7N2K61m0m10K43K62j24k46K70J32k77L9O8k47J11j43L39m46
1770a57k79M56j47m30J95K89k16l3K56K46j84m35O59L8l53J17L41k75k1K81L52
$$ plain form
1791 700 251 -183 242 356 -43 48 275 -93 -220 -190 85 -296 -199 16 73 -591 -288 -26 -152 -255 149
1812 149 -75 -249 -249 322 107 -23 -234 339 274 -83 128 419 188 93 187 69 90 111 93 -8 -213 -206 -184 -301
1836 -301 -251 -84 -84 -253 -377 84 134 161 -55 117 -93 -214 56 -80 -3 -43 281 215 7 -129 97 91 114 204
1860 204 -65 189 -23 204 -225 -205 -121 164 -196 -314 107 -318 -376 -106 34 -46 -113 -132 104 38 -3 1 188
1883 188 53 73 91 357 119 -36 23 196 61 42 -36 -141 98 44 52 -334 173 -35 -308 -206 -183 -210 -101
1906 -101 174 -129 -173 -320 -102 -21 -76 88 -9 39 186 -201 98 235 315 125 71 122 -69 45 105 93 -23
1929 -23 -77 240 -30 -157 -253 -104 -187 -50 -109 124 -248 -48 44 -225 -75 62 210 112 113 116 8 -223 160 271
1953 271 2 103 187 258 19 -45 118 37 -121 -41 1 -347 -273 31 -321 -239 -299 159 -101 -544 106 -64 -227
$$ packed form
1791G00m49m34M25J14l99R1K27l68j27L0K75l81R7K15N7o64L03K62j26j03M04
1812A49k24j74%N71k15j30k11N73o5l57K11K91k31r5R4j18K1K1j8j01k05PK2j17
1836c01N0J67%j69j24M61N0K7k16J72k10j21K70j36P7m0L24o6k08j36K26oK3R0
1860B04k69K54k12K27m29K0Q4K85l60j18M21m25n8K70J40q0o7j9K36o6m1MJ87
1883A88j35K0J8K66k38j55N9J73j35j9p8j05K39n4Ql86N07k08k73J02K3k7J09
1906a01K75l03m4j47K18Q1n5J64r7M8J47l87K99J37Q0j90n4N1j91J14O0j2j16
1929b3n4L17k70j27r6J49q3J37n9K33l72K00R2k69J50J37J48r8JLj08k31L83J11
1953B71k69J01Q4P1k39o4J63q1j58Q0M2l48P4L04l52Q2o0M58k60m43O50j70j63
$$ plain form
1976 -227 -101 182 359 -60 204 233 109 -167 182 362 234 117 125 117 -166 70 17 40 -142 -68 -229 -321 -88
1999 -88 67 -72 -285 -76 28 -364 -311 32 82 -38 -69 129 170 -161 142 388 58 81 40 152 -41 -147
2021 -147 82 18 -114 115 110 -256 -194 115 -35 -193 -250 135 -139 -165 -87 -45 19 -28 184 77 -343 101 181 -25
2045 -25 -160 145 483 -335 113 176 148 119 -224 427 -144 -423 290 246 -221 -283 -123 141 -309 -217 256 134
2067 134 -495 75 29 -258 -167 102 3 -345 50 658 -291 -99 294 308 -255 -85 532 365 38 142 461
2088 461 -21 -472 104 89 -203 -217 163 53 -551 -197 482 18 -440 -14 60 -311 -228 379 30 -205 96
2109 96 563 157 -231 261 328 -112 -10 360 186 -241 311 79 -53 -304 431 38 -413 -203 251 -66 -284
2130 -284 -112 0 -348 -432 165 -53 -319 -252 314 -221 -444 -6 466 -172 -229 535 133 19 131 572 333
$$ packed form
1976b27J26K83J77m19K64K9j24k76L49J80j28j17Qqk83K36n3K3j82P4j61r2K33
1999h8J55j39k13K09J04l92N3L43N0j20l1J98M1l31L03K46l30K3m1J12j93j06
2021a47K29o4j32K29nl66O2L09j50j58n7L85k74k6P8M2O4m7K12j07m20M44Q0k06
2045b5j35L05L38q18M48O3k8k9l43O51n71k79P13m4m67o2J60K64m50R2M73j22
2067A34o29N70m6k87R1K69r9l48L95O08r49J92L93J4n63J70O17j67l27J04L19
2088D61m82m51N76j5k92j4L80j10o04L54O79m64m58M26P4l71Q3O07l49k35L01
2109I6M67m06l88M92O7m40J02L70j74m27N52k32j32k51P35l93m51K10M54l17k18
2130b84J72J12l48q4N97k18k66O7N66n35k23M38M72o38n7P64m02j14J12M41k39
$$ plain form
2151 333 -291 -77 577 -223 -134 310 -102 -487 -231 325 -200 -247 70 176 -361 -101 110 -177 -206 -177 346
2172 346 -72 -269 259 61 -41 188 191 138 -252 428 507 -93 -392 212 -31 -530 -142 281 -89 -340 96
2193 96 124 -265 -478 344 -72 -311 65 268 -41 -355 42 213 -129 -60 355 203 -79 207 277 -18 -325
2214 -325 332 353 -547 -144 494 -114 -489 -168 387 -288 -561 42 162 -263 -389 76 97 -343 248 378 -178
2235 -178 -44 176 10 -15 -54 360 64 -344 166 263 -204 -379 285 29 -317 -62 133 -129 -340 -50 463
2256 463 -117 -233 21 -78 -399 -140 260 -192 -50 172 -32 -459 -249 260 25 -346 167 559 85 -100
2276 -100 203 568 -189 67 296 183 -173 -97 382 -103 -306 -86 43 -314 -274 59 93 -346 -205 274 -316
2297 -316 -275 16 194 -128 -142 146 24 30 186 272 110 260 286 275 -209 -38 536 58 -210 -44 142 -46
$$ packed form
2151C33o24K14O54q00Q9M44m12l85K56N56n25m7L17J06n37K60K11k87k9K9N23
2172C46m18j97N28j98j02K29Ln3l90O80P9o00k99O04k43m99L88M23l70k51M36
2193I6K8l89k13Q22m16k39L76K03l09l14L97J71l42O9M15j52k82K86P0k95l07
2214c25O57K1r00M03O38o08l75L21N55o75k73O03J20m25j26M65K1m40N91J30n56
2235a78J34K20j66k5l9M14k96m08N10R7m67j75O64k56l46K55J95k62k11K90N13
2256D63n80j16K54r9l21K59M00m52J42K22k04m27K10N09k35l71N13L92m74j85
2276a00L03L65p57K56K29j13l56P6M79m85k03K20J29l57M0L33L4m39J41M79n90
2297c16M1K91J78l22j4K88j22OJ56Q6j62J50K6j1m84J71N74m78k68J66J86j88
$$ plain form
2319 -46 -302 113 59 -366 -214 254 -183 -338 -81 67 -288 -178 251 -81 -154 -52 392 48 -58 163 460
2340 460 61 -141 375 197 -162 143 181 -58 -173 11 59 -424 -132 -130 -109 -569 -102 86 -301 -259 58 171
2362 171 -29 -226 128 62 -192 138 333 48 -69 27 246 87 -43 105 -86 -55 59 95 -84 -190 225
2383 225 -162 -197 -63 -182 -228 -321 37 -46 -32 -72 86 75 -391 15 230 -3 -231 127 177 -119 187 406 224
2406 224 -138 -75 346 231 -15 49 106 51 102 84 111 -443 -104 -41 -128 -178 -126 0 -171 -302 77 81 -76 9 -45
2431 -45 -158 50 161 121 -34 66 279 -4 73 9 261 1 -406 34 -33 -61 26 128 13 -204 -180 -296 -138
2454 -138 -395 70 -72 -83 -183 1 243 -284 -55 44 -81 -33 117 103 19 118 349 0 22 356 76 19 -186
2477 -186 117 -48 -274 -51 14 38 -296 -186 -22 -91 -128 -322 137 -174 127 117 -41 -122 75 310 -126 200
$$ packed form
2319d6k56M15n4m25J52M68m37j55K57J48l55J10M29l32p3J02M44l44j06K21K97
2340D60l99k02N16j78l59L05L8k39j15J84M8m83K92KK1m60M67J88l87M2L17J13
2362A71k00j97L54o6k54L30J95k85j17R6K19j59j30J48j91L1J14L6j79j06M15
2383B25l87l5J34j19m6r3L58q3J4m0J58j1m66M06K15k33k28L58N0k96L06K19j82
2406B24l62O3M21j15k46O4N7n5N1j8K7n54L39O3q7n0N2J26j71j31L79Mj57Q5n4
2431d5j13K08J11m0j55J00K13k83P7o4K52k60m07M40o7k8Q7J02j15k17K4j16J58
2454a38k57M65j42j1j00J84K42n27K29R9j25M8J50j4q4R9K31l49K2L34k80n7k05
2477a86L03j65k26K23O5K4l34J10J64o9l7j94M59l11L01j0j58q1J97K35m36L26
$$ plain form
2499 200 298 67 -47 135 265 95 -24 26 3 -132 -65 140 -157 -119 -88 -66 -326 -223 -124 -100 -135 -104 -59 -218
2523 -218 -246 -27 206 186 97 -30 -20 -181 120 190 220 188 45 223 131 -146 65 -55 105 -30 -8 128 -46
2546 -46 15 31 -121 -78 -136 -223 -31 19 75 -31 -251 -11 -44 65 -152 74 117 -29 35 159 -74 57 -24 225
2570 225 29 -113 270 340 -71 -104 217 -25 -373 10 -96 -157 -156 -200 126 -35 -10 47 164 -10 48 114 -9
2593 -9 86 101 -176 -79 152 280 -130 -287 33 -52 -266 -70 16 -124 -289 40 26 -126 -320 30 -127 -236 -301
2616 -301 52 -122 -209 -304 -109 85 -248 -59 113 -9 132 180 141 96 -31 267 -12 27 97 213 7 29 -191
2639 -191 -74 -40 55 -120 -15 -4 -248 91 130 -201 -127 -3 -216 254 385 -66 -71 207 91 42 -153 332 -48
2662 -48 -61 -12 349 -98 -139 261 115 -51 -3 102 -168 -30 109 26 81 -223 -131 126 43 -1 -123 79 -210
$$ packed form
2499B00R8k31j14J82J30j70j19N0k3j35O7K05k97L8L1K2k60J03R9K4l5L1M5j59
2523b18k8K19K33k0q9j27J0j61L01P0L0l2j43J78r2k77K11j20J60j35K2J36j74
2546d6O1J6j52M3n8q7J92N0N6j06k20K40l3J09k17K26M3j46O4J24k33J31q1K49
2570B25j96j42L83P0m11l3L21k42l48L83j06o1Jm4L26j61K5N7J17j74N8O6j23
2593iR5J5k77R7K31J28m10j57L20q5k14J96Q6j40j65L29j4j52j94L50j57j09o5
2616c01L53j74q7r5J95J94l33J89J72j22J41M8l9m5j27K98k79L9P0J16k06K2k20
2639a91J17L4R5j75J05J1k44L39L9l31P4J24k13M70J31m51nK78j16m9j95M85l80
2662d8j3M9L61m47m1M00j46j66M8J05k70J38J39q3N5l04R2K57q3m4j22K02k89
$$ plain form
2685 -210 -129 -112 83 -135 -57 -34 80 -75 214 89 11 -15 336 204 -73 -14 19 -207 -30 -124 21 69 103 74
2709 74 -344 -290 -255 116 -47 -276 155 -52 -219 -278 206 -73 -119 126 148 -183 -10 141 302 -34 -95 346
2731 346 25 160 -144 373 97 232 83 -226 -383 -216 162 -292 -89 -62 104 -136 145 178 -13 -123 30
2752 30 305 -131 -182 158 139 -160 251 -122 -110 -31 58 -144 155 86 -147 -36 -42 55 -8 -163 -131 86 -177 -25
2776 -25 -93 -136 -170 -296 -82 -127 -73 85 6 216 2 -69 -2 133 183 287 412 -108 -26 -24 -79 122 -99 234 82
2801 82 -68 127 -120 196 -307 75 53 4 -129 -147 -11 -26 -87 -148 -293 -145 -81 4 -55 69 57 255 170 13
2825 13 -115 -26 335 73 140 7 -223 133 -96 -125 -164 122 -9 -92 24 -63 -355 -368 -178 -19 -246 -182 -213
2848 -213 -25 -151 -21 -124 -45 -57 47 218 79 154 -72 -6 -1 1 177 -297 53 209 -59 28 -165 -257 117
$$ packed form
2685b10Q1J7J95k18P8K3J14j55K89j25p8k6L51j32k77N9L3k26J77r4J45M8L4k9
2709G4m18N4L5L71j63k29M31k07j67n9M84k79m6K45K2l31J73J51J61l36o1M41
2731C46l21J35l04N17k76J35j49l09j57J67L78m54K03K7J66k40K81L3j91j10J53
2752C0K75m36n1L40j9k99M11l73J2P9Q9k02K99o9k33J11oR7o3j55L2K17k63J52
2776b5o8m3l4j26K14m5N4J58p9K10k14p1O7J35N0J04J25n20Q2Kn5K01k21L33j52
2801H2j50J95k47L16n03L82k2m9j33j8J36j5o1o1j45J48O4Q5n9J24j2J98q5j57
2825A3j28Q9L61k62O7j33k30L56k29k9l9K86j31q3J16q7k92j3J90J59k27O4l1
2848b13J88j26J30j03P9j2J04J71j39P5k26O6NKJ76m74L50J56k68Q7j93r2L74
$$ plain form
2871 117 -80 -253 -239 -209 -6 -96 1 -131 174 138 -260 -28 202 -60 24 -35 265 -5 200 301 111 149 -61
2894 -61 22 -68 -93 54 2 -98 -213 -95 149 -222 -40 80 -60 -83 24 -53 -61 -78 23 -188 -6 248 305 401
2918 401 85 -87 56 -97 -36 -41 290 -27 -8 182 169 -24 -78 28 8 48 -91 -23 188 -181 74 29 48 104
2942 104 -131 4 -207 -129 116 42 21 68 -23 255 -15 -73 -23 152 299 387 95 -227 -17 103 22 -201 -89
2965 -89 66 -245 -43 -132 -340 -144 -57 -169 24 73 -116 -31 18 98 278 -100 105 53 167 43 -111 53 99
2988 99 157 0 -15 -49 -62 -147 153 80 85 73 -92 -150 188 -93 -1 -185 10 9 -181 161 228 -41 38 330 56
3013 56 -151 82 231 -72 47 135 33 -47 -82 51 -11 5 151 -94 -166 -136 -334 -44 -36 -121 -146 131 73 52 194
3038 194 -35 -228 79 -75 -91 79 24 -99 77 351 198 62 -3 -32 -102 -172 314 40 -46 134 63 183 11
$$ packed form
2871A17j97j73J4L0K03r0R7j32L05l6l98K32K30k62Q4n9L00k70K05J01j90L8k10
2894f1Q3r0k5J47n2j00j15J18K44l71J82J20j40k3J07p7qj7J01k11J82K54N7R6
2918D01l16j72J43j53O1nL31l17J9J90j3j93n4J06k0M0j39O8K11l69K55m5J9N6
2942A04k35J35k11P8K45p4k1M7r1K78k70n8N0J75J47Q8k92l22K10J20q1k23J12
2965h9J55l11K02q9k08J96Q7j12J93M9j89Q5M9Q0J80l78K05n2J14j24j54J64M6
2988I9N8j57j5l4j3q5L00p3Nj2j65n8L38k81R2j84J95jj90L42O7k69P9K92k74
3013E6k07K33J49l03J19Q8j02q0l5J33o2J6J46k45p2L0j98K90Qq5k5K77n8k1J42
3038A94k29j93L07j54j6J70n5j23J76K74j53j36o5k9p0p0M86k74q6J80p1J20j72
$$ plain form
3061 11 -52 -49 107 -10 -105 -60 -214 12 74 13 -368 -156 -88 223 160 14 205 -23 -119 121 181 19 2 -135
3085 -135 -209 -8 -135 204 138 -164 -177 163 16 -172 441 -159 -294 -291 242 -142 202 -63 130 -100 -201 248
3107 248 11 157 -66 44 130 52 -47 189 70 -313 64 138 130 -219 150 -130 -375 -64 -9 -204 -49 10 -237
3130 -237 -407 -147 146 154 -40 -54 -101 -120 -13 -126 166 -58 -122 226 124 -283 -118 58 -61 58 15 229
3152 229 -237 -64 -113 122 -142 -104 235 22 -96 64 -171 -170 -29 179 -45 -61 224 50 144 -12 74 -97
3174 -97 99 202 206 -230 -84 58 129 -268 -146 207 -173 -49 -90 167 70 98 313 54 88 -57 -60 109 -105
3197 -105 153 -219 -157 -58 90 227 -126 -194 -69 171 79 -142 -66 87 160 196 64 76 -197 -180 -138 -40 51 115
3221 115 281 -76 282 49 39 41 71 -71 -322 -64 65 -163 118 100 175 -125 -222 261 92 -13 -120 19
$$ packed form
3061A1o3LJ56j17r5M5j54K26O2o1l81K12O8L11o3j46J91k28r6K40O0j62j7j37
3085a35p4K01j27L39o6l02j3L40j47j88O13o00j35LN33l84L44k65J93k30j01M49
3107B48k37J46k23J10Q6p8r9K36j19l83L77P4ql49L69k80k45L11N5j95J55N9k47
3130b37j70K60K93Qj94j4m7j9J07j13K92k24o4L48j02m07J65J76j19J19m3K14
3152B29m66J73m9K35k64L8L39k13j18J60k35JJ41K08k24j6K85j74R4j56Q6j71
3174i7J96J03Mm36J46J42P1l97J22L53l80J24m1K57r7K8K15k59L4j45lJ69k14
3197a05K58l72O2R9J48J37l53o8J25K40r2k21P6J53P3L6j32J2k73J7M2R8R1O4
3221A15J66l57L58k33j0KL0j42k51K58J29k28K81j8P5l00r7M83j69j05j07J39
$$ plain form
3243 19 -131 12 68 114 15 -75 138 -30 21 -27 138 -250 -195 198 -129 -128 29 111 0 -79 98 -157 -263 -77
3267 -77 -130 207 -124 -13 129 -64 52 19 32 -97 67 148 242 91 214 175 217 -124 52 163 -3 -34 -144
3290 -144 -129 -162 57 43 -240 201 -254 -11 -72 55 -231 183 70 123 167 176 72 159 -120 -11 -234 169 203
3313 203 194 -100 69 153 -5 -105 200 8 1 53 -124 -134 -28 106 -331 95 200 -57 -156 35 -12 102 -75
3336 -75 -10 94 -73 -149 231 91 6 -2 97 -205 157 -35 163 1 36 168 9 115 -56 -95 -134 -69 50 62
3360 62 -299 -54 -35 121 -131 72 45 220 -130 151 46 -76 -158 -15 303 -250 15 265 105 -98 -68 -34
3382 -34 26 -209 27 89 -98 40 172 -61 -279 139 115 -351 -131 -69 -106 -97 166 -110 129 -153 -95 -122 56
$$ packed form
3243A9j50J43N6M6r9r0K13j68N1m8J65l88N5L93l27JJ57Q2j11p9J77k55j06J86
3267g7n3L37l31J11J42j93J16l3J3j29J64Q1R4j51J23l9M2l41J76J11j66l1j10
3290a44J5l3K19j4k83M41m55K43o1J27k86M14j13N3M4Rj04Q7k79J09k23M03L4
3313B03rk94J69Q4j58j00L05j92pN2j77j0J06J34m37M26J05k57r9J91m7J14j77
3336g5O5J04j67p6L80j40q5qR9l02L62j92J98j62L5J32j59J06j71l9l9O5J19J2
3360F2l61K45J9J56k52K03k7J75l50K81j05j22q2J43L18n53K65K50j60k03L0L4
3382c4O0k35K36O2j87J38J32k33k18M18k4m66K20O2l7RK63k76K39k82N8k7J78
$$ [...]
8191G1
##END NTUPLES=NMR FID
##END=
