##TITLE=1H_Ad=0(bat1-aceton-ag)-lig
 CDCl3
 8 sc, 
 14.12.2022
##JCAMPDX= 6.0         $$ Bruker NMR JCAMP-DX V2.0
##DATA TYPE= NMR FID
##DATA CLASS= NTUPLES
##ORIGIN= UXNMR, Bruker Analytische Messtechnik GmbH
##OWNER= root
$$ XWIN-NMR		Version 3.5
$$ Wed Dec 14 13:57:42 2022 Russian Standard Time (UT+4h)  she@DPX200
##.OBSERVE FREQUENCY= 200.13135
##.OBSERVE NUCLEUS= ^1H
##.DELAY= (6, 6)
##.ACQUISITION MODE= SIMULTANEOUS
##.ACQUISITION SCHEME= undefined
##.AVERAGES= 8
##.DIGITISER RES= 18
##SPECTROMETER/DATA SYSTEM= spect
##.PULSE SEQUENCE= zg30
##.SOLVENT NAME= CDCl3
##.SHIFT REFERENCE= (INTERNAL, CDCl3, 0, 15.7039)
##AUDIT TRAIL= $$ (NUMBER, WHEN, WHO, WHERE, WHAT)
$$ ##TITLE= Audit trail, XWIN-NMR		Version 3.5
$$ ##JCAMPDX= 5.01
$$ ##ORIGIN= Bruker BioSpin GmbH
$$ ##OWNER= she
$$ F:/spectra/data/she/nmr/H-F/1/audita.txt
$$ ##AUDIT TRAIL=  $$ (NUMBER, WHEN, WHO, WHERE, WHAT)
(   1,<2022-12-14 13:56:22.17 +0400>,<she>,<DPX200>,
      <created by zg, POWCHK disabled, PULCHK disabled
       configuration hash MD5:
       00 E9 B6 7A A2 85 ED C7 34 08 36 98 17 FE 4E 26
       data hash MD5: 16K
       00 33 1B 03 C9 98 C5 D5 C2 E4 72 DC F5 CF D5 52>)
$$ ##END=
$$ 
$$ hash MD5
$$ F6 A2 62 42 7B F5 4C 8F 7D 50 F6 BB 15 77 15 9B
##$RELAX= 
##$RELAX= 
##$RELAX= 
##$RELAX= 
##$RELAX= 
##$RELAX= 
$$ Bruker specific parameters
$$ --------------------------
##$DU= <F:/spectra>
##$EXPNO= 1
##$NAME= <H-F>
##$PROCNO= 1
##$TYPE= <nmr>
##$USER= <she>
##$AMP= (0..31)
100 100 100 100 100 100 100 100 100 100 100 100 100 100 100 100 100 100 
100 100 100 100 100 100 100 100 100 100 100 100 100 100 
##$AQSEQ= 0
##$AQ_mod= 1
##$AUNM= <au_zg>
##$AUTOPOS= <>
##$BF1= 200.13
##$BF2= 200.13
##$BF3= 200.13
##$BF4= 200.13
##$BF5= 200.13
##$BF6= 200.13
##$BF7= 200.13
##$BF8= 200.13
##$BYTORDA= 1
##$CFDGTYP= 0
##$CFRGTYP= 5
##$CHEMSTR= <none>
##$CNST= (0..31)
1 1 145 1 1 1 1 1 1 1 1 1 1 1 1 1 1 1 1 1 1 1 1 1 1 1 1 1 1 1 1 1 
##$CPDPRG= <>
##$CPDPRG1= <>
##$CPDPRG2= <>
##$CPDPRG3= <>
##$CPDPRG4= <mlev>
##$CPDPRG5= <mlev>
##$CPDPRG6= <mlev>
##$CPDPRG7= <mlev>
##$CPDPRG8= <mlev>
##$CPDPRGB= <>
##$CPDPRGT= <>
##$D= (0..31)
0 1.2 0 0 0 0 0 0 0 0.06 0 0.03 0 0 0 0 0.0002 0 0 0 0 0 0 0 0 0 0 0 0 
0 0 0 
##$DATE= 1671011781
##$DBL= (0..7)
120 120 120 120 120 120 120 120 
##$DBP= (0..7)
150 150 150 150 150 150 150 150 
##$DBP07= 0
##$DBPNAM0= <>
##$DBPNAM1= <>
##$DBPNAM2= <>
##$DBPNAM3= <>
##$DBPNAM4= <>
##$DBPNAM5= <>
##$DBPNAM6= <>
##$DBPNAM7= <>
##$DBPOAL= (0..7)
0.5 0.5 0.5 0.5 0.5 0.5 0.5 0.5 
##$DBPOFFS= (0..7)
0 0 0 0 0 0 0 0 
##$DE= 6
##$DECBNUC= <off>
##$DECIM= 32
##$DECNUC= <off>
##$DECSTAT= 4
##$DIGMOD= 1
##$DIGTYP= 9
##$DL= (0..7)
0 120 120 120 120 120 120 120 
##$DP= (0..7)
150 150 150 150 150 150 150 150 
##$DP07= 0
##$DPNAME0= <>
##$DPNAME1= <>
##$DPNAME2= <>
##$DPNAME3= <>
##$DPNAME4= <>
##$DPNAME5= <>
##$DPNAME6= <>
##$DPNAME7= <>
##$DPOAL= (0..7)
0.5 0.5 0.5 0.5 0.5 0.5 0.5 0.5 
##$DPOFFS= (0..7)
0 0 0 0 0 0 0 0 
##$DQDMODE= 0
##$DR= 18
##$DS= 0
$$ [...]
##$SUBNAM2= <"">
##$SUBNAM3= <"">
##$SUBNAM4= <"">
##$SUBNAM5= <"">
##$SUBNAM6= <"">
##$SUBNAM7= <"">
##$SUBNAM8= <"">
##$SUBNAM9= <"">
##$SW= 18.05172834244
##$SWIBOX= (0..15)
0 0 2 0 0 0 0 0 0 0 0 0 0 0 0 0 
##$SW_h= 3612.71676300578
##$TD= 16384
##$TD0= 1
##$TE= 0
##$TE2= 300
##$TE3= 300
##$TEG= 300
##$TL= (0..7)
0 120 120 120 120 120 120 120 
##$TP= (0..7)
150 150 150 150 150 150 150 150 
##$TP07= 0
##$TPNAME0= <>
##$TPNAME1= <>
##$TPNAME2= <>
##$TPNAME3= <>
##$TPNAME4= <>
##$TPNAME5= <>
##$TPNAME6= <>
##$TPNAME7= <>
##$TPOAL= (0..7)
0.5 0.5 0.5 0.5 0.5 0.5 0.5 0.5 
##$TPOFFS= (0..7)
0 0 0 0 0 0 0 0 
##$TUNHIN= 0
##$TUNHOUT= 0
##$TUNXOUT= 0
##$USERA1= <user>
##$USERA2= <user>
##$USERA3= <user>
##$USERA4= <user>
##$USERA5= <user>
##$V9= 5
##$VALIST= <valist>
##$VCLIST= <CCCCCCCCCCCCCCC>
##$VD= 0
##$VDLIST= <DDDDDDDDDDDDDDD>
##$VPLIST= <PPPPPPPPPPPPPPP>
##$VTLIST= <TTTTTTTTTTTTTTT>
##$WBST= 1024
##$WBSW= 4
##$XGAIN= (0..3)
0 0 0 0 
##$XL= 0
##$YL= 0
##$YMAX_a= 253280
##$YMIN_a= -305103
##$ZGOPTNS= <>
##$ZL1= 120
##$ZL2= 120
##$ZL3= 120
##$ZL4= 120
##$ABSF1= 10
##$ABSF2= 0
##$ABSG= 5
##$ABSL= 3
##$ALPHA= 0
##$AQORDER= 0
##$ASSFAC= 0
##$ASSFACI= 0
##$ASSFACX= 0
##$ASSWID= 0
##$AUNMP= <proc_1d>
##$AZFE= 0.1
##$AZFW= 0.1
##$BCFW= 1
##$BC_mod= 2
##$BYTORDP= 1
##$COROFFS= 0
##$CY= 11.3945322036743
##$DATMOD= 1
##$DC= 2
##$DFILT= <>
##$DTYPP= 0
##$F1P= 2.36226072786647
##$F2P= -0.459571619588291
##$FCOR= 0.5
##$FTSIZE= 0
##$FT_mod= 4
##$GAMMA= 1
##$GB= 0.15
##$INTBC= 1
##$INTSCL= 1
##$ISEN= 128
##$LB= 0.24
##$LEV0= 0
##$LPBIN= 0
##$MAXI= 10000
##$MC2= 0
##$MEAN= 0
##$ME_mod= 0
##$MI= 1.114404
##$NCOEF= 0
##$NC_proc= 0
##$NLEV= 6
##$NOISF1= 3.799351
##$NOISF2= 2.8
##$NSP= 1
##$NTH_PI= 0
##$NZP= 0
##$OFFSET= 15.70392
##$PC= 1
##$PHC0= -19114.09
##$PHC1= 19.80072
##$PH_mod= 1
##$PKNL= yes
##$PPARMOD= 0
##$PSCAL= 0
##$PSIGN= 0
##$REVERSE= no
##$SF= 200.130013532006
##$SI= 16384
##$SIGF1= 3
##$SIGF2= 2
##$SINO= 400
##$SIOLD= 16384
##$SREGLST= <1H.CDCl3>
##$SSB= 0
##$STSI= 0
##$STSR= 0
##$SW_p= 3612.71676300578
##$SYMM= 0
##$S_DEV= 0
##$TDeff= 0
##$TDoff= 0
##$TI= <>
##$TILT= no
##$TM1= 0
##$TM2= 0
##$TOPLEV= 0
##$USERP1= <user>
##$USERP2= <user>
##$USERP3= <user>
##$USERP4= <user>
##$USERP5= <user>
##$WDW= 1
##$XDIM= 8192
##$YMAX_p= 0
##$YMIN_p= 0
$$ End of Bruker specific parameters
$$ ---------------------------------
##NTUPLES= NMR FID
##VAR_NAME=  TIME,          FID/REAL,        FID/IMAG
##SYMBOL=    X,             R,               I
##VAR_TYPE=  INDEPENDENT,   DEPENDENT,       DEPENDENT
##VAR_FORM=  AFFN,          ASDF,            ASDF
##VAR_DIM=   8192,          8192,            8192
##UNITS=     SECONDS,       ARBITRARY UNITS, ARBITRARY UNITS
##FACTOR=    0.0002768,     1,               1
##FIRST=     0,             0,               0
##LAST=      2.2672688,     0,               0
##MIN=       0,             -305103,         0
##MAX=       2.2672688,     253280,          0
$$ Real data points
##PAGE= N=1
##DATA TABLE= (X++(R..R)), XYDATA
0@%%%%%%%%%%%Qj6J6j6K4l2M0m8N6p2Q7j01J18j37J61j87K14k50K89l31L80m31
33b28M87n52O23p00P87q83R84j096J219j352J499j660J835k028K238k465K717
50A425k993L297l633M005m423M892n422O026o724P539q507R680j1132J2990j5459
65h439J8919k4154L3077n2221J65147j99243k28776M73179M3307l94698R50L78706
77B05754r7771k98286J21644K51622j68576j79747J74677J33482j96804p1694
87a25699J90466L1273j87815J6480J66086l7560j46011N7882J20984n5375j03072
98g2361N4279Q5035m0534p3899K6483O3009p941o1258j1113O0456K7547p1218
110b1515l8666Q0986M0063r4470l1972J01384J6590j02966M242R9120k3861q9298
$$ plain form
0 0 0 0 0 0 0 0 0 0 0 0 0 8 -8 8 -8 16 -16 24 -24 32 -40 47 -54 64 -73 88 -99 115 -135 154 -177 203 -228
33 -228 259 -293 330 -370 417 -466 518 -578 641 -711 788 -872 963 -1065 1173 -1292 1425
50 1425 -1568 1729 -1904 2101 -2322 2570 -2852 3174 -3550 3989 -4518 5162 -5970 7020 -8439
65 -8439 10480 -13674 19403 -32818 132329 -66914 -295690 177489 220796 -173902 -172952 205754
77 205754 107983 -190303 -68659 182963 14387 -165360 9317 142799 -54005 -125699
87 -125699 64767 96040 -91775 -75295 90791 53231 -92780 -34898 86086 30711 -72361
98 -72361 -18082 66953 26419 -47480 -20997 42012 34071 -27187 -38300 22156 49703 -21515
110 -21515 -60181 20805 60868 -33602 -65574 35810 52400 -50566 -46324 52796 28935 -60363
122f0363M5548P8846o4987o3453Q6103M6638j03621k6462J18073M762j27517J7963
134d8470J28472m1004j23074N8316J09563p1804r2511P8274P0572p9205m7050
145e7921P3385K4474o0898m431M4763q942k6999J8813J0256k2120M092K1442j3916
158A998j7539J9211J1508k0368o050J8391j882j3480J0445L751j8833R389K5999
171B2540k5684k9357M3814K9686o1844k4539P8288J4611r0159n5R5835j6589r4980
184e8433L2930Q7229m9621p3473O1975N3842p0865l1786P4243R088p3152J2607
196b5416O9221l1802o1384M9754N1576o2062l9262P1433K7030p5899j3300P5767
208C5656rp0407J0837N9055j9605m5489K2452K8736k2211j4621J7532L21r137
$$ plain form
122 -60363 -14815 64031 -956 -64409 21694 68332 -35289 -61751 56322 61084 -66433 -48470
134 -48470 80002 38998 -84076 -25760 83803 11999 -80512 -2238 68334 -10871 -57921
145 -57921 15464 39938 -20960 -25391 19372 10430 -16569 2244 12500 -9620 -5528 15914 1998
158 1998 -15541 3670 15178 -5190 -11240 7151 5269 -8211 2234 5985 -12848 -3459 22540
171 22540 -3144 -32501 11313 40999 -20845 -45384 32904 47515 -42644 -42699 53136 36547 -58433
184 -58433 -25503 61726 12105 -61368 607 54449 -16416 -48202 26041 35129 -38023 -25416
196 -25416 43805 12003 -49381 373 51949 -10113 -49375 22058 49088 -26811 -40111 35656
208 35656 35647 -34760 -23923 35132 15527 -29962 -7510 21226 -985 -15606 1926 2247 -6890
221f890Q927o0j3711R136J5357j5640j2073K1875P525k3545J324K3782j0531j8860
235a3384K0239J2271k9932m132L8198p815m6410K0446M9304l5958n0002M8744
247A569M5461o1979l7552P1387K5647p6902r316P7300o273p0428K2272O1989l4873
260H302m7224M5770L2628n2138j6215N4916R84n5016J1870N1954k4510m8174L2992
273c861L9967m0261l2686M3054K2253m2865j3241L9735M502l3112M259K4780r089
286C435j3182J2284M016j1012N486Q631j1833l841J5685j366j6303N530J3533
299A1063j0149r210J0701L270j1754J647J0593q687q019J4171M461j8599m32K2889
313A1945m142k4144R728K5371j4690k2860K0420J8716k3867j1768K5176L758k4372
$$ plain form
221 -6890 2037 1977 -11734 -2598 12759 -2881 -14954 6921 14446 -9099 -7775 16007 5476 -13384
235 -13384 6855 19126 -10806 -14938 23260 15445 -30965 -10519 38785 2827 -47175 1569
247 1569 47030 -14949 -52501 18886 44533 -32369 -41685 35615 29342 -41086 -18814 43175 8302
260 8302 -38922 6848 39476 -12662 -28877 26039 27023 -27993 -16123 35831 11321 -36853 -3861
273 -3861 36106 -4155 -36841 6213 28466 -14399 -27640 12095 16597 -16515 -12256 12524 3435
286 3435 -9747 2537 6553 -4459 1027 9658 -2175 -6016 9669 8303 -8000 -2470 11063
299 11063 914 -8296 2405 5675 -6079 -4432 6161 -2526 -10545 3626 8087 -10512 -10944 11945
313 11945 7803 -16341 -6613 18758 4068 -18792 1628 20344 -3523 -15291 9885 13643 -10729
326a0729M269K0011j2662j3888J8142O213k2223J412K3154r324k2185J5679J9601
339A7470k0858j4581K4106R560k5132l352K4910k192k3184Q525J9946j4663j4978
352a4423J9687P906k2788j208K4441o646k4435J4465K1071k0484j5598K4129R514
365A5631k5144k787K4392l115k0790Q140J5758j1279r916J2673M029j2788J127
378d069J1322o023r991R762O942j3042l831J4853m63j5144M429J4942q442j1963
392a0718J2470Q163j4550k257J5826k800j4849Q746J2552j3849q537J6554L333
405A0084j8300O26J7549n090j6543O972J4317r618j2030J1069Q078j0621n092
418h599J0988K769r936J237R055l303o483O353M111p455l25P704k759p234N339
$$ plain form
326 -10729 -6460 13551 889 -12999 5143 11356 -10867 -9455 13699 4375 -17810 -2131 17470
339 17470 -3388 -17969 6137 15697 -9435 -12787 12123 9931 -13253 -4728 15218 555 -14423
352 -14423 5264 13170 -9618 -10826 13615 6969 -17466 -3001 18070 -2414 -18012 6117 15631
365 15631 -9513 -12300 12092 8977 -11813 -3673 12085 806 -9110 3563 7592 -5196 -4069
378 -4069 7253 1230 -8761 1001 7943 -5099 -8930 5923 5460 -9684 -5255 9687 1245 -10718
392 -10718 1752 9915 -4635 -6892 8934 6134 -8715 31 12583 -1266 -9803 6751 10084
405 10084 -8216 -7590 9959 4869 -11674 -4702 9615 -3 -12033 -964 7114 -3507 -8599
418 -8599 2389 5158 -4778 -3541 5514 2211 -4272 2081 6192 -1263 -1588 6116 3357 -3877 1462
433A462M273p225k135P132k281o322M280L222o349q24P210k191p677N683P222
448E480p844m781R982L959j0514j361J1869M6j1555K474J1301n097j0330P057
462F86Q070r517o586J1076K095j2663J665J1230n549j0041Q103P667j0067m707
476h538J1442K071j0522J213J0031k574p666M455O094m780l996N479K171n792
490i12l34N081j555n325K108M584m468l908N249K194o257l97N808j473m391K972
506a024L240l693o68L940p40k700K796J101k862N30K568j260k524K035J497k681
522d45o68K005M9k391K52J916o99k256J674J931k429j240L044R97l539K86M220
539B707j366m542L131L774m607k184N429N58n564J040M886l125l894M214K455
$$ plain form
433 1462 5735 -1490 -3625 3507 1226 -5096 -816 2406 -3943 -4767 2443 252 -7425 -1742 5480
448 5480 -2364 -7145 2837 6796 -3718 -5079 6790 6836 -4719 -2245 9056 3959 -6371 686
462 686 8756 -761 -7347 3729 5824 -6839 -5174 6056 507 -9534 -1431 6236 -3831 -8538
476 -8538 2904 4975 -5547 -4334 5697 3123 -4543 -88 6006 1226 -2770 2709 4880 -912
490 -912 -1246 3835 2280 -3045 -937 3647 -821 -4729 520 2714 -3543 -3940 1868 395 -3996 -1024
506 -1024 2216 -1477 -2145 1795 1055 -1645 1151 2252 -610 -80 2488 1228 -1296 739 2236 -445
522 -445 -1113 892 941 -1450 -1198 718 19 -2237 -563 1368 -1061 -2301 743 1740 -1799 -1513 2707
539 2707 1341 -3201 -70 3704 -903 -3087 2342 2900 -2664 -1624 3262 137 -3757 457 2912
554B912m540r73M278L43l925M72M012q57l627J331L289k214k552K671K019l593
570i54j572M000K85m140Q69L563k164l292K877K151l226o35K918Rk039J143J513
587A306j024j55Q01K26m76J02J73J6k74l38K27j83o04k62N22o43r90Q96J7j141
607a804M40Q18o31n35J704Q5j317J232J364j316j29K027j91j406O96J109j271
624H75j76O95o66q45N98K90j641m8O14p68q41L73O65j28m85J8J010L96j055M55
644f64K160o09j360J819J267j941l57K181l39k141K81J979j623j597J350M17j830
661a007o54P27M47o59q98O44J062m51r88J168J214j190q4J640L91j264L95J264
679A757n98n02J93L05l70Q6k17o23L61j54j120L45M84j046p62J819nj493M76J120
$$ plain form
554 2912 -1628 -2601 1677 2020 -1905 -1433 2579 1722 -1905 -574 2715 501 -2051 620 2639 -954
570 -954 -2526 1474 1759 -2381 -1512 2051 -113 -3405 -528 1623 -1603 -2238 680 689 -1350 -207 1306
587 1306 282 127 928 1154 678 780 953 969 695 357 584 401 -203 -465 57 -586 -1576 -680 -663 -1804
607 -1804 -1364 -546 -1177 -1712 -8 77 -1240 -8 1356 40 -89 1938 1747 341 1037 2146 875
624 875 699 1394 728 -117 481 771 -870 -918 -304 -1072 -1913 -1540 -875 -1003 -1488 -1470 -460 -64 -1119 -664
644 -664 1496 887 -473 1346 2613 672 315 2496 2157 16 297 2276 653 -944 406 823 -1007
661 -1007 -1661 -934 -487 -1146 -2044 -1400 -338 -789 -1777 -609 605 -585 -669 971 1362 98 493 1757
679 1757 1159 657 850 1155 785 871 654 31 392 238 -882 -537 -53 -1099 -1861 -42 -47 -1540 -1064 56
699E6n14l20M78Q67k74j85rN81K91m04n43R37j84j047M78Q58q25j154R41N68j464
720h68J06J137o73n60K45N59k33R9j00kO71j41n34P21N44j243k66J134J15j481
740g70M98R01p85l36N59O8o22RN65j36k58J69K64L75m27o75J107J64j024J68J278
761A092l57j584J075O83j204q14J435j81j537O16P31p08r3O05K3k54K48K35J11
780A22K15n1NR67k58r53N64Q71o23q29N98m9o77m98N38o0k66m29j83L40J10j185
802a731M41J465p28j076J383J272j471m75K427K41k330J186J845j137j442J290
818A160Q01j603q65R31O51j810p31J305L66j538n08J489J55j788Q71J469q18j034
836a497J818L11j221L40J793m25j066Q53P70j148K84M74p55l55O66n05r25J65
$$ plain form
699 56 -458 -778 -300 567 293 108 99 680 971 567 24 961 777 -270 208 1066 241 -913 28 596 -868
720 -868 -762 375 -298 -858 -613 -54 -287 -188 -288 -290 381 240 -294 427 971 -272 -538 596 711 -770
740 -770 -272 629 -156 -492 67 135 -487 -478 87 -49 -307 -138 126 501 74 -601 506 670 -354 -186 1092
761 1092 735 -849 226 909 -295 -1109 326 145 -1392 -776 -45 -753 -846 -241 -218 -472 -224 11 122
780 122 337 286 291 1258 1000 47 611 1482 859 30 628 579 -98 -596 -58 -118 -384 -813 -996 -656 -546 -1731
802 -1731 -1290 175 -553 -1629 -246 1026 -445 -920 1507 1748 -582 604 2449 1312 -130 1160
818 1160 1961 358 -507 424 1075 -735 -1466 -161 205 -1333 -1841 -352 -197 -1985 -1114 355 -463 -1497
836 -1497 321 632 -589 -249 1544 1119 53 906 1676 528 812 1286 531 176 842 337 -588 -423
854d23O15n90p98N57K05p22m1Q42J34o81o2J356j29q13N29J524j083o46J343P50
874A867k034J42K259j224j986J466J324k728m23K172J1k474M83J637q69j394J327
891d44J088j505m05J728K45j441K24J776n32j603J048J380j045j162J375N32j744
908d85k65J939q76j661J305J164k018l35K166p09j472J202J511k176k33J614o3
925F08j508P15J503j134j130J204R90j699m21J466j2j862K68K137p56k319K077
942A27J947k471j279K923K22k565K90K887j321k222K241J031k338n32K598q35
958G03k344J372J553j850j251K171K12j916j38K296r05j385J276J641j648r29
974a142K235N49k358K24K733p99k566J349K364k767j304K848ll209O40K694j904
$$ plain form
854 -423 192 -398 -1196 -639 -434 -1156 -1197 -355 -221 -902 -964 392 263 -550 -21 1503 420 -226 1117 1867
874 1867 -167 -25 2234 1010 -976 490 1814 -914 -1337 835 846 -1628 -1145 492 -377 -1771 -444
891 -444 644 -861 -1266 462 707 -734 -510 1266 734 -869 179 1559 514 -648 727 1259 -485
908 -485 -750 1189 313 -1348 -43 1121 -897 -1232 934 225 -1247 -45 1466 -710 -943 671 608
925 608 -900 -185 1318 184 -946 258 1248 -451 -872 594 582 -1280 -1012 1125 369 -1950 127
942 127 2074 -397 -1676 1247 1469 -1096 -806 2081 760 -1462 779 1810 -528 -1060 1538 703
958 703 -1641 -269 1284 -566 -1817 354 566 -1350 -1488 808 -97 -1482 -206 1435 -213 -1142
974 -1142 1093 1642 -716 -492 2241 1442 -1124 225 2589 -178 -1482 1366 1363 -1846 -1206 1488 -416
991d16j956K137J038k224o87K544m60j898J072K227j320j423K012J130k146J2
1007c58K274l98j963P03K079j731j874K117P74k807j73K687j277k516J507J879
1023I23k265j422L078M03k891Q45K731j236j868K496J075k236k12K683l62k314
1039e72J198J766k021j603K004J002k606o46K710r52k537J087K216k012j597K408
1055a55J371l274M25L332r63l020K232K692k694j269K762Q86l011L17K806j198
1071A239k396J415J634k190j205K154J53k271J10K312j114j885J694J221j953
1086a082n48K685l45k185J023K381j930j526K550R82k885r0L061j137k877K283
1102C60J816l052j072L102K11l293Q63K861j375k868K272K098k505j331K938Q87
$$ plain form
991 -416 -2372 -235 803 -1421 -2108 436 -24 -1922 -850 1377 57 -1366 646 1776 -370 -358
1007 -358 1916 1518 -445 258 2337 606 -1268 849 1623 -1184 -1357 1330 53 -2463 -956 923
1023 923 -1342 -2764 314 717 -2174 -1329 1402 166 -1702 794 1869 -367 -579 2104 1742 -572
1039 -572 626 2392 371 -1232 772 1774 -832 -1478 1232 280 -2257 -1170 1046 -966 -2563 -155
1055 -155 1216 -2058 -1633 1699 736 -2284 -52 2640 -54 -1323 1439 2325 -686 -369 2437 1239
1071 1239 -1157 258 1892 -298 -1503 651 804 -1467 -1357 955 -159 -2044 -350 871 -1082
1086 -1082 -1630 1055 710 -1475 -452 1929 -1 -1527 1023 2005 -880 -970 2091 954 -1923 360
1102 360 2176 -876 -1948 1154 1365 -1928 -1065 1796 421 -2447 -175 1923 -582 -1913 1025 1912
1118A912l316n3L133o56k868J667K267k401j710K744R55l305L47K829j337k473
1134b265K273J665k356p30K656j18k337J096J758j754j015K176M55k542K24K427
1150A613j074j935J443J340k076j159K306K52k507M41K542j041k049J741K090
1165A927k469q58K847Q6l074J191K502j825j846K484J312l119o8K655p05l042
1181b002J449J937j918j788K261J087k542l98K712l16k237J061K150j730j200
1196a474K186J171k306l12K698n06k475J199K226k390j083K314K68k990P22K003
1212A251j500j614J522R84k055l86K449p69j891J410J813j501j009K266O28k089
1228d91m81K763l11k361J279J865j636j871K154Q56k852k98K929j145k578J661
$$ plain form
1118 1912 -1404 -1457 1676 1020 -1848 -181 2086 -315 -2025 719 1674 -1631 -1284 1545 208 -2265
1134 -2265 8 1673 -683 -1413 1243 1125 -1212 -116 1642 -112 -1127 1049 1504 -1038 -814 1613
1150 1613 539 -1396 47 1387 -689 -1848 458 710 -1797 -1356 1186 145 -1904 -163 1927
1165 1927 -542 -1400 1447 1533 -1541 -350 2152 327 -1519 965 2277 -842 -910 1745 1040 -2002
1181 -2002 -553 1384 -534 -2322 -61 1026 -1516 -1914 798 482 -1755 -694 1456 -274 -1474
1196 -1474 712 1883 -423 -735 1963 1457 -1018 181 2407 17 -1066 1248 1516 -1474 -752 1251
1212 1251 -249 -1863 -341 643 -1412 -1798 651 -118 -2009 -599 1214 -287 -1296 970 1598 -491
1228 -491 -972 1791 1480 -881 398 2263 627 -1244 910 1766 -1086 -1384 1545 400 -2178 -517
1244e17J781k175j400K403Q40k728K36K780p56k056J654J338j613n21J812K02
1260A280j756M90J216n18j741J334J067j533q27J814l14j966O29J765j149j473
1276a682J813O35j989R4K178m96k166J743J209j555q53J908N76k125N50J298m83
1293F55j745J169J131j549o49J541L93k043K51J779q50j223J126J277j695o64
1309a096J601O59k073K55J974q26j638J490R00j798l53J689m51j509Q98J155j004
1326a27r49J412J9j067K64J241l20j155M50J142p07q05J222K18j506N22R65k76
1344E43j310P79R83j690k63J373j54j739P95J425j196j057J631R23j619m79K020
1361I65j96j459N65J520p59j218J338L83j092m04J090M9j246L5J151r46o98P28
$$ plain form
1244 -517 1264 -911 -2311 92 932 -1796 -1560 1220 464 -1592 62 1400 -213 -734 1078 1280
1260 1280 -476 14 1230 712 -1029 305 1372 -161 -988 826 512 -1454 -825 940 -209 -1682
1276 -1682 131 766 -1223 -1129 1049 553 -1613 130 1339 -216 -1069 839 1415 -710 -160 1138 655
1293 655 -1090 79 1210 -339 -988 553 946 -1097 -846 933 83 -1140 -14 1263 -432 -1096
1309 -1096 505 1164 -909 -654 1320 494 -1144 346 1246 -552 -905 784 333 -1176 -278 877 -127
1326 -127 -1076 336 355 -712 -448 793 473 -682 -232 910 203 -602 620 838 -668 -146 819 543
1344 543 -767 12 995 -695 -958 415 261 -1478 -683 742 -454 -1511 120 1043 -576 -1055 965
1361 965 769 -690 -125 1395 636 -582 756 1139 47 -357 733 782 -464 -429 722 -224 -922 -194
1379a94L07j345K26J037j49j061P73J243j044m30J053K96j267O42J129o38q75
1396b97R76N25j065n30J447n38j139K74J231j245r13P82O25j137J9P26L18r41
1414h82Q8J101k61q77R60P93r25j39R37J60r27K56P63p03m31P86J53j158J11O28
1434D33l96p09L90L01q18l2P38j51m70P4R03l77m98P22N34p92l34J116K61r94
1454i9n8J252l92r34M65N09o57k80L57J22q35M4P52l84n16L44M21l40k42K11K47
1475a3k85J08L99p3l12M20K83m65j71N42j72j64J39j61r5m43M95M14q78j09O13
1496G2j88l59M65M10p80P0M51J61q05N43L22k70l21N77O5o38j30N93m9l84k1M28
1518B12j78n14L10O57o01l46N19K41l95k1M91j0n29J23N80m97k23K71Q2m50J71
$$ plain form
1379 -194 113 -1232 -1006 31 -118 -1179 -406 837 -207 -637 416 712 -555 87 1216 578 -297
1396 -297 679 1204 139 -391 1056 518 -621 -347 884 -361 -1274 -492 133 -1004 -985 -259 59 -882
1414 -882 -794 307 46 -831 129 922 -3 -142 795 955 28 284 1047 344 -87 699 852 -306 -195 433
1434 433 37 -672 -282 19 -799 -831 -93 -244 -714 -640 263 -114 -612 110 644 -148 -482 634 895 -99
1454 -99 -157 1095 703 -231 234 743 86 -194 163 285 -550 -506 246 -138 -654 -310 111 -229 -471 -260 -13
1475 -13 -298 -190 209 136 -176 244 527 62 -109 433 261 97 236 75 -20 -463 32 446 -432 -541 72
1496 72 -116 -475 -10 400 -380 -310 141 302 -503 40 362 92 -229 348 413 -225 -355 238 189 -195 -216 212
1518 212 34 -480 -170 487 -114 -460 59 300 -95 -116 375 365 -164 -41 539 42 -181 90 172 -278 -107
1539a07L63o71J96J11l62K03j70M5J60K9j26J12JJ84J06K20J06pJ11l03j5J00
1561B86J53J11p56L84J70n73P6L53j06q06N37J46l50l69M39J71m91J55O48k12
1581c4k04M3L94j8k28L04L69m1l29J62J78n5n62L69k70k23k1P5k01j62J54J35
1603a65m07k2K94l39K25M5L13p8k7L98r8L1R7K79j70o0K52j87L2j63j9J28k58
1626A01n88N83l17m06M16j1l75P7K93J25m75L78K46k53O7J47J80n69P52j0N3j57
1648B57O8M56q01J51J26o3k10O9n6J65m45M4K43J01n39K87r7J09p6K56N1j60l3
1671i7N5J83j28K52q5k47O0K21j8k44K99l64p9J33q2J4k2J56l0M4j96Q0k4K21
1695A02k02M32j97l17K56K71j77l85L92j65l49J81M55k60k87R0J03k46m9O06l44
$$ plain form
1539 -107 256 -415 -219 -108 -470 -267 -437 -392 -232 -203 -329 -217 -216 -32 74 294 400 393 504 201 186 286
1561 286 439 550 -206 178 348 -225 -149 204 98 -708 -171 -25 -375 -744 -305 -134 -625 -470 178 -34
1581 -34 -238 -195 199 181 -47 257 626 585 256 418 596 541 -21 348 78 -145 -166 -91 -292 -454 -300 -165
1603 -165 -572 -594 -300 -639 -414 -369 -56 -134 -161 237 139 170 267 546 376 316 568 381 413 250 231 359 101
1626 101 -487 96 -221 -627 -211 -222 -597 -520 -227 -102 -577 -199 47 -206 -139 8 188 -381 371 361 414 257
1648 257 325 781 -20 131 257 194 -16 53 -3 162 -283 -239 4 105 -434 -147 -244 -135 -211 45 96 -64 -97
1671 -97 -42 141 13 265 180 -67 -7 214 196 -48 251 -113 -192 -59 -141 -127 -149 7 -23 21 -175 -95 -119 102
1695 102 -100 332 135 -182 74 345 168 -217 175 10 -339 -158 297 37 -250 -160 -57 -303 -352 254 -90
1716i0j60K94R5K03n37M1J17J88j27J47J37M7j51J82l12k11J37kk09j5J59O8n5
1739e4j77K50k86o4K36N8j38L12j37l6j10L33L15j63m41L97R8k19j77K11r9q0
1761B9J11j43j21k13K14K01k61l13J07K1J30p3L74j66k37O00K5j63N3J23j15m8
1783A35K11M5k78p4L56m07m3j06K18k77k2K1k04K52l36K37j52J43l9o2L15j59
1805b26J12L18m7J48Ojp0J03J08j21l14L01j49l6j10O7j41m7r9q9j83L23k10K09
1829a48j55L01j17k94M31K4J15j07L2p6K26Q8j82M76j85j83q6p3m8j81M8Om7R8
1853c7j56j25p2K33j57P3L16j16k5k27M39j42j02l0j1K01rM4l30L46J68m24M79
1876C36l35k61K39p8K83m14K65K62l10j31K85j49j9p8J59K07j29k39K13n9o8j12
$$ plain form
1716 -90 -250 44 139 342 -195 -154 -37 151 24 171 308 355 204 386 74 -137 0 -2 -211 -226 -67 1 -54
1739 -54 -231 19 -267 -331 -95 -37 -175 137 0 -36 -146 187 502 339 -102 295 393 174 -3 208 109 29
1761 29 140 -3 -124 -337 -123 78 -183 -496 -389 -368 -238 -311 63 -103 -340 260 285 122 175 298 183 135
1783 135 346 391 113 39 395 -12 -55 -161 57 -220 -242 -221 -425 -173 -509 -272 -424 -281 -320 -382 -67 -226
1805 -226 -114 204 157 305 311 310 240 343 451 330 16 317 168 132 22 89 -52 -99 -198 -287 -470 -147 -357 -148
1829 -148 -303 -2 -119 -413 18 42 157 50 82 6 232 320 138 614 429 246 160 87 39 -142 -94 -88 -135 -37
1853 -37 -193 -318 -390 -157 -314 -241 75 -41 -66 -293 146 4 -98 -128 -139 62 53 97 -233 113 281 -143 336
1876 336 1 -260 -21 -99 184 -230 35 297 -13 -144 141 -8 -27 -105 54 261 132 -107 106 47 -21 -133
1898a33J71j0o0kk18J07J12J3K46n09L60l2N4j25R8K47l27J73J62j22k43J49q3
1921B8J40m8m6N9j82K34n13K49k56J20K5O7k64J77J50Q9l70K05K71l41L02K10
1943C06k40J75J05L4j80K1K27l38j59L0K83j83j24k17J67j53J75j74k49M5J92
1964b57O1j24J73k67K27J85k5J75M4k68J79N41m54J04L6M3m59J74j19J5k30O2
1986a84K28k19m7j23J18j32K4r0M3k6J02J49P4p1L87J48l10J72K57k14k67J87
2008B06J00q9j50m5q9L1j21K27l57k4K38N1n8j36K25j2k28K62L59o41J33L95O8
2031C45o2l74M46j8k82o0J64l7j82K44K3m74J11K08l7j55K57j68j15r6K51N8n56
2054e09N59K04m85L45j05J17l55L18J46p0k71K25K89n24nK72j0m51L10J00j86
$$ plain form
1898 -133 38 28 -32 -34 -252 -145 -33 -20 226 -283 77 45 99 -26 72 319 -8 165 327 205 -38 111 28
1921 28 168 120 74 133 -49 185 -328 -79 -335 -215 -190 -123 -387 -210 -60 29 -341 -136 135 -206 96 306
1943 306 66 241 346 380 200 221 448 110 -49 -19 264 81 -43 -260 -93 -246 -71 -245 -494 -449 -257
1964 -257 -196 -320 -147 -414 -187 -2 -27 148 192 -76 103 644 190 294 330 373 -86 88 -31 -16 -246 -184
1986 -184 44 -175 -222 -345 -227 -359 -335 -425 -382 -408 -306 -157 -83 -154 233 381 71 243 500 286 19 206
2008 206 306 217 67 22 -67 -36 -157 70 -287 -311 -73 -22 -80 -216 9 -3 -231 31 390 -251 -118 277 345
2031 345 283 -91 355 337 55 -5 159 122 -60 184 207 -267 -156 52 15 -140 117 -51 -166 -262 -11 47 -509
2054 -509 50 254 -231 114 9 126 -229 89 235 165 -106 119 408 -116 -121 151 141 -310 0 100 -86
2075h6P2j49M29j71l90K57p1M0K45J4k60m5J96R6l84nK87j66l20L86J37l09k49
2098d46L05J55l80L29J26Jk5M9n9p8j84J49L35r6R7n9N3j27k16K91l17j12L26
2121A17k27j76P8K15k77M4L17k34J9K13m5L1Q7j51K63k88j1K21K7r3r6K22k3l08
2145g5R3J59j00l67M65J12n02j60K1L74n38J76L38l29J71O4K73m01j0M92R1l77
2167c0J74J98k26j51L55j20k40j71L52r4k64K16l9q8k40J77K13n96J38K64JoK5
2190a52L06k96j07K89K28k53k11O64n03K15Q5jj94k6J53j05p0l04Q5k30J39J46
2212a42q4l09K23J31L55m60L57o1r7p6L41J9j84L53j84j11k18K55J37j54o2L29
2234C58j78j23jJ62l66p7Q6K47j59j99L26j35N8j10J56k07K47J03J08l24n5K78
$$ plain form
2075 -86 -14 -163 266 95 -295 -38 -109 -69 176 190 -70 -115 81 177 -207 -212 75 -91 -411 -25 112 -197 -446
2098 -446 -141 14 -366 -37 89 90 65 114 55 -23 -207 -58 277 181 278 219 272 145 -71 220 -97 -209 117
2121 117 -110 -286 -208 7 -270 -226 91 -143 -124 89 44 75 162 11 274 -14 -25 196 223 130 34 256 233 -75
2145 -75 18 177 77 -290 175 287 -215 -375 -354 20 -518 -342 -4 -333 -162 -98 175 -226 -236 256 347 -30
2167 -30 144 342 116 -35 320 200 -40 -211 141 47 -217 -1 -40 -128 -368 -191 22 -574 -436 -172 -171 -177 -152
2190 -152 154 -142 -249 40 268 15 -196 468 -35 180 265 264 70 44 197 92 22 -282 -197 -427 -288 -142
2212 -142 -226 -535 -312 -181 174 -286 71 10 -87 -163 178 197 13 366 182 71 -147 108 245 91 29 358
2234 358 180 57 56 218 -148 -225 -139 108 -51 -250 76 -59 -1 -111 45 -162 85 188 296 -28 -83 195
2256A95j89rO5K04j34j85KK55r7j91K01j23r3OM76l39k22L11k05k4J37m2J10q4
2280B5P8qj22O2K34l11k82J20M33l09O3k7J56n07K16J51J16j78j16K84r9J08m3
2303D4K55l51J11K62l22m02K19M50l01j20K17n4j80J55n1j37l30N14o6j58o6K62
2325d9JJ4j07K88j97q0K32j1k7k3J96%m03J56J26j82o8K4K25n43K06n9J74J5k51
2350c43J10l5k2K71J44l30K07J49J65k05R8J05j55j47M27k34m30L56l3N6j55J46
2372A45j43J9l67L65k96l5K25m5o8j27L96j87j68J34J87K7j66K89J15l37J00J14
2394A77j14JK06L7k65n1j74L74l10l38L97n7r4J45o7J15k22L5L29r2j94L26M8
2417B12k63Q0J31J18j23kp0k4l7J27J22l85J10p1J06mj25Q1k07K74k6l40K40O6
$$ plain form
2256 195 6 -3 62 266 132 -53 -51 204 107 -84 117 -6 -99 -93 383 44 -178 133 -72 -96 41 -1 109 25
2280 25 103 95 -27 35 269 -42 -324 -204 229 -80 -17 -44 112 -395 -179 -28 88 -90 -206 78 -21 87 44
2303 44 299 -52 59 321 -1 -403 -184 266 -35 -155 62 8 -172 -17 -68 -205 -535 -21 -87 -245 -311 -49
2325 -49 -48 -34 -141 147 -50 -130 102 91 64 41 237 237 -166 -10 116 -66 -134 -110 115 -428 -222 -281 -107 -92 -343
2350 -343 -233 -268 -290 -19 125 -205 2 151 316 111 209 314 159 12 439 205 -225 131 98 154 -1 145
2372 145 2 21 -346 19 -277 -312 -87 -132 -200 -327 69 -118 -286 -152 35 62 -104 185 300 -37 63 177
2394 177 63 64 270 307 42 -9 -183 191 -119 -457 -60 -117 -211 -66 -133 -18 -240 -205 124 32 -162 164 212
2417 212 -51 29 160 278 155 153 83 59 22 149 271 -114 -4 -75 31 27 -98 -17 -224 50 24 -316 -76 -10
2441a0Q3m8j21k1J89r2J25J77k78j62M63l44j33J89q9J69n1k28J54J4j82J00J83
2464H7j20J76j55l1K27k44K5J63Q2l83J98P4k50O6R2j82L33j26o1k13k9M82k70
2487e9j36K67j87J55k86L86oj85Q7o9O5J02pj40J36j26RK95l60j09K14j01j28
2510a83J95K1k86J01J3Q1l24J56J64j5L0P7O5K33r9j18n8N7j00L5J4k18K72Jo1
2535E3j37j0J11j43J83j11j94P4n0o6J74j28M48l24O6J1J35j91r9L49j18l8K96
2558B91k85m1l0N03l93n7K19l82J74j67K5j35N5K99k25QL8o2kJ8K99j19r1j46
2582b06J40K22j53K35j43K59K8m24L29J4l88O3J14j94K33k17J49j67j40J87o4
2603a23r9K43k2K70l23N4r5J3M1m2r0R2j2Q5P6P4r3J57n5k15ON0m1o0M9K91k29
$$ plain form
2441 -10 73 25 -96 -117 72 -20 105 282 4 -158 305 -39 -172 17 -72 97 46 -182 -28 -14 -196 -96 87
2464 87 -33 143 -12 -43 184 -60 -35 128 210 -173 25 99 -151 -85 7 -175 158 32 -29 -242 -271 211 -59
2487 -59 -195 72 -115 40 -246 140 134 -51 36 -33 32 134 127 -13 123 -3 6 301 -59 -168 46 -55 -183
2510 -183 12 33 -253 -152 -139 -58 -382 -226 -62 -77 -47 30 95 328 229 111 53 110 10 45 59 -159 113 114 53
2535 53 -84 -94 17 -126 57 -54 -248 -174 -224 -290 -116 -244 204 -120 -54 -43 92 -99 -198 151 33 -5 291
2558 291 6 -35 -65 438 45 -12 207 -175 -1 -168 -143 -278 -223 76 -149 -141 -103 -165 -167 -149 150 31 -60 -206
2582 -206 -66 156 3 238 95 354 382 -42 287 301 -87 -24 90 -104 129 -88 61 -106 -246 -59 -123
2603 -123 -222 21 -1 269 -54 0 -95 -82 -41 -83 -173 -81 -93 -8 68 142 49 206 151 -64 -58 -8 -49 -109 -60 231 2
2630Bj98K96l08J48j58K23m7J92j71j05O0J03j17J27k4J9J05o4l04K64l35J76
2652a16j0M46k28l98J54J33pL8M4j22n5K71q6j90K53q6O1L1p4L09l51k66L62J6
2676A29j88n8N1J16j01j00J76j22K76j86K31j67J3qpj63M2K98m6j3k30J27J79
2699B49j65k9k27q4K38j32J8k7j08L14l39K18M3k34L21k41p6L23M3l51J98K38
2721A90k05k6j8L40k64r3OP6J99k76R9k60J33q1N6K67Jl17K2M6k0j78L78j64L94
2746C05k93K01j63kK0K23m4O6k85O3R3j75l0M9L0j43j1N7j52M3L5j15J60q9j4
2771a71l1LK74j12J41j69R4Pp5M28j93o7r7j21o9K26j29L13r5m1j07L2Rk37J12
2796g5j62J18O8J00j87L7J33R2J02l82J97P9j32J56J42q6n91N48Q2k23o9J29p1
$$ plain form
2630 2 -196 100 -208 -60 -218 5 -42 150 -21 -126 -66 37 -80 47 23 42 147 83 -221 43 -292 -116
2652 -116 -126 320 92 -306 -152 -19 -26 12 56 -66 -121 150 64 -126 127 41 102 133 59 368 17 -249 113 129
2676 129 -59 -117 -66 50 -51 -151 25 -97 179 -7 224 57 70 62 55 -108 -66 232 186 173 -57 70 249
2699 249 84 55 -172 -256 -18 -150 -132 -159 -267 47 -292 -74 -31 -265 56 -185 -261 62 105 -246 -48 190
2721 190 -15 -41 -59 281 17 -76 -70 6 205 -71 28 -232 -99 -180 -124 143 144 -173 -151 -105 -125 -303 75 -89 305
2746 305 12 213 50 48 68 291 247 313 28 91 184 9 -21 28 58 -85 -96 -39 -191 -148 -113 -228 -68 -157 -171
2771 -171 -202 -199 75 -37 104 -65 29 36 -39 389 196 129 32 -89 -158 68 -61 252 157 116 9 41 50 -187 -75
2796 -75 -237 -119 -51 49 -138 -101 32 124 226 -156 41 120 -12 144 286 200 -391 157 239 16 -53 76 5
2819Eq6L8J61l20J22J86j68J54k68J09J90k91J7J65k12J79K52K20n58J86k04Q0
2841d3J76m6%k12K5L0J66k84K31k35K16p5n0K14j37K10j47n5k0j36L3k5Q7j9J05
2866Ij65j32J07J73j30j49J03J78k04M78j98l09J17N8j88K36RJ20r3M2rk83K22
2889hm5j33L87k45L4P8l2q3j56K58j53J01j00K7k5L30k88Q4p2n7P6M0J56j4j08
2914E2l1J24o9J46j02J2j72K2l2Q4k9k40j40K24pJ10J15k64k8J71q1l0K12j25
2938g8J24o6J56n0o7P5J35Qk14K3Q4j03P2j03j00J56Km8N6N0m30L03r6J83j37
2963f5l7j42J40J16J00l7q0n5k9K98j15K01k68K5J1j39k35K56j03M4n0K12l2L8
2987E4j36j35M01l32j6K29j36O1j35k06K59K59j90J47k9j88L9K84q2k77K09J67
$$ plain form
2819 5 -81 -43 118 -202 -80 106 -62 92 -176 -67 123 -168 -151 14 -198 -19 233 453 -105 81 -123 -43
2841 -43 133 87 87 -125 -100 -70 96 -188 43 -192 24 -51 -101 113 -24 186 39 -16 -36 -172 -139 -164 -77 -96 9
2866 9 -156 -288 -181 -8 -138 -287 -184 -6 -210 268 70 -239 -122 -64 -252 -16 -7 113 20 62 53 -230 -8
2889 -8 -53 -186 201 -44 -10 68 36 -47 -203 55 -98 3 -97 -70 -95 235 -53 31 -41 -98 -22 18 174 160 52
2914 52 21 145 76 222 120 132 -40 -18 -50 34 5 -235 -375 -151 -158 -48 67 -197 -225 -54 -135 -165 47 -78
2938 -78 46 -20 136 86 19 94 229 237 23 46 130 27 99 -4 -104 52 54 6 62 112 -318 -15 -111 72 -65
2963 -65 -102 -244 -104 12 112 75 -5 -60 -89 209 94 295 27 52 63 -76 -311 -55 -158 -114 -164 48 16 54
2987 54 -82 -217 184 -148 -164 65 -71 -10 -145 -351 -92 167 -23 124 95 -93 -54 230 148 -129 80 247
3009B47M5n09K14N2j73N5nK52k08ON8j11o7K85k4k96K40k6nk30J58J02j00p7J31
3034A4M4k46J53p1Q0R7k32kK67j1Pj46j62K69L11k34k02J00Lj22M2k4k0J59P0
3059A44O7j94l2j57N4N4j8j06M9J03J47o1j42Q6k07K31L91m42k0j52K69N6L6L
3083A59J59k44Q3j65j12M29k70j1o6k34K01j53J91p8M7L26k81M6l03K42K51j96
3105B1J49o3l8l18K77j49J25J06K33k71R1l2k79l06M81k8m1j15R1L3q8j10K01
3128c0j41l8L61j58l0K02k78J64L0J76k51J77oRj1j80K27m31K82M7k26L33l47
3151a19J29j5k05pJ51N9j5RJ84j27K8J29j25j07k42N31k49m5J01R3J09k60k3J4
3175bL35m19L13k25M6K6k44J89L8j28M9q0L8k3KJ08l39M63j86n0J34J44k59mJ3
$$ plain form
3009 247 292 -217 -3 49 -124 -69 -74 178 -30 -24 34 -77 -144 141 117 -179 61 35 30 -200 -42 60 -40 -117 14
3034 14 58 -188 -35 -106 -26 71 -161 -163 104 93 100 -46 -208 61 372 138 -64 36 39 -83 -41 -65 -85 74 144
3059 144 211 17 -15 -172 -118 -64 -82 -188 -139 -36 111 50 -92 -6 -213 18 409 -33 -53 -205 64 120 156 159
3083 159 318 74 157 -8 -120 309 39 28 -38 -272 -71 -224 -33 -111 -64 262 -19 27 -276 -34 217 21
3105 21 170 107 69 -249 28 -121 4 110 343 72 163 131 -148 -454 27 -1 -42 -157 -66 -33 -121 -231 -30
3128 -30 -171 -209 152 -6 -36 166 -112 52 82 258 7 184 178 187 176 -4 223 -208 74 121 -105 228 -119
3151 -119 10 -5 -210 -217 -66 -7 -22 -13 171 44 72 201 76 -31 -273 258 9 -36 65 158 267 7 -16 -2
3175 -2 333 -86 227 2 48 74 -170 19 57 -71 -22 -102 -64 -87 -85 23 -316 147 -39 -89 45 189 -70 -74 -61
3200f1L4R5k07N0j39L64j54J20J5k35rJ62j11M3j05q6L1L2M20m7k48j36K32N3
3224A13k73J21r6L19p4k23O8j06J85k99M23l26K00P0O7k93Q0J63j78J20R0j2p5
3247F4L6k79L97j90j37l4k2J87j22P0n2K37k82J75k57Q5J62j84J27K09j54J03
3269A39k15J26Q9j18J11j31N4R0J0l10J2J37o5n3K87j19j71P0j51J70q7J75L61
3292D11o97J01J33J32L1o1p3k0J87j03j7M9O9J5P4k37j45J10n1J61n0K0J11j82
3316c2k10JJ31M5Q7j54N2o7QK03j00l5O5N6P4QLK7o0m2q8L03o7k26K7k00K40p2
3344b3qq8Q3j16Q8J84J27m22P0L8K15L0J8k13Lj63J9K28J38m1j87P8o5j6j05J54
3370B6L6k71J67j01J76O5k12M9J57J73m48L1K54j00r0K25k18O0J34J5N2j68K67
$$ plain form
3200 -61 -27 68 -139 -89 -228 136 -18 102 117 -118 -127 35 -76 -33 -138 -224 -193 -161 259 212 -36 -172 60 113
3224 113 -160 -39 -135 184 110 -113 -45 -151 34 -265 158 -168 32 102 169 -124 -44 119 -59 61 151 139 64
3247 64 100 -179 218 28 -109 -143 -165 22 -100 -30 -82 155 -127 48 -209 -124 38 -146 -19 190 36 139
3269 139 -76 50 139 21 132 1 55 145 155 -155 -143 -6 -71 -124 163 44 -127 -57 -208 -38 -125 50 411
3292 411 -286 -185 -52 80 111 50 -23 -43 144 41 24 73 142 157 231 -6 -151 -41 -92 69 19 39 150 -32
3316 -32 -242 -241 -110 -65 22 -132 -80 -147 -139 64 -36 -71 -6 50 124 132 135 162 102 60 -28 275 208 -18 9 -191 49 -23
3344 -23 -31 -119 -36 -152 -64 120 247 -175 -105 -67 148 178 196 -17 -14 -177 -158 70 208 167 -20 58 -7 -23 -128 26
3370 26 62 -209 -42 -143 33 98 -114 -65 92 265 -183 -152 102 2 -88 137 -81 -21 113 128 180 12 279
3393B79pm73M1L10j91q6M2J20L6m6n7j00R5J78j77J15R1k29J99m8k01K13o0M5
3417H9r1P0o8k41J95J96q7j6O1j04K9k99J07j86L50O0k01K84j30j88K80j35J44
3440A19j93J90j50j74L16j65rK9m5r5L7J54q4K9N5L5k21K13L2k7K2mL7J01l83
3465a81K0J62J34k42L62l12J06rj31K51k34J9k24K83l5J30o2k21J35K61l48j7
3487a53K63j26rn3J07j64j61L70M2J78l87J94j58K28o9J24k89J35J06k58Q1k31
3509b30K37K9j00j0L85m88K69k72J51k38L06l6L1j30OK13j72J33R3r0j80j9J39
3532B7n8R5k66P6P9k87M02j64lK21k73J21J03j53O8q4J32ON3k21K01J31j29J49
3556B26j95m8N7j17O0J10Q1j32J39k24J24j82K90k04N9q3k06K73j6J79M1j88k41
$$ plain form
3393 279 272 -201 -160 150 -41 -127 -85 35 71 25 -32 -132 -37 141 -36 79 170 -59 140 92 -109 104 44 89
3417 89 -2 68 0 -241 -46 150 63 47 108 4 33 -266 -159 -345 5 65 -136 148 18 -170 110 -25 119
3440 119 -74 116 -34 -208 108 -57 -66 -37 -82 -177 -140 14 -70 -41 14 49 -172 41 73 46 68 64 101 202 -181
3465 -181 -161 1 135 -107 255 -57 49 40 -91 160 -74 -55 -279 4 -31 99 37 -184 -49 212 -136 -153
3487 -153 110 -16 -25 -78 29 -135 -296 74 116 294 -93 101 -57 171 102 226 -63 72 178 -80 1 -230
3509 -230 7 36 -64 -74 311 -177 92 -180 -29 -267 39 3 34 -96 -90 123 -49 84 177 87 -93 -112 27
3532 27 -31 64 -202 -126 -47 -334 68 -96 -99 122 -151 -30 73 -80 -12 -96 36 42 95 -126 75 206 77 226
3556 226 31 -17 40 -77 -17 93 174 42 181 -43 81 -101 189 -15 44 -39 -245 28 12 191 232 44 -197
3579a97K33J59m14K15r3K34j74n2K28k90J19k92K55j03J00J0L26l57R6r6k3J45
3601B9R8l56M79j75J59j89NJ54k70M5OO4J5J07j94L2J91m6k21m8L4N00m01K8l5
3626A1P4p7k53J30J32j46K11p2K27l69L04n3j61J71K88k33Kl02N60m59j85K94
3648I4j89K37j54J32j59O7J9o0j68K88m3j31R6Q7k52K43j9n2p5m0rK29q7j22q
3673g6j34L12j66PJ03k51N4L6K07rp4P3k74J84J58j01j74J01p2K73k02K00l18
3696a43K71j8k35q8L26j82L3m1%mk15J60J25j77J05J43l3M2k29K69k44J10J42
3719A17J35N6k84L1j40K07q9J13l35K98k93K3L62k33mj94J50k30J69J05N9j86
3741a63K24j00j33N4J06K1j87M04j62J35k36l8o6K47j77M78n46J45L0l7o7K17
$$ plain form
3579 -197 36 195 -219 -4 -97 137 -37 -89 139 -151 -32 -324 -69 -172 -72 -62 264 -93 3 -93 -116 29
3601 29 127 -229 250 75 234 45 50 204 -66 -21 -15 49 64 171 -23 9 200 154 -67 -115 -81 419 18 46 11
3626 11 85 8 -245 -115 17 -129 82 10 237 -132 172 119 -42 129 417 184 186 -116 444 -15 -200 94
3648 94 -95 142 -12 120 -39 28 47 -13 -181 107 64 -67 29 116 -136 107 88 36 -39 -79 -88 141 54 -68 -76
3673 -76 -210 102 -64 -57 46 -205 -151 -115 92 83 9 82 -192 -8 150 49 -125 -24 -96 177 -25 175 -143
3696 -143 128 110 -125 -213 113 -69 -36 -77 -77 -81 -296 -136 -11 -188 -83 60 27 69 -160 109 -135 -25 117
3719 117 252 308 24 55 -85 122 33 146 -189 109 -184 -161 201 -32 -36 -230 -80 -310 -141 -36 23 -163
3741 -163 61 -39 -172 -118 -12 9 -178 226 64 199 -37 -75 -141 106 -71 407 -139 6 36 -1 -68 149
3763A49j07p3l9J25j8N4k83mJ88J0j74n9K25j82K81J05j53m1J1q2K79k52K2K27
3787B09k62J36k46K37kl60K93k2q6o7K76N8k32R6p1l9J11R6j98K9Q6q3J98j06
3811E1j82J82j15K4k4J92k35LK08j66J3j07J51O2l5J56k87J88j77J25M8k21pJ73
3835B0k89OJ88K70j22r3M9k05J81o6M5K45j19J6l2n5N1j4J43k68J93k08J57k1
3859G2l9J39q4k51K21j9PJ14j41J04k0k25l4J43j22J08k0k55N91k45j31J27q6
3882d6J11J84l04LJ33l8J98p7l42M34p8j5j18K20j51j83r4L05j91M0J81j20Lr8
3906d3O1K02l76j38M78k24K74j40j54R7j01M6J93k14R8O1j25R8J00k25m9J8K18
3929A55k80L0J54L20n79J11J2P6Q2l03N2L40J2j21j34K51j00l4l1QPj59J34Lr
$$ plain form
3763 149 42 -31 -70 55 37 91 -192 -196 -8 2 -172 -231 -6 -188 93 198 45 4 15 -67 212 -40 -18 209
3787 209 -53 83 -163 74 72 -288 5 -17 -103 -170 106 164 -68 28 -43 -82 29 125 -73 -44 42 -41 157 51
3811 51 -131 51 -64 -40 -64 128 -107 -104 104 -62 -49 -156 -5 57 22 178 -109 79 -98 27 75 -146 -153 20
3835 20 -269 -263 -75 195 73 -20 29 -176 5 -61 -16 229 110 126 94 39 90 76 219 -49 144 -64 93 72
3859 72 33 172 88 -163 58 39 46 160 19 123 103 -122 -156 -13 -135 -27 -47 -302 289 44 -87 40 -46
3882 -46 65 249 -55 -52 81 43 241 164 -178 256 178 163 45 265 114 -69 -163 142 -49 -9 172 52 55 -43
3906 -43 18 220 -156 -294 184 -40 234 94 -60 37 -64 -18 175 -39 59 120 -5 93 193 -32 -81 -63 155
3929 155 -125 -95 59 379 -200 -89 -77 -1 81 -222 -170 170 182 61 -73 178 78 44 13 21 28 -131 3 6 -3
3954cq7kJ23K8N5j56O2Kk18K33k16jJ17O5j35J15j03O3J3R2k05R8J52j80j40L18
3980I0J66l69N6J5j35L42k0k01o4J19J80l0k29J33m1J03q6RQj08J36p2km7r9N
4006a41R1Q7K2k88K18J44p7N5k09J01o0J0J0l4M0M2J41k87L88j65j24j24j30J67
4030a23K74k68r1J67R6j05P4j88l7L69m54J48K76o4k67K71j43J45J3k1Q1%l07
4053a54L23k40K83j47k91L55k20J74q0R7j37qJ09j19K1K03Ok22M8J87k25J72P6
4076B11l7r3j24J80o6J65l30m3J66J05K1o8kR2k81Q6L04l57M7q3J10P1j48J36
4100F2k92L84l2K5k47J19p6L01k72L6J85j44K29l04K1J5J76j16j89K69j36m2J08
4123H0k81L6J29q4N5M8n2lJ15l6l1LK06j3k30J32L7l65J68J76j50J74k05QR5l14
$$ plain form
3954 -3 -90 -92 31 59 114 -42 20 22 -196 37 -179 -180 -63 2 -133 -18 -121 -58 -45 47 -158 -60 92 -88 -228 90
3980 90 256 -113 -57 -42 -177 165 145 -56 -120 -1 179 149 -80 53 12 115 29 38 46 -62 74 2 0 -47 -146 -141
4006 -141 -50 37 59 -229 -11 133 56 111 -98 3 -57 -47 -37 -71 -31 11 152 -135 253 88 -36 -160 -290 -123
4030 -123 151 -117 -208 -41 55 -50 24 -164 -201 168 -286 -138 138 74 -193 78 -65 80 93 72 153 153 -154
4053 -154 169 -71 212 65 -226 129 -91 83 3 100 -37 -45 64 -55 -34 169 175 -47 1 188 -37 135 211
4076 211 174 81 -43 137 71 236 -94 -137 29 134 155 87 85 177 -104 -18 286 -71 -24 -107 3 74 -74 62
4100 62 -230 154 122 147 -100 19 -57 244 -28 8 193 49 278 -26 -5 10 186 70 -119 150 14 -28 80
4123 80 -201 -165 -36 -120 -65 -17 -69 -72 43 7 -24 -21 185 172 -58 74 111 -254 -86 90 -60 114 -91 -83 12 -302
4149c02J22J54m6L0J90j45j72K70n2qp2n0J29k46L16J5j43J12PQ5k61lJ28p0L6
4174B4j47M4R4J9j6K21l04K21j50k4k88P8K04J88j33n4J1Q8j43R0M9J10k38Q1
4198B5k23J41P1l35M65q7P1m4j26j49J04k34K87O8Q5k06m1R0L14o8j11k1k30K38
4222H4j75L03q9N0j98L1KJ58l19N0J41J14l99J35J67Mk73J18J48k95K83Q6O7j33
4246F0l0j0m1o0q6j6K56k68L97l81J3J06l2jJ78k15K16nJ08k90J07n2M8J05P3
4271A80j86j5J03j94K89j54L00l68J25k32K46j08R8j0j67K25j79J81j02q4j10
4292a62j2j13L40P3n2q2O3J44l30J05m6K91l55J55J46m3J9k36j20K06m4j56K56
4315D7p1k47K33l8k7K34k73J10r9L00o9L9j13j60L3K78L7q9R5k27Q7J90k07J59
$$ plain form
4149 -302 -180 -26 -72 -42 148 3 -169 101 49 41 -31 -81 48 -198 118 133 -10 102 109 194 -67 -70 58 -12 24
4174 24 -123 -79 15 34 18 239 -65 156 6 -18 -306 -228 -24 164 31 -23 -12 76 -67 23 72 182 -56 25
4198 25 -198 -57 14 -321 144 57 128 84 -42 -191 -87 -321 -34 34 119 -87 -128 -38 276 208 97 76 -154 84
4222 84 -91 212 123 173 -25 6 8 166 -153 -103 38 152 -247 -112 55 59 -214 -96 52 -243 40 126 193 60
4246 60 30 20 -21 -81 -167 -183 73 -195 202 -179 -166 -60 -92 -93 85 -130 86 81 189 -101 6 -46 2 107 180
4271 180 -6 -21 82 -112 177 23 323 -45 80 -152 94 -14 84 74 -93 132 -47 134 32 -52 -162
4292 -162 -174 -287 53 126 74 -8 55 199 -131 -26 -72 219 -136 19 165 122 141 -95 -215 -9 -53 -209 47
4315 47 -24 -271 -38 -76 -103 131 -142 -32 -131 169 100 139 26 -134 -101 177 214 125 220 -7 80 270 63 222
4339B22j24k38J90P5l85K93Q9l26k4J23P1K01k07M0k99K08L66k28oj5%m5J13J96
4363B90j64r3j28K0J11k08J35J68o5k04P5J34P2m2j0k84K57k30K38k0J58j56L7
4386I1O6k54jJ78j34r8K59k59j95K11J95r9L35j98j67o6J51mN5k10J87r4J10p5
4410a6p3J58j03lO8m6l2j30pJ6K15j00R3%j83J01%k46q1N08J94l71J59k44R0N1
4436A8l4N4M5L2k7o5J31J8K6j71J88k61J43j95L5k17L01q7j9K14j29p3j66J06
4460a33J73L1r9L01k39p5j13J92j14L1j59M94k72j18J85j54J76l9l80J26J32O0
4482FJ20j86k70K03K01K4j20o2O2N7J54k94Q0n5J76j33L1L7o8j12L19n3m21N23
4506B19o8n17J79J36M4r5k0J10p9L05k53K82j77k89J57R7j14J03j97J19j12O1
$$ plain form
4339 222 98 -140 50 125 -260 33 122 -204 -228 -105 -34 167 -40 0 -299 -91 275 47 41 26 26 -19 94 290
4363 290 126 33 -95 -75 36 -172 -37 131 66 -138 -63 71 143 101 91 -193 64 -166 72 52 210 54 91
4386 91 157 -97 -98 80 -54 -152 107 -152 -347 -136 59 -40 295 97 -70 -136 15 11 66 -144 43 -51 59 -16
4410 -16 -89 69 -34 -37 31 -15 -47 -177 -184 -168 47 -53 40 40 -143 -42 -42 -288 -369 139 333 -38 121 -123 -33 18
4436 18 -16 38 83 115 88 23 154 172 198 27 215 -46 97 -98 -63 -280 21 -66 -85 129 0 -73 -239 -133
4460 -133 40 71 -28 273 34 -41 -154 38 -76 -45 -204 290 18 -100 85 -69 107 68 -312 -186 -54 6
4482 6 126 -60 -330 -127 74 98 -22 -84 -22 35 189 -105 -25 -80 96 -37 -6 31 -37 -149 170 117 -304 219
4506 219 151 -366 -187 -51 -7 -102 -122 -12 -91 214 -39 243 66 -223 -66 31 -83 20 -177 -58 -170 -109
4528a09N6p4K2N7L2k32K79j04P8l5R9o1l9j52N8K09R5j77J01m9L1J1j14K03j19
4553F6j06K36l22J54p0M17k29j03N6k41kP3L4K22k59j2J26Nmp5J36O6j08k20R6
4578f4J67q6j40L32l13k4L07j21j95l0j95J36K35r6n6kQ3K06r2J93l92K61j2J70
4602B72j67j19N9r1R9K8L4M5j56K06l86K26J05r3m8n0O4j81JJ91M8k77P7N2J46
4627H5J16k24J08k39J24J25J02j57J72J7k79J51M7k29K11k19OM1J13j24k16M14
4649A45J8j15J0J22m68J20N05j86k06lL96o3k20k19L28j50k8j85K16l9J64l35
4671a93L05j54jm6l7L87l92L7K30N2l69L22m08K71L5j91O2K1K14k09K43r5k56
4694a72K60j71J49j18J3Q3M7o5N6k37K36R8L2o8j66K78k85o0r9N1J91q8J12l2
$$ plain form
4528 -109 -53 -127 -105 -48 -16 -248 31 -73 5 -30 69 8 -31 -183 -125 84 179 2 103 54 85 96 -18 185 66
4553 66 -40 196 -126 28 -42 375 146 43 99 -142 -144 -71 -37 185 -74 -86 40 45 41 -34 102 168 60 -160 -64
4578 -64 103 17 -123 209 -104 -128 179 58 -137 -167 -362 -226 9 -87 -143 -145 -62 144 52 245 -147 114 102 272
4602 272 105 -14 45 -46 53 81 115 160 4 210 -176 50 155 62 14 -36 28 -153 -152 39 87 -190 -113 -61 85
4627 85 201 -23 85 -154 -30 95 197 40 212 229 -50 101 148 -81 130 -89 -83 -42 71 -53 -269 145
4649 145 163 48 58 180 -288 -168 337 151 -55 -58 338 275 55 -164 164 14 -14 -199 17 -22 142 -193
4671 -193 112 -42 -43 -89 -126 261 -131 -94 136 188 -181 141 -267 4 39 -152 -90 -69 145 -64 179 84 -172
4694 -172 88 -83 66 -52 -39 44 91 26 82 -155 81 179 211 143 -23 255 -30 -90 -189 -138 53 -35 77 45
4718D5Or4J8J38Rk74L39rj20k9k37M88j77j99J78q7K15k60M0L46k64on0P4l19
4743b29P9K16m8L9j85m4J52K08r0k88J40L86l44k1M6J14m8N2k4n3l03J30K98k34
4767e1R8Q8k92J18k2o7K9L34l70K57m8q8k47L79j02j31O1j73L26l40L54r6j21
4790a04P0J47j54j84J91J06o8J58j88K2N6l0j6k3o5o2L61j96k30K04k49K29k1
4813d6LK26J8k56k2J42N9j96L15k18j43q0L80j01J2p6m6M3j52K59m03K49j44k1
4837a98K17k99PL14j0p7K44j23j6r0L18m41J34L2rl6j11J55K66j25j85N4k91M60
4861A90r2J30k09Q2j86r3M0o1M6%j31K47l2j39L22o1p2R4j95K62j15j84L06Q0
4885B29k70K42k80J07K31k14j34J63l8p0J4j21J28N6o9kJ94k64J9Lj48K41j15
$$ plain form
4718 45 51 -43 -25 113 122 -152 187 178 58 29 -208 280 103 -96 82 -5 210 -50 -10 336 72 66 16 90 -229
4743 -229 -150 66 18 57 -128 -172 -20 188 98 -190 -50 336 -8 -29 17 131 83 135 111 58 -245 -115 183 -51
4767 -51 47 135 -157 -39 -61 -128 -99 235 -135 122 74 -14 -261 118 16 -115 -54 -227 99 -241 113 17 -104
4790 -104 -34 113 -41 -225 -34 72 4 162 -26 -4 52 22 6 -17 -82 -144 217 21 -209 -5 -254 -25 -46
4813 -46 -43 183 201 -55 -77 65 124 -72 243 25 -118 -198 182 81 93 17 -29 14 -138 121 -282 -33 -177 -198
4837 -198 19 -280 -273 41 31 -46 198 75 59 -31 287 -154 -20 12 3 -33 -144 11 277 152 -33 21 -270 190
4861 190 98 228 19 101 -85 -178 -138 -199 -153 -153 -284 -37 -69 -208 114 53 -19 75 -120 142 27 -157 149 229
4885 229 -41 201 -79 28 259 45 -89 74 36 -34 -20 -141 -13 43 -26 -28 166 -98 -79 -76 -224 17 -98
4908i8J21K11l46j4L41k0l63J4m5L16k06o5Q4L0r5J92j5J26k79J68K9j23k25J47
4932a15K99l80J13J35N4k44L9J39r1J52J1k09R8p9K27k74M6L5r7l2J86J05j06
4955A2M7k9o3p1K07q7L31m64P2J40j14K90k32k90J90JM8j91k0L48k12J50n6j52
4979a45R9j18L27Ml78N19l18p1K1K35k53K7N3J79j93R9J54l24J5j7K7m9j70M25
5003A48N8k41J85k56p8N91m85J77o7J90k9j4j81J36k8R5l35K61j03k9R6J09Q1
5026B81l82K43o2q4j90J79P6j11J39r5m04O19l30l5L2J30J24m2j23R1k18J25O
5049c1J98m9j26q1K72k51L44m03k78M11k15J16J37P7j09j98K95j70j54M2Q7J21
5071C5r0m6%J58j89M25j9k46J46k39l4j24J39M17l88p7j35K15J38lj9j72J2k19
$$ plain form
4908 -98 23 234 -112 -126 215 195 -168 -154 -199 117 -89 -154 -70 -40 -135 57 42 168 -111 57 86 -37 -262 -115
4932 -115 184 -196 -83 52 106 -138 -99 40 -51 101 112 -97 1 -78 149 -125 -79 -44 -141 -173 13 118 12
4955 12 59 30 -33 -104 103 16 347 -117 -45 95 -19 271 39 -251 -61 -60 -12 -203 -223 125 -87 63 7 -145
4979 -145 -46 -164 163 167 -211 308 -10 -81 -60 175 -78 -51 2 181 -12 87 241 -83 -68 -85 -58 -107 -277 148
5003 148 206 -35 150 -106 -184 407 -78 99 32 222 193 179 -2 134 106 201 -134 127 24 -5 91 200 281
5026 281 -101 142 80 -4 -194 -15 61 -50 89 -6 -410 209 -121 -156 -124 6 130 88 -35 56 -162 -37 -31
5049 -31 167 118 -8 -89 183 -68 276 -127 -405 6 -209 -93 44 121 12 -186 109 -61 -215 -173 -86 35
5071 35 -55 -101 -101 57 -132 293 274 28 174 -65 -99 -223 -84 333 -55 -132 -267 -52 86 83 64 -108 -96 -315
5095c15M21j35l6N3K6j67p8J7O5K93j50p9J29k14K12K03m51K26J72r1m14n4K44
5118a23Q6J69k73R6K5J32j72K62k10M8J32j54Rl5m8P2J83k5k14J16N1j62J15j02
5142b2k36J34J76P5r5R0q5l3k24P6J35j7L33k19l1J19Q0k14k4N3j2k13J20O1M4
5167G1J55l99L40k43Q6J56k73J23J83k89J10O2N3j06Q1J18l49R7J48l6P7j80o7
5190h2J52j50R8j18o2K3R3o6oJ88j81J13n6n7K0J76l21J75j3R4l1k18J36J12M9
5215F8lL0o1k29J58J05l9j43K22j77J25J0J76n51J50J95oNO5j42k46J14j01M78
5239B03r6k77K14l09K45r9J50NJ45j7n7Q9j80j05J4j10J51j14p4J31J3j53K27
5262dq0J34q1J2O4j24J88j78j75N47k31j00J95k30O9r2K4J73J17k98M4k56M41
$$ plain form
5095 -315 106 -29 -65 -12 14 -153 -231 -214 -149 144 -6 -85 44 -170 42 245 -206 20 192 101 -313 -367 -123
5118 -123 -37 132 -141 -45 -20 112 -60 202 -8 40 172 18 27 -8 -56 16 199 174 -40 76 127 -35 80 -22
5142 -22 -258 -124 52 127 32 122 37 4 -220 -144 -9 -26 307 88 57 176 256 42 18 71 59 -154 -34 27 71
5167 71 226 -173 167 -76 10 166 -107 16 199 -90 20 82 135 29 110 228 -121 -24 124 88 165 -15 -82
5190 -82 70 -80 18 -100 -162 -139 -46 -112 -118 70 -111 2 -54 -111 -91 85 -236 -61 -74 20 -11 -229 -93 19 68
5215 68 65 95 34 -195 -37 68 29 -114 108 -69 56 66 242 -309 -159 36 30 35 100 -42 -288 -174 -275 203
5239 203 107 -170 44 -265 -20 -119 31 36 181 164 107 196 16 -89 -75 -185 -34 -148 -222 -91 -78 -231 -4
5262 -4 -84 50 -31 -19 45 -79 109 -69 -244 303 72 -28 167 -63 6 -86 -62 111 228 -70 -26 -282 159
5285A59l28J15J91l20L18j11j66L73l68M01l44R8K58m84N8J31L8l0j43L16j8r4
5307E0q5jL3J3r2K53k87R5j61L01n2k41J26M9L1j02k9K8Q2m8K9np0K37o3R4j32
5334E3q2L4p2J78j00J07k71K9J15l70L29j3M3N5k5J27o9k96L02k8J76k11m3J9
5358a3K49k02j69J61qjp3K28l82O9J47R5l13M18k36j4J36k68J86L1j19K1J6J8
5382b3k07P1L22p7l3m0Oj0p0K7m3L93n10K0J43O8L7k15J59r0q7J86K78k36j41
5407g2j99N44j27j33MR2j32J59k24P5N3j21k9K55k25K84k00j89L0J35K7j28K98
5430A77l52J93J0K16k78k41L51j39J70Lk04J59J78n29L18J04k12P9J1j21K1J39
5452E3n8M9K2j35q0P5K52k47j0m6K10m8J16k71K18Q4k63N02l32k18K31r0L7j15
$$ plain form
5285 159 -169 -54 137 -183 135 24 -142 231 -137 264 -80 18 276 -208 -150 -19 19 -11 -154 162 144 50
5307 50 -35 -36 -3 10 -82 171 -116 -21 -182 119 67 -174 -48 1 32 -70 -99 -71 11 -37 -8 -13 -83 154 91 185 53
5334 53 -29 5 -67 111 11 118 -153 -124 -9 -379 -50 -63 -20 35 10 137 68 -228 74 46 222 11 -32 -13
5358 -13 236 34 -135 26 18 17 -56 172 -210 -141 6 101 -212 206 -30 -44 92 -176 10 41 -78 -57 -41 -23
5382 -23 -230 -159 163 86 53 13 19 9 -61 -34 -77 316 -194 -174 -31 37 74 -141 18 -72 -159 27 305 69 -72
5407 -72 -271 273 146 13 17 109 -23 136 -88 -13 40 -81 -110 145 -80 204 4 -185 -155 -20 7 -121 177
5430 177 -175 18 28 244 -34 -275 76 -63 107 110 -94 65 243 -286 32 136 -76 3 14 -107 -86 53
5452 53 -5 44 66 -69 -149 -74 178 -69 -79 -125 85 37 153 -118 100 184 -79 423 91 -127 104 14 51 -64
5476f4K06j69J51lm3r1J35k81J27J3n1j63K63k89M50J03j24Q1n8j58k66M53j20
5499A02j13k28J99l3K73l11J70Ok60J9J90j09PK3L7k74J98Q9J67l71K00k2J18
5522G7k4N5l39J88J87J24k13l5k27J83J21M7L8k21J37k28J26K63n30M44m3k50
5544a20j05k1M04k79P6L0J5%L51m06n7K73j38j92K24j36MK1J44R6n2o5j25J21
5568F3rj15L7KJ47Nj52J32j49K3N9mP3o7K24k22P0l1k62K2J1L50l14j5l7J96m9
5595a2k78K43L2J9J11j65P5o9j3L7Q5N3j96K79l59J54j01O4j30R6rJK18N5r2l29
5621b31K20m0K20j77Q2ML64n40J47j51K81k10P0J04l49L32l94K82J06j60j52K89
5643I7j58l8M6J73j08k3n7J95j83k2J17l2N2o4R5J05j09O6k7j73J44q5j7O2p7
$$ plain form
5476 -64 142 -27 124 121 78 -13 122 -159 -32 -19 -70 -233 30 -259 191 294 170 251 193 35 -231 222 102
5499 102 -11 -239 -40 -73 200 -111 59 65 -195 -176 14 -95 -88 -65 -28 -302 -104 -15 152 -219 -19 -41 77
5522 77 53 108 -231 -43 144 268 55 20 -207 -24 97 144 182 -39 98 -130 -4 259 -271 173 130 -120
5544 -120 -225 -246 158 -121 -45 -15 0 0 351 -55 -112 161 23 -169 55 -81 -77 -56 88 184 132 67 -58 63
5568 63 54 -61 -24 -22 125 130 -22 110 -39 -16 43 39 112 45 269 47 117 86 -176 -154 -143 207 -107 -122 -159 37 -12
5595 -12 -290 -47 -15 4 115 -50 25 -44 -57 -20 65 118 -78 201 -158 -4 -105 -41 -171 -75 -84 -83 135 190 98 -231
5621 -231 -11 -51 169 -8 74 78 442 -98 49 -102 179 -31 39 143 -206 126 -268 14 120 -40 -192 97
5643 97 -61 -99 -53 120 12 -11 -68 127 -56 -78 39 7 59 -5 90 195 86 152 125 -48 96 11 -6 56 -21
5668b1QL07l33J12j37J2k3j15K69j04j00J17J97j92J75n53L69J42k25N7l2K00
5690A30j21K16k71k12R5K47Q7q4j27q1N3j21J98r8J69L3N0m85K34J60J20Rm08
5713b07J95K2O3j31k7K17J75m73J06L09j92k5j55K00o7j20K45j29K5%o4P5Lj09
5737f4J91P8l64K49j73JJ22J42k30j91L97Q2m97J59J41O5m7M5k15MJ15j7o0o6
5761a33R8j52L79l62M96l42J63k49J29l1J61j39P4j1j36K00n51K92J24J17k33
5782a06M3J11j58J61j11J07L4O0mj02J72j57r5J31J94m63K13J08k92L25n7M5j7
5805A42j48K18n81M14j91J79M6m05K58R4l02L33j19k99N03k35J23j6l8k03J09
5826a18j33M20Q1k00j24l8L1J0K60l50K21j46R5j35Q8J37nj11j31J25J68L0J9
$$ plain form
5668 -21 -13 294 -39 73 -64 -52 -75 -190 79 -25 -125 -8 189 -3 172 -381 -12 130 -95 -38 -70 130
5690 130 9 225 -46 -258 -163 84 171 87 -40 -121 -68 -189 9 -89 80 113 163 -322 -88 72 192 201 -207
5713 -207 -12 10 73 -58 -85 132 307 -166 -60 249 57 32 -123 77 10 -110 135 6 31 31 -33 42 45 -64
5737 -64 127 205 -159 90 -83 -82 40 182 -48 -239 158 240 -257 -98 43 108 61 106 -109 -105 10 -7 -67 -133
5761 -133 -35 -187 192 -170 326 -16 147 -102 27 -4 157 18 92 81 -55 145 -406 -114 10 127 -106
5782 -106 -63 48 -110 51 -60 47 81 141 137 35 207 50 -45 86 280 -183 30 138 -154 171 114 159 142
5805 142 -6 212 -369 45 -146 33 79 -326 -68 26 -276 57 -62 -361 142 -93 30 14 -24 -227 -118
5826 -118 -251 169 250 50 -74 -112 -81 -71 189 -161 60 -86 9 -126 -38 99 94 -17 -148 -23 145 175 194
5849A94j52k21J31k43K29j18K19M4q1q7K54n6k43j22L01k42L81K5j03rp7K81m10
5872a05K55o8k86K75j6l1P0J1k2k45K22j50J06L9J55k96K94Q0l00J17N4j52N6
5895F3J71j04j83k4J11k6M9K8k41J77J90O7k84K7j8J39o2j31J08q2j9k0M4J6j35
5920a39J72P7q9l3l1J96k87N8K12j33j97j3K64J3o4K5j25R0j7K14j57l4j40R5
5944d3j52J72r2j06M00M4p5J04n17O14k26o9R0j21j27J34j20J52J39o5K03l46
5966gJ62m4Q1k24q4mk6K4J37j96M6K27l42L78j49n8p3K81k87q9L31Q3j08j85L44
5991B18l12j23N0J14J13j29J86k47K75n0j37Nj38MK29n8q3J09J8mk02J96l4Jk24
6016b23J88J1OJ07q9O6j17J05J17l17J69k62J30K41r2M0j93k7J36l45L36m0j30
$$ plain form
5849 194 42 -179 -48 -291 -62 -180 39 83 2 -85 169 113 -130 -252 49 -193 188 213 110 101 24 305 -105
5872 -105 150 82 -204 71 55 24 94 105 83 -162 60 -90 16 55 210 -86 208 288 -12 105 159 7 63
5895 63 234 130 -53 -77 34 8 57 85 -156 21 211 278 -6 21 3 142 80 -51 57 -25 -44 -64 -20 -4 -139
5920 -139 33 110 21 -12 -43 153 -134 -76 136 3 -194 -207 57 70 6 31 -94 -4 -21 193 36 2 -138 -43
5944 -43 -195 -23 -115 -221 179 223 148 252 -265 349 123 54 144 23 -104 30 -90 62 201 136 339 -7
5966 -7 155 111 192 -32 -116 -120 -146 -122 15 -181 -135 92 -250 128 -21 -79 -152 129 -158 -247 84 167 59 -126 218
5991 218 -94 -217 -167 -53 60 -69 117 -130 145 95 -42 -37 -175 -171 58 0 -83 26 44 40 -162 34 0 1 -223
6016 -223 -35 -24 -18 89 0 66 -51 54 171 -146 23 -239 -109 132 40 80 -113 -140 -4 -349 -13 -53 -183
6039a83J96l3j6K1r3L65n7Kj01pOk04L10k79j03P3j60K06J32J41k50K3O2l86K31
6064a04N6J08j28j2L15n3m0J6q9M4lo0M6o9r4O2J38l4J9k98N9J74j09J0j01M3
6090a04R1N9n3r3l2J03J20p2J90l1k85P2o0J57N7j78L36j32k78K53J24k95n4l
6114a08P5M9M6k46K19k10N1J01l6K15n0j95L40k24j17K07k97J07l18M59Q5j7O
6137A42j70N4J06o2p0J28p4Q6k83J98J42k14K11j74j92M50l38o5K97q4o6j01K02
6160A23k23L3o0K07j36N7k9J92k18j81J4R2K69j35o2J61q6M5K18j82K13k42k10
6183a40L18j02K0k86J27J25L8k33Q5J06o1N0j61J38L64l14J11k75K7J43j18J51
6205A13j89M4J47k88K81mm7M7K5j08m5R0K51k53j63J4o7J83J80j22j21K1j12J0
$$ plain form
6039 -183 13 -20 -36 -15 -108 257 200 202 101 94 100 -104 206 -73 -176 -103 -263 -57 75 216 -34 -11 51 -335 -104
6064 -104 -48 60 -68 -80 235 182 142 158 69 113 110 50 96 27 -67 -5 133 99 118 -180 -121 53 -56 -46 -147 -104
6090 -104 -13 46 -7 -100 -132 -29 91 19 209 178 -107 -35 -95 62 119 -59 277 145 -133 120 244 -51 -105 -108
6114 -108 -33 16 62 -184 35 -175 -124 -23 -59 156 106 -89 251 27 -90 117 -180 -73 -391 68 153 136 142
6137 142 -28 26 132 70 0 128 54 140 -143 55 197 -17 194 20 -172 278 -60 -125 172 88 22 -79 123
6160 123 -100 -67 -127 80 -56 1 -28 164 -54 -235 -221 -129 140 5 -57 104 18 63 281 99 312 70 -140
6183 -140 178 76 96 -190 -63 62 100 -133 -48 58 -3 47 -114 24 388 74 185 -90 -63 80 -38 113
6205 113 -76 -32 115 -173 108 104 57 104 129 21 -24 66 317 64 -99 -85 -152 31 211 89 -32 -11 -123 -113
6229a13K86j35q6l4J52l2J1N8l3K09j69k35L21m8j10p1J92j17k35K48k3J01l58
6252b21j48L29J6o8J87j36J19q4J26j45P9j08K04j93N6k60J10J20R4j9j70R4K03
6275A85j52K64k03j18j84J81N4k7j43J25L2r7J05Jq2K89j76n0k4P4n2L62m34K27
6299A57J9m34O1R3m2P8R9N3j11M4P9k09J29j29J03j29J63q4j13M7j84N44l65J13
6323a8L7j48j09K34Jj26K39j48Q8l32L28p5k15n1L84J59k17J58j50J77j75j18
6345g7K31L3j24q0%Q9k45J49K99j67q6K0M5k81Q2J06j51M02j53k90l5P4L9J85
6369F5q0K51k04o5L3j14J99n6J72q8l65M25j94R8J11k18O5O5j30N4j54K48N0k43
6393g5L05l89K1K35k29L53l51J20J85k66J37j32M66j97k28m0J90j65J38j17PR3
$$ plain form
6229 -113 173 38 -48 -82 70 38 49 107 74 283 114 -121 200 152 42 -29 163 46 -189 59 36 137 -221
6252 -221 -369 -40 -24 -92 95 -41 78 -6 120 -25 54 -54 150 -43 13 -247 -137 -17 77 58 -112 -18 185
6275 185 33 297 94 -24 -208 -27 27 0 -143 -18 14 -83 22 23 -59 230 54 4 -20 54 2 364 -70 157
6299 157 176 -258 -197 -104 -146 -68 31 84 -27 17 96 -113 16 -113 -10 -139 24 -60 -173 -126 -310 234 -131 -18
6323 -18 19 -129 -238 -4 -3 -129 110 -38 50 -282 46 -29 -244 -295 89 248 31 189 39 216 41 -77
6345 -77 154 187 63 -17 -17 72 -173 -24 275 108 22 42 87 -194 -112 -6 -157 245 92 -198 -233 -159 -120 65
6369 65 -15 236 32 -33 0 -114 85 29 201 113 -252 173 -21 77 188 -30 35 100 -30 24 -130 118 168 -75
6393 -75 230 -159 -138 97 -132 221 -130 -10 175 -91 46 -86 380 183 -45 -85 105 -60 78 -39 -32 61
6415F1p3j90O7J67q8L17l24J42J25q9J5l28L34k64J83K48m65J23O4L32m18J83
6437A22j66j15J00J1L5J91j44j28k4J28k67J07J16pK98n18K23r7J70j74L12J75
6459C48k40o9J8M6L7q1J58k94k04J30p1N20l30j06j12L52k02RL01j49J36n7j18
6482B2n8o4K61j37l6p1Q6M4j97j04L90n0l35K17P6P4k18j30K87q9J03N7k57O6
6506f3K28k18j4M33m61R0k77M01j01J92r7m4j25J97l6n3l48J46L56l6j84J54j46
6529fp7K09j78P4k18L3j75L69L4j13j62K92M0J06j14qK2j55J20j28K12k98Q8J68
6553A35J25k78K8K65l0j95k7j56R1L4N8n7m3J05M1j53k1J49J8j24R8J82l58J01
6577a2l1j6Q4k19P5J89J92k46J26k79M6r2K1l2K46n8J73J4J5q8j24J90k82K6K25
$$ plain form
6415 61 -12 -202 -135 32 -56 261 -63 79 204 115 130 -198 136 -128 55 303 -162 -39 25 357 -61 122
6437 122 -44 -159 -59 -48 -13 178 34 -94 -118 10 -257 -150 -34 -41 257 -261 -38 -135 35 -139 173 348
6459 348 108 39 57 103 140 59 217 -77 -281 -151 -222 298 -32 -138 -250 102 -100 -91 210 61 197 140 22
6482 22 -36 -100 161 24 -12 -83 3 47 -150 -254 136 86 -249 -32 44 118 -100 -230 57 -32 71 128 -129 -63
6506 -63 165 -53 -67 366 -95 -5 -282 119 18 210 113 69 -56 141 105 52 -296 -150 206 170 -14 140 -6
6529 -6 -83 126 -52 22 -196 -163 -338 31 65 -48 -210 82 122 228 114 106 128 -27 93 -35 177 -121 -33 135
6553 135 260 -18 10 275 245 50 23 -133 -42 -8 50 -7 -50 55 96 -57 -78 71 89 -35 63 245 -113 -12
6577 -12 -43 -59 25 -194 -119 70 262 16 142 -137 -91 -183 -162 -194 52 -6 167 181 196 108 -16 174 -108 -82 143
6602A43J02j02J5L8L2K6l31M9L3P7k91L40o3l1j48R8l1j4L0J2p2J98O6l29P3K87
6628B07k15L17k42j92K18K87m11J11k4j54J20j21J99j67J14l00J79J59n4j08o9
6649a46M99l65K1R6j23M7l8q1K70k28q1Q2o4R1k51L14m22M95j51J99k10K34j87
6672Aj13M2J33n9n0J42j95J43k01Q9j03O4KK14j26R2r7R5l8N2R5m2j45L5J6l5
6698A1l1K00j77J12o6j60j07J22J09l8p3K92l99J92J57j98j7Q4j74q3L1K26k8
6721a5J03Jl40M03m8j57J45j18M2L14o2l27K48j63j05M6K18m4nq7J35k4k22J76
6745A14jl7l90K44J79j18O7k9j9k44J52N9k17J04K23n9K2j72K97n6l07J89j39
6768a38K49J41j89k40P7k9J41J5J22l70J70J5j02nK93p1k0O9J79k13k58R6J41
$$ plain form
6602 143 245 143 158 196 228 254 -77 -28 5 82 -209 131 68 37 -111 -13 -44 -58 -28 -16 -88 110 176 -153 -80 207
6628 207 -8 309 67 -125 93 380 -31 80 56 -98 22 -99 100 -67 47 -253 -74 85 31 -77 -146
6649 -146 353 -12 9 105 -18 29 -9 -90 180 -48 -129 -47 -111 -20 -271 43 -379 116 -35 164 -46 188 1
6672 1 -112 -70 63 4 -46 96 -99 44 -157 -68 -171 -107 -105 109 -17 75 -22 73 35 87 182 140 -5 30 46 11
6698 11 -20 180 3 115 49 -111 -218 -96 13 -25 -98 194 -205 -13 144 -54 -71 13 -161 -244 -213 13 -15
6721 -15 88 89 -251 152 104 -53 92 -26 16 330 268 -59 189 26 -79 -33 185 141 136 49 184 160 -62 114
6745 114 113 76 -314 -70 109 -9 58 29 10 -234 -82 -23 -240 -136 87 28 50 -122 175 119 -188 1 -138
6768 -138 111 252 63 -177 -100 -129 12 27 149 -221 -51 -36 -138 -143 150 79 59 128 307 94 -164 -68 73
6791G3K1k19K90k62J42k45K60j05j3J71j14q9N9K04l66L72m71K46J5K20j63K29
6813B55j65j90j69M10l8j36M3L11k60m6K54k65K61j81j97m1L59j68r1j69K79j91
6835a35O3J58n8R5k08K14k48N4R7k20K10o5q9K16m0O1P5m0l8J43k90m4L05k26
6859a0J3R6L2j48kJ34q4Mj30oK8r8K15K89m07j28L88nl36R1j0Q5J56k79J25r3
6885h0M9J0J71j92J42j24j24K74r4J8J1o9j24K88M2j60m3N0r6K98k47Pj35Q0j23
6910a71L38j59p1J33r3j17K05n1R0k25J79p3R1l7j90J92lj02oJ07O3K5r4j41J01
6935iL52j39l13j92L80O0P4j90l37K55pJ76L8m44J85J78j89K55l47K5L13k20L09
6958B13k04Qm2J89k02l9K85k15k04P8J42l77K83K75r7k88J21o7Q3K68j92J40q8
$$ plain form
6791 73 94 -125 165 -97 45 -200 60 -45 -58 113 -1 -90 -31 173 -193 179 -292 -46 -31 189 26 255
6813 255 90 -100 -269 141 103 -33 10 321 61 15 269 4 265 84 -113 -154 205 37 -54 -223 56 -135
6835 -135 -72 86 28 123 -85 129 -119 -65 32 -188 22 -43 -132 84 44 105 180 140 102 245 -45 -89 216 -10
6859 -10 3 99 131 -17 -19 115 31 35 -95 -101 -73 -171 44 333 -74 -202 186 181 -155 -64 -74 11 167 -112 13 -80
6885 -80 -31 -21 150 -42 100 -24 -148 126 32 50 61 -8 -132 156 198 38 -5 45 -51 247 0 7 -128 -48 -171
6910 -171 167 8 -63 70 -23 -140 65 14 104 -121 58 -15 76 39 -151 41 38 -64 -70 37 100 125 31 -110 -9
6935 -9 343 204 -109 -301 79 139 213 23 -314 -59 -66 110 148 -296 -111 67 -122 133 -214 -189 124 -96 213
6958 213 9 17 -25 164 -38 -77 208 -7 -211 -133 9 -368 -85 190 93 -195 -74 -141 -58 210 18 158 70
6981G0Q2j36L3K5l9j37K06j91o1L62j31J08r8pk02p8J26J25p0q6J86n6l5r0K1
7006g3n7L05l51J38P2N5q8m7J70j23j58K74k98K57j48J94j85J81k73L04k47j52
7028b50K26j27O8J27j29Q1j18J18Q5n8J54m56J85j1n1K2J35K13o8p6k07J90j05
7051e2Q7m7kl9r3M09l49p0K94k48J27J4R5k1q7O0j63M0K55j82N8j30j59N10l59
7076e2j13R7M6NJ11J0J77j23j37o4K30k9j6J3j32J59k52J63n0mo1L2m8M6L8j51
7102a05L49l49J37K12k07Kj81P9P0j66Q2J48K50k69J72j27m9P8k85J92L8j6om2
7126GP0q9j02j1k06L47j58K11K3j30l2P8j48j37L89k74J58J61k40K25k05j74M9
7149a88L85j95j04J16q0L5p3J70j04m7J22j90K7J53j16L28l2L5m5j11k00j9M66
$$ plain form
6981 70 152 16 49 74 35 -102 104 -87 -148 214 83 191 93 86 -116 -194 -68 57 -13 -99 87 31 -4 -94 -73
7006 -73 -130 175 -176 -38 34 89 1 -46 124 1 -157 117 -181 76 -72 122 -63 118 -155 149 -98 -250
7028 -250 -24 -151 -83 44 -85 -4 -122 -4 81 23 177 -279 -94 -105 -156 -134 1 214 146 70 -137 53 -52
7051 -52 35 -12 -14 -53 -146 263 -86 -156 138 -110 17 31 126 105 18 78 -85 -45 210 28 86 -44 -203 307 -52
7076 -52 -165 -68 -22 -17 94 104 281 158 21 -43 187 158 142 155 23 182 -70 93 43 39 -22 10 -38 8 46 -105
7102 -105 244 -105 32 244 37 39 -142 -63 7 -159 -77 71 321 52 224 97 48 126 -159 33 71 55 49 7
7126 7 77 -12 -114 -125 -331 16 -142 69 92 -38 -70 8 -140 -277 112 -162 -4 157 -83 142 -63 -237 -188
7149 -188 197 2 -102 14 -66 -31 -104 66 -38 -85 37 -153 -126 27 -89 239 207 242 197 86 -114 -133 333
7172C33n01J29m3J21O2p3m5j22M9J5J00j59J11J54j54J36k1j6j24nR9J65l49L04
7196A66k63K1K91k24Oj23J92p5j53R8J66j30J02k33J56o3P2Pp9qj07M4L22m98
7220c13K07J66k18R2K77k23Lm5R1q2j33K10P2j6j09q8L72m34J40J20l8j7M0r9
7244b5M8J96l46K53J96n09K67K65k83j58J62j53J07p8J3o2o1J23L0J72j82J67
7266A42k64L71o6l38K0J15m4j05O3J94mk44Q3j78O9J28L1J41J2K6n1J4R7j79K07
7291B40l42l0J0K68j44n6m5K44O5m12L46l08J08K28Lk85J93j57J14k6L1q9Q6N0
7315I2n6O5j05M8J06j73J74o4K3j05k35K42o3oK2j5m2K11M7l29K89r3m1q2M4J11
7341F5l01L62j9L9j5l9k1j48J61O5l54K00l6J38k80O5j17J94R2j62K4K81k35R
$$ plain form
7172 333 -168 -39 -82 39 101 28 -17 -139 -90 -75 25 -134 -23 131 -23 113 92 76 -48 -53 46 211 -138 166
7196 166 -97 -76 215 -9 -3 -126 66 -9 -162 -64 102 -28 74 -159 -3 -66 6 13 -66 -74 -181 -137 185 -313
7220 -313 -106 60 -158 -66 211 -12 -9 -54 37 -45 -178 32 104 88 -21 -109 263 -171 -31 89 51 34 74 -25
7244 -25 23 219 -127 126 322 -187 80 345 62 -96 66 -87 20 -58 -45 -107 -168 -45 -15 157 -25 142
7266 142 -122 249 183 -155 -135 -20 -64 -169 -106 88 84 -160 -77 -255 -186 -58 -27 114 126 152 101 115 212 33 240
7291 240 -102 -132 -122 146 2 -54 -99 145 210 -202 144 -164 -56 172 175 -110 83 -74 40 14 45 -44 42 92
7315 92 36 101 -4 44 150 -23 151 87 110 5 -230 12 -51 -57 -35 -50 -92 119 166 -163 126 33 -8 -90 -46 65
7341 65 -236 126 107 146 131 92 71 -77 84 149 -205 -5 -41 97 -183 -118 -235 -41 51 -111 -87 194 -41 -32
7365c2l7lP7p5R5l4l4K28J0j71L3j18K46k55K57k45J06J08k07J33j08J54k43J26
7389A1p9J82k35N4Q9R2l3j36Mk9K87j20J56m40LM17l26MK7J52m15K81j86L28j45
7414e7Q7j36j0O9k12K06J17j96k62M34O5j50K19k41k8J11j37n6J07q4M4K21j0
7437A01k0K4k89R9K07j17J3n3L7J5J31k42Q3j7m8K02r7J28M8l93K01n4j46OJ94
7462A3rL29l62k34K89J6P3k88K07J13k81M6j45j18M32N5j19p8j60N22l71q5o8
7485b23J62M4J70k01p3L57K9k22j35J41j97K3K23N8K4k98J63p5K40n1j5j38r8
7508i2k5l5K34O5L2k10j0o5K84l20K10m7l4m1J48k5k51L38k64P0L07l18j43J98
7532FL57m10p1J46J3M0j20p4K99K8j65j36m2l9K15q6%J44K5k12J10q2J54K58n04
$$ plain form
7365 -32 -69 -72 5 -70 25 -9 -43 185 195 24 57 -61 185 -70 187 -58 48 156 -51 82 -26 128 -115 11
7389 11 -68 114 -121 -67 22 114 81 -55 -51 -80 207 87 243 -197 -194 223 -103 -99 -72 80 -335 -54 -240 88 -57
7414 -57 30 -106 -116 -47 -259 -53 64 -132 -394 40 105 -45 174 -67 -95 16 -121 -177 -70 -154 -110 111 101
7437 101 81 105 -184 -85 122 5 18 -35 2 17 148 -94 -11 -28 -76 126 29 157 205 -188 13 -41 -187 -181 13
7462 13 4 333 -29 -263 26 42 115 -173 34 147 -134 -88 -233 -351 81 136 17 -61 -221 301 -70 -155 -223
7485 -223 -61 -17 153 -48 -121 236 265 43 -92 49 -148 -125 98 156 180 -118 45 -30 210 159 144 6 -92
7508 -92 -117 -152 82 147 179 -31 -41 -106 178 -142 68 21 -13 -54 94 69 -182 156 -108 -38 269 -49 -192 6
7532 6 363 -47 -118 28 41 81 -39 -113 186 214 49 -87 -129 -168 47 -39 -39 105 130 -82 28 -54 100 358 -146
7557a46Q2l8J2j01O5J4K37j45j66J37R1o5K05k57J67r2j68J84K5P3k34J57j22
7580h5J82r9O4j52M5N4l0O5j96K04J70O6l51K97j39k57L85j96L2M0J23j71m2K1
7604C0o1Q3J40k42N5j29j38K06N8j38K54k21q3J32K73r0k77J37J0J27j25P2M5
7627A18K2Qk10n7O6n0R7p4PK0K16o9j87P7J9r8L3J37j65K05j15J53r6J75j38k9
7653F5j11K94k86j16N4j58K06R3P5R7l51J46LR1O1k04j41K85k38J83J14l24O3
7676i9K00l7j60L0K15n4j66R8kJ01j36J7M0J23L3O3k65N7m8J6l1M0j35O9j12R5
7702d8J6R7J1j44P8k7K91j16j99L3J70j29o5j60L10k10%J28j0L2J03j02j04n7
7726a02P0k6j60J97j81K69n8J41k98K99J8j75q5J36n7M8n0j2j66J18p7J52Q7j0
$$ plain form
7557 -146 -64 -102 -90 -191 -126 -112 125 -20 -186 -49 42 -23 182 -75 92 0 -168 16 41 114 -120 37 -85
7580 -85 97 -2 62 -90 -45 9 -21 44 -152 52 222 288 -63 234 95 -162 223 27 59 99 222 51 9 30
7604 30 -31 52 192 -50 5 -124 -262 -56 2 -136 118 -103 -186 -54 219 129 -148 -11 -1 126 1 73 118
7627 118 140 148 -62 -119 -53 -103 -6 -80 -73 -53 163 94 -93 -16 3 -95 -62 75 -90 115 0 153 57 232 94 65
7653 65 -46 248 -38 -154 -100 -258 -52 41 116 213 -138 8 11 102 163 -41 -182 103 -135 48 162 -162 -99
7676 -99 101 64 -96 -66 149 95 -71 27 25 126 -10 7 47 170 203 266 1 58 10 26 -5 35 -100 -31 -143 -48
7702 -48 -32 65 76 -68 10 -17 274 158 -41 -8 162 33 -32 -192 118 -92 -92 36 26 58 161 59 -45 -102
7726 -102 -32 -58 -218 -21 -202 67 9 150 -148 151 169 -6 -91 45 -12 36 -14 -26 -192 -74 -151 1 88 78
7750G8j38J92j1N9j8nl56L28k87K81k68L53j76K9J20m14O7J67q4J13k1j98J35
7773e4JK42m1J51l81J45p5K7l5j94N74l83J49j34L5k2N9p9J62P4k57K33r3k62
7797a58K20l47L08K0R8k39o8K95j11L8N7r1J53R1l30K12n1k59K25qN8p6K98l11
7821B4j21Q4j1kk11K49j51K56J18m4j47k5J43k17LJ04K0k48K49k56K94k22L8J0
7845f3k6J06L1j78K20j10n8N2O5M5j04l1L8J0J83n7k46K03k15K42O8L1k06J86
7869A86M7m23J18N7p9J06n8K1r0J43P3k99J41O9Om5P3k35M31l92Q0K25M7j65j65
7894a28J01k6J6Q8j82K01k3k3PO0o3k35K44q1P3l40L99j58o8J4p4K73j39K47m42
7919b59M2K67J6k06K3J64K9k7j06J64r0j68L15k59J93k65L52k0n0N9k77J48n8
$$ plain form
7750 78 -60 132 121 180 162 157 -199 129 -158 123 -145 208 32 61 181 -233 -166 1 -83 30 9 -189 -54
7773 -54 -53 189 148 299 -82 63 -12 15 -20 -214 360 -23 126 -8 27 5 64 -15 147 221 -36 197 104 -158
7797 -158 62 -285 23 43 141 -98 -166 129 18 56 113 22 175 266 -64 148 97 -162 63 55 113 37 335 24
7821 24 -97 -13 -24 -26 -237 12 -139 117 235 191 44 19 162 -55 -52 52 72 -176 73 -183 111 -111 -73 -63
7845 -63 -89 17 48 -130 90 -20 -78 -26 39 84 -20 -51 -13 -3 180 123 -123 80 -135 107 175 206 0 186
7869 186 233 -190 -72 -15 -94 12 -46 -25 -115 28 101 -198 -57 12 18 -27 46 -189 242 -150 -70 155 202 37 -128
7894 -128 -27 -53 -37 51 -131 70 47 24 31 91 28 -207 37 -44 29 -311 88 -70 -138 -124 -198 75 -64 183 -259
7919 -259 -217 50 66 -140 -117 47 76 49 -57 107 17 -151 164 -95 98 -167 185 165 115 174 -103 45 -13
7942a3K02k44K12k80R7K93k52j36K08K6k99K09m3O4l7j75J0K02N3j85M2k1Q6J28
7966A47j51q2J77r7L1N7L4j92o7J29J07j5j05L05R6k69k32Q3l0J25Mr8k3L7n0
7991g9K03P7j48q9o8L48j99P6m9j9J14k79K17o3m1K65l06j07K24M4O0j26J36j37
8015E4N9l84J04J01k1J82o6j94Q5P2O0j60J41pp3J85l5l3j56L18k61J14j44n4
8039a13pk9J62k33L40k40L9J50n1K0K07m42N95l95J24j14p4j43Q5J28J10q0M3
8062H2J02l08J68n4j44L80k09N7j32j52K60k37K84j70J2O3m0j0O1J11k8q3r3J88
8086A08L2j40j31L33j47j05J19l4O5j53O7J72N3m60L48P5j12o3j86K57j21j08
8108a31J48j29L2p2L9J10Kr2o8L67k42K9j68O1J17K1n3l6P5P7p4p2P9k95L92L2
$$ plain form
7942 -13 189 -55 157 -123 -26 267 15 -121 87 113 -186 23 -20 44 7 -168 -158 44 97 -88 -46 -67 19 147
7966 147 -4 -86 91 -6 25 82 116 -76 -143 -14 93 78 -27 278 374 105 -127 -44 -74 51 55 -43 -66 -29 -79
7991 -79 124 201 53 -36 -104 244 45 121 72 53 167 -112 105 42 1 266 -40 -147 77 121 181 55 191 54
8015 54 113 -271 -167 -66 -87 95 29 -165 -80 -8 52 -108 33 26 -47 138 103 70 -86 232 -29 85 -59 -113
8039 -113 -120 -149 13 -220 120 -120 -81 69 18 38 245 -197 398 3 127 13 -61 -204 -119 9 119 39 82
8062 82 184 -124 44 -10 -154 226 17 74 -58 -210 50 -187 97 -73 -61 2 -38 -48 13 124 96 13 -80 108
8086 108 140 0 -131 202 55 -50 69 35 100 -53 14 186 239 -221 127 202 90 27 -159 98 -23 -131
8108 -131 17 -112 -80 -152 -113 -3 -1 -93 -161 206 -36 -7 -175 -114 3 24 -29 -65 10 87 13 -59 20 -275 117 149
8134A49j45M6k3j13J8k98K84L18l13J24j8Q5o9o6j53K45p2p0L1j59R9n8J46J2
8158@r8J42j97J93J62l40K20m6j80J65K3K7j76J78j57j3J49M6j14p6K18j46j26
8181a46M50m28Q7k7n2Q5J54m58M55k9
$$ plain form
8134 149 4 50 27 -86 -68 -366 -82 236 -77 47 29 114 45 -21 -174 71 -1 -71 -40 -199 -100 -158 -12 0
8158 0 -98 44 -153 40 202 -138 82 36 -144 21 44 71 -105 73 -84 -97 52 98 -16 -92 126 -20 -146
8181 -146 304 -124 -37 -64 -116 -31 123 -335 120 91
8191I1
$$ Imaginary data points
##PAGE= N=2
##DATA TABLE= (X++(I..I)), XYDATA
0@%%%%%%%%%%%%%%Qj6J6j6J6k3L1l2L7m5N1n9P0p9Q9j04J19j35J53j73J94k18
36a16K45k73L05l39L77m19M64n13N66o24O87p57Q34r19J012j116J232j360J504
55G90j666J853k072K329k633L001l462M052m839N940p585J0297j5499K8743j17267
70i8018k07085M43322J15061m23936k5954L96873n6697l34474J08355K77801j50201
81D5047k13357J70154J56699j89742j02162J92367N0980j92757o211J76388k8817
92E8589j56974N0021J32927n7054j11281N6813R4369m6445p8649L5532O8479j6297
104C0030o0686j299O0447K0113o5441l3925P4715M0405q8926l8098R7591K4479
116E9405j03975o897J00646j4490r4763L4693Q4502n5261p1102P6318N6039r4875
$$ plain form
0 0 0 0 0 0 0 0 0 0 0 0 0 0 0 0 8 -8 8 -8 8 -15 16 -16 21 -24 27 -32 38 -41 48 -56 63 -72 81 -92 102 -116
36 -116 129 -144 161 -178 199 -220 244 -269 297 -327 360 -397 437 -482 530 -586 646 -714 790
55 790 -876 977 -1095 1234 -1399 1602 -1860 2192 -2647 3293 -4292 6005 -9494 19249 -98018
70 -98018 -305103 138219 253280 -170656 -196610 200263 143566 -190908 -82553 195248 45047
81 45047 -168310 1844 158543 -31199 -133361 59006 109986 -82771 -88982 87406 58589
92 58589 -98385 -48364 84563 27509 -83772 -26959 67410 20965 -57684 -22152 46327 30030
104 30030 -30656 -31955 28492 48605 -16836 -50761 23954 64359 -24567 -62665 34926 59405
116 59405 -44570 -51467 49179 34689 -60074 -25381 59121 3860 -67242 9076 65115 -29760
128b9760l6215J11535J6615j22954P107J29404k9566j26520N0565J16386o5781
139B0816j01673P5393Q1408q0051n9506P6637L5341o8047j3796N2848l248l5746
151a9624J4649J8294k0641k487K2725r621j9164J7406J4665k0158q714J9694K107
164I131j6420N965Q762j4744K115K2702j7725k8314L4746L0223n2968k7685P0695
177B6483K0188q4850p207R4050q056r5872K5106R1827m1590q0467N5590O3822
189E9024o7172m3138P2618K0580p4776J293P1527k2734o5750M0720N6941n6024
201f891m5746O7724L3883p4349j9889P7197O767p3246O471O5485j5836n2215K1515
214i130L7280k2603k2091J9621O759j4073M120M380j2625M304J4446j3029j4459
$$ plain form
128 -29760 -65975 45560 62175 -60779 -53672 75732 46166 -80354 -29789 86597 20816
139 20816 -80857 -5464 75944 -4107 -63613 13024 48365 -19682 -33478 19370 16122 -19624
151 -19624 -4975 13319 -7322 -9809 12916 3295 -15869 1537 16202 -3956 -12670 7024 9131
164 9131 -7289 -1324 7438 -7306 -5191 17511 -214 -28528 6218 36441 -16527 -44212 26483
177 26483 46671 -38179 -45386 48664 40608 -55264 -30158 61669 20079 -60388 -4798 59024
189 59024 -8148 -51286 21332 41912 -32864 -31571 39956 17222 -48528 -7808 49133 -6891
201 -6891 -52637 15087 48970 -25379 -45268 31929 38696 -34550 -28079 37406 21570 -30645 -9130
214 -9130 28150 5547 -16544 3077 9836 -4237 -117 4263 -8362 -4058 10388 -2641 -17100
227a7100J9024J0578k3220l090K4370n309k1024J6161J6455k4393q074L4961j582
240A7757m2254J4548M7938k8212n0619M2220M8134n6356m2699O6561L1118p5433
252b7297j7772P6968J372p4792J4435O6406k8721n4450M0967M0423m8687k3720
264c4868N4730Q980n4966O664N4079j8147n0066K8862M4470l7163l6710M1031
276F896K7405m3699j8578M1089P902l7129l02K8834p296j8812J0563Q604j1608
289f131J516J0254q349n789J4569J705j6075M098J6000q078j1435J0615O521j1524
303b103r72J0850n640j0007J0869O249j6709l084K0524j670k4075O466K5250j2204
317C744k4332J8076K1204k1958j4882K4833Q232k4645N60K2617q655j7166J5762
$$ plain form
227 -17100 1924 12502 -10718 -13808 10562 5253 -15771 390 16845 -7548 -15622 19339 17757
240 17757 -24497 -9949 37989 9777 -40842 1378 49512 -6844 -49543 17018 48136 -27297
252 -27297 -45069 31899 33271 -41521 -27086 39320 10599 -43851 -2884 37539 -11148 -34868
264 -34868 19862 28842 -26124 -19460 34619 16472 -33594 -4732 39738 2575 -34135 6896
276 6896 34301 -9398 -27976 13113 21015 -16114 -16416 12418 5122 -13690 -3127 5477 -6131
289 -6131 -4615 5639 -2710 -8499 6070 7775 -8300 -4202 11798 3720 -7715 2900 9421 -2103
303 -2103 -3075 7775 2135 -7872 2997 9246 -7463 -10547 9977 8307 -15768 -9302 15948 3744
317 3744 -20588 -2512 18692 -3266 -18148 6685 14917 -9728 -9168 13449 4794 -12372 3390
330C390J0166k0712k312K2585n706k3276J2641K0729j8564j7397K2617J2122k5072
343h789o167K5315O11k4143N654K1866j1792j7189J7307J1753k1469m569K3998
356A2386l149k4551J0419K2635j7651j8781K2910J2345k5167o249K5479l75k2973
369a2722O299J8274r607j2703J2558O873j2547j213J2025l333j1182P835Q716
382I273j1739n700J3952J460j5441J778J5324o816j3589J0306J0276j3666n439
395a0021J5722J30j5440O129J4116j0829j0325J5793O283j7686j236J8220k625
408H231j7348N959J4963q969j3246J0519R394j1563p236J0961L547j0723r26R483
422C046k100p749N355N420o470j856P965n37p153M299O172n966l075P227Q8o835
$$ plain form
330 3390 13556 -7156 -9468 13117 7411 -15865 -3224 17505 -1059 -18456 4161 16283 -8789
343 -8789 -14956 10359 10970 -13173 -7519 14347 2555 -14634 2673 14426 -7043 -11612 12386
356 12386 9237 -15314 -4895 17740 89 -18692 4218 16563 -8604 -14853 10626 10251 -12722
369 -12722 -6423 11851 2244 -10459 2099 8972 -3575 -4788 7237 3904 -7278 557 9273
382 9273 -2466 -8166 5786 7246 -8195 -6417 8907 2091 -11498 -1192 9084 -4582 -10021
395 -10021 5701 5831 -9609 -3480 10636 -193 -10518 5275 11558 -6128 -7364 10856 8231
408 8231 -9117 -3158 11805 2836 -10410 109 9503 -2060 -9296 1665 5212 -5511 -6437 3046
422 3046 946 -6803 -1448 3972 -2498 -4354 3611 3074 -4079 220 6392 426 -2649 4578 4666 -2169
438b169K990M582n888k409O702j192q428L845O998p179o232Q923M447j0465k416
453g891J1523R54j1159J199J1977k969j0766O301R731p729p240J0747M003j2042
467c361m48J1888l738j1190O384Q703r818o640J0730K816j1280l69J0236k130
481A783q395L604O929l978n238N557L651n228j335O070j55n054J731M720k915
496A747m491M592K923o304j057N357p07n628K052L952l577k361L694L30l406J782
512a102K120k581k73L270o31k163J494K147k246j275L049q4k030j2J739m54k092
529a124R33J835j663k206K817Q78l396o0L908q91m413K483M205l846k839N180
545A801J143n297M32N469k258m730L359L344m334j972M335P41l937n1L658o62
$$ plain form
438 -2169 821 5403 -485 -2894 3808 2616 -5812 -1967 5031 -2148 -8380 543 4990 -5475 -7891
453 -7891 3632 4586 -6573 -5374 6603 3634 -7132 -831 8900 1171 -6069 4678 8681 -3361
467 -3361 -3809 8079 4341 -6849 -465 8238 -1580 -8220 2510 5326 -5954 -6323 3913 1783
481 1783 -6612 -3008 3921 -57 -5295 262 3913 -1315 -2650 3420 3265 -1789 -58 4662 1747
496 1747 -2744 1848 4771 -1533 -2590 2767 2060 -3568 -1516 2436 -1141 -3502 192 522 -2884 -1102
512 -1102 1018 -1563 -1836 1434 803 -1360 134 2281 35 -1240 1809 1725 -305 -317 1422 968 -1124
529 -1124 -191 1644 -19 -2225 592 1470 -1926 -1986 1922 1031 -3382 -899 3306 -540 -3379 1801
545 1801 2944 -2353 -1921 3548 1290 -3440 -81 3263 -1071 -3043 1292 2033 -1904 -1955 1703 1041
561A041l190R36L566j693l147K675K793l015k019L540J592m433P0M090j865l399
577b458K208K720l499j399K655K81k657O89J688j009o18J167K12o93N91K39N50
594F67l64K29M03L43n60j94J381n10j135L75P05j860J12J160j028r80N42L64j706
613b056L40J396j059o85J644L04j330P74J325m40j77J077l1n00N93R75j248Q8
631I90Q21o54j074M93K20l59j251l85Q20m98r18j21J436n16j585J060J920j701
649a302k61K269O32k285R22K183m73j552J059J260j522q39J074L07p03j157J04
666b84R03r47j429R79N79j173p01J299J47p52j43J600l28p23J052M66k72N29J17
685I19p6K58J78n82K61N92r17j061J125J14j678k07J603p95j007M32P37n17l00
$$ plain form
561 1041 -2149 -1213 2353 660 -2487 188 2981 -34 -2053 1487 3079 -1354 -1284 2806 941 -2458
577 -2458 -250 2470 -1029 -2428 227 508 -2149 -1460 228 -781 -1399 -232 -20 -713 -122 117 667
594 667 303 532 935 1278 718 524 1905 1395 260 635 1340 -520 -408 752 -276 -1256 -714 -350 -2056
613 -2056 -1716 -320 -1379 -2064 -420 -116 -1446 -672 653 213 36 1113 1082 582 1175 2150 902 990
631 990 1811 1157 83 576 796 437 -814 -1199 -379 -877 -1795 -1916 -480 -996 -2581 -1521 399 -1302
649 -1302 -1563 706 1338 -947 -25 2158 1685 133 1192 2452 930 91 1165 1472 769 -388 -284
666 -284 619 -328 -1757 -778 -199 -1372 -2073 -774 -627 -1379 -1522 78 -250 -973 79 545 273 802 919
685 919 843 1101 1279 697 958 1550 633 -428 697 811 -867 -1074 529 -266 -1273 -841 -104 -621 -921
704i21J42L99l5p6m59J352K64j208M09J341n54q19P76O91j124n68J260l32j028
723d90M65M50o73j58q5M57Q3k78o83P36Q43r85m91J475J12j460O71Q86m55r57
743e37J104J9p61m75P54k11l00J07J07K77l86o98J195M61j481Q5J739l33j234
762e68P17J144p08r16J174J55j321L23P80o77p48O92j44l15k83J87k22J25l1q8
782g24M75K36p64M66J200n78n46P59O03n06j69M71K82n51j98j84K93O3j018n7
802d47J022r27j374J004J021j618n34J827J45j845M90K396r32j460J383J598j242
819E07q43J345J014j009j030J381N26j537p11J163J67j962R1J634j314j519J287
836h10R07k032P1J878n93r73R26J245j060K04J030j63n05J049J54q80L58N99n80
$$ plain form
704 -921 -779 -380 -415 -491 -950 402 666 -542 -133 1208 654 -165 611 1302 178 -390 870 538 -490
723 -490 -25 425 -248 -406 -491 -34 49 -229 -912 -176 667 -318 -809 666 778 -682 -11 875 420 -537
743 -537 567 586 -175 -650 104 -107 -407 -300 -193 84 -302 -1000 195 656 -825 -740 999 666 -568
762 -568 149 1293 585 -331 843 998 -323 0 780 103 -645 47 -97 -412 -695 -508 -730 -605 -636 -724
782 -724 -249 -13 -777 -311 889 311 -235 524 1127 621 452 923 1205 654 456 272 565 628 -390 -447
802 -447 575 -352 -1726 -722 299 -1319 -1853 -26 119 -1726 -1236 1160 228 -1232 151 1749 507
819 507 -336 1009 2023 1014 -16 1365 1891 354 -357 806 973 -989 -898 736 -578 -2097 -810
836 -810 97 -1935 -1864 14 -579 -1552 -626 619 -441 -237 793 630 125 1174 1328 448 806 1405 825
855H25n16L62M09j449j46N68L1q79m20Q86kj092L08J337r39j006J267J371j660
874g45j77K317o39j674J433J593j556j494K462M46k513rK434j344j751J340R82
891A105k017n42J608M03k198K16K004k49j697O29J825j016j192J397J078j520
907a66n54J948k71j908J080J453j844p52J880q9k138J020J371j546q07J714J48
924E39j367K78J575n55j608J294J010j476o79J944L57k052k3J948m19k218J019
941d33K004j822j740K493Q63k756Q2K906j192k527K251J847k438p07K329n2k277
958a169R02K474j521j821J669R13k316r6J906o58j521L32J732j661j090J794P36
975F05k083r8K818p60k266J329K550k073j389K785J063l193L05K877j523k521
$$ plain form
855 825 309 671 1080 -369 -515 53 84 -795 -1215 -329 -331 -1423 -1115 222 -717 -1723 -456 915 -745
874 -745 -922 1395 756 -918 515 2108 552 -942 1520 1966 -547 -556 1878 534 -1217 123 1105
891 1105 -912 -1454 154 557 -1641 -1425 579 330 -1367 -738 1087 71 -1121 276 1354 -166
907 -166 -720 1228 957 -951 129 1582 -262 -1014 866 777 -1361 -341 1030 -516 -1323 391 539
924 539 -828 -550 1025 470 -1138 156 1166 -310 -989 955 1312 -740 -763 1185 766 -1452 -433
941 -433 1571 -251 -1991 502 1365 -1391 -1309 1597 405 -2122 129 1976 -462 -1169 1160 1108 -1169
958 -1169 -267 2207 686 -1135 534 1447 -869 -965 941 283 -1238 -906 826 -835 -1925 -131 605
975 605 -1478 -1576 1242 482 -1784 -455 2095 22 -1367 1418 2481 -712 -407 2470 947 -1574
991a574K173J351k817o04K453p4k844O87K081j375k019K197J175k180l61K339
1007F08J70k200J089K198j256j637K092J405k287n46K485p21k619J271K170k434
1023b12j696K557P79l431J58K824j102k421J817J638k522m63K765k3k424J087
1039f69K545j581j335K152J209k226p28K558R0l116Q76K610j766k588K405J253
1055A689l290p82L385n77l243J722K810k389j941K985J395l135m65L541p47k389
1071a431J829K041k063j055J834P23k173k14K171p76k307J281J709k155j161K219
1087D72J00k480P69K409j340k134K412J479k965j57L315r68k691J793K612k911
1103b85j588L400K44l134J63K991j075k637J499K392k351j763K642J223k803o81
$$ plain form
991 -1574 599 1950 -867 -1471 982 908 -1936 -1249 832 -543 -2562 -365 810 -1370 -1731 608
1007 608 778 -1422 -333 1865 609 -1028 1064 2469 182 -364 2121 1400 -1219 52 2222 -212
1023 -212 -1908 649 1428 -2003 -1845 979 -123 -2544 -727 911 -1611 -2074 691 668 -1756 -669
1039 -669 1876 295 -1040 1112 2321 95 -633 1925 2015 -1101 -225 2385 619 -1969 436 1689
1055 1689 -1601 -2383 1002 425 -2818 -1096 1714 -675 -2616 369 1764 -1371 -1836 1705 958 -1431
1071 -1431 398 2439 376 -679 1155 1878 -295 -509 1662 886 -1421 -140 1569 -586 -1747 472
1087 472 572 -1908 -1139 1270 -70 -2204 208 1687 -1278 -1435 1880 912 -1779 14 2626 -285
1103 -285 -1873 1527 1771 -1363 -1200 1791 716 -1921 -422 1970 -381 -2144 498 1721 -1082 -1763
1119a763L291n52l146J612K792j994k059K493J320k874l34K784q68k736J692J904
1135A562k199j199K788m8k474P19K161j334j537J895J010j991l69K631p61j741
1151h87J058J502j533j273K041O98k373n20K887j041k547J558K024k472j351K909
1167F80M17k907M86L014j570k077K132J756k483n82K690J49k991J064K301j315
1183G64k005K028Q78k435r13K865j92k841R70J807j249j865J712J284j957p28
1199a877K877j09k442J266K318j813j553K461R19k709K69K506j201j908J582J210
1215A796k130o93J854l17k421J031J743j376j470J784R86k209k79K429L6k066
1231a302P37K271j268j848K403J306k781k01K584k12k717R02K311j934j917K226
$$ plain form
1119 -1763 1528 976 -2170 -558 2234 240 -1819 674 1994 -880 -1214 1570 702 -2034 -342 1562
1135 1562 -637 -1836 952 904 -1570 -851 1310 -24 -1561 334 1344 -647 -1016 1615 854 -887
1151 -887 171 1673 140 -1133 908 1606 -767 -1287 1600 559 -1988 -430 1594 -878 -2229 680
1167 680 1097 -1810 -1324 1690 120 -1957 175 1931 -552 -1134 1556 1705 -1286 -222 2079 764
1183 764 -1241 787 1665 -770 -1683 1182 990 -1851 -881 926 -323 -2188 -476 808 -1149 -1877
1199 -1877 1000 891 -1551 -285 2033 220 -1333 1128 2047 -662 -393 2113 912 -996 586 1796
1215 1796 -334 -1027 827 510 -1911 -880 863 -513 -1983 -199 787 -1422 -1701 728 764 -1302
1231 -1302 -565 1706 438 -1410 993 2299 -482 -683 1901 1689 -1028 -126 2185 251 -1666 560
1247E60R03k727j03K097l08k443J220J724j507j234K019M80j438j76K175n39j350
1264f47P92J748j541j074J729L88j823r8K074j222j750J433J026j739n18K088
1280H66k92k347J364J611j656j130K004N11j886K02J799o56j375J160J512j826
1296a39p51J643L41j878j2J873o84j413P70J620j585j275J763P60k104J61J857
1313I47p10j439R08J594j577r85K164k74j423M41J518j031j234J147P16j390m35
1330a063J522m1j192L81Q72m27r91J139N85j237M6J085j01j419J047R98j259q20
1348h75J743J73j766K07J714j259j196R79J006j442n79J899k78j605P21J172p22
1365a08r58J043R91j123l31J320j14r11J2J261l25j109P03N12r76m00J014l46
$$ plain form
1247 560 1463 -1264 -1367 730 422 -2021 -801 923 -584 -1818 201 681 -757 -933 1242 703 -647
1264 -647 145 1893 352 -722 1007 1395 -428 -526 1548 326 -1424 9 1035 -704 -1222 866
1280 866 574 -1773 -409 1202 -454 -1584 420 931 -955 -753 1046 390 -985 175 1687 -139
1296 -139 -890 753 1094 -784 -796 1077 393 -1020 -250 1370 -215 -1490 273 1033 -1071 -910 947
1313 947 237 -1202 -294 1300 -277 -1262 902 628 -795 -354 1164 133 -1101 46 762 -628 -1063
1330 -1063 459 418 -774 -393 479 52 -939 200 785 -452 -406 679 578 -841 206 1204 -55 -875
1348 -875 868 1041 -725 -518 1196 -63 -1259 -280 726 -716 -1295 604 326 -1279 -558 614 -108
1365 -108 -1066 -23 968 -155 -486 834 720 -191 -179 1082 757 -352 351 863 -113 -513 501 155
1383A55j000L46J082j006j036J357L58j318J51J286n39p10R25R48j095l01J536
1400A139j93j121O20P71n08j035O38Q14r40o83P37K44j191L20O59k87r07L29O43
1419D9n88n58J091K03q86M22J023r50l15J162R7n47j08Q33l42o13M09M57r52o3
1439a76N94k40p37N2R07q01l20K45N17k71q53Q05N06q40k30J412l97o58O26P71
1459I12p46o49J187J11j002J58R15n73m67N27L1o73N0L61r7l77N2K76j03l05M5
1480c67K19m6j11M29J11l19j10O63p51J44N41J69n55N5M09j95j019P06L82p21
1500c66J36N30r8o05K06N62l42l65K83J47j53p2K68m9k52j99O40r6n59J10O71
1521C97n74m83L55O17q76K14K22K17p15O16N47q87K46M47J90n80K17N85m20n63
$$ plain form
1383 155 -845 -499 583 -423 -1459 -102 256 -1062 -911 375 -164 -874 51 999 -96 -397 1139
1400 1139 946 -175 445 1216 708 -327 311 1125 185 -498 239 483 -708 -388 271 -16 -923 -594 49
1419 49 -539 -1097 -6 197 -689 -267 756 -194 -509 653 750 203 95 928 586 -27 382 839 -113 -176
1439 -176 418 178 -559 -507 400 -401 -721 -476 41 -230 -1083 -278 228 -612 -842 570 173 -485 141 912
1459 912 166 -483 704 815 -187 -29 886 313 -154 373 404 -269 -219 142 45 -332 -280 -4 -107 -412 -367
1480 -367 -148 -194 -305 124 235 -84 -194 469 -282 -138 403 572 17 72 481 286 -733 -27 355 -366
1500 -366 -230 300 202 -403 -197 365 23 -342 -59 88 -65 -137 131 82 -170 -369 271 175 -384 -274 397
1521 397 -177 -660 -305 312 -564 -350 -128 89 -626 -10 537 -350 -104 343 533 -47 170 755 335 -228
1541b28M89Q9k08m61M27q7j27q7lj24J2P3j23R4j57N2N33l30K3J20L55j27P2L19
1565E96r00N04N06k26o73K94M23m59q7K15m6o11J52m2L61m61J22R2O6k48j24N91
1587D5Q2l05M12J67k00m6J12N32p56O03l26N8j41N6K04n60k63N32n26p0J57j16
1609c49j9P8j0R4k44L35j28j17Q3K36j3J31m1M77J95l89o6M6J48n76N27k2j90
1632A86l12K53R4n06NL27k43k87J27K43k58k18M11n0l13L13N27m62N25q3M1N7
1654C77l44L31J34o24J9K67O3k54P8J26p3l71L47J7m21K15M6j07L7m9L78l21k20
1677c49Q15m89J06nJ67j76l4K42k58O6Om4j67P8Rn6k37J42J19R6k19Q3M24k58
1701F1j23l8L77l42K01N6j88k27J71K79O5n27L57ln79R0L82M6k23k39N17k20m0
$$ plain form
1541 -228 261 350 142 -319 108 21 -106 -193 -196 -320 -308 -235 -358 -264 -421 -369 164 -166 -143 -23 332 205 277 596
1565 596 -304 200 706 480 -193 101 524 65 -22 193 147 -464 -312 -354 7 -454 -332 -240 -174 -422 -546 45
1587 45 127 -178 234 401 201 155 267 799 43 646 320 378 237 293 497 -63 -326 206 -320 -390 -233 -349
1609 -349 -368 -290 -300 -206 -450 -115 -243 -360 -277 -41 -54 77 36 513 708 319 253 299 447 -129 398 376 186
1632 186 -126 127 221 -285 -280 47 -196 -483 -356 -113 -371 -589 -178 -228 -541 -228 299 -163 362 279 320 377
1654 377 33 364 498 -126 -107 160 223 -31 47 173 100 -271 76 93 -328 -113 -67 -174 -137 -186 192 -129 -349
1677 -349 466 -23 83 78 245 69 35 277 19 85 91 47 -120 -42 -33 -89 -326 -184 -65 31 -188 -105 319 61
1701 61 -62 -100 277 -65 136 192 4 -223 -52 227 292 -235 122 119 -460 -370 12 58 -165 -404 113 -107 -147
1724a47K54J5o8r0K71MP6k73L58p3k96L16j09k99n7J62J24l05K46N3n42M1M07
1747F8l02j42R4Q2M9p1M25j60n8m3M44j42M3m7K13k7j57J4K88n56j44K64k72j9
1771a56k6P4o3k94K53j24Q4k41L17j28l5K45j16M58j96L79k0k61J70M20l21j69
1793B50K69j18m01O3M4rk2m44K9K00k15j91L26o9j64Q5N29n15L17k10L00j21K80
1816B13O3j2j5L55l05k02L38k10l41K08J11l19j24L09k01%n3n3j61K63j32r9L96
1839B9k12J82J04J73m17J13L43J27m65K72L61k20j84j29J04m5M4j25k98R5O8J99
1861A19j07l07P8K05nQ3k97M9M32k15M4j52K24j5j50O3l5K00k86mQ7K70l52K3
1885d8K43m64J14L37l65J81K59k52M5j11R5K11j29q9J10o7j21K22l16J07L0j96
$$ plain form
1724 -147 107 122 54 -36 235 239 315 42 400 327 31 347 238 -61 -118 44 168 -137 109 162 -380 -339 68
1747 68 -234 -376 -282 -200 -151 -222 203 43 -15 -58 386 244 287 240 453 426 269 283 571 15 -129 135 -137 -156
1771 -156 -182 -108 -171 -465 -212 -336 -252 -493 -176 -304 -339 -94 -210 248 52 431 411 150 320 740 419 250
1793 250 519 401 0 63 107 98 76 -368 -339 -139 -354 -545 -219 -288 -452 -367 162 -353 -36 -246 54 -67 213
1816 213 276 264 249 604 299 97 435 225 -116 92 203 -116 -240 69 -132 -132 -185 -238 -399 -136 -268 -367 29
1839 29 -183 -1 103 276 -141 -28 315 442 -23 249 610 390 206 77 181 136 180 55 -243 -148 -80 119
1861 119 12 -295 -217 -12 -17 66 -231 -182 250 35 79 -73 151 136 -14 49 14 214 -72 -76 11 281 -71 -48
1885 -48 195 -269 -155 182 -183 -2 257 5 50 -61 34 245 116 27 137 70 -51 171 -145 -38 -8 -204
1907b04J73J22k93N8J24k23K0l0J58P9m7j08K88l3j5o4J44LK21l26K31j70n6J15
1931A67K3j58j62J76l11J02N5K76m88J29l8j76N8j8M04K6k43K48m5J71J33p7j51
1954A01K32Q9j75k74J6oJ42k15K78j77j63J76k09j51m5J25K09l32K08R6J51j09
1976c3j0J95K2j59J43K80q6j77J77rj20j92M02l21q8k18O1lLJ67j6l19o2K57l11
2001d17j0P1J84Q1J05o6pk68L69K55Rj04j50L83l37p4J42R8k65Q5j97R5l35J11
2025b42J70l52L45J7j05j94J01J91j9j07J60J65q8k0J75J9p2M3J21j58l18J76
2047HL28k84j87K90k23l76L90L78n09j4L3J60l0P8Q8l32k7N9L58k70K57r2L3j81
2071f5m8L22j60p0K51k64J06k40kO6j19M0L39m6m19J40M20o71J26M01L07m78J82
$$ plain form
1907 -204 -31 91 -202 -144 -20 -243 -223 -253 -95 -16 -63 -171 117 84 69 5 149 152 373 47 278 108 52 167
1931 167 190 32 -130 46 -265 -163 -108 168 -320 -191 -229 -405 -347 -365 39 65 -178 70 25 196 329 252 101
1954 101 333 422 247 -27 -11 -17 125 -90 188 11 -152 24 -185 -336 -381 -256 -47 -379 -171 -75 76 -33
1976 -33 -43 152 174 15 158 438 352 175 352 343 223 31 433 112 24 -194 -133 -136 -133 34 18 -301 -363 -106 -417
2001 -417 -427 -356 -172 -91 14 -52 -59 -327 42 297 306 202 52 435 98 24 166 264 -1 84 -113 -18 -353 -242
2025 -242 -72 -424 -79 -62 -167 -361 -260 -69 -88 -195 -35 130 42 22 197 216 144 187 308 150 -168 8
2047 8 336 52 -135 155 -68 -444 -54 324 -185 -199 -166 -6 -36 42 130 -202 -229 -170 188 -82 175 83 116 -65
2071 -65 -113 209 49 -21 230 -34 72 -168 -170 -104 -223 -183 156 110 -309 -169 251 -420 -294 107 414 -64 118
2094A18K98l40l46M08J09o45L86M5J02l47K04j59K14l64l0N47l83J51j90J63p
2115f6n8L92j59k51K43L82m44j23N06m14k64N68l83j92K52r4J49m68L90L3m09
2136d10J85K86Q5j32j67L59N9p7j98M85j32j72K08j16P4m82L90j37K6j49r6N7
2158e4q0O7j12k40o3L52J81m71L85Mm4k76L69mj0K71r7Lo5L7K17j82j17Q1m1N1
2184A62l88L36o1l99L22J24m42J86J74j14k41K79J47k77j76M22j5j09K06P1qj69
2206C0q2K64o5r5L67m69j34O2J96k53k7j67N58n14J7K30J57l86J8L6K79j90p6
2229b44O75l21m91M58J1j43L12K36j86m02L36j09k7l76L65J38l55J98k9j99j69
2250c22L51J5q8j90K83m7K2J84j58o4Q7P2J46l00J5N44o14j34K37L04n36J55o1
$$ plain form
2094 118 416 76 -270 138 247 -398 -12 33 135 -212 -8 -167 47 -317 -347 200 -183 -32 -222 -59 -66
2115 -66 -124 268 109 -142 101 483 39 -84 422 8 -256 312 -71 -263 -11 -105 44 -424 -34 -1 -410
2136 -410 -225 61 146 14 -153 206 265 188 -10 475 343 171 379 263 337 -145 245 108 134 -15 -111 -54
2158 -54 -134 -67 -179 -419 -482 -130 51 -420 -35 -31 -75 -351 18 14 4 275 178 181 116 153 370 188 71 152 111 162
2184 162 -226 110 49 -350 -28 96 -346 -160 14 -100 -341 -62 85 -192 -368 54 39 -70 136 207 199 30
2206 30 -52 212 147 52 419 -50 -184 -122 74 -179 -206 -373 185 -329 -312 -82 75 -311 -293 -257 22 -168 -244
2229 -244 431 110 -381 77 88 -55 257 493 307 -95 241 132 105 -271 94 232 -123 75 46 -153 -322
2250 -322 29 44 -44 -234 49 2 24 208 50 -14 73 145 291 -9 6 550 -64 -198 39 343 -193 -38 -99
2273i9M54m51j10L60j41j45k20M13R4j48Q7k6q9J02K97l44J64k21O6j61q8K84
2295G8p9j34M9K76qm98L07R6k13J91J92n4l77K02K66k18j94M76k36j83J98Q6l5
2318A88k39j42K76j42j41J25J67l14m3L13k60j42K95j61K85m09K70L80n37L79
2338A48K3J15l69J61J87j80j50L83j62n80N04J40j94j43L13L5n76k0K20J10k44
2359b79L43K4l09k05M30J68j67K72k06J99R6r8P2L2K0k70K1j32J20P3Q6m23L57
2382B24k73p0K5j8k64j00L37J76j26PoJ40k05J67N8J01J18k43J91m8J6O6p8n7
2406A38Q2k45M31l93m9r4n8NM6K06m70K06p8L07q5j38L32j87O3o9J14JJ68l27
2430i4J26k7J89Ll83L34q2j13P7J43r9k57K3L32j53j11K0o7m1K57j39m1RJ0Q3
$$ plain form
2273 -99 355 -96 -206 154 13 -132 -352 61 155 7 94 68 -21 81 378 34 198 -23 43 -118 -206 78
2295 78 -1 -135 -86 190 182 -316 -9 87 -126 65 257 203 -174 28 294 76 -118 358 122 -61 137 223 188
2318 188 -51 -193 83 -59 -200 -75 92 -222 -265 48 -212 -354 -59 -220 65 -344 -74 306 -231 148
2338 148 171 286 -83 78 265 85 -65 318 156 -424 80 220 26 -117 196 231 -345 -365 -145 -35 -279
2359 -279 64 88 -221 -426 4 172 5 277 71 270 366 268 340 372 392 122 143 11 131 204 290 -133 224
2382 224 -49 -119 -94 -112 -376 -476 -139 37 -89 -82 -88 52 -153 14 72 173 291 48 239 191 207 273 195 138
2406 138 220 -25 406 13 -36 -130 -188 -183 -137 69 -401 -195 -273 34 -51 -189 143 -44 19 -50 64 65 233 -94
2430 -94 32 5 194 197 -186 148 66 -47 30 173 74 -183 -160 172 19 -92 -72 -139 -180 77 -62 -103 -94 -84 -1
2455aJ73k63J16Q5j68j15Q7K71k05n6L4j38r3K57j11L76l22J01j16P8j27J66J08
2478A37J80k65J57n2l74K07N7%k02K6l4J09K6p7K85m66r2L88J9j36K0J27K65l41
2502c6N1J32p8J57k42L1P1J83k46jj76P5J26L4k12J66l12J02J95j79l7J3L55k49
2526g7P3nr9Q4p9J55J50l0P9r0K52l31n4j2J03p1j46K60l53N0J09j22L76j56O1
2551A27l66L4J64j70%L50k11N1r1K59M6m3L1j92K76o4j81M4J36m05J26J60k3k19
2575a61N6J31j72q6J31j22R4j5n6K44k66J30O2k33N59k76P3j91Q7p6J7L91j81
2598A40r1J76m04L80k73J27L7j69N2N5j08J60k6q4j2R9r0j8J76j21J80j4j20o5
2622a3J96k95K35k43K66r5j18kK5j75J98j6L12m50j20L90j46J29J35k00k96K68
$$ plain form
2455 -1 172 -91 25 110 -58 -173 -86 185 -20 -76 -42 -180 -273 -16 -127 249 -73 28 -88 -10 -137 29 137
2478 137 317 52 209 157 -217 -10 47 47 -155 -129 -163 -54 -28 -105 180 -286 -378 10 29 -107 -87 40 305 -36
2502 -36 15 147 69 226 -16 15 86 269 23 22 -154 -79 47 81 -131 35 -277 -175 20 -159 -196 -183 172 -77
2526 -77 -4 -9 -108 -24 -103 52 202 172 251 161 413 82 28 16 119 48 -98 162 -191 -141 -32 -154 222 66 127
2551 127 -239 -205 -41 -211 -211 139 -72 -21 -112 147 193 150 181 -11 265 201 20 64 200 -205 -79 81 58 -161
2575 -161 -105 26 -146 -232 -101 -223 -129 -144 -200 44 -222 -92 -30 -263 296 20 93 -98 -11 -87 -70 321 140
2598 140 49 225 -179 201 -72 55 92 -77 -25 30 -78 82 56 -28 -40 59 -31 -49 127 6 186 172 52 -13
2622 -13 183 -112 123 -120 146 51 -67 -69 -44 -219 -21 -37 275 -175 -295 95 -51 78 213 13 -283 -15
2644a5r7L3J86p5k30L74k54R2J15j6Q1n7k17K96l96J36R2k22L19r2j36P8j20K07
2668H2l4J53j59N7p0j66J28q2K31l67J16j76J91j38L01L6k10j92J94r7K70K57
2690C25m27J02k1n9o8l1L01O4j13Q8j42R2J19J4n3k52k9j03q5J97j32m5K75p0
2714e3l50L6K77L6Q1k99J58J15P2k13J68j27Q9M1R8J20j60r7K44k6k51K99K1l60
2738h1J87j95j04K22N4j59j13J04K10Ok13j8J15j76j32L20K13j31k6J1J25k14
2760Ek7jM1j2K11k55k27K35k12L2M04m03K33j13l1K37n8ol6Q3q4L6J31k21L36
2785B98L5k15k39J96mj81K09p0m2q4rJ9J6J22j34J45j74R8l6J80k54K55l21K03
2809A3K40l34o6J73J25q1m8J8j10K57J29l06K7m4j69L44j39j58J30o6oJ79l06
$$ plain form
2644 -15 -112 -79 107 32 -198 176 -78 14 129 113 194 137 -80 216 -180 -44 48 -174 145 53 -83 -5 -125 82
2668 82 48 201 42 99 29 -137 -9 -91 140 -227 -111 -287 -96 -234 67 103 -107 -299 -105 -202 68 325
2690 325 -102 0 -21 -80 -148 -179 122 186 73 161 19 111 230 244 191 -61 -90 -193 -278 -81 -213 -258 17 -53
2714 -53 -403 -367 -90 -54 27 -272 -114 1 73 -140 28 -99 -10 31 129 249 89 -8 236 210 -41 258 279 -81
2738 -81 106 -89 -193 29 83 -76 -189 -85 125 131 -82 -100 15 -161 -293 27 240 109 83 94 219 5
2760 5 -22 -23 18 6 217 -38 -265 -30 -242 -210 194 -209 24 -89 -120 117 59 53 17 100 16 52 183 -38 298
2785 298 333 118 -121 75 71 -110 99 29 -13 -97 -106 -87 -71 51 -83 62 -112 -14 -50 130 -124 131 -190 13
2809 13 253 -81 -147 26 151 70 22 40 -70 187 316 10 37 -7 -176 168 29 -129 1 -65 -71 108 -198
2832a98K65r7J47j08P6p1jm6M3j08m6J15O8l9P5l21K58O6j34L11l17rR2r7j04
2857a80J91N6l17M03J91l94p4o9M61j20j74L50n10K15j61j14K68j45J51lk26K21
2879B0j49J6K77j20rR8j64j25j11N54j61j79K33j73j51J13n6K99m4J2J34j24m0
2902A50j86j2K87l97L73J4l25k04L89j92m0q0J49M6M19k83r8j57K60O7j73J65
2924A72K07o18K89L11k91k3J18j67P9p5j71j8J50k84J30j03R7l5K78n8L7Q1k01
2947i5K56j04L12k00jj81k03K00K32j75OJ43q7l78M32k68O9k59K19O3j5j66R4
2970a06K5J00o0K8j11J05L2k5p3M56j46j77N8J36k36mK26k45n7p1O1k5J88j06
2994b7q7J90o6j1J5J7J4p6k31L25l05L90j33j43M2J13J14k2N1n1j87Q1J99j29
$$ plain form
2832 -198 67 -30 117 9 85 14 13 -33 10 -98 -144 -29 39 0 75 -246 12 78 -56 255 -62 -71 21 -76 -180
2857 -180 11 67 -250 153 344 -50 -124 -193 268 148 -26 324 -186 29 -132 -246 22 -123 28 25 -201 20
2879 20 -129 -113 164 44 35 133 -31 -156 -267 287 126 -53 180 7 -144 -31 -87 212 168 180 314 190 150
2902 150 -36 -48 239 -158 215 229 -96 -300 89 -103 -143 -223 -74 -28 391 108 10 -147 113 180 7 172
2924 172 379 -239 50 361 70 47 165 -2 77 2 -169 -187 -37 -321 -191 -294 -197 -232 46 -12 25 106 -95
2947 -95 161 57 369 169 168 -13 -216 -16 216 41 47 190 103 -275 157 -111 -42 -301 -82 -19 -34 -200 -106
2970 -106 -81 19 -41 -13 -124 -19 13 -12 -85 371 225 48 106 242 6 2 228 -17 -74 -145 -84 -109 79 -27
2994 -27 -114 76 10 -1 14 31 45 -31 -262 63 -242 148 15 -128 -86 27 141 119 170 119 -68 13 212 83
3018H3l3k15K70j8L0j02j45J68j13j06K03k56J99J01NN3j74J02J58k24j6j24J36
3041a8J6m0p4rM14l04K23l38K49p6P4m23L00J57j59j13L3J21l7L9o0J98j6l8K23
3066C42m85NN2o3K65N%l18J8L34k03O6j24M9K75j23Q3o7Kk93K60k02P3O5n9R4
3092E1M0jj3J56j87l3k50K43P2J12k54J06k89K94k51L1k2K0J66J12o3j80j5K57
3116A02k49K01R0j71J58j04P2o8q6j57K76k7L8j45O4mnk30O0k1K14O1j04k29K90
3141B6m6k17K15p2M83j77k07O8k6k20K70N6mQ0l5q5o0J30j54l57L62j11K63o4
3165A18r2J9j60K96j59k7J79m9K29l38J36k11K64j77J87k40J25Ml07O3J44j33
3187a29J12J33k37l0k09K16J18j35K23n2l9q9K24l44J33K03j38P5R5j30J3o5q
$$ plain form
3018 83 50 -165 105 87 117 15 -130 38 -75 -181 22 -234 -35 66 71 124 -50 52 210 -14 -30 -154 -18
3041 -18 -2 -42 -116 -125 289 -15 208 -130 119 43 117 -306 -6 151 -8 -121 -88 33 -4 35 -25 173 157 119 342
3066 342 -143 -138 -86 -149 116 121 121 -197 -179 155 -48 18 -106 -57 218 95 178 111 113 -180 80 -122 -49 16 -43 51
3092 51 91 90 77 233 46 13 -237 6 78 190 -64 42 -247 47 -204 -173 -195 -175 -9 103 40 -140 -155 102
3116 102 -147 54 144 -27 131 27 99 31 -55 -212 64 37 75 -70 -6 -10 -15 -245 -185 -206 8 69 -35 -264 26
3141 26 -20 -237 -22 -94 389 212 5 73 47 -173 97 153 149 229 194 109 49 179 25 -332 30 -81 182 118
3165 118 26 45 -115 181 22 -5 174 125 354 16 152 -59 205 28 215 -25 100 104 -203 -140 4 -129
3187 -129 -17 116 -121 -151 -360 -144 -26 -161 62 10 -29 -118 106 -238 -105 98 -40 35 130 0 13 -52 -60
3210f0K78j60k2j25P4K25k57J46r1J63k81J97j93N5k19L08ll0j65K10j53l5K66
3233A28mJ41m31J44j02L6r1n9J94j04J20N1j13P2j61N03l50J13J61j06j63Rp6
3256h8Q9O5J22k34K0J4j60K13j32R4o8O8P2j28r0J77P3j9N0k97L1M4L30j45j92
3281i1L68m32K02l2m1M20n72L68j62k29J83j87L72n57M61l74K30L05m00N6J37
3302B5L3k01K53ok3r2R6j70M07n67m0R3K83K3j05K3p0J57o1k00J93j83J26j13
3326a19J78j49Q7L7rJ09j58N6K4J9q1K3O0j97M12L2l85Q7j16K70n4mJ1M9k08l
3352b9j51J14p2J85k41L56k83p6J40O3j85K85q5j93K70j24J06j07K29k77J82j47
3374d0J29k39M03N9m05K1M3J73j71m2J27j25m7J6J97l55J67l6j7L54k33Q6k22
$$ plain form
3210 -60 218 58 36 -89 -15 210 -47 99 8 171 -110 87 -106 -51 -270 38 35 5 -160 50 -103 -138 128
3233 128 124 265 -166 -22 -124 -88 -179 -238 -44 -148 -28 23 -90 -18 -179 324 -26 87 248 142 -21 -12 -88
3256 -88 1 66 188 -46 -26 -12 -172 41 -91 3 -65 3 75 -53 -143 34 107 88 138 -159 -128 -84 246 101 -91
3281 -91 277 -155 47 15 -26 394 -178 190 28 -201 -18 -205 167 -390 71 -303 -73 232 -168 -112 25
3302 25 58 -143 110 104 81 -11 85 -85 322 -245 -285 -192 91 114 9 32 -38 119 58 -142 51 -132 -6 -119
3326 -119 59 -90 -3 34 25 134 -24 32 56 75 -6 17 77 -120 292 324 -61 26 -90 180 126 122 133 182 -26 -29
3352 -29 -180 -66 -138 47 -194 162 -121 -197 -57 6 -179 106 21 -172 98 -26 80 -27 202 -75 107 -40
3374 -40 89 -150 253 312 -93 -72 -29 144 -27 -69 58 -67 -114 -98 99 -256 -89 -125 -142 212 -21 65 -157
3397a57QO8Q0K67j42m4j18J34k44L32k01k1N8l2j29K56p3j09J79n6o4J44k06R0
3421B0K6j23J91k23J96J08j49pL0j55j46K39J67k81J93j30J76k90Q9j07J94o0
3443d2M5j26R5K1J85k64j9J99q5k88L17r7K19k61J06J07K0J30k96J65j64m5J30
3466E2M6j37K79k5m83L37O1n0p5J9J71pj23J75K0J1o2j31Rm69L80j50K61l57M17
3491A69p3k26O3K07r4n0N5L3k0N4j98Q3K33l8kk79J07J5J9m8j23n3K69k58J83
3516B8p2J16J15K4k85k12L04n5j86J73O7k31J62j33J66Nm5K18j81j8lK48j87j71
3540a53o1N19k48j32L07r1j12L3j8r1q6j00J40J07J70l01P9J48p3N3j02P7J39
3563B04j7j71P9k45J84L9l5O2L7R2k69n9k37L36p8k40M52k18O3k83O04k42k83
$$ plain form
3397 -157 -149 -81 -1 266 124 80 -38 96 -148 184 -17 -38 20 -12 -141 115 42 -67 112 56 -8 136 -70 20
3421 20 46 -77 114 -109 87 195 46 39 69 -86 -232 7 174 -107 86 -44 132 -158 -69 -176 18 -42
3443 -42 3 -123 -28 -7 178 -86 -105 94 9 -279 38 -59 160 -101 5 112 132 262 -34 131 -33 -78 52
3466 52 98 -39 240 215 -268 69 130 80 5 24 195 188 65 240 260 271 209 78 87 -382 -2 -152 109 -248 169
3491 169 96 -130 -67 140 46 -4 51 84 64 118 -80 3 236 198 196 -83 24 39 58 10 -113 -166 103 -155 28
3516 28 -44 72 187 211 -74 -286 18 -37 -223 -50 17 -214 -52 -185 -19 -14 -59 159 -22 -40 -43 205 18 -153
3540 -153 -214 305 57 -75 232 141 29 62 44 -47 -133 -233 -93 14 184 -117 -38 110 37 90 -12 65 204
3563 204 187 16 95 -150 34 73 38 100 137 229 -40 -99 -336 0 -78 -318 134 -84 -21 -304 300 58 -225
3586b25L51k7J36q3k45q7L61k05O1J81k48L03m73J28J46k96K56J94k26l1L4j25
3608a20Q5PJ3KJ10j3j80J81q8j14k9L78l46J88k20L22j83k61K01K82m37K58J2
3631D8k11Q1J57k20O5PJ58n4N9L8Kn6k32jO3J75k19R8p0J75rK06k26O4l1p6J4
$$ plain form
3586 -225 126 99 235 152 -93 -180 181 -24 37 218 -30 273 -200 -72 74 -222 34 228 2 -29 5 -120
3608 -120 -35 -28 -15 -13 97 84 -96 85 -3 -117 -146 232 -114 74 -146 176 -7 -268 -67 215 -222 36 48
3631 48 -163 -82 75 -145 -80 -73 85 31 90 128 130 74 -158 -159 -96 79 -140 -42 -112 63 54 260 34 98 67 -9 5
$$ [...]
8191I8
##END NTUPLES=NMR FID
##END=
