##TITLE=1H_Ad=0(Aceton-ag)-lig
 CDCl3
 8 sc, 
 17.11.2022
##JCAMPDX= 6.0         $$ Bruker NMR JCAMP-DX V2.0
##DATA TYPE= NMR FID
##DATA CLASS= NTUPLES
##ORIGIN= UXNMR, Bruker Analytische Messtechnik GmbH
##OWNER= root
$$ XWIN-NMR		Version 3.5
$$ Thu Nov 17 13:52:52 2022 Russian Standard Time (UT+4h)  she@DPX200
##.OBSERVE FREQUENCY= 200.1313499994
##.OBSERVE NUCLEUS= ^1H
##.DELAY= (6, 6)
##.ACQUISITION MODE= SIMULTANEOUS
##.ACQUISITION SCHEME= undefined
##.AVERAGES= 8
##.DIGITISER RES= 18
##SPECTROMETER/DATA SYSTEM= spect
##.PULSE SEQUENCE= zg30
##.SOLVENT NAME= MeOD
##.SHIFT REFERENCE= (INTERNAL, MeOD, 0, 15.7039)
##AUDIT TRAIL= $$ (NUMBER, WHEN, WHO, WHERE, WHAT)
$$ ##TITLE= Audit trail, XWIN-NMR		Version 3.5
$$ ##JCAMPDX= 5.01
$$ ##ORIGIN= Bruker BioSpin GmbH
$$ ##OWNER= she
$$ F:/spectra/data/she/nmr/H-F/1/audita.txt
$$ ##AUDIT TRAIL=  $$ (NUMBER, WHEN, WHO, WHERE, WHAT)
(   1,<2022-11-17 13:51:39.03 +0400>,<she>,<DPX200>,
      <created by zg, POWCHK disabled, PULCHK disabled
       configuration hash MD5:
       00 E9 B6 7A A2 85 ED C7 34 08 36 98 17 FE 4E 26
       data hash MD5: 16K
       AA 4F 5D C1 AD 63 87 EF D3 F3 1F C0 12 D2 C2 1F>)
$$ ##END=
$$ 
$$ hash MD5
$$ 15 C5 02 02 5B 91 93 33 8E 21 4F 34 57 A2 EB D9
##$RELAX= 
##$RELAX= 
##$RELAX= 
##$RELAX= 
##$RELAX= 
##$RELAX= 
$$ Bruker specific parameters
$$ --------------------------
##$DU= <F:/spectra>
##$EXPNO= 1
##$NAME= <H-F>
##$PROCNO= 1
##$TYPE= <nmr>
##$USER= <she>
##$AMP= (0..31)
100 100 100 100 100 100 100 100 100 100 100 100 100 100 100 100 100 100 
100 100 100 100 100 100 100 100 100 100 100 100 100 100 
##$AQSEQ= 0
##$AQ_mod= 1
##$AUNM= <au_zg>
##$AUTOPOS= <>
##$BF1= 200.13
##$BF2= 200.13
##$BF3= 200.13
##$BF4= 200.13
##$BF5= 200.13
##$BF6= 200.13
##$BF7= 200.13
##$BF8= 200.13
##$BYTORDA= 1
##$CFDGTYP= 0
##$CFRGTYP= 5
##$CHEMSTR= <none>
##$CNST= (0..31)
1 1 145 1 1 1 1 1 1 1 1 1 1 1 1 1 1 1 1 1 1 1 1 1 1 1 1 1 1 1 1 1 
##$CPDPRG= <>
##$CPDPRG1= <>
##$CPDPRG2= <>
##$CPDPRG3= <>
##$CPDPRG4= <mlev>
##$CPDPRG5= <mlev>
##$CPDPRG6= <mlev>
##$CPDPRG7= <mlev>
##$CPDPRG8= <mlev>
##$CPDPRGB= <>
##$CPDPRGT= <>
##$D= (0..31)
0 1.2 0 0 0 0 0 0 0 0.06 0 0.03 0 0 0 0 0.0002 0 0 0 0 0 0 0 0 0 0 0 0 
0 0 0 
##$DATE= 1668678698
##$DBL= (0..7)
120 120 120 120 120 120 120 120 
##$DBP= (0..7)
150 150 150 150 150 150 150 150 
##$DBP07= 0
##$DBPNAM0= <>
##$DBPNAM1= <>
##$DBPNAM2= <>
##$DBPNAM3= <>
##$DBPNAM4= <>
##$DBPNAM5= <>
##$DBPNAM6= <>
##$DBPNAM7= <>
##$DBPOAL= (0..7)
0.5 0.5 0.5 0.5 0.5 0.5 0.5 0.5 
##$DBPOFFS= (0..7)
0 0 0 0 0 0 0 0 
##$DE= 6
##$DECBNUC= <off>
##$DECIM= 32
##$DECNUC= <off>
##$DECSTAT= 4
##$DIGMOD= 1
##$DIGTYP= 9
##$DL= (0..7)
0 120 120 120 120 120 120 120 
##$DP= (0..7)
150 150 150 150 150 150 150 150 
##$DP07= 0
##$DPNAME0= <>
##$DPNAME1= <>
##$DPNAME2= <>
##$DPNAME3= <>
##$DPNAME4= <>
##$DPNAME5= <>
##$DPNAME6= <>
##$DPNAME7= <>
##$DPOAL= (0..7)
0.5 0.5 0.5 0.5 0.5 0.5 0.5 0.5 
##$DPOFFS= (0..7)
0 0 0 0 0 0 0 0 
##$DQDMODE= 0
##$DR= 18
##$DS= 0
$$ [...]
##$SUBNAM2= <"">
##$SUBNAM3= <"">
##$SUBNAM4= <"">
##$SUBNAM5= <"">
##$SUBNAM6= <"">
##$SUBNAM7= <"">
##$SUBNAM8= <"">
##$SUBNAM9= <"">
##$SW= 18.0517283424941
##$SWIBOX= (0..15)
0 0 2 0 0 0 0 0 0 0 0 0 0 0 0 0 
##$SW_h= 3612.71676300578
##$TD= 16384
##$TD0= 1
##$TE= 0
##$TE2= 300
##$TE3= 300
##$TEG= 300
##$TL= (0..7)
0 120 120 120 120 120 120 120 
##$TP= (0..7)
150 150 150 150 150 150 150 150 
##$TP07= 0
##$TPNAME0= <>
##$TPNAME1= <>
##$TPNAME2= <>
##$TPNAME3= <>
##$TPNAME4= <>
##$TPNAME5= <>
##$TPNAME6= <>
##$TPNAME7= <>
##$TPOAL= (0..7)
0.5 0.5 0.5 0.5 0.5 0.5 0.5 0.5 
##$TPOFFS= (0..7)
0 0 0 0 0 0 0 0 
##$TUNHIN= 0
##$TUNHOUT= 0
##$TUNXOUT= 0
##$USERA1= <user>
##$USERA2= <user>
##$USERA3= <user>
##$USERA4= <user>
##$USERA5= <user>
##$V9= 5
##$VALIST= <valist>
##$VCLIST= <CCCCCCCCCCCCCCC>
##$VD= 0
##$VDLIST= <DDDDDDDDDDDDDDD>
##$VPLIST= <PPPPPPPPPPPPPPP>
##$VTLIST= <TTTTTTTTTTTTTTT>
##$WBST= 1024
##$WBSW= 4
##$XGAIN= (0..3)
0 0 0 0 
##$XL= 0
##$YL= 0
##$YMAX_a= 132975
##$YMIN_a= -156857
##$ZGOPTNS= <>
##$ZL1= 120
##$ZL2= 120
##$ZL3= 120
##$ZL4= 120
##$ABSF1= 10
##$ABSF2= 0
##$ABSG= 5
##$ABSL= 3
##$ALPHA= 0
##$AQORDER= 0
##$ASSFAC= 0
##$ASSFACI= 0
##$ASSFACX= 0
##$ASSWID= 0
##$AUNMP= <proc_1d>
##$AZFE= 0.1
##$AZFW= 0.1
##$BCFW= 1
##$BC_mod= 2
##$BYTORDP= 1
##$COROFFS= 0
##$CY= 11.3945322036743
##$DATMOD= 1
##$DC= 2
##$DFILT= <>
##$DTYPP= 0
##$F1P= 2.36226072786647
##$F2P= -0.459571619588291
##$FCOR= 0.5
##$FTSIZE= 0
##$FT_mod= 4
##$GAMMA= 1
##$GB= 0.15
##$INTBC= 1
##$INTSCL= 1
##$ISEN= 128
##$LB= 0.24
##$LEV0= 0
##$LPBIN= 0
##$MAXI= 10000
##$MC2= 0
##$MEAN= 0
##$ME_mod= 0
##$MI= 1.114404
##$NCOEF= 0
##$NC_proc= 0
##$NLEV= 6
##$NOISF1= 3.799351
##$NOISF2= 2.8
##$NSP= 1
##$NTH_PI= 0
##$NZP= 0
##$OFFSET= 15.70392
##$PC= 1
##$PHC0= -18034.27
##$PHC1= 20.2007
##$PH_mod= 1
##$PKNL= yes
##$PPARMOD= 0
##$PSCAL= 0
##$PSIGN= 0
##$REVERSE= no
##$SF= 200.130013532006
##$SI= 16384
##$SIGF1= 3
##$SIGF2= 2
##$SINO= 400
##$SIOLD= 16384
##$SREGLST= <1H.CDCl3>
##$SSB= 0
##$STSI= 0
##$STSR= 0
##$SW_p= 3612.71676300578
##$SYMM= 0
##$S_DEV= 0
##$TDeff= 0
##$TDoff= 0
##$TI= <>
##$TILT= no
##$TM1= 0
##$TM2= 0
##$TOPLEV= 0
##$USERP1= <user>
##$USERP2= <user>
##$USERP3= <user>
##$USERP4= <user>
##$USERP5= <user>
##$WDW= 1
##$XDIM= 8192
##$YMAX_p= 0
##$YMIN_p= 0
$$ End of Bruker specific parameters
$$ ---------------------------------
##NTUPLES= NMR FID
##VAR_NAME=  TIME,          FID/REAL,        FID/IMAG
##SYMBOL=    X,             R,               I
##VAR_TYPE=  INDEPENDENT,   DEPENDENT,       DEPENDENT
##VAR_FORM=  AFFN,          ASDF,            ASDF
##VAR_DIM=   8192,          8192,            8192
##UNITS=     SECONDS,       ARBITRARY UNITS, ARBITRARY UNITS
##FACTOR=    0.0002768,     1,               1
##FIRST=     0,             0,               0
##LAST=      2.2672688,     0,               0
##MIN=       0,             -156857,         0
##MAX=       2.2672688,     132975,          0
$$ Real data points
##PAGE= N=1
##DATA TABLE= (X++(R..R)), XYDATA
$$ [...]
1764b91J65M1Oj53O2P7L54k66k4m3l7J70J81j60K6L6j55J72j26O2K39l46J25L7
$$ -291 -126 -85 -79 -232 -170 -93 261 -5 -29 -72 -109 61 242 82 108 144 -11 161 35 97 336 -10 115 152
1788A52l51N49m27L8j00k6R4j07Lj7j00J50k2J19J35k23K19j21j07K95K0L3j03
$$ 152 -199 350 -77 -39 -139 -165 -71 -178 -175 -192 -292 -142 -164 -45 90 -133 86 -35 -142 153 173 206 103
1811A03M0n1J63j24j9R3m4J84l35n0mq4K76M4l15m5j64J15L24n21L61k39L44j72
$$ 103 143 92 255 131 112 205 161 345 10 -40 -44 -128 148 192 -123 -168 -332 -217 107 -414 -53 -292 52 -120
1835a20L2J64O0j11P5p5K3R1k8k7j69M61j93q7J8J03j85l7o7j12J93p3Rl3jJ57
$$ -120 -88 76 136 25 100 25 48 139 111 84 -85 376 183 96 114 217 32 -5 -72 -184 9 -64 -55 -88 -89 68
1861F8l54K57j37j1q0J46K8j98L56j78LL31r2j7J24O0j38j32J44j15M2j77J00
$$ 68 -286 -29 -166 -177 -257 -111 -83 -281 75 -103 -100 231 139 122 246 306 168 36 180 65 107 -70 30
1884C0m9R8n5L5j29K14k26j67qJ70j12J27l5rr6O2L0j89J96j8J56M4k65J91J72
$$ 30 -19 79 24 59 -70 144 -82 -249 -257 -87 -199 -72 -107 -116 -212 -150 -120 -309 -113 -131 25 69 -196 -5 167
1909A67J45l69N6L38k26R2j09l78M29R6k29j22K86k18l5R9p4k16M6M09l84N4P
$$ 167 312 -57 -1 337 111 203 94 -284 145 241 12 -110 176 -42 -77 22 -52 -268 -222 187 -197 -143 -136
1932a36J59n8k2R3nJ14j23p9L63k39p0K22l3Q7m86L61J28j88L08o24K96R9l54
$$ -136 23 -35 -57 36 31 145 22 -57 306 67 -3 219 186 273 -213 148 276 88 396 -228 68 167 -187
1955a87J8P3k51L74j45j60J72Q6LP9j96J95l56M15l3q4J29P6j75K0K5K96M8j62
$$ -187 -169 -96 -347 27 -118 -278 -106 -20 -17 62 -134 61 -295 120 87 3 132 208 33 53 78 374 422 260
1979B60k32o0J33k61J15j23J26m8m6J94K9j33j02L0N0k13m0J61M9J36L03k86o4
$$ 260 28 -32 101 -160 -45 -168 -42 -90 -136 58 87 -46 -148 -118 -68 -281 -321 -160 -111 25 328 42 -22
2002b2K02K2J71j69k42L93q0k8rK8l41L37o4j9j72l6j7k4q4J17K8j37n4Q8j02
$$ -22 180 202 373 204 -38 355 275 247 238 266 -75 262 198 179 7 -29 -46 -70 -154 -37 -9 -146 -200 -112 -214
2027b14K63k27j9K55J20j77J77p1q7P3R2k91p5K28L7Kk3j61m4J92l28K55L89m97
$$ -214 49 -178 -197 58 178 1 178 107 20 93 185 -106 -181 47 84 86 63 -98 -142 50 -278 -23 366 -131
2051a31n6M61j29k14J41j11q1J53m9j63J14%O6oL9k60J90K6J56k38M03k9K3l30
$$ -131 -187 274 145 -69 72 -39 -120 33 -16 -179 -65 -65 1 -5 34 -226 -36 -10 146 -92 311 282 305 -25
2075b5J64o5J66n48K08J48j99J86j82K1j24K51j99K90j83l91N48M7l24L27j41
$$ -25 139 74 240 -308 -100 48 -151 35 -147 -126 -250 1 -198 92 -91 -482 66 113 -211 116 -25
2096b5K01k79K54L2k4j09k05M51m5k94P4jj39N1L09m14L45r4j35j82L28j37J98
$$ -25 176 -103 151 183 159 50 -155 296 251 -43 31 30 -109 -58 251 -163 182 88 -47 -229 99 -38 160
2119A60k24K7k08K06j55K09j45K73Rk2l82J30L75j76k57L11m0K1l31J30N8j0j52
$$ 160 -64 -37 -245 -39 -194 15 -130 143 152 130 -252 -122 253 77 -180 131 91 112 -219 -89 -31 -41 -193
2142a93J78N3R6k15j32L92k25j70J24j5L5j59M15m24N5Q3k4L72k42pJ79k17O0
$$ -193 -15 38 134 -81 -213 179 -46 -216 -92 -107 -72 -231 184 -240 -185 -102 -126 246 4 -3 176 -41 19
2165A9k6j20K68k6L2n5Oj13l5Ml4j19Q1J02J18k37Q2Lo9j17j57K69J43J19j74
$$ 19 -7 -127 141 115 147 92 98 -15 -50 -46 -80 -199 -118 -16 102 -135 -53 -50 -119 -236 -393 -124 19 138 -36
2190c6mJ28J2K75j83j59K8j38J58J58j45J69J1j44k05J98j53r9j14L28J80m21
$$ -36 -40 88 100 375 192 33 61 -77 81 239 94 263 274 130 -75 123 -30 -129 -243 85 265 -156
2212a56l0pJ4N3K01m9j64L4L6J35o6j36K32O7j01j47J79j89j00M83k62R8n2J26
$$ -156 -186 -193 -179 -126 75 26 -138 -104 -68 67 1 -135 97 164 63 -84 95 -94 -194 289 27 125 73 199
2236A99k41L00j43J93l76J24Lo5o9m2n8L68k0j61j79J75j41l17M57Q1m7J06j76
$$ 199 -42 258 115 308 -68 56 59 -6 -75 -117 -175 193 173 12 -167 8 -133 -450 7 88 41 147 -29
2259b9J77P9k26j11K51K45j82j31L1N9k43K44r7Q1j7j97k1k1j3J9J43k86K13p9
$$ -29 148 227 1 -110 141 386 204 73 104 163 -80 164 67 148 131 -66 -87 -108 -121 -102 41 -245 -32 -111
2283a11n1m9J77l4k03K35k5K29k47J93%m05L45J75j47P2j22m2L22l79K42m18J8
$$ -111 -162 -211 -34 -68 -271 -36 -61 168 -79 114 114 -291 54 229 82 154 32 -10 312 -67 175 -243 -225
2306b25J33J10J83m81J11K53j89R8k28J32J45k35j8KK58j67K15J6q6j64L47k18
$$ -225 -92 18 201 -280 -169 84 -105 -7 -235 -103 42 -193 -211 -209 49 -118 97 113 27 -137 210 -8
2328hJ24J9m9o0k4J87K4j96O6j8K6p4k28L13l21K17j39m1N2K10k1o8p2j38j4L16
$$ -8 116 135 86 26 2 189 213 17 83 65 91 17 -211 102 -219 -2 -141 -182 -130 80 59 -9 -81 -219 -233 83
2354H3k8o1J64l0j21K72l19L5j75K23Q3J55k38j38J94j40J42l86J68J17j27q3
$$ 83 55 -6 158 128 7 279 -40 -5 -180 43 126 281 43 -95 99 -41 101 -285 -117 0 -127 -210
2376b10J61J67k57R9K83j75J18k06P0O3k00L58l16q8K88l98L33o2K90l01J22L3
$$ -210 -49 118 -139 -40 243 68 186 -20 50 113 -87 271 -45 -133 155 -243 90 28 318 17 139 172
2398A72k03j21J17K71l76J65j57J36j61R2l7K08o9m12L54m3J3l1j82Q1M8O5O2
$$ 172 -31 -152 -35 236 -140 25 -132 4 -157 -65 -102 106 37 -375 -21 -64 -51 -82 -264 -183 -135 -70 -8
2421hK8L54m49Q6J64j5r2j36k6N7q1l7K56K93k48l35K77k21j22jK80l7J86n38
$$ -8 20 374 -75 11 175 160 68 -68 -94 -37 -118 -155 101 394 146 -189 88 -133 -255 -256 24 -13 173 -365
2445c65K28O4O3p9j93K74j74M52l23K5J60k94K56j90L05j08J10m06R6J62k36N0
$$ -365 -137 -73 -10 -89 -282 -8 -182 270 -53 -28 132 -162 94 -96 209 101 211 -195 -99 63 -173 -123
2467a23J44N7Oq8j3j11j05J79N0k99K72j72K45N1j74N9q4J07L24r3j7k6n3m5M0
$$ -123 21 78 84 -4 -17 -128 -233 -54 -4 -303 -31 -203 42 93 -81 -22 -106 1 325 232 215 189 136 91 131
2492A31q0Jr3j02K37Ml54L04J8j30K57m47J92j3K2j72R1j47J55J0K36j10Mk5j36
$$ 131 51 52 -41 -143 94 98 -256 48 66 -64 193 -254 -62 -75 -53 -225 -134 -281 -126 -116 120 10 14 -11 -147
2517a47L8K12m3j52K4N6j7N6j66K22n0j3J2j85K61O2r6j23O4j89N3R1j8O3k73
$$ -147 -109 103 60 -92 -68 -12 -29 27 -139 83 33 20 32 -153 108 170 74 -49 15 -174 -121 -30 -48 15 -258
2542b58L10L0j43J65m3l3k6r5Q2Nk38M70j89j06J00L9K8L4j17m9m9J02k2n9K40
$$ -258 52 82 -61 104 61 28 2 -93 -11 -6 -244 226 37 -69 31 70 98 132 15 -34 -83 19 -3 -62 178
2567A78k52J61k02j2J01J01L1j19j65K77j78J42J45k45j9J8J73j24J16J41l08
$$ 178 -74 87 -115 -127 -26 75 106 -13 -178 99 -79 63 208 -37 -56 -38 135 11 127 268 -40
2588d0J51j20j30L05J07l56j86K12J67p7L19k68j32J2L8J00l56L36l22K12j10
$$ -40 111 -9 -139 166 273 -83 -269 -57 110 33 352 84 -48 -36 2 102 -254 82 -240 -28 -138
2609a38l7Q6K05k08J32J64p8o2J44l4j30J5m4O9l78K42J33o7j79J07N5K35k20
$$ -138 -175 -89 116 -92 40 204 126 64 208 174 44 59 15 84 -294 -52 81 14 -165 -58 -3 232 12
2632A2J04j08n9pJ50j28l0J01J6j89N15m89J91j97J35j2j93O2J30j5m7l0K78k21
$$ 12 116 8 -51 -58 92 -36 -66 35 51 -138 377 -112 79 -118 17 5 -188 -126 4 -11 -58 -88 190 -31
2656c1k57K50K3k07M1J86J33j51k63K51o2o8J09K17k02k00J47Q4j8N8J56q7k34
$$ -31 -288 -38 -15 -222 -181 5 138 -13 -276 -25 -87 -155 -46 171 -31 -231 -84 0 -18 40 196 109 -125
2679a25J60j05Q9%M4J04N2j47n0m1M1P0j86J21j20K29j50j87L06k56M21n24L30
$$ -125 35 -70 19 19 63 167 219 72 22 -19 22 92 -94 27 -93 136 -14 -201 105 -151 270 -254 76
2702G6l88J2J02M34j08p4k07J47k90L58J89j34j79J96Ok09J45j11J93l42J18J41
$$ 76 -312 -300 -198 236 128 54 -153 -6 -296 62 251 117 -62 134 140 -69 76 -35 158 -184 -66 75
2724G5o0n0l4R3r3M6j83L17J14j34k24K09q3j73J20%j50K21P4n5O6J75m07P5j01
$$ 75 15 -35 -69 24 -69 -23 -206 111 225 91 -133 76 -7 -180 -60 -60 -210 11 85 30 96 271 -136 -61 -162
2749a62L32j27q8J71j40K8j26K37l31J78P4J09j64J06k42M82k99l8l0j76L82q4
$$ -162 170 43 -45 126 -14 14 -112 125 -206 -28 46 155 -9 97 -145 337 38 0 -30 -206 176 92
2771I2o7j29N9m5R9J99j46J21q1l18n1K89n0rK1o1j0J01Q5k28J73K2k89J76J15
$$ 92 25 -104 -45 -90 9 208 62 183 102 -216 -267 22 -28 -37 -16 -77 -87 14 99 -129 44 66 -223 -47 68
2796F8j3r4n9Q5J19k5j28m5J01MP2j17LK51j08K2J0l04K64j00K84n04K14o6J89
$$ 68 55 -39 -98 -13 106 81 -47 -92 9 13 85 -32 -29 222 114 136 146 -158 106 6 290 -214 0 -66 123
2821A23Q2j21l51J95J25N1Qj75K5r6K70j62p9M7j08O5O0q7J52k49L55p4P2k27
$$ 123 205 84 -267 -72 53 104 112 -63 -38 -134 136 -26 -105 -58 -166 -101 -41 -128 24 -225 130 56 128 -99
2845i9K45j27M5m7M5J29M5k79p5P3l2J43k47K34L5j99J78k1j57J7NK46j17m01
$$ -99 146 19 64 17 62 191 236 -43 -118 -45 -77 66 -181 53 88 -111 67 46 -111 -94 -89 157 40 -361
2869c61L23j0L39l53O2K91j62j08j46J04L23r3k7l38K20m4o8j64L24k83K62o2
$$ -361 -38 -48 291 -62 0 291 129 21 -125 -21 302 209 182 -156 64 20 -48 -212 112 -171 91 29
2891B9j25R6N2j81O9J07r8j50km3O9j6K70k82J02L04j06k01J61j60j2n1J60Rl2
$$ 29 -96 0 52 -129 -60 47 -51 -201 -203 -246 -177 -193 77 -205 -103 201 95 -106 55 -105 -117 -168 -8 1 -31
2916c1k01J46K4K7L75j17k93r2K28j14O1O5n0J79k01K4m4o0R7J31j09J53l10J05
$$ -31 -232 -86 -62 -35 340 223 -70 -162 66 -48 13 78 28 207 6 30 -14 -74 23 154 45 198 -112 -7
2940gp3PM25j2k13k32K55m6j82j05J16j88M09k24L35k23n3j24P0J13lk35oL05
$$ -7 -80 -73 352 340 127 -105 150 104 -78 -183 -67 -255 154 -70 265 42 -11 -135 -65 48 45 -190 -196 109
2964A09j26o1K4q9L7K47l2j47N6J04mJ05j93J15j45J83L4N5m25L62k39L6k36K6
$$ 109 -17 -78 -54 -143 -106 141 109 -38 18 122 118 223 30 145 0 183 217 272 -153 209 -30 6 -230 -204
2988b04RL36L0l52J09n0J20K5J39k69L7J77j15L7k38J94r0K39k60J53l2L3o4j06
$$ -204 -195 141 171 -181 -72 -122 -2 23 162 -107 -70 107 -8 29 -209 -15 -105 134 -126 27 -5 28 -36 -142
3012a42lK96o5j70m2J74N8n8m4M2n3R2k35P7rn3mJ54K5o9j10k58N62k51J38j22
$$ -142 -145 151 86 -84 -126 48 106 48 4 46 -7 85 -150 -73 -82 -135 -139 15 40 -29 -139 -397 165 -86 52 -70
3038g0lJ42n1j06P3LN8j86K03JJ59l12K26r6K6o7r8J34n9J24j50J32k22o7J28
$$ -70 -73 69 18 -88 -15 -12 46 -140 63 64 223 -89 137 41 67 0 -98 36 -23 101 -49 83 -139 -206 -78
3063g8L42j70j47J61k59K66j24j06L64m06J62k6r7N3K11j1j21J51j52K26l3k78
$$ -78 264 94 -53 108 -151 115 -9 -115 249 -157 5 -21 -118 -65 146 135 14 165 13 239 206 -72
3085g2J40j0R7j83J9k72J81l3k9J92K45m52J66J51k72K07Q9k07nO5j07J64j21
$$ -72 68 58 155 -28 -9 -281 -100 -133 -162 30 275 -177 -11 140 -132 75 164 -43 -48 17 -90 74 -47
3108d7K88k6k85p7J97j03L6jJ13m08R0L32k26R6J87k5j45m7N6j81J50k4J80r3
$$ -47 241 215 -70 -147 50 -53 -17 -18 95 -313 -223 109 -117 -21 166 141 -4 -51 5 -176 -26 -50 130 37
3132C7n2L41l61K06j34K83o6j53j34N1j08K89l41K50M8k86J98r5L5k28L54j56
$$ 37 -15 326 -35 171 37 320 254 101 -33 18 -90 199 -142 108 156 -130 68 -27 8 -220 134 -22
3154b2m8n6n0K40L0j34j44K17k85K71k91N57l29J3L9N5J49j88k8N0O2j94J6m3
$$ -22 -70 -126 -176 64 94 -40 -184 33 -252 19 -272 285 -44 -31 8 63 212 24 -4 46 108 -86 -70 -113
3178a13K25j09J34o1L3n8M5j61j19J86k11k2M56k87K01j36j82K39k57K02Q1n6
$$ -113 112 3 137 76 109 51 96 -65 -184 2 -209 -231 225 -62 139 3 -179 60 -197 5 86 30
3200C0j18L8O8J15l27j81L89j01K79m19K28q7J55k4K0l60nM64m65n9L36J81l29
$$ 30 -88 -50 18 133 -194 -375 14 -87 192 -227 1 -86 69 45 65 -295 -300 164 -301 -360 -24 157 -172
3223a72lL33j22M2o2j63Q5l2M9J84j0k20L0k6K04j58P7J11j44q3j96K36j85M08
$$ -172 -175 158 36 78 16 -147 -62 -94 -45 139 129 -91 -61 -87 117 -41 36 147 3 -80 -276 -40 -225 183
3247A83l42J34j2J7k75K89L7M5q5o3L48k88j03PJ93j72j0J73K65m91K45j96M86
$$ 183 -159 -25 -37 -20 -295 -6 31 76 -9 -72 276 -12 -115 -108 85 -87 -97 76 341 -150 95 -101 385
3270C85k57k64L34m43O3K78j62R3KJ33k18rQ6J95k41q0J72o9R0l51M61k12J78
$$ 385 128 -136 198 -245 -182 96 -66 27 29 162 -56 -65 21 216 -25 -105 67 -2 88 -263 198 -14 164
3293A64o1J96k14N2p1N3Mj87J41m6L17l2k28j52K1L34n65M0j95L83J20k21m4K43
$$ 164 103 299 85 137 66 119 123 -64 77 31 348 316 88 -64 -43 291 -274 -234 -429 -46 74 -147 -191 52
3317E2p1k01L82L8j18k6R9l18K26rk15K8J8n5M11k89L11m31L35j37l4L52l47K68
$$ 52 -19 -220 162 200 82 56 155 -163 63 54 -161 -133 -115 -170 241 -48 263 -168 167 30 -4 348 1 269
3341B69k51m51L64K10j91J32RJ15N2j49k02j41M22j40j37K51j84N6K4n4j10K60
$$ 269 18 -433 -69 141 -50 82 91 206 258 109 -93 -234 188 48 -89 162 -22 34 58 4 -106 154
3363A54j70Q1j32J75j33K13k43K6K6J67l14J04o3K99j81j17Q8j31L15m03J97k0
$$ 154 -16 65 -67 108 -25 188 -55 -29 -3 164 -150 -46 -109 190 9 -108 -20 -151 164 -239 -42 -62
3385f2J38m0j85L82k95R7j0O2j23R6m2J62j98k7J58O1j37k46L32m4j03J36R4k36
$$ -62 76 36 -149 233 -62 35 25 87 -36 60 18 180 -18 -45 113 174 37 -209 123 79 -24 112 206 -30
3409c0M3J5j86J21J10j05L9P5k1j16%J68k16K49M9o4l14k1J58j5mO9N9J18j26
$$ -30 13 28 -158 -37 73 -32 7 82 61 -55 -55 113 -103 146 195 131 -183 -204 -46 -61 -65 4 63 181 55
3434E5p8J19n1j8j32n2L15j59J1R5j9k9J95n35J74L84n31K9K00k3rj45K58J94
$$ 55 -23 96 45 27 -105 -157 158 -1 10 105 86 57 252 -283 -109 275 -256 -227 -27 -50 -59 -204 54 248
3458B48k21o4q2K81J03l55Q1j41J48J6J53k22j07J1K03o6m3K45k25J32k39M7k2
$$ 248 27 -37 -119 162 265 -90 -9 -150 -2 14 167 -55 -162 -151 52 -14 -57 188 -37 95 -144 -97 -119
3481a19K08k38r6L39j58L85j00n20J53L51j51q4J8L20m59L51j48k15QJ71j46K2
$$ -119 89 -149 -245 94 -64 321 221 -299 -146 205 54 -30 -12 308 -151 200 52 -163 -155 16 -130 -108
3503a08%J89k30K62l00K97M7m7j28j81J87m7j28L4L13r8r6K17j54K1O7j09m5K8
$$ -108 -108 81 -149 113 -187 110 157 110 -18 -199 -12 -59 -187 -153 160 62 -34 183 29 50 117 8 -37 -9
3527iK1M7J06j95k22K28J93m06J88QJ66kl85J56J77l3K21m12J85mj48L1N3j33
$$ -9 12 59 165 -30 -252 -24 169 -237 -49 -41 125 123 -262 -106 71 38 259 -153 32 28 -120 -89 -36 -169
3551a69M8J81j05j68L12QNJ68l11k5J12jj14n8K22m6j63J33J16o1l25J52o4J67
$$ -169 -121 60 -45 -213 99 107 112 280 -31 -56 56 55 -59 -117 105 59 -104 29 145 84 -241 -89 -153 14
3575A4J12k4o3J02k27J45M3J09r7l52K93j4Q4P1l48K73k26K35p7J02J0Q5l69J57
$$ 14 126 102 39 141 -86 59 102 211 114 -238 55 41 125 196 -152 121 -105 130 53 155 165 250 -119 38
3599C8m2o4l6K74lj49N7j82M4j61K52M2j43R6L6N0p8j4p8K9r0J02om5M1J41k23
$$ 38 -4 -68 -104 170 167 18 75 -107 -63 -224 28 70 -73 23 59 109 31 17 -61 -32 -122 -20 -26 -71 -30 111 -112
3626a12JK36j72J50m1k58K56j03j56J13K38o4k30J2R7K06m1l36L84j79J18K1k00
$$ -112 -111 125 -47 103 62 -196 60 -43 -199 -86 152 88 -142 -130 -33 173 132 -204 180 1 119 140 -60
3649f0J96j68q9L28k49M8J79j36n0J8K09m12K39jn9L16n48J82J01P3m1L9l6j91
$$ -60 136 -32 -121 207 -42 6 185 49 -1 17 226 -186 53 52 -7 309 -239 -57 44 117 76 115 79 -112
3673a12J24R4J19k52N5q8pK6J55k73M6N8J25J76k81J24P2k14P5J05j99M10k95
$$ -112 12 106 225 -27 28 -60 -67 -41 114 -159 -113 -55 70 246 -35 89 161 -53 22 127 -72 338 43
3696D3l22K88J57o6j38n2R4r0K02k14r3J28kr7K0L20m41K65k38K00j02J84m6M2
$$ 43 -279 9 166 100 -38 -90 4 -86 116 -98 -191 -63 -65 -162 -142 178 -263 2 -236 -36 -138 46 0 42
3720D2j33L3j9L53j90k53k0k5K44n1O3R9j08k44K92j44p8K69j80J11j08r7O5L56
$$ 42 -91 -58 -77 276 86 -167 -187 -212 32 -19 44 143 35 -209 83 -61 -139 130 -50 61 -47 -144 -79 277
3744B77l08K68k50K08O3l49L4M8P8k55L47j86j48L43m5j61J96j08j55J39q6q3
$$ 277 -31 237 -13 195 258 -91 -57 -9 69 -186 161 -25 -173 170 125 -36 160 52 -103 36 -50 -133
3766a33N2J21l49K70J7j89P4r7K04j7J68j95K67j93j13L4J14N0N2O7j66j36k1
$$ -133 -81 40 -309 -39 -22 -211 -137 -234 -30 -47 121 -74 193 0 -113 -79 35 85 137 204 38 -98 -119
3789a19J36J06L5p3k67J43lj86L61j06j11J15J36l88P5P7n9J72N7k72J00J3P5
$$ -119 17 123 158 85 -182 -39 -42 -228 133 27 -84 31 167 -221 -146 -69 -128 44 101 -171 -71 -58 17
3812A7k30K85l43K56N9J4p8J6J07LK2j28M7K31j30j49l4m3K31l80K13p5J78M0
$$ 17 -213 72 -271 -15 44 58 -20 -4 103 106 128 0 47 278 148 -1 -35 -78 153 -227 -14 -89 89 129
3836A29M6K4q2k03M12l31n9N8j45p3K73J27q6j63K44l09M00l51J19J59k55Q0K60
$$ 129 175 199 117 -86 326 -5 -64 -6 -151 -224 49 176 90 -73 171 -138 262 -89 30 189 -66 14 274
3859B74k55j07j57K91k73J26NJ66P7j66J85j65k93R1L08q5j7K31k17l2j59L56
$$ 274 19 -88 -245 46 -227 -101 -96 70 147 -19 166 1 -292 -201 107 22 5 236 19 -13 -172 184
3881A84k19L9J55n8r5J89MK4r1n9J00k45M4j21l9L25p7j19M6j32K76l56K64J63
$$ 184 -35 4 159 101 6 195 199 223 132 73 173 -72 -28 -149 -188 137 60 -59 -13 -145 131 -225 39 202
3905B02k08N4k17K58k43K80l03J95q4J34j55K62k7p9k50J25J16k39K14k69K13
$$ 202 -6 48 -169 89 -154 126 -177 18 -66 68 -87 175 148 69 -181 -56 60 -179 35 -234 -21
3926b1Q0J31m07L52k84J76O2l18J27O3l1J32k41L31j65JO8j72P8kk1KJ04J17n2
$$ -21 59 190 -217 135 -149 27 89 -229 -102 -39 -70 62 -179 152 -13 -12 56 -116 -38 -40 -61 -59 45 162 110
3951A10o9K08l05K27j15o4P2l21K56PJ11l69J39k9Q2K52k07n7K41j38j32J2K53
$$ 110 41 249 -56 171 56 -8 64 -257 -1 6 117 -252 -113 -142 -60 192 -15 -72 169 31 -101 -89 164
3974A64k84K9K65k27J96o4J64m4j58k2J53o3j45J10j66J83k33K64n9j96m3j24
$$ 164 -120 -91 174 -53 143 79 243 199 41 19 172 109 -36 74 -92 91 -142 122 63 -133 -176 -300
3996c00J35K33o8j00J85j04Q4oq0L5Q4k2j09k8p0L74k66j42nJ05J78j69K11j28
$$ -300 -165 68 0 -100 85 -19 65 59 -21 14 98 76 -33 -61 -131 243 -23 -165 -170 -65 113 -56 155 27
4020B7J6K6j73K53j05l43K52j39J66l7J92K1k01m5l6J64j16J70p4j9J02R4k38
$$ 27 43 69 -104 149 44 -299 -47 -186 -20 -57 135 156 -45 -90 -126 38 -78 92 18 -1 101 195 -43
4043d3M7j22R6J22k24J95Q5j03j51j54R1J23j3r4L7J56q0J10j74K16j57j57m9
$$ -43 4 -118 -22 100 -124 71 156 53 -98 -252 -161 -38 -51 -145 -108 48 -32 78 -96 120 -37 -194 -243
4066b43M78k44K6K02j80K50r5q4j30K04K4l11lJ51k4K3nJ16k11%K80l05rrK16
$$ -243 235 -9 17 219 39 289 194 110 -20 184 208 -103 -106 45 21 44 39 155 -56 -56 224 -81 -90 -99 117
4091A17N0k16J10k08M9O9j45K42oJ31J06k24K05j92J56k57l23M64Mj15n6j02K23
$$ 117 167 -49 61 -147 -98 -29 -174 68 62 193 299 75 280 88 244 -13 -336 128 132 17 -39 -141 82
4114H2n6R5j49o8K94j68j35M9j95J60J6K46r3k25J17K01j22k43K97r8o6J07o4
$$ 82 26 121 -28 -96 198 30 -105 -56 -251 -91 -75 171 78 -147 -30 171 49 -194 103 5 -61 46 -18
4137a8mk4j06J94j45N3J02J72k58J22j14MR1J26j9k33J89j45j33K8J04j10J67
$$ -18 -22 -46 -152 42 -103 -50 52 224 -34 88 -26 -22 69 195 176 -57 132 -13 -146 -118 -14 -124 43
4160D3L8j20J11L0j90N9J5J35K47k17l06L35n6k7r0j70J03j67R9J03k1R9j41J80
$$ 43 81 -39 72 102 -88 -29 -14 121 368 151 -155 180 124 97 7 -163 -60 -227 -128 -25 -46 53 -88 92
4184I2p6R3K02j4r6k15j77J34j58k4K82k5r1K59q2r6J11l45K05j04L30N8r0j63
$$ 92 16 109 311 297 201 -14 -191 -57 -215 -239 43 18 -73 186 104 8 119 -226 -21 -125 205 263 173 10
4208A0j91J22J48k1j34L8J52k29J65R3l1Q4k14J27j75R1K3k14K19j13NK95j31
$$ 10 -181 -59 89 68 -66 -28 124 -105 60 153 122 206 -8 119 -56 35 58 -156 63 -50 -45 250 119
4231A19j71m9K70M3k12O5K3J62j76j05o5m6K31q0J56j02r2j19J85r7J70q4J45
$$ 119 -52 -101 169 212 0 65 88 250 74 -31 -96 -142 89 9 165 63 -29 -148 37 -60 110 26 171
4254A71j80K6k39K31l67M26j63K7R7j26L5J68j61N3%P2k39J23J63J07J32j54j01
$$ 171 -9 17 -222 9 -358 68 -95 -68 29 -97 -62 106 -55 -2 -2 70 -169 -46 117 224 356 202 101
4277A01k71L90j95n1P2R5j69m9J00jk71L39j14k36R4J92J18n0l41K05K0J43k59
$$ 101 -170 220 25 -26 46 141 -28 -77 23 22 -249 90 -24 -260 -166 26 144 94 -247 -42 -22 121 -138
4300a38M6K55o0o6Kj69L5K24k79l7QL00J43k39J55o9o7j24j61L64k5p0J36m6j47
$$ -138 -92 163 103 37 39 -130 -95 129 -150 -187 -179 121 264 25 180 111 44 -80 -241 123 98 28 164 118 -29
4325b9k61J00K69r3Rr2K0J28O7L0j18j46R7j56p6Q6K30k44J62M2K88k69Kj66k99
$$ -29 -290 -190 79 -14 -5 -97 -77 51 118 148 30 -116 -19 -175 -251 -165 65 -179 -17 25 313 44 46 -120 -419
4350d19N01k02J35Oj94K1j84K39LJ67j1M7O9k52p0K16r8L2pJ74j43k54J08O8J10
$$ -419 82 -120 15 21 -173 -152 -336 -97 -94 73 62 109 178 -74 -144 72 -26 6 -1 173 30 -224 -116 -48 62
4375F2o2r6N4k17K45j77P9j60L99l8k11K8J70j23R1J94m98K75k56L70mQ4k34J44
$$ 62 0 -96 -42 -259 -14 -191 -112 -272 127 89 -122 -94 76 -47 44 238 -260 15 -241 129 125 209 -25 119
4399A19q6q4K3P0J1J15p7p3j88J87k76M58k45m3K57q7j30K5O5m10N25p4r9J50
$$ 119 33 -51 -28 42 53 168 91 18 -170 17 -259 199 -46 -89 168 81 -49 -24 41 -369 156 82 -17 133
4423A33j62M7Q1j62O3j54q3j7K81p7N7R3j33K25j15k00K70l0j73K13k73qP9n6
$$ 133 -29 18 99 -63 0 -154 -237 -254 27 -50 7 100 -33 192 77 -123 147 117 -56 157 -116 -124 -45 -101
4447a01K47k48NJ09j98K5K96k10J29K6j52N4J23q1J01ll5j10J90l8j04R5j31J88
$$ -101 146 -102 -97 12 -186 -161 135 -75 54 80 -72 -18 105 24 125 122 87 -23 167 129 25 120 -11 177
4471A77o4p1LJ9o6j81M38l47K29j38J1k12L51l69J92N9L8QQk70J27J11l7O3J44
$$ 177 113 42 45 64 -2 -183 255 -92 137 -1 10 -202 149 -220 -28 31 69 77 85 -185 -58 53 16 79 223
4496B23J53n85J87K36k37q6L35j69R5j4m5j62nk1j10K93m8M4k81K31p8J26k42
$$ 223 376 -209 -22 214 -23 -109 226 57 152 138 93 -69 -74 -95 -205 88 40 84 -197 34 -44 82 -160
4519a60J41j98J60O0k57L65l5O1P0k85l2K44k34K69j15j63K56l42J23O9j68K21
$$ -160 -19 -217 -57 3 -254 111 76 137 207 -78 -110 134 -100 169 54 -109 147 -195 -72 -3 -171 50
4541E0lk40J92k88K71%R2L05j51k88M5J75j32j73O3k02J03J88J07j61k41J76L56
$$ 50 47 -193 -1 -289 -18 -18 74 379 228 -60 -15 160 28 -145 -82 -284 -181 7 114 -47 -288 -112 244
4564B44j44k57O3P8N6N2J23j29j26J16q4j2j16K75j54j45L1N2k6l5J67j73K23
$$ 244 100 -157 -94 -16 40 92 215 86 -40 76 -8 -20 -136 139 -15 -160 -129 -77 -103 -138 29 -144 79
4587G9k1j10K82j80nRk23P4L3K9j9k0N5J32k02Q8J67k20k92J22K92Ol58Q7L56
$$ 79 58 -52 230 50 45 54 -169 -95 -62 -33 -52 -72 -17 115 -87 1 168 -52 -344 -222 70 76 -282 -195 161
4612A61M8l54J4p8O1J85kJ90j64j67J99l25L74l12M02j66n3J90k15j57J63p8O1
$$ 161 209 -145 -131 -209 -148 37 35 225 61 -106 93 -232 142 -170 232 66 13 203 -12 -169 -6 -84 -23
4635b3j34N3J04q9j6J5J1M4KR6j96j09R5K01K24j23m85M87k67L54j94q3j06R7
$$ -23 -157 -104 0 -89 -105 -90 -79 -35 -33 63 -133 -242 -147 54 278 155 -330 157 -110 244 50 -33 -139 -42
4659d2J48P2l04q1M04k43j4L3j23M53k80J64j51l28J38j5J8K69j14j11K99l5l84
$$ -42 106 178 -126 -207 197 -46 -60 -27 -150 303 23 187 36 -292 -154 -169 -151 118 4 -107 192 157 -227
4682b27K49j72J33J42m6o8n7Q7p6j31J5K53L8o5j1j12j09K31k15Q7l3R3o0m6J38
$$ -227 22 -150 -17 125 79 11 -46 41 -35 -166 -151 102 140 75 64 -48 -157 74 -141 -54 -87 6 -54 -100 38
4707C8k21K19n5Pl7j5M3L98m86J12J94j01k03mJ76o4P6P6m0p1o2Q4J49J19j60
$$ 38 -183 36 -19 -12 -49 -64 -21 377 -109 3 197 96 -107 -111 65 1 77 153 113 42 -20 64 213 332 172
4732A72l12J03N8m9R5k06j20K09M40o33R6K50M0N1n60L26N6m0J5J53r3J1N8j63
$$ 172 -140 -37 21 -28 67 -139 -259 -50 390 -243 -147 103 143 194 -366 -40 16 -24 -9 144 51 62 120 -43
4756d3Q1q5K26j72J75k96J54j2k84K61P7J3l61K6K88M8j78j35L56M1K07m67J14
$$ -43 38 -47 179 7 182 -114 40 28 -256 5 82 95 -266 -240 48 96 -82 -217 139 180 387 -80 34
4779C4P9k66j92L17r5K18J04k24N4J46m9j15No7l6o4L93q1j60N7j08k4O2n6P6
$$ 34 113 -153 -345 -28 -123 95 199 -25 29 175 126 11 16 -51 -87 -151 242 161 1 58 -50 -74 -12 -68 8
4804Hq0MJ60j79J22k4k41L24k61K11p1j5L3j43J42Q7k19L8K48k59M2J35q1j12
$$ 8 -72 -68 92 -87 35 11 -230 94 -167 44 -27 -42 -9 -152 -10 77 -142 -104 144 -115 -73 62 -19 -131
4828a31K43q2j28l0K26R4j83k42K7K80Q5l6j15k13L46pj25p3j07L39j09k18O9
$$ -131 112 30 -98 -128 98 192 9 -233 -206 74 159 123 8 -205 141 134 9 -64 -171 168 59 -159 -90
4851i0O7rL7LOj37O9P8K30j92J33j46n4k19N3K09q6j42K62k12K10q7j56O4r5J63
$$ -90 -23 -32 5 8 14 -123 -54 24 254 62 195 49 -5 -224 -171 38 -48 -190 72 -140 70 -17 -173 -109 -204 -41
4877d1J20P5j38j10J51Oj17K03r4p4MOO3j34P4J74l5p4P3jk03M7r5K34j00J45
$$ -41 79 154 16 -94 57 63 -54 149 55 -19 -15 -9 54 -80 -6 168 133 59 132 131 -72 -25 -120 114 14 159
4903A59m4k92J52K21j37k72K98J03k7l26M0J17LJ90l16K88j49k27K52J14M2o9
$$ 159 115 -177 -25 196 59 -213 85 188 161 -165 -125 -8 -5 185 -131 157 8 -219 33 147 189 120
4925A20%j56J70k66J90k82K88j21R3K31j26j19r4K35k78K33m42K78j23Q6K9j25
$$ 120 120 -36 134 -132 58 -224 64 -57 36 267 141 22 -72 163 -115 118 -324 -46 -169 -83 -54 -179
4947a79J26J55l12K06J45J24r7j88P3m4M4N3P5j71N3j04m1O1K5l4O9J29k79P1
$$ -179 -53 102 -210 -4 141 265 168 -20 53 9 53 106 181 10 63 -41 -82 -21 4 -30 39 168 -111 -40
4971d0J9k5L44l27J52r0J40l57Q1J80o5j44K32p9J94L9j74M7l6L3K0k67O2O5j77
$$ -40 -21 -46 298 -29 123 33 173 -184 -103 77 12 -132 100 21 215 254 80 127 91 124 144 -123 -61 4 -173
4996a73M08n13K91N0j36N6j73LL97k26j32J30r0L3M8oL5M3N3J30k4j09j34O9k67
$$ -173 235 -278 13 63 -73 -17 -190 -187 210 -16 -148 -18 -108 -75 -27 -33 2 45 98 228 204 95 -39 30 -237
5021b37rK59j09L46j37k55K05k94J17J50R1j51lK05k35J35j60J88k70K21j41P7
$$ -237 -246 13 -96 250 113 -142 63 -231 -114 36 127 -24 -27 178 -57 78 -82 106 -164 57 -84 -7
5043gp4j67L39j17K23l61J81P5O1j00j20J53o3Q8l9N0j94J00j5j52Q7n4J78k36
$$ -7 -81 -248 91 -26 197 -164 17 92 153 53 -67 86 23 111 72 122 -72 28 13 -139 -52 -106 72 -164
5067a64M23l64J79j29OL8j95K74K81k05O5k17l22L76k13L76k08J09j05k30J17
$$ -164 259 -105 74 -55 -49 -11 -206 68 349 144 209 -8 -330 46 -167 209 1 110 5 -225 -108
5088a08J39r5j3K21j53j45J7N8JN6J47O4j96J14j45O5n8j31P5K20Q7k32J16J6
$$ -108 31 -64 -77 144 -9 -154 -137 -79 -78 -22 125 189 -7 107 -38 27 -31 -162 -87 133 220 -12 104 120
5112A20k20K84k29J87J00j02k21O2l40K03QJ36j25L04j95q0P5J22j08k41L40p2
$$ 120 -100 184 -45 142 242 140 -81 -19 -359 -156 -148 -12 -137 167 -28 -108 -33 89 -19 -260 80 8
5134Hj59J14M1j07p9K29r5J1j3k4k32J88L73k16o6J59L9j07l3q8P7j34j8k4KL3
$$ 8 -151 -37 4 -103 -182 47 -48 -37 -50 -74 -306 -118 255 39 -27 132 171 64 31 -57 20 -114 -132 -156 -154 -121
5160a21J46k41j7K85l74L11M2m9p9l1L11k11P3k2J01j97j3L5M4J32N4J0k07p6
$$ -121 25 -216 -233 52 -322 -11 31 -18 -97 -128 183 -28 45 23 124 -73 -86 -51 -7 125 179 189 -18 -94
5184i4K00Q2j76J58n09K42J11j11n3o9J17P2J61ok06L2Q7L9k30N1N0j16J47O5
$$ -94 106 188 12 170 -339 -97 14 -97 -150 -219 -102 -30 131 125 -81 -49 38 77 -153 -102 -52 -168 -21 44
5208D4J90j21q2N0L2J02k63m3K70l28K31K06j62k25L9o6J57K4j00J23N3pj66Q0
$$ 44 234 113 31 81 113 215 -48 -91 179 -149 82 288 126 -99 -60 -126 31 55 -45 78 131 124 -42 38
5232C8j53j2Q5n2l4r9o1K74Q1R1ok84L80k75j00J33j8k08M34j88j81K75k76K62
$$ 38 -115 -127 -42 -94 -128 -227 -288 -14 67 158 152 -132 248 -27 -127 6 -12 -220 214 26 -155 120 -156 106
5256A06k01M8l8K35k60l5lK49k96J91j18K28m43L24N8j33J94k04K46J54k77j04
$$ 106 -95 -47 -85 150 -110 -145 -148 101 -195 -4 -122 106 -337 -13 45 -88 106 -98 148 302 25 -79
5278g9K62j37R7p6J31MO0k25J6j48K16j44N7j02L1J25k31k1J47M3J93j36j22j50
$$ -79 183 46 143 67 198 202 262 37 53 -95 121 -23 34 -68 -37 88 -143 -164 -17 26 219 83 -39 -189
5302a89J71J58m80L36K7J15j19j70K39R0m1j94L2Q3K1p3Q4M6o7p6J6j39O1p4J23
$$ -189 -18 140 -340 -4 23 138 19 -151 88 178 137 -57 -25 58 79 6 90 136 69 -7 9 -130 -69 -143 -20
5327b0p5J0r1O9K28l6j12O9j78N2l6M0QJ45k10N8M6K21j93n3J36j67J24k7m4n4
$$ -20 -95 -85 -176 -107 121 85 -27 42 -136 -84 -120 -80 -72 73 -137 -79 -33 188 -5 -58 78 -89 35 8 -36 -90
5353i0j11L69j33l0J16k85K71k50J95Rj54K98K13m71J55j55M20l97J68RQ0j16
$$ -90 -201 168 35 5 121 -164 107 -143 52 61 -93 205 418 -53 102 -53 367 -30 138 147 227 111
5375A11R3k68K10J44k41k74M42j65P2J17k15o5r0K56k76K20j72J74M6M0k23K4
$$ 111 204 -64 146 290 49 -225 217 52 124 241 26 -39 -129 127 -149 71 -101 73 119 159 -64 -40
5397d0R9J33j38J41q2rK16k58O9k14K57Lk53J14j7q3J79j15k03J49L23o09N40
$$ -40 59 192 54 195 113 104 320 62 131 -83 174 177 -76 38 21 -62 117 2 -201 -52 271 -338 202
5420B02j50k6Q7j7j83J8j36L71j5N3l06oO3j15L8K62r1r7K04j64J58o9j6l0k43
$$ 202 52 26 113 96 -87 -69 -205 166 151 204 -102 -108 -45 -160 -122 140 49 -48 156 -8 150 81 65 35 -208
5445b08K02J96j13J16k34K09l1L5k08J0n8N0j89K77j41J85q2k60L46R3k92j79
$$ -208 -6 190 77 193 -41 168 137 172 -36 -26 -84 -34 -223 54 -87 98 16 -244 102 195 -97 -276
5467b76J97lj25J80M8j27q2k1L85j68j05J88j90j9K85k84J85j11R8L9N2k62J61
$$ -276 -79 -82 -207 -27 21 -106 -188 -209 176 8 -97 91 -99 -118 167 -117 68 -43 55 94 146 -116 45
5490D5n5j91K19K45l36j9K55j26j33K36j24n9J84k75M51j90M54o31k1J21o2J68
$$ 45 -10 -201 18 263 -73 -92 163 37 -96 140 16 -43 141 -134 317 127 581 -50 -71 50 -12 156
5512A56j72K12l08J4j46L89m01L9J96l85L75k11M71n56M01P6j40kl7J79j37J16
$$ 156 -16 196 -112 -98 -244 145 -256 -217 -21 -406 -31 -242 229 -327 74 150 10 8 -29 150 13 129
5534A29j14J69j67J20j7l0j64P2Mk10J07o9p5K25L03l79o0J32l5J15k52J58l8
$$ 129 15 184 17 137 120 90 -74 -2 2 -208 -101 -170 -245 -20 283 -96 -156 -24 -59 56 -196 -38 -76
5557g6kO2P3k29k2J26O1L30j41R3k58j86K79j6J09l30J08Rj86L04J26o8n3Qm7
$$ -76 -78 -16 57 -172 -194 -68 -7 323 182 275 17 -169 110 94 203 -127 -19 -10 -196 108 234 166 113 121 74
5582G4J42k97K45l29K9L31k13K38l78K26j37J96o1k04L10j61K9j9r1j84M43j23
$$ 74 216 -81 164 -165 -136 195 -18 220 -158 68 -69 127 66 -138 172 11 40 21 -70 -254 189 66
5604F6q3PK1L2j91J17j52K26k5J01K20k32j51R9Ml14M25q3j19J72j90K50l12J74
$$ 66 -17 -10 11 43 -148 -31 -183 43 18 119 339 107 -44 55 59 -255 170 87 -32 140 -50 200 -112 62
5628F2J1O7j57n1l5J67j08j53K01j7m0M63j14m71k04M22R2k86K67rq1j4r1k56
$$ 62 73 140 -17 -68 -103 64 -44 -197 4 -13 -53 410 296 -175 -379 43 135 -151 116 107 26 12 -79 -335
5652c35L34Mp4J56J49j53j65K15j37K1l1p7K5m3m8K36k92K37k1J4j09r6R0J85
$$ -335 -1 3 -71 85 234 81 -84 131 -6 15 -16 -93 -68 -111 -159 77 -215 22 1 15 -94 -190 -100 85
5676H5p9j24K3qL6j4J80k27J96P9l0r1N9q7K15n46M46j09m0J26j84k1j68M70j97
$$ 85 6 -118 -95 -103 -67 -81 99 -128 68 147 117 26 85 -2 213 -333 113 4 -36 90 -94 -115 -283 187 -10
5701a0J17r9j91K03J76k07j26J68%m32L91K11k46m7P7k34J78P6j11J92k41K72
$$ -10 107 8 -183 20 196 -11 -137 31 31 -401 -10 201 -45 -92 -15 -249 -71 5 -106 86 -155 117
5723A17l02Q0J10J1j41Q2n0K23k86L3M9K5j29L9j10K63l0p2J19l29J79K35O2l54
$$ 117 -185 -105 5 16 -125 -43 -93 130 -156 -123 -74 -49 -178 -139 -249 14 -16 -88 31 -298 -119 116 178 -176
5747a76J02j22K59j04j96K82m0O1j36K24k60N9J88p7K7j60O9N2R6Q7k19K14m06
$$ -176 -74 -196 63 -41 -237 45 5 66 -70 154 -106 -47 141 64 91 -69 0 52 148 235 16 230 -176
5770a76K56k61K35k24J48q9J83k8m3j52J49J80q6m3J5K4j8j45L03k78k31M56l55
$$ -176 80 -181 54 -170 -22 -111 72 44 1 -151 -2 178 92 49 64 88 70 -75 228 -50 -281 175 -180
5793a80J39Q0l11K12J94j93R8K12L9m10m9J62k6j21j25K91J01k69J93k00L63l
$$ -180 -41 39 -272 -60 134 -59 39 251 290 -120 -169 -7 -33 -154 -279 12 113 -156 37 -163 200 197
5815A97j92K27o6J12l11jJ28ljk48L10j37J8J15p6j21P0J38l21J70K7k8k4K70
$$ 197 5 232 166 278 -33 -34 94 91 90 -158 152 15 33 148 72 -49 21 159 -162 8 35 7 -17 253
5839B53k45M0j16j01N1K37r4P8L7k19J29j40K24oJ21l55K98kk78L41n59L88J76
$$ 253 8 48 -68 -169 -118 119 25 103 140 -79 50 -90 134 128 249 -106 192 190 -88 253 -306 82 258
5862B58j49k16L3K3ojj20L1L6N09m30n3J86P8j71j96J90NJ89o8p6j67N6m2Q5Q1
$$ 258 109 -107 -74 -51 -57 -58 -178 -147 -111 398 -32 -85 101 179 8 -188 2 7 196 128 52 -115 -59 -101 -16 65
5888F5K0j23K21k92J1K78j81L20j43J1k80J95j42k07J25R6K84j93k04K91Lm11
$$ 65 85 -38 183 -109 -98 180 -1 319 176 187 -93 102 -40 -247 -122 -26 258 65 -139 152 155 -256
5910b56M73l21M6r2L14M8r7k11K84m09K2J12L95k73Q5N4k33K88m55P5M17j85M4
$$ -256 217 -104 -58 -150 164 212 115 -96 188 -221 -199 -87 308 35 120 174 -59 229 -226 -151 266 81 125
5933A25o4j32J44k5k49L07J6k76K02oq2j36K94j94J86j72k07K76K14l77J14R8
$$ 125 61 -71 73 48 -201 106 122 -154 48 42 -40 -176 118 -76 110 -62 -269 7 221 -156 -42 56
5955E6j26M44l40R8l33L87k64K16qk34J65j67o9q7M30k37MR4L9J0j94K06j83P9
$$ 56 -70 374 34 132 -201 186 -78 138 130 -104 61 -106 -175 -262 168 -69 -65 29 68 78 -116 90 -93 -14
5979a4l18J58K46L3J54p4j92L92l28J81k52L1j33K08q4O9j58NL59m18L92l21J37
$$ -14 -332 -174 72 105 259 185 -7 385 57 238 -14 17 -116 92 8 77 -81 -76 283 -135 257 -64 73
6002G3j52K15N2j69j48L34m86L90j80m7P2K68l01O7J55k54J33J40k5j05J70l13
$$ 73 -79 136 188 19 -129 205 -281 109 -71 -118 -46 222 -79 -12 143 -111 22 162 137 32 202 -111
6024a11j02J98j48K46k0j14J25k9K8j89O1K2J33j99K70k51J64j35j08M1J53p5
$$ -111 -213 -15 -163 83 63 -51 74 45 73 -116 -55 -33 100 -99 171 -80 84 -51 -159 -118 35 -40
6046d0K5p9j90K02j8m4L20P5k07n8P9rk9p6J7K47k10l9Oj01J81j8j07J37l63L52
$$ -40 -15 -94 -284 -82 -100 -144 176 251 44 -14 65 56 27 -49 -32 215 5 -34 -28 -129 52 34 -73 64 -299 53
6072E3k95J68K27j08j79l9K76r4o5r1K42j27J12M7j92K53j93r2J4N1L9j75J13
$$ 53 -242 -74 153 45 -134 -173 103 9 -56 -147 95 -32 80 127 -65 188 -5 -97 -83 -32 7 -168 -55
6095e5r5J07j07J63P4lQk25n1J03O0P0q8K50j55j16k3K30k56j2K66k5M5k43j16
$$ -55 -150 -43 -150 13 87 84 92 -133 -184 -81 -21 49 -39 211 56 -60 -83 147 -109 -121 145 120 165 -78 -194
6120a94PJ02J18k8q2L35j90j05O0J18k74J08l04M0N02j88j07L1J94l70L89k07
$$ -194 -187 -85 33 5 -77 258 68 -37 23 141 -133 -25 -329 -289 213 25 -82 -51 143 -227 162 -45
6142d5J8O3j03Q7j18Q9q1J1k2OJ95m1q3O7ol01L65k20j51K47l1K39r8N1j40mJ37
$$ -45 -27 36 -67 20 -98 -9 -90 -79 -101 -95 100 59 -24 43 37 -264 101 -119 -270 -23 -54 185 87 138 -2 -6 131
6169A31k83L44l22J23K56l03K20o4j08J27j81J67J26k23Q1k62L52l23J09J51j33
$$ 131 -152 192 -130 -7 249 -54 166 102 -6 121 -60 107 233 10 91 -171 181 -142 -33 118 -15
6190a5j47K05j66J60J52k79J76M6j52j74K30o8p4K50j02p0K86j53l16L73l3j68
$$ -15 -162 43 -123 37 189 -90 86 132 -20 -194 36 -32 -106 144 42 -28 258 105 -211 162 129 -39
6212c9L9j17J15J02m6nk4k44K07k3k64J28P7JK53n19L73J31J30k27k96M20j34
$$ -39 0 -117 -2 100 54 49 25 -219 -12 -35 -299 -171 -94 -93 160 -359 14 145 275 48 -248 172 38
6235C8M7J8J31l61J00J92j57K4q1k1J54k92J89P6k46L13Km6J02n3p7j57p3M06
$$ 38 85 103 234 -127 -27 165 8 32 -49 -70 84 -208 -19 57 -189 124 126 80 182 129 52 -105 -178 228
6259B28k96R4n1J52k49J90R7l00n1KL13l79M09n7o4q2J80j80J28j15j54K32r2
$$ 228 -68 26 -25 127 -122 68 165 -135 -186 -184 129 -250 159 102 38 -44 136 -44 84 -31 -185 47 -45
6282d5P1l2k05J21Q5p5j7J81l41J55L82n35M7M5j5n5L84O4n31K35qP2K4J5j11
$$ -45 26 -6 -211 -90 -5 -80 -97 84 -257 -102 280 -255 -208 -163 -178 -233 151 215 -316 -81 -89 -17 7 22 -89
6307h9J50j77K29j6k97K72m2q8j44K54%j4j44K03n7r4j92K12k5J14L4k37k05K31
$$ -89 61 -116 113 97 -200 72 30 -58 -202 52 52 38 -106 97 40 -54 -246 -34 -59 55 89 -148 -353 -122
6331a22K48J66l05J09o2j4J30l68J97K44k28J05k39L14k63J15L14l09m7J44l27
$$ -122 126 292 -13 96 34 20 150 -218 -21 223 -5 100 -139 175 -88 27 341 32 -15 129 -198
6352a98K68m74M21j03n2J41n1j01J94n3L9j48rK9K21K4j75N8k13K03k57L40j43
$$ -198 70 -404 17 -86 -138 3 -48 -149 45 -8 31 -117 -126 -97 124 148 -27 31 -182 21 -236 104 -39
6375c9L5l78O04m32J64j45K32R2k64K32l09J6Q2M7M1k1L7j19K61M7J11n12L88
$$ -39 -4 -382 222 -210 -46 -191 41 133 -131 101 -208 -192 -110 -63 -22 -43 -6 -125 136 183 294 -218 170
6398A70l01K59j55L4rj32J28p1J72k34N5K3J23j2o1p3o3Q1J59j79J32J23k95j38
$$ 170 -131 128 -27 7 -2 -134 -6 -77 95 -139 -84 -61 62 50 -11 -84 -147 -66 93 -86 46 169 -126 -264
6422b64M03k20k3j31K32O4k4k22K76k54J39lR3K20n38K14k43N34l07K82j33l01
$$ -264 139 -81 -104 -235 -3 61 37 -185 91 -163 -24 -27 66 286 -252 -38 -281 253 -54 228 95 -206
6444b06L17l12L53J66m00l48M59k13K85k09o3K12q1j98Q4J54k46N25l49K49k83
$$ -206 111 -201 152 318 -82 -430 29 -184 101 -108 -171 41 -40 -238 -154 0 -246 279 -70 179 -104
6465a04Q7r2r8N99m10K70k28L5k18K75P8L8k95K69j44j31K36m01K29O4n6O5j18
$$ -104 -17 -109 -207 392 -18 252 24 59 -159 116 194 232 -63 206 62 -69 167 -234 -5 59 3 68 -50
6488e0j73M62k52J03o7J48k42J73p3O7o1J72k06K23nj70r7J13J63l89K16j13K8
$$ -50 -223 239 -13 90 23 171 -71 102 29 96 35 207 1 224 219 49 -48 65 228 -161 55 -58 -30
6511c0J53Mj46J61k51J38j75K04j96K74l03K49j54J79L9k01K8J90j46J1n0P5J61
$$ -30 123 127 -19 142 -109 29 -146 58 -138 136 -167 82 -72 107 146 -55 -27 163 17 28 -22 53 214
6534B14k19q1j31J78l5j2L6K02p6l09J71L14j71o7Q4j1M8k85J66n0k0K28k43J17
$$ 214 -5 -86 -217 -39 -74 -86 -50 152 76 -233 -62 252 81 14 98 87 135 -150 16 -34 -54 174 -69 48
6558D8j07J67j21j15N4m1J98q2Q8L1K3mk62l9K1J91o5j81J08j34M19l31L23l1
$$ 48 -59 108 -13 -128 -74 -115 83 1 89 120 143 139 -123 -162 -141 50 -15 -196 -88 -222 197 -134 189 158
6582A58j41J26p5k53P8L11j87p0J29j86K03k51J59o2j17K69l04M06k3j62R8P7
$$ 158 17 143 68 -185 -107 204 17 -53 76 -110 93 -158 1 -61 -178 91 -213 193 170 8 106 183
6604A83l14rL67j66j61L87l32M8J58j84j65J65j5k9JJ5k48L22j95K29j83R2j65
$$ 183 -131 -140 227 61 -100 287 -45 3 161 -23 -188 -23 -38 -67 -66 -51 -299 23 -172 57 -126 -34 -199
6627a99K88j16K25K4l42n9L40k17j70N91m19K83j96M1jk14J22%j75K18m7q6r3
$$ -199 89 -27 198 222 -120 -179 161 -56 -226 365 -54 229 33 74 73 -141 -19 -19 -194 24 -23 -109 -202
6650b02M24j69j71L18k57N9J5m7K9L29k89K25k94k3J02o5L65m08j0p2O2J72o0
$$ -202 222 53 -118 200 -57 2 17 -30 -1 328 39 264 -30 -53 49 -16 349 -59 -69 -141 -79 93 33
6673C3rL0m8k49L20k43K54k08o9J99k6k46L32qr1J8k7N9oK33k75J40j02J92l23
$$ 33 24 54 6 -243 77 -166 88 -120 -189 10 -16 -262 70 62 -29 -11 -38 21 15 248 -27 113 11 203 -120
6698a20N5J81n5j73q4N03m57l9K25M8l8j47K00k75J22oP1pJJ98j86J25pj15rJ91
$$ -120 -65 116 61 -112 -196 307 -150 -189 36 84 46 -101 99 -176 -54 -60 11 4 5 203 17 142 135 20 11 202
6724B02j88q3J75r9J40q0j99j7O9L7J77j35K32k82L5J41j80P9j2q1J04r9O5L5
$$ 202 14 -69 106 7 147 67 -132 -149 -80 -43 134 -1 231 -51 -16 125 -55 24 12 -69 35 -64 1 36
6748C6l06M30j18p9j47J97R9K8j08J57O6l91J7j6q1M12r2Q2j04n6k21K59J58j36
$$ 36 -270 160 42 -37 -184 13 112 140 32 189 255 -136 -119 -135 -216 196 104 186 82 26 -195 64 222 86
6772H6j41L10j98j14J47j10j04L4R6o9K3J58qj01k7n2J92k57K49r1r1J02r3L1
$$ 86 -55 255 57 -57 90 -20 -124 -90 6 -63 -40 118 110 9 -18 -70 122 -135 114 23 -68 34 -59 -28
6796b8O7r5q6Q0K13j22j45J67k28K26J96k72K7J17k15n0L67j71O8j65R3r2K46
$$ -28 39 -56 -142 -62 151 29 -116 51 -177 49 245 -27 0 117 -98 -148 219 48 116 -49 44 -48 198
6819A98n3j09j66NK20j42mJ1j04M1J28j75J59J67k3k41L48j47j06J4l1l8K4o5
$$ 198 145 36 -130 -125 95 -47 -51 -40 -144 -103 25 -150 9 176 153 -88 260 113 7 21 -10 -48 -24 -89
6843h9K58l37r1J63O7R4j70J06j11J40l40L70j16O6K6J42j58j3Ok15P1J50J01
$$ -89 169 -168 -259 -96 -29 65 -105 1 -110 30 -310 60 -56 10 36 178 20 7 13 -202 -131 19 120
6866A20J9n0k0K88n50K15j12N5J32M1k23l0J63K97k88K4k73%N06k49j17j93M32
$$ 120 139 89 69 357 -193 22 -90 -35 97 138 -85 -115 48 345 57 81 -192 -192 314 65 -52 -245 187
6889A87j79Q4j05J72r8J84k03m5J1j10j14KK09m8o8J53J51p9N0j11pj04K47j56
$$ 187 8 92 -13 159 61 245 42 -3 8 -102 -216 -214 -5 -53 -121 32 183 104 154 43 36 -68 179 23
6913B3J0J1j39n2n1Q6M0J25J7K70k45K9k22P6K9O4J0j50L22l66J50L5j59J21k11
$$ 23 33 44 -95 -147 -198 -112 -72 53 70 340 95 124 -98 -22 7 71 81 -69 253 -113 37 72 -87 34 -177
6938a77J52j75L26m10K62j39L15j12j36P2J22j99M8J60o2j46j41J97K34k23PQ
$$ -177 -25 -200 126 -284 -22 -161 154 42 -94 -22 100 -99 -51 109 47 -99 -240 -43 191 -32 -25 -17
6960a7R0N8j66J97n1l8j64L07l31O8O3j97R6p1m0L77J1j26k85J92o6j42K05K16
$$ -17 73 131 -35 162 111 73 -91 216 -115 -47 16 -181 -85 -156 -196 181 192 66 -219 -27 -93 -235 -30 186
6984A86m14M68j08l24K25j90K05n2q5J28l13L52P5k15K1J71k62J85K6n7q1m6M14
$$ 186 -228 240 132 -192 33 -157 48 -4 -89 39 -274 78 153 -62 -41 130 -132 53 79 22 -59 -105 309
7007C09j63j82j86K87j54nK18PJ09l28J41Q2j67K38k99K49j87Q9k1J64j47j16
$$ 309 146 -36 -222 65 -89 -94 124 131 240 -88 53 135 -32 206 -93 156 -31 58 37 201 54 -62
7029f2K64j86M8j64J77j75R6P4N4k16m7j91J44K46J23j14o8n9J09k4j40mJ64k29
$$ -62 202 16 64 -100 77 -98 -2 72 126 -90 -137 -328 -184 62 185 71 3 -56 53 29 -111 -115 49 -180
7053a80P8O9K1L8j02K07q5Mp1p7j9N3K0m4q8J08k3J57J26j89K20n00K72j10M1
$$ -180 -102 -33 -12 26 -76 131 46 50 -21 -98 -117 -64 -44 -88 -176 -68 -91 66 192 3 223 -277 -5 -115 -74
7078g4L50l09K12l66L3J94L7j36j0L8N8%r1JJ03j74J4j53K40K73k73j07J81ML1
$$ -74 276 -33 179 -187 -154 40 77 -59 -69 -31 27 27 -64 -63 40 -134 -120 -273 -33 240 -33 -140 41 45 76
7103G6J7l85O21k04p2n8K2J68k78L46l66J39K29k55J17j26J41j44O3o7M4mJ33
$$ 76 93 -292 329 125 53 -5 17 185 -93 253 -113 26 255 0 117 -9 132 -12 51 -16 28 24 157
7126A57j09l4q1n3J85l25M89m11K60j97J90m9KJk37J31J59q3O4m0q9J65MpL84
$$ 157 48 14 -67 -120 65 -260 229 -182 78 -119 71 22 24 25 -212 -81 78 -5 59 19 -70 95 99 92 476
7151D76o11j02L62k68P9K30k19k3J14Q4j65J9LP7j17J8K5J0q3J55l19L25O2k09
$$ 476 -135 -237 125 -143 -64 166 -53 -76 38 122 -43 -24 -21 56 -61 -43 -18 -8 -91 64 -255 70 132 -77
7175g7K1J43l04J85K08k0j75P1m2l8j80J59J61J1n3n4NJnJ8M7k0O6o1k37%J03
$$ -77 -56 87 -217 -32 176 156 -19 52 10 -28 -208 -49 112 123 70 16 21 22 17 35 82 62 128 67 -170 -170 -67
7202f7J15Qj70j00K86R0j2k17k3L13k38K05l13J31N5K3p8k29K53N6j91K40p8j1
$$ -67 48 56 -114 -214 72 162 150 -67 -90 223 -15 190 -123 8 63 86 8 -221 32 88 -103 137 59 48
7226D8J01l59N1J65j9k67q5L55K49k48J80k10K06l7M7j86Q4O7l30K00K35l48j67
$$ 48 149 -210 -159 6 -13 -280 -365 -10 239 -9 171 -39 167 130 177 -9 75 142 -188 12 247 -101 -268
7249b68L09k08J89Jp7PN5l1j9l4K49j15j19P5M0q8J95k90L66k92K72l55L46j97
$$ -268 41 -167 22 23 -54 -47 8 -23 -42 -76 173 58 -61 14 54 -34 161 -129 237 -55 217 -138 208 11
7273A1k1pK35m16K50k55J92L03k75j38K45k71K18j41J33j95R6j7J75P3j50J45
$$ 11 -10 -17 218 -198 52 -203 -11 292 17 -121 124 -147 71 -70 63 -132 -36 -53 122 195 45 190
7295A90r6l0k80J37O3l1M7r3J89q6L34l36j3J35l05J07P9P7k04k7K0J44j31J90
$$ 190 94 64 -216 -79 -16 -47 0 -93 96 10 344 8 -5 130 -175 -68 11 88 -116 -143 -123 21 -110 80
7319H0j8M2K8k39J64k74M09j36o9P7P2k20L63m13K92j92J32J47k83M08l96Q3j82
$$ 80 62 104 132 -107 57 -217 192 56 -13 64 136 -84 279 -134 158 -34 98 245 -38 370 -26 57 -125
7342a25K9r5L22q6j75l1J56M3j73J77RNj96L5N8q4L02l27j80J50L54j03j95J83
$$ -125 -96 -191 131 45 -130 -161 -5 38 -135 42 51 56 -140 -105 -47 -131 171 -156 -336 -186 168 65 -130 53
7366E3K1j14K5NJ04j49M2p0l2r5O1J0K00J7R8M2l30K74m23N8K59j79Q1m6J15k01
$$ 53 74 -40 -15 -10 94 -55 -13 -83 -115 -210 -149 -139 61 78 176 218 -112 162 -261 -203 56 -123 -42 -88 27 -174
7392a74K95N9j15k81J67K48p7r5R1J40l39Q5k11J01K51k65O8L04l35k5q2L45q2
$$ -174 121 180 65 -216 -49 199 122 27 118 258 -81 4 -207 -106 145 -120 -52 252 -83 -108 -190 155 73
7415G3k58M4K82p4k6J53j45j84J3K86q6q9J33j6J90l44l3J8P1q5J21P0m55K97
$$ 73 -185 -141 141 67 41 194 49 -135 -122 164 78 -11 122 106 296 -48 -81 -63 8 -77 44 114 -341 -44
7439d4k22L77k75J09J46j34L8j52M2k5j75M72k76K24j7j66r3kK58K0l4j78O3L01
$$ -44 -266 111 -164 -55 91 -43 -5 -157 -115 -140 -315 157 -119 105 88 -78 -171 -173 85 105 71 -107 -44 257
7463B57m17L62k74lk09K55k97K51j6J30q8J15n3j2Qj66P3J65p3j57J61N3J83n34
$$ 257 -160 202 -72 -75 -284 -29 -326 -75 -91 39 -49 66 13 1 9 -157 -84 81 8 -149 12 65 248 -286
7487b86K28K01J60l36J11O2l11J23J40Kr2J7R0k17N3J33J9J6j95nj99M1L40j88
$$ -286 -58 143 303 -33 78 140 -171 -48 92 94 2 19 109 -108 -55 78 97 113 -82 -87 -286 -245 95 -93
7511i3J51jJ22j14l70L10l4%n6J24l17J99J70L9j56K07k39J07l1m2R1j14J43j46
$$ -93 58 57 179 65 -305 5 -29 -29 -85 39 -278 -79 91 130 -26 181 -58 49 18 -24 67 -47 96 -50
7535e0K04k21L47k42J63k93j77L37m18N02k61Q0N5k37K22p5q4r3J25Q9K58l93
$$ -50 154 -67 280 38 201 -92 -269 68 -350 152 -109 -29 26 -211 11 -64 -148 -241 -116 -27 231 -162
7557a62J91L40l22j9J51j10M6k10J89k25L39p5k01k49N07j03r4j5J50k32J95O6
$$ -162 29 369 47 28 179 69 115 -95 94 -131 208 133 -68 -317 190 87 -7 -22 128 -104 91 157
7579A57n25K81J30l19K21J73k52K05k02K06k54J53J43m75K98j74j5M74m33J09
$$ 157 -368 -87 43 -276 -55 118 -134 71 -131 75 -179 -26 117 -358 -60 -234 -249 225 -208 -99
7599i9L5LK07l5j25M2N8l29L28m16L22J63Jk83Q6J82k05M8M6n5K16j88N9p7j09
$$ -99 -64 -61 146 111 -14 28 86 -243 85 -331 -9 154 155 -128 -42 140 -65 -17 29 -26 190 2 61 -16 -125
7624a25q9L74j80k3L4j2j27K78l45J45M21l52J16j95R7P2r3J21r2r2NP8j44K4
$$ -125 -214 160 -20 -43 -9 -21 -148 130 -215 -70 351 -1 115 -80 17 89 -4 117 25 -67 -62 16 -128 -104
7648a04P6j03J40J3qo2p5Q0J80m8j29j34J88l28L39j78K47K42m54JR0q5j7P9k27
$$ -104 -28 -131 9 22 14 -48 -123 -43 137 89 -40 -174 14 -314 25 -153 94 336 -118 -117 -27 -112 -129 -50 -277
7673b77K17K18j79j62K83k0L0l08LJ16j1J89l27J64K2P2J03q8K80k61J23k39J79
$$ -277 -60 158 -21 -183 100 80 110 -198 -195 -79 -90 99 -228 -64 -42 30 133 45 325 64 187 -52 127
7696A27j76J52M7k72J52k2p7r0M05r8j23k17K94j0P5j96K26o5j58L8K01l05J59
$$ 127 -49 103 150 -122 30 8 -69 -159 246 148 25 -192 102 92 167 -29 197 132 -26 12 213 -92 67
7719F7l43K40J31j74j10J56J81l9k70J23k5O7J51NJ00k81K17j72Qm3kJ79k30O0
$$ 67 -276 -36 95 -79 -189 -33 148 109 -161 -38 -63 4 155 160 260 -21 196 24 32 -11 -13 166 -64 -4
7743dn1O4L8p5j0j42L35k07O6j0L1M7Pp0P3j20J24q1N6j5l39L85k09J31L2k28
$$ -4 -55 9 47 -28 -38 -180 155 -52 14 4 35 82 89 19 92 -28 96 15 71 56 -283 102 -107 24 56 -172
7769a72J29J43k88L8O1n0q3L57J34j26l60J32O1M8j60J63J9k17N7k63M19j11j19
$$ -172 -43 100 -188 -150 -89 -139 -222 135 269 143 -217 -85 -24 24 -136 27 46 -171 -114 -377 42 -69 -188
7792a88J21J8K87j67l10K36j84L42k86K7K67p8j86K50j81J1o8J63K56n16P7K59
$$ -188 -67 -49 238 71 -239 -3 -187 155 -131 -104 163 85 -101 149 -32 -21 -89 74 330 -186 -109 150
7814A50J87l60k09J16j11L16J3m1K17j46j77q8O2J85L1l15J89m2J14k60L68l50
$$ 150 337 -23 -232 -116 -227 89 102 61 278 132 -45 -133 -71 114 145 -170 19 -23 91 -169 199 -151
7836a51J16J62j30J43k26l4J65k03K23n4j63k0j32N61l00J72j14lL5mJ26j76j59
$$ -151 -35 127 -3 140 -86 -120 45 -158 65 11 -152 -172 -304 257 -43 129 15 12 47 43 169 -7 -166
7859a66K41j35L55l80P2q7K61l79K39Mn3j10K24j19j13p8K12R3k97L09j77j54
$$ -166 75 -60 295 -85 -13 -100 161 -218 21 25 -28 -138 86 -33 -146 -224 -12 81 -216 93 -84 -238
7881b38L2JJ2K54p9q0LON5L7J06n2O0j64J20j18j42K80j01k46L7qM14j82K9L3
$$ -238 -206 -205 -193 61 -18 -98 -95 -89 -34 3 109 57 117 -47 73 -45 -187 93 -8 -254 -217 -225 189 7 36 69
7907F9m57K83K67j33j00K15m54L44k48J17q0K61k09J10j6O9J69l64Q1J84l56L50
$$ 69 -388 -105 162 29 -71 144 -310 34 -214 -97 -177 84 -125 -15 -31 38 207 -157 -76 108 -248 102
7929A02k25M47l49M3m8M2J01j54j1J42P4p2j08k06L03N6j37k33L90j48K0J3r8
$$ 102 -123 324 -25 18 -30 12 113 -41 -52 90 164 92 -16 -222 81 137 0 -233 157 9 29 42 -56
7952e6K02k12J71p9j29J04K6n1J81L6k98O6k5%n3J12K0m7J92k32J6J2j63J72J30
$$ -56 146 -66 105 26 -103 1 27 -24 157 193 -105 -39 -64 -64 -117 -5 15 -32 160 -72 -56 -44 -207 -35 95
7977I5k4l72K30N3j0Q7J01j07k18M1J05j56K17q7J72p2N5j55Q8j16K6R5Q0j92
$$ 95 71 -301 -71 -18 -28 59 160 53 -165 -124 -19 -175 42 -45 127 55 110 -45 43 -73 -47 48 128 -64
8001f4J41k23J68rMK24n35K59j79M11k85K43j8o6k7J15Qk94J08J4oj48K39m0P8
$$ -64 77 -146 22 13 17 241 -294 -35 -214 197 -88 155 137 71 44 159 167 -127 -19 -5 -11 -159 80 40 118
8026A18k3j45j0oL17j25l48K01j77K91K19m48j04J29j0n0J31N5mn5N6j37K37k38
$$ 118 95 -50 -60 -66 251 126 -222 -21 -198 93 312 -136 -240 -111 -121 -171 -40 15 11 -44 12 -125 112 -126
8050a26J15q6O8P0J31o5K0r5n3J01k03o6M4K48j46K76k22J20J09k40L0J87m41
$$ -126 -11 -97 -29 41 172 107 127 32 -21 80 -123 -189 -145 103 -43 233 11 131 240 0 30 217 -224
8073b24K57m9k1j19J88o6j52M72k75j06J46j43J00J8J6Q8j55K9j44J94j70J18
$$ -224 33 -16 -37 -156 32 -34 -186 286 11 -95 51 -92 8 26 42 130 -25 4 -140 54 -116 2
8095Bj71R9L8l8o1K91k76J19P7k84J84O9N9k68L04k42L35l79K15k68M02q4k27
$$ 2 -169 -70 -32 -70 -131 160 -116 3 80 -204 -20 49 108 -160 144 -98 237 -142 73 -195 207 123 -104
8118a04m9K23k20M11l91J26L67m30r3J09j9K34k09k60K50q8L11k98J93j37J24
$$ -104 -153 70 -150 261 -130 -4 363 -67 -160 -51 -70 164 -45 -305 -55 -143 168 -130 63 -74 50
8139E0j11J69l08J80J7K10j50O5R5j12j46M6PK5M2k0r2J19o7M7p1J50l22K00j42
$$ 50 -61 108 -200 -20 -3 207 57 122 217 105 -41 5 12 37 79 59 -33 86 19 66 -5 145 -177 23 -119
8164a19o2L25j70K24l34J19pq1r2L39k28J73k22J08P9j65LJ46j96r0J54l3K27
$$ -119 -181 144 -26 198 -136 -17 -24 -105 -197 142 -86 87 -135 -27 52 -113 -110 36 -160 -250 -96 -129 98
8187I8j09K88l33j6
$$ 98 -11 277 -56 -72
8191g2
$$ Imaginary data points
##PAGE= N=2
##DATA TABLE= (X++(I..I)), XYDATA
0@%%%%%%%%%%%%%%%%%lJ1j6J6j6J6j9K7l2L2m0M8n1N9o7P5q5R6j10J24j37J54
$$ 0 0 0 0 0 0 0 0 0 0 0 0 0 0 0 0 0 0 -3 8 -8 8 -8 8 -11 16 -16 16 -24 24 -27 32 -35 40 -45 51 -59 65 -72 82
39H2j73J90k08K31k57K84l14L46l80M18m61N09n60O18o83P55q38R31j038J165
$$ 82 -91 99 -109 122 -135 149 -165 181 -199 219 -242 267 -293 325 -358 397 -441 490 -548 617
59F17j317J503j733K027k419K968l789N140p733J4344n8810j07655K18220P1612
$$ 617 -700 803 -930 1097 -1322 1646 -2143 2997 -4736 9608 -49202 -156857 61363 132975
73A32975k07316l6396J96270L261j70073J6914J50135l5760j27325M7884J08723
$$ 132975 -74341 -110737 85533 88794 -81279 -64365 85770 50010 -77315 -29431 79292
84G9292o3625q8724P3598O9131q3821n0226Q6731L4920q8475k5633Q7408K0936
$$ 79292 15667 -73057 541 69672 -14149 -64375 22356 57276 -31199 -56832 30576 51512
96E1512q9403j7559R1572J5472r3809j0823R5395Q825r3637n272R1833L435q8381
$$ 51512 -37891 -55450 36122 51594 -42215 -53038 42357 51182 -42455 -47727 44106 47541 -40840
109d0840k11Q5092l280q1317R163P5449j7322o7620K5350N6791l4237m6306M0385
$$ -40840 -41051 44041 40761 -40556 -31393 44056 26734 -40886 -15536 41255 7018 -39288 1097
122A097L4067m7041k3930N2733J3796n8124m314O2199l925o4804J2136O5708j7914
$$ 1097 35164 -11877 -35807 16926 30722 -27402 -31716 30483 26558 -38246 -26110 39598 21684
135B1684o3772K3068O0935k4850n5434K6003N0664k5281m3633K3466L6335k0640
$$ 21684 -42088 -19020 41915 17065 -38369 -12366 38298 13017 -30616 -7150 29185 8545
147H545l0274J6856K3184j3729j8271J0183J2816q639r211P682N261q020k768
$$ 8545 -21729 -4873 18311 4582 -13689 -3506 9310 671 -8540 -858 4403 -3617 -6385
160f385R708q01j1149L317J3653l957j5854N443J9430m026k3033L639K7496k872
$$ -6385 3323 2522 -8627 -5310 8343 4386 -11468 -6025 13405 9379 -13654 -10015 17481 14609
174A4609l0900J836L4767j924l7928K974L9311m161m0811O228L9066r935l7158
$$ 14609 -16291 -14455 20312 18388 -19540 -16566 22745 18584 -22227 -15999 23067 13132 -24026
187b4026J3127L1872j6879k5893K0235J8577k2908j0811K5086L537k6328M618
$$ -24026 -10899 20973 4094 -21799 -1564 17013 -5895 -16706 8380 11917 -14411 -9793
199i793K6880j0392k7250J7055K7348k0798k6425K5184K4686k6740k3082K7132
$$ -9793 17087 6695 -20555 -3500 23848 3050 -23375 1809 26495 -245 -23327 3805
211C805K0639k6730j9564K5013J7392k3217j6203K0568J4411j8862j3176J6857
$$ 3805 24444 -2286 -21850 3163 20555 -2662 -18865 1703 16114 -2748 -15924 933
223I33J1329j6470q511J5693N639j5792j500J6662k151j6573O945J7992j1012
$$ 933 12262 -4208 -12719 2974 8613 -7179 -8679 7983 5832 -10741 -3796 14196 3184
236C184j8537J5879J9180j9942j9856K4727J9588k8760j8630L1498J7074l4437
$$ 3184 -15353 526 19706 -236 -20092 4635 24223 -4537 -23167 8331 25405 -9032
248i032j5268L5810J0960l6969o764L5634J558l3755L733L0023q639k5075J3305
$$ -9032 -24300 11510 22470 -14499 -21263 14371 15929 -17826 -14093 15930 7291 -17784 -4479
261d479J9782j6401j4153J9533R584k1761l742K3504n1k3837L771K4139o674k3597
$$ -4479 15303 -1098 -15251 4282 13866 -7895 -11637 11867 11816 -12021 -8250 15889 9215 -14382
275a4382Q482K2251j0415k0920J0549J8775j0956j6635J0163J3814r421j1540
$$ -14382 -5900 16351 5936 -14984 -4435 14340 3384 -13251 -3088 10726 1305 -10235
287a0235P716Q663o481o543N474M451l658k604L994Q46k471M94L259j828l410
$$ -10235 -2519 6144 -337 -6880 -1406 3045 -613 -3217 777 1623 -848 -354 2905 1077 -2333
302b333L247M147m188m389M585N219n420n699N162N901n505o809N134O503n468
$$ -2333 914 5061 873 -3516 1069 6288 868 -4831 331 6232 727 -6082 -948 5555 87
317H7o945N041O253n042m838M660L349l616j764L110r7j455K378p3l359K114M723
$$ 87 -6858 -1817 4436 -606 -5444 -784 2565 -1051 -2815 295 198 -1257 1121 1048 -2311 -197 4526
334D526k953n412M748N482n458n613N879M955o663l967N817K796o137j234M841
$$ 4526 1573 -3839 909 6391 933 -4680 1199 6154 -509 -4476 1341 4137 -2000 -3234 1607
349A607m13m476J858K986l530j931N395L70o059J405P233k718p175N066O344n302
$$ 1607 1194 -3282 -1424 1562 -1968 -3899 1496 1866 -4193 -2788 4445 1727 -5448 -382 5962 660
365F60n554O021M627n671l331M936K434l984j331K560K65j656k32J65j020Q47
$$ 660 -4894 1127 5754 83 -3248 1688 4122 138 -1193 1367 1632 -24 -256 -91 -1111 -264
381b64N15k026n34K494L42k886K26L011l97k558J144K009j107j132K271P9j962
$$ -264 251 -1775 -2309 185 527 -2359 -2133 878 481 -2077 -933 1076 -31 -1163 1108 1187 -775
398g75J252K327k479j749L172J853m334j624M492J085m834j346M843P70m779j137
$$ -775 477 2804 325 -1424 1748 3601 -733 -2357 2135 3220 -1614 -2960 1883 2653 -2126 -3263
414c263M848K17m718j73L914J91l486K02L415m70k170Q93J911q13j118J179Q56
$$ -3263 1585 1802 -2916 -3089 825 1016 -2470 -2268 1147 677 -1493 -600 1311 498 -620 559 1415
431A415n73r66P24J501j265j364J313J513j963k039K250J517k947k247L513J783
$$ 1415 842 -124 600 2101 836 -528 785 2298 335 -1704 546 2063 -884 -3131 382 2165
447B165m367j668M909R59m751o27M720O04m768K69M699j71m600J638M375j987
$$ 2165 -2202 -3870 1039 1998 -2753 -3380 1340 1944 -2824 -2555 2144 1973 -2627 -989 3386 1399
463A399l546K749L370l650k129L951Q32m461J6L968q23m315J643L512k525l373
$$ 1399 -2147 602 3972 322 -1807 2144 2976 -1485 -1469 2499 1676 -2639 -996 2516 -9 -3382
479c382K827K403l064k126L272J436l195j76K861k93j821N38K051o16j518J265
$$ -3382 -555 1848 -1216 -3342 -70 1366 -1829 -2005 856 563 -1258 -720 1331 715 -803 462
495D62J506j802n66J974r2j691J9J866r79j373L97R29p76j208M10J049j18j359
$$ 462 1968 166 -400 1574 1482 -209 -190 1676 697 -676 -279 650 -126 -1334 -924 125 7 -1352
513a352J42J240m52j290Q36R79k66j075R92Q07p02j99J081M64q29k16J089J46
$$ -1352 -1210 30 -422 -1712 -876 103 -163 -1238 -246 561 -141 -340 741 1205 376 160 1249 1395
531A395j515M39J112p21j578O32J496j280j244R46J492j832j285J890L96k165
$$ 1395 -120 319 1431 710 -868 -236 1260 -20 -1264 -318 1174 -658 -1943 -53 343 -1822
547a822k70K486m51j574J013J298q09j168J505J365j431o97J394O52j647M5J881
$$ -1822 -2092 394 -57 -1631 -618 680 -129 -1297 208 1573 142 -555 839 1491 -156 -111 1770
564A770l45j581k22K070p13j758M07J252j075j268J005Q13j238q40J564K79j207
$$ 1770 1425 -156 -378 1692 979 -779 -372 880 -195 -1463 -458 355 -883 -1723 -159 120 -1087
581a087k30J202m0o17J71O15Ll34L63P15k92PK82M79n28k39K29k01m27k68Q15
$$ -1087 -1317 -115 -155 -772 -601 14 17 -317 46 761 469 476 758 1237 709 470 699 498 71 -197 618
602F18n17m31M81p1m60k70J40j85l40L42n8J40j26K52K92L87k80k0J36N99o38
$$ 618 101 -330 151 80 -380 -650 -510 -695 -1035 -693 -751 -611 -737 -485 -193 194 -86 -106 30 629 -9
623iK08O73m12l57O76M13o23k76L09J80r58J40K60r9p40l24J048j68q01j23O73
$$ -9 199 872 460 103 779 1192 569 293 602 782 -176 -36 224 125 -615 -939 109 -59 -860 -983 -310
644c10Qq93O09O31k94r05J133O87p73j31Q28L52l62n00R62J02p20l08O29O1p85
$$ -310 -302 -1195 -586 45 -249 -1154 -21 666 -107 -238 590 942 580 80 1042 1144 424 116 745 806 21
665B1L54o3J05p90o8O23r3r07j59P62l82n58M93L12J6k53J35P37l98r5M5R33k97
$$ 21 375 312 417 -373 -441 182 89 -818 -977 -215 -597 -1155 -662 -350 -334 -587 -452 285 -113 -208 -163 770 473
688D73m34L24Q25o87m14M49M23q83k48P83k64l26l09L76n7q77j01O48J19n67j16
$$ 473 39 363 1188 501 87 536 959 76 -172 611 347 21 -288 88 31 -846 -947 -299 -180 -747 -863
709h63N31J36m43L8N73J78n30K52O52j06o25N26P73o20l31O32J63m99n86L24L41
$$ -863 -332 -196 -639 -601 -28 150 -380 -128 524 418 -207 319 1092 472 141 773 936 437 -149 175 516
730E16l30n39L49M03o13m27N63J21o67m33Q74l03l25N5Q63k15m64O37N70n44l34
$$ 516 186 -353 -4 399 -214 -641 -78 43 -624 -1057 -183 -486 -811 -756 107 -108 -572 65 635 91 -243
751b43P05M77l12n44M35K70k24m31L71M44r24j37O18L6j117j14P15k25q23L69
$$ -243 462 939 627 83 518 788 564 133 504 948 24 -113 505 541 -576 -690 25 -200 -1023 -654
771f54L38k82j19K78M21k94o37M07O88k03l30O87O18p82l17J159k55n93p7N99
$$ -654 -316 -598 -717 -439 -18 -312 -949 -542 146 -57 -387 300 918 136 -181 978 723 130 53 652
791F52j07n91k65R37k60m08n6L87k77o80J49M70k84r23P83L88l28m63N32O18n98
$$ 652 545 -46 -311 626 366 -42 -98 289 12 -668 -519 -49 -333 -1256 -473 -85 -413 -876 -344 274 -324
812c24n33J312K40o22l79R90j00m93K85O51k37n63k5N20k66r03L58M58p79n50
$$ -324 -857 455 695 73 -306 684 584 91 376 1027 790 227 202 722 456 -447 -89 369 -410 -960
832i60P80N42j024J42K19Ml14j10O92k66k0m3M19j83k44M39L33J25j16J5K08J97
$$ -960 -180 362 -662 -520 -301 -297 -611 -721 -29 -295 -315 -358 61 -122 -366 73 406 531 415 430 638 835
854H35o66J47M75l09l74M0L75l87m40j9N75o97n3k13N97k14m10K2O90k83m87P98
$$ 835 169 316 791 482 108 148 523 136 -304 -323 252 -445 -498 -711 -114 -328 -738 -716 -26 -309 -796 2
876BK13n62M9R36j36p38N41L92k30l40L67M14n81l81M57R5m61j98J67q1m22k0
$$ 2 215 -347 -298 638 502 -236 305 697 467 127 494 908 327 -54 403 498 37 -161 6 -75 -497 -517
898e17L19j88k84K66L90m02r7Q6K05l38J07P45k30J44J06R8Pj21J32p8o1K48j62
$$ -517 -198 -386 -670 -404 -14 -416 -513 -427 -222 -560 -453 292 62 206 312 410 417 296 428 350 289 537 375
921C75j34J11l45R6j10L4j63l67K23M07n43m68M04K04k49m00P65L16q04K16O76
$$ 375 241 352 7 103 -7 27 -136 -503 -280 127 -416 -884 -480 -276 -525 -925 -160 156 -648 -432 244
942B44m9j70r8M63n9m52N77O67j110R2M28M17r02m9L86l74k80L03J19n34j36L48
$$ 244 195 25 -73 390 331 -121 456 1123 13 105 533 950 48 -1 385 11 -269 34 153 -381 -517 -169
964a69Q5o59L28K07l51J60K00j6j52L19M39j19l96P11q2q7l04N33j91m02J38L22
$$ -169 -84 -743 -415 -208 -559 -399 -199 -215 -367 -48 391 272 -124 587 505 418 114 647 456 54 192 514
986E14j70l17M80k38o88N2O63n41k69L87K15n99l04L33K92n02K8P54n8m23L39
$$ 514 344 27 507 269 -419 -367 296 -245 -514 -127 88 -511 -815 -482 -190 -692 -664 90 32 -391 -52
1007e2K96J56l73K38M41m02mM02k13k21R0K52j76m21L28j93n18k32O33l9n70K86
$$ -52 244 400 27 265 706 304 300 702 489 268 358 610 434 13 341 148 -370 -602 31 -8 -578 -292
1029b92nj67J21J31po82M58L89j25j24M94K80k83L7L90O0n49L78K63j92p63O72
$$ -292 -297 -464 -343 -212 -219 -901 -443 -54 -179 -303 191 471 188 225 615 675 126 504 767 575 -188 484
1051D84K57o03l31N70o7p80K32M85l47m04M93qm84k15N19J79m82J53P00k38m10
$$ 484 741 138 -193 377 310 -470 -238 247 -100 -504 -11 -19 -503 -718 -199 -20 -502 -349 351 113 -297
1072b97L44O17n34j45N18k1k42j3m7K2r2M31k83j98l4K0L1n47L29k04k34K9L78
$$ -297 47 664 130 -15 503 482 240 227 180 202 110 541 258 60 26 46 77 -470 -141 -345 -579 -550 -172
1095a72j43l77K53M64o05J71M91q0l89L80P33o71l34N90P02p87l84Q64L73j170
$$ -172 -315 -692 -439 25 -580 -409 82 2 -387 -7 726 55 -279 311 1013 226 -158 706 1079 -91
1115i1j92J080k56q42J99O12o17p14P96K45n80n58P38K75r08L64N95l36k74M05
$$ -91 -283 797 541 -301 -102 510 -107 -821 -25 220 -360 -918 -180 95 -813 -449 146 -190 -464 -59
1135e9N38m42p5J38M23l95j2J74J51j95L20l22k03L78l75K09m35L93n46j20L61
$$ -59 479 37 -38 100 523 128 116 290 441 246 566 244 41 419 44 253 -182 211 -335 -455 -94
1156i4R4n07j51N62J96p30k37P99n3l91J30Q71m58k95N98L57o63nN56j04p24L11
$$ -94 0 -507 -658 -96 100 -630 -867 -68 -121 -512 -382 489 31 -264 334 691 28 23 579 475 -249 62
1178F2O89l83m85L88J86m89m31O07J90r30J61K28M1k86OM49k78j18L07L69n74
$$ 62 751 368 -117 271 457 -32 -463 144 334 -596 -435 -207 -166 -452 -446 3 -275 -393 -86 283 -291
1199b91p4O29l08k03K25O88m18k71M63j81k63M47R7k76k52J4J71n00L74K2n64
$$ -291 -365 264 -44 -247 -22 666 248 -23 440 259 -4 443 540 264 12 26 197 -303 71 93 -471
1220d71k53Q38m9l98n3K43P9k54j3L02j98k31P39K8n35J01P84m78n77Q01J80k53
$$ -471 -724 114 65 -333 -386 -143 -64 -318 -331 -29 -227 -458 281 309 -226 -125 659 181 -396 405 585 332
1242C32l71K03M18n45l75O87J7m62qN02l67q63O90k97M44q26N27J39L1l58N91
$$ 332 -39 164 582 37 -338 349 366 -96 -104 398 31 -832 -142 -439 5 -821 -294 -155 -124 -482 109
1263A09P2k17N5J96%J34K03l99NJ59K70l79Q0j62m1j7J72O6m08k39K32j46j42
$$ 109 181 -36 19 215 215 349 552 153 158 317 587 208 288 126 85 68 240 306 -102 -341 -109 -255 -397
1286c97j32O01m4q44O20Q7j30l18O55r1k71K59M00L8k56o9M75k35m68N67K29n99
$$ -397 -529 72 28 -816 -196 -109 -239 -557 98 7 -264 -5 395 433 177 108 583 348 -120 447 676 77
1308G7k36O09k40m45m3O68m47o31N10J80l48k04K36L22j83k12J13L49l92q8K46
$$ 77 -159 450 210 -235 -278 390 -57 -688 -178 2 -346 -550 -314 8 -175 -387 -274 75 -317 -405 -159
1329a59LJ35J33Pj95L43K2N9k21O17o17j22K51K7r8l37J88P2m01L96k3l53l77
$$ -159 -156 -21 112 119 -76 267 289 348 127 744 127 5 256 283 185 -152 36 108 -293 103 80 -273 -650
1352f50N50L3j78j63K37J80k02j14L46J57n51N78K31m37j10L78K16j82j60J5P2
$$ -650 -100 -67 -245 -408 -171 9 -193 -307 39 196 -355 223 454 17 -93 285 501 319 159 174 246
1373B46j26K20Ll10MPMl64K90Q0k53q9J41k32mJ83K22K58o11J22J98j23J68P3
$$ 246 120 340 343 33 37 44 48 -316 -26 54 -199 -288 -147 -379 -383 -200 22 280 -331 -209 -11 -134 34 107
1397A07L02l37K25k4J31q5j32K01J66n31O2K67o10M3L40k09m19j37N26k21J16
$$ 107 409 72 297 273 404 319 187 388 554 23 85 352 -258 -215 125 -84 -503 -640 -114 -335 -219
1418b19o8J74j91j78L59l8j17J3M54K3o3J14N7j62j17L57r0n2j4K0J1j62J45j08
$$ -219 -287 -113 -304 -482 -123 -161 -278 -265 189 212 149 263 320 158 41 398 308 256 242 262 273 111 256 148
1442A48k50Ro7k2j78O1M86o60K16N7o7R1r5K03k19J01K63J92m0l29L25l2j07n
$$ 148 -102 -93 -160 -182 -360 -299 187 -473 -257 -200 -267 -176 -271 -68 -287 -186 77 269 229 -100 225 193 86 81
1466H1N14k88p5q0J28j75k57L27pj10k88K55o4k06N3J33j83m4l2n7K91j45k1K88
$$ 81 595 307 232 152 280 105 -152 175 168 58 -230 25 -39 -245 -192 -59 -242 -286 -318 -375 -84 -229 -250 38
1490C8M4O6m9k26K42L08o6k49K94j04k83Q9L58k48l61K82J40l06j40L9n6k28l2
$$ 38 82 148 99 -127 115 423 357 108 402 298 15 104 462 214 -147 135 275 -31 -171 -132 -188 -416 -448
1513d48J34J71l20K2L10K97l14J02M0j77N5j1L90J2k89J36J46l3K6P4q3l9l01
$$ -448 -314 -143 -463 -441 -131 166 -148 -46 -6 -183 -128 -139 251 263 -26 110 256 223 249 323 240 201 -100
1536a00Q4L90m08q7L7J25j47L3R6k2k88n0K86k96Q1L9j0O5r3N12l2j17K3j17K18
$$ -100 -16 374 -34 -121 -84 41 -106 -73 23 1 -287 -337 -51 -347 -266 -227 -237 -172 -265 247 215 98 121 4 222
1561B22k02R4l1J68j43O4j5J58k76N2K5m1j06N5k60pr8R3JL40k05jK4j9k2J35
$$ 222 20 114 83 251 108 172 157 315 39 91 116 75 -31 24 -236 -243 -341 -248 -247 93 -112 -113 -89 -108 -130 5
1587Ej38K68l1K7M4n3P2r3J40j99K01j35L22m8j95o9m10N74m32K92l79J9O6P2
$$ 5 -133 135 104 131 175 122 194 101 241 42 243 108 430 382 187 118 -292 282 -150 142 -237 -218 -152 -80
1611h0j22k39K06J6J82m5J38j23J02L5J15p0m0PM9M08m17n9jL83j32k53j40M5
$$ -80 -202 -441 -235 -219 -37 -82 56 -67 35 70 185 115 75 82 131 539 122 63 62 445 313 60 -80 -35
1635c5J47k29K96k24j40l1O0k34K8M7M10j26j34J25J73K7m31L16o8j93L18l44
$$ -35 112 -117 179 -45 -185 -216 -156 -390 -362 -315 95 -31 -165 -40 133 160 -271 45 -23 -216 102 -242
1657b42M51k8N0M2l3l26RJ30J0o9%O2l40J97J80l05j40Q3O3k5m6n1K05j49J69
$$ -242 209 181 231 273 240 -86 -77 53 63 -6 -6 56 -284 -87 93 -212 -352 -269 -206 -231 -277 -328 -123 -272 -103
1682a03J07K1m3K15L7j83J46K5O4l70K49J10j86J54n4K3j60m6k4j93K27R5l62
$$ -103 4 25 -18 197 234 51 197 222 286 -84 165 275 89 243 189 212 52 6 -18 -211 16 111 -251
1705b51n0J89k10K93l0o9k52K77j09j2L33j6k82K22O2q8P1K25j03j63J47n1j2
$$ -251 -301 -112 -322 -29 -59 -128 -380 -103 -212 -224 109 93 -189 33 95 7 78 303 200 37 184 133 121
1728A21q0QK98l23P0l16L69k96r4J71J39l0k25r2J4K1k8M2K59j4J05q4J93j65
$$ 121 41 49 347 24 94 -222 147 -149 -243 -72 67 37 -188 -280 -266 -245 -273 -231 28 14 119 35 228 63
1752F3J72j79M3l4O9R4J69j53j56j01K07j23R6J5N8m08l51L51J36l19K5J07J59
$$ 63 235 56 99 65 134 228 397 244 88 -13 194 71 167 182 240 -168 -519 -168 -32 -351 -326 -219 -60
1775f0j78K33lM5j95P1j4j21M01J7j13K0Q9q3n1M5Rn6J88k29J47n0m70J28J92
$$ -60 -238 -5 -8 37 -158 -87 -101 -222 179 196 83 103 192 109 58 103 112 56 244 15 162 112 -358 -230 -38
1800c8J07Jk42OJ65j69r9L32m01l3M05j48J67J52k87J69k01K34k2J4J11j49J12
$$ -38 69 70 -172 -166 -1 -170 -269 63 -338 -371 34 -114 53 205 -82 87 -114 120 98 112 223 74 186
1823A86j84m5L28l00K7P1m50K13j6lO5j62j56L11k15K9J05Q8O3j84M9K04j44K53
$$ 186 2 -43 285 -15 12 83 -367 -154 -170 -173 -108 -270 -426 -115 -330 -301 -196 -108 -45 -229 -180 24 -120 133
1847A33J08j73K85k52J88P7p5j80M2K7j48q8J79O4k53r4L06l83J06J52Jj6Lm0
$$ 133 241 68 353 101 289 366 291 111 153 180 32 -56 123 187 -66 -160 146 -237 -131 21 22 6 9 -31
1871c1j82j51J81J90j99K33j33J29J54l88K7L40j33J55k33L09j18k6K2o3j33K39
$$ -31 -213 -364 -183 7 -192 41 -92 37 191 -197 -170 170 37 192 -41 268 150 124 146 83 -50 189
1893A89q0j92J44J71k61k48O0J4J74k01p0L12k3k9j34Q8N9J68j28k3r3K36k6j
$$ 189 109 -83 61 232 -29 -277 -217 -203 -29 -230 -300 12 -11 -40 -174 -86 -27 141 13 -10 -103 133 107 106
1917A06r9o4L63Mk47j84J64pq6%J29j27k24K58J47p9k44k85J02R8J57J1j65J37
$$ 106 7 -57 306 310 63 -121 43 36 -50 -50 79 -48 -272 -14 133 54 -190 -475 -373 -275 -118 -107 -272 -135
1941a35K2mL88k31l23N01j01K66l99J74k5k0k45L64k32j03K19k17K5n4K13l36
$$ -135 -113 -117 271 40 -283 218 117 383 -16 158 133 113 -132 232 0 -103 116 -101 -76 -130 83 -253
1963b53J94j09j24J52N2J00k76L05j95R6j22p3K35k2J35K13k24j96L88JK24m11
$$ -253 -59 -168 -292 -140 -88 12 -264 41 -154 -58 -180 -253 -18 -40 95 308 84 -112 276 277 501 90
1985I0O8l8l79K87k69J88J37j26k2K0p7L0k35M9J87M7P4rlk82L2J89O9K17j87
$$ 90 158 120 -259 28 -241 -53 84 -42 -64 -44 -121 -91 -326 -277 -90 -43 31 22 19 -263 -231 -42 27 244 57
2010E7M8k60L70j8J48m12m7K77L5j67q3L4J8p6K9J2J1j7j06K50k75L7l2N3L15
$$ 57 105 -155 215 197 345 -67 -114 163 198 31 -52 -18 0 -76 -47 -35 -24 -41 -147 103 -172 -135 -167 -114 201
2035B01p5j47j73K49j87L37r0J83j81l5M8j9j57K09q4j26M21l45j01J36r4j26
$$ 201 126 -21 -194 55 -132 205 115 298 117 82 130 111 -46 163 79 -47 374 29 -72 64 -30 -156
2057a56M33j87M4m4m8j64p0J07N6q3K8K92k36k25J36K03m3k9K51o0l2k61Q0N1
$$ -156 277 90 134 90 42 -122 -192 -85 -29 -112 -84 208 -28 -253 -117 86 43 14 265 205 173 -88 -8 43
2081D3K37l97K35K04j31k3M8l72Q0J31j96Nj06J72l4Ok01N1K98k34O5K47k70N1
$$ 43 280 -117 118 322 191 168 216 -156 -76 55 -141 -136 -242 -70 -104 -98 -299 -248 50 -184 -119 128 -142 -91
2105i1K51J3J25l90QL44%Nj56p4J3j72L95j69j86K79j28ml80K83j44L54m57Q0
$$ -91 160 173 298 -92 -84 260 260 265 109 35 48 -124 271 102 -84 195 67 63 -317 -34 -178 176 -281 -201
2129b01L7n1K44j55J10q4j4O3L85l55J24j89Q3J34j39K91j56m2J36j94N8j69J9
$$ -201 -164 -215 29 -126 -16 -100 -114 -51 334 -21 103 -86 -3 131 -8 283 127 85 221 27 85 -84 -65
2152f5K09ro3k30l9K30j44m8K66j03j03P0R1J87l75J5k6j69J43J81J56k48J95
$$ -65 144 135 72 -158 -197 33 -111 -159 107 4 -99 -29 62 249 -126 -111 -137 -306 -163 18 174 -74 121
2175A21P9l3J17m0l05J88J12J24k77k73m1M02l66K18Nk41o4j5M93k10k00J26j32
$$ 121 200 167 284 244 -61 127 239 363 86 -187 -228 174 -192 26 31 -210 -274 -289 204 -6 -206 -80 -212
2198b12J97l1k26M35j40q1jO0Q4q2J23Q5p7l6j72K92k33J63k09rJ87j97M1k76
$$ -212 -15 -46 -272 163 23 -58 -59 1 85 3 126 211 134 98 -74 218 -15 148 -61 -70 117 -80 -39 -315
2222c15K03L81k75nj24m2J72j67J75J33j14j79R8K06j86m6K78L9j29J80k34oJ05
$$ -315 -112 269 -6 -11 -135 -177 -5 -172 3 136 22 -157 -59 147 -39 -85 193 232 103 283 49 43 148
2245A48R7l60K3J00j90j7R5M4P0J9l8O5k47l5MK56k11R9N3J07L8L1j46Q6o4q9
$$ 148 245 -115 -92 8 -182 -199 -104 -60 10 29 -9 56 -191 -226 -222 34 -177 -78 -25 82 120 151 5 91 27 -62
2271f2J16L3J4R0j21l10L13j10K53k58N0J17j51J32mqk05O0J15k65K91k44J35
$$ -62 54 87 101 191 70 -240 73 -37 216 -42 8 125 -26 106 102 94 -111 -51 64 -201 90 -154 -19
2294a9j9j2j28K22L7q8m6L09k12J15j48k96N42m14J66R4J47j94j09M67k76j6l05
$$ -19 -38 -50 -178 44 81 -7 -53 256 44 159 11 -285 257 -157 9 103 250 56 -53 414 138 122 -183
2317a83J13m9J88k07N4N0r2J44j30L52l01j20L75N8k90n7o1K25k16M84l75j30
$$ -183 -70 -119 69 -138 -84 -34 -126 18 -112 240 -61 -181 194 252 -38 -95 -156 69 -147 337 -38 -168
2339a68L44j44Q4j7ko5m32N75k72J44k09K39k83L28m14L31q2%J57j70J16j61Q2
$$ -168 176 32 116 99 97 32 -400 175 -97 47 -162 77 -206 122 -292 39 -43 -43 114 -56 60 -101 -19
2362a9JJ8j88L7L71j72j34k7K11J52l16L80k89j68o0J89K3j01j6J79j06n1O3j98
$$ -19 -18 0 -188 -151 220 48 -86 -113 98 250 -66 314 25 -143 -203 -14 9 -92 -108 71 -35 -86 -23 -221
2386b21K40j48K8O2j2O6k2j70j3M38n30M37j53L0q7o1K12L10j74j09Jk9j8N9l3
$$ -221 19 -129 -101 -39 -51 15 -7 -177 -190 248 -282 155 2 32 -55 -116 96 406 232 123 124 95 77 136 103
2411A03j23Q0j92J6K90%k52p8M62m58J30R3O5l9j00k5J20j35l7l4K02q4K64r8
$$ 103 -20 60 -132 -116 174 174 -78 -156 306 -152 -22 71 136 97 -3 -28 92 -43 -80 -114 88 4 268 170
2435A70L5l29L87l83M1J36qj01K44k66ml8rl2K31o7lo3j49M1J29N1r5N7q4J31
$$ 170 205 -124 263 -120 -79 57 49 -52 192 -74 -78 -116 -125 -157 74 7 4 -59 -208 -167 -38 13 -82 -25 -109 22
2461B2j47J04K5J95k0K17j70k01P0q3J00j40J37j13l2J2K86l31P3j74L7J76j19
$$ 22 -125 -21 4 199 179 396 226 25 95 12 112 -28 109 -4 -36 -24 262 -69 4 -170 -133 43 -76
2484g6J11k72J57J8L7k21K3M9J42m6m6N7p8M05oQ5j70j31q0L39k79j13J23K3k05
$$ -76 35 -237 -80 -62 -25 -246 -223 -174 -32 -78 -124 -67 -145 260 254 339 169 38 -42 297 18 -95 28 51 -154
2509a54K77k62J02P7j58j9M8N6K34l59J46M5N4j19k04K16L3K11k54N2Lj28J65
$$ -154 123 -139 -37 40 -118 -137 -89 -33 201 -158 -12 33 87 -32 -236 -20 13 224 -30 22 25 -103 62
2532F2jj0j55M3R7K0j12J72r3Q0j32k08L69j60J10j9j14r0J4K33l11J74J61k30
$$ 62 61 51 -104 -61 36 56 -56 116 23 103 -29 -237 132 -28 82 63 -51 -141 -127 106 -205 -31 130 -100
2556a00P1j7J38J17k79J87kl24N37l25OL6j02R8J52jm32K26J60o2l1J39l07J4
$$ -100 -29 -46 92 209 -70 117 115 -209 328 3 9 45 -57 41 193 192 -240 -14 146 84 53 192 -115 -101
2580a01K6m0Q6L3M7N8o9n5J32qj15J23%k7J98k29j02K00n3k54J50P0k01J63J56
$$ -101 -75 -115 -29 4 51 109 40 -15 117 109 -6 117 117 90 288 59 -43 157 104 -150 0 70 -131 32 188
2605A88k53J67k38P9M12k61J09r9j57J34j3j15l5L12l62J68j94O8R2J55J3j53
$$ 188 -65 102 -136 -57 355 94 203 104 -53 81 68 -47 -82 230 -132 36 -158 -90 2 157 170 17
2627A7J42k66L99k51M5J09l42L43k31R0k06J40j72J05L56m33J70l6p0oJ96k15
$$ 17 159 -107 292 41 86 195 -147 196 -35 55 -151 -11 -183 -78 278 -155 15 -21 -91 -97 99 -116
2649a16K30k2j42L17k78j40L71J18j36j72P7j94J48j16J48O7j69m02L77PN0j19
$$ -116 114 92 -50 267 -11 -151 220 338 202 30 107 -87 61 -55 93 160 -9 -411 -34 -27 23 -96
2671i6m8K24j28j96K18J2k13O7J63J51r7l14J32K34J34k64Q6Nn8K48l49K63k86
$$ -96 -144 80 -48 -244 -26 -14 -227 -160 3 154 57 -257 -125 109 243 -21 65 70 12 260 -89 174 -112
2694a12k3K96k42r6P1J59K06m06P2J04j82j9L03j82l06L94J98m25J87K00J25j99
$$ -112 -135 161 -81 -177 -106 53 259 -147 -75 29 -153 -172 131 -51 -357 37 235 -190 -3 197 322 123
2716A23n4J5Nk42L07q0j37j32J71J21K11j69J25l23K33n3k04K01j35Rj18R5L4
$$ 123 69 84 89 -153 154 74 -63 -195 -24 97 308 139 264 -59 174 121 -83 118 -17 -8 -126 -31 3
2739Cmj62J69j46J69R1k59K24O4l65K00J29j53J42k16m1L09j55LK86l07q7L55
$$ 3 -1 -163 6 -140 29 120 -139 85 149 -216 -16 113 -40 102 -114 -155 154 -1 2 288 -19 -106 249
2762B49M8k16l61J82O3K8P7j24J68j74M2QJ55k02j74L82l73L29l64L76K35l75
$$ 249 297 81 -280 -98 -35 -7 70 -54 114 -60 -18 -10 145 -57 -231 151 -222 107 -257 119 354 -21
2784b1J17j89lJ97j83L62l66J2M20m28J77P6j80J36l6n2j3l0O6m33J68J48j52
$$ -21 96 -93 -96 101 -82 280 -86 -74 346 -82 95 171 -9 127 91 39 26 -4 62 -371 -203 -55 -207
2807b07J61J08l01L86l78M00j37r1K88l44J27k89M27R4l94L31k97K29K65k11j42
$$ -207 -46 62 -239 147 -231 169 32 -59 229 -115 12 -277 150 244 -150 181 -116 113 378 167 25
2828B5n4J96r4j05o7L2K6J38q9j67k7J53J15j50o3j6P2Q2K4k77K92J6k37J99L2
$$ 25 -29 167 73 -32 -99 -67 -41 97 8 -159 -186 -33 82 -68 -131 -147 -75 7 31 -246 46 62 -175 24 56
2853E6O7k82J35J54j35K94l74O9K50l69n6M06n75Q41n69J54k62J4J74l50L52l3
$$ 56 123 -159 -24 130 -5 289 -85 -16 234 -135 -191 215 -360 481 -88 66 -196 -182 -8 -358 -6 -39
2875c9R5r3J63l04j9J11m5J44L8J7MJ92n2j16k51J55j36J06l79M81j71m2J66K1
$$ -39 56 -37 126 -178 -197 -86 -131 13 51 68 72 264 212 96 -155 0 -136 -30 -409 72 -99 -141 25 46
2899D6L06m79J9J85m84L37R4R3k46j50J59J71k92p8M72k67K28p9L15j91l15L10
$$ 46 352 -127 -108 77 -407 -70 24 117 -129 -279 -120 51 -241 -319 153 -114 114 35 350 159 -156 154
2921A54L7j90k52K37L29k63J56j88j17J14o0l75K48J56k34M3J47m1O8J07NQ9k23
$$ 154 191 1 -251 -14 315 52 208 20 -97 17 -43 -418 -170 -14 -248 -205 -58 -99 -31 76 81 170 -53
2944e3J81L5l42K19Rn3k93L31k52O6K60n3p7J9q1J15J17l15J62L6K15l06k6K52
$$ -53 128 163 -179 40 49 -4 -297 34 -218 -152 108 55 -22 -3 -84 31 148 -167 -5 31 246 -60 -86 166
2968A66k70lO3k20K56j11m1L73j22j72J18j56R9j87K76k14J07N4K6kk01J05o6
$$ 166 -104 -107 -44 -264 -8 -119 -160 213 91 -81 37 -119 -20 -207 69 -145 -38 16 42 40 -161 -56 -122
2991a22K53j53k7K5J29k81K34n9J38l94qK25l3J23k45L39k90j7J49K25j39n7n7
$$ -122 131 -22 -49 -24 105 -176 58 -1 137 -257 -265 -40 -73 50 -195 144 -146 -163 -14 211 72 15 -42
3014d2J0R0j13j04L09Lj77L5J94m03J58l0j19K50j97NQ0J32L51n20o8J86j93M17
$$ -42 -32 58 -55 -159 150 153 -24 11 205 -198 -40 -70 -189 61 -136 -131 -51 81 432 -88 -156 30 -163 254
3038B54j95j86Q1k06J81J41J78j96J2k1J24r9j68n2L15K1q3j03l1J45K4Lr5K5
$$ 254 59 -127 -46 -252 -71 70 248 52 64 43 167 68 -100 -152 163 184 101 -2 -33 112 136 139 44 69
3062F9L0j78Q7M9j12q0K33J13k99n9J21K16k64N3m3m2J49l2l9L74k72j1q2K25
$$ 69 99 -79 8 57 -55 -135 98 211 -88 -147 -26 190 -74 -21 -64 -106 43 11 -28 346 74 63 -19 206
3086B06k40p2O1K28n7j55J6M3j37J69j69J91l2N7r1j78K71k72K68j52p8J59j03
$$ 206 -34 -106 -45 183 126 -29 -13 30 -107 62 -107 84 52 109 18 -160 111 -161 107 -45 -123 36 -67
3109f7K3J90k51L08N0k73J31j53J41O5l24J7L68q2j50R5L8j21J17k02k29K34q5
$$ -67 -44 146 -105 203 253 -20 111 -42 99 164 -160 -143 225 143 -7 88 126 5 122 -80 -309 -75 -160
3132a60L21k00N7m48L02L69l21O0k9j45L27j09n7K48j33k40J74j25J49Q6l95M71
$$ -160 161 -39 18 -430 -128 241 -80 -20 -49 -194 133 24 -33 215 82 -158 16 -109 40 126 -269 202
3154B02j93q2j05N42m11J13j96L12l97K61j29N9J59m19L58j73k55L85M6m9J07
$$ 202 9 -73 -178 364 -47 66 -130 182 -215 46 -83 -24 135 -284 74 -99 -354 31 77 28 135
3175A35k0J97k51j72L10j15j64L60l07j60M46r2o2j35q1J96j45J25j36J06J11
$$ 135 115 312 61 -111 199 84 -80 280 -27 -187 259 167 105 -30 -111 85 -60 65 -71 35 146
3196A46m37J64R2K26P2m00M17j09N3k60O5l8j16lL22k85K27j57j43J04L64j48
$$ 146 -291 -127 -35 191 263 -137 280 171 224 -36 29 -9 -125 -128 194 -91 136 -21 -164 -60 304 156
3218A56Jj82o3K45k58J36j46k1n2O1Q3M5Qk42M00R0l07N4L8k23N3K31q1J4K2l68
$$ 156 157 -25 -88 157 -101 35 -111 -132 -184 -123 -40 5 13 -229 171 261 -46 8 46 -177 -124 107 26 40 62 -306
3244c06J30K69rQ3Pj85J37l73K31O4K7j07P4j20k1J32J06j70j38K63l29M20m6
$$ -306 -176 93 84 167 174 -11 126 -247 -16 48 75 -32 42 -78 -99 33 139 -31 -169 94 -235 185 139
3267A39l40K94j75J96k25J06L7m8K36j33oN0J42k09j07j02K29p7J81m55M78k29
$$ 139 -201 93 -82 114 -111 -5 32 -16 220 87 81 131 273 64 -43 -145 84 7 188 -267 211 -18
3289a8m9L0K12j45k29J26J43J00k23J54J35m55J92nj53K42j43m0J02J89j5l1j45
$$ -18 -67 -37 175 30 -199 -73 70 170 -53 101 236 -219 -27 -32 -185 57 -86 -126 -24 165 150 119 -26
3312b6l8K31j90R0k04J09j11K06j42m9J37J59r0k36J6J56k23M0jK22nj24L14j50
$$ -26 -64 167 -23 67 -137 -28 -139 67 -75 -124 13 172 82 -154 -138 18 -205 -165 -166 56 51 -73 241 91
3336I1j46K26j66q3l3J62J48j84j2j22K29K61n53L06j37L0J19j57P6j95mL93o05
$$ 91 -55 171 5 -78 -111 51 199 15 3 -119 110 371 -182 124 -13 17 136 -21 55 -140 -144 249 -356
3359c56M11r5J29j85K22k01J80k67N53k06k40N6M0M5j70J05j74K53j2j40L07j96
$$ -356 55 -40 89 -96 126 -75 105 -162 391 185 -55 1 41 86 -84 21 -153 100 88 -52 255 59
3381E9k79P1J0J02o3M56l82l09K33Q8J23r9J65l06J92j75K00l7L2k03k4J93k4
$$ 59 -220 -149 -139 -37 -100 356 -26 -335 -102 -14 109 10 175 -131 61 -114 86 49 81 -122 -146 47 23
3404B3l9J41j57n0J86N0p9J20j91Qk02K30j29J5L63l78N5Q7m5j89L91j08m3L3
$$ 23 -16 125 -32 -82 104 154 75 195 4 12 -190 40 -89 -74 289 -89 -34 53 8 -181 210 102 59 92
3428I2l09L56j97k8K2Q3P0j26j22o6N18k21J01j34j54O6r0K67J51l75K6K74l38
$$ 92 -217 139 -58 -86 -64 19 89 -37 -159 -225 293 72 173 39 -115 -49 -139 128 279 -96 -70 204 -134
3451a34O9l0J71j49J6j44L37j23j14o8K2N6J52l7O6j72O8p2J16oJ4M5j30J66j23
$$ -134 -65 -95 76 -73 -57 -201 136 13 -101 -169 -147 -91 61 24 90 -82 -14 -86 30 24 38 83 -47 119 -4
3476dN2j64q2K03j6L0q6K14j55J5J33j40j19K20l02R2K97k65mL41k55J17O6j20
$$ -4 48 -116 -198 5 -11 19 -67 147 -8 7 140 0 -119 101 -201 -109 188 -77 -81 260 5 122 188 68
3500F8N5j26J80O5j4j8j73N3J5K1Q9l44k4L85l38J48J67q0j64K2m1j57K84m9K21
$$ 68 123 -3 177 242 228 210 37 90 105 126 215 -129 -153 232 -106 42 209 129 -35 -13 -54 -211 73 24 245
3525B45l08K59j58K4J5p9k33K06p4J29J10k6j65J51k38j03J04L10j55J95p9ol50
$$ 245 -63 196 38 62 77 -2 -235 -29 -103 26 136 110 -55 96 -142 -245 -141 169 14 209 130 124 -226
3548b26M00J75k83j25j8O9p3K23m30R9K83l9j22J37O4j10m0J23j09n9J76n27N20
$$ -226 174 349 66 -59 -77 -8 -81 142 -288 -189 94 55 -67 70 134 24 -16 107 -2 -61 115 -412 108
3571A08LJ8P2k94oK89l0k70J68N4j28p8r7n3K57j62K12Q0n0j35k44N43k92p6J51
$$ 108 111 129 201 -93 -99 190 160 -110 58 112 -16 -94 -191 -244 13 -149 63 143 93 -42 -286 257 -35 -111 40
3596D0j31P0Q9j48R3l50K82L19k70j07J86Mj72K09l50K37o0j05P5O4N5j09j23
$$ 40 -91 -21 68 -80 13 -337 -55 264 -6 -113 73 77 -95 114 -236 1 -59 -164 -89 -25 30 -79 -202
3619b02M3J11J77kk55J66JJ34k25m6Q6O6l79L93r6J85o8N3Lj69RL06Rl68R4Q6
$$ -202 -159 -48 129 127 -128 38 39 173 -52 -98 -12 54 -325 68 -28 157 89 142 145 -24 -15 291 300 -68 26 112
3645A12J32m07K02j42R7M6l10O3J80o6J37l1l21M51Qj63N3j44J46qo2n7J16K8
$$ 112 244 -163 39 -103 -6 40 -270 -207 -27 -93 44 13 -308 143 151 -12 41 -103 43 35 -27 -84 32 60
3669F0pOj67J29Q2k37J75K5J02l30L6J67j83K6m9J38J03j29m7J04J36j50j10P3
$$ 60 53 59 -108 21 103 -134 41 66 168 -162 -126 41 -142 -116 -165 -27 76 -53 -100 4 140 -10 -120 -47
3693d7K44j99K43p2L8m26J72J11j32M0J10j63L33k54K00lp4J19k79k8n4J30K80
$$ -47 197 -2 241 169 207 -219 -47 64 -68 -28 82 -81 252 -2 198 195 121 240 -39 -67 -121 9 289
3716B89k68k18K90k63K05J75k88L7l0J7K09r6R6pKj66J81k33J35j69K72q1R7k06
$$ 289 21 -197 93 -170 35 210 -78 -41 -71 -54 155 59 155 148 150 -16 165 -68 67 -102 170 89 186 -20
3740b0j72l8J48n0r5J43K75j52o2N8m2j3l4J47k22R9j00M41k38K2j32J56J53l41
$$ -20 -192 -230 -82 -132 -227 -84 191 39 -23 35 -7 -20 -54 93 -129 -30 -130 311 73 95 -37 119 272 -69
3764f9o0J54j96n1P4R2Q7j91K51j44J97k0k2j46p8K77KR0l54ONN8L8K02r2l76
$$ -69 -129 25 -171 -222 -148 -56 31 -160 91 -53 144 124 102 -44 -122 155 157 247 -107 -101 -96 -38 0 202 110 -266
3790b66K56%J70m2k1%q1j49K39k08K90m38L38R4L5j89k81K21L29k43k71L30j48
$$ -266 -10 -10 160 118 97 97 16 -133 106 -102 188 -250 88 182 217 28 -253 -32 297 54 -217 113 -35
3813c5n3J2R5j01l0P7j07J88j28j73M54o9k25L39k10m8mJ56k02J5M5J13M7j99
$$ -35 -88 -76 19 -82 -112 -35 -142 46 -82 -255 199 130 -95 244 34 -14 -18 138 -64 -49 -4 109 156 -43
3837d3k2qP5M8j64M4N7J78j44k29K94k53K32J0J7j26M9n4P0J13j35lk65J11k2
$$ -43 -65 -73 2 50 -114 -70 -13 165 21 -208 86 -167 65 75 92 -34 15 -39 31 144 9 6 -259 -148 -170
3862a70O9Q8q5J10K1K48l63m5j95M60j28n9M9J81k2m21J1J44j0O0J35q6n7or3
$$ -170 -101 -13 -98 12 33 281 -82 -127 -322 138 10 -49 0 181 159 -262 -251 -107 -117 -57 78 -8 -65 -71 -164
3887a64J12K41j60n2J93j25M5K84l27j32k0O3J88l2l39L08P2k72j91M78k70J10
$$ -164 -52 189 29 -23 170 45 90 374 47 -85 -105 -42 146 114 -225 83 155 -117 -308 170 -100 10
3909A0L7L0m1l8k2r7k4J08o0N16l01k29K12k72P8m6J05J56l01MJ90j05M1L14j23
$$ 10 47 77 36 -2 -24 -121 -145 -37 -97 419 118 -111 101 -171 -93 -139 -34 122 -179 -175 15 -90 -49 265 142
3934A42lP9l36R5L1J22o9j71J70K68n10J71J41j07k49J28P2K94l07m5N4q1kk85
$$ 142 139 218 -118 -23 8 130 61 -110 60 328 -182 -11 130 23 -226 -98 -26 268 -39 -84 -30 -111 -113 -398
3958c98N33N6j82J46k30r0R1N0j12J48J57l8j77oR0q6n6K02k82L10k19j85L70
$$ -398 135 191 9 155 -75 -165 -74 -24 -136 12 169 131 -46 -52 38 -48 -104 98 -184 126 -93 -278 92
3981I2r3P2o6pl6j04L57j14L6rk13K18j03J74k01P7K64l47M2J30j29K8q1J14m0
$$ 92 -1 71 5 -2 -38 -142 215 101 137 128 -85 133 30 204 3 80 344 -3 39 169 40 68 -13 101 61
4006F1j37K4l0J69j10J06j97k16L27j75J32n2j4m4pJ75J02J42k02J21O7l19n1
$$ 61 -76 -52 -82 87 -23 83 -114 -330 -3 -178 -46 -98 -112 -156 -163 12 114 256 54 175 242 -77 -128
4029a28K33j54L8K88q7l15L60j84m45N62k24R3k15J45R0Q1j87K1K58k73k24K45
$$ -128 105 -49 -11 277 190 -125 235 51 -394 168 -56 37 -178 -33 57 138 -49 -28 230 -43 -267 -22
4051b2n1K11M8j55J31Rl38n6L27j85M0P9N7k24k7nP7J5J32j97J51q0Rr7O8o1J51
$$ -22 -73 138 186 31 162 171 -167 -223 104 -81 -41 38 95 -129 -156 -161 -84 -69 63 -134 17 -63 -54 -151 -83 -144 7
4078Gr5J06J34l19K82k6Kj80l1J31n9J23K6j00j30R9J57k11n2j10L03PJ41j08
$$ 7 -88 18 152 -167 115 89 91 -89 -120 11 -48 75 101 1 -129 -30 127 -84 -136 -246 57 64 205 97
4102I7O1l87QJ13k30K90po3J97j64J60k0K5Q1M7j19j00K70m50M18j42N6k16M7
$$ 97 158 -229 -221 -108 -338 -48 -55 -118 79 -85 75 55 80 161 208 89 -11 259 -191 227 85 141 -75 -28
4126b8M26o26K83P7Q9l8j01J99q9j0m05J82M0k38J95J33k04L32k50J33Jl16N4
$$ -28 398 -228 55 132 221 183 82 281 192 182 -223 -41 -1 -239 -44 89 -115 217 -33 100 101 -215 -161
4149a61J66J98k82J4J92k7J08n9q9j85L97l66K16j73K8k30k0kM26L3j46l6j1j7
$$ -161 5 203 -79 -65 127 100 208 149 60 -125 272 -94 122 -51 -23 -253 -273 -275 151 184 38 2 -9 -26
4173b6R0j17n7mO4J50j36J5O4L20l91J74j55j64L19j07j82J80n6J00O5l17J85
$$ -26 64 -53 -110 -114 -50 100 -36 -21 43 363 -28 146 -9 -173 146 39 -143 37 -19 81 146 -171 14
4196A4k14Q6J41R0p1M0Oj69J91j04O2m4j18K79j05j56J08O0q9K19l13J56L2j14
$$ 14 -200 -114 27 117 46 86 92 -77 114 10 72 28 -90 189 84 -72 36 96 7 226 -87 69 101 -13
4220a3j68K92j80K6P9j26J06j36pnK55j24K9J06j23j75J45j23J57j21K29j3j10
$$ -13 -181 111 -69 -43 36 -90 16 -120 -127 -132 123 -1 28 134 11 -164 -19 -142 15 -106 123 110 0
4243@j63L6L59m17J91Ok2N4J26j32j02J9Q6Nk47K45Q6k68J76j47m8M51l19j11
$$ 0 -163 -127 232 -185 6 12 -10 44 170 38 -64 -45 41 46 -201 44 130 -138 38 -109 -157 294 -25 -136
4267a36K04o5k71M31j79j04j21J64ok4J27N3q1J13j39P7j25N6K9J06l5r0K57j65
$$ -136 68 3 -268 163 -16 -120 -241 -77 -83 -107 20 73 -8 105 -34 43 -82 -26 3 109 74 -16 241 76
4291G6j71J58k12k35J69K92J38j62J47l23J13J2K2J41l70J64L0Q3j42R6J25j05
$$ 76 -95 63 -149 -384 -215 77 215 53 200 -123 -10 2 24 165 -205 -41 -11 72 -70 26 151 46
4313D6j42M15k95L5o0J17j21l08K46KL4K09j08j77J13R1o0J59q6l15K98j08%n6
$$ 46 -96 319 24 59 -1 116 -5 -313 -67 -65 -31 178 70 -107 6 97 37 196 110 -205 93 -15 -15 -71
4337g1l4M9k22J81QJ32j70M03l03Q3j61R4k9j67J7K08J91o3k21K46o1j26J13j60
$$ -71 -105 -56 -278 -97 -89 43 -127 276 -27 56 -105 -11 -40 -207 -190 18 209 146 -75 171 110 -16 97 -63
4361f3M1q1K3K86l83K60q3k5J91j56j42j3k1K58n4q6J19J0M7j74K27j88n4J0j72
$$ -63 -22 -103 -80 206 -177 83 0 -25 166 10 -132 -145 -166 92 38 -48 71 81 128 -46 181 -7 -61 -51 -223
4386b23J18O5j36L12k11K41j05k12J25j3K39l25L4O7M4kk87K30RP5j65N9J30j92
$$ -223 -105 -40 -176 136 -75 166 61 -151 -26 -39 200 -125 -91 -24 20 18 -269 -39 -30 45 -120 -61 69 -123
4410a23Q7m0Lo5L13O7k59K05p0k26P9J96j38k05K92l02J30P0J63j88j95J91J21
$$ -123 -36 -76 -73 -138 175 242 -17 188 118 -108 -29 167 29 -176 116 -186 -56 14 177 -11 -206 -15 106
4433A06j05P8j40pP9k3l7J76p2N7j08J89m14K38P7k66J04R7Lj88k6Q4J03K33j62
$$ 106 1 79 -61 -68 11 -12 -49 127 55 112 4 193 -221 17 94 -172 -68 29 32 -156 -182 -98 5 238 76
4458G6o8N6k90N2L54n4l78J44J53j0K36k34jj9J26p1K3j58J31J1m2pK70k88J24
$$ 76 8 64 -226 -174 180 126 -252 -108 45 35 271 37 36 17 143 72 95 -63 68 79 37 30 300 12 136
4483A36k8k45P9q9K64m4N1O5k47k3K84k94j48J39M89k59l40J34J78J3J15k87L47
$$ 136 108 -137 -58 -147 117 73 124 189 -58 -81 203 -91 -239 -100 389 130 -210 -76 102 115 230 -57 290
4506B90m09M1m6L4K51k18L7l6O8o6J96j5k75O8lk0m2m6L13%j4j75j33L23q9P4
$$ 290 -119 -78 -124 -90 161 -57 -20 -56 12 -54 142 127 -148 -80 -83 -103 -145 -191 122 122 108 -67 -200 123 34 108
4532A08M0m15K57M5Q8k3Q3lj01j01J22l5o8J43n0k40K00r6p6L43j56K9k16J21
$$ 108 148 -267 -10 35 123 100 183 180 79 -22 100 65 -3 140 90 -150 50 -46 -122 221 65 94 -122 -1
4556aJ44o5l81L65p9m2J15J08p1j66L7J97m5j24mn4j42K54j16L23k39m5j10k9
$$ -1 143 78 -303 62 -17 -59 56 164 93 -73 -36 161 116 -8 -12 -66 -208 46 -70 253 14 -31 -141 -170
4580a70K94j30p9N5k96J71R8J45K68l85j89K17K42k37P1j59N1P1m2l25O0L44k31
$$ -170 124 -6 -85 -30 -326 -155 -57 88 356 -29 -218 -1 241 4 75 -84 -33 38 -4 -329 -269 75 -156
4603a56K1J66J85j11j21J17m2k19L1K46j13k64K24r4k2K51j77Oo3J17q6J64q2
$$ -156 -135 31 216 105 -16 101 59 -160 -129 117 4 -260 -36 -130 -152 99 -78 -72 -135 -18 -104 60 -22
4626b2j29j25L24j51J01R0J50p5j13k29M65l25K08j8k19J32k30O0J21k3j8K67
$$ -22 -151 -276 48 -103 -2 88 238 163 50 -179 286 -39 169 151 -68 64 -166 -106 15 -8 -26 241
4648B41m05M17l42J24L1k17L07k58J50j45K99j90o7pJ36j96L9N4K42j45J2j85
$$ 241 -164 253 -89 35 66 -151 156 -102 48 -97 202 12 -55 -62 74 -122 -83 -29 213 68 80 -105
4670a05L7N40p42M33m8p6p0J84n9q5j27R4k11K7K56k83M5J06O4M0j08J50J08n0
$$ -105 -68 472 -270 163 115 39 -31 153 94 9 -118 -24 -235 -208 48 -235 -190 -84 -20 20 -88 62 170 120
4694A20j14J81j97j86J41m4L46l0k02m5J49j95M4M8K9j5k89L17p7K02o0j6M2r0
$$ 120 6 187 -10 -196 -55 -99 247 217 15 -30 119 -76 -32 16 45 30 -259 58 -19 183 123 107 149 59
4718E9J46k23o6J8J54k72Q7J48j40j14o6L70r1o6j17P0J52J18n1j35J52r5k6N5
$$ 59 205 -18 -84 -66 88 -184 -97 51 -89 -203 -269 101 10 -56 -173 -103 49 167 116 -19 133 38 12 67
4742F7O9k21n3L1R3L6j41L5J32j69q2M53l71K19k05j66M05r4o0m32Q13k84J52
$$ 67 136 -85 -138 -107 -14 22 -119 -84 48 -121 -203 250 -121 98 -107 -273 132 38 -22 -454 359 75 227
4765B27j75j59J62j15m7N6lj54K71P4l03J25o7J51L8j61KO5j61L17O5L4Jk07k7
$$ 227 52 -107 55 -60 -107 -51 -54 -208 63 137 -166 -41 -108 43 81 -80 -78 -13 -174 143 208 242 243 36 9
4790IM7k84K12J73k47R6P7J04l23NJ87J04l8j12P2m9mK56k41O5j39K41l74J09
$$ 9 56 -228 -16 157 -90 6 83 187 -136 -131 56 160 122 10 82 33 29 285 44 109 -30 211 -163 -54
4814e4Q4j47R6K8o1n9K68k09M2K35k85J22p8J28m22K17j58K16O8r3q5K30r7j7
$$ -54 30 -117 -21 7 -54 -113 155 -54 -12 223 -62 60 -18 110 -312 -95 -253 -37 31 -62 -147 83 -14 -31
4838c1jl9N9m3j70Q4J98K4j87Q7J88k49j20M28k81N4l1J75j53J52o4QL5o1j44
$$ -31 -32 -71 -12 -55 -225 -141 57 81 -106 -19 169 -80 -200 228 -53 1 -30 145 -8 144 80 88 123 62 -82
4863h2k0K87j19j9J60k34N6j0K2n5m30L15J12lN6j31J70j26p1J93j51J23j84K18
$$ -82 -102 185 66 47 207 -27 29 19 41 -14 -444 -129 -17 -20 36 -95 75 -51 -122 71 -80 43 -141 77
4887G7m2k5k14J55q4L58k95L03j30j94L51l94L29l22J69J25n6l69L09O9j23j30
$$ 77 35 10 -204 -49 -133 225 -70 233 103 -91 260 -134 195 -127 42 167 111 -258 51 120 -3 -133
4909a33J08O4N7k39P7%K18m8mK2j59J33j31q1J10O0j39k0J90j48J6K16J67l77
$$ -133 -25 39 96 -143 -66 -66 152 104 100 122 -37 96 -35 -116 -6 54 -85 -105 85 -63 -47 169 336 -41
4933d1J32k35K49p7jJ2k35K28n1r4n7K43J45k56r5J07J31k40K54m5j42K31l59
$$ -41 91 -144 105 28 27 39 -196 32 -19 -113 -170 73 218 -38 -133 -26 105 -135 119 74 -68 163 -196
4956a96L1J56J20R3j79J30j21R9j63j95L66p4j14j84K09L51l95J94m8o0N1j31
$$ -196 -165 -9 111 204 25 155 34 133 -30 -225 141 67 -47 -231 -22 329 -66 128 80 20 71 -60
4978f0O1P8Q2k83J9N5r8K57J59j77q7p9o6P5J13N0r2J5l30L34J13J82l58j17K14
$$ -60 1 79 161 -122 -103 -48 -146 111 270 93 6 -73 -139 -64 49 99 7 22 -308 26 139 321 -37 -154 60
5003F0J34j2j87j1m7J24r6K8P8j8M8N8l17J07N2l58L00J15n6J74j21l08M88j59
$$ 60 194 182 -5 -16 -63 61 -35 -7 71 53 101 159 -158 -51 1 -357 -57 58 2 176 55 -253 235 76
5027G6j16J95k29N28o45R5J78N7m37L42p3jo9N7l29M03K01k64R1j29K50k49Q9
$$ 76 -40 155 -74 454 -191 -96 82 139 -298 44 -29 -30 -99 -42 -371 32 233 -31 60 -69 181 -68 21
5050B1J40k49K04p5k84J93M1L6J01j89N3O9lJ9m1Ro9J43k31O2k5L2j08J43O7k78
$$ 21 161 -88 116 41 -243 -50 -9 27 128 -61 -8 61 58 77 36 45 -24 119 -112 -50 -75 -43 -151 -8 59 -219
5076b19L68J6Q9k49l3R1j4Q7Q1j04L1m30M62j11j21K70j41j16J12l31J10L7O3
$$ -219 149 165 254 5 -28 63 49 136 217 113 144 -286 176 65 -56 214 73 -43 69 -262 -152 -115 -52
5099e2J00p7j33K60l06L97k86j32K3K55j24j68L60j23J1J80r0j24J63j08Q8Q5
$$ -52 48 -29 -162 98 -208 189 -97 -229 -206 49 -75 -243 117 -6 5 185 95 -29 134 26 114 199
5121A99k03m9J31k95R7J09r2L22j34r7J75k70J81j36j36K90n0jJ34k01K12k80
$$ 199 -4 -53 78 -217 -120 -11 -103 219 85 -12 163 -107 74 -62 -198 92 42 41 175 -26 186 -94
5143i4M09l35N5K40k45o4jj9J94k11j7J93j10q9j3J43J17l65P7K16j69l6R7j13
$$ -94 315 -20 35 275 30 -34 -35 -54 140 -71 -88 105 -5 -94 -107 36 153 -212 -135 81 -88 -124 -27 -140
5167a40K63k16j58J05k87N03mK5j11P1MJ88l12J13l3J55l1k18J31j13L55k84J72
$$ -140 123 -93 -251 -146 -433 70 66 91 -20 51 55 243 -69 44 11 166 135 -83 48 -65 290 6 178
5190A78k3L0R5l07j87M6K10po1m4l0k4K19l21J11J41k23J65j7K78k60j30J24J73
$$ 178 155 185 280 -27 -214 -168 42 35 -26 -70 -100 -124 95 -226 -115 26 -197 -32 -49 229 -31 -161 -37 136
5214A36P9l92K40p9L3n8J58j85K41j80J10k64J24K51l24J21O3j45L8Q5q8L36k0
$$ 136 215 -177 63 -16 17 -41 117 -68 173 -7 103 -161 -37 214 -110 11 74 -71 -33 52 -36 300 280
5237B80l60P2n3R0q4j47L52k23K9MK9J49k6r3J83k45mJ04K2k93M1J75k20M60m63
$$ 280 -80 -8 -61 29 -55 -202 150 -73 -44 -40 -11 138 112 19 202 -43 -47 57 79 -214 -173 2 -218 242 -221
5262b21K81J71k46Q3M8K05m82P8J10J66l39M48l11K9J82l56L3J58N5m6j0J96j11
$$ -221 60 231 -15 68 116 321 -161 -83 27 193 -146 302 -9 20 202 -154 -121 37 92 46 36 232 121
5285A21j0q8Q8PO2k51l5J52j54K30J11l21P4J8k45N17l48K06j10O9k27J02k48
$$ 121 111 23 111 118 180 -71 -106 46 -108 122 233 -88 -14 4 -241 276 -72 134 24 93 -134 -32 -280
5308b80J68J02K19k07m3J6J03j49K06o5J8M8k0K8l12K28j28R8j0N8j85J7K04j47
$$ -280 -112 -10 209 2 -41 -25 78 -71 135 70 88 136 116 144 -168 60 -68 30 20 78 -107 -90 114 -33
5332c3j18J80N9k02l3N9P1j46P4L61k29M6k58J85j69K95l59K36N1N0j46l3k19
$$ -33 -151 29 88 -114 -147 -88 -17 -163 -89 272 43 89 -169 16 -153 142 -217 19 70 120 -26 -59 -278
5355b78M19k00Q7j26J73l9J76l83J40j02K00r3J57j19P1K25m07L05j67k62Q7K32
$$ -278 141 -59 28 -98 75 36 212 -171 -31 -133 67 -26 131 12 83 308 -99 206 39 -223 -136 96
5377I6j99l8J24Lk09J71o4q2K70j47P1p3j7J72%l50L36L5o3J7j49J02j00K51j53
$$ 96 -103 -141 -17 -14 -223 -52 -116 -198 72 -75 -4 -77 -94 78 78 -272 64 99 36 53 -96 6 -94 157 4
5402Dl9l20K80R5j01L77k41Pp5k0K65j21l18L48k39J63K72j95l70J94OP0L6o9
$$ 4 -35 -355 -75 20 -81 296 55 62 -13 -33 232 111 -207 141 -98 65 337 142 -228 -34 -28 42 78 9
5426IK39m39N2L37k42N7K0k71J51R9k09L08j56J37k4J01j40k7j41K37l9p5L4k93
$$ 9 248 -191 -139 198 -44 13 33 -238 -87 12 -197 111 -45 92 68 169 29 2 -139 98 59 -16 18 -275
5450b75J28J05r9j18L95m2k74j10J96P9m1r4K01O9k86K63q2k50M24j99J93k46
$$ -275 -147 -42 -141 -259 136 94 -180 -290 -94 -15 -56 -150 51 120 -166 97 15 -235 189 -10 183 -63
5472f3J19r2j64J14M3J20p3l05K56p7K56p9m3j90m3J86l38L06M71l49q8L6k30
$$ -63 56 -36 -200 -86 -43 77 4 -301 -45 -122 134 55 12 -178 -221 -35 -373 -67 404 55 -33 3 -227
5495b27R9JM9J10J23l68J80J46j17P3k36J18j73J20l5K99m01O4Q0K67j81j19j7
$$ -227 -128 -127 -78 32 155 -213 -33 113 -4 69 -167 -49 -222 -102 -137 162 -239 -175 -95 172 -9 -128 -145
5518a45q0Q4J72n0j60o1L64q6p0l0j72J92LK80k29N8m1k66Q2R4p0N25l48j86K11
$$ -145 -225 -141 31 -19 -179 -240 124 38 -32 -62 -234 -42 -39 241 12 70 29 -237 -155 -61 -131 394 46 -140 71
5543G1j78L5M07q2j48k72qJ04N6j06l8O2%O2K7J0p2l5K2L3K79m55J98P3K1k50
$$ 71 -107 -72 335 253 105 -167 -175 -71 -15 -121 -159 -97 -97 -35 -8 2 -70 -105 -83 -50 229 -226 -28 45 66 -184
5569a84J44l0L5pj61K27r8J81k33L20l0l91L43k04k45K85j22L91m28M6K2J09K83
$$ -184 -40 -70 -35 -42 -203 24 -74 107 -126 194 164 -227 116 -88 -333 -48 -170 221 -207 -161 -139 -30 253
5592B53j86l3J17N5l95k7J60J4J1K74l67P0O0J4J16l0N4l41L75j46k42K42Oj39
$$ 253 67 34 151 206 -189 -216 -56 -42 -31 243 -124 -54 6 20 136 106 160 -181 194 48 -194 48 54 -85
5616h5j12n8L57j86J77k40J83r6J07m4O4Q0j07J12l33J70K03r8j32j39K87q7P6
$$ -85 -197 -255 102 -84 93 -147 36 -60 47 3 67 147 40 152 -181 -11 192 94 -38 -177 110 23 99
5639I9J6j31J59r2o8k9R9l8j94L49j83j39K07k84O24k98k52L4J79p9J24q8J49
$$ 99 115 -16 143 51 -17 -46 53 15 -179 170 -13 -152 55 -229 395 97 -155 -121 58 -21 103 15 164
5662A64j57Q4M7Kj13J00j23j27K43pj85j46L49j18j74R6K54l23l8n4M97n10L28
$$ 164 7 91 138 140 27 127 4 -123 120 113 -72 -218 131 13 -161 -65 189 -134 -172 -226 271 -239 89
5685H9l08L30Oj23m0O2K05k03J41k01K54j77OL6j32j23K18r2K7q2JJ40J86k46
$$ 89 -219 111 117 -6 -46 16 221 18 159 -42 212 35 41 77 -55 -178 40 -52 -25 -107 -106 34 220 -26
5709b6K05r2j93L36j71k9N7k15j14K40J70l40L03j1k48oM59l20k37K87k52L17
$$ -26 179 87 -106 230 59 30 87 -128 -242 -2 168 -172 131 120 -128 -134 325 5 -232 55 -197 120
5731A20p4J75p8J63m6k30l4O9J95o1J5j24j43J46q3k43j20L64j76P3K47l47L06
$$ 120 46 221 143 306 260 30 -4 65 260 199 214 90 -53 93 10 -233 -353 11 -165 -92 155 -192 114
5754A14q3l7J5j57L57k70M69m02P4k71L93J52k79j99O2j73J81Q9K6j59k53N40
$$ 114 31 -6 9 -148 209 -61 408 6 80 -191 202 354 75 -124 -62 -235 -54 35 61 -98 -351 189
5776A89k14qJ86k24j74j7M50j25j52K96j56K5j92p3K04J45J6m05K73K7j56n2O9
$$ 189 -25 -33 153 -71 -245 -262 188 63 -89 207 51 76 -116 -189 15 160 176 -229 44 71 -85 -137 -68
5799f8J35J09j43L16m55J13j1N2J01o2k68M0K90j78N7l5K10j98k15J93n0L39n3
$$ -68 67 176 33 349 -106 7 -4 48 149 87 -181 -141 149 -29 28 -7 203 5 -210 -17 -67 272 219
5822B19k92K01j33J05p4k71J89J86k01J05o6O3m1K36k44J34J6k6Qj98p4j51L17
$$ 219 -73 128 -5 100 26 -245 -56 130 -71 34 -32 31 -10 226 -18 116 132 106 114 -84 -158 -309 8
5845HJ38j74j28O7J21o1oJ47l10L12o20M75k6J11o1K06k75k4K98k63L49l21j5
$$ 8 146 -28 -156 -89 32 -29 -35 112 -198 114 -506 -31 -57 54 -7 199 -76 -100 198 -65 284 -37 -52
5868e2n1J57J8j92J14k28P4M99j91j1j19O1j51P2o9J35k8j23J3J78Mj3k93K85
$$ -52 -103 54 72 -120 -6 -234 -160 339 148 137 18 79 -72 0 -69 66 38 -85 -72 106 110 97 -196 89
5892H9Q6k20j32n1K79j81K7n9L85k31L8P3K7k34J24Q0j32M9O4l63L19k48K06N
$$ 89 175 -45 -177 -228 51 -130 -103 -162 223 -8 30 103 130 -104 20 100 -32 17 81 -282 37 -211 -5 0
5916@J10j72P9q0oJ48n6j57L15j38M8K9j22j13K32J51m46L43k83L5J72j77K7j40
$$ 0 110 -62 17 -63 -69 79 23 -134 181 43 91 120 -2 -115 117 268 -178 165 -118 -83 89 -88 -61 -201
5940b01J26K70j92Lj50QJ44j42Q8J14o7k3j51N19Q8k67k94J23J80Q7k47j46jM32
$$ -201 -75 195 3 6 -144 -136 8 -134 -46 68 1 -22 -173 346 434 167 -127 -4 176 263 16 -130 -131 301
5964C01j30k00P0R9j68K81j80q8P7L7m39J58J70M1j3j34N0J81j04L0j12j1j58
$$ 301 171 -29 41 140 -28 253 73 -15 62 99 -340 -182 -12 29 16 -118 -68 113 9 39 -73 -84 -242
5987b42K54kL9Kn0J27m3j56P0r7j3R0p1K33k28J35p6j76M2M12k26J3p4J6r5J03
$$ -242 12 10 49 51 1 128 85 -71 -1 -98 -111 -21 -92 141 -87 48 -28 -204 -162 250 24 37 -37 -21 -116 -13
6013a3N2j12P7K70k05k7o0R3j21j39L11k97K40k99J78J76p1k15r9K24j45R4j17
$$ -13 39 -73 4 274 69 42 -18 75 -46 -185 126 -171 69 -230 -52 124 53 -162 -261 -37 -182 -88 -205
6036b05J73r6rK34r6k70K01P8J43l5l18n7M71l12L34l35J99O3l60L62l19L91l47
$$ -205 -32 -128 -137 97 1 -269 -68 10 153 118 -200 -257 214 -98 236 -99 100 163 -197 165 -154 237 -110
6059a10J74m7j4%q8M7J46L9j95J79Q9k89n9K30j51k1R1j53J09r5k1J91j32K67
$$ -110 64 17 3 3 -85 -38 108 147 -48 131 220 -69 -128 102 -49 -70 21 -132 -23 -118 -139 52 -80 187
6083A87j94Q7l7J8L1M9k08n5L61l16K63k19l4L89k59M3k60J02J61l51M06l58R8
$$ 187 -7 80 43 61 92 141 -67 -122 239 -77 186 -33 -67 322 63 106 -154 -52 109 -242 164 -194 -96
6106i6m0N28n15K87j21k9Q3j20J24J4k81K52j67RP4r3N9q5K61l30J83p1J37j25
$$ -96 -136 392 -123 164 43 14 97 -23 101 115 -166 86 -81 -72 2 -91 -32 -117 144 -186 -3 -74 63 -62
6130f2m8n2J4L12k13o9M2J98q5m3j58L60n09J91K24k04J65j26M2K1R3Q6k67K31
$$ -62 -110 -162 -148 164 -49 -118 -76 122 37 -6 -164 196 -313 -122 102 -102 63 -63 -21 0 93 179 -88 143
6154A43n8Q8Oj47n8R0Q9k15j11k23M53K1kk13N0K6J45j79J37l00J65K87j75R9
$$ 143 85 173 179 32 -26 64 153 -62 -173 -396 57 78 76 -137 -87 -61 84 -95 42 -258 -93 194 19 118
6178A18K23m16o4pJ12m7J60l1J72k25Q3J45l32L38k72K70k16J87p5N2j37k68L53
$$ 118 341 -75 -139 -146 -34 -81 79 48 220 -5 78 223 -109 229 -43 227 11 198 123 175 38 -230 123
6201A23R3r4j90J59l25K58j90K46j04K19o7o2j5o5J98p1n6l34L67R9L4l34L04
$$ 123 216 122 -68 91 -234 24 -166 80 -24 195 128 66 51 -14 184 113 57 -277 90 189 223 -111 193
6224A93n6l73L37l3k13N4j61L37j54J88p9q1j12K03j44J20p1j12%K35OK5j91P5
$$ 193 137 -236 101 68 -145 -91 -252 85 -69 119 40 -41 -153 50 -94 26 -45 -157 -157 78 84 109 -82 -7
6248gK53l49J68k2J34j39j83MK12j30r3Q3J23j47J62j26K51k98K13n0l5mk76K02
$$ -7 246 -103 65 43 177 38 -145 -141 71 -59 -152 -69 54 -93 69 -57 194 -104 109 59 24 20 -256 -54
6272e4J30k75K90j5O5l8j35n3K9L2M08m79Nj54K93p4j8m3K11j15j25J29k73N05
$$ -54 76 -199 91 76 141 103 -32 -85 -56 -24 384 -95 -90 -244 49 -25 -43 -86 125 10 -115 14 -259 246
6296B46k63J70K1j31j65J24J57k91M56j88j56N5k66K95j77q9K23j11r8M46k68
$$ 246 -17 153 174 43 -122 2 159 -132 324 136 -20 35 -231 64 -113 -202 21 -90 -188 258 -10
$$ [...]
8191F5
##END NTUPLES=NMR FID
##END=
