##TITLE=1H_Ad=0(Aceton-ag)-pr
 CDCl3
 8 sc, 
 17.11.2022
##JCAMPDX= 6.0         $$ Bruker NMR JCAMP-DX V2.0
##DATA TYPE= NMR FID
##DATA CLASS= NTUPLES
##ORIGIN= UXNMR, Bruker Analytische Messtechnik GmbH
##OWNER= root
$$ XWIN-NMR		Version 3.5
$$ Thu Nov 17 13:58:27 2022 Russian Standard Time (UT+4h)  she@DPX200
##.OBSERVE FREQUENCY= 200.1313499994
##.OBSERVE NUCLEUS= ^1H
##.DELAY= (6, 6)
##.ACQUISITION MODE= SIMULTANEOUS
##.ACQUISITION SCHEME= undefined
##.AVERAGES= 8
##.DIGITISER RES= 18
##SPECTROMETER/DATA SYSTEM= spect
##.PULSE SEQUENCE= zg30
##.SOLVENT NAME= MeOD
##.SHIFT REFERENCE= (INTERNAL, MeOD, 0, 15.7039)
##AUDIT TRAIL= $$ (NUMBER, WHEN, WHO, WHERE, WHAT)
$$ ##TITLE= Audit trail, XWIN-NMR		Version 3.5
$$ ##JCAMPDX= 5.01
$$ ##ORIGIN= Bruker BioSpin GmbH
$$ ##OWNER= she
$$ F:/spectra/data/she/nmr/H-F/1/audita.txt
$$ ##AUDIT TRAIL=  $$ (NUMBER, WHEN, WHO, WHERE, WHAT)
(   1,<2022-11-17 13:57:01.42 +0400>,<she>,<DPX200>,
      <created by zg, POWCHK disabled, PULCHK disabled
       configuration hash MD5:
       00 E9 B6 7A A2 85 ED C7 34 08 36 98 17 FE 4E 26
       data hash MD5: 16K
       F2 D1 68 13 77 88 14 23 95 D9 68 19 65 85 52 5B>)
$$ ##END=
$$ 
$$ hash MD5
$$ B2 C4 55 96 3D EE AF 39 BC B8 DE DD F2 D0 03 A1
##$RELAX= 
##$RELAX= 
##$RELAX= 
##$RELAX= 
##$RELAX= 
##$RELAX= 
$$ Bruker specific parameters
$$ --------------------------
##$DU= <F:/spectra>
##$EXPNO= 1
##$NAME= <H-F>
##$PROCNO= 1
##$TYPE= <nmr>
##$USER= <she>
##$AMP= (0..31)
100 100 100 100 100 100 100 100 100 100 100 100 100 100 100 100 100 100 
100 100 100 100 100 100 100 100 100 100 100 100 100 100 
##$AQSEQ= 0
##$AQ_mod= 1
##$AUNM= <au_zg>
##$AUTOPOS= <>
##$BF1= 200.13
##$BF2= 200.13
##$BF3= 200.13
##$BF4= 200.13
##$BF5= 200.13
##$BF6= 200.13
##$BF7= 200.13
##$BF8= 200.13
##$BYTORDA= 1
##$CFDGTYP= 0
##$CFRGTYP= 5
##$CHEMSTR= <none>
##$CNST= (0..31)
1 1 145 1 1 1 1 1 1 1 1 1 1 1 1 1 1 1 1 1 1 1 1 1 1 1 1 1 1 1 1 1 
##$CPDPRG= <>
##$CPDPRG1= <>
##$CPDPRG2= <>
##$CPDPRG3= <>
##$CPDPRG4= <mlev>
##$CPDPRG5= <mlev>
##$CPDPRG6= <mlev>
##$CPDPRG7= <mlev>
##$CPDPRG8= <mlev>
##$CPDPRGB= <>
##$CPDPRGT= <>
##$D= (0..31)
0 1.2 0 0 0 0 0 0 0 0.06 0 0.03 0 0 0 0 0.0002 0 0 0 0 0 0 0 0 0 0 0 0 
0 0 0 
##$DATE= 1668679020
##$DBL= (0..7)
120 120 120 120 120 120 120 120 
##$DBP= (0..7)
150 150 150 150 150 150 150 150 
##$DBP07= 0
##$DBPNAM0= <>
##$DBPNAM1= <>
##$DBPNAM2= <>
##$DBPNAM3= <>
##$DBPNAM4= <>
##$DBPNAM5= <>
##$DBPNAM6= <>
##$DBPNAM7= <>
##$DBPOAL= (0..7)
0.5 0.5 0.5 0.5 0.5 0.5 0.5 0.5 
##$DBPOFFS= (0..7)
0 0 0 0 0 0 0 0 
##$DE= 6
##$DECBNUC= <off>
##$DECIM= 32
##$DECNUC= <off>
##$DECSTAT= 4
##$DIGMOD= 1
##$DIGTYP= 9
##$DL= (0..7)
0 120 120 120 120 120 120 120 
##$DP= (0..7)
150 150 150 150 150 150 150 150 
##$DP07= 0
##$DPNAME0= <>
##$DPNAME1= <>
##$DPNAME2= <>
##$DPNAME3= <>
##$DPNAME4= <>
##$DPNAME5= <>
##$DPNAME6= <>
##$DPNAME7= <>
##$DPOAL= (0..7)
0.5 0.5 0.5 0.5 0.5 0.5 0.5 0.5 
##$DPOFFS= (0..7)
0 0 0 0 0 0 0 0 
##$DQDMODE= 0
##$DR= 18
##$DS= 0
$$ [...]
##$SUBNAM2= <"">
##$SUBNAM3= <"">
##$SUBNAM4= <"">
##$SUBNAM5= <"">
##$SUBNAM6= <"">
##$SUBNAM7= <"">
##$SUBNAM8= <"">
##$SUBNAM9= <"">
##$SW= 18.0517283424941
##$SWIBOX= (0..15)
0 0 2 0 0 0 0 0 0 0 0 0 0 0 0 0 
##$SW_h= 3612.71676300578
##$TD= 16384
##$TD0= 1
##$TE= 0
##$TE2= 300
##$TE3= 300
##$TEG= 300
##$TL= (0..7)
0 120 120 120 120 120 120 120 
##$TP= (0..7)
150 150 150 150 150 150 150 150 
##$TP07= 0
##$TPNAME0= <>
##$TPNAME1= <>
##$TPNAME2= <>
##$TPNAME3= <>
##$TPNAME4= <>
##$TPNAME5= <>
##$TPNAME6= <>
##$TPNAME7= <>
##$TPOAL= (0..7)
0.5 0.5 0.5 0.5 0.5 0.5 0.5 0.5 
##$TPOFFS= (0..7)
0 0 0 0 0 0 0 0 
##$TUNHIN= 0
##$TUNHOUT= 0
##$TUNXOUT= 0
##$USERA1= <user>
##$USERA2= <user>
##$USERA3= <user>
##$USERA4= <user>
##$USERA5= <user>
##$V9= 5
##$VALIST= <valist>
##$VCLIST= <CCCCCCCCCCCCCCC>
##$VD= 0
##$VDLIST= <DDDDDDDDDDDDDDD>
##$VPLIST= <PPPPPPPPPPPPPPP>
##$VTLIST= <TTTTTTTTTTTTTTT>
##$WBST= 1024
##$WBSW= 4
##$XGAIN= (0..3)
0 0 0 0 
##$XL= 0
##$YL= 0
##$YMAX_a= 133126
##$YMIN_a= -140678
##$ZGOPTNS= <>
##$ZL1= 120
##$ZL2= 120
##$ZL3= 120
##$ZL4= 120
##$ABSF1= 10
##$ABSF2= 0
##$ABSG= 5
##$ABSL= 3
##$ALPHA= 0
##$AQORDER= 0
##$ASSFAC= 0
##$ASSFACI= 0
##$ASSFACX= 0
##$ASSWID= 0
##$AUNMP= <proc_1d>
##$AZFE= 0.1
##$AZFW= 0.1
##$BCFW= 1
##$BC_mod= 2
##$BYTORDP= 1
##$COROFFS= 0
##$CY= 11.3945322036743
##$DATMOD= 1
##$DC= 2
##$DFILT= <>
##$DTYPP= 0
##$F1P= 2.36226072786647
##$F2P= -0.459571619588291
##$FCOR= 0.5
##$FTSIZE= 0
##$FT_mod= 4
##$GAMMA= 1
##$GB= 0.15
##$INTBC= 1
##$INTSCL= 1
##$ISEN= 128
##$LB= 0.24
##$LEV0= 0
##$LPBIN= 0
##$MAXI= 10000
##$MC2= 0
##$MEAN= 0
##$ME_mod= 0
##$MI= 1.114404
##$NCOEF= 0
##$NC_proc= 0
##$NLEV= 6
##$NOISF1= 3.799351
##$NOISF2= 2.8
##$NSP= 1
##$NTH_PI= 0
##$NZP= 0
##$OFFSET= 15.70392
##$PC= 1
##$PHC0= -18032.97
##$PHC1= 17.6007
##$PH_mod= 1
##$PKNL= yes
##$PPARMOD= 0
##$PSCAL= 0
##$PSIGN= 0
##$REVERSE= no
##$SF= 200.130013532006
##$SI= 16384
##$SIGF1= 3
##$SIGF2= 2
##$SINO= 400
##$SIOLD= 16384
##$SREGLST= <1H.CDCl3>
##$SSB= 0
##$STSI= 0
##$STSR= 0
##$SW_p= 3612.71676300578
##$SYMM= 0
##$S_DEV= 0
##$TDeff= 0
##$TDoff= 0
##$TI= <>
##$TILT= no
##$TM1= 0
##$TM2= 0
##$TOPLEV= 0
##$USERP1= <user>
##$USERP2= <user>
##$USERP3= <user>
##$USERP4= <user>
##$USERP5= <user>
##$WDW= 1
##$XDIM= 8192
##$YMAX_p= 0
##$YMIN_p= 0
$$ End of Bruker specific parameters
$$ ---------------------------------
##NTUPLES= NMR FID
##VAR_NAME=  TIME,          FID/REAL,        FID/IMAG
##SYMBOL=    X,             R,               I
##VAR_TYPE=  INDEPENDENT,   DEPENDENT,       DEPENDENT
##VAR_FORM=  AFFN,          ASDF,            ASDF
##VAR_DIM=   8192,          8192,            8192
##UNITS=     SECONDS,       ARBITRARY UNITS, ARBITRARY UNITS
##FACTOR=    0.0002768,     1,               1
##FIRST=     0,             0,               0
##LAST=      2.2672688,     0,               0
##MIN=       0,             -140678,         0
##MAX=       2.2672688,     133126,          0
$$ Real data points
##PAGE= N=1
##DATA TABLE= (X++(R..R)), XYDATA
0@%%%%%%%%%%%%%Oj4J6j6J6k4L2l3M1m9N7p0Q0r1J06j23J43j66J88k13K44k77
$$ 0 0 0 0 0 0 0 0 0 0 0 0 0 0 6 -8 8 -8 8 -16 16 -17 24 -25 32 -38 42 -49 57 -66 77 -89 99 -114 130 -147
35a47L10l48L92m39M90n45O05o73P46q24R12j008J112j225J349j486J636j803
$$ -147 163 -185 207 -232 258 -287 318 -355 391 -433 479 -529 583 -642 707 -779 857 -946
53i46J989k195K429k694K993l337L743m224M804n526O447p671R387j1977J6388
$$ -946 1043 -1152 1277 -1417 1576 -1761 1982 -2242 2562 -2964 3483 -4188 5199 -6778 9610
68I610k5856Q5127j05768r7291K37354j1313k02380M9786J93857j14729j45558
$$ 9610 -16246 68881 -36887 -134178 103176 91863 -110517 -60731 133126 18397 -127161
79a27161J41534J07621j73845m9888J74482L400j73711M8550J50956q6600j23908
$$ -127161 14373 121994 -51851 -101739 72743 76143 -97568 -49018 101938 15338 -108570
90a08570J21812Q2036j37385l9594J43906l460j33733M0673J17716p2481r0055
$$ -108570 13242 95278 -42107 -81701 62205 58745 -74988 -34315 83401 10920 -79135
101g9135R5146N9368j09068k3730J11231j0200j05590M1689Q9017o8086o7112
$$ -79135 16011 75379 -33689 -57419 53812 43612 -61978 -20289 68728 642 -66470
112f6470Q5947L8167r5399r405R4241j8342q6184M2054P1661o2042n0949P6213
$$ -66470 19477 57644 -37755 -47160 47081 28739 -57445 -15391 56270 -5772 -56721 19492
124A9492K6352q1140J9P9985k4384o9827M6874N4508o2973l3765P3804R201p4554
$$ 19492 45844 -35296 -35277 44708 20324 -49503 -2629 51879 -11094 -44859 28945 38146 -36408
137c6408J4262O8175l5594n6084N2127L8179o4672j7119O8766p159o5788K8819
$$ -36408 -22146 46029 10435 -45649 6478 44657 -20015 -37134 31632 24473 -41315 -12496
149a2496N4654m7427l8884O0620J8381o6995M577O7122k6869n8070M6216M4403
$$ -12496 42158 -5269 -44153 16467 34848 -32147 -27570 39552 12683 -45387 829 45232
161D5232o0115k5420O9983L775p1992K0601O6794m3138n3482O0842L4571p3563
$$ 45232 -14883 -40303 29680 33455 -38537 -17936 48858 5720 -47762 13080 47651 -25912
173b5912j2370P8700j2813p7516L7107O6955n9380n0052P4752K7888q3858l722
$$ -25912 -38282 40418 27605 -49911 -12804 54151 -5229 -55281 19471 47359 -36499 -40221
185d0221Q5404k0938p9584M5606O5783o4142m6092P7696K3894q3284Q71Q2729
$$ -40221 45183 24245 -55339 -9733 56050 -8092 -54184 23512 47406 -35878 -35007 47722
197D7722k4244p5230M6212O1275o2959m3033P3563K2022p9165k98P8097k2300
$$ 47722 23478 -51752 -5540 55735 -7224 -50257 23306 45328 -33837 -34135 43962 21662
209B1662p1035M1532N7252n7651l9680O7241J9968p2215Q65P1504k1591o4091
$$ 21662 -49373 -7841 49411 -8240 -47920 19321 39289 -32926 -32061 39443 17852 -46239
221d6239M0475N2159n4792l5650O4858J7595o8813K168O8377k1369o1895L9593
$$ -46239 -5764 46395 -8397 -44047 20811 38406 -30407 -28239 40138 18769 -43126 -3533
233c533M9543n3071l4044O1997J5611o6547L440O4854k3508n7695L9804M5170
$$ -3533 46010 -7061 -41105 20892 36503 -30044 -26604 38250 14742 -42953 -3149 42021
245D2021n3109k9310O0600J1569o3445P294O0720k5018n1872M0479L8890n0726
$$ 42021 -11088 -40398 20202 31771 -31674 -24380 36340 11322 -40550 -71 38819 -11907
257a1907k1891N5806N535n6142J2521N0715k7073m1283M0013K6958m6712j2778
$$ -11907 -33798 22008 27543 -28599 -16078 34637 7564 -33719 6294 33252 -13460 -26238
269b6238M9258k638m8121J7023M1035k9772l1246L8280J7795m2305m561M2711
$$ -26238 23020 20382 -27739 -10716 30319 547 -30699 7581 25376 -16929 -21490 21221
281B1221r046l8914K0986L1629l0495k0277L6361Q814l7903M271L5893j5054l0656
$$ 21221 12175 -26739 -5753 25876 -4619 -24896 11465 20279 -17624 -13353 22540 7486 -23170
294b3170K5011K2457l1516j1912L4350O83l3670R453K9954j9279k3978K6057J5159
$$ -23170 1841 24298 -7218 -19130 15220 15903 -17767 -8314 21640 2361 -21617 4440 19599
307A9599l0924n831L2386m578l0767J3222K7210k1517k0657K7925J2132l0969
$$ 19599 -11325 -17156 15230 10652 -20115 -6893 20317 -1200 -21857 6068 18200 -12769
319a2769k719L2386o343k9988J4916K6026k2211j9123K8386J0443l0944j158L1053
$$ -12769 -15488 16898 10555 -19433 -4517 21509 -702 -19825 8561 19004 -11940 -13098 17955
332A7955q080k9051J6425K4065k4208j7327K9271Q011l2097J115L1511j0737k8329
$$ 17955 9875 -19176 -2751 21314 -2894 -20221 9050 17061 -15036 -13921 17590 6853 -21476
345b1476J8981K2541k5699j4979L1113N142l2023M865L0985j3596k6626K2169
$$ -21476 -2495 20046 -5653 -20632 10481 15623 -16400 -11535 19450 5854 -20772 1397
357A397K0342k8530j1182L2042J298l2109Q374K8945j6738k4089K3480J6467k8744
$$ 1397 21739 -6791 -17973 14069 15367 -16742 -8368 20577 3839 -20250 3230 19697 -9047
370i047p392K9601k154k8349J0175K4482j7620j8561K2846J1355k5439l333K6189
$$ -9047 -16439 13162 11008 -17341 -7166 17316 -304 -18865 3981 15336 -10103 -13436 12753
383A2753m682k3875J2485J9531j7086j3897K1288P386k2926o0K2570o718j9959
$$ 12753 8071 -15804 -3319 16212 -874 -14771 6517 13903 -9023 -9083 13487 6769 -13190
396a3190J2435J5588j7083j0292J9267M283k0821J473J9408p649j6445J1656J2716
$$ -13190 -755 14833 -2250 -12542 6725 11008 -9813 -8340 11068 3419 -13026 -1370 11346
409A1346j4749q713J7080L711j7761J712J7056o388j3915R861J1654j2493p655
$$ 11346 -3403 -12116 4964 8675 -9086 -7374 9682 3294 -10621 -760 10894 -1599 -9254
422i254J5278K716j5404J648J4916o291j2579R687R634j2934o057J4391J049j4743
$$ -9254 6024 8740 -6664 -5016 9900 3609 -8970 717 10351 -2583 -8640 5751 6800 -7943
436g943L025J3404p641j1117J0699P680j3091l697J4597m85j4341N363J2524q485
$$ -7943 -4918 8486 845 -10272 427 8107 -4984 -8681 5916 5431 -8910 -3547 8977 492
450D92r638J1546O760j3677j842J4347k637j3309O802J1002r841p837J1749M190
$$ 492 -9146 2400 9160 -4517 -6359 7988 5351 -7958 -1156 9846 5 -7832 3917 8107
464H107j3445l94J2780l898j1499P289Q401j0132n037J1061J498j1625K444J1189
$$ 8107 -5338 -5732 7048 3150 -8349 -1060 7341 -2791 -7828 3233 4731 -6894 -4450 6739
478F739n800q748Q434O059r428k673J0282k20r806L448Q823n890o520P315L936
$$ 6739 939 -7809 625 6684 -2744 -5417 4865 4645 -5161 -1713 7110 1220 -5300 2015 5951
493E951q211j754Q349q71q155K908O651n173n193N949L374o912j261O714l18o435
$$ 5951 -2260 -4014 4335 3464 -4691 -1783 4868 -305 -5498 451 3825 -3087 -4348 2366 2048 -4387
509d387K454N710m061m053N010K752m895q04N226l61n216K067M846l676l459M290
$$ -4387 -1933 3777 -284 -4337 673 3425 -1470 -2274 2952 2591 -2625 -558 4288 612 -2847 1443
525A443K468n142j216N180j96o226K454M663l831m090M820K629n498j219N758
$$ 1443 3911 -1231 -2447 2733 2537 -3689 -1235 3428 -403 -4493 327 2956 -2542 -3761 1997
540A997l89n780K629N139l968l346M874K399n540l33N777j185n265L385M033m364
$$ 1997 1608 -4172 -1543 3596 -372 -3718 1156 3555 -1985 -2318 3459 2274 -2991 394 4427 63
556F3k309M334J161n199L16M343k051l837L320K551m541j108M053J03m095J323
$$ 63 -2246 2088 3249 -1950 -1634 2709 658 -3179 141 2692 -1849 -2957 1096 1199 -2896 -1573
572a573L692k642k789L847J513l519l23L772m40l435J821K799k373j568K942M67
$$ -1573 2119 -523 -3312 535 2048 -1471 -1794 1978 1538 -1897 -76 2723 350 -1218 1724 2191
588B191k779L33J874o56k039P67J557j620n80J035J00j190k33J024j6q53R0J001
$$ 2191 -588 -255 1619 963 -1076 -309 1248 -372 -952 83 183 -1007 -1240 -216 -232 -1085 -995 6
606Fn97k02Q17L94o86k20R92M62j240K72J387l85j226O35J330j331o73J273L20
$$ 6 -591 -793 24 418 -268 -488 504 966 -274 -2 1385 1000 -226 409 1739 408 -265 1008 1328
625A328k009p7J904r46j709P19J912j642j270J476R31j852l69K527q07j677J238
$$ 1328 -681 -758 1146 200 -1509 -790 1122 -520 -1790 -314 617 -1235 -1604 923 116 -1561 -323
642c23J675j775l34J808J41j697O73J824j576o26J239M56j694J62J195r39j478
$$ -323 1352 -423 -757 1051 1192 -505 168 1992 416 -210 1029 1485 -209 -47 1148 209 -1269
659a269J491P90j798k62J484m99j107K13J166q04r69J521P9q42M31P78o9n23J75
$$ -1269 222 1012 -786 -1048 436 -63 -1170 -957 209 -595 -1564 -43 36 -806 -375 403 334 -189 -14
678a4Q75o28l13P30N5m67L45Q3m66L48m0l51l27M39j98n66kL01m64q8O94l65j70
$$ -14 861 233 -80 650 705 238 583 666 200 548 508 157 -170 269 71 -495 -497 -196 -660 -748 -54 -419 -589
701e89J99J17j94j03M50J89m77L84M49n09L86N72n31k40P88jp89P9Q57n98q64
$$ -589 -390 -273 -467 -570 -120 69 -408 -24 425 -84 302 874 343 103 891 890 101 180 1037 439 -425
722d25P40M24r36l73N01j51o56L30M15j64o35O50q0l41N09J86l7j21L26J06k73
$$ -425 315 739 -197 -570 -69 -220 -876 -546 -131 -295 -930 -280 -360 -701 -192 -6 -43 -164 162 268 -5
743eM59K57n41J30P43l86o93P71M39j148qN00l51q49M59O15q69k56N02Jr03L04
$$ -5 454 711 170 300 1043 657 -36 735 1174 26 18 518 167 -682 -223 392 -477 -733 -231 -230 -1133 -829
765h29J053q13l45J086l87p28J013M30n39l59J172O6j016K42J360r50q65J004
$$ -829 224 -589 -934 152 -235 -963 50 480 -59 -418 754 820 -196 46 1406 456 -409 595
783E95O19j299n34J256N4j507K46J233q06j160J164K73r40k97R96j72o66M22J065
$$ 595 1214 -85 -619 637 691 -816 -570 663 -143 -1303 -139 134 -806 -1103 -107 -279 -945 -523 542
802E42r52k10J113J29r98J50J331m56o31O30M88q92l27J009m21q72M21Q33l50
$$ 542 -410 -620 493 622 -376 -226 1105 649 18 648 1136 244 -83 926 505 -367 54 887 537
821E37j028J96P14r31p33J015N31j041m09J347Nj152J24J680o84j096J064R34
$$ 537 -491 -295 419 -512 -1245 -230 301 -740 -1149 198 203 -949 -825 855 171 -925 139 1073
839A073j089o03J415N51j866O32J376j146q41J107N44j598m66J999n26k167J221
$$ 1073 -16 -619 796 1347 -519 113 1489 343 -498 609 1153 -445 -911 1088 562 -1605 -384
856c84J394j366j348J929M34k249M76K107j108k006K137J537j978j118K599K19
$$ -384 1010 -356 -1704 225 659 -1590 -1114 993 -115 -2121 16 1553 -425 -1543 1056 1275
872A275k598Q08K707j440k330K406J365k625q00K858l02k857J046K090j762j614
$$ 1275 -1323 -515 2192 752 -1578 828 2193 -432 -1232 1626 1324 -1533 -487 1603 -159 -1773
888a773K227N54k549K7K525p55k102J400K064k398q12K622N2k140K57K724j218
$$ -1773 454 1008 -1541 -1514 1011 256 -1846 -446 1618 -780 -1592 1030 1082 -1058 -801 1923 705
905G05k194J636K308k650j044K560K82k708O78K206j032k338J461J946k542j064
$$ 705 -1489 147 2455 -195 -1239 1321 1603 -1105 -427 1779 747 -1591 -130 1816 -726 -1790
921a790K354L71k537J18K395p48k298J790J691j915j338K784O29l180R47K820
$$ -1790 564 935 -1602 -1484 911 163 -2135 -345 1346 -569 -1907 877 1506 -1674 -727 2093
937B093j344k126J912J837k912r86L380p8l499R66K903j789k580K269J964l657
$$ 2093 749 -1377 535 2372 -540 -1526 1854 1776 -1723 -757 2146 357 -2223 46 2010 -1647
953a647o20L609l43l591J425L347k467k614L377J727l925k44L988o05l747K147
$$ -1647 -2267 1342 999 -2592 -1167 2180 -287 -2901 476 2203 -1722 -1966 2022 1417 -2330 -183
969a83K869k488k254L691R39m092M55L570j354l321K504K268l683j273L871J34
$$ -183 2686 198 -2056 1635 2574 -1518 -1063 2507 1153 -2168 336 2604 -1079 -2352 1519 1653
985A653m256J425L336k148l115L159J872l437q81M191n01l897J647L493k252k591
$$ 1653 -2603 -1178 2158 10 -3105 54 1926 -1511 -2392 1799 1298 -2599 -952 2541 289 -2302
1001b302L198J854l772m79L749m01l907J635L179k671k439L349J443m023l64L685
$$ -2302 896 2750 -1022 -1501 2248 1847 -2060 -425 2754 83 -2356 993 2436 -1587 -1951 1734
1017A734p08l602J904K743k679k059L409J202m039L12L794j124l366K225K888
$$ 1734 1026 -2576 -672 2071 -608 -2667 742 1944 -2095 -1783 2011 887 -2479 -254 2634
1032B634k876j844L734Q09m268M40L992j464l479K570K606l408j821L895O73m476
$$ 2634 -242 -2086 1648 2457 -1811 -1371 2621 1157 -2322 248 2854 -554 -2375 1520 2193 -2283
1048b283P40L760j801l420K826K447l714j344M288K11m320J268M087k741k803
$$ -2283 -1543 2217 416 -3004 -178 2269 -1445 -2789 1499 1710 -2610 -1342 2745 4 -2799
1063b799L538K012l735r90M362o22m164J928L767l188k678M049J427m794k49M763
$$ -2799 739 2751 -984 -1974 2388 1766 -2398 -470 3297 109 -2569 1480 2907 -1887 -2136 2627
1079B627j406m389K676L048l402k453M212R04m409L19M883j778l967K801L083
$$ 2627 1221 -3168 -492 2556 -846 -3299 913 1817 -2592 -2273 2610 832 -3135 -334 2749
1094B749l448j718M119O72m452J118M033k308l204K974K259l368j173L600J58
$$ 2749 -699 -2417 1702 2374 -2078 -960 3073 765 -2439 535 2794 -574 -1747 1853 2011
1109B011m105R35L835k271k914K794K210l832j354M223k90l463Q78L547k163l190
$$ 2011 -2094 -1159 2676 405 -2509 285 2495 -1337 -2691 1532 1242 -2221 -1343 2204 41 -3149
1125c149L687J862l575q79M106l07l649J141M091k876k738L185J845l906p66M211
$$ -3149 538 2400 -1175 -2054 2052 1745 -1904 -763 3328 452 -2286 899 2744 -1162 -1928 2283
1141B283p45l807J680L221l210j879L196J229l847k10M030j188l693K473K942
$$ 2283 1538 -2269 -589 2632 -578 -2457 739 1968 -1879 -2089 1941 753 -2940 -467 2475
1156B475l390j682M017L71l815Q87M160k162l360K878K406l440j368M156l4m108
$$ 2475 -915 -2597 1420 1791 -2024 -1137 3023 861 -2499 379 2785 -655 -2023 2133 2099 -2009
1172b009Q14L961k210l478L564J789l864q20L635j83l708J235L377k264k673L380
$$ -2009 -1195 2766 556 -2922 642 2431 -1433 -2253 1382 1199 -2509 -1274 2103 -161 -2834 546
1188E46J596l698k17L666q63l108J881K802k967j601L297O66l202J73L380j486
$$ 546 2142 -1556 -1773 1893 1030 -2078 -197 2605 -362 -1963 1334 2000 -1202 -1029 2351 865
1204H65l039K261K490l313j560L352Q14l880L83L285j460k796J955K796l031j481
$$ 865 -2174 87 2577 -736 -2296 1056 1870 -2010 -1627 1658 198 -2598 -643 2153 -878 -2359
1220b359L490M70l443M06L586j596k793K611K132k730j458L528Ml146N42K912
$$ -2359 1131 1601 -1842 -1436 2150 554 -2239 372 2504 -226 -1684 1844 1848 -1298 -756 2156
1236B156j877k346K426J678l152p62L342k43l359J292K748k333k228K886J708
$$ 2156 279 -2067 359 2037 -1115 -1877 1465 1222 -2137 -845 1903 -430 -2658 228 1936
1251A936l476m92L737o27l117J587K809k212k332L086J267l285l14L411o41l274
$$ 1936 -1540 -2032 1705 1078 -2039 -452 2357 145 -2187 899 2166 -1119 -1433 1978 1337 -1937
1267a937J602K643k355j837K737Q48l068r1L026j243k424J725K156k791q08K544
$$ -1937 -335 2308 -47 -1884 853 1701 -1367 -1458 1568 325 -2099 -374 1782 -1009 -1817 727
1283G27M79k866P23K621j730j975K346J595k483j063K899K43k951J009K622j760
$$ 727 1206 -1660 -937 1684 -46 -2021 325 1920 -563 -1626 1273 1516 -1435 -426 2196 436
1299D36k032K057J339k409p75K552j45k624Q56J954j255j702J974P53j965n80
$$ 436 -1596 461 1800 -609 -1384 1168 1023 -1601 -745 1209 -46 -1748 226 979 -986 -1566
1315a566K684l11k597J349J626j183j241K115M31j911R7J931o34k117J603J289
$$ -1566 1118 807 -1790 -441 1185 2 -1239 876 1307 -604 -507 1424 790 -1327 276 1565
1331A565j711j146J986N22k345K31K521j059k293J507J489j640j138K074M19k557
$$ 1565 -146 -1292 694 1216 -1129 -898 1623 564 -1729 -222 1267 -373 -1511 563 982 -1575
1347a575O47K179q85j954J744J071j621o49K191q7k319P37K271j294j436J705
$$ -1575 -928 1251 366 -1588 156 1227 -394 -1043 1148 1061 -1258 -521 1750 456 -980 725
1363G25O03j615o46J956k29j944P24J719j585j278J686R82k304J77J800m76k039
$$ 725 1328 -287 -933 1023 794 -1150 -426 1293 -292 -1570 116 1098 -1206 -1029 771 295 -1744
1380a744J482J445j607r55J790O30j801O6J664l69j673Q99J701j277j002J758
$$ -1744 -262 1183 -424 -1379 411 1041 -760 -694 970 601 -1072 -173 1528 251 -751 1007
1396A007qj470j40J392o09j296R67R28j100r01J798J39j647K57J403o88j191J049
$$ 1007 999 -471 -611 781 172 -1124 -157 771 -329 -1230 568 707 -940 -683 720 32 -1159 -110
1414a10R96j305m75J622p1j471N13J099o62q66J052R38j321o63J376J50j437K83
$$ -110 886 -419 -894 728 657 -814 -301 798 136 -730 322 1260 -61 -724 652 802 -635 -352
1432c52J367p20j323J404L23j289k20J151K05j334J95J078q81n68J082L81q59
$$ -352 1015 295 -1028 376 699 -590 -810 341 546 -788 -593 485 -396 -964 118 499 -360
1449c60j46J055p8r20K82Q22m91o55J213K13j321J2J002j88j114O66P22j153l56
$$ -360 -506 549 471 -449 -167 655 164 -491 722 935 -386 -374 628 440 -674 -8 714 -439 -795
1468g95J189k6q71j55P42j00j141Q94Q53j073j57R80K2n60m42J170j39p58N36
$$ -795 394 368 -503 -658 84 -16 -1157 -263 590 -483 -640 340 362 -198 -640 530 391 -367 169
1487A69N27n65k03O86L6o09r9O54n65j73N07J24o98k21N49L75r63K6P74n15p76
$$ 169 696 131 -72 614 650 41 -58 596 31 -142 365 489 -209 -430 119 494 -469 -443 331 -184 -960
1508i60R73J05l59m7M19o5l56l7P84j64p30K88O70k94m30P65N7n49j98N56j0p37
$$ -960 13 118 -241 -288 131 66 -290 -327 457 293 -437 -149 521 227 -203 562 619 70 -128 428 418 -319
1530c19L65J75n86K26L05j02n25j9P06j53n44L22K8k29j26N55J42p15N80M16n6
$$ -319 46 221 -365 -139 166 64 -461 -480 226 73 -471 -149 -121 -350 -476 79 221 -494 86 502 446
1551D46o93N20M84n75n22R11k53o59N24J45l23k94K67K86n80J20R0O5k02p1M15
$$ 446 -247 273 757 182 -340 571 318 -341 183 328 5 -289 -22 264 -316 -196 -106 -41 -243 -314 101
1572A01l08j77K95M31n29q3M41l40m6K41O01l65k92L46P7l08o9K76N5l69R1L36
$$ 101 -207 -384 -89 342 -187 -270 171 -169 -215 26 627 262 -30 316 393 85 16 292 347 -22 69 405
1594D05m41k79L68J1l13r5O78k40n11r1N43P7m73mN60o01J69L81J0k30j10N08
$$ 405 -36 -315 53 64 -249 -344 334 94 -417 -508 35 112 -361 -365 195 -406 -237 144 154 -76 -186 322
1616C22p1l02L15J75k52k42K31L59m81j49K73j83l7P2k96q5J34J66j88j33J27
$$ 322 251 -51 264 439 187 -55 176 535 54 -95 178 -5 -42 30 -266 -351 -217 -51 -239 -372 -245
1637b45J65J54m82L62K24j50l99N46N7l38r4O14k4m74J14O73o57j75M48J59n51
$$ -245 -80 74 -408 -46 178 28 -371 175 232 -106 -200 414 390 -84 30 703 46 -129 319 478 -73
1658g3K13J06l78j14p5K56r9o5J04j59M8M8J89m2j53L6L13l09K13L80j85l75K35
$$ -73 140 246 -132 -246 -321 -65 -164 -229 -125 -284 -236 -188 1 -41 -194 -158 155 -154 59 439 254 -121 114
1681A14K16r5k30K61J27l32k43M77k25q9J10Q8j45m95M09L83n38j84L11M8j68
$$ 114 330 235 5 266 393 61 -182 295 70 -19 91 179 34 -461 -52 331 -207 -391 -80 -32 -200
1702b00j03L67Q5m18J69L60l52p3N27Pk27m03O21l37j94K96L42l18j5M44k86k35
$$ -200 -303 64 149 -269 -100 260 -92 -165 362 369 142 -261 360 23 -171 125 467 149 134 578 292 57
1724E7l9L70n66k32L58m2j67k54M15k11J18J50K81o32m8M06K52l82M03k92Q3K7
$$ 57 18 388 -178 -410 -52 -94 -261 -515 -100 -311 -193 -43 238 -394 -442 -36 216 -166 237 -55 28 55
1746E5J82J34k02k63L06J58l34R6L49m05k78J66K03k94l3M75k96l97L64q8r6O6
$$ 55 237 371 169 -94 212 370 36 132 481 76 -202 -36 167 -127 -160 315 19 -378 -14 -102 -198 -132
1768a32L01K1m38K20Q5J31k26L5K89R1j71J55J8k86MQ8J40k61j88M26k34q2J50
$$ -132 169 190 -248 -28 57 188 -38 -3 286 377 206 361 379 93 97 185 325 64 -124 302 68 -14 136
1791A36qj12l22K69P6j71j11J72J24k72nn4K26J47K9o5m0L70j46J11k30O3J87
$$ 136 128 16 -306 -37 39 -132 -243 -71 53 -219 -224 -278 -52 95 124 59 19 389 243 354 124 187 374
1814C74m79L44J7k19p0L7J49j37J56k59J21k36j50N66k12k39r5O04n64N1J67J28
$$ 374 -105 239 256 37 -33 4 153 16 172 -87 34 -202 -352 214 2 -237 -332 272 -292 -241 -74 54
1836E4l60%N12p8j65K00j30j01L9J26J24m34N48j64j72J06O2%J5j67J88k39l5
$$ 54 -306 -306 206 128 -37 163 33 -68 -29 97 221 -213 335 171 -1 105 167 167 182 15 203 -36 -71
1859g1o1j1K78m17l0j0M48l47K45J60n07L90K70k62j00J28K55j66k8q8J21Q0l24
$$ -71 -132 -143 135 -282 -312 -322 126 -221 24 184 -323 67 337 75 -25 103 358 192 164 76 197 277 -47
1882d7J61mK8k53K05J63l76K6K6m7q8J64L9pl08J01j5Q2QP5J31j66J20J32l11
$$ -47 114 110 138 -115 90 253 -123 -97 -71 -118 -206 -42 -3 -10 -318 -217 -232 -150 -142 -67 64 -102 18 150 -161
1907a61K31N9J27q4j0J21l86l5J84K16l01qj15L36l85k3J82n1j18L48m04J26r2
$$ -161 70 129 256 172 162 283 -103 -138 46 262 -39 -47 -162 174 -211 -234 -52 -103 -221 127 -277 -151 -243
1930b43k4K50k61K26L36j44OQ5m9l29mj0N02j49r4p7l2j2q5J41K5j03J79j89M3
$$ -243 -267 -17 -278 -52 284 140 146 231 182 -147 -151 -161 341 192 98 21 -11 -23 -108 33 58 -45 134 -55 -12
1955a2k63L48k64k65K06J94J3j60n7K05j42R6L68k42Q5lJ74J15k26J60O4k41k39
$$ -12 -275 73 -191 -456 -250 -56 -43 -203 -260 -55 -197 -101 267 25 110 107 281 396 170 330 394 153 -86
1978h6K80j28j13Q3J97n16J97J17K21n61J29Q5n5Nj49K86j93j62M37k85k2L72
$$ -86 194 66 -47 36 233 -283 -86 31 252 -309 -180 -95 -150 -145 -294 -8 -201 -363 74 -211 -233 139
2000A39J06j07n61R52j48k66l16M25J79l87R5J87j97m80M48J29j61p7l2J12l33
$$ 139 245 138 -423 529 381 115 -201 224 403 16 111 298 101 -379 69 198 37 -40 -72 40 -293
2021b93K82l20J26j07J14M11n87K14L13P3l40J10K29o12n3O96P7k64l1K09r6r5
$$ -293 -11 -331 -205 -312 -198 213 -374 -160 153 226 -114 -4 225 -387 -440 256 333 69 38 247 151 56
2043E6k6K62k96q9K63j26k76J24M20o09O9j28N58l99k97N94n8k61j77M52n2k09
$$ 56 30 292 -4 -93 170 44 -232 -108 312 -297 -228 -356 202 -197 -494 100 42 -219 -396 56 4 -205
2065b05J77M66m79n1L38ok98L7L87k70KM9K81o24r5L77r5j64LM36l83k95M33J70
$$ -205 -28 438 -41 -92 246 240 -58 -21 366 96 98 147 428 -196 -291 86 -9 -173 -170 266 -117 -412 21 191
2089A91o18K1O40j90k99K73K87l65p4J86M69o11j27O83j42n22J93N38n04j75K88
$$ 191 -427 -406 234 44 -255 18 305 -60 -134 52 521 -90 -217 466 324 -198 -5 533 29 -146 142
2110A42L2p52N78J8n4n1l0m8o0r2K99Rk34J5L44j43j62J96k4j49l2M00R3p25M66
$$ 142 174 -578 0 18 -36 -87 -117 -165 -225 -317 -18 -9 -243 -228 116 -27 -189 7 -17 -166 -198 202 295 -430 36
2135C6N52k83m77L64J97o22K80J06j01j33l08N48l16l98M49K48m79j03O42om76
$$ 36 588 305 -172 192 389 -233 47 153 52 -81 -389 159 -157 -555 -106 142 -337 -440 202 196 -280
2156b80K26L7m5m04L35M58o98K69M83k42m95M35M28l64k73M49r5l66m2M19p3m36
$$ -280 -54 -17 -62 -466 -131 327 -371 -102 381 139 -356 79 507 143 -130 319 224 -142 -184 235 162 -274
2178b74K74K10m92j74M64K20m45J08J63k55j53J51M76l76k48M01K4j12J11M46
$$ -274 0 210 -282 -456 8 228 -217 -109 54 -201 -354 -203 273 -103 -351 50 74 -38 73 519
2198E19n81m1K41K03k67j74K39K95p74M77K81m69p9J93J29o66K40J54q4p8oL51
$$ 519 -62 -103 138 341 74 -100 139 434 -340 137 418 -51 -130 63 192 -474 -234 -80 -164 -242 -248 103
2220A03m73j18L87L20l46o5M93O3m52j08N92k63j12L55j26k34j43J17L5l85K32
$$ 103 -370 -488 -101 219 -127 -192 301 364 -88 -196 396 133 21 376 250 16 -127 -10 25 -360 -128
2241a28M67m11o8J98m7k92r5M17Ql51K18K88n11R2N25m74L8J25K76k49k97K17
$$ -128 339 -72 -140 58 11 -281 -376 41 49 -302 -84 204 -307 -215 310 -164 -126 -1 275 26 -271 -54
2263e4M26k41l00N67j52o06L98N39n15n75L97J16j77R4R8J71m80J23K42p5m74
$$ -54 372 131 -169 398 246 -360 38 577 62 -513 -116 0 -177 -83 15 186 -294 -171 71 -4 -478
2284d78K51M09n37N4L27q4j40M48J1n41K65K38O2l32r1M68l54j54L17O8n30K98
$$ -478 -227 182 -355 -301 26 -58 -198 250 261 -280 -15 223 285 -47 -138 330 -24 -178 139 207 -323 -25
2306b5M07m70l01J55K16q0q5p6K70j31k56M83J38l93j48K34L30n79K95M89n28
$$ -25 382 -88 -389 -234 -18 -98 -183 -259 11 -120 -376 107 245 -148 -296 -62 268 -311 -16 473 -55
2327e5j64M10qQ2k45Q4L76n39J30Q7o0m44K73j02j03M38j68j06j23L35j08j83
$$ -55 -219 191 183 265 20 104 480 -59 71 158 98 -346 -73 -175 -278 160 -8 -114 -237 98 -10 -193
2349a93J27M68n12kj53M52l35k6J37J82l8j2K30j30k23J73L7j29k66L48j3k72
$$ -193 -66 402 -110 -112 -265 187 -148 -174 -37 145 107 95 325 195 -28 145 182 53 -213 135 122 -150
2371a50J41J93m07n9k7L59p3k98K16K19k44j43N31k37k00K33J76l02J16N2J03
$$ -150 -9 184 -223 -282 -309 50 -23 -321 -105 114 -130 -273 258 21 -179 54 230 -72 44 96 199
2392A99m85L01J44N9l43k08N02l31KJ52o0J00n0K08l84K19k38K00k53l7L18j55
$$ 199 -286 15 159 218 -125 -333 169 -162 -160 -8 -68 32 -18 190 -194 25 -213 -13 -266 -303 15 -140
2414a40O3rP9J61k76L62l89O4K75j06M2rq8j01M11l24J30J05k36J59J25j04o28
$$ -140 -77 -86 -7 154 -122 240 -149 -85 190 84 126 117 29 -72 339 15 145 250 14 173 298 194 -434
2437d34L44L23k04l57K72pQ0l26L58J55p13N26j77O13n66K38K1k48j58J96K61
$$ -434 -90 233 29 -328 -56 -63 17 -309 49 204 -509 17 -160 453 -113 125 146 -102 -260 -64 197
2458A97k53K22J69j28k68J47J11k11n0J60j95l9J91r2N8m25L04j06L3J05R8n5
$$ 197 -56 166 335 207 -61 86 197 -14 -64 96 -99 -138 53 -39 19 -406 -102 -208 -175 -70 28 -27
2480b7k0J56P0k36L4P0Q8k10m0K09J90j08j54j11k90M52J50K4l84j00L33k83j77
$$ -27 -47 109 179 -57 -23 47 135 -75 -115 94 284 176 22 -89 -379 73 223 247 -137 -237 96 -187 -364
2503c64O3K18L91m91P4J70k09J46l9q9QK31j60o9K08j5K01l06K48J2N9j76M3J06
$$ -364 -301 -83 308 -183 -109 61 -148 -2 -41 -130 -122 109 -51 -120 88 73 274 -32 216 228 287 111 154 260
2527B60k96j33L70k48M7M6J01j29l44L73k7J20k70l03M68J25j53Q0j59j39J56
$$ 260 -36 -169 201 -47 0 46 147 18 -326 47 20 140 -130 -433 35 160 7 87 -72 -211 -55
2548e5K89l26J47J13l08j51N54J1Pk23r6K56J6l66J21P1j20j65K94P6k03j6J88
$$ -55 234 -92 55 168 -140 -291 263 274 281 58 -38 218 234 -132 -11 60 -60 -225 69 145 -58 -74 114
2571A14j84l5N8k2K6p8R3J22r5p5K59O0j13J0j56j93J72J39n6p8J42l5r7o0J98
$$ 114 -70 -105 -47 -69 -43 -121 -28 94 -1 -76 183 243 130 140 -16 -209 -37 102 46 -32 110 75 -22 -82 116
2596A16l32k79K84L15j69m1J85l0J29o3j08O9p0K04N3l85K8M3K54k30P7J63k70
$$ 116 -216 -495 -211 104 -65 -106 79 49 178 115 7 76 6 210 263 -122 -94 -51 203 -27 50 213 -57
2619e7J18K1K7k21J67J56N8m28j4O1L39l35Q3J29j34q6N7N7L3k42K69M9k78k0
$$ -57 61 82 109 -112 55 211 269 -159 -173 -112 227 -108 -25 104 -30 -116 -59 -2 31 -211 58 107 -171 -191
2643a91N34m35jM3L4j73J25L08k25j61K17k01J35kJ04p4K7k39L56k97J70k08J17
$$ -191 343 -92 -93 -50 -16 -189 -64 244 19 -142 75 -126 9 7 111 37 64 -175 181 -116 54 -154 -37
2666c7m1o4Q1N1J05j70OO9p5j89L09k9k98L85On3oJ0L68m98l4Q4kk19J09J78K34
$$ -37 -78 -142 -61 -10 95 -75 -69 0 -75 -264 45 16 -282 103 109 56 50 60 428 -70 -104 -20 -22 -241 -132 46 280
2693B80l14K10k54P3j86K15j70O6J78jl00J14J51q5j18Q4R6O1o8K34j99l1j23
$$ 280 -34 176 -78 -5 -191 24 -146 -80 98 97 -203 -89 62 -23 -141 -57 39 100 32 266 67 36 -87
2716h7J66O7j16L5o8m6J8J04j46j39Q3J93L9k48N5j84K11nlK95m51J95J57o8k66
$$ -87 79 146 30 65 -3 -49 -31 73 -73 -212 -129 64 103 -145 -90 -274 -63 -68 -71 224 -227 -32 125 57 -209
2741b09L58k64R5l60M91L7j48n0K51j52K18jj0j54j04j36R0j73L45L1k47Q3Q0
$$ -209 149 -115 -20 -380 111 148 0 -50 201 49 267 266 256 102 -2 -138 -48 -221 124 155 -92 -9 71
2764G1j09Q5J65L4j91j55K33k46K64q3Q5j98j98L68R8K3m87N75k31l17L55K00
$$ 71 -38 47 212 246 55 -100 133 -113 151 68 153 -45 -243 125 223 246 -241 334 103 -214 141 341
2786C41j17l44O8n1J70P8k76j99K1K97j13L0k2Q7k0J17j92q6M04p9q8K62m25J79
$$ 341 224 -120 -52 -103 67 145 -131 -330 -309 -12 -125 -95 -117 -30 -50 67 -125 -211 193 114 26 288 -137 42
2810D2n0J74j1k71M66l16K16j25p0j06J74k8Q2k26l22K15K21r7j73K70l10J60
$$ 42 -8 166 155 -116 350 34 250 125 55 -51 123 95 177 -49 -371 -156 65 -32 -205 65 -245 -85
2832h5P2j68K66k76J09J31j45L46l4j77N5j90lJ32K47j97r8j8m6L7L54k02o7r2
$$ -85 -13 -181 85 -191 -82 49 -96 250 216 39 94 -96 -99 33 280 83 -15 -33 -79 -42 312 110 43 -49
2856d9l3j4J56Q9j55J35k2j75J71n9j07n5M6K6K69n71L54K86k86N8j28K39j5j48
$$ -49 -82 -96 60 149 -6 129 107 -68 103 44 -63 -118 -72 -46 223 -348 6 292 6 64 -64 175 160 12
2880A2J04j25Lj03L04k11j01P4r5L34l28l7o6M72l55K35k45n0K20p7j44J32Q4
$$ 12 116 -9 -6 -109 195 -16 -117 -43 -138 196 -132 -169 -235 237 -118 117 -128 -178 42 -35 -179 -47 37
2903C7J28j18Kk8Q3m1j28K85j95k8K2Kk30L12R2j42j43m1L43l05j4M19n20K68
$$ 37 165 47 49 21 104 63 -65 220 25 -3 19 21 -209 103 195 53 -90 -131 212 -93 -107 312 -208 60
2927F0k94O1L39m51m4K43j4J24K66j24k81N8Q4N1j61L12j53l08L29j74J42N7q
$$ 60 -234 -173 166 -285 -329 -86 -100 24 290 166 -115 -57 27 78 -83 229 76 -232 97 -77 65 122 114
2950A14K1k40p4q7j2K66j70K50k25J76j04j02J36j0j05O9j17J76K81q1o3J15j72
$$ 114 135 -105 -179 -266 -278 -12 -182 68 -157 19 -85 -187 -51 -61 -166 -97 -214 -38 243 162 99 214 42
2973D2k46J93L0L44o01K46J17J20m64J62R3l30K35K9J21Q8j14p0M2j12l2O1K3
$$ 42 -204 -11 19 363 -238 8 125 245 -219 -57 36 -294 -59 -30 91 179 65 -5 37 -75 -107 -46 -23
2996b3j03L31k18M8n0k2j13K32n2J30l70K09J26m2L3J34k48J94k20J64l40Q5J63
$$ -23 -126 205 -13 35 -15 -37 -150 82 30 160 -210 -1 125 83 116 250 2 196 -24 140 -200 -115 48
3019D8rRl03K59n2M3N3n5K79m87J52M5J54k35O8K33k47M14m63J31M9q7l8M3l5
$$ 48 39 48 -255 4 -48 -5 48 -7 272 -215 -63 -18 136 -99 -31 202 -45 369 -94 37 86 -1 -39 4 -31
3044c1L1j3q4N0K13k20N9j08N4p7J99Qj63R5O9j65J22j13m2K08j92L61m06Q2K05
$$ -31 0 -13 -97 -47 166 -54 5 -103 -49 -126 73 81 -82 13 82 -83 39 -74 -116 92 -100 261 -145 -63 142
3069A42k77L42p5K11k64p8L10j81k76L88j89K08m64K58P7k78J39nN7j66J74j38
$$ 142 -135 207 132 343 79 1 311 130 -146 242 53 261 -203 55 132 -146 -7 -12 45 -121 53 -85
3091h5O4j00J48j90K73M2l25J58j03L60j51j36J71k65J62R1J54k84N6j09J99q7
$$ -85 -21 -121 27 -163 110 152 -173 -15 -118 242 91 -45 126 -139 23 114 268 -16 40 -69 130 43
3113D3k88J39P4j6j34M1K69k30Q8j9Q5Q3j81J58r0L9j32K21j88RJ52L7k84J08
$$ 43 -245 -106 -32 -48 -182 -141 128 -102 -14 -33 52 135 -46 112 22 61 -71 150 -38 -29 123 160 -124 -16
3137a6L89k82k95M37j88J51j1q4j89R0j45J55j98O1J62j36P8l8Q5r6l9K21p9p8
$$ -16 373 91 -204 233 45 196 185 101 -88 2 -143 12 -186 -125 37 -99 -21 -59 26 -70 -109 112 33 -45
3161d5r0J37J72r0J29k0r0l29K19l8k3N7K81l07o8l6O1J0J67Q2k30qr9J33k7j70
$$ -45 -135 2 174 84 213 193 103 -226 -7 -45 -68 -11 270 -37 -105 -141 -80 -70 97 179 -51 -59 -158 -25 -52 -222
3187b22J4J14m0j25L28Mk36%J27L03n7K7m39L50p8j04K27l75J62m2NO5J03j76
$$ -222 -208 -94 -134 -259 69 73 -163 -163 -36 267 210 237 -202 148 70 -34 193 -182 -20 -62 -57 8 111 -65
3211f5LJ67m0K52j41m65Q5L00j40l50M71j37l17L53j4o8Q3K34l99K80j4j9J30
$$ -65 -62 105 65 317 176 -289 -204 96 -44 -394 77 -60 -377 -24 -38 -106 -23 211 -188 92 78 59 189
3234A89P8j72m7k15M26j53j81J62k3k16P6L99l01M5p6k05M45j72o0j78P1J32q1
$$ 189 267 95 48 -167 259 106 -75 87 64 -152 -76 323 22 67 -9 -214 231 59 -1 -179 -108 24 -57
3257e7M2p8N5K86j38j19j49M12J60l76J77j99j83J49p4J90j27J3R4j4k10L16k32
$$ -57 -15 -93 -38 248 110 -9 -158 254 414 38 215 16 -167 -18 -92 98 -29 -16 78 64 -146 170 -62
3280f2k75L57k08M28m61j89M45q0N9j88L56O2l26J02P5P6k88L64J5j21m53M06
$$ -62 -337 20 -188 240 -221 -410 35 -45 14 -174 182 244 -82 20 95 171 -117 247 262 141 -312 94
3302I4l5j09K8J87Rn1k43J47J5k60L63l00P3N3L2j58J31J68l39K94p0J68j41j82
$$ 94 59 -50 -22 165 174 123 -120 27 42 -218 145 -155 -82 -29 3 -155 -24 144 -195 99 29 197 56 -126
3326a26lJ71k05P%L23R9k09n8n0k0o3N77m52q8J18j08m1J69j52L37l87K23Pj07
$$ -126 -129 42 -163 -156 -156 167 266 57 -1 -51 -71 -134 443 -9 -97 21 -87 -128 41 -111 226 -161 62 69 -38
3351c8K78l28%J87K7k85o5L75k44O4K3k12M89r3k36K98j32o9o2k81L13l5k28K28
$$ -38 240 -88 -88 99 126 -159 -224 151 -93 -29 -6 -218 271 178 -58 240 108 39 -23 -304 9 -26 -254 -26
3375b6k03J59L07n47J84K11j45J98k35K79l07P4k6R8j22J84l11J17n2K44r1O5
$$ -26 -229 -70 237 -310 -126 85 -60 138 -97 182 -125 -51 -77 21 -101 83 -228 -111 -163 81 -10 55
3397E5j91N8J75j24J56J37q3j44k18O2K2k1j78L44k03q1J20J70l5l30L11j61Q8
$$ 55 -136 -78 97 -27 129 266 183 39 -179 -117 -95 -116 -294 50 -153 -234 -114 56 21 -309 2 -159 -71
3420g1K41kk98n8L10k28M7J02k4K20j28L9k8O7k96K18O7k58R9r2oR4J18N4l69
$$ -71 170 168 -130 -188 122 -106 -59 43 19 239 111 150 122 189 -107 111 178 -80 19 -73 -79 15 133 187 -182
3445a82L8J45K3k15Q3K01j30J94k36K33j68J20L0j68O1o8K10k3k52k3L3J31J04
$$ -182 -144 1 24 -191 -108 93 -37 157 -79 154 -14 106 136 -32 29 -39 171 148 -104 -127 -94 37 141
3468A41j06K9k42L02k53K68l58K73K14k98M11m73K5n0OL19j15j41NM8L9j1l47
$$ 141 35 64 -178 124 -129 139 -219 54 268 -30 381 -92 -67 -117 -111 208 93 -48 -43 5 44 33 -314
3491c14M26K7k08K46rm6m83N70r7k36M02J1l04k3j17Q8L6k27K77o2l3j19M6O3
$$ -314 112 139 -69 177 168 122 -361 209 112 -124 278 289 -15 -38 -155 -67 -31 -258 19 -43 -76 -195 -149 -86
3515h6J5K41p7j64K01j28K84m5k6j23k24J31qJ04j46J21J69l01j98M26N9l60k11
$$ -86 -71 170 93 -71 130 2 286 241 215 92 -132 -1 -9 95 -51 70 239 -62 -260 166 225 -135 -346
3538c46L44j08J67J82k69j34K64j78L90k29j85J76j21J07r7L9Q0j14N6J9J20k89
$$ -346 -2 -110 57 239 -30 -164 100 -78 312 83 -102 74 -47 60 -37 2 82 -32 24 43 163 -126
3560a26J53J26K8l9q3O0j67K15q9j55k4q3K00j06K56k32J23J07j13j07J31J31
$$ -126 27 153 181 142 59 119 -48 167 78 -77 -101 -184 16 -90 166 -66 57 164 51 -56 75 206
3582B06k19J53k51JL03l07O1r7J58j7j30K65j72n0K38n1r7K6r6l5m6L9j83K31
$$ 206 -13 140 -111 -110 193 -114 -53 -150 8 -9 -139 126 -46 -96 142 91 -6 20 -76 -111 -157 -118 -301 -70
3606g0Q2j94M5J28o0J30k49K42j86K57K9J0L6k92J32J62q3k80J06J79p7j15J22
$$ -70 12 -182 -137 -9 -69 61 -188 54 -132 125 154 164 200 -92 40 202 119 -161 -55 124 47 -68 54
3629E4r3J34j01R2J08k86o4K89J32k93o0k47L12J26k36N2K8k58K13K13J76j68
$$ 54 -39 95 -6 86 194 -92 -156 133 265 -28 -88 -335 -23 103 -133 -81 -53 -311 -98 115 291 123
3651A23j86M34m31K29M2j59j77L8K27o2j48j22J12O0p2j97L30n5J84k70l3j84
$$ 123 -63 371 -60 169 211 52 -125 -87 140 78 -70 -192 -80 -20 -92 -289 41 -14 170 -100 -133 -317
3673c17M84k15j20L84r4j38j90L17o5J47J7l81L20M5J44k03j30j4J98j19Q8L4
$$ -317 167 -48 -168 216 122 -16 -206 111 46 193 210 -171 149 194 338 135 5 -9 189 70 158 192
3695A92l05M3J16L3q3k60M18r8j82L5J50j24K8j22J66R4l8j98L37m28M78l82J38
$$ 192 -113 -70 46 79 -4 -264 154 56 -126 -91 59 -65 -37 -159 7 101 63 -135 202 -226 252 -130 8
3718Hk9O6ql13K79k50K72p5O1M7l6j96J35k9J59k17J07k9j00J31k8O0K23l21J55
$$ 8 -21 45 37 -276 3 -247 25 -50 11 58 22 -174 -39 -68 91 -126 -19 -48 -148 -17 -45 15 238 -83 72
3743G2j35J75j87N5j06L4J15j78Q5K31Nq5j14O0J9K4N3j76J44j60K9M4j07N9k93
$$ 72 -63 112 -75 -20 -126 -92 23 -155 -70 161 166 81 -33 27 46 70 123 -53 91 -69 -40 4 -103 -44 -337
3768c37Q9K68k22M37j75k83P8K54Q9k56K3k62K55O2K04j00j15N5J6k18j18J00
$$ -337 -248 20 -202 235 60 -223 -145 109 198 -58 -35 -297 -42 20 224 124 9 64 80 -138 -256 -156
3790a56r6L95k67j48L00j6J99o7q0J2r0j11K96m02O6j4K00J68k93J30J14k94L17
$$ -156 -252 143 -124 -272 28 12 211 144 64 76 -14 -125 171 -231 -165 -179 21 189 -104 26 140 -154 163
3813A63n2j47N3J16Q1j46k00m4Q6j50L39P1j61P2j85K18l9j26O4k21J63j92K67
$$ 163 111 -36 17 133 214 68 -132 -176 -90 -240 99 170 9 81 -104 114 75 -51 13 -208 -45 -237 30
3836C0J8P7k15L0L40l94J12K06o2k23R0N1n5J3m1q3R8J79l00J37Q6j84J23m2J80
$$ 30 48 125 -90 -60 280 -114 -2 204 142 -81 9 60 5 18 -23 -106 -8 171 -129 8 94 -90 33 -9 171
3861A71l44Nq2K96J50J31m09Jk14P7J84J37j97L17R0l59P6K41m68J70J97j15j15
$$ 171 -173 -168 -250 46 196 327 -82 -81 -295 -218 -34 103 -94 223 313 -46 30 271 -197 -27 170 55 -60
3884f0J77k03j3k6jK6q4O1r4jJ60m9K42m2M4k16J4L00j58k1k22J23k65N58k00
$$ -60 117 -86 -99 -125 -126 -100 -184 -123 -217 -218 -58 -107 135 93 137 -79 -65 235 77 56 -166 -43 -308 250 50
3909E0l9n7k8Q6j10K16M4P6j69j93K25k82O1L09k22k2l8L0k0j23J60O5J46j84
$$ 50 11 -46 -74 12 -98 118 162 238 69 -124 101 -181 -120 189 -33 -55 -93 -63 -83 -206 -46 19 165 -19
3933a9K36j32k4rk97L88k77N4Q8R9k10K79j70k80L75J90l48J74k94J18K11m16
$$ -19 217 85 61 52 -245 143 -134 -80 8 107 -103 176 6 -274 101 291 -57 117 -177 -59 152 -264
3955b64J11O3J04j73J88k11K22j9l06J97n0j9K23n3j30K26k49J43K00l07k3K01
$$ -264 -153 -90 14 -159 29 -182 40 21 -285 -88 -138 -157 66 13 -117 109 -140 3 203 -104 -127 74
3977G4J9l65J59P8j40K15o7J71q1K35j47j29rk51J74n2p9K54J99l83J88l9m5q2
$$ 74 93 -272 -113 -35 -175 40 -27 144 63 298 151 22 13 -238 -64 -116 -195 59 258 -125 63 24 -21 -103
4001a03J37J25q7q7N7o3J30J22k99R1o9K43k61K09n7k0j75J45L2k52N30l88N0
$$ -103 34 159 72 -15 42 -21 109 231 -68 23 -46 197 -64 145 88 68 -107 38 70 -182 348 -40 10
4024A0J4M9r0o8K33p1n6j32pJ36R9k26K37k87L77j49j95K20m9P0J2k77%L24l37
$$ 10 24 73 -17 -85 148 77 21 -111 -118 18 117 -109 128 -159 218 69 -126 94 45 115 127 -150 -150 174 -163
4049a63J09k7L19m13K23L56l85m7P5p8J68j73j9k5rQ3l5K70J25m77K85l80J50
$$ -163 -54 -81 238 -175 48 404 19 -28 47 -31 137 -36 -55 -80 -89 -6 -41 229 354 -123 162 -218 -68
4072f8K33j53J95k34j12K65l00kJ58k30J28L51k79L80l47m1j02kL12l00j30J24
$$ -68 165 12 207 -27 -139 126 -174 -176 -18 -248 -120 231 -48 332 -15 -56 -158 -160 152 -148 -278 -154
4094a54J79j9R7j10r8L29j96k6Q8k58L3P4M0j31L63k52j32J23k0n8Q1Qk4J46m3
$$ -154 25 6 103 -7 -105 224 28 2 90 -168 -135 -61 -21 -152 211 -41 -173 -50 -70 -128 -47 -39 -63 83 40
4119D0k1P0J16j61n0J84k83P1m1K21j40j27J68R2k65R0J8K14j17r0J44O2k86J7
$$ 40 19 89 205 44 -6 178 -105 -34 -75 146 6 -121 47 139 -126 -36 -18 196 79 -11 133 195 -91 -74
4143g4J09P9j90J10l6J22J01l00j3m5j20J32J44pJ21J6j74J01J38k68l8qK48j56
$$ -74 35 114 -76 34 -2 120 221 -79 -92 -137 -257 -125 19 12 133 149 -25 76 214 -54 -92 -100 148 -8
4167hK4m3j37L5l5K84j03r5j66J59J80L3j37l0R4k36J19L02q0j59N9J34j26n7
$$ -8 16 -27 -164 -129 -164 120 17 -78 -244 -85 95 128 -9 -39 55 -181 -62 240 160 1 60 194 68 11
4191A1mJ65k38j11K38j50J77J56j75L3l62K99J6p2n8K39J74l82L4L7q8o7J51j73
$$ 11 7 172 -66 -177 61 -89 88 244 69 102 -260 39 55 -17 -75 164 338 -44 -10 27 -61 -128 23 -150
4215a50Q5j06J58p5J85l04P8K52Lm76M32k23k1O0j84L82L7k48J25o9J86j42K71
$$ -150 -65 -171 -13 -88 97 -207 -129 123 126 -350 82 -141 -162 -102 -286 96 133 -115 10 -59 127 -15 256
4238B56j93l48J84J62J33l94L08qj96k1K80n34M12QJ0p9m6M4m9KJ10j9J62j37
$$ 256 63 -285 -101 61 194 -200 108 100 -96 -117 163 -371 41 49 59 -20 -66 -22 -71 -69 41 22 184 47
4262D7l91K75J24l10K45k47L34P2j32L7J0q8J81j63K28q4j71j13K06j85OJ96j06
$$ 47 -344 -69 55 -255 -10 -257 77 149 17 54 64 -24 157 -6 222 138 -33 -146 60 -125 -119 77 -29
4285b9Q1q0M05l99j67L15l16K01N8j18K59m17L07k66NK46m7kj86J97R8j38J04
$$ -29 52 -28 377 -22 -189 126 -190 11 69 -49 210 -207 100 -166 -161 85 38 36 -150 47 145 7 111
4308A11l8L4lk70j27M0Q2J73n9J59oj64j7kn7K65l9k48oR7L8L29k43j52K37j48
$$ 111 73 107 104 -166 -293 -253 -171 2 -57 102 96 -68 -85 -87 -144 121 82 -166 -172 -75 -37 292 49 -103 134 -14
4334a4J8j83K79R2k96R9j61Nj43L39j45R0Q1l51J46N1j3J87j08R3R6p9k01o9Q1
$$ -14 4 -179 100 192 -104 -5 -166 -161 -304 35 -110 -20 61 -290 -144 -93 -106 81 -27 66 162 83 -118 -187 -106
4359a06J71J09j13o7k3J45j61jq7K54q5j06J41%k86M20l95K69m4l35N15m06J48
$$ -106 65 174 61 -6 -29 116 -45 -46 -133 121 36 -70 71 71 -215 205 -190 79 35 -300 215 -191 -43
4382d3J5J45j45J05j77K48j26j02J21p5J34l09K81j45J75j6l9L6k43L54L5k0j54
$$ -43 -28 117 -28 77 -100 148 22 -80 41 -34 100 -209 72 -73 102 86 47 83 -160 194 229 209 55
4405E5Pl6p1L91l93J11J00j62M5k59K17R7l0j49kq3o4L06Kk64J25r5M1K01P7j29
$$ 55 62 26 -45 346 -47 64 164 2 47 -212 5 102 72 -77 -79 -162 -226 80 82 -182 -57 -152 -111 90 167 38
4431C8n9K15k32N3RJ50j59j10K13q1M4k28K34q6J37J50k66n5J87j13M1N9r4R4
$$ 38 -21 194 -38 15 24 174 15 -95 118 37 81 -147 87 1 138 288 22 -33 154 41 82 141 47 141
4455A41o1j00L4j05J5K00n0K2p9NM9k12L88m15j97N00k64L37k27j05L50l35R0
$$ 141 80 -20 14 -91 -76 124 74 96 17 22 71 -141 247 -168 -365 135 -129 208 -19 -124 226 -109 -19
4478a9J01Rk43J95O8k84K27J04o1j27N9N8j2K2l60M54j74q6J10P1j34Q8n1j20
$$ -19 82 91 -152 43 111 -173 54 158 97 -30 29 87 75 97 -263 191 17 -69 41 112 -22 66 15 -105
4502a05J25K71k81j06J60M9J36k59P4l43J39J53J43k92J00Q4Q8M1l9k52l5K47
$$ -105 20 291 10 -96 64 113 249 -10 64 -279 -140 13 156 -136 -36 48 136 177 138 -114 -149 98
4524I8q9p1M2P5J96l00K12j87K69j99j02m0J34RN1n5j6%n2O0M9P8k68J35L1lj66
$$ 98 9 -62 -20 55 251 -49 163 -24 245 46 -56 -96 38 47 98 43 27 27 -25 35 84 162 -106 29 60 57 -109
4551a09j5J13n6K92j43k72J47L09j32k5J38j34j53k7j91K69J25l42L05m61L06
$$ -109 -124 -11 -67 225 82 -190 -43 266 134 109 247 113 -40 -67 -258 11 136 -206 99 -362 -56
4572e6k3K16o3Mm7j2R7k46J22p2j27O9M8J16j6j29M18l45OK69k47L5K25k48K21
$$ -56 -79 137 74 78 31 19 116 -130 -8 -80 -207 -138 -90 26 10 -119 299 -46 -40 229 -18 17 242 -6 215
4597B15l86O4L51k97r2N2L4N7q9L8L76n83J73O2J04J9k66J58N1k7P5q6P6j40O4
$$ 215 -171 -107 244 -53 -145 -93 -59 -2 -91 -53 323 -260 -87 -25 79 98 -168 -10 41 14 89 3 79 -61 3
4622CJ68m8r1l6M9O6k7k13L21k01K9L1R0k37L11j62j99L98l37J92k66L62j57o3
$$ 3 171 123 32 -4 45 111 84 -129 192 -9 20 51 141 -96 215 53 -146 252 -85 107 -159 203 46 -17
4646a7k1j10J73q2J23N8j11n96P44q5l03J78j8Q2j61J61r5J78m14K36M6k25K51
$$ -17 -38 -148 25 -57 66 124 13 -583 161 76 -227 -49 -67 15 -146 15 -80 98 -316 -80 -34 -259 -8
4669hR7o9Rn5j74R7P7NK38j70M02n00j5PL5J18j09p6K70j53j61N03l79P8k28L26
$$ -8 89 20 29 -26 -200 -103 -26 -21 217 47 449 -51 -66 -59 -24 94 -15 -91 179 26 -135 368 -11 67 -161 165
4695A65l67J82Q3j38J73j92J95k92L48l47K58j14l9Q2J41J5L8j28k22L45k42l1
$$ 165 -202 -20 63 -75 98 -94 101 -191 157 -190 68 -46 -85 -3 138 153 191 63 -159 186 -56 -87
4717h7j5L30p8k6q6j4j45K00j99j64Q3J40R3j09K16n8K1l63K5J42M3J30j02p1
$$ -87 -102 228 150 124 38 24 -121 79 -120 -284 -201 -61 32 -77 139 81 102 -261 -236 -94 -51 79 -23 -94
4741i4J99J56l83J85Q7r3n1K3K27k53O6k10J1L05l97J9j5J08n1K12Q7j37l27J41
$$ -94 105 261 -122 63 150 57 6 29 256 3 69 -141 -130 175 -222 -203 -218 -110 -161 51 138 1 -326 -185
4765a85J5L61l20L11l32K18p2K4j69M25m49J24M0K0K07o57L19R7n6j28j07M02
$$ -185 -170 191 -129 182 -150 68 -4 20 -149 276 -173 -49 -9 11 218 -439 -120 -23 -79 -207 -314 88
4787H8m4q3r8Q7L7J76j54K23k42K75k10R4j84J4J32j31J13J41l62M40l92R3Q9
$$ 88 44 -39 -137 -50 -13 163 9 232 -10 265 55 149 -35 -21 111 -20 93 234 -128 312 -80 13 102
4810A02j11m8J9J47j87Q0m8L2l3N5j58J93L3Ml44L40q7J33k48k55J52L29k04j41
$$ 102 -9 -57 -38 109 -78 2 -46 -14 -47 8 -150 43 76 80 -264 76 -11 122 -126 -381 -229 100 -104 -245
4834b45K68n7k44L73k19J59p9J37j68K74j10Nr1j3o1J3K60j77R5o3j26K02m34
$$ -245 23 -34 -278 95 -124 35 -44 93 -75 199 89 94 3 -10 -71 -58 202 25 120 57 -69 133 -301
4857c01n9M70k77K95k73L1j3o8K53k21P4J92M3j99j21J49q4j8L83m61J23J17J27
$$ -301 -360 110 -167 128 -145 -114 -127 -195 58 -163 -89 103 146 -53 -174 -25 -109 -127 256 -205 -82 35 162
4880A62R2k18N3J7j07J04k62K19Lj0L2P3k7r3P4r3J39j75k2J7k19L44q9m2j88
$$ 162 254 36 89 106 -1 103 -159 60 63 53 85 158 131 38 112 19 158 -17 -39 -22 -241 103 14 -28 -216
4905b16R8K08Q1j43r1l8nJ84j0k23L7L61k80L09k51j04J60K4j41L0J00q9K0j04
$$ -216 -118 90 171 28 -63 -101 -106 78 68 -155 -118 243 -37 272 21 -83 77 101 -40 -10 90 1 21 -83
4929h3R2k59J31J42l4k1K0K59j85j43o1kJ09M7M5J28k39K80o0O3k51p1P3k6K5
$$ -83 9 -250 -119 23 -11 -32 -12 247 62 -81 -142 -144 -35 12 57 185 -54 226 166 229 -22 -93 -20 -46 -21
4954b1K36k84P3K6j20q6J54j23kK06k35M4J02j7L9J2l1m6K89l02R6k30K96K4k58
$$ -21 215 -69 4 30 -90 -176 -22 -145 -147 59 -176 -132 -30 -47 -8 4 -27 -73 216 -86 10 -220 76 100 -158
4979a58K83j77L9J58j77K48k6j83o2j4J57j78J17j90L31j61L7j77K35j91k72K01
$$ -158 125 -52 -13 145 -32 216 190 7 -55 -69 88 -90 27 -163 168 7 44 -133 102 -89 -361 -160
5001a60N4J0N2L0J08o6Q6o4J47k38M5jL72k56P7J46m75J09j13K49p7J34q7l43
$$ -160 -106 -96 -44 -14 94 28 114 50 197 -41 4 3 375 119 196 342 -133 -24 -137 112 35 169 82 -261
5025b61J18L31m3j96o3J86o1K40k11r5Ll9O9L5K06j30j28M6N3j28R8Q3pj0n1J14
$$ -261 -143 188 145 -51 -114 72 11 251 40 -55 -52 -91 -22 13 219 89 -39 7 60 -68 30 113 106 96 45 159
5051A59J06k47j61m5L09k68Q9J79j68K50l3j42p9J25J53l8j6j54N0%J8j7J89j69
$$ 159 265 18 -143 -188 121 -147 -58 121 -47 203 170 28 -51 74 227 189 173 19 69 69 87 70 259 90
5075I0J55n28L07R1j93K43k03l3j0K28P8j39J74j93j66n6K16R6L3k05L10n94M46
$$ 90 245 -283 24 115 -78 165 -38 -71 -81 147 225 86 260 67 -99 -155 61 157 190 -15 295 -299 147
5098A47l22J61j52L26p5k9J38p3L5k28l5j7N3K10k86J45Q8j80m0J77K55l74J28
$$ 147 -175 -14 -166 160 85 56 194 121 156 -72 -107 -124 -71 139 -147 -2 86 -94 -134 43 298 -76 52
5121E2j63n7K96k91K67o2O0j80L9J14K49l27k17L07k34P5J33M5J3l20nM82k47
$$ 52 -111 -168 128 -163 104 42 102 -78 -39 75 324 -3 -220 87 -147 -72 61 106 119 -201 -206 276 29
5144B9o5K31k58K67l1j43N4l42kM05pR6l78J09J58j05j74K84k23l2N5o6K5R7Q3
$$ 29 -36 195 -63 204 173 30 84 -258 -260 145 138 234 -144 -35 123 18 -156 128 -95 -127 -72 -138 -113 -16 67
5169F7k3j54L98l94j45J80J04j20m4J58P6o1lJ88m07J64J27p1Qj75%O9m9Q9L24
$$ 67 44 -110 288 -106 -251 -71 33 -87 -131 27 103 42 39 227 -180 -16 111 40 48 -127 -127 -58 -107 -18 306
5194C06l51K8J52K3r7K9J0m2J6j17K97m74L43k61J97k45L4p9K9L00k08q9N09k68
$$ 306 -45 -17 135 158 61 90 100 58 74 -43 254 -220 123 -138 59 -186 -152 -231 -202 98 -110 -199 310 42
5218D2n7r7L7j47k2M07k72M3R4l5n2J13L6q5n3K63j44r4J50N3j57j44O2J54K11
$$ 42 -15 -112 -75 -222 -244 163 -109 -66 28 -7 -59 54 90 5 -48 215 71 -23 127 180 23 -121 -59 95 306
5243C06k96j45L21k36Q1j21J77k55J08K2j37K08J4j22r3R1J72l25J51K52k86K78
$$ 306 10 -135 186 -50 31 -90 87 -168 -60 -38 -175 33 47 -75 -168 -77 95 -230 -79 173 -113 165
5265A65q4o9J31k14P0O3J08k37J80j29j17L86m17L15j28q3k82K10j5JK00j97j38
$$ 165 81 12 143 -71 -1 62 170 -67 113 -16 -133 253 -164 151 23 -60 -342 -132 -147 -146 54 -143 -281
5288b81J55k4Q6j29J56J97j98m1O5Q1nK5l7J8kj06LJ3n2K61m08K25j4j03L0j74
$$ -281 -126 -150 -64 -193 -37 160 -38 -79 -14 67 62 87 50 68 66 -40 -37 -24 -76 185 -223 2 -12 -115 -85 -259
5314b59J26J65j51K16J4j10M8n0j05N2N6k23J10j29L88k77L79p9m76J28N5J47
$$ -259 -133 32 -119 97 111 1 49 -1 -106 -54 2 -221 -111 -240 148 -129 250 171 -305 -177 -122 25
5336B5l40N79k68M17o76J42K04k02K50qk60j26M64k62J91r9l72L71j1J55j52P
$$ 25 -315 264 -4 413 -263 -121 83 -119 131 123 -137 -263 201 -61 130 31 -341 30 19 174 22 29
5358B9q4q4K65n4J39J0n88K66O3joO9Q6l04J2K62j57J41j59m1K92k17j29L13j10
$$ 29 -55 -139 126 72 211 221 -367 -101 -38 -39 -45 24 110 -194 -182 80 -77 64 -95 -136 156 -61 -190 123 13
5383A3k70J09J26m0R7j53K00J14j01j08K20n0k80N4O8j04M7K27q4q9L33j38l64
$$ 13 -257 -148 -22 -62 35 -118 82 196 95 -13 207 157 -123 -69 -1 -105 -58 169 85 -4 329 191 -173
5406a73K40o5m7J29p7O3m5n0J30J02l86K89k65R0J85Jk1k8j62L0j8J10j02j8J29
$$ -173 67 2 -45 84 7 70 25 -25 105 207 -179 110 -155 -65 120 121 100 72 -90 -60 -78 32 -70 -88 41
5431D1j84M29l25L9L2k4K16j63l6q9J06j36m6J77l3M1J18Jl29M6K85r0j84K32
$$ 41 -143 286 -39 0 32 8 224 61 25 -64 42 -94 -140 37 4 45 163 164 -165 -119 166 76 -108 124
5455A24o3L0n1k9N8j40J26j7n7q3q3J5K23R3k3j64R6m8K5q6J00j37k13K29l0L9
$$ 124 61 91 40 11 69 -71 55 38 -19 -102 -185 -170 53 146 123 -41 55 7 32 -54 46 -91 -304 -75 -105 -66
5481f6K11k72K76k17k29K90j7P4j38k22J66K28j13JQ2K0R8k40r3K81k3Mm64L98
$$ -66 145 -127 149 -68 -297 -7 -24 50 -88 -310 -144 84 -29 -28 54 74 172 -68 -161 120 97 101 -363 35
5505C5j46K53Mk71N8oO8K13l84K18k2j14J49j09L09k68N2K32l4j26k4j61j45J0
$$ 35 -111 142 146 -125 -67 -73 -5 208 -176 42 20 -94 55 -54 255 -13 39 271 237 111 87 -74 -219 -209
5529b09M87j71JJ27o0l12J70J01j16l00L13k75K44Oj66R1j85J95L9J65Ql91J79
$$ -209 278 107 108 235 175 -137 33 134 18 -282 31 -244 0 6 -160 -69 -254 -59 -20 145 153 -238 -59
5552e9K0K1J39K2m5J95j17j90J95k93M41k64j66J13j3K00k95p4l1K67l9LJ76l92
$$ -59 -39 -18 121 143 98 293 176 -14 181 -112 329 65 -101 12 -1 199 -96 -170 -201 66 27 30 206 -186
5576a86J09J06j90J70O1R3m8Lj10K28j81N2q5j5j45n2K24l5q4J46j50N4J90j09
$$ -186 -77 29 -161 9 70 163 115 118 8 236 55 107 22 7 -138 -190 34 -1 -85 61 -89 -35 155 46
5600D6j57N9p3K2K57J38l52j05R8J87p9J11j01pJ06l16Q8N0K12Nj48m8O0j20q9
$$ 46 -111 -52 -125 -103 154 292 -60 -165 -67 120 41 152 51 44 150 -166 -78 -28 184 189 41 -7 53 -67 -156
5625a56R3R1K3QN0J31o1p3j41j2p0j22K30L7r2m0J14m7p1L09j57k11K65j24Q2
$$ -156 -63 28 51 59 109 240 179 106 -35 -47 -117 -239 -9 28 -64 -104 10 -37 -108 201 44 -167 98 -26 56
5650E6j05J27j55P1KQ0k45M00l29j5J45l0j1J12J0J91k61J24oR5l82J23%m0K27
$$ 56 -49 78 -77 -6 -4 76 -169 231 -98 -113 32 2 -9 103 113 304 43 167 161 256 -126 -3 -3 -43 184
5675A84j69J24l00J75J06j76q8K12oP3j19O6k8j17L73n5l16M35l22j48J63l2k84
$$ 184 15 139 -161 14 120 -56 -144 68 62 135 16 82 54 -63 310 255 -61 374 52 -96 67 35 -249
5698b49K90M5K9q3j34K12J45l87O6J8p5O5J80m68J47L66j76k1N9j19l2J13N5J08
$$ -249 41 86 115 32 -102 110 255 -132 -66 -48 -123 -58 122 -346 -199 167 -9 -30 29 -90 -122 -9 46 154
5722A54k83l1l06N22r8j72J26j38K76l8O3OQ8j68K30n19J46K09k7k30K30Pk5O4
$$ 154 -129 -160 -466 56 -42 -214 -88 -226 50 12 75 81 169 1 231 -288 -142 67 40 -190 40 47 22 86
5746H6q7j80K11j64J25J9q6K54j16QM8r0M1j82Q3M1j19J09J59j60J8J20k45K3
$$ 86 -1 -181 30 -134 -9 10 -76 178 62 70 118 28 69 -113 -30 11 -108 1 160 0 18 138 -107 -84
5770h4J50r1k26J35l3K81Q0k84J41j34j25j7J40oM7j87J79l6p6L21l50J35J24
$$ -84 66 -25 -251 -116 -149 132 212 -72 69 -65 -190 -207 -67 -73 -26 -213 -34 -70 -146 175 -175 -40 84
5793H4j88L12J45l68j20L4q3PK89j25j53L08k47j38K25P4r3R1k97K15R6k52j71
$$ 84 -104 208 353 -15 -135 -101 -184 -177 112 -13 -166 142 -105 -243 -18 56 -37 54 -243 -28 68 -184 -355
5816c55M52O1r3j5m7K06j03K1m6q2J5k0m0j34L7J89p0j76J57j8K3J52m15K64j95
$$ -355 97 158 65 50 3 209 106 127 81 -1 14 -6 -46 -180 -143 46 -24 -200 -43 -61 -38 114 -301 -37 -232
5841b32M04m23L00K5k2R5k08K64r0l4M2L6j35J76l82K14j56J03r0L30l21K39l22
$$ -232 172 -251 49 74 52 147 -61 203 113 79 121 157 22 198 -184 30 -126 -23 -113 217 -104 135 -187
5864a87j50L84j92J10J5K5P7m3q4K11p6N7j32j3j76J28l8n3R0K90j97L0q0J79
$$ -187 -337 47 -145 -35 -20 5 82 39 -45 166 90 147 15 2 -174 -46 -84 -137 -47 243 46 76 -4 175
5888A75r4j58J95k60J64j97J67m2o2K00j03N5j19n0R2M3o6j13p2J38K04l37P4
$$ 175 81 -77 118 -142 22 -175 -8 -50 -112 88 -15 40 -79 -129 -37 6 -60 -173 -245 -107 97 -240 -166
5911a66J36K18k71J11J09k98K90l20L09nm1K4l8j46P7K09k03K35j99j80L03Nl07
$$ -166 -30 188 -83 28 137 -161 129 -191 118 113 72 96 58 -88 -11 198 -5 230 31 -149 154 159 -148
5934a48J95O1n8k93J21J42P9l9k01L3Q4K9o0l0J86l34L52rl9k11L1K22j0k34L11
$$ -148 47 108 50 -243 -122 20 99 60 -141 -108 -24 5 -55 -85 101 -233 119 110 71 -140 -109 113 103 -131 180
5959A80J3k05l64L01J82J56j26p1J4j5Pj90J21j3k31K84q9Q1l7j22J54J7j97l5
$$ 180 193 -12 -376 -75 107 263 137 66 80 65 72 -118 3 -10 -241 43 -46 35 -2 -124 30 47 -150 -185
5983a85J41J18J4p4q9M7o2J11l5j56K95k28Q7J27j53J74l16M11l08J01Q0Lj52
$$ -185 -44 74 88 14 -75 -28 -90 21 -14 -170 125 -103 -16 111 -42 132 -184 227 -81 20 100 103 -49
6006d9K32l6j80j37l9k18L50m8K31O6o4R9j42K8j24K61m00O6m4K93j80J79j91
$$ -49 183 147 -33 -170 -209 -427 -77 -125 106 172 108 207 65 93 -31 230 -170 -104 -148 145 -35 144 -47
6029d7j18J45J19O5k07L11l05K98k61J19o1j82J00J25o9R4M9M7l13J75l30K29
$$ -47 -165 -20 99 164 -43 268 -37 261 0 119 58 -124 -24 101 32 126 175 222 -91 84 -246 -17
6051a7J28k48J46j8R3j56J84l47J74O8L5j87J45L6k68L46m4l3lm7L3m2l4J37k06
$$ -17 111 -137 9 -9 84 -72 112 -235 -61 7 42 -145 0 36 -232 114 70 37 34 -13 20 -22 -56 81 -125
6076a25J74k7m0l41M63j0o1P0K8Q3n5Rp6J28j55j39J84j84K11l52J00K84l01J87
$$ -125 49 22 -18 -359 104 94 33 103 131 214 159 168 92 220 65 -74 110 -74 137 -215 -115 169 -132 55
6100E5L8j56L19k16j6n3O7p1j94J42j37J11J13k1j02J90r3p3J20K87k93q8J9n2
$$ 55 93 -63 256 40 24 -29 38 -33 -227 -85 -222 -111 2 -19 -121 69 -24 -97 23 310 17 -71 -52 -104
6124a04N4p2J99k9j84J22K32m8l47J22P6n9l6OJ80k02K31k51K18P3j22J10j42
$$ -104 -50 -122 77 48 -136 -14 218 170 -177 -55 21 -38 -74 -68 112 -90 141 -110 108 181 59 169 27
6147B7J65j45l8p9j5J31j15L34k22L18n18J04P1N8l6j77j80M93j26K2j05K6j03
$$ 27 192 47 9 -70 -85 46 -69 265 43 361 -157 -53 18 76 40 -137 -317 176 50 72 -33 -7 -110
6170a10J48j5l6K99k78m2O0O2Q0l62J79M2j27P1Rn9R1K02o0k71Qm3O4J37k18J93
$$ -110 38 23 -13 286 8 -34 26 88 168 -194 -15 27 -100 -29 -20 -79 12 214 154 -117 -109 -152 -88 49 -169 24
6196B4q3q4L04k89M7J56j92J9L44l25K4J30N1q8J57k21L63l59j48K72l3k41J36
$$ 24 -59 -143 161 -128 -81 75 -117 -98 246 -79 -55 75 126 38 195 -26 337 -22 -170 102 69 -172 -36
6219c6J64J93q3k12k6l2j09J62p1J72k01J11K63j44l33M2K89m96L79M9m4Nj04
$$ -36 128 321 238 26 0 -32 -141 21 -50 122 -79 32 295 151 -182 -140 149 -347 32 81 37 42 -62
6242f2R1n7k0j88M05J44n88K15J77Ok28L4L3J59k74L89m65K42k2j25K13j31L4
$$ -62 29 -28 -48 -236 169 313 -275 -60 117 123 -105 -71 -38 121 -153 236 -229 13 -9 -134 79 -52 -18
6265a8J42N7L2m35L77j97J02j59l1K54J47j01j13j08P8K4j10K24l23R8J65j25
$$ -18 124 181 213 -222 155 -42 60 -99 -130 124 271 170 57 -51 27 51 -59 165 -158 -60 105 -20
6287b0j01J27K9P6j86k74O15m92K24K12m59J62K33K10p7l30J65l59M10k8j38N8
$$ -20 -121 6 35 111 -75 -349 266 -226 -2 210 -249 -87 146 356 279 -51 114 -245 165 137 -1 57
6309E7R5R6k79LJ61j17J3m20M93k7j80K20j64L26m45O2k01L52j40J73k96k9J71
$$ 57 152 248 -31 -28 133 16 29 -391 102 75 -105 115 -49 277 -168 -106 -307 45 -95 78 -218 -247 -76
6332g6k7L51j03M6l35J69O7p2o2M9p5L66m81K39n1N8J85j62k44J23J93j66J57
$$ -76 -103 248 145 191 -144 25 92 20 -42 7 -68 298 -183 56 5 63 248 86 -158 -35 158 -8 149
6355A49k15q7K94k42J91j04K64j61j8m8r7R4K1K8j07J5m4q8K9J09J59k35j23K81
$$ 149 -66 -153 141 -101 90 -14 250 89 71 23 -74 20 41 69 -38 -23 -67 -155 -126 -17 142 -93 -216 65
6379F5j3p5PK24j16k58J14l7J77j54K25j89M7q9J82o5l11K53O6k27J12J28K9k37
$$ 65 52 -23 -16 208 92 -166 -52 -89 88 -66 159 -30 17 -72 110 45 -266 -13 53 -174 -62 66 95 -142
6403a42m7M53j37j52p9m6M14o6j64k4J78l02N0p6J62k06K5K51n3r3n2O1Q8K4p1
$$ -142 -189 264 127 -25 -104 -150 264 198 34 10 188 -114 -64 -140 22 -184 -159 92 39 -54 -106 -45 43 67 -4
6428dj68O6O7K06K17j49l8n6k13J35m2j61J36o7K06j71k4J29R3k75l2L46k69l3
$$ -4 -172 -106 -39 167 384 235 197 141 -72 63 21 -140 -4 -71 135 -36 -60 69 162 -113 -145 201 -68 -101
6452a01J17q4k28K79Mm8R3j46L11j98j18K37J3j92Rj07J87P7l29L79k73Q7pJ8
$$ -101 16 -68 -296 -17 -13 -61 32 -114 197 -1 -119 118 131 -61 -52 -159 28 105 -224 155 -118 -31 -38 -20
6476b0N9l5L3M1o7P5j29J69l6J11m90L72L5j07k75L43J61p4j55j33L9L1J42l6
$$ -20 39 4 37 78 11 86 -43 126 90 201 -289 83 118 11 -264 79 240 166 11 -122 -83 -52 90 54
6500E4j51N8R6n0R6l38o2K18K89j45m7l07J42J38l2oN4K9q0j15M55l66K5k77K87
$$ 54 -97 -39 57 7 103 -235 -297 -79 210 65 18 -289 -147 -9 -41 -47 7 36 -44 -159 296 -70 -45 -322 -35
6525c5J42K0L4j74m7J25L8j01j1j46J47k41L60l64J15J05k04L27k76J93J00l33
$$ -35 107 127 161 -13 -60 65 103 2 -9 -155 -8 -249 111 -253 -138 -33 -237 90 -186 7 107 -226
6547b26J73o6p8M64m13K94lk46J43n8K20l16O5K03k4j14Pp3J69l14J48J85j45
$$ -226 -53 -119 -197 267 -146 148 145 -101 42 -16 204 -112 -47 156 132 18 25 -48 121 -193 -45 140 -5
6570ek80K76J81k92R7o0K2q2L5j8n3J32l5j04lJ02J12q2j59L39J42k1j69q7j5
$$ -5 -285 -9 172 -120 -23 -83 -61 -143 -108 -126 -179 -47 -82 -186 -189 -87 25 -57 -216 123 265 244 75 -12 -27
6595b7J00k10M27l40O6j13L64J34l86l1Ok4P4r2j71L93o1NJ64o31J79J64m1K7
$$ -27 73 -137 290 -50 16 -97 267 401 15 -16 -10 -34 40 -52 -223 170 109 114 278 -353 -174 -10 -51 -24
6619b4o1j30J66j73L67l28J20k2J80r9k10J86L0N7j82L53k42J42Rm7k2J89k38
$$ -24 -85 -215 -49 -222 145 -183 -63 -85 95 -4 -214 -28 2 59 -123 230 -12 130 139 92 70 259 21
6642B1M2o1L3QJ82m5j59j64l6Q3K67j38J21l5j05Q6k67m5K33O0m55L50J1K0L4
$$ 21 63 2 35 43 225 180 21 -143 -179 -96 171 33 154 119 14 100 -167 -212 21 81 -374 -24 -13 7 41
6667D1j2l5Q8k62L7L12j33k59K57j05K4k52L76j66J29p5j04R2P5l6j57J29p9K63
$$ 41 29 -6 82 -180 -143 169 36 -223 34 -71 -47 -299 77 -89 40 -35 -139 -47 28 -8 -165 -36 -115 148
6691A48j67Q2J39l57J89Q3o0N0o4R7j75j4K27k73L9j1m4QK60K0q7o8m3J19l71
$$ 148 -19 63 202 -155 34 117 57 107 43 140 -35 -49 178 -95 -56 -67 -111 -103 157 177 90 22 -21 98 -273
6716b73M03J6j33m4rk8k0J50j2l7J42k45j83L75P5R5k89o4K04k32J06K80k75M4
$$ -273 130 146 13 -31 -40 -68 -88 62 50 13 155 -90 -273 102 177 272 -17 -81 123 -109 -3 277 2 46
6740D6j8P2P5j04m1j47r0J25K46O8k75o9J48r2K95q5q1k51K55j88N8O6l3J50l30
$$ 46 28 100 175 71 30 -117 -207 -82 164 232 -43 -112 36 -56 239 154 73 -178 77 -111 -53 13 -20 130 -200
6765b00K08k3M1o2m5j65K90n9j20J97p9M5j22L36k68m5M4J46l48J53j35J00p3
$$ -200 8 -15 26 -36 -81 -246 44 -15 -135 62 -17 28 -94 242 -26 -71 -27 119 -229 -76 -211 -111 -184
6788a84K54o0O8Rj24L57l33j78K8J80k09l0L29l2r9j14Q2J42p7j41K77m9k15Q2
$$ -184 70 10 78 87 -37 320 -13 -191 -163 17 -192 -222 107 75 -24 -138 -56 86 9 -132 145 96 -119 -37
6812c7O8k32L90j42P0r1N1j08N5J32p6j07ml1J54p6K11k6k56J48j98J30q2J55
$$ -37 31 -201 189 47 117 26 77 -31 24 156 80 -27 -31 -62 92 16 227 201 -55 93 -105 25 -57 98
6836I8m3l03J33J87j30r8K01k91K12K84k01j52R7P2J45l40OQ8p6Q6n5q0J94j40
$$ 98 55 -248 -115 72 -58 -156 45 -246 -34 250 49 -103 -6 66 211 -129 -123 -35 -111 -25 -80 -160 34 -106
6860a06J44J2K52m51n7M42l52K26qP0k73K66q4R3q3J0N9j47k22J37m2K97o4q4
$$ -106 38 50 302 -149 -206 236 -116 110 102 172 -101 165 81 174 91 101 160 13 -209 -72 -114 183 119 35
6884C5o9j91M07k9k42J21J78n2k61N6K57l4k08Q8j31Oo6Q3K27l02L48k70j3K02
$$ 35 -34 -225 182 153 -89 32 210 158 -103 -47 210 176 -32 56 -75 -69 -135 -52 175 -127 221 -49 -62 140
6908A40j74j09L90k2q2j39p4J3J83j03j50K89k62M0k11L53l3j7j79J23r1k23K79
$$ 140 -34 -143 247 225 143 4 -70 -57 126 23 -127 162 -100 -60 -271 82 49 32 -147 -24 -115 -338 -59
6931e9J48r2L6J9j7J8k84J64j48M26p2M1j54q2n1k5M11l41J56q4J02m1m20N10
$$ -59 89 -3 33 52 35 53 -231 -67 -215 211 139 180 26 -56 -107 -132 279 -62 94 10 112 71 -349 161
6955A61k80J92k9K64l51j64L32p0k43J20k2L1k6J42r2R3k98K71J31k60J37K0J68
$$ 161 -119 73 44 308 -43 -207 125 55 -188 -68 -90 -59 -85 57 -35 58 -240 31 162 -98 39 59 227
6978B27k02ok1mJ6q7LL62m61J23j07K42J06l10j1J56J1k4J31j60L83m15q9k05
$$ 227 25 19 -2 -6 10 -77 -74 288 -173 -50 -157 85 191 -119 -130 26 37 13 144 -16 367 -48 -137 -342
7002c42L28J29j78L54n3j79l64J85L55k19rR6j64J59r0L9l49j5L99l08J31J42
$$ -342 -14 115 -63 291 238 59 -305 -120 235 16 7 103 -61 98 8 47 -302 -317 82 -226 -95 47
7024D7O0o8Kj41Q2K08j5j95j13r9K52k07K69k75J93P8j53M6K4K9k85J67K09k66
$$ 47 107 39 41 -100 -18 190 175 -20 -133 -232 20 -187 82 -193 0 78 -75 -29 -5 24 -261 -94 115 -151
7048a51K01J53l47J49L3j37j61K38J72k36Q0J29j43k94K64j23L09l99R6Q0j23
$$ -151 50 203 -144 5 38 -99 -260 -22 150 -86 -6 123 -20 -314 -50 -173 136 -263 -167 -87 -210
7069b10J05K17k0k0J53k81J54rJ18R9m9k00jj01L9l37L87RJ0j91J82p0J73k06
$$ -210 -105 112 92 72 225 -56 98 89 207 306 257 57 56 -45 -6 -343 44 53 63 -128 54 -16 157 -49
7093d9L41n01L31l73J51J6K28N6n7k2O5k49K10m0m1Pl17L58R6j69j32qq2Q7J28
$$ -49 292 -209 122 -251 -100 -84 144 200 143 121 186 -63 147 107 66 73 -244 114 210 41 -91 -99 -181 -94 34
7118C4k12P9L67l25p0K77P1k43K34j70J03r6O1l44K31k85J38J54p2j53L16M8o7
$$ 34 -178 -99 268 -57 -127 150 221 -22 212 42 145 49 110 -234 -3 -288 -150 4 -68 -221 95 143 76
7141G6J3Nn3J26k32R4q0O0Q8J14m44K44k1j1K18j26q0J23l61M36m08L97l0k36
$$ 76 89 94 41 167 -65 29 -51 9 97 211 -233 11 -10 -21 197 71 -9 114 -247 189 -219 178 148 -88
7165h8J12J45q9q5p4o4J06j19J16J69N4n7j00k07J01J0R0J5j15N2N8R4j63MK34
$$ -88 24 169 80 -5 -79 -143 -37 -156 -40 129 183 126 26 -181 -80 -70 20 35 -80 -28 30 124 -39 -35 199
7190A99l29J95l5R9j95n3O2J69l47Q2L29j16J90k04O4j67OL0q9JJ8K49k66J25
$$ 199 -130 65 30 129 -66 -119 -57 112 -235 -153 176 60 250 46 110 -57 -51 -21 -110 -109 -91 158 -108 17
7214A7O9j53K09j19O6q6m5jl1J36k53R6R9j11L3J68J18j22kmQ3j28q5Mr1J55N7
$$ 17 86 -67 142 23 89 3 -42 -43 -74 62 -191 -95 4 -107 -74 94 212 90 88 84 167 39 -46 -42 -133 22 79
7241G9j04O0j69L15j22m2j04P6J76q7j68J43o9J82q1r0j28K08N3k03N4M8o0l0
$$ 79 -25 35 -134 181 59 17 -87 -11 165 78 -90 53 -16 166 85 -5 -133 75 128 -75 -21 27 -33 -63
7265f3J42n6K44k83r0K08m0M0j05j4K03j90N3k3j31R5M5K55l53O5M3j62J67M0
$$ -63 79 23 267 -16 -106 102 62 102 -3 -17 186 -4 49 26 -105 -10 35 290 -63 2 45 -117 50 90
7289I0R2j04k59KJ76qj00R2J43j96J56o3k3K3J73l13K35j19j10K10l66M36k98
$$ 90 182 78 -181 -179 -3 -11 -111 -19 124 -72 84 21 -2 21 194 -119 116 -3 -113 97 -269 167 -131
7312a31K19q7j46J10J46m4pn1ONj2J04l24R1L71j12n8j98L35j00k4%j49P9k8p2
$$ -131 88 1 -145 -35 111 67 60 9 15 20 8 112 -212 -121 250 138 80 -118 217 117 93 93 -56 23 -5 -77
7338g7j11O3L02k73j35M00l08K22l74L30K3LQ4k40J94l02J29K1l71L12J83p0J25
$$ -77 -188 -125 177 -96 -231 169 -139 83 -291 39 62 65 149 -91 103 -199 -70 -49 -420 -108 75 5 130
7361A30rk52P8L4J17j76J24M4o9J7K29l52l02L72j8J07p0L59k89j51m6L15p4L7
$$ 130 121 -131 -53 -19 98 -78 46 90 21 38 267 -85 -387 -15 -33 74 4 363 74 -77 -123 192 118 155
7385A55k61J93j41l0K05k99L04k69j04M20k09p3L1K01k21j63J24J13l6j28L29
$$ 155 -106 87 -54 -84 121 -178 126 -143 -247 173 -36 -109 -78 123 -98 -261 -137 -24 -60 -188 141
7406A41k35K57j65k2J3O1%R2k29N7L5J19l40L20o9k43R3k5K67p9l21J51n3K98
$$ 141 -94 163 -2 -24 -11 50 50 142 -87 -30 5 124 -216 104 35 -208 -115 -140 127 48 -273 -122 -175 123
7430A23k12J55j04j03L9J86l4j74Q3P6M9l88J60J43p5j26K71q4k40K45J19l0j92
$$ 123 -89 66 -38 -141 -102 84 50 -124 -41 35 84 -304 -144 -1 -76 -202 69 -15 -255 -10 109 79 -113
7453a13K59j29J7j61K55m07J12l5L71N1k16j3N9J04l8p2L5k63K84j63m4K80m8
$$ -113 146 17 34 -127 128 -279 -167 -202 169 220 4 -9 50 154 116 44 79 -184 100 -63 -107 173 125
7476A25j91PJ57l77L78j88J29J18j45p8l3J49J06j49k72L99o4J6j47J54Qk07j05
$$ 125 -66 -59 98 -279 99 -89 40 158 13 -65 -98 51 157 8 -264 135 71 87 -60 94 102 -105 -210
7499b10M06m9r6j13K03j37M8j5o1J48N8o9l6J64l77J12J31o0k49J71L1O8J87j85
$$ -210 196 147 51 -62 141 4 52 37 -24 124 182 113 77 241 -136 -24 107 47 -202 -31 0 68 255 70
7523G0n1m1q1K20j15r7N1Q6J61j56N1j8q2j78L76j92j56J07m8j08Q4Q0m8Q0j0
$$ 70 19 -22 -103 117 2 -95 -44 42 203 47 98 80 -2 -180 196 4 -152 -45 -93 -201 -117 -37 -85 -5 -15
7548a5J52k90K46j12l7J8K28k00QJ28k48K4J56j09p9L13q7NQ1j21l9j57K57R0
$$ -15 137 -153 93 -19 -56 -38 190 -10 -2 126 -122 -98 58 -51 -130 183 96 101 182 61 22 -135 122 212
7572B12l43J60j2k90L35k57J22J07O0k44Q2j4K3J64j4j7j53K43q9k24K33K2l57
$$ 212 -131 29 17 -273 62 -195 -73 34 94 -150 -68 -82 -59 105 91 74 -79 164 75 -149 84 106 -251
7595b51J66J09o0P9o3J20k42L08j93l2J65j11j10K41m0k57Q2J24j75N8j26J25
$$ -251 -85 24 -36 43 -20 100 -142 166 -27 -59 106 -5 -115 126 86 -171 -89 35 -140 -82 -208 -83
7617h3j58K20J6K5J81j31k52j1J18Q1K3j5K0j01Q4j42K0k5L25j30k8L7k8Pm8J5
$$ -83 -241 -21 -5 20 201 70 -182 -193 -75 6 29 14 34 -67 17 -125 -105 -130 195 65 37 74 46 53 5 20
7643B0o7q1L51j68j17k9K17R8k33j7l69O85l37r7K49j12J69j02P6k41L86j82j51
$$ 20 -47 -128 223 55 -62 -91 126 224 -9 -26 -395 290 -47 -144 105 -7 162 60 136 -105 281 99 -52
7666e2P4K0q2p2K4J7j14Q2m6L38j53M2l8J56k24m2R6J53J40m11ol6Q4j92L20K24
$$ -52 22 42 -40 -112 -88 -71 -185 -103 -149 189 36 78 40 196 -28 -70 26 179 319 -92 -98 -134 -50 -242 78 302
7692C02m43J74K60n14L25O1j65n1J38j93J52j82j9J35j86L25m1j0Q2J27n76K27
$$ 302 -141 33 293 -221 104 165 0 -51 87 -106 46 -136 -155 -20 -206 119 78 68 150 277 -299 -72
7714g2L12L8k85K05l1j41N3K23l91K43R0m9j98K26j42k38J43K43Kk67K5k1J04
$$ -72 240 278 -7 198 167 26 79 302 -89 154 244 195 -3 223 81 -157 -14 229 231 -36 -11 -32 72
7737G2k17P0K11k8k5j03k4J34j27P7j12K74N1k28L4j06k8J77j6M2p6J75k91M7
$$ 72 -145 -75 136 108 83 -20 -44 90 -37 40 -72 202 253 25 59 -47 -75 102 86 128 52 227 -64 -17
7761a7J40k37J34k42lL69j73J43p6k8J00L7j75k3q5P1J21q2J59k40J95k76o6M71
$$ -17 123 -114 20 -222 -225 144 -29 114 38 10 110 147 -28 -51 -136 -65 56 -26 133 -107 88 -188 -254 217
7785B17j55J00k65J30k83K26q4K64q4j03n5K35j44L21k15k61j8J93m03M31Q7j42
$$ 217 62 162 -103 27 -256 -30 -114 150 66 -37 -92 143 -1 320 105 -156 -174 19 -384 47 134 -8
7807hp4K16k44K51l8l3l8l3K05j91Q5l96K55OK72j15j89J43j45N6K6K18o3k24
$$ -8 -82 134 -110 141 103 70 32 -1 204 13 98 -298 -43 -37 235 120 -69 74 -71 -15 11 229 166 -58
7831e8M1rJMKJ92k27l9O4k6j11R3K09j32o5K71j39Q8j68j50J22n1k0O9r0nK54
$$ -58 -17 -26 -25 -21 -19 173 -54 -93 -29 -55 -166 -73 136 4 -61 210 71 159 -9 -159 -37 -88 -108 -39 -129 -134 120
7858A20Pj84O2j4R1j27K04nl94J74M8k9R1k8o0r2J02Q6o3P6m9K13p6k6j60J23
$$ 120 127 -57 5 -9 82 -45 159 154 -240 -66 -18 -47 44 16 -44 -136 -34 52 -11 65 16 229 153 127 -33 90
7884I0k13M8O6Lm3J00Q7k21j87J26L50p0k78K37K56k05N2j32M8l24J20q5Q7M17
$$ 90 -123 -75 -9 -6 -49 51 138 -83 -270 -144 206 136 -142 95 351 146 198 66 114 -210 -90 -175 -88 329
7908C29k03n0O4l7l18L05l01N4j31K11p6K44N7m38L09k31K76N3m02L20J06J98
$$ 329 126 76 140 103 -215 90 -211 -157 -288 -77 -153 91 148 -290 19 -212 64 117 -285 35 141 339
7930C39o34L44K21l34J95k31J13l41N07q0m08L71o0j25J52k08j61L44N2j51K71
$$ 339 -295 49 270 -64 131 -100 13 -328 179 99 -309 62 2 -123 29 -179 -340 4 56 -95 176
7951A76l7k37l7K44O1j97m8K78j09p6l13K25N6l59L51k17L75j55L14m41K2M64
$$ 176 139 -98 -135 109 170 -27 -75 203 94 18 -295 -70 -14 -373 -22 -239 136 -19 295 -146 -124 340
7973C40l14J17j12n8j29J06P4q8n7K25l50J62Q1P5l27K28j39M16m23J69k71J10
$$ 340 26 143 31 -27 -156 -50 24 -64 -121 104 -246 -84 -3 72 -255 -27 -166 250 -173 -4 -275 -165
7995a65J17j52K25J7o4j0Q9J7p9l4J8N8L9k32M31l18P4J60p4r4K03k51j08K08
$$ -165 -48 -200 25 42 -22 -32 57 74 -5 -39 -21 37 76 -156 275 -43 31 191 117 23 226 -25 -133 75
8019G5k45mL67j85j26J76p4k0J58L5n0j06J7R5J60k37k3J29j42r4K76j50J83k89
$$ 75 -170 -174 193 8 -118 58 -16 -36 122 157 107 1 18 113 273 36 13 142 0 -94 182 32 215 -74
8043g4l6MJ59n7J79o7k33K28j19r5mkL02n12L50n7J33j10k61J20K00o8j97M31
$$ -74 -110 -106 53 -4 175 108 -125 103 -16 -111 -115 -117 185 -327 23 -34 99 -11 -272 -152 48 -20 -217 214
8067B14q2j77Q4q2M0j82K13N2j15L0j19nJ31J24r3K00l02J63k14J29K1M2k6l32
$$ 214 132 -45 39 -43 -3 -185 28 80 -35 -5 -124 -129 2 126 33 233 -69 94 -120 9 30 72 46 -286
8091b86J55P3j18J36J15qk29N4J42n8J18j34J60k3j49O5J33j85J2l7M7l6K8J65
$$ -286 -131 -58 -176 -40 75 67 -162 -108 34 -24 94 -40 120 97 -52 13 146 -39 -27 -64 -17 -53 -25 140
8115A40j40Q3k48N3L93k62Q6p5K87l13P4r9J51k36R1P5k4J70j74p1L7p2K6n9J32
$$ 140 0 83 -165 -112 281 19 105 30 317 4 78 -21 130 -106 -15 60 36 206 32 -39 -2 -74 -48 -107 25
8140B5j68j10K81J13o6M7l3l28L68J4k8k02J72J03k49J83j01j14J48R3m6j57R2
$$ 25 -143 -253 28 141 75 122 89 -239 129 143 115 -87 85 188 -61 122 21 -93 55 148 102 -55 37
8163C7l4p4K5K9O6j86K83j55M4m4J25j46qJ46j65J54N0Ol7j04j42K08m5koJ70
$$ 37 3 -71 -46 -17 49 -137 146 -9 35 -9 116 -30 -38 108 -57 97 147 153 116 12 -130 78 33 31 25 195
8189A95p7J4
$$ 195 118 132
8191A32
$$ Imaginary data points
##PAGE= N=2
##DATA TABLE= (X++(I..I)), XYDATA
0@%%%%%%%%%%%%%%%%%kJ0j6J6j6J6k0K8l2L2m0M8n2O0o8P6q7R9j10J23j38J54
$$ 0 0 0 0 0 0 0 0 0 0 0 0 0 0 0 0 0 0 -2 8 -8 8 -8 8 -12 16 -16 16 -24 24 -28 32 -36 40 -47 52 -58 65 -73 81
39H1j71J91k13K35k60K87l16L49l84M24m68N16n67O24o91P64q46R39j048J177
$$ 81 -90 101 -112 123 -137 150 -166 183 -201 223 -245 271 -296 328 -363 401 -445 494 -554 623
59F23j330J518j751K048k443K994l816N170p754J4285n7693r2529K18920L2397
$$ 623 -707 811 -940 1108 -1335 1659 -2157 3013 -4741 9544 -48149 -140678 78242 110639
73A10639k15223K7447K03987q6138j68744J28267J29234j61284p7915J74742K7107
$$ 110639 -104584 -77137 126850 40712 -128032 235 129469 -31815 -109730 65012 92119
84I2119j77251K3402J62670o8497j39754J05651J02867j31204o2150J42830J7218
$$ 92119 -85132 -61730 100940 32443 -107311 -1660 101207 -29997 -92147 50683 67901
95F7901j39683K2466J27288n7512j04416Q5391P5972j03276m1212J12223O714
$$ 67901 -71782 -49316 77972 20460 -83956 1435 77407 -25869 -67081 45142 51856
106E1856j09163K6499R8918n5556p8820P8562N3090r2275k4162R5820n622r1235
$$ 51856 -57307 -30808 68110 12554 -66266 12296 65386 -26889 -51051 44769 39147 -52088
118e2088L0545P9038n3113o2552O9799L8920p9935j3371Q1146j2609p5426L6096
$$ -52088 -21543 57495 4382 -58170 11629 50549 -29386 -42757 38389 25780 -49646 -13550
130a3550O3086n5392m4353P0090K1710p4771K978P2901k5153o2677M4601M8214
$$ -13550 49536 -5856 -50209 19881 41591 -33180 -30202 42699 17546 -45131 -530 47684
142D7684n8928k8174O7455N011o8506J8394O0568l9222m7461N4387K8676o5536
$$ 47684 -11244 -39418 28037 33048 -35458 -17064 43504 4282 -43179 11208 39884 -25652
154b5652p041O7698j6070o3776L7235N1943n4211l5136O5893J5159p1545Q486
$$ -25652 -32693 35005 18935 -44841 -7606 44337 -9874 -45010 20883 36042 -35503 -27017
166b7017P0577l1596o0402N2829M4838o7847k3576P7282J19p9363K5417P3010
$$ -27017 43560 11964 -48438 4391 49229 -18618 -42194 35088 35207 -44156 -18739 54271
178E4271m8931n9539O7516L9357q0379j6585Q5358r036q3644L3318P3423n5546
$$ 54271 5340 -54199 13317 52674 -27705 -44290 41068 32032 -51612 -18294 55129 -417
190d17n6803P1677L5209q1172j1200Q3898j2607p9606L5810O9262n4632n2724
$$ -417 -57220 14457 49666 -31506 -42706 41192 28585 -51021 -15211 54051 -581 -53305
202e3305O9492L3136p7038j1244P9809j1007p5610L2296O4964n0501m9314O2911
$$ -53305 16187 49323 -27715 -38959 40850 29843 -45767 -13471 51493 992 -48322 14589
214A4589L0007p0888r842P2332j1891o8665L1228N8939m8390m4804O0892K7038
$$ 14589 44596 -26292 -36134 36198 24307 -44358 -13130 45809 -2581 -47385 13507 40545
226D0545o7697p881O9813j1817o5454L1033N6327m6229m2136N8529K5392o5151
$$ 40545 -27152 -35033 34780 22963 -42491 -11458 44869 -1360 -43496 15033 40425 -24726
238b4726n871O6315j3281o2132L1663N2115m7144l7874N7527K0097o3142k360
$$ -24726 -30597 35718 22437 -39695 -8032 44083 -3061 -40935 16592 36689 -26453 -28813
250b8813O3087j7265n6972L3488M5289m6264l0333N3570J3959n6448L671N4589
$$ -28813 34274 17009 -39963 -6475 38814 -7450 -37783 15787 29746 -26702 -23031 31558
262C1558k0146m6470L4475L4713m3319k0525M9518N035m9651J0565M5220k4020
$$ 31558 11412 -35058 -583 34130 -9189 -29714 19804 24839 -24812 -14247 30973 6953
274F953l6771L4683K4714m1163j1828M3085k203m1836J4899L5529k6263k6526
$$ 6953 -29818 4865 29579 -11584 -23412 19673 17470 -24366 -9467 26062 -201 -26727
286b6727L4225J4096l8025j702L7740r958l4004K0966K7005k8408j7041L3657
$$ -26727 7498 21594 -16431 -18133 19607 9649 -24355 -3389 23616 -4792 -21833 11824
298A1824O432l4264M475L2808j4301k7509K2557K0083k8810j0796L1796K83l1584
$$ 11824 18256 -16008 -11533 21275 6974 -20535 2022 22105 -6705 -17501 14295 14578 -17006
311a7006Q538K8788j7387k4780K5048J6561l0173q016L2292j731l1325J0656K8035
$$ -17006 -8468 20320 2933 -21847 3201 19762 -10411 -18427 13865 12134 -19191 -8535 19500
324A9500j8849k2044K5631J5102k9697n955L1973l637l0087J2715K6784k0430
$$ 19500 651 -21393 4238 19340 -10357 -16312 15661 12024 -18063 -5348 21436 1006
336A006k0929K7323J2744l1302l600L2104o485l0244J4724K5781k3285j8977K8643
$$ 1006 -19923 7400 20144 -11158 -14758 17346 10861 -19383 -4659 21122 -2163 -21140 7503
349G503J0039l2157J3L1839r602k9055J8455K3761k5715j5817L0999O280l2002
$$ 7503 17542 -14615 -14602 17237 7635 -21420 -2965 20796 -4919 -20736 10263 16543 -15459
362a5459L534L1407j2620k6472K0303K0229k5855j2113K9150K787k9720O479K6681
$$ -15459 -11925 19482 6862 -19610 693 20922 -4933 -17046 12104 14891 -14829 -8350 18331
375A8331j4567k1707J9755J5090k4197p670K5897q37k5285Q372K1805j4753j6937
$$ 18331 3764 -17943 1812 16902 -7295 -14965 10932 10095 -15190 -6818 14987 234 -16703
388a6703J9563J0524k1902l266K2770k998k1008R647J7873j4426j2755J8117P277
$$ -16703 2860 13384 -8518 -11784 10986 7988 -13020 -3373 14500 74 -12681 5436 12713
401A2713k0155p68J9675m649j8368R676J4840j3845j0856J5986O039j7943j212
$$ 12713 -7442 -8210 11465 6816 -11552 -1876 12964 -881 -11737 4249 10288 -7655 -8867
414h867J7459m100j5901Q350J3150j1492r757J4261N422j5392l02J5581m037j3498
$$ -8867 8592 4492 -11409 -3059 10091 -1401 -11158 3103 8525 -6867 -7169 8412 4375 -9123
428i123Q142J1554j1089q104J3976L587j4819R21J4285n569j2762R169R340j2229
$$ -9123 -981 10573 -516 -8620 5356 8943 -5876 -4955 9330 3761 -9001 168 9508 -2721
442b721o063J3810J685j4784L249J2828p075j1376J1106P868j3044m085J4144
$$ -2721 -8784 5026 6711 -8073 -4824 8004 929 -10447 659 8527 -4517 -8602 5542
455E542Qj3797M795J2240p855r724J1457O138j2410k241J3288j966j2562O096
$$ 5542 5550 -8247 -3452 8788 933 -8791 2666 8804 -3606 -5847 7441 5475 -7087 -991
469i91R796q997p203J0687L163j1892N86J1114m225r889O977P157r133m079R983
$$ -991 8805 -192 -7395 3292 6455 -5437 -4851 6263 2038 -7851 -874 6283 -2850 -6929 3054
484C054J089r818J923R400m628p355O798N627p867k707Q497P00q521K114P540
$$ 3054 4143 -5675 -3752 5648 1020 -6335 463 6090 -1777 -4484 4013 4713 -3808 -1694 5846
499E846m335n880N616L813o568k132O519K61p089J594O079l516m672M213L124
$$ 5846 1511 -4369 1247 5060 -1508 -3640 2879 3140 -3949 -2355 3724 208 -4464 -251 2873
514B873n010j602N234M55n712J741N098k536m054M026K953m564j313N210M69n706
$$ 2873 -2137 -3739 1495 1950 -3762 -2021 3077 541 -3513 513 3466 -1098 -2411 2799 3268 -2438
530b438J324N180k899m451M161L173n242k096N666J03o008J473N327l137m701
$$ -2438 -1114 4066 1167 -3284 877 4050 -1192 -3288 2378 2481 -3527 -2054 3273 136 -4565
545d565M495L021n185j684N844j62n605K653M563l858k615M415J748m458m93N086
$$ -4565 -70 2951 -2234 -3918 1926 1764 -3841 -1188 3375 -483 -3098 1317 3065 -1393 -1886 3200
561C200j118m404K865L138l965k061M384L41m517P09L989k396l543L609J775l732
$$ 3200 2082 -2322 543 3681 -284 -2345 2039 2380 -2137 -1428 2561 165 -3378 231 2006 -1726
577a726p96L660j79l666J551K985k095k033K803J339k555k76K349qj834P93J489
$$ -1726 -2522 1138 959 -2707 -1156 1829 -266 -2299 504 1843 -712 -988 1361 1353 -481 312 1801
594A801j031j232J132Q13j289n04J056k36p00n5P60n32r99N24L32o64l11J015
$$ 1801 770 -462 670 1483 194 -310 746 510 -190 -245 515 -17 -1016 -492 -160 -824 -1135 -120
612a20J75j153J48J278m43p14O86J205r38r65J614P74j512k36J936m52j819Q85
$$ -120 55 -1098 -950 328 -115 -829 -143 1062 124 -841 773 1547 35 -201 1735 1283 -536 349
630C49J315j118j703J628P96j755m02J734o25j692O02J526j230j346J696O97k036
$$ 349 1664 546 -1157 471 1267 -488 -890 844 219 -1473 -871 655 -575 -1921 -225 472 -1564
647a564P24J606p93j202J498P35j320l5J516k53j460J053J051j657o3J277k92
$$ -1564 -840 766 -27 -1229 269 1004 -316 -351 1165 912 -548 505 1556 -101 -164 1113 821
664H21j294J9J461p72j136Q32P10j476L9P25l31n53J50N04n5l25O27J33m93L25
$$ 821 -473 -454 1007 235 -901 -69 641 -835 -796 -71 -402 -955 -805 -301 -356 -681 -54 79 -414 -89
684h9M28m18M08K11p1j38L83Jk97L9K99m55j96N31n1q25N2L10l70k00J45j31k17
$$ -89 339 -79 329 540 469 331 714 715 418 457 756 301 105 636 585 -240 -188 122 -248 -448 -303 -434 -651
707f51K29J62q94P64L41l20K0O52J22n55K5J046l32p71Q75K41m85l18P28j62m53
$$ -651 -422 -260 -1154 -390 -49 -369 -349 303 425 -130 -105 941 609 -162 713 954 469 151 879 717 264
728B64l46N76j33o61L52j26j59pk18Q8k57j13J75p4J29N04n16j21R16j18o74P99
$$ 264 -82 494 361 -300 52 -74 -233 -240 -458 -370 -627 -740 -565 -639 -510 -6 -522 -643 273 155 -519 280
750B80O52o65m80Q77J38p79K24R79p98l41N56k02l40l29P72o62o46Q12Lj217M67
$$ 280 932 267 -213 664 802 23 247 1226 428 87 643 441 101 -228 544 -118 -764 48 51 -1166 -699
771f99J079j016o46J222L27j201J34J439m61j141R13J103r96l89J034N90j186
$$ -699 380 -636 -1282 -60 267 -934 -800 639 178 -963 -50 1053 57 -332 702 1292 106
788A06k01J499q27p27O57N45j072n68Q64K19j458L90J045j048m94R92o1q43K51
$$ 106 -95 1404 577 -150 507 1052 -20 -588 276 495 -963 -573 472 -576 -1070 -78 -139 -982 -731
807g31P47n6q58P09R31r21l23J174J77j207M23R23l29r32N82J018j105o82Q46
$$ -731 16 -40 -898 -189 742 -179 -502 672 849 -358 65 988 659 -273 309 1327 222 -460 386
826C86L62r04m06Q81L86j684J80J297p98j140J019Q27j174o52J680L16j536L60
$$ 386 748 -156 -562 319 705 -979 -799 498 -300 -1440 -421 406 -768 -1420 260 576 -960 -600
844f00J586o62j003R46J300j504p24J700L51j880L75K205j889r03J393N54k166
$$ -600 986 324 -679 267 1567 63 -661 1039 1390 -490 -115 2090 201 -702 691 1245 -921
861i21k98K332o40k602J563J814k094j332K769K72k686L69K874r15k353J753K008
$$ -921 -1219 1113 473 -2129 -566 1248 -846 -2178 591 863 -1823 -1454 1420 505 -1848 -95 1913
878A913k503o52K926j71k675O57K878j769j915K069J436k786m20K361j68k730
$$ 1913 -590 -1242 1684 1513 -1162 -505 2373 604 -1311 758 2194 -592 -1012 1349 1181 -1549
894a549R50K196k161j560K585O20k424q8K496p86k282J550J968j902j294K804
$$ -1549 -599 1597 -564 -2124 461 1081 -1343 -1431 1065 279 -2003 -453 1515 -387 -1681 1123
910A123M18k560j36K778m20k586J337K290k344j371K677P60k910j14K585p63k477
$$ 1123 1541 -1019 -1155 1623 1203 -1383 -46 2244 -100 -1471 1206 1966 -944 -1058 1527 764 -1713
927a713J233J916j922j782K503Q86k678K27K677j129k364J724K450k353j403L092
$$ -1713 -480 1436 -486 -2268 235 1121 -1557 -1330 1347 218 -2146 -422 2028 -325 -1728 1364
943A364M06l196M92L141j285k670K365K097l187j336L716K02l792P40L328k028
$$ 1364 1770 -1426 -934 2207 922 -1748 617 2714 -473 -1809 1907 2109 -1683 -943 2385 357
959C57l324L230J984l846p86L876l40l674J230L564k374k574L381J293l575j08
$$ 357 -2967 263 2247 -1599 -2385 1491 1151 -2523 -1293 2271 -103 -2677 704 1997 -1578 -1686
975a686L748r26l125J857L005l039j874M011J40l666L88L800j711l500K607K165
$$ -1686 2062 1136 -1989 -132 2873 -166 -2040 1971 2111 -1555 -1167 2633 922 -2578 29 2194
991B194l151j553L950k0l617O38L428j879k832K880K214l584j147L977J49l566
$$ 2194 -957 -2510 1440 1420 -2197 -1559 1869 -10 -2842 38 2252 -1332 -2479 1498 1647 -1919
1007a919R36L635k262k672L124J771l287j049L861k88l437R61K977k400k180L096
$$ -1919 -983 2652 390 -2282 842 2613 -674 -1723 2138 1850 -1587 -626 2351 -49 -2229 867
1023H67J305l760m70L723p54l497J676K867k421k218L291J092l398p5L736p01
$$ 867 2172 -1588 -2058 1665 911 -2586 -910 1957 -464 -2682 609 1701 -1697 -1772 1964 1263
1039A263l906K186L356k984k256L618J601m448M1M190j426l533K398K814l600
$$ 1263 -2643 -457 2899 -85 -2341 1277 2878 -1570 -1529 2661 1235 -2298 100 2914 -686
1054f86k018M146P98m725O73M311k080l594L082K471l969j028M086K10m270J250
$$ -686 -2704 1442 2240 -2485 -1812 2499 419 -3175 -93 2378 -1591 -2619 1467 1677 -2593 -1343
1070a343L916k101l308L562K190m260l70M246n34m407J665L799k906k921L680
$$ -1343 2573 472 -2836 726 2916 -1344 -1714 2532 1998 -2409 -744 3055 149 -2772 908
1085I08K037m692m54M603j056m407K303L643l481k416L656J377m009j1M226j256
$$ 908 2945 -1747 -2201 2402 1346 -3061 -758 2885 -596 -3012 644 2021 -1988 -1999 2227 971
1101I71l937K782K904l216j842L604J181m086N17L976j437l610K439K813l772
$$ 971 -2966 -184 2720 -496 -2338 1266 2447 -1639 -1122 2854 1417 -2193 246 3059 -713
1116g13j521L651O01m110Q42L609j792l492K736K483l649j043L938K13m273R32
$$ -713 -2234 1417 2018 -2092 -1250 2359 567 -2925 -189 2294 -1355 -2398 1540 1753 -2520 -1588
1132a588L912j995k968L073K223l389j053L440K67l957J262L777k637k517L101
$$ -1588 2324 329 -2639 434 2657 -732 -1785 1655 1922 -2035 -773 3004 367 -2150 951
1147I51J508l761m38M040j099l671J816L314l240k421L886J057m157L55L772j263
$$ 951 2459 -1302 -1740 2300 1201 -2470 -654 2660 -580 -3001 885 1942 -2215 -1860 1912 649
1163F49l548K531L031l129k068L867Q96l977M99L688j551l105K421K744l511j462
$$ 649 -2899 -368 2663 -466 -2534 1333 2229 -1748 -1249 2439 888 -2217 204 2948 -563 -2025
1179b025L903J98l896P14L434k008l250K937K149l749l54L483m22l702J491L025
$$ -2025 1878 2076 -1820 -1106 2328 320 -2930 7 2156 -1593 -1947 1536 1114 -2588 -1097 1928
1195A928k054k363L094J500l389m02L875j135l153K019K850k745k212L391J175
$$ 1928 -126 -2489 605 2105 -1284 -1686 2189 1054 -2099 -80 2770 25 -2187 1204 2379
1210B379l785k01L727r41l366J601K882k754j891L045J158l659K39L016q99l203
$$ 2379 -1406 -1607 2120 1179 -2187 -586 2296 -458 -2349 696 1854 -1805 -1566 1450 551 -2652
1226b652K226K645k715j753L257O75l260M33L144j358k717K116K691k887j655
$$ -2652 -426 2219 -496 -2249 1008 1683 -1577 -1144 2000 642 -2075 41 2732 -155 -1810
1241a810L689o3l392N59L164j531l128L069J709l205j188L219J29l327P98K938
$$ -1810 1879 1816 -1576 -1017 2147 616 -2512 557 2266 -939 -2127 1092 1221 -2106 -1308 1630
1257A630j335k690K603K049l353p06L355l18l236J671K555k117j931K699J392
$$ 1630 295 -2395 208 2257 -1096 -1802 1553 1235 -2001 -330 2225 108 -1823 876 2268
1272B268k881n37L170q60l025J681K377k440j382K441N63k962J39K844j288k210
$$ 2268 -613 -1150 2020 1160 -1865 -184 2193 -247 -1629 812 1375 -1587 -1448 1396 108 -2102
1288b102J670K106k472j061K637Q04l219M64K726j222j991J738J689k317q07K952
$$ -2102 -432 1674 -798 -1859 778 1582 -1637 -1173 1553 331 -1660 78 1767 -550 -1357 1595
1304A595pk877P53K153j192k066J910J235k166n23K150N1k312M83K196j404j541
$$ 1595 1588 -1289 -536 1617 425 -1641 269 1504 -662 -1185 965 1016 -1296 -813 1383 -21 -1562
1321a562J763Q82k129j83K258l72k026J014J717j300j438J967Q48j908l75K210
$$ -1562 201 1083 -1046 -1229 1029 657 -1369 -355 1362 62 -1376 591 1439 -469 -844 1366
1337A366l16k293J547J823j971j648K108N75k090j11K058o61j837J271J154j416
$$ 1366 1050 -1243 304 2127 156 -1492 616 1191 -899 -1010 1048 387 -1450 -179 975 -441
1353d41j159J870L22j863J46K377j046j798J624J530j972p04J957K21j914N16
$$ -441 -1600 270 592 -1271 -1125 1252 206 -1592 32 1562 -410 -1114 843 1064 -850 -334
1369c34K028j456j313J567J019j952o45J969m8k165R29J366j134j319J418R80
$$ -334 1694 238 -1075 492 1511 -441 -1086 883 835 -1330 -401 965 -169 -1488 -70 910
1385I10j824k99J829m75j467R11J327j009p34J157P29j468j12J751n42j354R30
$$ 910 -914 -1213 616 141 -1326 -415 912 -97 -831 326 1055 -413 -525 1226 684 -670 260
1402B60Q39r65r49J599Lj501J32J600l92j620O60P67r79n84J258K23j325K2J625
$$ 260 1099 134 -815 784 787 -714 -582 1018 626 -994 -334 433 -546 -1130 128 351 -974 -952 673
1421F73o09j131J011Q15j103m52J559M8j376K75J129k83j047O44R24j229o18J321
$$ 673 64 -1067 -56 759 -344 -796 763 811 -565 -290 839 556 -491 153 1077 -152 -770 551
1439E51J21j170RJ027m27j196P52Q15r46j83P36J95j320O81P37m82o36R16M27
$$ 551 672 -498 -489 538 111 -1085 -333 482 -464 -647 89 284 -1036 -355 382 -100 -736 180 607
1458F07r21k43J441m23j168P00Q13m68r47J186L88j511M9J192k48j122N21Q52
$$ 607 -314 -557 884 461 -707 -7 806 338 -609 577 965 -546 -497 695 447 -675 -154 698
1476F98p36p32R13P3q00j72R69k74o68N47O21n34l62P45M0o55J71M68j47o15P98
$$ 698 -38 -770 143 216 -584 -756 213 -61 -729 -182 439 -95 -457 288 328 -327 -156 312 165 -450 348
1497C48K25n86k0J83L25o98J59N33l54n14K24K48l77m45P79K05r89K45P55l10
$$ 348 573 -13 -33 150 475 -223 -64 469 115 -399 -175 73 -304 -749 30 235 -754 -509 246 -64
1517f4m87J54Q74m51n07M35J21n7l79Q12j10n17K88O26o34l3L34r9o74L43L34
$$ -64 -551 -397 477 26 -481 -46 75 18 -361 451 341 -176 112 738 104 71 405 306 -368 -25 309
1538C09R8r45L31R31j007l80O04j57l66N8P85l60m99L38N51n01k59P67K13m75
$$ 309 407 -538 -207 724 -283 -663 -59 -216 -582 -524 261 -99 -598 -260 291 -210 -469 298 511 36
1558C6j33O98l51m17M53K65n04l25N81O1l75m6R8l3m90M11K23k09k95M00P0l38
$$ 36 -97 601 250 -167 286 551 47 -278 303 364 -11 -57 41 8 -482 -71 152 -57 -352 48 118 -220
1580b20l48P26l04q1J97J80l11N4K61n9r9p3M72k34o4L06J68n14m28N73K1k15
$$ -220 -568 158 -146 -227 -30 150 -161 -107 154 95 -4 -77 395 161 97 403 571 57 -371 202 223 8
1602Hl26N75l28k59L17K89m03n03L73L57n01OL93J36k65K4L23j20r2L7J40p8j85
$$ 8 -318 257 -71 -330 -13 276 -127 -630 -257 100 -401 -395 -2 134 -131 -107 216 96 4 41 181 103 -82
1625h2M24K16n69J50K22l50J5J73o9j22p7K50m8m25K59J92m66k58L78M56o33L41
$$ -82 342 558 -11 139 361 11 26 199 130 8 -69 181 133 -292 -33 159 -307 -565 -187 269 -364 -23
1647b3J68l23pL5J49m3j46M06p0o97L28Q64l77j48M1J46j90j96L94k06q0k01K02
$$ -23 145 -178 -185 -150 -1 -44 -190 216 146 -551 -223 641 264 116 157 303 113 -83 311 105 25 -176 26
1670B6k90j08J40M09l37l06K16M4j0j23J45k35L69J21P0Rk31M09J51n38L90K7
$$ 26 -264 -372 -232 177 -160 -466 -250 -206 -216 -339 -194 -429 -60 61 131 140 -91 318 469 -69 321 348
1692C48j30l04M16o7l43MJ31L53n46J4Q8O3n27J23N42n09m3L53K5r7J24Qj32k48
$$ 348 218 -86 330 263 -80 -76 55 408 -138 -124 -36 27 -500 -377 165 -344 -387 -34 -9 -106 18 26 -106 -354
1716c54M04k0M4j48J55J07l90L45K46k84mJ08M88q31L7L37m90J29L39K46l59p46
$$ -354 50 30 74 -74 81 188 -202 143 389 105 101 209 697 -134 -97 240 -250 -121 218 464 105 -641
1738f41O86L6l90qM22j15m30J02N76j96k3J54R6l17J84J62k49m7K99l7l28n2L81
$$ -641 45 81 -309 -317 105 -10 -440 -338 238 42 19 173 269 -48 136 298 49 2 301 264 -64 -116 265
1761B65J06o95J94M33l92j24J55j1M7l85O33j46o03L97L20l26j35K87L9M8k55
$$ 265 371 -324 -130 303 -89 -213 -58 -69 -22 -407 226 80 -523 -126 194 -132 -267 20 59 107 -148
1782a48L50M0j86m1M51j83m18K33Q3J08l34J29J69j75j54L55m46j33K4K23k21
$$ -148 202 242 56 15 466 283 -135 98 181 289 -45 84 253 78 -76 279 -167 -300 -276 -53 -274
1803b74K39L9j20p3j24J99Q9l84N76j8j85J58K59l68o9R4K40K44k27P5k60l4K
$$ -274 -35 4 -116 -189 -313 -114 -25 -409 167 149 -36 122 381 13 -56 38 278 522 295 370 110 76 78
1826G8M31j34o17L08J21n33N4N32l96N0k0p3O0l1l5J29m2J17k62L73k21K33k63
$$ 78 509 375 -242 66 187 -346 -292 240 -156 -106 -126 -199 -139 -170 -205 -76 -118 -1 -263 110 -111 122 -141
1849a41K45n2J95q6k3J16l08J8o0RK67n4r2k4R1r2j38Q7j08q8J76n1M6Qk6L2M
$$ -141 104 52 247 161 138 254 -54 -36 -96 -87 180 126 34 10 101 9 -129 -42 -150 -238 -62 -113 -67 -59 -85 -53 -49
1876d9J23j77K18Qk59K17J14p2k6j0J09J64k06K63l29m7qk55K12k04q5J44k42
$$ -49 74 -103 115 123 -136 81 195 123 97 87 196 360 154 417 88 41 33 -222 -10 -214 -299 -155 -397
1899c97L22j59K00j9R2l42J58Q4N2K02l56L53k35L32k8k3j44o6P8K09O2j94K1
$$ -397 -75 -234 -34 -53 39 -303 -145 -61 -9 193 -163 190 -45 287 259 236 92 26 104 313 375 181 202
1922B02k22J54k62J04J02j46r4L07j54K24k49j77J7n6l3K38p2P2l37L36j30K28
$$ 202 -20 134 -128 -24 78 -68 -162 145 -9 215 -34 -211 -194 -250 -283 -45 -117 -45 -382 -46 -176 52
1944E2J71O5j64pK24m3j76OJ71k32K35k12j74J8Q9q1J50M6k05J36k63J71Q0l2
$$ 52 223 288 124 117 341 298 122 128 299 67 302 90 -84 -66 23 -58 92 138 -67 69 -194 -23 57 25
1968B5m02M32j44l84K87J02L00k03j62O59n91L1J22J97M7n42N87p5m35pK12J09
$$ 25 -377 55 -89 -473 -186 -84 216 13 -149 510 -81 -50 72 269 316 -226 361 286 -149 -156 56 165
1990A65m60M59j77K0k29L77l3k77l93L94K1k37N27J44l69j87L93j34j80J90L77
$$ 165 -295 164 -13 7 -222 155 122 -155 -548 -154 -133 -370 157 301 -68 -255 138 4 -176 14 391
2011C91k5m45L11J68l55J56Q5P6o95L38J33l6m44L10J48k03k82L49K11o87N11
$$ 391 366 -79 232 400 45 201 286 362 -333 5 138 102 -342 -32 116 -87 -369 -20 191 -496 15
2032A5k8r5l71N86j88pK08J11k32j64L58K19j55j34K16M3l85j75P24n06m43N92
$$ 15 -13 -108 -479 107 -81 -88 120 231 -1 -165 193 412 257 123 339 382 -3 -178 546 40 -403 189
2054A89r1L9m42J86L20n37K47L06j49m85Q7M88j72k53O9K51m23J10L25J59l01
$$ 189 98 137 -305 -119 201 -336 -89 217 68 -417 -330 158 -14 -267 -198 53 -370 -260 65 224 -77
2075g7L04M1m87K87L75j86m38J81J57R5p35O11R2l10j11O85l29l24O0L03n63O1
$$ -77 227 268 -219 68 443 257 -181 0 157 252 -483 128 220 -90 -201 484 155 -169 -109 194 -369 -308
2097c08M29J20l71N7L30k34m85J70K99L35m07K97l0k23R1L2nj54J42L24m37n2
$$ -308 121 241 -130 -73 257 23 -462 -292 7 342 -65 232 202 -21 70 102 97 -57 85 409 -28 -80
2119h0K49m3m71k1M27j48k53J00K59q0j06J88j24j83R0J63J67k81J39L26j45p2
$$ -80 169 126 -345 -366 61 -87 -340 -240 19 -61 -167 21 -103 -286 -196 -33 134 -147 -8 318 173 101
2141A01K25j59j76j97L41K34n68K85J19j04l91L84O5m54J51L41l74j49K32K80
$$ 101 326 167 -9 -206 135 369 -199 86 205 101 -290 94 159 -295 -144 197 -177 -326 -94 186
2161A86o12N1M83n4l06J23K93j92r3M76J8k54l50O77l29k51m6N37k95j06K86j81
$$ 186 -426 -375 108 54 -252 -129 164 -28 -121 355 373 119 -231 446 117 -134 -180 357 62 -44 242 61
2183F1m77J83N47l13m92L75N34o61l25O79j14m72J22M81n2k99K36R9k54j67L69
$$ 61 -416 -233 314 1 -491 -116 418 -243 -568 111 -3 -475 -353 128 76 -223 13 112 -142 -309 60
2204F0R9l29J97K14n06pL70J63j78m9J68j64j98K10J79j19m98K56L76p29K20L88
$$ 60 159 -170 27 241 -265 -272 98 261 83 34 202 38 -160 50 229 110 -388 -132 244 -485 -265 123
2226A23k95k38M50J78l38j82L56J16j89k55N19n1l50J45J27J75l98K33m4j60Q4
$$ 123 -172 -410 40 218 -120 -302 54 170 -19 -274 245 194 -156 -11 116 291 -107 126 82 -78 6
2247FL95k89k84K91J20k03m73N47j49p8Q5r3J10l16J55N62m01k58N76j61m17J65
$$ 6 401 112 -172 119 239 36 -437 110 -39 -117 -32 -125 -15 -331 -176 386 -15 -273 303 142 -275 -110
2269a10M10j58k29j4L99n25M12j32P7j6k06L32j95j25p6K58l87Q5J09J08k03J79
$$ -110 300 142 -87 -101 298 -227 185 53 130 114 -92 240 45 -80 -156 102 -285 -200 -91 17 -186 -7
2291gO2l10j2K97J58l55j50Q04m00j82J84K52m72J38K66j31Q7l57J23J61l82n2
$$ -7 55 -255 -267 30 188 -167 -317 487 87 -95 89 341 -131 7 273 142 229 -128 -5 156 -226 -278
2313b78L08Jk53N0K90j34l47K83K20n38L55l8o3J30R6P4m87L86O8ll28J94L06
$$ -278 30 31 -222 -172 118 -16 -363 -80 140 -398 -43 -81 -144 -14 82 156 -331 55 123 120 -208 -14 292
2336B92k35P6L5N9n2o7K6o6j80J24K73l42K6K0n5NJ54J66n01J18j7K98Rm03L67
$$ 292 57 133 168 227 175 108 134 68 -112 12 285 -57 -31 -11 -66 -61 93 259 -242 -124 -141 157 166 -237 130
2361A30j52p7j91M15j9m7KR9q5L5J76l1k42L1K4m9p4K51l3n30N3J96L5j32K68
$$ 130 -22 -99 -290 125 106 59 61 160 75 110 286 255 13 44 68 19 -55 196 163 -367 -314 -118 -83 -215 53
2386E3m0j51M3K17m00K27Q6j77J41j58M44l6k09k31J78L60k62N6K14n51J14J29
$$ 53 13 -138 -95 122 -278 -51 35 -142 -1 -159 285 249 40 -191 -13 347 85 141 355 -196 -82 47
2408D7K14l25P1m6%j05k97L90N3N4q3J57n08K51J66n5l1j5N2j47M4J19J53j47
$$ 47 261 -64 7 -39 -39 -144 -441 -51 2 56 -27 130 -378 -127 39 -16 -47 -62 -10 -157 -113 6 159 12
2432A2l0K43j79k30J99j8K18j19J32m1k38p6K65P2n12J77Q9n0j11M5J92l01JK59
$$ 12 -18 225 46 -184 15 -3 215 96 228 187 -51 -127 138 210 -302 -125 -36 -86 -197 -152 40 -261 -260 -1
2456ak75K99q2j0J03K55m16K52j67K47K43o09L86k80L20k14l49O22j96k11J2L79
$$ -1 -276 23 -59 -69 34 289 -127 125 -42 205 448 -161 225 -55 265 51 -298 324 128 -83 -71 308
2478C08k09k12j04K59k06J50N0k53J83lK27j57k8J78L7j21j91N8K09k1m6J9K12
$$ 308 99 -113 -217 42 -164 -14 36 -217 -34 -37 190 33 5 183 220 99 -92 -34 175 154 108 127 339
2501C39l49J3J88k26o6J77J37l33J93l8O6m00J00K82j35J90j89l31N58k78n6j06
$$ 339 -10 3 191 -35 -101 76 213 -120 73 35 101 -299 -199 83 -52 138 -51 -382 176 -102 -158 -264
2523b64L3L73k3m9k15K44R5k95J17K46j81rJ13L03m30om5K50m59J2J88ml20J44
$$ -264 -231 142 119 70 -145 99 194 -101 16 262 81 72 185 488 58 52 7 257 -202 -190 -2 -6 -326 -182
2547a82L7P3l18L32J40j19l64L37L53m22K36L85l78m1j50P7o9J65K97r2l46L40
$$ -182 -145 -72 -390 -58 82 -37 -401 -64 289 -133 103 488 110 69 -81 -4 -73 92 389 297 -49 291
2569B91k95J08j49J14j82j58J10P4l7j82L20Ol00L62Q8q2l02K04J01j13rJ05N8
$$ 291 -4 104 -45 69 -113 -271 -161 -87 -124 -306 14 20 -280 82 170 88 -214 -10 91 -22 -31 74 132
2592A32l00L30Nj61j71K79l01K67j45K25q6r2J40k6pl36J76K28j47k74K52p7k8
$$ 132 -168 162 167 6 -165 114 -187 80 -65 160 74 -18 122 96 89 -247 -71 157 10 -264 -12 -89 -117
2615a17KlJ01J89j55J39k15j72M45J3m33J51J34K26m75M02j6l24J09qQ6j12k1
$$ -117 -115 -118 -17 172 17 156 -59 -231 214 227 -206 -55 79 305 -170 232 216 -108 1 -7 79 -33 -54
2638e4q8K71j38Q6J58k64J19j3Ok47K4K1J82j38K0J95k32J53J27k55J10k80N04
$$ -54 -142 129 -9 77 235 -29 90 77 83 -164 -140 -119 63 -75 -55 140 -92 61 188 -67 43 -237 267
2661B67j01j00k37P4J84J3K9Kp6j08J96Mj85k34L95m98N10k18p3J39j69J69l23
$$ 267 166 66 -171 -97 87 100 129 131 55 -53 143 147 -38 -272 123 -375 135 -83 -156 -17 -186 -17 -340
2684c40L39O5J80M2k96J22k5k61J55J76j03J99j59qj07n8J86j23k30L44j25N2
$$ -340 -1 64 244 286 -10 112 87 -174 -19 157 54 253 94 86 -21 -79 107 -16 -246 98 -27 25
2706B5j37o3m9Mk14L40J95k96J29J39m18L59J71k37J96q6N5N5k04Q1J92k17q5
$$ 25 -112 -175 -224 -220 -434 -94 101 -195 -66 73 -345 14 185 -52 144 58 113 168 -36 45 237 20 -65
2729f5K20j7j69J05J68l07o4Q7j54L88m7l1j25k3m0K9J33l18L67j83R9k67K42
$$ -65 155 138 -31 74 242 -65 -129 -42 -196 192 145 114 -11 -34 -74 -45 88 -230 137 -46 53 -214 28
2752B8J45l94K24J35Q8j76r3R0K35j99l19R8M5J05L0o6J0p0K77l89J44m1J09K6
$$ 28 173 -221 3 138 226 50 -43 47 282 83 -236 -138 -93 12 42 -24 -14 -84 193 -196 -52 -93 16 42
2776D2j61J62J3K9j63l0l46N81k28K50m4j45J74l9O8R9l36J02J50j59r5K9p1K10
$$ 42 -119 43 56 85 -78 -108 -454 127 -101 149 105 -40 134 95 163 262 -74 28 178 19 -76 -47 -118 92
2800I2k74k4Q7R3k6j12J14M0L9p1O8P8m35M32m6j66J11N4K09l21K14J25q7j7j98
$$ 92 -182 -206 -119 -26 -52 -164 -50 -10 29 -42 26 104 -331 101 55 -111 0 54 263 -58 156 281 194 177 -21
2825b1M24n74O5J00l9M5j8J99j28j38R9j0j98q2M34j75j77J36J05k99K2J71j96
$$ -21 403 -171 -106 -6 -45 0 -18 181 53 -85 14 4 -194 -276 158 -17 -194 -58 47 -252 -230 -59 -255
2848b55L67j81L65j56k55r7K65O6K2m2o7j65J53J30k02q0j00K37Lj1j49L04m10
$$ -255 112 -69 296 140 -115 -212 53 119 141 99 32 -133 20 150 -52 -132 -232 5 8 -3 -152 152 -258
2871b58K23j10K78q6qK0j88K21O3m7k56J63K12m92K20K30j3l0j66J7J64p3J47
$$ -258 -35 -145 133 47 39 59 -129 92 155 108 -148 15 227 -265 -45 185 172 142 -24 -7 157 84 231
2894B31P7j33j38m4P7l27L50o7q6lk16O3J8m3K57K26l34Q1l9N3O3LJ57j23q1j93
$$ 231 308 175 37 -7 70 -257 93 26 -60 -63 -279 -216 -198 -241 16 242 -92 -11 -50 3 66 69 226 103 22 -171
2920a71L73k74O7K37j08j34k5L68k42j96K04n1k33J68r6K5Q6k9p3J58k85nM77
$$ -171 202 -72 -5 232 124 -10 -35 333 91 -105 99 48 -185 -17 -113 -88 -2 -31 -104 54 -231 -236 241
2943B41j60k8k76L56l07J31K34j17j08L35m7j30l0r6P6j7j01M0k27K87K1k29L70
$$ 241 81 53 -223 133 -174 -43 191 74 -34 301 254 124 94 -2 74 57 -44 -4 -231 56 77 -152 218
2966B18r4j90L25l36l4K29j56K8k0P3L3j97K63m2j75J39JJ86j90j9j90M5L15j74
$$ 218 124 -66 259 -77 -111 118 -38 -10 -30 43 76 -121 142 100 -75 64 65 251 61 42 -148 -103 212 38
2990C8J82l32O8K05j94K00l32K42J67k73k6jQ1j26J10l19K96P3j63l3j8K10j47
$$ 38 220 -112 -44 161 -33 167 -165 77 244 -29 -55 -56 25 -101 9 -310 -14 59 -104 -137 -155 55 -92
3013i2J39J59k47O2j78K58j23O1J3j62K61m06j04L94R4J9q0R2k49q8R4J49m23
$$ -92 47 206 -41 21 -157 101 -22 39 52 -110 151 -255 -359 35 129 148 68 160 -89 -177 -83 66 -357
3036c57J37M2O6K63j26j86L50j66J05k52K88k74J89j47m1Q4J79j88OJ33j86R8
$$ -357 -220 -178 -112 151 25 -161 189 23 128 -124 164 -110 79 -68 -109 -25 154 -34 -28 105 -81 17
3058A7j95L58k37j94O12l61r3p7O2J40j12J0Q0j1m9n9J36q6K28k61K96k65q3K75
$$ 17 -178 180 -57 -251 361 0 -93 -170 -108 32 -80 -70 10 -1 -50 -109 27 -59 169 -92 204 -61 -144 131
3082A31j45J29K2J34k63NJ55q4j23J25o3k01J24l3N8q2R7NJ78j59J3mNr8m6P3
$$ 131 -14 115 137 271 8 13 168 84 -39 86 23 -178 -54 -87 -29 -111 -14 -9 169 10 23 19 24 -74 -120 -47
3108d7K01j41J04J4k60J08J51J80m94q1L27J34k02K60j78j80N5r7M8N0J20l93
$$ -47 154 13 117 131 -129 -21 130 310 -184 -265 62 196 -6 254 76 -104 -49 -146 -98 -48 72 -321
3130c21J68L65l47L25M2P5j95J1k21J05l32K76qP3R1k44Q2L73m40j8M99l00L4
$$ -321 -153 212 -135 190 232 307 112 123 -98 7 -325 -49 -57 16 107 -137 -55 318 -122 -140 359 59 93
3153I3J31j26%j54K04J04l61o4J77J50n7j64Q4J9m16L48K24l94L4N44l32j59N7
$$ 93 224 98 98 -56 148 252 -109 -173 4 154 97 -67 17 36 -380 -32 192 -202 -168 376 44 -115 -58
3176e8K73k08O7P8r7m4j02K10n6k31J95k28p0K70q3K07m30K36j28J30R4j04M5
$$ -58 215 7 74 152 55 11 -91 119 63 -168 27 -201 -271 -1 -84 123 -307 -71 -199 -69 25 -79 -34
3199c4J24N1q4L0k12K53q8J64m05K38J02k53N6m3J38J68k06K00k81jj20K00j8
$$ -34 90 141 57 87 -125 128 40 204 -201 37 139 -114 -58 -101 37 205 -1 199 -82 -83 -203 -3 -21
3222b1N4J06J4l45j88L39J34j76Q8kq0K17j22J7k26J27R0R1l15N21l02o6J82k26
$$ -21 33 139 153 -192 -380 -41 93 -83 5 3 -77 140 18 35 -191 -64 26 117 -198 323 21 -45 137 -89
3246h9j39L46k38K88q6j39l7K2j59M9N5l1R3R0O5k58J90m9O3r7r4J48J03j16k
$$ -89 -228 118 -120 168 82 -57 -94 -72 -231 -182 -127 -158 -65 25 90 -168 22 -27 36 -61 -155 -7 96 -20 -22
3271b2L2J57k23K29j48k07L16J19k18q5K06J11j19k82K79k63QN4J29j04k1j39
$$ -22 10 167 -56 173 25 -182 134 253 35 -50 156 267 148 -134 145 -118 -110 -56 73 -31 -52 -191
3293a91L61l36Q1J13j64K15N1k45L49k26q0K52j79k6J52j57O8j70J77l5l2R6Q9
$$ -191 170 -166 -85 28 -136 79 130 -115 234 8 -72 180 1 -25 127 -30 38 -132 45 10 -22 74 163
3316A63l41J28R0k34K15J17n50N14R0j82K02k55p5J85J44k19k2J20j72N1J50j15
$$ 163 -178 -50 40 -194 21 138 -412 102 192 10 212 -43 -118 67 211 -8 -30 90 -82 -31 119 4
3338Dj08J11j12K63p7k67K02N5j47J5k1J80j29j27J64p8L2j74L08j79j7j71J69
$$ 4 -104 7 -105 158 81 -186 16 71 -76 -61 -82 98 -31 -158 6 -72 -40 -214 94 -85 -102 -273 -104
3361a04rM7J35k66P0K6J14K1J33k12J17j18m1N5J02l9M2K8j18O9L9M3k93L07j28
$$ -104 -113 -66 69 -197 -127 -101 13 34 167 -45 72 -46 -87 -32 70 31 73 101 -17 52 91 134 -159 148 20
3386B0j03J07q6p0J76Q5j56k39O5K34J65j11M2q2k6j8j38K14j77M5P4O9J71k35
$$ 20 -83 24 -62 -132 44 129 -27 -266 -201 33 198 87 129 47 21 3 -135 79 -98 -53 21 90 261 26
3410B6k87l8L06J77j87l8L8M2j41J14K5J10k59Q3J67j50j00L54k25L6k84J82R1
$$ 26 -261 -299 7 184 -3 -41 -3 39 -102 12 37 147 -112 -29 138 -12 -112 242 17 53 -231 -49 42
3433D2j89j07L80l64J17L98l88K58J2P3o6j17j55K7K2m5j08K17M9r7j43J23k43
$$ 42 -147 -254 126 -238 -121 277 -111 147 159 232 166 49 -106 -79 -57 -102 -210 7 56 -41 -184 -61 -304
3456c04L43J3k25L77p9k24J27J1j60M36k01j07K1j29q0J41j4R1j95o4Qp8M14l27
$$ -304 39 52 -173 204 125 -99 28 39 -121 315 114 7 28 -101 -181 -40 -54 37 -158 -222 -214 -292 122 -205
3480b05L14k57J29L7l77M99p3j20K5j0M3jJ39j55m1J95j9K9K5j66J10k56M5L10
$$ -205 109 -148 -19 18 -359 140 67 -53 -28 -38 5 4 143 -12 -53 142 123 152 177 11 121 -135 -90 220
3504B20j16j56k7j56J50K53l03Q7J48r7R9k78K13J7%j28N4R2n6J17Lj5n19J09
$$ 220 104 -52 -79 -235 -85 168 -135 -48 100 3 102 -176 37 54 54 -74 -20 72 16 133 136 121 -398 -289
$$ [...]
8191a48
##END NTUPLES=NMR FID
##END=
