##TITLE=1H_Ad-NHPI(bat3)-PE
 CDCl3
 8 sc, 
 14.6.2023
##JCAMPDX= 6.0         $$ Bruker NMR JCAMP-DX V2.0
##DATA TYPE= NMR FID
##DATA CLASS= NTUPLES
##ORIGIN= UXNMR, Bruker Analytische Messtechnik GmbH
##OWNER= root
$$ XWIN-NMR		Version 3.5
$$ Wed Jun 14 14:16:28 2023 Russian Standard Time (UT+4h)  she@DPX200
##.OBSERVE FREQUENCY= 200.13135
##.OBSERVE NUCLEUS= ^1H
##.DELAY= (6, 6)
##.ACQUISITION MODE= SIMULTANEOUS
##.ACQUISITION SCHEME= undefined
##.AVERAGES= 8
##.DIGITISER RES= 18
##SPECTROMETER/DATA SYSTEM= spect
##.PULSE SEQUENCE= zg30
##.SOLVENT NAME= CDCl3
##.SHIFT REFERENCE= (INTERNAL, CDCl3, 0, 15.7039)
##AUDIT TRAIL= $$ (NUMBER, WHEN, WHO, WHERE, WHAT)
$$ ##TITLE= Audit trail, XWIN-NMR		Version 3.5
$$ ##JCAMPDX= 5.01
$$ ##ORIGIN= Bruker BioSpin GmbH
$$ ##OWNER= she
$$ F:/spectra/data/she/nmr/H-F/1/audita.txt
$$ ##AUDIT TRAIL=  $$ (NUMBER, WHEN, WHO, WHERE, WHAT)
(   1,<2023-06-14 14:14:06.32 +0400>,<she>,<DPX200>,
      <created by zg, POWCHK disabled, PULCHK disabled
       configuration hash MD5:
       00 E9 B6 7A A2 85 ED C7 34 08 36 98 17 FE 4E 26
       data hash MD5: 16K
       3C 08 E8 88 36 13 5E 92 2F BB 66 42 4A B0 8C 57>)
$$ ##END=
$$ 
$$ hash MD5
$$ A3 68 9B 24 4F DD D7 B8 D0 E1 E5 1B 66 54 FD FE
##$RELAX= 
##$RELAX= 
##$RELAX= 
##$RELAX= 
##$RELAX= 
##$RELAX= 
$$ Bruker specific parameters
$$ --------------------------
##$DU= <F:/spectra>
##$EXPNO= 1
##$NAME= <H-F>
##$PROCNO= 1
##$TYPE= <nmr>
##$USER= <she>
##$AMP= (0..31)
100 100 100 100 100 100 100 100 100 100 100 100 100 100 100 100 100 100 
100 100 100 100 100 100 100 100 100 100 100 100 100 100 
##$AQSEQ= 0
##$AQ_mod= 1
##$AUNM= <au_zg>
##$AUTOPOS= <>
##$BF1= 200.13
##$BF2= 200.13
##$BF3= 200.13
##$BF4= 200.13
##$BF5= 200.13
##$BF6= 200.13
##$BF7= 200.13
##$BF8= 200.13
##$BYTORDA= 1
##$CFDGTYP= 0
##$CFRGTYP= 5
##$CHEMSTR= <none>
##$CNST= (0..31)
1 1 145 1 1 1 1 1 1 1 1 1 1 1 1 1 1 1 1 1 1 1 1 1 1 1 1 1 1 1 1 1 
##$CPDPRG= <>
##$CPDPRG1= <>
##$CPDPRG2= <>
##$CPDPRG3= <>
##$CPDPRG4= <mlev>
##$CPDPRG5= <mlev>
##$CPDPRG6= <mlev>
##$CPDPRG7= <mlev>
##$CPDPRG8= <mlev>
##$CPDPRGB= <>
##$CPDPRGT= <>
##$D= (0..31)
0 1.2 0 0 0 0 0 0 0 0.06 0 0.03 0 0 0 0 0.0002 0 0 0 0 0 0 0 0 0 0 0 0 
0 0 0 
##$DATE= 1686737645
##$DBL= (0..7)
120 120 120 120 120 120 120 120 
##$DBP= (0..7)
150 150 150 150 150 150 150 150 
##$DBP07= 0
##$DBPNAM0= <>
##$DBPNAM1= <>
##$DBPNAM2= <>
##$DBPNAM3= <>
##$DBPNAM4= <>
##$DBPNAM5= <>
##$DBPNAM6= <>
##$DBPNAM7= <>
##$DBPOAL= (0..7)
0.5 0.5 0.5 0.5 0.5 0.5 0.5 0.5 
##$DBPOFFS= (0..7)
0 0 0 0 0 0 0 0 
##$DE= 6
##$DECBNUC= <off>
##$DECIM= 32
##$DECNUC= <off>
##$DECSTAT= 4
##$DIGMOD= 1
##$DIGTYP= 9
##$DL= (0..7)
0 120 120 120 120 120 120 120 
##$DP= (0..7)
150 150 150 150 150 150 150 150 
##$DP07= 0
##$DPNAME0= <>
##$DPNAME1= <>
##$DPNAME2= <>
##$DPNAME3= <>
##$DPNAME4= <>
##$DPNAME5= <>
##$DPNAME6= <>
##$DPNAME7= <>
##$DPOAL= (0..7)
0.5 0.5 0.5 0.5 0.5 0.5 0.5 0.5 
##$DPOFFS= (0..7)
0 0 0 0 0 0 0 0 
##$DQDMODE= 0
##$DR= 18
##$DS= 0
##$DSLIST= <SSSSSSSSSSSSSSS>
$$ [...]
##$SUBNAM2= <"">
##$SUBNAM3= <"">
##$SUBNAM4= <"">
##$SUBNAM5= <"">
##$SUBNAM6= <"">
##$SUBNAM7= <"">
##$SUBNAM8= <"">
##$SUBNAM9= <"">
##$SW= 18.05172834244
##$SWIBOX= (0..15)
0 0 2 0 0 0 0 0 0 0 0 0 0 0 0 0 
##$SW_h= 3612.71676300578
##$TD= 16384
##$TD0= 1
##$TE= 0
##$TE2= 300
##$TE3= 300
##$TEG= 300
##$TL= (0..7)
0 120 120 120 120 120 120 120 
##$TP= (0..7)
150 150 150 150 150 150 150 150 
##$TP07= 0
##$TPNAME0= <>
##$TPNAME1= <>
##$TPNAME2= <>
##$TPNAME3= <>
##$TPNAME4= <>
##$TPNAME5= <>
##$TPNAME6= <>
##$TPNAME7= <>
##$TPOAL= (0..7)
0.5 0.5 0.5 0.5 0.5 0.5 0.5 0.5 
##$TPOFFS= (0..7)
0 0 0 0 0 0 0 0 
##$TUNHIN= 0
##$TUNHOUT= 0
##$TUNXOUT= 0
##$USERA1= <user>
##$USERA2= <user>
##$USERA3= <user>
##$USERA4= <user>
##$USERA5= <user>
##$V9= 5
##$VALIST= <valist>
##$VCLIST= <CCCCCCCCCCCCCCC>
##$VD= 0
##$VDLIST= <DDDDDDDDDDDDDDD>
##$VPLIST= <PPPPPPPPPPPPPPP>
##$VTLIST= <TTTTTTTTTTTTTTT>
##$WBST= 1024
##$WBSW= 4
##$XGAIN= (0..3)
0 0 0 0 
##$XL= 0
##$YL= 0
##$YMAX_a= 385906
##$YMIN_a= -368933
##$ZGOPTNS= <>
##$ZL1= 120
##$ZL2= 120
##$ZL3= 120
##$ZL4= 120
##$ABSF1= 10
##$ABSF2= 0
##$ABSG= 5
##$ABSL= 3
##$ALPHA= 0
##$AQORDER= 0
##$ASSFAC= 0
##$ASSFACI= 0
##$ASSFACX= 0
##$ASSWID= 0
##$AUNMP= <proc_1d>
##$AZFE= 0.1
##$AZFW= 0.1
##$BCFW= 1
##$BC_mod= 2
##$BYTORDP= 1
##$COROFFS= 0
##$CY= 11.3945322036743
##$DATMOD= 1
##$DC= 2
##$DFILT= <>
##$DTYPP= 0
##$F1P= 15.7292609196834
##$F2P= 12.9074282941183
##$FCOR= 0.5
##$FTSIZE= 0
##$FT_mod= 4
##$GAMMA= 1
##$GB= 0.15
##$INTBC= 1
##$INTSCL= 1
##$ISEN= 128
##$LB= 0.24
##$LEV0= 0
##$LPBIN= 0
##$MAXI= 10000
##$MC2= 0
##$MEAN= 0
##$ME_mod= 0
##$MI= 1.114404
##$NCOEF= 0
##$NC_proc= 0
##$NLEV= 6
##$NOISF1= 3.799351
##$NOISF2= 2.8
##$NSP= 1
##$NTH_PI= 0
##$NZP= 0
##$OFFSET= 15.70392
##$PC= 1
##$PHC0= -20268.12
##$PHC1= 16.25272
##$PH_mod= 1
##$PKNL= yes
##$PPARMOD= 0
##$PSCAL= 0
##$PSIGN= 0
##$REVERSE= no
##$SF= 200.130013532006
##$SI= 16384
##$SIGF1= 3
##$SIGF2= 2
##$SINO= 400
##$SIOLD= 16384
##$SREGLST= <1H.CDCl3>
##$SSB= 0
##$STSI= 0
##$STSR= 0
##$SW_p= 3612.71676300578
##$SYMM= 0
##$S_DEV= 0
##$TDeff= 0
##$TDoff= 0
##$TI= <>
##$TILT= no
##$TM1= 0
##$TM2= 0
##$TOPLEV= 0
##$USERP1= <user>
##$USERP2= <user>
##$USERP3= <user>
##$USERP4= <user>
##$USERP5= <user>
##$WDW= 1
##$XDIM= 8192
##$YMAX_p= 0
##$YMIN_p= 0
$$ End of Bruker specific parameters
$$ ---------------------------------
##NTUPLES= NMR FID
##VAR_NAME=  TIME,          FID/REAL,        FID/IMAG
##SYMBOL=    X,             R,               I
##VAR_TYPE=  INDEPENDENT,   DEPENDENT,       DEPENDENT
##VAR_FORM=  AFFN,          ASDF,            ASDF
##VAR_DIM=   8192,          8192,            8192
##UNITS=     SECONDS,       ARBITRARY UNITS, ARBITRARY UNITS
##FACTOR=    0.0002768,     1,               1
##FIRST=     0,             0,               0
##LAST=      2.2672688,     0,               0
##MIN=       0,             -368933,         0
##MAX=       2.2672688,     385906,          0
$$ Real data points
##PAGE= N=1
##DATA TABLE= (X++(R..R)), XYDATA
0 0 0 0 0 0 0 0 0 0 0 0 0 0 0 0 0 0 0 0 3 -8 8 -8 8 -8 8 -8 11 -16 16 -16 19 -22 25 -28 29 -34 37 -41 45 -49 54
41 54 -59 67 -72 79 -88 96 -104 115 -126 140 -154 171 -190 212 -238 269 -307 354 -413 490 -593
62 -593 737 -950 1279 -1829 2879 -5251 12694 -77529 -368933 110317 346504 -208645 -273807
75 -273807 289770 197013 -332823 -90540 361491 -3334 -345306 107721 312930 -188502
85 -188502 -250429 255344 171739 -300409 -87278 311618 -10234 -307451 88284 264233
95 264233 -169078 -217281 217358 142192 -256797 -69158 265911 -10013 -254029 85091
105 85091 225359 -141563 -170670 193754 117133 -212754 -42037 225547 -18491 -205010
115 -205010 83224 176903 -128762 -130651 162341 76235 -182938 -23105 177475 -38590 -166967
126 -166967 81064 128607 -125785 -91992 145212 38226 -157313 11533 147842 -58967
136 -58967 -122805 101238 91122 -123035 -42193 142438 1644 -133916 51042 122431 -86066
147 -86066 -87276 119595 49554 -135373 -3980 136005 -45088 -126294 82356 93945 -121326
158 -121326 -61613 136200 11500 -148418 30632 136607 -79456 -116888 117072 81515
168 81515 -144528 -34938 162333 -10739 -156382 66197 145485 -105968 -108242 147807 69655
179 69655 -165994 -15358 175110 -36168 -165407 85131 138727 -130603 -104889 157200
189 157200 52745 -178786 -5844 174660 -50472 -164288 94190 133031 -134760 -94638
199 -94638 161076 48391 -171795 4110 173453 -48826 -152959 97886 130058 -128493
209 -128493 -86622 157494 45161 -165481 4771 163913 -51175 -148692 91120 118576
219 118576 -127913 -85791 145581 37593 -160356 2493 152074 -50542 -140673 86028
229 86028 111831 -119215 -77498 139880 38105 -146240 8019 146211 -44779 -125869 86002
240 86002 104538 -110074 -65739 131773 29674 -135246 11880 130172 -50300 -113883 80773
251 80773 84562 -108466 -54818 117370 12964 -123767 19552 110087 -56453 -94050 81115
262 81115 65083 -99750 -32488 108272 635 -102677 34668 93952 -57774 -68944 83434
273 83434 46485 -91089 -12227 96558 -15561 -87829 43736 72266 -67083 -51788 79253
284 79253 21703 -89115 2273 81731 -33437 -74436 51674 52757 -71426 -32184 78527
295 78527 5364 -79134 20616 73128 -40559 -56102 61765 40744 -68529 -13872 77124
306 77124 -5354 -69854 30578 62722 -47276 -46546 60964 26823 -70738 -8039 69157 -16930
318 -16930 -67886 32719 53123 -52998 -41549 61366 19692 -69653 -615 68480 -20422
329 -20422 -62037 40572 52122 -52546 -32855 66656 17430 -67064 7030 69805 -23899 -59034
341 -59034 44475 48172 -57228 -30592 66265 9700 -71353 8586 65542 -32566 -60050 45737
353 45737 41591 -62765 -26833 67016 3617 -70479 16249 64468 -35725 -51730 52764 37806
365 37806 -60247 -15315 68532 -911 -63163 24272 58872 -38295 -43115 53041 28196 -59454
377 -59454 -9668 60236 -10274 -58697 24734 46290 -42268 -36540 48533 17278 -56467 -3527
389 -3527 52994 -14899 -49372 28775 38981 -38998 -25121 47770 13024 -47096 5474 48479
401 48479 -15485 -38538 30780 31646 -36089 -17480 41970 5402 -42707 6626 38255 -19594
413 -19594 -34201 25578 22189 -35651 -15226 34699 772 -38212 6880 33009 -17988 -28255
425 -28255 25675 20367 -29907 -9410 34882 2502 -31415 11041 31984 -15712 -22966 26015
437 26015 18232 -29001 -7475 32007 -1335 -31502 10075 26617 -20473 -23553 23920 11916
449 11916 -31345 -6448 29440 -6086 -30426 12988 24326 -21712 -18073 27425 10606 -28813
461 -28813 766 31501 -7215 -25198 18954 23018 -22334 -11888 28968 5513 -28047 4910
473 4910 26891 -13412 -23255 18939 14776 -25499 -9667 24287 -2021 -27063 6521 20639 -16251
486 -16251 -17932 18968 10110 -22230 -2910 22812 -2734 -19107 10555 18237 -12563 -10295 18858
499 18858 8297 -17085 512 18547 -3828 -15354 8890 12465 -12760 -9553 12825 3087 -16123
512 -16123 -1493 12446 -5565 -13458 5807 8634 -10265 -7921 10813 3865 -11704 208 12502
525 12502 -1348 -9817 6736 11200 -6260 -5755 11235 5915 -9831 -645 12110 -1122 -10789
538 -10789 4454 9447 -8290 -8831 8512 3251 -13126 -2835 10296 -3790 -12610 4454 8739
551 8739 -9421 -7226 10290 3349 -11233 928 12442 -2792 -8992 8470 9671 -8167 -3430
564 -3430 12459 2263 -10237 3133 10699 -5788 -8153 8055 4744 -10704 -2844 8992 -2910
577 -2910 -10654 2992 6186 -8128 -6436 6813 1340 -9167 477 7553 -2933 -5814 5856 5532
591 5532 -4675 -450 7458 1515 -4174 3055 5659 -1921 -2430 4211 1873 -3559 -1148 3122 -939
606 -939 -4261 -430 1160 -2913 -3293 61 -239 -2719 -1894 422 50 -1691 -498 1471 926 -927 818
623 818 3171 1679 -939 1997 3874 234 -1333 2984 2607 -1832 -751 3498 -15 -4172 463 2539
639 2539 -3489 -4100 2034 410 -5464 -1798 3403 -2179 -5020 2319 2684 -3870 -1147 4804 705 -3462
655 -3462 2578 4951 -1540 -1579 5417 2424 -2789 1624 4894 -1052 -3000 2873 2416 -4085 -1528 2854
671 2854 -1626 -4469 764 1146 -4193 -2372 1819 -864 -3922 342 2032 -1902 -1361 2592 961 -1292
687 -1292 1604 3225 -110 226 3397 1692 -540 1701 2040 -770 -43 1792 -199 -1758 286 530
703 530 -2179 -1386 712 -1463 -3045 -132 -242 -2392 -1041 1229 -598 -2025 1019 1432 -1387 -13
719 -13 3267 1041 -867 2165 3136 -445 387 2926 1205 -1097 1376 1814 -1494 -991 1340 -529 -2631
736 -2631 -346 307 -2381 -2274 394 -950 -2910 -338 826 -1815 -1324 1744 171 -1397 1350 2354
752 2354 -508 148 3309 971 -463 2243 2179 -930 566 2631 84 -2255 1290 1537 -2567 -1719
768 -1719 1916 -1329 -3562 118 1171 -3417 -2603 2163 -504 -3838 346 3149 -2014 -2139 3944 2005
784 2005 -3043 884 5250 -189 -2356 4263 3557 -2874 -538 4830 -80 -3970 1757 3419 -3699
799 -3699 -3180 3495 45 -5484 -532 2941 -3210 -4270 1713 1526 -4515 -1514 3704 -514 -4015 2149
815 2149 3740 -1647 -1181 4317 2106 -2444 1050 4482 -4 -1892 2365 2874 -1998 -1496 1857 364
831 364 -2904 -1125 1767 -1257 -3320 -410 763 -1887 -2848 828 971 -2363 -1547 2444 1225 -2166
847 -2166 278 3810 763 -2297 2385 4300 -1031 -1681 4362 2895 -3538 10 5071 -730 -4965
862 -4965 1981 3780 -4912 -4202 4657 541 -7393 -764 5207 -3486 -6802 3787 3923 -6516 -2666
877 -2666 7575 477 -6857 3298 7711 -3706 -4293 7652 4398 -6803 18 8944 -1198 -6971
891 -6971 4740 6014 -6725 -4624 7406 893 -9216 172 7004 -5232 -7982 5148 3758 -8144
905 -8144 -3244 7817 -356 -8046 2882 7287 -4573 -4575 7321 4053 -6074 102 8582 4 -6081
920 -6081 4326 6594 -4452 -3745 6195 2517 -6845 -798 6041 -2040 -7195 2082 4290 -5669 -4764
935 -4764 4504 1750 -6874 -1851 6314 -1038 -6705 2811 5899 -3713 -3857 6500 3884 -5753 -255
950 -255 8101 163 -6659 3543 7367 -4493 -5255 6644 3571 -8615 -1998 8049 -2111 -9393
964 -9393 2998 6683 -7662 -6699 7784 2521 -10389 -468 9811 -3135 -9343 6602 8018 -7925
978 -7925 -4079 11244 2716 -10066 2966 11559 -4696 -8300 9347 6683 -10242 -2781 11468
991 11468 -1076 -11354 3973 9361 -8603 -8015 9077 3227 -12030 -1678 10163 -3323 -10744
1004 -10744 5898 8018 -8443 -5011 10692 2676 -9933 1928 10865 -3489 -7712 7907 7118
1017 7118 -8077 -2947 10332 1109 -9693 2337 8765 -5284 -8072 6398 4653 -9151 -3619
1030 -3619 8374 -608 -10069 1714 7837 -5696 -7616 6537 5427 -8205 -2620 9602 1054
1043 1054 -8102 3096 9925 -4088 -6806 8095 6387 -8241 -2488 10030 411 -10066 2779
1056 2779 9370 -6188 -8668 7316 5008 -10794 -3881 9876 -1307 -12036 3519 9591 -7330
1069 -7330 -8446 9716 5234 -11103 -1158 12563 -1640 -10667 6754 11124 -8129 -6368 12050
1082 12050 4216 -12331 850 13113 -4191 -11466 7696 8683 -11787 -5971 12006 412 -13741
1095 -13741 1787 11205 -7309 -10759 9065 6525 -12176 -2867 12505 -572 -11657 5000 11051
1108 11051 -6733 -7289 10937 5582 -10562 -335 11996 -1659 -10416 5984 8772 -7986 -6377
1121 -6377 8951 2577 -10882 -821 9532 -3669 -10149 4730 6844 -8115 -5731 8268 2066
1134 2066 -10028 368 9420 -2516 -7966 5733 7549 -6308 -3899 9183 3074 -8607 976
1147 976 9644 -2531 -8041 5820 6825 -7460 -4941 8527 1278 -10586 -66 8796 -4447
1160 -4447 -9379 5573 6185 -9059 -4955 9770 1177 -10667 2293 10238 -4345 -8080 8483
1173 8483 6940 -9311 -2362 11646 510 -10530 4796 10252 -6442 -7369 9440 4753 -11442
1186 -11442 -1545 10969 -3170 -11475 5188 7948 -9323 -6531 10167 1855 -12020 624 10634
1199 10634 -4930 -9598 7772 7366 -9316 -3505 11296 1335 -10176 3464 10565 -4930 -7065
1212 -7065 8439 5556 -9204 -2274 9906 -983 -9986 2970 7881 -7000 -6951 6820 3225 -9653
1226 -9653 -2046 8569 -1851 -8973 3680 7206 -5691 -5399 7441 4053 -7428 -511 8883 -371
1240 -371 -7023 4312 7397 -4495 -4937 7034 3777 -7421 -1324 7854 -1368 -7939 2616 6378
1254 6378 -6063 -5951 6068 3000 -8707 -1866 7760 -1430 -8428 3658 7158 -5647 -4920 8110
1268 8110 3903 -7890 200 9930 -1543 -7870 5643 7369 -6437 -4360 8902 2037 -8972
1281 -8972 807 8472 -4390 -8030 5645 4897 -8806 -3812 8097 -360 -9449 2294 7307 -5561
1295 -5561 -6095 6872 3812 -7805 -736 9073 -983 -6878 4868 6922 -5415 -3689 7895 2445
1309 2445 -7037 649 7238 -2423 -6323 4388 4067 -6258 -3230 5999 247 -7258 433 5340 -3777
1324 -3777 -5545 3777 3252 -5205 -1988 5570 524 -5208 1926 5505 -1898 -3498 4461 3664 -3746
1339 -3746 -928 5400 841 -4541 1176 4892 -2200 -3908 3191 2647 -4873 -2416 4147 -169 -5567
1354 -5567 -141 4267 -2876 -4832 2915 3067 -4499 -1722 5288 755 -5066 1511 5705 -2186 -3659
1369 -3659 5030 3768 -4982 -1037 6486 292 -5893 2328 5535 -3811 -4478 4857 2087 -6818 -1159
1384 -1159 5538 -2080 -6090 2569 4141 -5376 -3401 5607 1151 -6180 855 5962 -2052 -4064 4547
1399 4547 4064 -4347 -887 5929 508 -4705 2051 4857 -2565 -3536 4147 1484 -4459 -1105 4137
1414 4137 -1044 -4691 1294 2427 -3851 -3027 2760 637 -3837 -247 3417 -833 -2817 1647 2601
1429 2601 -1560 -944 2845 1716 -2265 345 2884 438 -1942 1380 2507 -1104 -1507 1893 1288 -2613
1445 -2613 -1183 1928 -402 -2598 -72 1812 -1690 -2696 1258 1265 -2836 -1222 2416 567 -2769 516
1461 516 3269 -1082 -1595 3022 2387 -2126 -280 3762 596 -3060 1314 3212 -1457 -2274 2741 1014
1477 1014 -3787 -522 2992 -1653 -3770 1331 1866 -3226 -2059 2632 105 -3731 522 3209 -1707
1492 -1707 -2147 2684 1940 -2532 -174 3659 197 -2148 2269 2592 -1392 -1140 2548 745 -2548 58
1508 58 1991 -1286 -2223 1038 639 -2368 -1098 1026 -402 -2195 54 1122 -1115 -1283 798 657
1524 657 -740 -159 1195 885 -183 830 1263 576 209 950 1028 61 -512 437 819 -482 -765 349
1542 349 385 -1218 -1162 481 -411 -1872 -571 852 -958 -1575 896 733 -1665 -489 1958 399 -1675
1559 -1675 1125 2142 -723 -880 2492 1352 -1382 370 2288 -284 -1668 1440 1429 -1705 -1177 1578
1575 1578 -174 -2746 61 1268 -1725 -2261 1004 243 -2502 -418 1758 -557 -1734 1272 1516 -1148
1591 -1148 -262 2074 326 -847 675 1872 -347 -388 1381 852 -1193 -265 977 -507 -962 504
1607 504 73 -805 -608 27 -248 -936 -560 -189 -425 -712 -165 -277 295 34 -86 586 510 -295 403 989
1627 989 408 35 731 1464 -148 -109 1282 476 -1093 -272 736 -720 -1474 89 842 -1844 -938 1140
1645 1140 -323 -1896 95 1019 -1242 -1268 1551 679 -1536 102 2149 -322 -1157 1677 1807 -731
1661 -731 -297 2426 477 -1599 924 1801 -1227 -1232 1567 335 -2292 -91 1346 -1276 -2006 777 604
1678 604 -1878 -890 1274 -316 -1785 483 1236 -775 -768 1397 658 -794 366 1478 119 -333 1095
1695 1095 1176 -346 -30 857 218 -446 155 310 -706 -444 -183 -133 -727 -476 -341 -233 -744 -523 -132 22
1715 22 -143 -197 169 730 -353 75 1064 575 -301 999 1246 177 36 1163 882 -1101 111 1498
1733 1498 -499 -1255 710 759 -1436 -1361 842 -292 -2024 -162 970 -1276 -1485 1305 251 -1442
1749 -1442 -62 1715 -179 -1011 1457 1704 -738 -405 1882 801 -1133 846 1629 -1019 -1184 1239
1765 1239 603 -1821 -134 1275 -857 -1571 447 224 -1837 -867 807 -739 -1391 301 898 -1085
1781 -1085 -502 1230 574 -563 467 1409 104 51 1053 801 -190 427 781 98 38 291 189 -309 -263
1800 -263 -484 -622 -424 -168 -510 -533 -286 -373 -417 -504 -76 -577 -75 216 -79 4 726 246 -48 80 1085
1821 1085 499 -395 737 731 -534 32 964 104 -888 199 768 -699 -1156 398 -93 -1638 -575 560
1839 560 -732 -1132 366 215 -1107 -475 1122 -346 -992 521 1408 -471 -186 1501 464 -731 271
1856 271 1212 -263 -337 1063 456 -1056 -153 685 -581 -910 28 -132 -1227 -554 385 -618 -754 316
1874 316 -24 -787 -557 604 -209 -617 647 485 -124 436 849 266 -197 819 415 -349 231 784 -368
1893 -368 -225 420 38 -999 -152 233 -1010 -1009 156 -605 -1013 -322 448 -657 -542 627 229 -965 499
1912 499 1186 -36 -305 1112 1173 -559 183 1371 -5 -641 1122 794 -686 38 1100 -198 -1160
1929 -1160 130 314 -1178 -974 503 -79 -1336 -167 283 -463 -907 295 85 -619 52 849 -83 -46
1947 -46 878 680 -160 188 939 600 58 540 585 -99 -22 485 -58 -472 39 -236 -553 -674 -352 -274 -420
1968 -420 -375 -517 -326 128 -73 -55 230 476 -158 -377 491 377 -158 667 1222 -88 29 953 595 -425
1988 -425 -30 1261 -128 -1020 586 615 -1547 -707 703 -421 -1820 -29 623 -1078 -968 683 319
2005 319 -1486 51 1365 -690 -864 1195 641 -814 128 1688 -57 -922 1130 1378 -854 -893 1425
2022 1425 296 -1509 241 1052 -817 -1140 635 233 -1431 -491 676 -617 -1104 256 728 -957
2038 -957 -731 913 204 -992 423 976 -44 -306 710 823 -258 205 1039 364 -362 263 702 49
2056 49 -692 -144 123 -455 -786 -216 -199 -984 -480 52 -14 -694 -256 421 -156 -528 183 624 -11 -345 899
2077 899 820 -612 362 1162 216 -627 678 1083 -657 -431 1057 155 -1335 -106 1107 -738 -1516 572
2095 572 503 -1521 -1003 1016 -11 -1715 123 1203 -1190 -1169 1378 1131 -1400 -58 1961 -182 -994
2112 -994 1379 1431 -871 -380 1915 56 -1305 133 1302 -856 -1464 1238 580 -1618 -715 940 -792
2129 -792 -1668 302 851 -1153 -896 1220 276 -1126 311 1268 -254 -884 1017 1133 -684 -16 1344
2146 1344 332 -616 465 1025 -405 -529 678 403 -784 -323 512 -129 -1076 -376 197 -375 -979 46
2164 46 227 -702 -485 171 576 -591 -343 705 300 -479 200 1258 -109 -308 955 999 -701 -361 1274
2183 1274 98 -1209 -13 946 -929 -1405 579 201 -1372 -806 992 -608 -1646 481 926 -1540
2199 -1540 -731 1368 345 -1394 563 1504 -466 -962 1558 1281 -1012 -120 2152 -25 -1351 910
2215 910 1368 -1203 -855 1360 172 -1897 -90 1248 -1024 -1352 767 604 -1636 -366 1241 -343
2231 -343 -1207 534 1034 -557 -951 1329 768 -653 119 1477 355 -415 640 812 -402 -204 976
2248 976 546 -620 88 438 -553 -852 -137 149 -654 -892 65 33 -888 -664 166 -284 -548 152 690 -153
2268 -153 -350 274 929 -276 -367 1150 673 -315 157 1202 118 -691 583 993 -747 -702 669 180
2286 180 -1133 -160 678 -485 -1298 488 378 -1292 -698 1326 227 -1531 460 1263 -903 -681 1506
2303 1506 846 -1090 -46 2000 43 -1118 824 977 -1007 -439 1633 289 -1725 -145 1220 -836
2319 -836 -846 778 295 -1378 -299 1052 -509 -1430 351 861 -775 -380 888 380 -702 407 989
2336 989 -110 -387 1062 868 -685 308 1054 -33 -385 112 248 -194 -206 211 133 -644 -653 -74 -252 -538
2356 -538 -375 294 -403 -637 90 554 -357 -206 211 362 -129 -163 584 497 -115 286 1027 226 -325 364 878
2377 878 -305 -427 588 126 -1184 -158 470 -529 -1035 180 225 -949 -556 998 -24 -1138 393
2394 393 1037 -557 -558 1178 504 -889 414 1452 -50 -650 822 1120 -599 -278 1115 279 -866
2411 -866 355 890 -594 -702 684 192 -1016 -495 530 -589 -1109 310 309 -739 -621 918 263 -525
2429 -525 254 1008 -287 -171 990 386 -7 206 653 38 -3 375 267 -124 47 354 19 -158 11 -23
2449 -23 -423 -283 9 -178 -130 -536 -310 -60 2 -454 147 574 40 -140 193 504 -37 -109 545 462 -42 411
2471 411 951 -182 -321 453 309 -621 -290 441 -34 -842 -16 288 -573 -690 522 70 -686 280 723
2490 723 -656 -636 654 483 -778 57 1008 195 -376 793 938 -463 59 1130 127 -615 428 800
2508 800 -210 -476 411 197 -1029 -340 399 -491 -964 132 359 -784 -330 391 -43 -586 62 377 128
2527 128 -172 336 571 24 145 603 118 166 222 243 48 47 429 295 -244 176 70 -135 -463 -282 -499 -153
2549 -153 -298 -185 -73 -51 -391 -419 375 337 -311 185 381 -41 -23 788 527 -255 293 693 142 -453 318
2570 318 143 -221 -252 686 43 -654 -191 405 -628 -918 347 -103 -777 -189 530 -476 -702 380 475
2589 475 -512 -153 977 271 -579 597 970 -145 -87 837 345 -496 164 761 -374 -453 460 22 -467
2608 -467 -358 214 -338 -851 77 301 -492 -574 -26 -185 -244 41 173 -259 -84 564 75 -72 397 325 265
2629 265 144 168 306 -83 378 64 38 -34 154 -46 -127 -2 -91 -285 -40 -363 -441 11 -227 -417 -351 280
2651 280 183 32 -44 309 -239 -217 505 569 -66 117 797 421 -193 461 438 -404 -66 795 -127 -552 183 325
2673 325 -193 -736 307 254 -837 -347 354 -437 -459 -40 469 -710 -405 901 -75 -728 396 769 -335
2692 -335 -149 633 240 -347 421 444 -134 -184 576 296 -408 1 171 -259 -528 -337 329 -677 -323 172
2712 172 -21 -741 -169 494 -321 -151 223 75 -97 -5 346 219 73 162 331 116 110 93 34 401 78 -379
2734 -379 -139 63 -275 -180 68 -82 -147 -286 246 -349 -423 184 53 -452 -233 255 120 -251 327 563 -247
2755 -247 21 605 314 -350 433 465 -466 15 703 167 -158 186 301 -141 -268 -18 -148 -659 -96 379
2775 379 -283 -757 256 232 -768 -598 780 252 -465 125 507 -54 -71 562 535 -552 -37 584 216 -363
2795 -363 699 366 -358 -29 344 94 -279 94 295 -234 -221 198 -246 -327 11 243 -372 52 99 -91 94
2816 94 -125 -47 154 54 595 -4 115 164 308 13 -34 316 93 123 293 -302 -114 59 35 -380 -215 194
2838 194 -364 -330 45 151 -665 -232 163 -250 -278 399 606 -297 79 734 297 54 120 628 -29 -362 375
2859 375 572 -252 302 604 -52 -261 382 309 -666 -206 281 -179 -514 -23 389 -631 -463 261 -122 -298
2879 -298 109 401 -295 -42 300 134 144 -118 446 80 -183 292 136 -149 152 363 -68 -237 20 251
2899 251 -381 -90 -39 -281 -288 -42 -31 -134 -160 158 -20 -109 -102 122 163 82 49 177 -15 239 -8 -93 417 -42
2923 -42 147 171 181 -168 -239 247 216 -119 -281 -25 -323 -529 63 158 -425 -250 19 -89 -419 42 432 -217
2945 -217 -359 393 154 -157 96 629 -122 -241 448 269 -207 -167 567 -52 -39 90 41 -420 -95 271 -140
2966 -140 -740 -332 -14 -416 -418 312 -216 -369 -97 442 -84 -247 548 146 -133 -13 476 125 392 377 316
2987 316 101 3 337 169 39 43 194 -307 1 -24 -206 -137 -89 -389 -442 -146 -212 -189 -172 132 92 -24 -281 349
3011 349 -212 139 283 148 126 321 186 230 -118 247 116 -133 259 -82 -406 -374 324 -137 -548 129 154
3032 154 -519 -392 106 -108 -398 94 240 -289 -83 319 215 -491 43 656 -341 -261 462 417 140 320 608
3053 608 72 -576 283 347 -356 -256 109 -79 -622 35 479 -312 -485 318 161 -316 -190 264 148 -236
3073 -236 -4 341 -311 -118 546 197 -198 8 19 -58 -36 90 148 4 -89 67 -214 44 -31 -193 -357 -170
3095 -170 50 -274 -434 87 121 -31 71 -30 65 125 327 2 -117 469 -26 163 209 56 80 208 402 26
3117 26 -144 178 279 -403 -224 284 -291 -207 -14 70 -287 -453 345 -150 -378 -273 -86 -582 -461 405 60
3138 60 -348 118 437 66 -139 208 502 -122 140 577 -21 -216 367 433 -327 -184 475 164 -316 50 145
3159 145 -151 -307 70 -56 -299 -172 -7 -88 -174 341 220 -219 -213 295 21 -38 316 278 -8 -115 384 -47
3181 -47 -312 205 115 60 -280 24 -132 -32 -348 51 -335 -46 -229 -429 160 -209 -220 -317 177 -180 -112 232
3203 232 101 -91 270 439 102 -270 133 24 39 13 -3 248 18 271 315 -285 -192 63 136 -510 -249 413
3225 413 -353 -633 95 234 -382 -66 64 -41 -359 70 353 -73 -232 217 205 -226 218 639 177 -436
3245 -436 417 337 -315 -61 366 82 -90 462 351 -297 -491 229 108 -362 -224 119 -209 -512 47 226
3265 226 -314 26 607 154 -149 74 87 -178 59 128 114 -353 248 107 96 43 -68 -62 393 -91 -32 -187 -116
3288 -116 -252 -28 128 -112 30 -158 -263 -237 -88 -62 166 -109 199 397 375 -18 124 99 44 1 371 61
3310 61 22 153 77 -52 -237 225 139 -176 -32 -109 -160 -377 -86 67 -579 -291 309 150 -370 327 272 26
3332 26 -333 156 218 -272 325 516 97 -215 248 0 -32 -323 571 245 -356 219 248 -333 -299 464 27 -190
3354 -190 54 376 -394 -127 -17 104 -497 -87 370 64 -476 126 545 -137 43 425 282 -134 167 186
3374 186 -47 8 16 167 -101 127 159 13 -229 -7 -18 -86 -207 -244 -288 -91 216 -164 169 -112 27 10 -151
3397 -151 -16 154 -23 106 174 83 176 219 258 501 216 -74 -164 520 -23 -411 -32 106 -232 -307 208 -135
3419 -135 -364 -266 206 -92 -581 57 -22 -251 -44 180 165 -290 114 419 -146 -251 341 499 -212 238 323
3440 323 118 -218 -34 26 -154 62 133 20 -440 -12 223 -324 -296 235 -21 -306 44 111 -209 -143 335 22
3462 22 -201 97 131 30 50 64 -37 206 -54 436 18 -206 146 -126 -94 -296 -223 -183 -183 35 99 149 10 -118
3486 -118 99 -272 -161 76 -88 -8 -51 -122 150 166 188 -94 104 269 -10 -6 -82 106 -65 275 377 -407 60
3509 60 104 -183 -295 -76 -93 -171 -108 -10 -274 -486 -84 81 -28 -219 183 208 -111 46 -28 -273 -146 81 330
3532 330 -243 74 424 -67 -143 141 98 -152 201 50 -123 -364 384 189 -275 -213 32 -155 -97 -72 312 32
3554 32 -121 54 331 -325 235 65 -70 2 236 248 -173 -19 90 5 -200 232 140 -117 -66 131 82 -178
3576 -178 -102 -257 -142 147 -112 -47 -70 -240 -88 85 217 32 -100 -69 -4 -135 -238 -125 6 3 143 22
3598 22 -44 167 250 -90 -81 -19 285 56 -275 -138 103 141 -103 73 174 -24 -93 38 -382 -98 29 58 -248
3621 -248 -194 133 19 22 166 49 78 -14 362 -1 95 266 41 -166 -16 115 55 108 -126 -76 151 -218 -188
3644 -188 -59 -29 48 123 -550 -203 185 19 -240 142 160 -249 -245 -31 286 -160 -27 255 -209 -102 204 102
3666 102 -135 -1 75 62 -7 286 152 -379 -237 85 -23 -86 -204 53 -151 -60 210 -172 99 -74 121 -37
3688 -37 -159 -52 52 320 114 23 -77 259 23 -98 -268 346 328 -251 -115 382 122 -296 167 -177 -264
3709 -264 -197 -31 -105 -374 31 3 -352 -145 96 24 46 93 52 -130 103 224 43 203 321 293 -307 68 61
3732 61 204 30 122 188 -195 -210 -117 133 -105 -73 -34 -149 -158 49 -66 -216 73 145 -94 -26 149 78 -385 54
3756 54 164 31 -78 362 208 184 -6 236 -134 190 2 131 -148 -34 81 -304 8 -4 38 92 -140 -68
3778 -68 125 -297 -66 -9 -121 -122 196 -194 191 102 45 20 107 63 37 135 -3 288 105 -64 120 66 -454 -215
3802 -215 -123 -7 99 -3 -143 -255 -71 -4 198 -49 448 -37 -400 -311 141 84 -65 247 180 41 164 -70
3824 -70 230 150 247 -3 26 47 63 -179 28 186 -135 258 -45 109 -141 -59 -20 106 -321 250 122 -251 -227
3847 -227 376 -193 -200 -39 182 -122 29 155 95 -12 16 -94 330 238 321 236 95 28 -48 -250 -115 8 -177
3870 -177 6 -136 135 -257 -5 44 68 -141 -340 69 -18 -261 54 17 60 91 -221 -8 -28 316 26 -9 11
3893 11 -252 151 -95 249 -40 -270 45 0 -146 50 -260 -43 -265 49 47 23 -121 195 257 -21 -267 353
3915 353 227 1 193 59 214 128 238 79 26 297 22 -150 35 -73 -374 150 72 115 -167 -203 -90 -99
3937 -99 -69 -338 7 -305 -46 161 260 2 -44 213 58 -193 365 -95 160 69 221 191 -71 45 26 -141
3959 -141 -60 45 -196 -68 -71 -11 -55 56 -186 -416 -99 -29 -41 -129 -48 -1 83 -70 184 -30 37 -207 294 -145
3983 -145 226 127 40 5 -142 223 -305 5 255 75 37 244 -118 -306 -315 27 3 -6 210 -22 130 169 -23
4006 -23 219 -138 61 441 -83 153 205 -131 -147 27 -110 34 -166 115 -134 116 -136 182 -106 111 -107
4027 -107 4 -208 -12 -296 78 -216 -143 -232 -8 59 -214 -183 -9 103 108 -143 -117 -108 -43 12 214 53 -37 19
4051 19 68 59 -82 182 157 219 1 58 1 -139 85 55 278 -1 -49 46 -281 -132 164 -260 18 93 -6 -148
4075 -148 7 -4 -59 -62 147 -122 59 69 49 0 -116 87 -225 -238 -264 125 -160 -231 -231 235 -134 23 51 -313
4099 -313 -238 -231 -1 108 27 -118 28 -104 31 77 -5 -49 376 -83 -16 62 10 36 -114 -204 -1 38 31 -79 4
4124 4 -47 18 439 128 -58 -90 -203 -231 203 -138 -83 17 -345 -47 -251 -258 299 -128 41 201 -68 116 -92
4147 -92 104 -108 -192 182 -155 130 225 -192 39 -166 172 -19 -160 28 79 -194 -120 21 -112 13 -60 105
4169 105 -334 -5 173 -402 97 282 291 -161 -22 -36 40 -24 -33 -99 -75 -153 97 -271 -112 -9 -246 -198 -190 175
4193 175 79 -261 33 -74 -162 -318 166 -175 -202 -86 -186 -142 -7 15 24 -135 125 -54 -37 81 43 12 -2 80
4217 80 -244 22 -140 165 4 -65 -184 158 29 -136 -85 -21 -41 -161 95 -49 -4 -204 -257 176 -201 199
4239 199 -159 -36 137 261 -157 138 127 -29 326 -3 -79 82 115 25 -1 16 -83 -14 -235 21 118 -76 -102
4262 -102 -65 -196 -50 -176 -151 -133 -8 152 14 108 43 163 50 112 4 188 -187 226 280 -12 -78 -179 -28
4285 -28 112 237 187 26 -212 96 -183 1 -446 -138 -2 -246 137 221 -11 4 141 -178 64 17 -69 -17
4307 -17 -102 173 -261 91 -50 301 -129 -141 -243 129 -39 69 -10 45 74 21 -100 59 158 -126 187 0 -400
4330 -400 152 -13 76 -257 -40 -58 -44 243 3 68 67 42 -138 213 91 2 232 99 -64 -185 -98 122 -95
4353 -95 45 -77 -168 238 97 -113 -288 106 47 73 152 -96 156 -151 -325 -247 164 -80 34 -285 86 54
4375 54 30 14 -246 55 -232 274 10 -62 -179 12 -66 243 75 -107 -60 45 -23 208 -63 -61 -158 21 -64 -105
4399 -105 -110 -240 24 -115 50 201 130 -51 -109 7 -112 -83 244 -84 120 23 -205 25 -161 -39 93 -199
4421 -199 40 -187 -21 -175 26 -150 -70 -110 -12 -286 120 54 -277 250 98 -203 -137 -43 -9 91 -279 158
4443 158 -164 -31 -143 -81 -182 66 34 -102 33 126 -14 73 -266 -186 74 -75 -321 -128 -87 194 92 -179
4465 -179 -14 -26 89 -118 -113 -116 23 14 -38 -19 265 -42 144 -26 82 -148 88 -162 -60 -119 -262 53 -71
4488 -71 41 38 166 89 382 -3 164 171 142 73 56 -121 -123 -73 41 81 -309 25 -280 21 43 -207 3 -157 -188
4513 -188 110 -128 -144 -119 -64 99 117 -121 -30 -18 11 -276 57 -37 79 -83 -37 260 43 -166 293 325 -114
4536 -114 129 -55 168 133 -87 -40 76 -4 -104 -70 392 56 -12 133 -15 41 -233 -146 44 158 -194 -1
4558 -1 136 -87 -86 241 140 19 -192 -66 171 -167 77 88 -142 -36 99 85 -49 130 230 76 130 72 105
4581 105 -130 3 -205 90 11 -32 14 -167 259 112 -401 -24 -163 242 -164 -55 108 32 48 108 24 32 25 -34
4605 -34 107 216 -292 55 -51 -187 -58 1 -3 -142 17 132 40 86 150 -157 -69 233 127 36 -186 -44 -75
4628 -75 -74 257 290 84 120 -13 22 77 327 -124 -338 676 112 200 41 260 -205 -191 87 -240 106 -36 -113
4651 -113 100 -123 115 -20 186 6 -23 -109 16 -14 -310 -56 -28 -6 -21 114 -79 258 -80 150 13 31
4673 31 -40 -32 -57 44 -19 -139 -286 130 -27 31 -48 149 -28 46 95 88 144 -205 -183 29 -110 26 200 92 -90
4698 -90 -157 -231 160 247 -190 -135 -112 157 114 -77 -36 -11 -118 -151 -28 46 -21 56 202 -70 35 -206 -146 -44 -48
4723 -48 233 48 -155 37 -86 -160 -99 -48 -101 27 98 -43 -4 110 53 23 104 -120 145 15 47 35 250 -161
4747 -161 42 -65 109 -50 -32 83 7 -42 -37 -318 -144 146 9 -15 11 -53 -54 137 -25 -193 49 -46 -103 -107 -158
4772 -158 -69 3 -144 10 170 -142 6 176 68 -49 -111 245 448 186 -65 11 -63 12 56 -90 71 -326
4794 -326 -11 -128 16 18 356 -14 -75 -31 -21 -51 -69 -234 166 134 -85 -13 -155 -112 -179 -79 37 -103 183 132
4818 132 53 -46 -18 -16 94 148 -69 -12 -43 -255 -69 201 -150 36 148 -74 -17 -63 -53 75 -41 -31 -99 -77 25
4843 25 35 119 -23 -59 330 -164 -203 19 179 73 -75 -113 -5 -204 86 152 216 70 -174 260 -113 -51 -114
4866 -114 131 -73 68 -99 235 -18 -232 209 35 24 -85 -109 229 151 -75 119 -223 9 -90 25 -62 -63
4888 -63 -52 -94 -45 51 -53 208 -8 -134 92 -90 144 -85 -185 120 111 91 -185 -115 315 -113 1 133 112
4911 112 -132 115 -45 223 144 -144 13 88 -15 -50 37 -75 168 132 140 -37 -237 26 -113 148 -62 66
4933 66 80 35 -8 100 -40 -114 58 176 -181 12 -281 -244 125 166 -161 112 231 -314 64 -27 12 46 289
4956 289 18 135 -353 89 145 73 123 145 -15 170 350 -72 390 83 132 173 183 17 187 93 -15 -9 139
4979 139 -38 184 19 -248 91 -56 7 12 296 214 9 243 -118 -60 -65 -48 54 -50 -170 -194 231 -124 53
5002 53 -30 334 -111 14 -14 72 -25 -95 -134 -221 82 -12 74 -16 -35 73 -59 -210 279 -178 -173 43 -152 397 184
5027 184 -176 11 306 -183 -169 -186 65 42 11 -149 75 -96 -164 158 -240 135 304 -15 -29 77 -34 164
5049 164 -14 1 203 -67 -48 -38 143 339 56 -83 37 47 -175 -167 -167 77 -5 -371 -375 124 -1 79 316 230
5073 230 64 -226 -167 -69 71 -199 54 157 -141 -10 277 10 -167 -279 167 19 -260 107 27 35 -145 87
5095 87 136 222 -24 -81 -169 54 153 2 129 123 -111 170 293 -133 -51 -175 272 27 26 138 -65 -337 -1 166
5119 166 203 38 -244 102 -171 -30 -170 -9 39 272 177 -23 -24 112 -96 47 -110 -179 157 239 66 -21 174
5142 174 -123 -183 -53 -23 -142 -56 -52 144 155 -45 -313 -84 169 -71 76 94 -78 -131 -140 136 180 -101 100 26
5166 26 -106 -70 -11 82 -25 -146 -32 -282 166 -172 13 404 126 -294 37 -110 -76 -80 -91 0 -156 56 -214
5189 -214 -37 34 -203 171 -67 42 -26 28 154 223 108 217 -114 86 95 -20 -61 141 -334 -25 -168 -181 -201
5212 -201 -93 -46 87 -107 117 -38 35 139 117 329 -69 230 115 173 -7 -286 330 -423 119 144 9 -138
5234 -138 180 5 -24 30 -56 -52 -233 -17 35 -30 -59 -303 94 -292 149 -28 30 146 -103 149 -70 -173 225
5257 225 206 111 -258 -46 -17 15 50 58 -98 -174 -92 26 -25 -150 42 -59 126 94 135 -70 -202 69 -162 -44
5281 -44 109 107 -178 -118 41 -31 92 -53 74 3 206 -60 -207 57 119 -34 8 157 14 108 27 200 208 -204
5305 -204 -97 142 -11 20 -59 -136 58 255 -63 79 -11 131 119 -143 -33 -62 -74 -49 -25 -158 117 -283 177
5328 177 -131 -237 94 153 -70 44 -13 208 -37 10 93 27 155 -124 216 -7 80 -177 10 -151 -298 4
5350 4 -169 21 -110 -298 109 -34 133 -175 150 -191 23 257 173 84 54 -76 175 -100 -158 130 -96 234
5372 234 -187 -31 -175 -54 183 -216 -324 -63 -231 -74 123 152 -114 -53 60 176 -12 -18 -174 -27 14 47
5394 47 116 90 -255 295 -139 130 -87 -57 -149 -166 7 65 95 -27 -78 -142 30 209 -24 -12 -59 -15 -1 189 -175
5419 -175 116 -42 -11 12 53 12 16 -54 -7 51 167 309 -111 37 140 -38 -190 -187 99 -28 -139 39 58 222
5443 222 -72 299 -4 -35 -153 -145 0 109 -121 44 119 -10 17 173 73 72 -90 -119 47 -83 19 -206 -23
5466 -23 -219 180 141 -27 77 -218 184 276 21 151 3 -157 1 -87 -42 107 76 92 -10 253 -175 -12
5488 -12 -53 72 -136 -16 -89 17 145 -10 110 157 205 -321 67 -97 58 96 344 8 54 69 -62 119 18
5511 18 45 -159 57 69 -219 -84 124 1 -164 -111 -106 212 -81 171 217 -197 -91 -120 5 45 11 222 -66
5534 -66 156 58 106 -99 39 140 33 -196 -283 -36 -219 -94 -139 40 57 -61 -4 -35 56 234 101 43 -175
5557 -175 -268 35 131 157 155 311 4 201 168 16 104 -79 -106 38 85 129 -131 -111 111 -424 18 -146 -105 -94
5581 -94 135 -48 124 -109 114 43 -221 35 108 7 -75 -46 223 305 -5 -18 -242 -44 -169 215 12 182
5603 182 -170 224 81 20 152 -249 -71 -74 -40 -103 99 30 20 18 16 -156 27 35 -88 -147 62 34 -120 145 31
5628 31 -166 -27 -105 -102 -182 318 87 -51 54 -248 -33 -208 210 -9 -141 171 118 103 -108 171 -112 48
5650 48 87 4 134 90 -88 -173 -228 277 -234 -255 -197 -50 258 11 -98 -133 -85 -3 117 -66 -72 49 55 -24 -29 159
5676 159 90 -71 -67 94 145 97 59 -226 33 66 -108 289 -161 165 -1 -27 -81 209 295 -33 165 -67 32 -155
5700 -155 -126 -58 114 79 157 102 -85 159 80 173 252 48 -82 90 115 88 -117 -76 -115 -65 -161 -44 -226 -6 -3
5725 -3 -133 -103 -101 172 155 214 -62 22 338 -185 -152 -21 -71 -167 -284 63 -52 227 79 -133 -1 -230 62 -63
5749 -63 148 -91 -32 124 49 -180 -251 -23 -143 -218 -130 -67 140 145 9 5 27 -103 -197 -241 173 207 61 -143 -48
5774 -48 124 37 -43 30 -35 173 -124 252 62 236 -141 -100 -162 -248 -142 -113 94 -141 -25 99 -29 -201 -342
5797 -342 118 -20 20 -211 -44 86 -12 -64 -33 -109 -260 -93 -157 -241 -207 104 -55 106 151 79 -83 7 225 178
5821 178 -111 -226 60 -99 213 259 -298 -222 110 97 -113 -284 -6 166 88 277 -28 -174 88 216 -109
5842 -109 340 354 171 -44 -72 44 -85 195 224 95 -295 107 8 118 -147 79 11 177 -139 -260 -75 -120
5864 -120 69 -3 -18 1 155 150 124 -71 -185 45 -73 135 -218 159 50 34 270 17 -64 95 -132 44 -53
5887 -53 -169 -62 -39 -122 190 133 -61 69 -218 15 -42 237 -99 68 -72 -113 -197 209 107 -84 144 203 -29
5910 -29 305 -155 128 219 26 55 -16 167 -57 -53 -269 161 50 25 -42 169 -247 -394 142 150 -139 12 136
5933 136 -20 -111 107 135 211 69 54 -41 -73 71 213 -45 29 63 -34 -248 -39 -93 -118 -221 -130 -70 34 -94
5957 -94 -292 112 -146 280 37 -45 11 -129 -72 -73 -240 96 -248 -45 12 -6 83 82 25 117 -129 37 -5 -227 -79
5982 -79 -81 127 -131 -192 -54 63 -115 37 95 164 -79 147 -312 270 253 83 245 -46 170 390 190 104 121
6005 121 93 17 -60 30 113 -225 43 -26 221 -4 -135 -126 -97 37 -62 -35 110 -112 42 82 -85 49 196 308
6029 308 -19 39 64 -97 68 168 -6 -80 131 -81 -4 87 33 48 140 -158 272 -33 -40 200 33 199 100 296
6053 296 -154 28 93 -156 -40 -26 -70 -125 -39 -249 -100 -20 -4 95 167 -21 -88 80 -105 -269 -75 -32 -56 -150
6077 -150 124 178 82 -99 -3 -8 3 406 -96 -296 -131 -175 -60 -49 -241 98 8 -24 -43 -160 236 36 -109 155
6101 155 -48 2 -32 182 -161 -47 21 -34 16 -179 -153 63 -2 125 73 -116 -78 -34 -293 -154 -152 0 -102 -37
6125 -37 396 -32 -203 -174 132 73 -81 391 1 52 -96 89 -244 -97 -235 -56 101 -47 5 27 -251 80
6147 80 9 187 -406 26 51 75 -90 -39 -163 33 -111 -137 35 -132 -189 -62 15 417 101 116 85 -100 81
6170 81 28 -22 -111 94 -25 -4 -139 -178 150 -85 87 55 -257 -35 -186 -22 -130 63 118 -164 46 -254 148
6193 148 100 140 158 -132 104 -85 189 107 26 -13 13 -81 64 169 -41 63 -72 -10 129 136 -80 134 11 48
6217 48 95 36 139 -109 -315 -88 -35 -71 -108 202 111 6 98 -123 175 97 -196 89 -50 -210 -215 146 75 -237
6241 -237 151 95 -29 250 128 -82 -158 92 40 58 56 -64 54 -4 162 -103 103 -12 -47 190 -131 196 193
6264 193 -72 -76 105 180 -51 11 28 91 -244 -108 240 148 -36 -48 -234 69 -16 -292 -102 172 -29 -147 -222
6287 -222 -154 290 -201 -10 153 -115 168 195 41 -35 -153 152 -156 -51 289 20 152 -24 81 66 -11 242
6309 242 93 -74 309 149 -114 -205 196 -21 -114 43 58 -84 -214 173 -110 250 -256 -147 -10 -22 175
6330 175 -128 -180 -86 -165 -34 -46 89 30 32 82 28 -60 -68 -156 263 -51 -53 -96 68 135 239 102 80 -163 32 -174
6356 -174 74 120 -199 -27 -55 172 -30 -209 -39 -150 177 -54 -45 -62 180 -163 -73 81 -1 -143 -121 -119 -70 -95
6380 -95 -177 20 -106 -67 156 -180 -178 20 -23 49 -142 158 -288 -139 -153 222 24 37 -109 37 -88 -326 -111
6403 -111 -177 -318 6 122 -229 24 -125 -1 -109 -248 114 28 24 -126 -53 -17 109 360 304 282 -336 164 62
6426 62 11 103 411 -187 6 44 -32 -257 -11 -21 -39 -189 116 100 -57 -71 -67 -84 -123 -8 -130 -32 -76 136 5
6451 5 -214 61 -93 -325 233 -146 -228 -189 114 28 -28 28 -107 -51 -3 67 95 -43 115 57 -33 -111 60 19 45
6476 45 216 -105 -145 3 104 -305 -35 -40 -106 140 242 232 -105 116 -263 -69 22 -87 -88 -32 199 -168 36
6499 36 -9 103 -11 49 -153 -130 -91 -21 -27 53 168 49 -141 -49 -39 120 272 15 -323 59 -83 -111 129 15
6523 15 -240 -33 -151 28 -203 -79 -41 -218 -273 -13 174 146 -5 232 -140 -112 -25 -55 107 85 -98 -135 -19
6546 -19 61 23 281 -117 100 4 -95 86 135 18 89 1 46 100 -102 278 -119 13 -51 52 74 75 -31 52 -19
6571 -19 -85 112 133 -125 92 -80 -177 -177 -76 -154 375 322 33 -61 -213 -37 20 140 -56 116 -293 -47 -25 52
6595 52 -36 -105 224 -65 -82 24 20 -274 22 -217 -31 292 -36 270 -14 96 281 -17 5 39 -139 35 285
6618 285 116 64 85 -136 43 -105 108 15 71 -121 -160 228 -299 25 -118 -105 17 -193 -130 16 -69 181 -152
6641 -152 -119 -95 99 -43 -113 12 120 37 40 299 -37 -8 70 -65 66 -216 120 -228 -38 7 -207 48 57 -34
6665 -34 269 -76 -259 9 -87 42 -194 -121 243 165 31 -285 -181 176 -41 510 -274 15 260 12 90 171
6687 171 -17 -121 66 -150 -291 51 -217 -55 -161 289 387 -22 -70 0 66 -88 67 -203 -207 -82 -291 -49
6709 -49 33 42 -115 161 249 -70 17 -161 155 118 341 275 -65 -1 10 -92 -17 42 -205 -6 -24 250 111 -123
6733 -123 162 48 3 -138 -46 -104 -63 -26 237 -106 -127 -48 -81 -120 -289 37 180 -134 -61 92 -73 10 -38 -187
6757 -187 -155 -152 320 -126 127 301 18 120 -333 -83 -138 159 -137 184 -66 158 -194 -97 -41 216 -183 -110
6779 -110 -112 -70 -86 88 -11 104 -31 3 -43 -53 53 -25 111 70 -52 145 84 -240 -21 -49 -31 203 -303 -4
6803 -4 -9 94 -65 -175 -152 178 154 340 21 -106 -51 132 42 -5 -7 124 -73 21 -274 -18 -32 -3 145 -125 104
6828 104 -130 -39 -324 -95 173 -91 -90 81 59 35 -91 -158 92 -2 -100 -32 170 192 -86 158 169 -33 -87 -111
6852 -111 -75 -50 72 245 -6 -86 77 -140 5 74 -230 140 178 -53 -232 275 101 107 116 72 205 -4 -176
6875 -176 138 195 -34 -54 249 181 211 -102 224 -196 -24 191 -23 -234 -25 3 -31 112 -68 -25 33 78 -195
6898 -195 -77 193 -98 85 119 5 143 80 55 -99 -59 263 -118 -176 -103 -88 82 24 -81 248 77 -103 -321
6921 -321 -91 142 42 -327 175 178 68 112 -85 -56 -83 9 -90 248 161 -215 71 -22 12 78 -58 186 -104 -43
6945 -43 155 -35 153 239 123 -79 -97 -99 156 18 102 232 -39 -130 -60 -168 6 45 -27 30 -70 320 -112 -150
6969 -150 -100 -136 82 -58 12 171 -19 0 13 81 -269 -215 22 -79 157 41 -71 122 -107 157 -3 121
6991 121 -38 -17 -265 -203 13 102 40 -32 -63 -129 301 -66 133 151 292 -10 -212 121 -250 77 -122 154 -91
7014 -91 -45 -48 -42 -75 24 -44 275 -287 -84 40 75 -265 16 189 -156 42 49 125 -47 82 44 -9 -151 269 -82
7039 -82 160 -200 -63 -194 108 153 57 179 112 170 -23 -6 100 203 -222 115 173 -69 -188 168 -146 -64 150
7062 150 85 294 101 -133 -206 -64 -392 -174 233 -154 42 16 -158 139 36 -28 -158 265 -50 201 127 -11
7084 -11 -102 34 187 -72 41 -67 -112 118 76 -40 224 237 30 -218 115 53 -107 133 -32 -168 300 -210
7106 -210 322 137 -11 -126 -57 245 -290 -73 -66 -178 10 -6 24 -47 88 -52 -33 50 126 134 156 -165 525 -118
7130 -118 84 -45 60 -66 -173 326 152 -10 -173 -192 266 188 -8 -76 76 96 124 -35 26 10 66 216 -105
7153 -105 -119 -41 42 64 178 -141 10 188 19 54 -40 113 242 387 137 117 111 95 78 -32 43 68 77 -246 71
7178 71 -165 84 -79 -83 -49 34 87 114 -4 -246 183 -146 -18 92 -16 16 -32 -19 82 -23 177 -140 148
7201 148 119 -138 -154 75 -23 -93 -82 84 -21 19 -76 -137 0 -273 -160 220 -5 226 -35 88 -114 -179 184
7224 184 201 -37 -187 312 -231 28 -175 -178 92 55 -103 -119 -185 -293 -85 -69 219 126 -79 -209 19 -18 124
7247 124 94 -195 103 126 -91 -54 -109 88 186 -160 96 -49 110 -72 114 42 176 -47 -229 -125 273 66
7269 66 303 255 -22 136 -277 -139 12 7 454 -103 -148 93 -419 -24 96 -328 109 -109 30 -151 -114 257
7291 257 211 -2 -41 8 -84 -29 -59 257 9 73 -287 -183 -3 191 13 1 77 -218 59 -31 38 225 -12 -141
7315 -141 280 179 -21 -223 179 -245 84 111 -148 133 192 -142 -63 212 -151 90 170 81 -153 99 -2 185
7337 185 81 -62 -130 -55 -107 -120 -196 -79 375 -156 23 -102 145 201 64 156 -387 -22 54 -76 40 -13 42
7360 42 -27 9 109 145 -161 -36 -16 77 27 193 75 -17 -81 30 203 -106 -159 -33 -187 242 -353 229 -93
7383 -93 5 -121 -24 59 53 194 16 -141 170 65 -85 72 316 39 -133 138 22 -4 -26 98 -312 -44 69
7406 69 63 61 -71 176 -221 -23 182 192 -321 -143 118 92 -57 -276 -7 -136 -128 -279 -120 -307 89 34 25 -7
7430 -7 -44 368 217 123 -42 110 -80 -68 -72 -144 83 -120 -182 -26 32 -91 97 172 65 134 -161 -50 139 274
7454 274 241 90 -249 151 36 -107 -95 -34 3 1 125 137 195 -61 -49 175 14 -119 -284 67 52 -185 166
7477 166 273 -7 5 -211 99 -250 -92 24 208 -59 -22 -49 5 -74 35 137 13 38 36 73 53 27 150 -75
7501 -75 -41 244 -59 24 102 165 -56 -324 -25 -324 23 107 175 -15 265 60 293 -146 115 102 -172 275 -41
7524 -41 141 -63 -180 -148 -29 -271 -215 -102 -5 27 147 -261 -182 -134 295 -181 70 -87 -110 104 -201 198 337
7547 337 143 36 -40 53 196 -3 -120 76 111 24 61 174 -283 80 128 77 -132 -81 -50 -211 -157 -132 41 89
7571 89 -67 -255 -10 75 -33 -358 -171 -151 -1 39 -79 199 -372 -123 43 -128 -111 33 46 -83 -120 131
7593 131 -208 -23 -2 -330 -254 -255 -99 2 -266 -43 61 -49 -206 134 -146 175 133 -133 -17 -14 7 -50 191
7616 191 -32 95 -83 -58 11 303 -73 -66 125 -11 -61 173 305 -67 -5 11 5 -222 -176 15 33 -115 307 46
7640 46 53 -3 120 168 47 223 -79 -28 -102 159 72 -199 198 -18 -62 231 34 -59 -82 73 -112 -170 5 71
7664 71 103 30 171 166 36 -27 -4 -68 -50 -117 301 236 89 286 188 -61 262 -255 -188 -115 -60 -129 131 -27 -6 -256
7690 -256 -150 103 -222 -57 -226 54 228 109 17 -37 16 -74 57 174 136 233 77 -264 -53 -28 -131 97
7712 97 0 269 70 184 -102 -89 -192 87 -192 -142 320 -84 10 -130 62 -40 91 -56 71 -132 16 262
7734 262 -167 -163 -113 232 -85 -217 327 125 205 -133 361 -21 -240 88 -83 -6 -21 151 332 -278 71 41
7756 41 -17 -98 -17 285 19 -120 39 -188 -2 88 -166 -317 -102 -268 -8 -25 64 37 175 108 -49 -82 -199
7779 -199 55 128 210 -219 -167 159 113 -242 -92 -181 -211 66 -251 -85 -155 -67 123 284 7 -75 -24 -113 108 72
7803 72 -416 -120 179 159 104 -223 217 -45 -5 -20 165 398 -315 -363 -131 74 43 -140 23 -217 53 -23 -174
7826 -174 -21 -178 158 -292 -93 93 43 195 -49 204 -113 87 -41 -14 16 -60 154 -171 -5 176 265 -79
7848 -79 74 44 -99 -184 336 -94 -48 -297 26 69 -28 52 -204 -188 135 235 -20 -171 78 333 41 -177 -150
7871 -150 -68 -121 -63 86 166 -109 -75 -1 -63 -94 49 -58 -186 -67 -63 32 -125 146 52 -202 -36 -13 96 -120
7895 -120 -172 182 43 -248 47 14 -67 172 -162 17 -206 -167 -188 19 -29 -43 110 114 -51 88 -145 -117 -84 -46
7919 -46 -330 299 -2 -136 106 -65 56 44 -110 66 23 -27 -33 -4 306 275 94 -30 90 29 66 42 -147 -69
7943 -69 103 -66 111 32 60 -2 9 2 -12 -129 -34 -218 114 -240 -66 150 -289 -212 21 388 -85 15 -93
7966 -93 111 -76 -105 104 -190 -62 241 169 25 264 108 -29 -18 49 35 -123 -197 -154 111 23 -220 263 -172
7989 -172 -138 -199 44 2 -184 201 118 -92 -139 153 -231 -84 -138 64 13 11 298 -66 169 185 133 14 178 -11
8013 -11 58 2 -17 101 136 75 269 128 -120 -163 -75 -116 -2 146 -168 68 100 -99 137 -255 93 53 122 186
8037 186 185 257 -303 -19 136 99 -143 117 -25 336 -173 114 -161 23 21 90 239 -61 -101 -274 -46 -62 171
8060 171 -245 103 -58 -54 238 -65 -14 49 -185 58 -12 60 -105 -98 158 -102 3 153 -129 -91 42 189 69
8083 69 115 -111 62 143 -99 -74 268 301 49 46 93 89 -51 123 -56 -63 273 43 89 82 270 31 -57 55 -91
8108 -91 -17 -123 130 -165 -131 -66 30 -318 251 -91 127 168 41 134 154 -88 42 41 7 21 132 131 -166 -66 32
8133 32 127 63 -47 -29 74 58 -88 -234 -23 178 -55 332 158 -3 -24 107 137 -31 87 13 36 -17 28 -211
8157 -211 -118 -232 37 162 161 86 -157 -123 38 49 250 214 -99 69 -58 -15 -13 84 -9 -50 -123 -134 14 -43 196
8182 196 -42 -155 65 -214 224 228 180 62 -10
8191a0
$$ Imaginary data points
##PAGE= N=2
##DATA TABLE= (X++(I..I)), XYDATA
0 0 0 0 0 0 0 0 0 0 0 0 8 -8 8 -8 16 -16 24 -25 32 -40 49 -57 66 -81 95 -111 127 -147 171 -196 223 -254
32 -254 288 -329 369 -416 468 -524 587 -653 726 -808 898 -992 1097 -1211 1339 -1476 1626
49 1626 -1791 1971 -2173 2396 -2641 2919 -3232 3588 -3997 4470 -5030 5700 -6522 7555 -8899
64 -8899 10734 -13381 17564 -25169 43338 -177929 10546 385906 -185397 -302959 237663
75 237663 244235 -324036 -138414 345655 49901 -359049 63789 332602 -142448 -282233
85 -282233 232203 215380 -274253 -128093 315176 39578 -308986 50798 290142 -132313
95 -132313 -242944 192559 178909 -244099 -109686 259406 25394 -267783 44224 237678
105 237678 -118029 -203300 168046 143593 -206307 -79536 223150 13404 -214905 55129
115 55129 196513 -103810 -150520 151886 108576 -170998 -46149 185312 -6110 -172827
125 -172827 61509 149250 -105846 -113437 134734 62702 -156605 -17009 150375 -40024 -141020
136 -141020 77502 104780 -116438 -69737 133392 21386 -139773 26009 131471 -67187
146 -67187 -103621 107730 73140 -125553 -23401 141187 -17131 -129978 67046 113952 -101860
157 -101860 -78227 130430 36315 -145714 7899 141755 -58505 -132036 95750 97140 -136010
168 -136010 -62513 152360 10021 -163385 37739 152036 -87036 -127697 129639 92069
178 92069 -156505 -39974 175492 -6996 -168571 64476 157067 -105912 -120878 147249
188 147249 81140 -169158 -29568 178071 -23778 -173029 71134 147665 -118794 -118235 146464
199 146464 69008 -171387 -24785 171946 -28964 -166080 73340 142722 -114152 -108246 145949
210 145949 68703 -160644 -17485 169560 -25443 -154950 74998 137597 -108341 -101188 139731
221 139731 62874 -154311 -17975 156860 -28137 -149909 66809 125297 -106743 -98555 128096
232 128096 55291 -147448 -17087 145825 -28160 -138281 66067 116902 -98747 -84748
242 -84748 124029 50532 -132378 -5916 136959 -28709 -120995 69229 102776 -94446 -68817
253 -68817 115568 34226 -122089 2834 117054 -40259 -105062 67474 77755 -94536 -52360
264 -52360 102656 14254 -109187 15377 98003 -47838 -83029 71543 58926 -87599 -28375
275 -28375 97148 467 -91017 32680 83732 -53323 -60357 76257 39040 -83510 -8902
286 -8902 86616 -18168 -79310 42078 62848 -64212 -44860 73411 16043 -82635 5510
297 5510 74617 -33657 -67213 50188 47627 -66609 -27467 74043 5124 -72908 20216 69295
309 69295 -37192 -52591 57511 40045 -64248 -15357 72626 -3137 -68178 25944 61157
320 61157 -43630 -48428 56630 29148 -68338 -12553 67465 -12637 -68346 28331 55620 -48720
332 -48720 -44196 58983 24661 -67971 -5196 70201 -14511 -63679 36461 56298 -49040 -37406
344 -37406 65017 22863 -67657 1649 71080 -19494 -63008 39948 51311 -55531 -35647
355 -35647 64252 13794 -71951 4245 65836 -28709 -60651 42656 43464 -59060 -28503 64586
367 64586 7414 -66679 13432 62791 -30473 -49670 47909 38062 -54442 -16711 62941 1829
379 1829 -58357 19500 54511 -33266 -41659 45831 26661 -54002 -11687 54015 -7869 -54081
391 -54081 19809 42598 -36237 -34563 42348 17371 -49377 -4857 47841 -10802 -43510 24667
403 24667 36563 -32531 -22797 41456 13862 -40688 2626 43081 -11323 -34999 24440 29359
415 29359 -30413 -18772 35265 7761 -37773 1504 34463 -14657 -33160 20165 22295 -30372
427 -30372 -16982 31063 4493 -34254 3244 31922 -13211 -27292 22380 22072 -26193 -11213
439 -11213 32610 5303 -30169 7888 31319 -13798 -24021 23704 18667 -27707 -9626 30235
451 30235 -693 -31744 7898 26438 -19430 -23778 22903 12450 -30203 -6436 29175 -5297
463 -5297 -29740 12979 24538 -20534 -16903 27223 10102 -27395 1315 29909 -7258 -23595
475 -23595 18119 20924 -21275 -11218 26305 4189 -25928 4017 23114 -12646 -20940 15983
487 15983 12238 -22659 -8613 20654 -1874 -23106 5302 17974 -12501 -14994 15724 9528 -17336
500 -17336 -2559 19508 -398 -15642 8483 16057 -9022 -9115 14707 7604 -13873 -1298 14879
513 14879 -2180 -13501 4960 10197 -9469 -9971 9178 4164 -13471 -4011 10392 -2446 -12616
526 -12616 2952 9521 -6970 -8736 9337 6471 -9763 -2077 12415 1455 -9502 4728 12134
539 12134 -4717 -7498 10162 7307 -9896 -2672 11810 -600 -12183 3271 9468 -8671 -9651
552 -9651 8144 3666 -13104 -2943 10224 -3381 -12179 4615 8773 -8600 -6367 11008 3629
565 3629 -10409 1958 12264 -2366 -7882 8749 8591 -7884 -2324 11309 756 -9294 3543
578 3543 8308 -5915 -6909 6587 2623 -9723 -1948 6669 -3669 -8818 3014 4009 -6545 -3874
592 -3874 5638 712 -6264 1389 5587 -1777 -2802 4318 3729 -2113 333 4979 1508 -2135 1775
607 1775 3487 -890 -1810 1476 1127 -1856 -1856 247 -692 -2593 -1965 -208 -819 -2568 -1857 512 -267 -2818
625 -2818 -126 2490 -776 -2051 2327 2859 -1321 -395 4374 2059 -2150 1765 4975 -784 -2222 3611
641 3611 2817 -3752 -1365 3863 -1154 -5256 1038 2675 -4579 -3797 2764 -256 -5662 -244 3275 -2753
657 -2753 -3819 3466 2234 -3678 0 4859 3 -2599 3539 4319 -1979 -467 4995 1165 -2798
672 -2798 2328 3459 -2397 -2244 2387 -104 -3737 -651 1538 -2987 -3346 851 -405 -3679 -901 1223
688 1223 -1756 -2343 1360 975 -1600 632 2658 -224 -88 2941 1568 -516 1779 2599 -170 132
704 132 2183 559 -1505 934 1085 -2117 -1397 431 -785 -3049 -803 420 -2619 -2479 768 -487
720 -487 -2901 147 1507 -1531 -1103 2249 1442 -1087 1396 3117 -68 104 2970 1547 -827 1333
736 1333 2324 -430 -1198 1629 437 -2534 -557 708 -2089 -2390 514 -671 -2827 -879 431 -1925
752 -1925 -1783 1285 -27 -1961 1018 2269 -823 12 3135 1413 -818 2187 3320 -420 -344 3231
768 3231 1227 -2094 983 2397 -1870 -2657 2209 56 -4155 -1073 2194 -2765 -3945 1831 795
783 795 -4380 -1408 3246 -1117 -3708 2443 3541 -2871 -1245 5394 1271 -3206 2283 5192 -1407
798 -1407 -2004 4646 2329 -3717 389 4434 -1740 -4178 2220 2459 -4389 -2409 2855 -732 -5331 12
814 12 2429 -3066 -3509 2197 1237 -3554 -526 3673 -41 -2428 2190 3378 -485 -616 3219 2223 -1015
831 -1015 509 2920 891 -1908 591 2304 -1263 -2458 582 1152 -2931 -2514 981 142 -3535 -1507
847 -1507 1953 -781 -3736 235 2991 -1744 -2914 3142 2817 -3157 -258 5486 995 -4010 2583
862 2583 5856 -2416 -2910 5665 3175 -5463 -577 6369 -1654 -6457 2472 4354 -6517 -4525 5544
877 5544 93 -8628 300 6271 -4212 -6993 5435 4373 -7021 -1715 8446 -219 -7184 4205
891 4205 7923 -4633 -4068 8435 3846 -7424 729 8762 -2599 -7209 4859 5284 -7281 -4207
905 -4207 7067 62 -9261 485 6378 -4781 -6858 5148 3421 -7476 -2641 6999 -331 -7025
919 -7025 2867 7166 -3459 -4340 6642 4481 -5413 -374 7783 648 -5805 3091 6463 -3558 -4647
934 -4647 4981 2843 -6677 -2483 5304 -1132 -7847 885 4867 -4740 -6169 4474 3561 -6593 -2615
949 -2615 6961 352 -6945 2387 7409 -3105 -5179 6977 5679 -6563 -1613 9214 763 -8495
963 -8495 3034 8283 -5483 -6863 7246 4111 -9964 -2450 9177 -2509 -10761 3832 7630
976 7630 -8560 -6946 9023 2881 -11140 302 11602 -3557 -9511 7663 8549 -8614 -3797
989 -3797 12042 2144 -10806 3249 11703 -5338 -8203 8893 6121 -10235 -2737 10674 -1600
1002 -1600 -11597 3562 8426 -8474 -7941 8733 2968 -11470 -1224 10267 -3267 -9754 5908
1015 5908 7995 -7924 -4585 10025 3033 -8677 1812 10272 -2658 -7538 6511 7121 -7677
1028 -7677 -3925 9214 1321 -9588 875 8246 -4120 -8530 5315 5476 -8443 -4875 8027
1041 8027 866 -9962 424 8964 -3794 -8243 6162 6982 -7476 -3753 10138 2869 -9123
1054 -9123 2181 10979 -3567 -8072 7254 7374 -8812 -3965 10552 981 -11318 1698 10279
1067 10279 -6113 -10206 7681 5777 -11567 -4340 11179 -873 -12678 3459 10762 -7712 -8902
1080 -8902 10876 5797 -11574 -884 13739 -1401 -11523 7311 11404 -8825 -6720 12350 3889
1093 3889 -12917 825 12741 -4647 -11496 7431 7484 -11490 -5679 11707 68 -13042 1970
1106 1970 10634 -6949 -9951 8646 6245 -10853 -2732 12034 112 -10540 4485 10536 -5751
1119 -5751 -6739 9903 5464 -9072 -1201 10717 -1241 -9388 4183 8090 -6548 -6588 7367 3393
1133 3393 -10115 -2333 8308 -2487 -9677 3462 7083 -6537 -6183 7781 3726 -8790 -387
1146 -387 9837 -997 -8094 5006 8528 -5868 -5259 9127 4231 -9239 -328 10104 -2060
1159 -2060 -9114 5009 7637 -8063 -6413 8564 1891 -11419 -619 9494 -4388 -10212 5932
1172 5932 6756 -9227 -4509 10858 1406 -11028 2662 11007 -4814 -8120 9058 7223 -9484
1185 -9484 -2145 12169 77 -10802 4546 10237 -7343 -7805 9520 3979 -11546 -1608 10702
1198 10702 -3744 -11242 5475 7871 -9202 -6044 10206 2055 -11414 890 10629 -4317 -8752
1211 -8752 7437 7345 -8401 -3379 10553 1439 -9191 2700 9812 -4475 -7135 7130 5539 -8536
1225 -8536 -3362 8416 -403 -9387 1497 7424 -5364 -7487 5626 3617 -8036 -2857 7741
1238 7741 44 -8253 2405 7593 -4035 -5703 6388 5119 -6462 -1706 8608 1049 -7455 2521
1252 2521 8102 -3782 -6191 6223 4559 -7649 -2771 8107 -814 -9316 1897 6985 -5757
1265 -5757 -7219 6343 3560 -8896 -1980 8427 -1077 -8775 3893 7857 -5728 -4917 8377 4042
1279 4042 -8039 203 10047 -1844 -7750 5713 7044 -6666 -4121 8506 1515 -9344 457
1292 457 8006 -4472 -7632 5640 4192 -8404 -2898 7497 -918 -8739 2379 6892 -5232 -5116
1306 -5116 6746 3475 -6971 132 8321 -664 -6232 4398 6231 -4575 -3075 6951 2100 -6298
1320 -6298 579 5968 -2378 -5890 3364 4003 -5525 -3419 4941 518 -6308 -115 4706 -2433 -5054
1335 -5054 3073 3611 -4339 -2152 4951 1330 -4431 772 5492 -1019 -3389 3607 4267 -3253 -1822
1350 -1822 5110 1531 -4680 146 4698 -1603 -4917 2200 3588 -4923 -3542 4156 579 -6087 -470
1365 -470 4874 -2475 -5134 3496 3911 -4853 -2113 5942 1013 -5505 1780 6011 -2520 -4308 5049
1380 5049 3966 -4997 -1104 6342 -266 -6246 2385 4922 -4413 -4243 4575 1391 -6404 -759 5290
1395 5290 -2462 -5735 2748 3877 -4859 -2847 5114 891 -5245 1084 5318 -1523 -3365 4192 3352
1410 3352 -3773 -682 5144 338 -3850 1725 3610 -2668 -2890 2763 1359 -3860 -1072 2861 -1152
1425 -1152 -3996 396 1676 -2727 -2632 1625 1124 -2829 -490 2521 50 -1909 1059 2724 -739 -1247
1441 -1247 2212 2098 -1379 -415 2768 1011 -1855 647 2373 -745 -2257 1067 1835 -2456 -1980 2213
1457 2213 -100 -3253 -475 2255 -1292 -2939 1373 1737 -2466 -1431 3180 638 -2486 1307 3662
1472 3662 -1058 -2005 3215 2692 -2747 -63 4051 -60 -3168 1551 2930 -2378 -2408 2864 387 -3770
1488 -3770 -395 2344 -1756 -3423 1623 1387 -3155 -1387 2856 -254 -2985 914 2553 -1611 -1394
1503 -1394 2741 1615 -1757 317 2800 231 -1501 1410 1803 -1360 -959 1872 467 -2160 -251
1518 -251 1128 -1087 -1906 98 283 -1558 -971 313 -272 -1186 -80 625 -252 -625 106 915 332 5
1536 5 721 1254 137 -313 946 1112 -248 -204 1346 634 -1239 -177 1097 -627 -1949 464 979 -1675
1554 -1675 -1158 1045 -248 -2281 -178 1360 -1283 -1894 1511 1081 -1728 -127 2731 228 -1818 1518
1570 1518 2194 -1012 -442 2752 819 -1536 635 2445 -615 -1951 1495 1278 -2268 -937 1533 -813
1586 -813 -2474 371 1172 -1858 -1458 1115 165 -2000 -31 1627 -659 -781 1050 1088 -704 55 1748
1603 1748 388 -477 927 1093 -210 -192 891 479 -148 -93 269 -296 -693 -147 -299 -390 -669 -657 -275 -213
1623 -213 -833 -578 157 -9 -685 105 871 -251 -409 902 1045 -505 408 1547 250 -665 785 1541
1641 1541 -694 -705 1498 361 -1710 110 1414 -1074 -1871 765 288 -2369 -723 1601 -582 -1932
1657 -1932 435 1385 -1483 -792 2028 428 -1677 697 2282 -329 -1033 1924 1351 -1372 -15 2047
1673 2047 -62 -1382 922 1248 -1503 -1161 1448 -142 -2173 168 632 -1435 -1328 609 80 -1757
1689 -1757 -206 975 -327 -864 537 792 -574 63 1164 143 -285 753 836 165 301 680 674 -27
1707 -27 -144 77 -263 -299 -204 -461 16 -806 -717 -126 -205 -856 -850 90 -331 -895 -138 819 -265 -513 933 1085
1729 1085 -903 252 1626 294 -412 916 1318 -685 -719 1638 593 -1582 39 1378 -563 -1558
1745 -1558 717 284 -1842 -775 1157 -726 -2295 316 1055 -1217 -1281 1259 305 -1506 215 1692
1761 1692 -440 -847 1859 1577 -1053 94 1944 193 -1112 992 1163 -1268 -503 966 16 -1376
1777 -1376 79 538 -1073 -1160 368 -104 -1161 -281 657 -472 -726 553 563 -556 147 939 251 -167
1795 -167 770 837 228 612 192 290 -26 315 157 -238 -50 149 -339 -265 -161 -823 -364 82 -530 -884 41
1816 41 -43 -900 -688 430 -276 -664 58 707 -474 -223 1189 469 -493 651 1482 25 -367 1089 705
1835 705 -704 9 1332 -80 -1154 347 586 -1488 -818 791 -227 -1604 56 808 -1082 -1000 599
1852 599 316 -976 137 1081 -64 -578 1028 890 -391 395 1296 226 -248 674 799 -338 -138 926
1870 926 -116 -765 243 142 -930 -618 54 -446 -1135 -167 -187 -681 -471 404 -158 -715 496 497 -430 188
1890 188 1134 399 -466 773 586 39 511 1028 182 -400 662 232 -833 -101 630 -471 -918 293
1908 293 -278 -1137 -780 443 -526 -1177 306 241 -1008 -543 1155 -167 -863 700 961 -354 -12 1124
1926 1124 867 -592 399 1295 -384 -257 867 390 -898 -13 720 -687 -1129 296 19 -1334 -799
1943 -799 299 -534 -1049 146 386 -812 -208 632 -13 -432 334 785 67 25 757 412 148 547 774
1962 774 37 171 374 -15 -226 289 -4 -686 -284 -214 -587 -191 -91 -564 -610 220 -111 -1060 -341 580 65
1983 65 -615 737 804 -457 70 1146 330 -348 693 1289 -289 -308 1238 236 -940 158 999 -808
2001 -808 -1114 804 336 -1575 -708 955 -615 -1429 427 354 -1467 -681 1141 92 -1372 637 1491
2018 1491 -784 -583 1417 664 -935 503 1580 -193 -986 1022 1226 -1132 -519 1161 -144 -1282
2034 -1282 164 615 -1133 -1163 530 -127 -1241 -505 593 -785 -730 210 395 -280 -351 773 402 -406
2052 -406 230 824 75 -108 561 642 94 29 536 443 -73 -77 513 154 -523 -165 92 -195 -898 -417 331 -819
2074 -819 -912 155 287 -869 -332 973 -69 -789 331 1129 -202 -503 1108 1003 -944 146 1310
2091 1310 -14 -1311 1027 1181 -1181 -895 1464 314 -1668 -190 1286 -1114 -1924 873 656 -1947
2107 -1947 -668 1566 -375 -1615 693 1367 -1078 -669 1847 722 -1099 409 1613 -621 -747 1289
2123 1289 1101 -1183 -227 1532 41 -1403 234 1218 -1027 -1117 920 204 -1693 -182 736 -715 -1234
2140 -1234 646 645 -1108 -402 741 39 -701 548 997 -85 -271 955 746 -82 97 898 201 -190
2158 -190 271 592 -390 -385 68 365 -306 -751 177 191 -824 -742 261 -68 -1144 -268 802 -188 -643 650
2178 650 571 -655 -510 1031 578 -777 502 1638 -54 -399 1193 1147 -1234 -699 1511 8 -1588
2195 -1588 484 1201 -1092 -1274 1020 -5 -1847 -249 1255 -854 -1786 756 974 -1356 -457 1415
2211 1415 122 -1428 854 1918 -571 -783 1696 1116 -1333 178 1879 -328 -1151 839 941 -1111
2227 -1111 -719 1186 -169 -1579 -75 961 -868 -1527 581 590 -1357 -380 861 -57 -1069 418 823
2244 823 -523 -378 1212 917 -337 130 1008 306 -535 626 609 -77 -447 453 238 -589 -306 389 91
2263 91 -752 -517 424 -277 -790 -64 502 -574 -549 623 579 -827 -185 1074 83 -505 535 1359 -325
2282 -325 -383 1214 801 -644 34 1264 -37 -1068 517 970 -1111 -968 962 73 -1498 -129 936
2299 936 -1048 -1294 401 571 -1431 -561 1500 28 -1079 516 1418 -792 -318 1548 668 -1383 350
2316 350 1580 -258 -705 987 723 -1397 -475 1031 -21 -1264 252 806 -964 -1030 357 -134 -1359
2333 -1359 -230 574 -682 -867 360 577 -506 -334 1038 486 -209 379 768 180 -334 554 618 -103
2351 -103 4 557 81 -530 -281 232 -234 -757 -98 199 -250 -630 -241 -26 -612 -508 -95 152 -587 63
2371 63 671 203 -204 412 957 57 -394 667 746 -489 127 948 93 -759 644 798 -640 -647 819 -146
2391 -146 -1087 -244 578 -586 -1053 442 291 -1227 -378 722 -241 -1335 333 856 -563 -435 974
2408 974 388 -726 688 1201 -99 -454 1000 675 -949 -395 665 -301 -1059 238 342 -633 -500 392
2426 392 -166 -1017 -152 628 -315 -783 224 287 -371 -142 368 -160 -208 190 619 107 -126 555 469 4 481
2447 481 632 249 172 256 56 -124 -275 -169 36 -202 -451 -340 -119 -344 -423 -48 -50 -453 -278 174 332 -184
2469 -184 -268 722 114 -289 549 719 -111 60 850 347 -206 367 682 -340 -190 460 76 -802 -67 638
2489 638 -315 -1172 340 549 -1035 -445 454 -450 -1097 222 741 -551 -305 808 543 -339 421 806
2507 806 -267 -296 728 621 -582 -34 722 151 -772 356 397 -605 -304 225 -251 -946 -125 170 -725
2526 -725 -716 55 205 -623 -142 435 -398 -197 144 246 -22 245 450 210 271 156 198 296 166 66 5 -3 56
2549 56 -318 49 -67 -53 -336 126 -24 -365 -243 93 -446 -414 124 309 -308 -175 769 165 -466 399 610
2570 610 -90 -140 616 707 -458 363 739 -276 -636 485 221 -483 -277 733 -587 -967 302 395 -801
2589 -801 -621 437 -209 -961 -51 671 -208 -581 769 323 -606 158 702 96 -200 403 697 -229 -43
2608 -43 688 101 -367 485 363 -525 -146 312 72 -756 -17 265 -475 -664 -180 -94 -446 -287 474 54 -33
2629 -33 -50 287 28 312 444 211 309 335 265 90 202 -12 31 272 236 -290 -194 204 -328 -192 63 -271 -780
2652 -780 -210 253 -392 -464 -95 170 -458 -444 358 240 -211 416 503 -146 20 397 402 -562 121 869 73 -590
2674 -590 618 427 -359 -198 396 53 -895 231 356 -587 -755 407 101 -882 -266 537 -178 -895 312
2693 312 147 -598 76 674 141 -72 564 513 -397 49 550 223 -93 388 475 -91 -256 248 317 -329 -169
2714 -169 91 -345 -564 -167 -33 -604 -376 -71 -184 -220 -58 138 -130 -171 285 86 161 168 310 -42 420 -7
2736 -7 -202 498 -64 -456 117 62 -210 22 276 -8 -706 -274 197 -237 -433 12 -28 -701 -325 278 -158
2757 -158 -420 148 920 -311 -350 625 479 -421 223 733 74 -416 275 461 -226 21 576 29 -688 218
2777 218 282 -661 -323 546 -300 -952 -303 204 -687 -423 344 64 -644 17 615 -18 -352 440 540 -154
2797 -154 -100 604 161 -277 235 351 74 -75 312 -69 -127 -36 161 -349 -202 -145 -170 -597 -158 70 -208 -227
2819 -227 -12 85 -207 -159 168 -218 110 229 106 7 424 431 -197 48 115 -129 172 509 -48 -150 47 271
2841 271 -237 -319 30 -196 -915 -202 40 -833 -513 87 -60 -468 -86 559 -197 -554 353 527 -310 5
2861 5 103 -131 -337 408 449 -190 -220 491 -135 -353 9 398 -529 -285 -28 198 -504 -141 -121 -416 -382 150
2883 150 105 -536 42 426 -71 -233 374 211 -66 46 867 310 -62 252 280 -269 49 579 25 73 82 368
2905 368 -307 -104 10 -232 -278 -11 80 -484 -330 -14 -113 -239 -8 -115 -151 -55 430 75 23 217 -32 -232
2927 -232 400 675 -105 16 413 -75 -250 167 349 -47 -213 161 -37 -385 -297 288 -630 -485 -157 -91 -358
2948 -358 -91 399 -165 -362 365 317 -271 -228 693 231 -352 353 488 -225 -340 508 198 -356 191 609 -184
2969 -184 -350 77 93 -660 -153 604 -155 -286 115 204 -316 -82 178 -53 -469 53 266 -246 -25 413 299
2990 299 -274 52 189 70 -38 225 -109 -163 9 144 -211 238 -38 49 -363 272 -93 -219 14 -42 -220
3011 -220 -163 29 -6 106 213 46 -10 3 184 9 -109 149 212 -31 -294 608 182 -69 171 -224 62 -312
3033 -312 239 183 -378 -178 344 -361 -417 33 -78 -477 -265 224 -156 -297 418 373 -184 -278 685 -163 -307
3054 -307 416 555 -65 -15 533 274 -468 97 419 19 -489 182 344 -173 -98 130 -281 -397 -71 33 -564
3075 -564 -309 434 -59 -342 -134 365 32 9 110 318 152 346 234 -147 253 408 47 83 183 361 -94
3096 -94 -157 -89 -288 -201 131 -302 -123 53 -69 -208 -172 232 -159 -383 12 305 -332 103 512 -61 -84 320
3118 320 272 -217 318 613 14 -515 354 398 -117 -9 576 28 -524 -38 205 -698 -453 192 -10 -430 -400
3139 -400 169 -267 -174 42 303 -629 29 496 144 -343 359 566 -19 94 655 193 -227 126 713 48
3159 48 61 310 1 -349 -123 198 184 -497 125 7 -246 -199 -21 -23 -421 -135 186 103 -218 -27 138 -130
3181 -130 41 514 -54 -67 133 434 -54 153 126 357 92 34 61 -139 -169 88 107 -63 -247 -284 -69 -408
3203 -408 -209 -247 195 62 -371 96 210 -82 -206 382 279 -446 340 417 -53 -154 303 273 -86 60 399
3224 399 54 -382 36 111 -355 -371 370 233 -503 -32 598 14 -503 20 267 -539 -98 726 -209 -269 322
3245 322 252 31 -86 645 -45 -258 267 593 -68 -212 187 151 -423 -252 313 93 -193 -212 -14 -258 -306
3266 -306 224 138 -686 -144 127 -183 -333 88 -18 -6 -91 224 151 -56 278 262 -75 121 210 175 -10 109
3288 109 124 -17 -116 61 112 -228 -58 -123 55 46 -86 -172 45 -39 2 -196 279 381 -197 258 190 -115 244
3311 244 79 -94 64 163 318 153 73 375 -1 -73 174 390 -171 -82 332 32 -361 -72 222 -338 -229
3332 -229 -11 55 -335 -164 636 -71 -365 323 489 -290 -63 382 226 -57 445 481 4 -330 439 228 -369
3353 -369 24 222 -138 -351 131 282 -490 216 120 -285 -189 -128 33 -349 -250 -53 104 -27 -293 273 -38
3374 -38 -227 229 127 83 47 -27 190 -37 -202 12 -127 283 180 -8 -47 -17 16 222 -78 -127 -241 -222 -504
3397 -504 12 -157 159 -273 82 -66 -12 -59 201 166 113 159 347 316 80 -148 520 87 -26 305 125 142
3419 142 -150 14 -34 -469 -145 240 -271 -344 -198 69 -334 -82 366 3 -156 132 246 -125 -209 339 -141
3440 -141 -37 22 170 305 160 290 184 -131 31 226 128 -71 -43 143 -451 -235 323 -298 -419 133 -258
3461 -258 -144 -303 47 -165 -126 85 -93 -229 -183 53 340 -114 221 107 344 -374 252 84 -298 149 178
3482 178 330 -571 -30 112 86 -58 -42 -240 -192 54 164 42 163 104 -257 -98 -174 -287 -120 203 -118 65
3504 65 135 -61 -76 208 211 79 48 267 256 -192 245 151 -10 -455 16 302 -46 85 356 -41 -374 -29 63
3527 63 -220 -381 376 291 -240 -15 636 192 -248 106 -32 114 231 659 219 -312 -60 116 -129 172 227
3548 227 -109 -254 75 567 239 -135 303 12 -235 -62 82 -12 -295 -73 -49 -89 32 -36 -132 -208 11 72
3570 72 1 -12 -2 104 165 124 125 243 166 227 181 382 -179 -123 -153 38 -115 -105 -266 -129 39 -175 -26 -445 -214
3595 -214 -69 269 -110 249 171 119 -249 8 12 34 -386 22 262 -60 -109 8 -39 -345 246 -40 -262 -193 101
3618 101 9 -77 -47 -3 17 -325 69 33 -179 -19 75 -48 -486 164 -41 -90 -155 188 175 -247 101 183 157 -124
3642 -124 312 -33 -47 178 359 -74 110 137 -16 81 -120 178 -26 -119 264 159 31 34 176 -25 -199 -13
3664 -13 -100 -195 170 91 116 10 -123 190 -259 520 1 -97 -18 23 92 -250 -62 41 233 -170 -164 -82 -33 184
3688 184 -25 -182 -135 38 117 86 -14 48 258 -166 75 145 85 152 330 -46 -4 353 97 -332 -46 165 30
3711 30 38 161 114 39 -208 -107 45 -35 -146 98 -32 123 139 -350 24 296 206 -251 -38 238 -60 -142 335
3734 335 125 -99 49 215 184 -71 19 159 -316 -159 -86 -312 -281 154 46 -183 -290 -12 16 -278 -230 -55
3756 -55 -151 58 -147 29 -57 75 26 -228 190 133 227 -314 -288 -113 -67 29 -5 116 -83 -254 -194 -151 -622 -26
3780 -26 92 97 109 347 -10 -45 233 22 123 180 372 -323 -194 263 210 -342 158 394 267 165 -147 80
3802 80 120 -233 -217 -150 -28 -164 190 -200 -35 160 -384 -12 18 82 -82 -89 -54 59 -53 -329 -106 -382 -101
3825 -101 67 -95 96 -66 265 -99 144 283 241 -88 -184 269 -25 5 358 140 -90 92 226 -161 -65
3846 -65 256 158 -178 200 287 -128 -79 -136 -47 37 -25 5 5 104 -42 -28 96 226 337 -26 160 439 -123 -68 -47
3871 -47 214 194 -152 -76 -69 -309 77 232 39 -52 -133 -72 -86 99 144 31 14 -97 -38 148 -95 147 180 -220
3895 -220 136 151 -47 -261 38 -75 -46 12 178 -397 69 25 -50 161 108 -134 -32 -157 130 -21 -163 109
3917 109 -56 -108 -139 99 -17 -61 -150 -13 -143 -87 150 76 -7 174 264 -211 -60 218 92 -185 -185 98 46 -221
3941 -221 7 -164 -5 27 -96 -220 81 -99 175 -313 -117 113 90 97 -56 72 -116 107 254 326 85 37
3963 37 41 30 -174 187 53 -33 224 240 9 -148 157 119 -356 105 312 -227 -6 4 -25 -172 -300 50 140
3986 140 -67 140 147 -87 -37 411 -39 -98 185 50 138 97 110 57 -213 185 -274 -181 -16 -292 -6 -290 -140
4009 -140 -247 -438 -141 -112 88 43 71 -54 -36 150 147 -33 85 180 -4 -26 -140 134 316 51 243 -49 -84
4032 -84 -108 52 -124 -73 50 42 -120 -40 25 -377 -121 31 -302 -78 164 -94 85 -280 195 -302 -155 6
4054 6 -122 62 -82 277 106 75 148 -53 -174 47 186 180 -29 -111 218 -274 -184 166 10 49 18 -163 140
4077 140 -176 82 50 6 -239 -9 70 72 188 26 72 89 45 331 118 95 241 -68 -117 262 -131 -57 246 -93
4101 -93 25 0 240 45 48 -62 17 -36 -209 127 74 -287 -8 198 141 16 -78 -11 -43 192 65 62 68 285 252
4126 252 -112 -164 36 216 444 114 86 -83 152 40 -167 -86 -134 27 -316 -191 63 -68 -52 -76 -165 108
4148 108 -30 117 -330 -31 144 -169 -108 366 263 -86 -142 80 -126 -4 183 107 -86 123 445 -98 -305
4169 -305 -2 144 -69 24 139 73 -230 109 114 -237 -81 207 138 -54 -125 338 -37 -4 248 112 -176 482
4191 482 83 6 -5 89 11 -167 -121 -30 115 50 -308 -119 -238 -61 34 -124 -315 -330 -60 100 134 97 64 23
4215 23 66 103 301 165 -15 43 -260 106 187 119 -174 -172 -153 -26 159 135 -137 -55 -39 -17 15 -186 6 -55 26
4240 26 -72 -8 -65 -117 -181 297 108 -1 55 25 147 -91 41 30 -49 -43 40 -300 295 4 41 10 103 -271 -168
4265 -168 115 -106 302 -30 -17 36 -57 30 89 -328 135 13 46 -82 7 84 74 152 119 54 198 -29 148 28
4289 28 122 372 -167 -143 238 25 -127 -130 -60 111 -117 -87 41 11 42 172 105 114 -103 -61 128 -11 231 184 129
4314 129 449 45 31 89 98 -75 190 8 173 -168 -132 289 -26 -50 -10 71 -261 -1 143 -95 -32 107 7
4337 7 16 -36 -32 -75 -225 -68 -159 -78 151 186 185 174 47 81 52 6 150 -169 170 -32 -49 -39 0 205 197 -188 -147 -166
4365 -166 -151 -243 -253 -148 -105 210 -225 102 -46 21 90 -121 67 -113 -156 237 83 -83 -230 -172 -123 -219 -138 -79
4389 -79 425 59 -21 205 38 -317 -113 64 -87 217 -105 -39 -165 146 191 -83 -13 -102 40 3 153 -128
4411 -128 -72 256 82 127 77 297 -162 112 -73 -123 389 -54 17 -191 -138 -116 105 45 -152 -126 119 -31 -221
4434 -221 -55 42 -25 56 -175 -258 -209 72 -30 28 -80 -24 124 27 44 139 -227 -111 45 -87 100 15 41 -124
4458 -124 234 50 -109 135 124 -187 -26 58 157 -30 175 20 -70 0 -74 -140 16 -101 17 33 -107 62 230
4481 230 30 24 -70 16 213 -38 452 99 79 154 55 -327 97 19 299 56 -12 130 35 -174 -52 -165 -242 189
4505 189 -73 154 14 233 -145 31 -103 22 3 86 -135 220 58 70 -107 218 42 32 -54 -294 28 17
4527 17 -342 -108 -133 34 126 -14 68 -177 48 -79 78 99 43 56 -139 28 143 -46 -9 -325 -26 -115 -107 64
4551 64 -69 52 -40 -85 144 325 124 32 13 -308 -290 -82 38 235 1 -44 149 279 -3 26 -10 -170 -81
4574 -81 -26 290 -140 119 210 7 24 32 82 44 -95 33 -19 -64 36 62 103 -350 -17 44 -155 -135 -32 -266 -187
4599 -187 116 171 217 -19 -133 -36 237 188 328 197 103 -20 -61 82 -39 132 -75 284 -5 -80 -5 -294 10
4622 10 6 -49 -2 164 -55 -16 66 -125 -80 -45 -89 41 160 -213 70 152 27 -11 263 174 366 -97 115 -182
4646 -182 11 -224 -98 -5 -110 -120 97 150 -90 81 23 24 1 -272 -52 191 78 31 -143 248 -52 -363 52
4669 52 242 -41 108 98 16 58 -131 155 19 -121 62 -112 128 196 -53 -54 -175 -162 -252 -208 -157 72 -292 -29
4693 -29 -13 17 -45 -232 -183 60 337 -99 108 -53 24 172 -225 -258 -167 52 142 -30 -49 11 169 45 45 -33 -29
4718 -29 -68 93 -260 -8 -3 37 235 -128 79 32 114 112 -9 -53 202 -127 -90 -213 -9 -155 -58 222 -33 46
4742 46 -27 -82 -263 -9 -23 186 -38 -179 228 -60 1 62 -333 80 62 -32 -240 -337 -32 17 -135 30 -251
4765 -251 6 30 84 395 -93 204 63 155 -246 -104 165 37 -196 170 103 -98 -53 -252 -247 -285 70 117 24
4788 24 -129 59 30 169 67 205 156 -12 -173 21 -20 250 284 -443 -320 -123 78 -126 -1 -117 -64 -407
4810 -407 190 -159 -118 170 -285 26 -28 -239 173 215 -34 15 137 -44 -108 0 -97 -15 156 -29 126 -81
4832 -81 -15 -142 158 -250 -27 105 89 135 -117 -96 -104 232 45 84 -30 190 -63 -56 70 189 31 -56 166 109
4856 109 234 151 -62 150 90 -94 120 -129 49 82 98 -431 17 -88 250 -199 48 297 171 -36 -385
4877 -385 -162 -15 146 3 52 -282 385 -298 -21 -25 -5 195 -234 189 172 -206 -184 -35 -190 102 179 332
4899 332 63 -25 88 -123 -157 58 151 101 24 71 281 -86 103 -88 29 -109 -3 -24 28 -47 -122 -9 -21 -41
4923 -41 -139 -220 283 81 -44 -83 17 -165 95 -95 -18 104 -62 -235 148 119 -43 29 266 -171 -55 -340
4945 -340 -216 158 136 -17 118 34 319 337 -156 142 135 18 155 124 52 -15 156 -74 70 -58 50 -62 84
4968 84 99 -95 17 191 151 132 -70 -188 34 -368 -6 -13 102 -2 -159 211 158 273 27 47 -45 -76 -66 187
4992 187 318 -104 124 -3 339 94 22 240 -94 -25 -194 82 97 161 3 29 225 49 -47 -77 50 -161
5014 -161 -108 88 19 -67 -233 -5 67 -45 68 178 50 -2 -76 -236 158 -110 -22 12 140 0 -94 -125 122
5037 122 207 68 -2 79 -163 -209 -35 21 -100 -91 74 83 -21 145 99 -221 -18 143 88 -4 148 -91 112 199
5061 199 -107 -83 293 -103 -26 -63 208 37 28 212 -100 142 -205 97 -13 45 -40 113 259 85 82 -17 -73 -8
5085 -8 49 -252 24 -30 33 -68 10 32 -183 184 -61 -297 -96 -2 -136 -52 124 84 -1 40 102 -2 89 20 277
5110 277 157 213 8 -102 -285 -91 -295 -185 270 -212 62 193 -388 -130 -5 276 -94 362 43 -138
5130 -138 208 -283 25 -300 16 202 219 37 -107 -26 25 50 2 -41 27 -139 -142 -118 -53 62 26 -74 145 -13
5154 -13 -2 136 51 -93 -83 -12 94 19 104 338 23 79 -87 -6 -79 118 -288 -44 184 -120 32 -95 304
5177 304 -73 -173 50 -12 -82 -113 22 307 20 -104 -96 -53 -5 156 -88 50 171 -153 74 139 -291 107 -141
5200 -141 -171 186 -258 -195 38 99 312 135 -132 95 -97 -56 97 -105 103 -100 -20 33 -119 -252 108 -182
5222 -182 109 -113 89 -54 186 -14 279 -115 83 -40 35 -84 -29 138 -3 -142 -60 362 46 25 -4 521
5244 521 64 49 215 -161 139 -34 -24 -42 -137 61 72 175 54 -113 288 -79 -259 -25 55 -163 168 145
5266 145 14 133 -50 -78 -231 -103 9 -135 75 -174 -24 106 -80 -126 -140 -175 -168 -69 -148 -87 144 -2 10
5289 10 -78 28 -122 4 264 146 23 57 -42 93 144 137 88 61 -95 -14 109 -29 46 -100 -415 -198 -98 38
5313 38 -64 92 154 -87 -11 -56 -5 -12 -98 181 158 42 83 103 -142 -110 6 -137 120 -45 -208 -32 268 16
5337 16 27 69 47 -96 -158 -77 17 -158 162 256 13 114 -140 82 185 -252 18 -227 162 -105 43 -28 -77
5360 -77 -93 169 -45 89 -8 227 121 -472 149 68 -115 29 6 79 74 6 -63 -37 12 -59 -12 -47 31 -192 102
5385 102 -33 34 -123 -301 36 87 305 142 12 118 268 -83 105 181 -71 -3 -26 47 -48 65 77 424 71
5408 71 -55 -1 289 234 81 -85 -91 160 -81 52 27 -220 -73 63 -174 -60 -75 55 188 -66 198 191 206
5431 206 39 109 -118 -215 -58 -171 43 -270 -64 -131 -389 60 55 -61 -91 -130 -104 -15 -75 118 120 -29 27 234
5455 234 183 194 -46 110 143 -26 -261 6 -48 117 -231 221 70 190 128 -23 130 -114 259 -19 55 107
5477 107 -48 -2 48 -90 4 -122 -97 27 329 -115 32 -141 -395 -117 -167 210 36 178 -46 -143 73 36
5499 36 82 -94 -448 -226 126 -167 -15 76 -48 52 170 -16 -187 8 -141 99 -230 96 -63 134 86
5520 86 -105 138 26 46 315 -320 151 112 -103 -122 -2 114 -205 57 -7 45 -126 15 83 240 42 -287
5542 -287 129 206 176 -22 32 -49 77 -186 -60 9 -62 -156 159 4 -21 45 -72 -166 21 231 -50 -8 109 70
5566 70 -68 -9 -164 207 57 83 -8 55 275 39 69 -155 58 213 137 29 -205 57 -222 -32 416 -138
5588 -138 -164 110 44 215 51 199 -14 -154 355 -51 11 208 218 -3 26 36 -24 -54 -65 45 30 -34 19 -86
5612 -86 115 273 56 -37 128 -2 -69 -154 -149 -252 -187 -206 -119 -263 142 -126 -20 -147 40 -38 -220 151 -59
5635 -59 145 269 -190 94 291 -18 141 48 -205 5 -47 126 80 47 -40 -177 12 -84 -1 -101 -249 130 -300
5658 -300 -45 97 180 -58 297 117 108 136 -200 218 -1 -94 169 -33 -91 32 53 35 -257 162 -99 70 -109
5681 -109 -30 -304 -377 126 168 38 -74 9 116 52 -58 13 202 -144 -88 34 168 -225 45 -160 -104 -82 105
5704 105 29 160 -29 -249 -27 -152 -200 -17 -103 -40 -127 -102 -118 83 -126 -93 -25 67 75 161 16 -137 238 138
5728 138 -218 -96 -56 112 -76 -89 19 -163 21 -201 -111 -198 -74 -103 -20 -115 -81 107 304 196 385 -52 2
5751 2 -38 34 76 293 -30 -137 11 198 67 -124 -84 265 336 -29 193 -99 -50 -61 91 90 -220 40 -89 -240
5775 -240 -141 -31 -142 138 -220 77 173 -61 300 417 -17 146 -130 -157 -10 -102 -32 24 -7 80 -259 80 23
5798 23 39 -201 -153 127 347 -68 80 -266 229 -102 -26 12 -60 140 -11 -166 -88 -48 -83 225 250 81 100 40
5822 40 -17 266 -111 86 241 -305 -1 26 -137 -94 99 52 168 -145 21 146 -131 -72 -267 -85 -10 115
5844 115 50 143 135 -324 -10 -41 -217 -194 -139 260 260 138 206 65 121 -368 252 178 -137 -202 82 157 -47 70 13
5869 13 -398 -202 158 64 13 -130 -81 -81 35 206 -23 -169 -233 138 -155 63 60 -137 26 44 -128 -83 -325 14
5893 14 -80 -199 135 178 102 16 -226 202 -42 -106 -97 106 -102 -50 157 37 -59 -42 -125 -51 2 117 14 -97 76
5918 76 59 -242 143 88 -132 -65 95 63 -16 0 -131 -72 35 92 -204 -70 258 24 76 -95 56 127 -13 49
5942 49 0 289 -111 -32 -88 78 -111 36 247 53 119 -213 -173 -43 48 -271 -53 -86 163 -115 -13 172 -158
5965 -158 -64 -235 265 -33 83 226 -33 -240 31 148 11 -79 31 -58 28 36 193 -37 -90 -109 310 41 141
5988 141 135 -44 103 -97 34 110 -37 42 106 26 -282 -95 90 -33 189 -122 -111 -35 350 -3 107 82 -196
6011 -196 159 119 182 102 262 69 1 -171 -134 77 55 -78 61 -173 122 100 -119 35 -193 -96 158 256 110
6034 110 7 44 -287 -230 141 119 114 -15 60 -115 74 159 189 98 73 111 -174 228 -138 94 -22 271 -113 -188
6058 -188 -29 33 10 157 -37 97 22 56 170 -334 -28 113 -81 267 151 -219 -4 22 135 5 5 -68 -58
6081 -58 127 31 -65 135 147 -75 63 -167 1 -171 -161 92 126 -51 329 -158 -29 -236 -104 193 -355 -61
6103 -61 219 342 -8 144 14 91 -97 -188 73 134 -40 -78 20 17 83 31 -51 -228 -199 -359 -119 101 80 -160
6127 -160 57 -210 -271 -261 122 -73 -147 -451 40 -60 -187 87 -107 -65 -179 150 -254 -113 101 124 -61 68
6149 68 9 117 134 136 83 -177 25 36 -245 -177 -55 169 24 157 192 -18 -368 31 -200 332 30 15 156
6172 156 54 74 -64 -26 -68 82 119 332 101 -105 -56 -100 266 -325 -61 141 26 1 -132 -10 55 -145 -199
6195 -199 -297 310 -83 -31 -162 157 -68 25 290 -186 -15 -58 -15 154 -174 -107 103 107 -42 -190 -292 15 8
6218 8 88 249 -236 -136 92 9 -134 -201 -201 91 -83 -114 115 275 -42 -345 112 277 -86 50 110 27 15 176
6242 176 -110 208 283 -60 -17 -203 299 -96 -65 41 -185 102 221 -127 154 166 100 -32 -101 -145 -138 -30 283
6265 283 309 -144 -67 -7 -36 -33 48 31 -122 -168 -272 -299 -118 -268 4 -286 57 380 49 78 -95 89 95 -57
6289 -57 121 135 -100 -7 -179 -144 46 -258 -77 245 114 223 -209 -192 88 155 -64 -14 -1 -23 338 -48 91
6312 91 -95 33 -59 81 102 -92 185 -50 1 -84 108 -33 -180 258 -42 -175 95 -137 97 45 353 26
6334 26 -288 -125 105 -166 71 -55 -100 -146 -52 -19 -238 -147 -63 49 75 -126 -341 -62 -13 3 153 30 254
6357 254 104 -188 83 -28 11 249 20 -29 13 21 -294 97 39 -34 -32 144 163 -189 -48 152 182 -171 81 200
6381 200 27 -89 80 62 75 -242 181 -82 -5 -36 248 16 22 -128 106 125 37 -78 127 -26 103 20 -10
6404 -10 115 99 -58 -151 -33 198 141 -172 74 6 184 44 40 39 -43 36 -164 355 117 -216 -59 -86 -315 53
6428 53 104 -163 104 -50 300 220 115 39 -194 115 -149 -146 181 40 125 -59 -21 -80 -419 -205 -80 -121 -202 31
6452 31 -69 -273 -27 -154 -222 -164 79 171 -207 75 225 60 134 113 -91 -167 -9 -5 94 -137 20 207 1
6475 1 -186 195 -252 168 181 85 -20 -42 -162 -289 -22 -96 -175 29 -30 -44 150 118 399 -107 11 74 -45 -59
6499 -59 390 9 -26 16 -55 -50 -151 49 51 224 42 -131 81 51 -8 -226 236 174 -63 -47 -88 -60 10 -131 93
6524 93 -139 4 36 -90 -307 -270 -242 -77 -221 143 23 -173 47 -121 -54 26 151 -114 -229 129 59 -92
6546 -92 -71 61 107 -295 303 28 176 205 113 -3 -135 138 -13 -83 6 129 67 -201 42 -141 1 -278 -95
6569 -95 -116 -329 -45 154 71 7 -34 -156 -222 -150 31 -182 -120 130 -70 85 -170 2 -85 -119 -23 147 -124 161
6593 161 94 -294 -210 40 66 74 195 -41 -238 -41 223 -76 -377 -154 -74 -213 -80 -17 132 -72 61 -152
6615 -152 36 -26 135 -235 -160 182 -114 324 61 11 -8 47 -141 346 -25 -173 -42 86 49 163 -6 50
6637 50 -84 197 220 -343 -104 -32 -180 -27 111 -205 -11 -141 30 -109 -39 -46 106 -362 43 -142 -135 59 -362
6660 -362 42 37 -52 -12 -25 -15 -152 -35 137 217 85 -259 131 -337 63 -202 -1 -203 74 164 -65 147 -52
6683 -52 85 -110 182 76 29 31 102 -120 -115 -149 204 70 181 309 83 27 -224 36 110 257 -316 -178 56
6706 56 125 62 -190 48 -33 124 81 98 -387 -50 -48 124 -3 -32 12 -27 202 83 147 131 -155 78 -2 291 130
6731 130 -166 119 -155 -143 118 -6 -16 -46 167 -273 81 -319 -108 24 63 159 -141 101 75 -223 -162 -211 113
6754 113 97 -136 70 55 235 -40 175 32 30 -89 28 140 -44 -409 195 203 116 125 -13 254 210 -106 76
6777 76 28 -180 83 -8 303 290 -156 156 -142 -92 -28 -45 -58 111 -62 -65 318 -12 100 -27 139 -118 -108 -29
6801 -29 -72 30 -178 -45 -171 85 -69 -241 -2 11 -109 60 -98 -187 -65 -211 97 150 20 5 114 134
6823 134 117 24 166 376 -151 -126 -45 -255 73 351 12 33 37 -92 -203 75 68 243 12 -19 22 -354 -233 151
6847 151 -65 -29 114 -84 -42 190 -72 -243 -25 109 -127 -141 151 -29 147 231 10 -40 72 125 -130 124
6869 124 212 -6 -8 251 -108 27 37 226 -52 162 -43 -101 -54 -28 258 210 131 -42 -312 87 93 -98 107 -284
6893 -284 266 28 -44 -86 -35 143 -75 -118 -179 2 63 273 146 -114 -71 -432 -91 -36 100 -179 257 -88 -132
6916 -132 84 59 70 67 -14 -338 -111 -83 31 -46 280 112 -72 -224 -38 29 -24 -107 77 -82 157 48 -87
6939 -87 -124 11 173 15 101 -271 200 58 -53 44 -265 -62 184 -111 -103 109 -57 92 -57 36 218 92
6961 92 -90 -22 18 -3 111 -11 -40 273 80 -26 104 -240 74 -23 -310 80 -206 -1 -317 -47 157 46
6983 46 117 -12 -103 62 101 -65 109 -49 78 75 -68 279 185 18 9 104 -35 52 -170 -20 -209 -186 -188 -137 210
7008 210 85 20 -10 -89 148 -102 -119 184 -48 287 99 29 -200 313 -76 34 90 -88 104 17 142 -221
7030 -221 82 -101 -21 16 -42 103 15 -206 94 146 211 78 -14 143 61 -70 27 224 158 235 236 48 -85 -160 12
7055 12 110 -12 -43 133 -139 -91 -210 -111 80 148 -73 -4 90 30 -162 -105 119 -69 -202 59 -11 -196 82 114
7079 114 -177 -86 -47 237 -47 127 62 137 52 42 -58 -415 28 -170 -10 -1 -117 53 187 -58 -6 7 27 208
7103 208 26 110 11 295 36 -75 142 119 49 -7 39 -105 217 -178 65 218 -46 36 -69 -33 41 -187 62
7126 62 -332 194 -186 23 277 56 -181 23 -20 302 50 4 247 145 -13 60 -19 233 57 43 -55 -187
7148 -187 51 -40 -155 -53 33 -62 198 -151 101 -386 -205 188 107 -67 310 -73 -251 -308 62 -58 256 -211
7170 -211 293 -229 -123 86 -68 120 -82 65 -33 7 196 -232 -29 -109 131 -112 -97 -122 -210 -348 -99 188
7192 188 -113 194 -196 39 116 -151 143 -55 -17 -99 -27 27 83 63 238 -118 -46 -12 -32 150 53 191 -173 277
7216 277 -350 -154 211 76 -274 27 -234 126 -71 -254 73 -202 -2 -98 211 -116 -126 206 -95 -45 185
7237 185 53 -71 8 -109 64 163 -23 -107 -32 -13 -161 -190 -1 88 -21 -61 -68 108 -79 23 -61 329 -30 291
7261 291 116 -252 -276 -35 30 -138 2 -40 -8 -127 184 -151 55 -157 200 117 -36 29 104 85 -24 29 -94
7284 -94 138 75 37 -55 -15 49 128 168 25 148 -84 0 169 134 84 -342 -114 101 2 -58 -157 59 194 -50 -8
7309 -8 80 -88 -105 -120 -39 0 105 -326 7 -145 -40 31 74 57 -173 179 102 -59 -1 16 -116 -109 54 -379 -308
7334 -308 -18 -47 42 206 274 127 232 -239 -173 48 86 -132 18 82 -178 152 34 22 93 20 62 155 6 226
7358 226 37 -103 -13 206 -9 13 40 -201 123 36 -56 -9 -201 -162 116 -169 -50 114 -72 -97 79 -222 92
7381 92 53 -243 182 -5 58 26 108 -64 -56 -104 31 153 -21 2 -47 135 -85 358 -94 -228 82 -64 77
7404 77 171 -89 258 27 -179 105 -272 122 -141 119 -330 -39 -140 -208 148 159 129 -5 49 -15 -182 7
7426 7 -2 149 36 165 38 -83 37 94 161 -105 -169 -102 -198 -225 223 34 190 -271 -115 208 -159 53 -202
7449 -202 -509 362 -74 368 17 -308 -307 376 -151 -61 -277 104 70 224 78 0 -56 -41 88 -19 151 -62
7471 -62 276 -206 75 -236 -105 213 123 72 -75 -70 -404 -73 -62 248 61 -169 9 129 83 -110 210 -314
7493 -314 -79 56 76 364 94 33 -82 -156 85 -65 113 116 67 186 167 113 -114 282 212 -2 40 -349 443
7516 443 97 25 -1 248 -9 -11 113 209 -24 16 190 -84 -30 43 225 -288 -102 30 -59 -368 -142 139 -207
7539 -207 187 33 -80 -180 85 -234 132 105 66 223 202 -4 -63 23 112 321 30 67 23 143 245 95 -178
7562 -178 -116 -142 -51 -227 22 172 197 -23 176 66 106 195 -107 231 17 -134 -80 36 -134 -93 159 -161 -224
7585 -224 -260 131 -26 -437 -74 -83 -57 122 323 -15 6 -94 19 -98 -58 102 100 150 151 3 -60 -57 68 77 -101
7610 -101 53 -203 136 109 -118 -193 50 16 -168 43 -13 168 -58 -41 194 277 76 -134 -200 -100 -144 61 -103
7633 -103 47 -122 2 14 -58 -205 81 54 280 114 -368 -148 -415 -78 -369 -115 -111 -154 44 22 158 284
7655 284 127 -41 -310 88 214 -122 184 15 62 -91 14 249 -87 249 105 -226 -18 47 -237 -103 -166
7676 -166 -136 86 -143 -170 -106 0 -5 103 -18 -1 -34 17 -173 26 -28 -144 268 -105 74 -143 5 137 203
7699 203 51 -92 81 -184 -6 -210 165 11 -120 164 -105 -140 -32 -78 -226 -217 -7 -51 19 172 233 -83
7721 -83 -185 38 64 -187 -85 249 -71 -231 39 -367 -410 -220 -330 7 0 216 136 99 111 -131 99 77 68 -110
7745 -110 69 -133 -84 -19 -235 255 -121 88 105 -159 -380 97 -154 -68 110 77 28 232 -53 -102 -45 -220 177
7768 177 149 185 -39 -273 85 307 -76 -181 7 163 166 67 148 107 -109 98 -59 -8 234 -8 249 27 171
7791 171 92 25 -127 176 -98 -34 -104 -119 150 -203 220 -111 83 -66 64 28 -153 -18 -19 20 -39 69 13 -222
7815 -222 -158 -18 42 189 -54 37 161 -84 -100 240 -8 -12 -27 -59 126 99 -159 -42 -133 77 313 24 -187
7838 -187 -137 -20 -16 123 -251 -140 -200 -133 -280 67 248 -103 121 235 52 -216 -159 150 175 117 -10 -34 20
7861 20 -35 -149 15 289 -1 114 -38 -4 -239 -50 -116 261 -202 -51 -79 122 61 -164 -10 69 122 -17 93
7884 93 49 79 32 103 -147 79 -122 124 -35 -195 102 -50 113 155 393 75 -10 185 -357 -241 11 101 139
7907 139 23 -145 45 10 288 73 154 -125 -4 194 40 -13 -16 42 -19 42 -13 173 140 -64 -111 -74 -113 61
7931 61 38 -36 95 -92 115 -13 141 101 -49 101 205 -339 53 -127 -23 -167 -47 168 -198 -124 58 184
7953 184 -39 -37 285 236 165 -277 25 151 221 45 -211 -106 249 133 -300 -89 263 -28 29 222 -20 -177
7975 -177 -95 121 12 196 -83 19 114 -141 148 -221 10 -48 102 -80 99 48 341 80 284 -80 313
7996 313 -60 159 345 -15 -104 -107 41 12 -227 50 -367 -161 -80 87 -182 59 148 -171 181 135 19 -162
8018 -162 -49 -200 -132 -14 90 -109 -6 100 99 -37 -68 137 21 -5 177 -351 132 -5 -70 -36 -15 -165 -198
8041 -198 11 118 63 12 -38 -52 -57 122 69 -79 210 -114 -78 5 -104 170 49 -27 -265 -46 200 31 -97
8064 -97 -171 -271 -217 -23 16 -16 -99 73 -86 -119 24 192 187 115 -76 -48 229 15 156 -264 21 28 22 -39 -111 -124
8090 -124 -91 -189 -1 128 -52 68 -55 305 16 -128 52 -7 57 -29 -58 -10 24 99 47 98 -170 -29 -150 -253
8114 -253 -45 -115 108 138 -16 -78 270 9 0 120 -191 56 -1 -285 78 141 132 -109 -80 27 -62 -57 70 56 268
8139 268 190 -121 88 -75 50 73 113 -67 -93 96 -40 443 35 432 -157 -178 97 58 58 -288 10 282 124
8162 124 -20 29 188 -139 -52 72 -325 11 -119 -100 307 -339 72 -10 -86 309 -133 200 -39 -6 148 0
8184 0 214 -13 117 25 291 78 -10
8191a0
##END NTUPLES=NMR FID
##END=
