##TITLE=1H_Ad-NHP7(bat2)-PE-2
 CCl4
 8 sc, 
 17.5.2023
##JCAMPDX= 6.0         $$ Bruker NMR JCAMP-DX V2.0
##DATA TYPE= NMR FID
##DATA CLASS= NTUPLES
##ORIGIN= UXNMR, Bruker Analytische Messtechnik GmbH
##OWNER= root
$$ XWIN-NMR		Version 3.5
$$ Wed May 17 14:46:18 2023 Russian Standard Time (UT+4h)  she@DPX200
##.OBSERVE FREQUENCY= 200.13135
##.OBSERVE NUCLEUS= ^1H
##.DELAY= (6, 6)
##.ACQUISITION MODE= SIMULTANEOUS
##.ACQUISITION SCHEME= undefined
##.AVERAGES= 8
##.DIGITISER RES= 18
##SPECTROMETER/DATA SYSTEM= spect
##.PULSE SEQUENCE= zg30
##.SOLVENT NAME= CDCl3
##.SHIFT REFERENCE= (INTERNAL, CDCl3, 0, 15.7039)
##AUDIT TRAIL= $$ (NUMBER, WHEN, WHO, WHERE, WHAT)
$$ ##TITLE= Audit trail, XWIN-NMR		Version 3.5
$$ ##JCAMPDX= 5.01
$$ ##ORIGIN= Bruker BioSpin GmbH
$$ ##OWNER= she
$$ F:/spectra/data/she/nmr/H-F/1/audita.txt
$$ ##AUDIT TRAIL=  $$ (NUMBER, WHEN, WHO, WHERE, WHAT)
(   1,<2023-05-17 14:43:15.18 +0400>,<she>,<DPX200>,
      <created by zg, POWCHK disabled, PULCHK disabled
       configuration hash MD5:
       00 E9 B6 7A A2 85 ED C7 34 08 36 98 17 FE 4E 26
       data hash MD5: 16K
       AA CE AE 57 D3 F0 48 2A 8E C1 CF 29 47 0B 49 CF>)
$$ ##END=
$$ 
$$ hash MD5
$$ D1 D4 E6 B4 34 D0 F2 21 23 10 46 65 F3 F4 BF FC
##$RELAX= 
##$RELAX= 
##$RELAX= 
##$RELAX= 
##$RELAX= 
##$RELAX= 
$$ Bruker specific parameters
$$ --------------------------
##$DU= <F:/spectra>
##$EXPNO= 1
##$NAME= <H-F>
##$PROCNO= 1
##$TYPE= <nmr>
##$USER= <she>
##$AMP= (0..31)
100 100 100 100 100 100 100 100 100 100 100 100 100 100 100 100 100 100 
100 100 100 100 100 100 100 100 100 100 100 100 100 100 
##$AQSEQ= 0
##$AQ_mod= 1
##$AUNM= <au_zg>
##$AUTOPOS= <>
##$BF1= 200.13
##$BF2= 200.13
##$BF3= 200.13
##$BF4= 200.13
##$BF5= 200.13
##$BF6= 200.13
##$BF7= 200.13
##$BF8= 200.13
##$BYTORDA= 1
##$CFDGTYP= 0
##$CFRGTYP= 5
##$CHEMSTR= <none>
##$CNST= (0..31)
1 1 145 1 1 1 1 1 1 1 1 1 1 1 1 1 1 1 1 1 1 1 1 1 1 1 1 1 1 1 1 1 
##$CPDPRG= <>
##$CPDPRG1= <>
##$CPDPRG2= <>
##$CPDPRG3= <>
##$CPDPRG4= <mlev>
##$CPDPRG5= <mlev>
##$CPDPRG6= <mlev>
##$CPDPRG7= <mlev>
##$CPDPRG8= <mlev>
##$CPDPRGB= <>
##$CPDPRGT= <>
##$D= (0..31)
0 1.2 0 0 0 0 0 0 0 0.06 0 0.03 0 0 0 0 0.0002 0 0 0 0 0 0 0 0 0 0 0 0 
0 0 0 
##$DATE= 1684320194
##$DBL= (0..7)
120 120 120 120 120 120 120 120 
##$DBP= (0..7)
150 150 150 150 150 150 150 150 
##$DBP07= 0
##$DBPNAM0= <>
##$DBPNAM1= <>
##$DBPNAM2= <>
##$DBPNAM3= <>
##$DBPNAM4= <>
##$DBPNAM5= <>
##$DBPNAM6= <>
##$DBPNAM7= <>
##$DBPOAL= (0..7)
0.5 0.5 0.5 0.5 0.5 0.5 0.5 0.5 
##$DBPOFFS= (0..7)
0 0 0 0 0 0 0 0 
##$DE= 6
##$DECBNUC= <off>
##$DECIM= 32
##$DECNUC= <off>
##$DECSTAT= 4
##$DIGMOD= 1
##$DIGTYP= 9
##$DL= (0..7)
0 120 120 120 120 120 120 120 
##$DP= (0..7)
150 150 150 150 150 150 150 150 
##$DP07= 0
##$DPNAME0= <>
##$DPNAME1= <>
##$DPNAME2= <>
##$DPNAME3= <>
##$DPNAME4= <>
##$DPNAME5= <>
##$DPNAME6= <>
##$DPNAME7= <>
##$DPOAL= (0..7)
0.5 0.5 0.5 0.5 0.5 0.5 0.5 0.5 
##$DPOFFS= (0..7)
0 0 0 0 0 0 0 0 
##$DQDMODE= 0
##$DR= 18
##$DS= 0
##$DSLIST= <SSSSSSSSSSSSSSS>
$$ [...]
##$SUBNAM2= <"">
##$SUBNAM3= <"">
##$SUBNAM4= <"">
##$SUBNAM5= <"">
##$SUBNAM6= <"">
##$SUBNAM7= <"">
##$SUBNAM8= <"">
##$SUBNAM9= <"">
##$SW= 18.05172834244
##$SWIBOX= (0..15)
0 0 2 0 0 0 0 0 0 0 0 0 0 0 0 0 
##$SW_h= 3612.71676300578
##$TD= 16384
##$TD0= 1
##$TE= 0
##$TE2= 300
##$TE3= 300
##$TEG= 300
##$TL= (0..7)
0 120 120 120 120 120 120 120 
##$TP= (0..7)
150 150 150 150 150 150 150 150 
##$TP07= 0
##$TPNAME0= <>
##$TPNAME1= <>
##$TPNAME2= <>
##$TPNAME3= <>
##$TPNAME4= <>
##$TPNAME5= <>
##$TPNAME6= <>
##$TPNAME7= <>
##$TPOAL= (0..7)
0.5 0.5 0.5 0.5 0.5 0.5 0.5 0.5 
##$TPOFFS= (0..7)
0 0 0 0 0 0 0 0 
##$TUNHIN= 0
##$TUNHOUT= 0
##$TUNXOUT= 0
##$USERA1= <user>
##$USERA2= <user>
##$USERA3= <user>
##$USERA4= <user>
##$USERA5= <user>
##$V9= 5
##$VALIST= <valist>
##$VCLIST= <CCCCCCCCCCCCCCC>
##$VD= 0
##$VDLIST= <DDDDDDDDDDDDDDD>
##$VPLIST= <PPPPPPPPPPPPPPP>
##$VTLIST= <TTTTTTTTTTTTTTT>
##$WBST= 1024
##$WBSW= 4
##$XGAIN= (0..3)
0 0 0 0 
##$XL= 0
##$YL= 0
##$YMAX_a= 346364
##$YMIN_a= -336641
##$ZGOPTNS= <>
##$ZL1= 120
##$ZL2= 120
##$ZL3= 120
##$ZL4= 120
##$ABSF1= 10
##$ABSF2= 0
##$ABSG= 5
##$ABSL= 3
##$ALPHA= 0
##$AQORDER= 0
##$ASSFAC= 0
##$ASSFACI= 0
##$ASSFACX= 0
##$ASSWID= 0
##$AUNMP= <proc_1d>
##$AZFE= 0.1
##$AZFW= 0.1
##$BCFW= 1
##$BC_mod= 2
##$BYTORDP= 1
##$COROFFS= 0
##$CY= 11.3945322036743
##$DATMOD= 1
##$DC= 2
##$DFILT= <>
##$DTYPP= 0
##$F1P= 15.7292609196834
##$F2P= 12.9074282941183
##$FCOR= 0.5
##$FTSIZE= 0
##$FT_mod= 4
##$GAMMA= 1
##$GB= 0.15
##$INTBC= 1
##$INTSCL= 1
##$ISEN= 128
##$LB= 0.24
##$LEV0= 0
##$LPBIN= 0
##$MAXI= 10000
##$MC2= 0
##$MEAN= 0
##$ME_mod= 0
##$MI= 1.114404
##$NCOEF= 0
##$NC_proc= 0
##$NLEV= 6
##$NOISF1= 3.799351
##$NOISF2= 2.8
##$NSP= 1
##$NTH_PI= 0
##$NZP= 0
##$OFFSET= 15.70392
##$PC= 1
##$PHC0= -19894.18
##$PHC1= 5.252718
##$PH_mod= 1
##$PKNL= yes
##$PPARMOD= 0
##$PSCAL= 0
##$PSIGN= 0
##$REVERSE= no
##$SF= 200.130013532006
##$SI= 16384
##$SIGF1= 3
##$SIGF2= 2
##$SINO= 400
##$SIOLD= 16384
##$SREGLST= <1H.CDCl3>
##$SSB= 0
##$STSI= 0
##$STSR= 0
##$SW_p= 3612.71676300578
##$SYMM= 0
##$S_DEV= 0
##$TDeff= 0
##$TDoff= 0
##$TI= <>
##$TILT= no
##$TM1= 0
##$TM2= 0
##$TOPLEV= 0
##$USERP1= <user>
##$USERP2= <user>
##$USERP3= <user>
##$USERP4= <user>
##$USERP5= <user>
##$WDW= 1
##$XDIM= 8192
##$YMAX_p= 0
##$YMIN_p= 0
$$ End of Bruker specific parameters
$$ ---------------------------------
##NTUPLES= NMR FID
##VAR_NAME=  TIME,          FID/REAL,        FID/IMAG
##SYMBOL=    X,             R,               I
##VAR_TYPE=  INDEPENDENT,   DEPENDENT,       DEPENDENT
##VAR_FORM=  AFFN,          ASDF,            ASDF
##VAR_DIM=   8192,          8192,            8192
##UNITS=     SECONDS,       ARBITRARY UNITS, ARBITRARY UNITS
##FACTOR=    0.0002768,     1,               1
##FIRST=     0,             0,               0
##LAST=      2.2672688,     0,               0
##MIN=       0,             -336641,         0
##MAX=       2.2672688,     346364,          0
$$ Real data points
##PAGE= N=1
##DATA TABLE= (X++(R..R)), XYDATA
$$ [...]
$$ plain form
2055 883 329 -1444 1240 183 -1223 378 -162 -599 -134 -781 494 -379 -1267 1402 -341 -1279 1067
2072 1067 -201 -132 279 -393 1113 -58 -316 1647 -319 -530 1203 -429 212 261 -212 1059 -405
2089 -405 -678 1286 -623 -700 535 -514 0 -643 -467 597 -1475 -844 1351 -1012 -773 796 -161
2106 -161 115 95 586 1012 -1104 197 1555 -1052 92 1003 -287 392 -401 44 708 -1401 122 1146
2124 1146 -1587 -151 178 -348 -73 -1210 506 838 -1701 189 1131 -1462 -81 363 171 115 -661
2141 -661 1267 865 -1373 1032 1257 -783 609 426 223 549 -691 689 471 -1256 420 123 -1140
2158 -1140 260 -536 -100 35 -1590 557 211 -1602 887 79 -665 517 -138 364 5 -711 1323
2175 1323 69 -919 1672 153 -584 855 76 454 126 -159 1292 -715 -611 1209 -619 -898 470
$$ packed form
2055H83n54j773K684j057j406J601n40m37M65o47J275q73q88K669j743r38K346
2072A067j268O9M11o72J506j171k58J963j966k11J733j632O41M9m73J271j464
2089d05k73J964j909p7J235j049N14o43J76J064k072O31K195k363K39J569r57
2106a61K76k0M91M26k116J301J358k607J144R11j290O79p93M45O64k109J523J024
2124A146k733J436L29n26K75j137J716L32k539J890R42k593J381M44j92n6p76
2141f61J928m02k238K405K25k040J392j83k03L26j240J380k18j727J676k97j263
2158a140J400p96M36J35j625K147l46j813K489q08p44J182o55N02l59p16K034
2175A323j254r88K591j519p37J439p79L78l28k85J451k007J04J820j828k79J368
$$ plain form
2192 470 -415 -6 -549 -626 971 -1223 -916 1194 -446 -544 98 131 736 -857 108 1797 -792 -419 1769
2211 1769 -202 -200 341 508 559 -1205 261 1301 -1189 -285 835 -831 -240 -534 -34 537 -1238 -145
2229 -145 893 -1327 -242 609 -341 -11 -387 489 795 -928 681 1250 -653 326 844 -133 211 -154
2247 -154 614 538 -971 938 594 -1575 238 73 -719 -158 -483 68 63 -1148 640 -101 -1341 552
2265 552 68 -64 422 -463 796 57 -906 1053 661 -935 741 601 223 227 -308 1053 -304 -1151 1344
2284 1344 -337 -1028 806 -335 -493 -263 -145 694 -698 -960 1292 -774 -1001 655 -233 -172 -79 31
2302 31 1377 -502 -493 1632 158 -571 806 352 611 -419 -172 1410 -752 -899 1276 -697 -694 68
2320 68 -108 353 -857 -288 681 -954 -519 669 -762 -141 113 -255 285 -718 119 1164 -354 123
$$ packed form
2192D70q85M09n43p7J597k194L07K110j640r8O42L3O05j593R65J689k589L73K188
2211A769j971KN41J67N1j764J466J040k490R04J120j666N91k94N00N71j775J093
2229a45J038k220J085Q51r50L30l76Q76L06j723J609N69j903R79N18r77L44l65
2247a54P68p6j509J909l44k169J813j65p92N61l25N51nj211J788p41j240J893
2265E52m84j32M86q85J259p39r63J959l92j596J676j40l78Mn35J361j357q47K495
2284A344j681o91J834j141j58K30J18Q39j392k62K252k066k27J656q88O1R3J10
2302C1J346j879RK125j474p29J377m54K59j030K47J582k162j47K175j973LP62
2320F8j76M61j210N69R69j635M35J188j431O21K54l68N40j003Q37J045j518M77
$$ plain form
2338 123 885 -410 759 296 77 658 -494 103 808 -942 342 521 -1005 74 -344 -328 -439 -987
2356 -987 521 -38 -1371 673 333 -1048 208 183 119 65 -551 1187 308 -851 922 390 -327 584
2374 584 -224 711 120 -793 929 320 -794 578 243 -262 -551 -304 671 -288 -1303 430 -272 -1216
2392 -1216 435 134 -580 63 -118 955 18 -407 987 122 -133 724 -73 289 234 -343 797 -140 -543
2411 -543 849 -542 -497 388 -366 -74 -393 -575 795 -678 -862 873 -472 -595 42 -407 53 -183
2429 -183 3 917 -578 -80 884 -343 357 591 -286 657 33 16 571 -784 115 535 -602 170 -190
2448 -190 -135 75 -691 -253 432 -1131 -38 287 -1170 -70 298 -251 43 -338 655 419 -899 781
2466 781 796 -558 398 324 194 271 -209 518 372 -839 593 238 -670 219 -152 -177 -7 -1120 357 7
$$ packed form
2338A23P62j295J169m63k19N81j152N97P05j750J284J79j526J079m18J6j11n48
2356i87J508n59j333K044l40j381J256k5o4n4o16J738q79j159J773n32p17R11
2374E84q08R35n91r13J722o09j114J372l35n05k89K47R75r59j015J733p02r44
2392a216J651l01p14O43j81J073r37m25J394q65k55Q57p97L62n5n77J140r37m03
2411e43J392j391M5Q85p54K92l19j82J370j473j84J735j345j23O37m49M60k36
2429a83J86R14j495M98R64j227P00K34q77R43o24j7N55j355Q99M20j137P72l60
2448a90N5K10p66M38O85j563J093L25j457J100L68n49K94l81R93k36j318J680
2466G81J5j354R56p4j30P7m80P27j46j211J432l55r08Q89l71k5J70j113J477l50
$$ plain form
2486 7 -1285 295 157 -223 -456 -144 796 -36 -891 693 285 -645 801 236 -102 440 -174 428 367 -448
2506 -448 635 -28 -345 415 -387 -27 372 -712 -78 -213 -638 99 -389 -418 304 -509 -83 210 -416 424
2526 424 -338 -233 900 -407 -43 1055 108 124 368 14 598 -549 39 925 -725 -163 430 -549 -60
2545 -60 10 -467 758 -722 -384 543 -671 -396 302 -460 152 -457 49 833 -414 255 802 -345 111
2564 111 641 181 635 -288 266 788 -571 154 738 -483 169 29 -79 71 -674 -44 376 -941 125
2583 125 137 -704 197 -546 143 310 -1090 81 653 -532 427 529 31 304 147 258 368 -558 692
2602 692 511 -458 639 -58 -502 344 -409 -168 -82 -712 264 -166 -740 642 -623 -76 371 -509 471
2621 471 258 -439 488 18 -308 476 -240 147 603 -74 614 -195 -387 667 -75 -256 730 -88 -261 116
$$ packed form
2486Gj292J580j38l80k33L12R40q32q55J584m08r30J446n65l38N42o14O02o1q15
2506d48J083o63l17P60q02L60L99j084O34j35m25P37m88k9P22q13M26K93o26Q40
2526D24p62J05J133j307L64J098r47J6K44l54N84j147N88Q86j650N62N93r79M89
2545f0P0m77J225j480L38R27j214K75O98p62O12o09N06P84j247O69N47j147M56
2564A11N30m60M54r23N54N22j359P25N84j221O52j40j08J50p45O30M20j317J066
2583A25J2q41R01p43O89J67j400J171N72j185R59J02m98K73j57J11J10r26J250
2602F92j81r69J097o97m44Q46p53K41Q6o30R76m30n74J382j265N47M47q80R80
2621D71k13o97R27m70l26P84p16L87M56o77O88q09j92J054p42j81R86q18j73L77
$$ plain form
2641 116 -227 163 -735 -359 627 -637 -580 387 -468 -56 -92 -293 605 -591 -378 738 -250 -154 390 152
2661 152 581 225 326 1138 -284 -101 841 -292 11 181 -40 340 -738 -374 627 -873 -62 282
2679 282 -754 -72 -150 -193 425 -419 -287 580 -453 82 340 -82 380 99 -60 364 -341 713 250 -695
2699 -695 198 555 -508 334 51 123 262 -673 192 -151 -1040 482 25 -891 170 -182 -79 187 -777
2718 -777 554 126 -730 609 -64 -118 299 -18 390 305 -497 774 55 -446 669 -23 -308 97 -245
2737 -245 292 -102 -770 378 -479 -922 513 -157 -114 -74 -625 195 -373 -512 733 -436 -107 703 -145
2756 -145 192 271 -366 707 49 -207 1011 -79 -86 397 16 162 -352 -530 569 -528 -520 654 -668
2775 -668 -169 188 -478 146 -233 -169 480 -734 -100 538 -598 251 322 -324 619 -103 -206 527 -366 202
$$ packed form
2641A16l43L90q98L76R86j264N7R67q55M12l6k01Q98j196K13J116r88R6N44k38
2661A52M29l56J01Q12j422J83R42j133L03J70k21L80j078L64J001j500Q11L44
2679B82j036O82p8m3O18q44J32Q67j033N35K58m22M62k81j59M24p05J054m63r45
2699f95Q93L57j063Q42k83P2J39r35Q65l43q89J522m57r16J061l52J03K66r64
2718g77J331m28q56J339o73n4M17l17M08q5q02J271p19n01J115o92k85M05l42
2737b45N37l94o68J148q57m43J435o70M3M0n51Q20n68j39J245j169L29Q10q48
2756a45L37P9o37J073o58k56J218j090pM83l81J46n14j78J099j097QJ174j322
2775f68M99L57o66O24l79O4O49j214O34O38j136Q49P1o46R43p22j03P33q93N68
$$ plain form
2795 202 676 -456 551 163 -292 469 -270 -142 240 -893 136 69 -690 201 -105 -384 73 -385 202
2814 202 156 -560 621 380 -726 710 556 105 141 -542 715 82 -605 451 407 -398 196 -267 96
2833 96 121 -780 295 212 -909 254 78 -114 -260 -443 193 -147 -979 284 51 -633 551 26 -77
2852 -77 499 -216 315 490 -493 643 58 -288 538 -108 96 578 -442 281 26 -492 266 -570 -283 129
2872 129 -509 117 -28 -447 250 -380 -341 501 -412 -147 208 -199 191 258 34 398 -65 244 852 -401
2892 -401 -43 314 -239 220 -111 -251 403 -444 -217 518 -620 -218 175 -660 37 -224 -167 506 -398 -185
2912 -185 522 -361 260 391 -325 325 28 310 419 -472 336 372 -465 797 135 -124 220 -630 100 438
2932 438 -693 286 175 -691 -55 -323 -125 -16 -702 56 331 -665 294 284 -421 283 -133 365 604 -390
$$ packed form
2795B02M74j132J007l88m55P61p39J28L82j133J029o7p59Q91l06k79M57m58N87
2814B02m6p16J181k41j106J436j54m51L6o83J257o33o87J056m4q05N94m63L63
2833I6K5r01J075q3j121J163j76j92j46j83O36l40q32J263k33o84J184n25j03
2852g7N76p15N31J75r83J136n85l46Q26o46K04M82j020P23k55n18P58q36K87M12
2872A29o38O26j45m19O97o30L9Q42r13K65L55m07L90O7k24L64m63L09O08j253
2892d01L58L57n53M59l31j40O54q47K27P35j138M02L93q35O97k61N7O73r04K13
2912a85P07q83O21J31p16O50k97K82J09q91Q08L6q37J262o62k59L44q50P30L38
2932D38j131R79j11q66O36k68J98J09o86P58K75r96R59j0p05P04m16M98K39r94
$$ plain form
2952 -390 517 380 -102 533 -166 330 489 -494 176 379 -721 373 -307 -529 430 -557 -383 24 -841
2971 -841 -115 19 -535 290 -427 -422 766 -244 198 330 -481 510 72 -155 561 -24 -281 621 -53 -100
2991 -100 304 -279 524 -261 -330 689 -593 -264 188 -479 -85 -219 -487 381 -662 -483 499 -250 -397
3010 -397 229 -130 28 -37 136 962 -160 -166 759 236 67 542 64 399 -174 36 379 -732 -67 471
3030 471 -331 164 -17 -499 169 -525 -221 544 -506 245 368 -243 234 -197 -52 463 -367 267 712 -448
3050 -448 472 411 -147 444 -221 124 335 -615 143 265 -517 483 -264 -476 198 -231 -87 215 -393 83
3070 83 -143 -496 369 144 -280 216 -68 434 161 -372 414 128 -168 523 209 98 474 -127 453 33
3090 33 -387 625 -225 -229 365 -344 -462 -37 -482 165 -317 -605 454 -94 -350 531 -347 -6 67 -35 612
$$ packed form
2952c90R07j37m82O35o99M96J59r83O70K03j100J094o80k22R59r87J74M07q65
2971h41P26J34n54Q25p17NJ188j010M42J32q11R91m38k27P16n85k57R02o74m7
2991a00M04n83Q03p85o9J019j282L29M52o67L94j34k68Q68j043J79R82p49j47
3010c97O26l59J58o5J73Q26j122oR25n23j69M75m78L35n73K10L43j111O65N38
3030D71q02M95j81m82O68o94L04P65j050P51J23o11M77m31J45N15q30O34M45j160
3050d48R20o1n58N91o65L45K11r50P58J22p82J000p47k12O74m29J44L02o08M76
3070H3k26l53Q65k25m24M96k84N02k73n33P86k86k96O91l14j11L76o01N80m20
3090C3m20J012q50mN94p09j18M25m45O47m82k88J059n48k56Q81q78L41P3j02O47
$$ plain form
3111 612 -90 -45 659 -84 -162 507 85 361 -111 118 829 -458 -270 743 -267 3 275 -347 -25 -307
3131 -307 -395 -26 -403 -372 363 -264 60 27 -406 440 -253 -153 801 -78 182 130 -34 306 321 -164 742 64
3153 64 -182 495 -556 239 72 -560 196 -96 -149 135 -500 -72 102 -803 499 195 -654 248 87 78 -41
3174 -41 -216 563 224 -610 433 539 -326 246 43 197 213 -482 295 110 -395 311 -22 -358 48 -447
3194 -447 230 -209 -497 262 31 -720 256 -174 -128 46 -184 489 -171 -333 623 -15 -215 583 53 171
3214 171 165 -204 569 -70 -362 497 -32 -358 212 -394 -73 -289 -537 480 -571 -413 450 -667 -294 197
3234 197 -539 180 95 -7 429 -324 -83 435 0 56 547 -111 224 -7 -12 469 -467 6 386 -399 -17
3255 -17 117 -465 -53 -372 -114 170 -831 -37 306 -860 4 156 43 104 -39 263 305 -557 709 361
$$ packed form
3111F12p02M5P04p43p8O69m22K76m72K29P11j287J88J013j010K70K72o22L22k82
3131c07q8L69l77L1P35o27L24l3m33Q46o93J00R54q79K60n2j64L40J5m85R06o78
3153F4k46O77j051P95j67o32P56k92n3K84o35M28J74r05J302l04q49R02j61rj19
3174d1j75P79l39q34J043J06q65N72k03J54J6o95P77j85n05P06l33l36M06m95
3194d47O77m39k88P59k31p51R76m30M6J74k30O73o60j62R56o38k00P98n30J18
3214A71ol69P73o39k92Q59n29l26N70o06L21k16k48J017j051J58Q63j117L73M91
3234A97p36P19q5j02M36p53K41N18m35N6M91o58L35k31nM81r36M73L80p85L82
3255a7J34n82M12l19K58K84j001P94L43j166Q64J52j13O1j43L02M2q62J266l48
$$ plain form
3275 361 -357 604 278 33 33 -350 379 355 -597 322 254 -402 259 1 -262 -108 -634 259 -1 -889 387
3296 387 -142 -241 2 -30 -40 -91 -254 757 102 -264 792 -66 -218 353 -94 108 119 -195 283 91 -100
3317 -100 248 -185 -113 214 -345 -46 -38 -464 93 -365 -276 308 -275 -135 226 -81 92 -80 6 351 -445 172
3339 172 670 76 -57 401 -34 261 -210 231 492 -542 -102 598 -239 -293 -17 -180 39 -528 4 363
3359 363 -552 -111 108 -246 -266 -213 66 258 -406 122 559 -264 168 185 21 410 109 156 343 -429 431
3380 431 304 -399 266 159 -317 224 -22 -20 42 -449 10 -56 -483 110 -55 -94 -73 -363 150 461 -227 154
3402 154 282 -170 435 -158 293 272 -194 360 117 -472 352 -10 -480 77 15 21 -37 -175 105 -304 -333 532
3424 532 2 -603 338 -321 -189 -84 -7 474 -139 -329 752 -166 -225 746 69 20 341 47 505 -252 5
$$ packed form
3275C61p18R61l26k45%l83P29k4r52R19o8o56O61k58k63J54n26Q93k60q88J276
3296C87n29r9K43l2j0n1j63J011o55l66J056q58j52N71m47K02J1l14M78j92j91
3317a00L48m33P2L27n59K99Qm26N57m58Q9N84n83J40L61l07J73j72Q6L45p96O17
3339A72M98n94j33M58m35K95m71M41K61j034M40P00q37n4K76j63K19n67N32L59
3359C63r15M41K19l54k0N3K79J92o64N28M37q23M32J7j64L89l01M7J87p72Q60
3380D31j27p03O65j07m76N41k46KO2m91M59o6m27N93j65l9K1k90N13L11o88L81
3402A54J28m52O05n93M51k1m66N54k43n89Q24l62m70N57o2On8j38K80m09k9Q65
3424E32n30o05R41o59J32J05P7M81o13j90J081r18n9R71o77m9L21k94M58p57K57
$$ plain form
3445 5 903 -62 -167 187 -282 -174 -287 -457 530 -477 -301 428 -396 -292 -237 -22 125 -397 -156 423 -102
3466 -102 41 285 -134 369 -66 182 428 -233 251 510 -78 -105 274 -213 163 -204 -352 161 -410 102
3486 102 241 -456 53 -207 -324 286 173 -561 271 -238 74 261 -333 320 -77 -167 638 62 221 202 -140
3507 -140 286 230 -115 367 92 -310 123 -289 -107 -220 -432 238 -204 -394 279 -277 -138 269 -30 270
3527 270 160 -495 591 122 -200 402 -146 134 180 10 431 34 -259 450 1 92 372 -159 -4 -241
3547 -241 -175 377 -303 -345 463 -314 -226 86 -361 -16 75 -24 368 -175 162 437 -213 349 490 113 244 150
3569 150 31 481 -160 69 450 -177 63 52 -211 237 -267 -230 257 -237 -197 216 -276 40 -63 -437 222
3590 222 -126 87 283 -244 334 198 -218 375 -49 -232 314 -284 -26 142 -99 523 100 -487 416 22
$$ packed form
3445EQ98r65j05L54m69J08j13j70R87j007J76P29q24J04N5K15J47n22K41N79n25
3466a02J43K44m19N03m35K48K46o61M84K59n88k7L79m87L76l67j48N13n71N12
3486A02J39o97N09k60j17O10j13p34Q32n09L12J87n94O53l97r0Q05n76J59j9l42
3507a40M26n6l45M82k75m02M33m12J82j13k12O70m42j90O73n56J39M07k99L00
3527B70j10o55J086m69l22O02n48K80M6j70M21l97k93P09m49R1K80n31J55k37
3547b41O6N52o80m2Q08p77Q8L12m47L45R1r9L92n43L37K75o50N62J41l77J31r4
3569A50j19M50o41K29L81o27K40j1k63M48n04L7M87m94M0M13m92L16j03l74O59
3590B22l48K13J96n27N78j36m16N93m24j83N46n98K58J68k41O22m23n87R03l94
$$ plain form
3610 22 -186 -17 -256 -42 195 -728 236 -56 -169 46 -268 51 -245 -289 55 53 -450 515 -32 13 256 -177
3632 -177 209 234 -160 247 137 -201 314 205 -172 191 -332 39 -49 -545 279 -203 -300 305 -236 102 -4
3653 -4 -414 47 -161 -77 26 -171 173 547 -202 34 519 -256 300 193 198 266 -186 -35 452 -252 236 -47
3675 -47 -259 109 -184 -82 171 -301 -162 163 -391 -221 -90 1 159 -102 131 331 -88 136 356 -193 147
3696 147 -120 378 503 -132 296 340 -232 152 195 -285 253 146 -152 138 -396 -281 146 -399 -74 -83 -100 62
3718 62 -175 -10 -27 -199 124 60 -171 366 -108 -94 181 16 165 436 -167 577 -56 -28 164 -257 -4 242
3740 242 -598 -37 -84 -166 338 -167 165 175 -141 -20 53 -366 239 -88 -154 188 226 198 292 -214 446 109 -303
3763 -303 266 91 157 379 -138 190 568 -213 -133 -145 -201 210 -565 -93 94 -456 -217 191 -294 -35 -211
$$ packed form
3610B2k08J69k39K14K37r23R64k92j13K15l14L19k96m4L44kn03R65n47M5K43m33
3632a77L86K5l94M07j10l38N15j09l77L63n23L71q8m96Q24m82r7O05n41L38j06
3653dm10M61k08Q4J03j97L44L74p49K36M85p75N56j07NO8m52J51M87p04M88k83
3675d7k12L68k93J02K53m72J39L25n54J70J31R1J58k61K33K00m19K24K20n49L40
3696A47k67M98J25o35M28M4n72L84M3m80N38j07k98K90n34J15M27n45L25rj7J62
3718F2k37J65j7j72L23o4k31N37m74J4K75j65J49K71o03P44o33K8J92m21K53K46
3740B42q40N61m7q2N04n05L32J0l16J21P3m19O05l27o6L42L8k8R4n06O60l37m12
3763c03N69j75O6K22n17L28L78p81Q0j2n6M11p75M72J87n50K39M08m85K59j76
$$ plain form
3784 -211 1 390 -173 -126 236 -317 230 434 -171 480 -115 14 501 23 49 228 -110 -34 -231 -255 319
3805 319 -221 -33 221 -485 -114 -54 -419 -84 -546 -62 277 -295 -34 123 -207 298 -62 40 291 -327
3825 -327 152 402 -106 225 152 -292 370 44 -109 273 121 13 104 -167 403 -6 -342 351 -383 -236 78
3846 78 -372 -195 205 -56 129 48 161 284 -229 -57 70 -322 216 243 -173 504 -43 -53 284 -113 269
3867 269 108 -375 197 -131 -269 36 -394 -328 -35 -305 -159 96 -368 104 -191 -33 266 -111 410 252
3887 252 -101 191 234 -250 280 144 126 173 -290 159 -130 -410 320 -186 -529 306 -252 -246 85 -142 -59 24
3909 24 -329 79 -240 -369 229 -68 91 96 -87 181 -121 -103 584 -187 27 121 108 136 -7 -200 103 -25
3931 -25 -237 103 -151 -172 -46 -196 -14 -44 -393 239 -314 -271 -48 -127 310 -228 -274 568 149 -45 246 47
$$ packed form
3784b11K12L89n63M7L62n53N47K04o05O51n95J29M87m78K6J79l38P6j97k4N74
3805C19n40J88K54p06L71O0l65L35m62M84L39n72K61J57l30N05l60J02K51o18
3825c27M79K50n08L31p3m44O62l26j53L82j52j08R1k71N70m09l36O93p34J47L14
3846G8m50J77M00k61J85q1J13J23n13J72J27l92N38K7m16O77n47j0L37l97L82
3867B69j61m83N72l28j38L05m30O6K93k70J46K55m64M72k95J58K99l77N21j58
3887B52l53K92M3m84N30j36j8M7m63M49k89k80P30n06l43Q35n58OL31k27Q3Q3
3909B4l53M08l19j29N98k97J59Nj83K68l02J8O87p71K14R4j3K8j43j93L03j28
3931b5k12L40k54k1J26j50J82l0l49O32n53M3K23p9M37n38m6Q42m19j94K91j99
$$ plain form
3953 47 145 134 68 494 -189 45 436 96 61 225 127 7 -16 -331 55 -332 -437 320 -140 -192 -14 -227 48
3976 48 191 -552 301 -469 -171 181 -26 -198 328 -298 227 -63 -333 291 -28 77 279 -67 389 -33
3996 -33 -121 267 -231 -191 -83 -353 -2 -141 -517 -104 -85 -375 171 -99 -172 345 -154 173 158 -347 240 93
4018 93 -397 161 -41 139 87 -268 118 240 -168 401 42 91 152 -160 -89 -156 -291 -187 182 -219 138 -377
4040 -377 -26 32 -387 -33 9 -288 311 -111 -8 339 -86 128 178 -238 382 -22 -203 285 -2 78 -7 -209
4062 -209 -30 -41 -270 50 -305 -177 59 -188 32 93 -483 -67 -32 4 186 -237 152 169 -192 -127 102 -341
4084 -341 208 208 -82 4 -237 190 67 -47 243 16 -245 83 -30 29 -18 -292 -250 150 -286 136 150 -73
4106 -73 88 -73 -39 73 -315 103 140 -148 387 267 77 159 -213 346 172 -222 207 267 -97 290 -202 -278
$$ packed form
3953D7R8j1o6M26o83K34L91l40l5J64r8j20k3l15L86l87j05P57m60n2J78k13K75
3976D8J43p43Q53p70K98L52k07j72N26o26N25k90k70O24l19J05K02l46M56m22
3996c3q8L88m98M0J08k70L51j39l76M13J9k90N46k70p3N17m99L27j5n05N87j47
4018I3m90N58k02J80n2l55L86J22m08N69l59M9O1l12P1o7j35J04L69m01L57n15
4040c77L51N8m19L54M2k97N99m22J03L47m25K14N0m16O20m04j81M88k87Q0q5k02
4062b09J79j1k29L20l55J28K36k47K20O1n76M16L5L6J82m23L89J7l61O5K29m43
4084c41N49%k90Q6k41M27j23j14K90k27k61L28j13N9m7k74M2M00m36M22J4k23
4106g3J61j61L4J12l88M18L7k88N35j20j90Q2l72N59j74l94M29O0l64L87m92p6
$$ plain form
4128 -278 69 -458 -216 -96 -200 406 -304 -294 513 -611 -29 275 -223 136 391 -142 420 178 54 412
4148 412 -130 188 298 -79 19 116 97 255 -37 -127 301 -90 -24 -21 -350 237 -251 -75 334 -404 -34 89
4170 89 -274 139 -154 201 407 -161 30 442 -67 -64 212 -2 263 -80 -79 214 10 42 100 -294 189 179 -236
4193 -236 -25 -267 211 -187 -439 25 -115 -176 -122 78 -332 376 80 89 338 -174 136 172 -412 283 75 105
4215 105 243 -213 153 271 -245 -71 -48 -185 365 -150 -179 288 -509 -82 -39 -222 -149 -229 -171 69 -277 -110
4237 -110 -66 -232 90 -53 -2 224 -68 16 358 -20 211 156 100 288 -28 -64 425 -193 -331 32 58 6 -104
4260 -104 -195 147 -209 -131 570 -221 -225 -39 -281 -42 -185 -242 154 -387 -81 175 40 205 131 -278 333 132
4282 132 -102 212 -33 5 29 -186 -78 -39 -32 135 -212 -132 96 -78 17 -182 -331 194 -167 -304 87 -175
$$ packed form
4128b78L47n27K42J20j04O06p10J0Q07j124N82L04m98L59K55n33N62k42j24L58
4148D12n42L18J10l77R8R7j9J58k92r0M28l91O6Ll29N87m88J76M09p38L70J23
4170H9l63M13k93L55K06n68J91M12n09LK76k14K65l43JK93k04L2N8l94M83j0m15
4193b36K11k42M78l98k52M64j40o1N4K00m10P08k96RK49n12L10L6n84O95k08L0
4215A05J38m56L66J18n16J74K3j37N50n15k9M67p97M27M3j83P3q0N8K40l46J67
4237a10M4j66L22j43N1K26k92Q4L42l78K31n5n6J88l16l6M89o18j38L63K6n2j10
4260a04r1L42l56P8P01p91mJ86k42K39j43n7L96n41L06K56j35J65p4m09O11k01
4282A32k34L14k45L8K4k15J08L9PJ67l47Q0K28j74R5j99j49N25l61j37L91k62
$$ plain form
4304 -175 114 55 89 422 6 -277 280 -211 24 284 -123 248 -123 -372 160 -30 -222 -26 -182 42 -21
4325 -21 -172 -144 92 -253 298 -211 34 107 -244 -84 209 -304 86 276 -428 369 316 381 393 -94 543 162
4347 162 -208 165 54 -263 -30 -76 -297 40 -274 287 -398 -166 170 -448 -415 -114 -254 185 -128 -265 -52
4368 -52 -280 -238 197 18 192 49 -210 331 -161 -115 490 122 143 428 -57 193 172 -16 49 -104 -245 36
4390 36 -65 -133 -179 -308 6 198 -310 -60 -117 -45 114 10 21 46 -12 30 338 219 38 -18 130 81 -237 161
4414 161 36 -286 294 16 -252 261 -289 -252 124 -203 254 69 -434 261 36 133 -21 -264 -19 173 -121
4435 -121 -14 236 -410 106 -144 133 85 47 354 108 -311 -2 164 77 -14 -219 181 53 -243 233 -147
4456 -147 -124 156 -79 108 -124 -203 159 175 -206 367 -5 71 197 -322 313 323 -64 456 309 -202 144 -104
$$ packed form
4304a75K89n9L4L33m16k83N57m91K35K60m07L71l71k49N32j90j92J96j56K24o3
4325b1j51K8K36l45N51n09K45P3l51J60K93n13L90J90p04P97n3O5J2m87O37l81
4347A62l70L73j11l17K33m6k21L37l14N61o85K32L36o18L3L01j40M39l13j37K13
4368e2k28M2M35j79J74j43k59N41m92M6O05l68K1K85m85K50k1j88O5j53j41K81
4390C6j01o8m6j29L14J92n08K50n7P2J59j04J1K5n8M2L08j19j81n6J48m9l18L98
4414A61j25l22N80k78k68N13n50L7L76l27M57j85n03O95k25R7j54k43K45J92k94
4435a21J07K50o46N16k50K77m8l8L07k46m19L09J66q7r1k05M00j28k96M76l80
4456a47K3K80k35J87k32p9L62J6l81N73l72P6J26n19O35J0l87N20j47n11L46k48
$$ plain form
4478 -104 -58 206 -131 56 334 -215 64 -4 -42 147 -200 48 136 -239 131 -11 -97 377 3 -155 182 -132
4500 -132 21 217 69 -16 74 58 109 -135 309 372 -40 36 260 -101 -47 -216 -2 10 -178 79 -76 -36 159
4523 159 -167 -237 -179 -363 59 311 -130 -46 235 95 412 89 24 162 -93 133 260 23 -74 85 207 -5
4545 -5 -13 0 -6 -75 104 -65 -286 196 -68 -244 95 -327 -129 16 -154 217 -35 -357 -23 -98 -48 261 17
4568 17 85 23 -100 -65 49 125 335 81 -34 288 -106 -106 -17 -248 72 -311 -123 142 -59 83 71 -437 -155
4591 -155 -233 -76 208 263 201 445 -282 22 -24 -12 419 26 82 224 -343 -93 172 -422 -173 -151 -25 142
4613 142 -321 -173 226 -318 -7 106 -327 102 -157 -252 266 66 -86 83 -106 76 99 -29 422 51 53
4634 53 199 23 -212 240 -261 50 15 -174 333 84 -153 -137 -283 -88 -298 -227 28 -205 -65 -56 -5 -117
$$ packed form
4478a04M6K64l37J87K78n49K79o8l8J89l47K48Q8l75L70j42q6M74l74j58L37l14
4500a32J53J96j48q5R0j6N1k44M44O3m12P6K24l61N4j69K14J2j88K57j55M0J95
4523A59l26p0N8j84M22K52m41Q4K81j40L17l23o5J38k55K26J27k37r7J59J22k12
4545eqJ3oo9J79j69k21M82k64j76L39m22J98J45j70L71k52l22L34p5N0L09k44
4568A7O8o2j23L5J14P6K10k54j15L22l94%Q9k31L20l83J88K65k01J42j2n08K82
4591a55p8J57K84N5o2K44p27L04m6J2M31l93N6J42n67K50K65n94K49K2J26J67
4613A42m63J48L99n44L11J13m33M29k59r5N18k00j52J69j89J82K3j28M51l71K
4634E3J46j76k35M52n01L11l5j89N07k49k37J6j46J95k10P1K55k33J40RN1j12
$$ plain form
4656 -117 81 -311 233 116 -76 217 -93 -107 203 -149 92 174 23 156 148 222 267 105 -131 45 -253 85
4678 85 -260 -455 159 -118 -118 -38 -181 43 -178 -251 28 -12 -100 242 -225 163 206 -129 204 145 29 233 -23
4701 -23 -60 235 -142 21 -27 -53 -23 3 -311 125 -183 12 0 -238 -74 75 1 127 24 -219 130 -89 -18
4724 -18 381 -121 248 18 -14 124 -90 -63 369 -289 112 76 -220 244 160 -223 92 -210 -117 -40 39 -8 -66
4747 -66 -316 -230 -193 -192 108 -102 28 -164 -30 109 56 -44 228 68 42 312 -10 245 141 -386 57 -88
4769 -88 -82 211 139 104 -162 -73 93 -198 -15 -56 -290 -67 -112 -121 -82 -34 -156 60 89 203 277 -33 121 119 96 22
4795 22 110 200 485 1 145 -154 -102 124 145 -182 126 -27 -26 10 -105 -14 -21 -342 -40 169 -214 -32 -136 103
4819 103 109 -129 19 369 76 141 -7 98 240 -254 -54 187 -135 53 115 -299 -138 -34 106 285 -109
$$ packed form
4656a17J98l92N44j17j92K93l10j4L10l52K41Q2j51J33qP4M5j62k36J76k98L38
4678H5l45j95O14k77%Q0j43K24k21p3K79m0q8L42m67L88M3l35L33n9j16K04k56
4701b3l7K95l77J63m8k6L0K6l14M36l08J95j2k38J64J49p4J26j03k43L49k19P1
4724a8L99n02L69k30l2J38k14K7M32o58M01l6k96M64q4l83L15l02R3P7P9m7n8
4747f6k50Q6L7JL00k10J30j92J34J39n3j00K72j60k6K70l22K55j04n27M43j45
4769h8OK93p2l5k66Q9J66k91J83m1k34K23m5rL9M8j22K16K9J14P4l10J54kk3p4
4795B2Q8R0K85m84J44k99N2K26K1l27L08j53JL6j15R1pl21L02K09l83J82j04K39
4819A03Ok38J48L50k93O5j48J05J42m94K00K41l22J88O2m14J61J04J40J79l94
$$ plain form
4840 -109 -151 47 -219 -53 118 -64 163 2 210 241 -122 66 110 99 136 44 41 440 71 -13 34 -85 84
4863 84 278 -259 248 29 41 158 -234 1 2 -304 173 -95 -286 159 -236 -51 -149 -83 320 42 -238 -122
4885 -122 68 -50 235 -33 257 51 124 276 133 -24 270 -65 -84 111 30 31 106 -299 -37 -195 -101 -104 -410
4908 -410 1 1 -435 -123 -216 -170 58 -256 -200 250 -283 -55 146 -245 299 148 101 8 -218 116 317 -225
4930 -225 45 122 45 416 -27 83 250 -465 -61 6 -34 92 -114 -174 -76 -299 -46 95 -361 132 79 -94
4952 -94 230 -140 -163 102 140 241 375 106 37 43 41 326 -139 14 165 -191 -39 37 -256 -218 -14 -251 189
4975 189 -95 -160 19 -191 121 31 -119 -49 -110 169 52 -117 241 178 -65 131 159 -70 144 -32 -22 58 -187
4998 -187 95 -259 -162 141 -157 -69 -55 -117 -129 83 -179 20 -43 -281 130 -65 -117 155 61 124 245 -120 185
$$ packed form
4840a09m2J98k66J66J71j82K27j61K08L1l63J88M4j1L7r2lL99l69q4M7j19J69
4863H4J94n37N07k19J2J17l92K35Jl06M77k68j91M45l95J85r8O6M03k78k80J16
4885a22J90j18K85k68K90k06P3J52j43j57K94l35j9J95q1JP5m05K62j58R4ll06
4908d10M11%m36L12r3M6K28l14N6M50n33K28K01l91N44j51m7r3k26L34K01n42
4930b25K70P7p7L71m43J10J67p15M04O7m0J26k06o0R8k23K53J41m56M93n3j73
4952i4L24l70k3K65L8J01J34k69o9OkK85m65J53J51l56J52P6k93L8K04k37M40
4975A89k84o5J79k10L12r0j50P0o1K79j17j69L58o3k43J96K8k29K14j76J0Q0k45
4998a87K82l54R7L03k98Q8J4o2j2K12k62J99o3k38M11j95n2K72r4O3J21l65L05
$$ plain form
5021 185 192 -194 97 -119 178 362 -267 -18 107 296 104 -309 -2 -256 -294 -212 112 -151 -15 -50 -101 156
5043 156 -21 -19 265 -405 210 95 145 283 143 -39 165 65 137 193 -34 234 -155 -57 107 -112 -88 -96 -51
5066 -51 -70 -162 -10 220 -266 -107 124 -277 -134 -17 78 -41 -110 -130 73 139 -395 349 -31 293 0 -72 105
5089 105 -189 -230 147 -25 -67 -22 -96 -25 -60 -120 68 -67 30 70 -182 99 -217 -23 67 -179 -201 338 -38 39
5113 39 591 -36 57 49 -240 370 211 146 215 -51 263 85 -113 29 96 -157 -42 -252 57 121 -251 -216 -270
5136 -270 -18 -139 -8 85 -69 -291 -37 21 -147 -34 95 -149 -17 -26 183 175 41 79 152 -126 -63 49 77
5159 77 55 -134 182 -99 -173 -268 -25 -228 57 10 86 223 -358 40 1 86 122 7 -160 176 -157 -142 361
5182 361 243 295 212 -354 -55 93 -115 154 -69 49 318 46 -77 139 -156 92 -227 80 192 -496 -37
$$ packed form
5021A85Pl86K91k16K97J84o29K49J25J89j92m13L07k54l8Q2L24k63J36l5n1K57
5043A56j77KK84o70O15j15N0J38j40j82K04j00P2N6k27K68l89R8J64k19K4qM5
5066e1j9r2J52K30m86J59K31m01J43J17R5j19o9k0K03O6n34P44l80L24k93p2J77
5089A05k94m1L77j72m2M5p4P1l5o0J88j35R7M0k52K81l16J94R0k46k2N39l76P7
5113C9N52o27R3qk89O10j59o5O9k66L14j78j98J42O7k53J15k10L09O4l72L5n4
5136b70K52j21J31R3j54k22K54N8j68J13J29k44J32rK09qj34L8P3k78O3J12K8
5159G7k2j89L16k81p4r5K43k03K85m7P6J37n81L98l9Q5L6j15j67L36l33J5N03
5182C61j18N2q3n66K99J48k08K69k23J18K69k72j23K16k95K48l19L07J12o88M59
$$ plain form
5203 -37 82 99 91 -155 -143 91 -31 -44 129 30 161 124 -287 166 32 3 0 -226 51 327 -74 -91 -129 -82 -47
5228 -47 -99 15 -1 -119 26 -59 -273 46 225 -82 38 -189 60 108 -320 23 -176 53 90 15 1 -31 81
5251 81 166 237 80 164 -35 -176 -58 -94 181 41 -392 -60 202 -43 125 -264 -143 36 -334 53 142 -263
5273 -263 164 -87 168 213 92 324 149 -64 39 -182 26 16 -161 79 254 -284 -103 -42 -160 -75 -148 -40
5295 -40 145 -289 13 64 -124 -34 -35 -165 2 13 55 144 134 257 103 75 -20 29 334 247 -153 -18 71 -62 29
5320 29 60 -148 -10 -178 -83 160 37 -27 -26 -99 -124 74 -39 90 -31 4 -8 -87 -48 240 27 -57 268 147
5344 147 391 -208 189 91 60 1 -12 201 111 18 -21 39 -141 -263 -170 -188 96 -83 -84 19 21 -179 -27 23 -106
5369 -106 -180 -65 218 -12 -58 -115 -2 204 134 26 157 -56 -160 104 -38 23 125 -112 -6 185 123 47
$$ packed form
5203c7J19J7qk46J2K34j22j3J73r9J31l7m11M53j34k9lk26K77K76m01j7l8M7L5
5228d7n2J14j6j18J45q5k14L19J79l07J20k27K49M8m28L43j99K29L7p5j4l2J12
5251H1Q5P1j57Q4j99j41J18l6K75j40m33L32K62k45J68l89J21J79l70L87Q9m05
5273b63M27k51K55M5j21K32j75k13J03k21K08j0j77K40J75n38J81O1j18Q5p3J08
5295d0J85m34L02N1j88R0jj30J67J1M2Q9j0J23j54k8r5M9L05q7m00J35Q9j33R1
5320B9L1k08J38j68R5K43j23o4Jp3k5J98j13J29j21L5j2p9L9K88k13q4L25j21
5344A47K44n99L97r8l1n9j3K13r0r3l9O0j80j22R3j8K84j79jJ03Kk00J52N0j29
5369a06p4J15K83k30m6n7J13K06p0j08J31k13j04K64j42O1J02k37J06J91o2p6
$$ plain form
5391 47 51 -52 75 -110 -273 -20 123 -56 -176 106 34 12 -188 148 -171 -10 86 91 291 119 109 377 79
5414 79 159 107 -58 -189 104 -163 104 -167 -278 -14 -143 -141 10 -211 -18 12 15 -67 -240 14 23 -38 120 111 -88
5439 -88 -73 3 -81 243 -89 183 77 -176 73 -4 -2 89 -20 -201 8 -134 152 -134 -140 77 -115 -114 67 -149
5463 -149 -116 -64 223 148 54 -24 -193 16 -147 56 -33 -61 -155 -312 143 179 15 107 -53 -205 47 -58 -40 -174
5487 -174 -281 51 -202 -147 46 -228 -386 64 -122 61 -10 -152 182 12 206 -2 123 225 152 -231 66
5508 66 -312 -35 108 68 83 -78 57 136 2 -148 131 -1 104 5 -358 -160 -75 -53 72 -225 -14 321
5530 321 -361 -254 286 -149 102 -39 113 139 184 93 192 -37 398 28 -173 174 -114 -48 205 -37 -217 8
5552 8 139 26 -207 -222 36 -59 -115 30 70 0 -62 157 109 87 69 54 78 64 137 22 56 152 -123 271 -260 32
$$ packed form
5391D7Mj03J27j85j63K53J43j79j20K82p2k2k00L36l19J61R6NK00j72j0K68k98
5414G9Q0n2j65j31K93k67K67k71j11K64j29KJ51k21J93L0Lq2j73K54Ro1J58rj99
5439h8J5P6q4L24l32K72j06k53K49p7KR1j09j81K09j42K86k86oK17j92JJ81k16
5463a49L3N2K87p5r4p8j69K09j63K03q9k8r4j57M55L6j64R2j60j52K52j05J8j34
5487a74j07L32k53N5J93k74j58M50j86J83p1j42L34j70J94k08J25J02p3l83K97
5508F6l78K77J43m0J5j61J35P9j34j50K79j32J05r9l63J98Q5K2J25k97K11L35
5530C21o82J07N40m35K51j41J52K6M5r1R9k29M35l70k01L47k88O6K53k42j80K25
5552HJ31j13k33j5K58r5n6J45M0p0o2K19m8k2j8j5K4j4P3j15L4R6k75L94n31K92
$$ plain form
5578 32 59 14 108 -196 -339 52 -94 -71 -102 -50 -147 -167 -198 -23 -142 -69 110 -109 -124 37 40 89 294 61 -6
5603 -6 -129 42 240 81 -98 244 128 -35 -28 -22 94 -47 -354 92 -140 -285 -37 -264 112 -82 -117 -224
5625 -224 -204 -29 284 -22 63 309 -196 27 -45 -237 207 105 43 100 25 47 276 -61 115 -90 -111 -206 -219
5648 -219 -88 225 -250 -163 47 -261 -154 56 132 -80 -188 17 -61 -198 21 -41 253 141 266 -56 181
5669 181 -258 249 452 3 57 -173 -242 209 38 246 34 -79 -147 -219 -8 -66 -114 12 307 125 -58 87
5691 87 211 200 2 -91 45 122 20 292 32 -3 75 -176 152 14 -90 164 -19 -152 -97 -145 11 -22 -76
5714 -76 44 43 39 -50 -310 -116 59 -251 214 75 -189 271 -145 -65 178 -140 -20 47 48 246 28 82 199 -291
5738 -291 68 177 52 374 -51 169 104 -3 -129 311 -157 -178 -135 108 322 -200 -163 213 -38 55 -234 3
$$ packed form
5578C2K7m5R4l04j43L91j46K3l1N2r7k0l1J75j19P3J79k19j5J61LM9K05k33o7
5603fj23J71J98j59j79L42j16j63POJ16j41l07M46k32j45K48k27L76j94l5j07
5625b24K0J75L13l06Q5K46n05K23p2j92M44j02o2N7p5K2K29l37J76k05k1r5j3
5648b19J31L13m75Q7K10l08J07K10P6k12j08K05p8j37K19o2K94j12J25l22K37
5669A81m39N07K03m49N4k30o9M51j71K08k12j13o8p2K11n8m8J26K95j82j83J45
5691H7J24j1j98r3J36P7j02K72k60l5P8k51L28j38j04K54j83j33N5m8J56l3n4
5714g6J20jmq9k60J94J75l10M65j39k64M60m16Q0K43l18J20O7JJ98k18N4J17m90
5738b91L59J09j25L22m25K20o5j07j26M40m68k1M3K43K14n22L7L76k51R3k89K37
$$ plain form
5760 3 145 1 -21 176 -43 -53 -40 -81 237 348 101 183 -259 -20 33 -11 -65 24 -125 21 -280 -277 188 -202
5784 -202 -244 -1 253 -147 268 13 4 21 -39 237 172 1 17 153 142 33 -83 434 -77 -249 182 -187 -127
5807 -127 -23 -9 63 -146 -61 73 56 -104 54 -142 -23 -104 -454 387 -49 10 -83 204 108 348 136 193 189 110
5831 110 173 66 160 -124 -3 -8 79 -21 67 -38 84 -79 -134 -289 -59 -71 29 -291 -159 62 -9 -298 152
5854 152 17 69 -180 -103 140 -52 2 177 -78 -87 276 78 -84 -188 -362 132 -122 50 212 -265 -82 -19
5876 -19 92 67 -43 -146 190 -96 3 9 64 235 -9 -95 12 45 68 490 211 134 -83 -85 287 88 70 -34
5900 -34 -43 -9 134 -283 280 -85 28 -58 -29 -152 40 -136 -144 -84 -115 69 -263 -251 87 -52 17 227 -53 -159
5924 -159 226 -126 362 91 107 157 22 120 -87 -74 56 228 -72 111 -14 -152 60 -154 -92 -15 -118 53
$$ packed form
5760CJ42j44k2J97k19j0J3m1L18J11k47Q2m42K39N3m4n4Q9j49J46l01LM65l90
5784b02m2K43K54m00M15k55rJ7o0K76o5j71J6J36j1j09j16N17n11j72M31l69O0
5807a27J04J4P2k09Q5J34j7j60J58j96J19q1l50Q41m36N9r3K87r6K40k12N7mp9
5831A10O3j07R4k84J21nQ7j00Q8j05J22j63n5j55K30j2J00l20J32K21p1k89M50
5854A52j35N2k49P7K43j92N4J75k55rL63j98j62j04j74M94k54J72J62m77J83O3
5876a9J11k5j10j03L36k86R9ON5J71k44q6J07L3K3M22k79p7k17kL72j99j8j04
5900c4rL4J43m17N63l65J13q6K9j23J92j76qO0l1J84l32J2L38j39O9K10k80j06
5924a59L85l52M88k71J6N0j35R8k07J3J30J72l00J83j25j38K12k14O2P7j03J71
$$ plain form
5946 53 15 -229 84 69 25 88 -240 -8 247 97 156 51 -39 82 -127 229 -21 -204 75 74 132 -91 -181 41
5970 41 64 -286 -50 -88 -172 -129 29 200 -117 210 23 -112 -5 66 4 -44 -25 -90 108 -15 14 249 194 103
5994 103 95 30 -121 -201 -127 141 -68 21 -154 4 -1 204 -333 -214 99 -268 58 113 -263 112 166 26 -104
6017 -104 134 -105 397 211 46 20 -143 221 195 -44 215 -62 226 138 -253 57 -187 -62 175 -187 -180 65
6039 65 -426 163 -84 -266 -32 49 -128 -179 -53 129 90 -72 215 64 -2 35 170 30 -181 -22 -89 -48 -84
6062 -84 143 62 -253 109 88 169 -2 -88 -73 449 -16 -15 -80 -275 54 -75 -50 379 -67 -55 -12 5 46 -50 -50 298
6088 298 -4 62 310 -19 128 37 46 -28 131 109 -113 -310 -26 -220 83 -148 -113 -66 -156 25 41 -26 -308 61
6112 61 151 -80 179 18 43 76 -53 122 237 -241 118 39 188 16 -184 -29 1 -170 -133 104 -82 -91 -222
$$ packed form
5946E3l8k44L13j5m4O3l28K32K55j50N9j05r0J21k09L56k50j83K79jN8k23r0K22
5970D1K3l50K36l8q4M3J58J71l17L27j87j35J07P1o2m8J9o5J98j23K9K35n5r1
5994A03qo5j51q0P4K68k09Q9j75J58nK05n37J19L13l67L26N5l76L75N4j40j30
6017a04K38k39N02j86j65k6j63L64k6k39K59k77K88q8l91L10k44J25K37l62PK45
6039F5m91N89k47j82K34Q1j77n1J26J82l9j62K87j51o6L7J35j40k11J59o7M1l6
6062h4K27q1l15L62k1Q1j71q6J5N22m65Jo5j95L29j29K5M29m46J2M3J7M1r6%L48
6088B98l02O6K48l29J47r1Rp4J59k2k22j97K84j94L03k31L5M7r0J81J6o7k82L69
6112F1R0k31K59j61K5L3j29J75J15m78L59p9J49j72k00J55L0j71L7K37j86rj31
$$ plain form
6135 -222 -110 -176 33 -92 -150 -106 102 -171 -100 94 -202 -17 212 122 -47 202 229 299 -30 -101 179 -138 14
6158 14 232 -150 73 48 -153 -281 -180 219 126 -47 44 16 -115 90 -27 -76 197 -216 -190 21 -152 133
6180 133 -268 26 99 136 81 176 -54 41 -169 29 7 130 -366 -34 -96 48 -72 -179 296 -129 -87 -50 -303
6203 -303 65 152 -134 -233 46 -114 191 -19 -70 142 112 31 101 244 166 -142 138 175 -71 -58 171 5 19
6226 19 81 121 -83 -153 -70 -156 62 -317 158 -132 -94 -38 -275 -41 -100 -153 254 -104 99 38 -43 331 44 164
6250 164 166 175 156 129 -121 146 -217 -63 73 81 -289 185 -113 122 1 -115 -2 -73 -71 149 -48 88 97 204
6274 204 252 170 -185 69 73 -84 52 -340 262 34 -246 -31 19 16 -76 -155 2 320 -250 159 69 171 -64
6297 -64 -130 11 -50 -259 89 -75 -197 153 -142 -63 -77 143 -152 -94 140 39 19 -148 316 312 184 137 -173
$$ packed form
6135b22J12o6K09j25n8M4K08k73P1J94k96J85K29r0j69K49K7P0l29p1K80l17J52
6158A4K18l82K23k5k01j28J01L99r3j73R1k8j31K05j17m9K73m13K6K11j73K85
6180A33m01K94P3L7n5R5k30R5k10J98k2J23m96L32o2J44j20j07M75m25M2L7k53
6203c03L68Q7k86r9K79j60L05k10n1K12l0q1P0J43p8l08K80L7k46J3K29j66J4
6226A9O2M0k04p0Q3q6K18l79M75k90L8N6k37K34n9n3M07l58K03o1q1L74k87J20
6250A64KRj9k7k50K67l63J54J36Ql70M74k98K35j21j16J13p1KK20j97J36RJ07
6274B04M8q2l55K54Mj57J36l92O02k28k80K15N0lr2p9J57L18n70M09r0J02k35
6297f4o6J41o1k09L48j64j22L50k95P9j4K20k95N8K34j01k0j67M64mj28m7l10
$$ plain form
6320 -173 -123 5 99 -150 -46 -121 -87 -47 -57 -35 -21 -222 157 -228 70 -170 -79 -22 -78 -97 191 87 265 149
6344 149 -145 91 3 -35 104 -56 92 21 32 115 156 -54 116 -54 -51 -154 -76 135 38 -30 -151 -131 104 14
6368 14 51 72 18 -170 166 -58 -417 26 159 63 99 -124 29 95 -138 194 93 -79 133 68 -35 8 -187
6391 -187 45 187 -257 53 -53 11 -44 -176 -105 -91 -93 -80 42 -99 247 -208 166 168 131 135 156 132 8 -110 -66
6416 -66 -30 -56 75 50 -90 -184 -78 -158 -187 41 2 153 -59 -72 143 -45 120 227 -244 151 11 89 232
6439 232 -87 15 -27 -12 -59 29 -45 155 -52 20 -45 -112 -88 107 28 -92 182 155 53 -113 -48 74 -206 -22
6463 -22 -239 -50 151 -177 103 161 -167 80 47 -32 -39 165 176 242 34 108 305 105 41 -136 120 135 -51 -187
6487 -187 -149 -26 -110 83 -277 -60 37 -31 -1 -56 -22 84 72 -228 -57 181 12 -216 -73 217 93 133 -2
$$ packed form
6320a73N0J28R4k49J04p5L4M0j0K2J4k01L79l85K98k40R1N7n6j9K88j04J78j16
6344A49k94K36q8l8J39j60J48p1J1Q3M1k10J70j70Lj03P8K11r7o8j21K0K35r0
6368A4L7K1n4j88L36k24l59M43J33r6L6k23J53O6k33L32j01j72K12o5j03M3j95
6391a87K32J42m44L10j06O4n5j32P1J4kJ3J22j41L46m55L74Kl7MK1k4j24j18M4
6416f6L6k6J31k5j40r4J06q0k9K28l9J51k12j3K15j88J65J07m71L95j40P8J43
6439B32l19J02m2J5m7Q8p4K00k07P2o5o7K4J95p9j20K74k7j02j66O5J22k80J84
6463b2k17J89K01l28K80N8l28K47l3p9pK04J1O6k08P4J97k00o4j77K56J5j86j36
6487a87L8J23q4J93l60K17R7o8L0n5L4J06j2l00J71K38j69k28J43K90j24M0j35
$$ plain form
6510 -2 -145 -13 363 -62 -75 -43 -94 68 -62 -67 171 -30 33 12 82 -136 11 -165 -60 70 76 -46 -216 146
6534 146 111 41 143 115 49 99 -31 331 90 1 323 -171 41 292 35 -17 -68 67 215 -152 -129 -23 54
6557 54 -13 65 -209 -85 -19 -266 -43 127 87 123 -55 -36 -85 -3 113 -27 -7 265 200 84 -182 32 98 -116
6581 -116 129 100 -468 -119 -67 192 217 -291 -7 108 -135 -69 131 92 -208 -27 96 227 197 -187 38 -102
6603 -102 14 125 -87 124 57 -3 -36 192 -43 13 46 -151 29 -134 347 -20 -459 60 -187 -283 44 -53
6625 -53 21 114 -155 -66 -93 -207 -61 63 54 226 -26 -64 150 -45 -111 300 199 27 -104 95 140 141 117 -117
6649 -117 -276 -4 -212 -139 -83 -138 127 -237 34 68 84 50 293 -62 152 27 -75 120 198 28 40 -266 -44
6672 -44 191 -30 90 -91 -231 174 16 -38 -16 -74 -78 225 -203 195 -258 -110 297 -199 -57 -42 -191 146
$$ packed form
6510bj43J32L76m25j3L2n1J62j30nK38k01O3k1P0k18J47j76J05J30Oj22j70L62
6534A46l5p0J02k8o6N0j30L62k41q9L22m94K12K51k57n2n1J35J48l67K3J06P7
6557E4o7P8k74J24O6k47K23J70m0L6j78J9m9Q2J16j40K0K72o5j16k66K14O6k14
6581a16K45k9n68L49N2K59K5n08K84J15k43O6K00l9l00J81J23J31l0l84K25j40
6603a02J16J11k12K11o7o0l3K28k35N6L3j97J80j63M81l67m39N19k47r6L27r7
6625e3P4R3k69Q9k7j14J46J24rJ72k52l8K14j95o6M11j01j72j31J99M5Jk4k34
6649a17j59K72k08P3N6n5K65l64K71L4J6l4K43l55K14j25j02J95P8j70J2l06K22
6672d4K35k21J20j81j40M05j58n4K2n8mL03m28L98m53J48M07m96J42J5j49L37
$$ plain form
6694 146 -8 -182 -226 35 -175 1 115 162 -21 -153 254 24 -77 53 -172 73 59 -287 231 -166 -185
6715 -185 6 78 -293 -154 -328 54 -256 -366 72 108 -407 -153 145 -75 167 -45 294 -17 -199 178 39
6736 39 135 -33 37 -24 42 -63 -127 55 -180 -5 -134 -87 -125 -81 -23 -218 172 16 24 8 52 216 199 -91 -10
6761 -10 -59 -59 6 -119 -299 47 137 86 -162 235 125 -88 6 52 92 -141 134 -36 -136 -2 5 61 45 -152 -98
6786 -98 -58 -157 -33 152 -63 154 -42 39 -73 -60 25 327 -351 1 96 27 175 255 31 255 -100 -259 182
6809 182 -138 -38 2 -78 144 -63 -79 41 -125 -16 -4 -342 -165 -126 -27 110 115 -53 45 -46 235 221 -80 51
6833 51 47 -92 267 -10 -149 175 -65 158 16 -55 -2 225 47 -132 -147 -51 -113 34 15 40 -236 50 20 81
6857 81 -80 10 23 -130 -8 35 152 -57 -21 -99 36 46 -94 216 34 14 89 -199 -71 74 -181 -64 -15
$$ packed form
6694A46j54j74m4K61k10J76J14M7j83j32M07k30j01J30k25K45j4l46N18l97j9
6715a85J91P2l71J39j74L82l10j10M38L6n15K54K98k20K42k12L39l11j82L77j39
6736C9R6j68P0o1O6j05o4J82k35J75j29M7l8M4N8j95L90j56Qj6M4J64j7k90Q1
6761a0m9%O5j25j80L46R0n1k48L97j10k13R4M6M0k33K75j70j00J34PN6j6j97N4
6786i8M0r9J24J85k15K17j96Q1j12J3Q5L02o78L52R5o9J48Q0k24K24l55j59M41
6809A82l20J00M0q0K22k07j6J20j66J09J2l38J77L9R9J37Nj68R8r1K81j4l01J31
6833E1mj39L59k77j39L24k40K23j42p1N3K27j78j79j5R6o2J47j9K5k76K86l0O1
6857H1j61R0J3j53J22M3J17k09L6p8J35J0j40L10j82k0P5k88J28J45k55J17M9
$$ plain form
6880 -15 -169 -89 -110 -6 -22 -23 2 280 -193 366 113 158 134 155 -54 -103 67 127 -126 79 351 -181 -80 -45
6904 -45 -17 -208 241 -46 -244 68 -223 -30 -300 -30 93 58 -116 -11 -3 42 34 -191 -35 60 167 80 -71
6927 -71 -66 20 16 348 112 244 37 -5 19 -69 -27 -233 -93 -34 -14 -117 -277 135 -226 -79 -422 47 -127 -93
6951 -93 -84 235 -16 122 51 67 192 -138 39 13 -4 125 33 110 66 -267 85 -15 -1 27 262 -127 -85 34
6975 34 -151 -167 -246 -120 235 52 -35 -82 -19 174 203 57 -69 -26 -16 279 25 18 411 -54 122 331 -125 76
6999 76 -399 -123 -24 -98 9 43 -6 132 -43 -440 -238 -173 -35 -186 -266 -123 -144 -149 -40 -42 -98 107 27 -86 2
7024 2 142 12 -276 30 203 -225 136 118 -151 -35 -32 -147 52 155 -358 256 -78 -336 170 -219 23 -77
7046 -77 -225 -71 -45 -220 -241 182 32 151 24 159 99 55 21 24 1 78 88 56 29 -137 172 68 254 68
$$ packed form
6880a5j54Q0k1J04j6jK5K78m73N59k53M5k4K1k09m9J70O0k53K05K72n32J01L5
6904d5K8j91M49k87j98L12k91J93k70K70J23l5j74J05QM5qk25J56R5J07q7j51
6927g1NQ6mL32k36J32k07m2K4q8M2k06J40N9K0j03j60M12l61J47l43M69j74L4
6951i3RL19k51J38p1J6J25l30J77k6j7J29r2P7m4l33L52j00J4K8K35l89M2J19
6975C4j85j6p9J26L55j83q7m7O3J93K9j46j26M3J0K95k54pL93m65J76K09m56K01
6999G6m75K76R9p4J07L4m9J38j75l97K02O5J38j51q0J43k1nJ09kn6K05q0j13Q8
7024BJ40j30k88L06J73m28L61j8k69J16Lj15J99J03n13O14l34k58N06l89K42j00
7046g7j48J54K6j75k1M23j50J19j27J35o0m4l4Lk3P7J0l2k7j66L09j04J86j86
$$ plain form
7070 68 77 -154 -9 -116 5 108 -144 -185 -95 -66 39 -89 -49 15 89 85 -226 109 35 295 -42 85 -142 -145 -22
7095 -22 -75 121 17 -52 -62 -77 50 159 -37 -158 11 -239 100 33 81 -19 -23 -40 43 -164 -30 90 77 139
7119 139 -82 29 228 -47 148 168 -287 -114 -41 -8 203 -375 -81 -255 -98 -37 -39 -68 -82 -78 83 183 -169
7142 -169 -44 -73 27 -20 108 133 -112 -125 66 -150 -79 -71 132 -8 33 -81 -58 24 -165 -101 -22 39 -137 50
7166 50 80 -43 -132 76 124 -79 79 -18 -102 -52 -95 13 191 -71 44 60 -92 84 59 108 96 81 171 99 -219
7191 -219 233 199 -273 -200 46 97 -111 -111 -4 -94 -68 -6 -263 -11 70 -110 -65 283 -17 82 40 -169 2 60
7215 60 -22 394 65 -147 -26 78 39 84 -253 122 -64 57 135 -13 -264 79 -276 -175 -91 -141 -239 109 -1
7238 -1 -114 80 99 21 11 -55 176 227 -68 -61 227 118 -116 40 -33 -3 230 -16 153 338 42 -134 32 -96
$$ packed form
7070F8Rk31J45j07J21J03k52m1R0K9J05j28M0O4P4ml11L35p4K60l37J27k27lJ23
7095b2n3J96j04o9j0j5J27J09j96j21J69k50L39o7M8j00mj7Q3k07J34J20j3O2
7119A39k21J11J99k75J95K0m55J73P3L3K11n78K94j74J57O1kk9j4MJ61J00l52
7142a69J25k9J00m7J28K5k45j3J91k16P1QK03j40M1j14K3Q2j89O4P9O1j76J87
7166E0L0j23q9K08M8k03J58r7q4N0m3J08J78k62J15J6j52J76k5M9j2j5R0p2l18
7191b19M52l4m72P3K46N1k08%J07r0K6O2k57K52Q1j80M5L48l00R9m2k09J71N8
7215F0q2M16l29k12J21J04l9M5l37L75j86J21P8j48k51L43l55J01Q4n0r8L48j10
7238aj13J94J9p8j0o6K31N1k95PK88j09k34J56p3L0K33k46J69J85k96j76J66j28
$$ plain form
7262 -96 48 34 144 1 67 -7 171 -284 146 60 -15 -47 66 27 41 -43 235 66 -138 160 -136 -25 13 14
7286 14 197 42 130 -31 107 56 128 22 -69 -164 -62 -18 -103 -39 143 48 -2 -50 -116 77 -23 -76 -34 12 120
7311 120 135 -78 288 35 -63 29 -334 32 -33 -24 97 -238 -117 -70 209 210 -1 -17 117 -211 -69 -184 -172 -96
7335 -96 -283 -116 -96 -25 34 -131 -25 94 -130 325 177 -55 294 76 369 -191 -219 14 360 124 23 95
7357 95 -149 -193 -140 152 -129 -42 111 -159 28 -22 -244 154 -94 -177 -40 106 -38 219 -80 71 145 63 -56
7380 -56 -50 175 -56 -4 -100 176 253 223 -66 -92 188 -66 -3 1 -71 101 97 108 342 -76 -234 -69 -95 212 108
7405 108 51 -54 57 -143 -157 -14 -86 211 9 46 5 -33 -204 -25 5 101 -55 42 -6 -215 13 9 -24 147
7429 147 -81 -279 -25 1 -44 -24 -44 -190 -29 -36 28 125 -30 117 -35 145 -144 49 -123 -243 -102 -51 32
$$ packed form
7262i6J44j4J10j43O6p4J78m55M30q6p5l2J13l9J4q4K78j69k04K98k96J11L8J
7286A4J83j55Q8j61J38n1P2j06r1r5J02M4q5O4J82r5n0m8o6J93j00n3M2M6J08
7311A20J5k13L66k53r8R2l63L66o5RJ21l35J21M7K79Jk11j6J34l28J42j15J2P6
7335i6j87J67K0P1N9j65J06J19k24M55j48k32L49k18K93n60k8K33L46k36j01P2
7357I5k44m4N3K92k81Q7J53k70J87n0k22L98k48q3J37J46j44K57k99J51P4q2j19
7380e6OK25k31N2r6K76P7l0k89k6K80k54O3Mp2J72mJ1K34m18j58J65k6L07j04
7405A08n7j05J11k00j4J43p2K97k02L7m1l8j71J79L0R6j56R7m8k09K28ml3J71
7429A47k28j98K54K6m5K0k0j46J61pO4R7j55J47j52J80k89J93j72j20J41N1Q3
$$ plain form
7452 32 112 -57 30 9 -67 -203 -150 -4 -115 -62 -154 -118 -74 128 122 137 -182 55 -78 107 173 -145 -74 73 -148
7477 -148 146 145 79 49 200 -98 140 -46 -20 101 105 -219 -77 7 -10 -258 -16 -5 -151 -270 30 22 27 6 -16
7502 -16 84 38 -242 -124 -61 85 28 122 132 51 134 25 -14 -35 206 -279 -7 230 25 217 122 130 36 249 134
7527 134 -150 -61 -300 -22 4 241 68 103 -5 106 126 318 233 32 -302 242 42 -24 273 56 -113 -140
7549 -140 -47 110 43 -134 85 243 76 -47 50 30 -196 -249 -79 166 -20 92 13 -26 24 -53 137 217 -16
7572 -16 133 114 -78 -50 76 51 101 -163 -296 -75 -193 241 22 -110 -28 -348 -153 125 -231 49 23 117 113
7595 113 81 -149 172 133 32 -151 98 68 115 -276 35 -42 228 -186 -234 122 180 -14 75 -15 171 107 -91
7618 -91 -80 167 43 161 97 8 -185 -281 215 89 -102 -35 -183 281 39 -17 -161 2 22 -163 244 164 122
$$ packed form
7452C2Q0j69Q7k1p6j36N3J46j11N3r2L6M4K02oJ5l19K37j33J85O6l18P1J47k21
7477a48K94jo6l0J51k98K38j86K6J21Ml24J42Q4j7k48K42J1j46j19L00qNk1k2
7502a6J00m6k80J18O3J46n7R4J0q1Q3j09l9k1K41m85K72K37k05J92r5Qr4K13j15
7527A34k84Q9k39K78K6K37j73L5j08J11K0J92q5k01l34N44k00o6K97k17j69k7
7549a40R3J57o7j77K19J58j67j23R7k0k26n3J70K45j86J12p9l9N0p7J90Q0k33
7572a6J49j9j92K8J26k5N0k64j33K21j18M34k19j32Q2l20J95K78l56K80k6R4m
7595A13l2k30L21l9j01j83K49l0M7l91L11p7K70m14m8L56N8j94Q9r0J86o4j98
7618i1J1K47j24J18o4q9j93r6M96j26j91O7j48M64k42n6j44J63K0j85M07q0m2
$$ plain form
7641 122 -50 -122 80 -59 72 102 -205 -28 -22 -145 52 29 -128 178 -178 15 74 -113 91 -111 -252 -186
7663 -186 75 -85 106 -142 65 -86 -75 -98 337 49 69 52 -11 -104 -30 -39 114 -229 367 70 96 42 12 -49
7687 -49 -184 -221 66 -112 19 228 -40 -72 -46 17 144 34 -231 187 -200 66 202 -71 4 283 24 63
7709 63 60 14 284 -101 11 -29 94 89 -314 -177 -43 43 18 39 -84 -56 58 -316 -43 39 -187 -105 -98 88 -177
7734 -177 25 175 12 100 118 33 -98 221 -9 -222 233 45 149 24 -104 82 36 -187 -88 -35 193 20
7756 20 -100 291 111 95 34 98 204 74 144 30 157 -45 -14 131 -83 7 -20 -27 107 -384 -47 49 -60 111
7780 111 -153 -197 -94 63 -32 -122 45 245 -197 -59 -115 195 78 23 188 -69 67 -203 12 143 -6 111
7802 111 -19 149 35 -40 -96 -200 -150 70 -110 -32 221 64 -256 -266 -114 229 120 -320 -57 -25 -117 67
$$ packed form
7641A22j72p2K02j39J31L0l07J77Oj23J97k3j57L06l56J93N9j87K04k02j41O6
7663a86K61j60J91k48K07j51J1k3M35k88K0j7o3r3P4rJ53l43N96k97K6n4l0o1
7687d9j35l7K87j78J31K09k68l2K6O3J27j10k65M18l87K66J36k73P5K79k59L9
7709F3lm6K70l85J12m0J23nm03J37J34Q6k5K1j23K8J14l74K73Q2k26Q2PJ86k65
7734a77K02J50j63Q8J8q5j31L19k30k13M55j88J04j25j28J86m6k23R9N3K28j73
7756B0j20L91j80j6o1O4J06j30P0j14J27k02L1J45k14R0k7pJ34m91L37R6j09J71
7780A11k64m4J03J57r5r0J67K00m42J38n6L10j17n5J65k57J36k70K15J31j49J17
7802A11j30J68j14p5n6j04N0K20j80P8K53j57l20j0J52L43j09m40K63L2r2J84
$$ plain form
7824 67 -30 -95 124 215 276 17 12 213 -42 326 -130 -132 133 -210 -48 236 -10 189 54 -155 -307 36 -53
7847 -53 172 86 -189 39 -88 -126 94 14 -56 -2 -146 26 83 102 276 -14 -9 104 -58 118 23 9 138 46
7871 46 29 93 -149 -127 -46 -100 155 -57 -89 82 49 15 -30 -16 -167 245 76 49 -114 188 -206 -7 78 375
7895 375 1 101 -35 -40 -349 65 10 22 63 -5 47 -5 108 -66 22 44 -111 -154 -131 150 19 -66 -171 10
7919 10 -327 -51 -59 -15 92 112 26 15 -85 -241 141 -404 -70 128 2 -190 12 -152 190 -88 96 -209
7941 -209 42 129 -172 -92 -69 -5 84 10 -112 -208 163 -40 70 -68 159 275 -54 -253 -59 -120 148 192 -44
7964 -44 -161 6 9 -65 44 16 96 -88 -47 -102 125 23 -204 -38 -172 -54 -183 -155 -215 -37 164 -172 83
7987 83 102 309 46 -375 -45 -95 138 9 104 -119 -53 -191 104 -110 85 100 -180 45 -78 -119 -68 108 137
$$ packed form
7824F7r7o5K19R1O1k59nK01k55L68m56kK65l43J62K84k46J99j35k09j52L43q9
7847e3K25q6k75K28j27l8K20q0p0N4j44J72N7J9J74k90NJ13j62J76r5j4J29r2
7871D6j7O4k42K2Q1n4K55k12l2J71l3l4m5J4j51M12j69k7j63L02l94J99Q5K97
7895C75l74J00j36nl09M14n5J2M1o8N2n2J13j74Q8K2j55m3K3K81j31q5j05J81
7919A0l37K76qM4J07K0q6j1j00j56L82n45L34J98j26j92K02j64L42k78J84l05
7941b09K51Q7l01Q0K3O4Q9p4j22r6L71k03J10j38K27J16l29j99J94o1K68M4k36
7964d4j17J67Lp4J09k8Q0j84M1n5K27j02k27J66j34J18j29K8o0J78K01l36K55
7987H3J9K07k63m21L30n0K33j29R5k23O6j38K95k14J95J5k80K25j23m1N1J76K9
$$ plain form
8010 137 -43 56 -353 -283 128 171 181 -124 159 194 41 -59 -99 253 121 -60 119 242 240 102 236 -96 -28
8033 -28 -92 -30 41 -12 -121 -29 78 -175 -242 113 -35 -50 263 98 -25 163 66 -13 -44 -39 -79 -77 136 -64 -192
8058 -192 88 77 -48 266 -23 -72 -93 -94 -7 -81 -176 -115 -70 -19 -345 -40 -179 68 -40 -60 -24 -80 -150 90 32
8083 32 160 -19 60 53 -175 139 -133 32 195 38 -15 130 36 67 41 187 -23 -113 -2 -71 101 150 -64 222
8107 222 232 -56 -140 -115 -22 34 -8 65 -222 8 -140 -126 155 46 33 -116 -250 -29 58 -23 53 20 -214 -61
8131 -61 -3 189 -128 -127 -38 -8 -33 -87 -89 -217 177 49 -140 -111 127 -90 204 -87 49 -174 6 -31 -147 -42
8155 -42 175 -7 38 75 -34 21 -43 -355 68 -127 230 -119 -63 -83 2 93 -245 -135 -187 -212 -242 -144 -348 -91
8179 -91 139 -98 103 -195 82 118 156 166 -125 41 124 -85
$$ packed form
8010A37j80R9m09P0M11M3J0l05K83L5j53j00m0L52j32j81J79J23kj38J34l32O8
8033b8o4O2P1n3j09R2J07k53o7L55j48j5L13j65j23J88r7p9l1Nm0KK13k00j28
8058a92K80j1j25L14k89m9k1jQ7p4r5O1M5N1l26L05j39K47j08k0L6n6p0K40n8
8083C2J28j79P9pk28L14k72J65J63j57n3J45r4L1k6J46k10r0J11o9J72M9k14K86
8107B22J0k88q4K5R3N6m2P3k87K30j48J4K81j09j3j49j34K21Q7q1P6l3k34J53
8131f1N8J92l17JQ9L0k5n4kj28L94j28j89K9K38k17K94k91J36k23J80l7j16J05
8155d2K17j82M5L7j09N5o4l12M23j95L57l49N6k0Q5R1l38J10n2k5l0R8k04K57
8179i1K30k37K01k98K77L6L8J0k91J66Q3k09
8191h5
$$ Imaginary data points
##PAGE= N=2
##DATA TABLE= (X++(I..I)), XYDATA
$$ plain form
0 0 0 0 0 0 0 0 0 0 0 0 8 -8 8 -8 16 -16 24 -24 32 -40 48 -56 65 -77 90 -105 122 -142 163 -188 217 -244
32 -244 277 -316 356 -401 449 -504 565 -628 700 -777 863 -956 1057 -1168 1290 -1421 1565
49 1565 -1722 1899 -2093 2307 -2543 2810 -3112 3456 -3849 4304 -4844 5491 -6281 7279 -8577
64 -8577 10345 -12904 16943 -24288 41836 -170662 -6441 346364 -164835 -240395 186340
75 186340 188211 -236203 -113072 249879 48215 -257569 44391 216565 -80853 -173007 118085
86 118085 151899 -140901 -119318 194962 55479 -203943 20149 182173 -69466 -147395 93440
97 93440 126447 -138487 -97468 173732 24037 -190157 43714 153058 -93864 -121106 118546
108 118546 86223 -150805 -38743 168906 -28252 -141643 81591 98702 -84613 -60691
$$ packed form
0@%%%%%%%%%%Qj6J6j6K4l2M0m8N6p2Q8j04J21j42J67j95K27k64L05l51M05m61
32b44N21n93O72p57Q50r53J069j193J328j477J640j819K013k225K458k711K986
49A565l287L621l992M400m850N353n922O568p305Q153r148J0335j1772J3560j5856
64h577J8922k3249K9847m1231O6124k12498J64221L52805n11199p5560M26735
75A86340J871m24414J23131L62951k01664l05784L01960J72174k97418r2154K91092
86A18085L3814k92800K1583L14280j39483k59422K24092J62024k51639p7929K40835
97I3440L3007k64934M1019K71200j49695k14194K33871J09344k46922k7242K39652
108A18546l2323k37028J12062K07649j97158j13391K23234J7111j83315K3922
$$ plain form
118 -60691 86512 56909 -94911 -32009 114667 -3901 -103283 36623 82538 -47840 -74913
129 -74913 60498 63599 -96633 -35830 108833 -20836 -97005 48360 61816 -62171 -49050
140 -49050 71027 30298 -92835 9568 95482 -53617 -59741 79652 27043 -71889 -1278
151 -1278 76544 -11667 -75878 47957 65580 -72180 -29854 74305 5198 -65956 -3467 68173
163 68173 -11371 -86164 39789 73986 -78349 -49266 85891 17079 -92141 -1020 99928
174 99928 -30990 -101067 77767 75129 -105876 -25565 110569 -4343 -96610 30656 98782
185 98782 -56181 -82878 96012 49090 -110129 -4336 98862 -22689 -88086 34169 82399
196 82399 -62770 -75514 88248 39168 -104713 -10293 94779 -12582 -96156 29884 99412
$$ packed form
118f0691J47203k9603j51820O2902J46676j18568r9382J39906M5915j30378k7073
129g4913J35411L101j60232O0803J44663j29669p6169J45365J3456j23987J3121
140d9050J20077m0729j23133J02403Q5914j49099o124J39393n2609r8932P0611
151a278P7822q8211o4211J23835J7623j37760M2326J04159o9107p1154O2489P1640
163F8173p9544p4793J25953L4197j52335K9083J35157o8812j09220R1121J00948
174I9928j30918p0077J78834k638j81005Q0311J36134j14912r2267J27266O8126
185I8782j54963k6697J78890m6922j59219J05793J03198j21551o5397J22255M8230
196H2399j45169j2744J63762m9080j43881R4420J05072j07361q3574J26040O9528
$$ plain form
207 99412 -65316 -84583 104218 47427 -114575 -2486 110857 -20102 -98784 50706 95074
218 95074 -80968 -65065 108174 23212 -105587 11104 89499 -29045 -83434 43611 73561
229 73561 -73725 -54691 86416 16373 -86423 2290 74065 -15449 -77035 33620 74977
240 74977 -63465 -52176 84550 21950 -80248 5062 78910 -16994 -74922 46230 68426
251 68426 -71890 -34592 83627 1072 -70909 17536 57690 -28242 -55709 41940 39729 -62927
263 -62927 -17487 58496 -8979 -48968 12129 41257 -18932 -45668 35148 37472 -52156 -13013
275 -13013 56197 -3304 -44616 15146 46841 -22838 -43502 47964 29979 -61277 1413 57786
287 57786 -22041 -43535 29016 33891 -40547 -28691 52176 3836 -59124 18169 40585 -32947
$$ packed form
207I9412j64728j9267J88801n6791j62002J12089J13343j30959p8682J49490M4368
218I5074j76042J5903J73239q4962j28799J16691P8395j18544n4389J27045K9950
229G3561j47286J9034J41107p0043j02796Q8713P1775q9514o1586J10655M1357
240G4977j38442J1289J36726o2600j02198Q5310P3848r5904n7928J21152K2196
251F8426j40316L7298J18219q2555p1981Q8445M0154q5932k7467R7649k211j02656
263f2927M5440P5983o7475l9989O1097K9128o0189k6736Q0816K324q9628L9143
275a3013O9210n9501m1312N9762L1695o9679k0664R1466j7985r1256O2690N6373
287E7786p9827k1494P2551M875p4438J1856Q0867m8340o2960P7293K2416p3532
$$ plain form
299 -32947 -27412 29190 19898 -34971 -16289 46097 184 -45954 21327 35921 -25201 -22717 29686
312 29686 25564 -36268 -15629 54015 -3131 -52044 27284 38233 -36228 -26560 38371 18361
324 18361 -50908 -7102 55315 -21462 -48718 36503 24940 -41555 -14828 37142 8253 -42513
336 -42513 3282 45659 -20407 -33183 32436 20935 -27161 -12676 30858 15652 -37274 -615
348 -615 45819 -16819 -35272 28838 22505 -30498 -18048 34458 10022 -47222 5531 44379 -30320
361 -30320 -32210 35613 12542 -35675 -7306 35415 -800 -40174 17172 35015 -29979 -16438
373 -16438 32140 8164 -23655 -4449 30162 3855 -34250 12858 32855 -23681 -19701 25725
385 25725 12808 -26629 -12897 33039 1521 -42793 14217 31803 -30914 -19754 29156 8016
$$ packed form
299c2947N535N6602r292n4869J8682O2386m5913m6138O7281J4594o1122K484N2403
312B9686m122o1832K0639O9644n7146m8913P9328J0949p4461R668O4931k0010
324A8361o9269M3806O2417p6777k7256Q5221j1563o6495K6727N1970k8889n0766
336d2513M5795M2377o6066j2776O5619j1501m8096J4485M3534j5206n2926L6659
348f15M6434o2638j8453O4110o333n3003J2450N2506k4436n7244N2753L8848p4699
361c0320j890O7823k3071m8217K8369M2721l6215l9374N7346J7843o4994J3541
373a6438M8578k3976l1819J9206L4611k6307l8105M7108J9997n6536L980M5426
385B5725j2917l9437J3732M5936l1518m4314N7010J7586o2717J1160M8910k1140
$$ plain form
397 8016 -30502 -4828 34017 -7311 -34146 24216 22134 -28775 -4488 26004 2906 -19187
409 -19187 761 26266 -5556 -23669 19424 15496 -20569 -5696 16666 5427 -19281 -6522
421 -6522 25637 -7220 -28854 18052 14872 -24885 -7446 19806 3159 -23663 607 27576
433 27576 -14367 -20946 26014 8018 -21693 3668 17461 -910 -14412 6347 19325 -13171
445 -13171 -10440 19977 1254 -13323 1975 7892 1287 -13901 -750 16602 -12654 -14387 15450
458 15450 2414 -15738 -2411 12456 653 -19733 6632 20627 -18756 -9223 23867 -725
470 -725 -15645 6399 14776 -4119 -14116 13558 14142 -18346 -1274 18127 -5786 -9697 3270
483 3270 7406 -2096 -13526 6049 10270 -15161 -5238 11231 -2141 -9371 -3065 10722 246
$$ packed form
397H016l8518K5674L8845m1328k6835N8362k082n0909K4287L0492k3098k2093
409a9187J9948K5505l1822j8113M3093l928l6065J4873K2362j1239k4708J2759
421f522L2159l2857k1634M6906l180l9757J7439K7252j6647k6822K4270K6969
433B7576m1943o579M6960j7996k9711K5361J3793j8371j3502K0759J2978l2496
445a3171K731L0417j8723j4577J5298N917o605j5188J3151J7352k9256j733K9837
458A5450j3036j8152J3327J4867j1803k0386K6365J3995l9383R533L3090k4592
470g25j4920K2044Q377j8895r997K7674N84l2488J7072J9401k3913l911J2967
483C270M136r502j1430J9575M221k5431R923J6469j3372p230O306J3787j0476
$$ plain form
496 246 -17419 9143 14011 -16719 -1858 16000 -1835 -9414 3839 13071 -4272 -11305 15559
509 15559 5813 -16296 6277 9841 -7269 -2958 2471 4167 -4276 -7794 8217 440 -11035 3077
523 3077 2412 -3056 -2951 -3192 7373 -1868 -10376 9991 4075 -10449 3823 7197 -815 -3942 2525
538 2525 10535 -5596 -6301 14631 -1276 -10060 8688 2523 -5605 -1127 2167 2727 -7124 -2592 7401
553 7401 -6692 -4818 5240 -3861 -1142 -483 -3051 5760 -3370 -4701 8202 -586 -4162 3322 3357
568 3357 2300 -4801 2596 10944 -7773 -2716 12556 -3889 -5682 5334 1453 -1572 -4872 2026
582 2026 4497 -9228 -887 5794 -6630 -1278 1341 -3165 2099 -3556 -1822 5115 -3615 -1077 3502
597 3502 -606 2123 -1813 1694 6335 -5842 1608 8990 -6269 53 6705 -3329 -751 1206
$$ packed form
496B46j7665K6562M868l0730J4861J7858j7835p579J3253R232j7343p033K6864
509A5559r746k2109K2573L564j7110M311N429J696q443l518J6011p777j1475J4112
523C077o65n468J05k41J0565r241q508K0367n916j4524J4272L374q012l127O467
538B525Q010j6131p05K0932j5907q784J8748o165q128M478L294N60r851M532R993
553G401j4093J874J0058r101K719O59k568Q811r130j331J2903q788l576P484L5
568C357j057p101P397Q348j8717N057J5272j6445j793J1016l881l025l300O898
582B026K471j3725Q341O681j2424N352K619m506N264n655J734O937q730K538M579
597C502m108K729l936L507M641j2177P450P382j5259O322O652j0034K578J957
$$ plain form
611 1206 743 -766 -4967 4118 342 -8703 4424 582 -7480 2875 -418 -2937 1022 -2931 2160
626 2160 331 -3883 4355 131 -1784 4415 -1833 2395 3630 -4589 4596 3490 -5013 2905 1846
641 1846 -1047 -59 -1821 3747 -2120 -5916 6347 -2446 -7356 5297 -1885 -4861 2402 -1916 -830
656 -830 -830 -1392 3406 -3084 29 4786 -3802 2225 3698 -3825 4564 1921 -3353 5131 332 -1466
672 -1466 2300 -1072 2015 -1747 -3311 5601 -3700 -4599 5564 -3466 -3913 2059 -2408 -207 -1773
687 -1773 -1890 3237 -3780 -460 3916 -4009 2816 2474 -4331 5406 1470 -3772 5215 1215 -1135 1657
703 1657 52 2811 -1996 -1788 5205 -3649 -2128 4609 -4887 -1001 2322 -5028 756 235 -3334 755
719 755 -2334 846 589 -4746 4278 1585 -5549 4799 2046 -2978 3113 250 1596 1460 -1801 4296
$$ packed form
611A206m63j509m201R085l776r045J3127l842q062J0355l293k519L959l953N091
626B160j829m214Q238m224j915O199o248M228J235q219R185j106q503P918j059
641A846k893R88j762N568n867l796J2263q793m910J2653p182k976P263m318J086
656h30%n62M798o490L113M757q588O027J473p523Q389k643n274Q484m799j798
672a466L766l372L087l762j564Q912r301q99J0163r030m47N972m467K201j566
687a773j17N127p017L320M376p925O825l42o805R737l936n242Q987m000k350K792
703A657j605K759m807K08O993q854J521O737r496L886L323p350N784n21l569M089
719G55l089L180k57n335R024k693p134J0348k753n024O091k863J346j36l261O097
$$ plain form
735 4296 -188 -2191 4437 -2586 -370 3691 -5208 1134 2533 -5468 915 497 -2950 356 -2330
750 -2330 709 -650 -4369 3873 -683 -3934 5078 -1371 -1983 5402 -1714 59 3231 -782 2334
765 2334 -685 1025 4231 -3793 1345 4978 -5152 905 2914 -3540 782 -1309 -1252 1148 -4140
780 -4140 661 777 -4404 2144 -897 -2584 3942 -3075 -743 4788 -3480 498 3723 -1620 1302
795 1302 682 1712 2386 -3484 4071 3474 -6266 3702 3137 -5224 1137 809 -876 -590 -3524 2671 -342
812 -342 -5819 2959 -385 -3771 1996 -2137 586 1770 -4475 3012 2731 -3938 2496 1997 512 798
828 798 -1501 5352 703 -5422 6134 2092 -6102 3315 1923 -2271 -707 -840 2624 -2667 -3955
843 -3955 5080 -3015 -4317 3610 -2265 -1563 1146 -2342 2323 -860 -2547 4741 -1238 -1584 3979 -151
$$ packed form
735D296m484k003O628p023K216M061q899O342J399q001O383m18l447L306k686
750b330L039j359l719Q242m556l251R012o449o12P385p116J773L172m013L116
765B334l019J710L206q024N138L633j0130O057K009o454M322k091N7K400n288
780d140M801J16n181O548l041j687O526p017K332N531q268L978L225n343K922
795A302o20J030O74n870P555n97r740R968n65q361O361l28j685K86k934O195l013
812c42n477Q778l344l386N767m133K723J184o245P487k81o669O434m99j485K86
828G98k299O853m649o125J1556m042q194R417j392m194J564j33L464n291j288
843c955R035q095j302P927n875P02K709l488M665l183j687P288n979l46N563m130
$$ plain form
859 -151 994 249 -50 5198 -2980 -2059 7933 -2620 -3734 4559 132 -2379 -2317 1792 2787 -7550
875 -7550 -431 6597 -6857 -3500 5103 -1854 -2252 -1414 1806 2529 -5809 1430 6192 -4129 -484
890 -484 3536 574 1267 -2669 2903 4864 -6301 726 6884 -3674 -2343 2628 1389 -1756 -4745
905 -4745 4213 2195 -9034 2217 4850 -6901 -1197 2611 -628 -2040 -2703 4533 642 -6186 4659
920 4659 3224 -4458 1812 2072 832 206 -2239 5159 1599 -5711 4169 3323 -4177 -294 1392 1833
936 1833 -3037 -3962 6399 -1711 -8670 5336 1735 -6722 -149 2737 320 -4276 -926 6873 -3473
951 -3473 -5072 7851 292 -4433 2731 2523 1442 -2476 26 6716 -3125 -3784 6408 143 -3568
966 -3568 226 1806 1570 -5853 -1486 7440 -5549 -5814 6590 94 -5575 -819 3423 1017 -7096
$$ packed form
859a51J145p45k99N248q178R21R992j0553j114Q293m427k511O2M109R95j0337
875g550P119P028j3454L357Q603o957l98Q38L220P23q338P239M762j0321L645
890d84M020k962O93l936N572J961j1165P027O158j0558J331M971j239l145k989
905d745Q958k018j1229J1251K633j1751N704L808l239j412o63P236l891o828J0845
920D659j435p682O270K60j240o26k445P398l560p310R880q46p500L883J686M41
936A833m870r25J0361q110o959J4006l601q457O573K886k417m596L350P799j0346
951c473j599J2923p559m725P164k08j081l918K502O690r841o59J0192o265l711
966c568L794J580k36p423M367Q926j2989k65J2404o496n669M756M242k406q113
$$ plain form
981 -7096 1524 7948 -7042 -2815 8201 -999 -3425 1954 3831 1148 -4693 2722 6272 -5805
995 -5805 -862 5617 -1261 -2217 -906 2456 1266 -6773 1393 5372 -6926 -2505 4695 -1578 -3673
1010 -3673 -866 3997 -48 -7131 4850 4953 -7553 1093 6358 -2020 -2240 1803 4673 -959 -4862
1025 -4862 6882 2544 -7285 2950 4644 -3232 -1653 398 3321 -2299 -5894 5651 1323 -7987
1039 -7987 1174 3610 -2341 -3932 119 5642 -3900 -6244 8712 1825 -8516 3613 5892 -2410
1053 -2410 -3864 3167 6494 -5297 -3819 9620 -540 -7534 4348 3696 -3059 -3478 1863 4847
1067 4847 -6358 -4337 7527 -1941 -6812 2448 2412 -1920 -4814 1658 5947 -6301 -3234 9052
1081 9052 -1197 -5895 4111 4317 -1844 -3862 4632 5620 -7612 -415 9371 -4205 -4543 4805 2029
$$ packed form
981g096Q620O424j4990M227J1016r200k426N379J877k683n841P415L550j2077
995e805M943O479o878r56J311L362j190q039Q166L979j2298M421P200o273k095
1010c673K807M863m045p083J1981J03j2506Q646N265q378k20M043K870n632l903
1025d862J1744m338r829J0235J694p876J579K051K923n620l595J1545m328r310
1039g987R161K436n951j591M051N523r542k344J4956o887j0341J2129K279q302
1053b410j454P031L327j1791J478J3439j0160o994J1882o52o755m19N341K984
1067D847j1205K021J1864r468m871R260l6m332k894O472M289j2248L067J2286
1081I052j0249m698J0006K06o161k018Q494R88j3232P197R786j3576l38R348k776
$$ plain form
1096 2029 -3082 -3417 3815 2525 -8363 322 6127 -5532 -3792 3077 1028 -2468 -4012 4388 3026
1111 3026 -7966 1665 7002 -4259 -2534 4045 3353 -2497 -3423 7049 2968 -8686 3673 6954
1125 6954 -5821 -2510 4683 1954 -4575 -3081 6584 -539 -8545 3815 3937 -5870 -1829 2677 1151
1140 1151 -3469 -3291 5949 342 -7205 4162 4737 -4195 -1418 3706 3610 -3829 -2729 8409 -213
1155 -213 -7520 5547 4177 -5160 -1748 3891 2379 -5950 -2108 7550 -3551 -7230 5768 1496
1169 1496 -5792 -1202 2718 1339 -4814 -902 6709 -3167 -4710 5664 1776 -3035 -344 3391 3101
1184 3101 -4567 -252 7674 -3320 -4271 6271 1127 -4279 -981 3683 710 -6954 1096 6301 -6811
1199 -6811 -3437 6145 -1313 -5255 -21 3814 -826 -6055 3313 5444 -6676 -1355 6541 -579 -3427
$$ packed form
1096B029n111l35P232j290j0888Q685N805j1659J740O869k049l496j544Q400j362
1111C026j0992R631N337j1261J725O579o92n850r26J0472m081j1654J2359L281
1125F954j2775L311P193k729o529J494R665p123q006J2360J22r807M041M506j526
1140A151m620J78R240n607p547J1367N75q932K777N124r6p439J100J1138q622
1155b13p307J3067j370r337L412N639j512q329L842R658j1101l679J2998m272
1169A496p288M590L920j379o153L912P611r876j543J0374l888m811K691L735k90
1184C101p668M315P926j0994r51J0542n144n406L298M664k973p664Q050N205j3112
1199f811L374R582p458l942N234L835m640n229R368K131j2120N321P896p120k848
$$ plain form
1214 -3427 861 5325 720 -5901 3917 6445 -6322 -1604 6370 151 -4471 -879 5598 -638 -8231
1229 -8231 4024 5074 -7857 -1637 5343 -1089 -4819 -644 5166 -1399 -6369 5154 3637 -6301
1243 -6301 886 4461 -190 -2398 -19 5114 -534 -4886 5253 3067 -5179 857 3213 -159 -3053
1258 -3053 -380 4838 -2627 -5607 5233 1084 -6570 680 3211 -1483 -4044 826 4895 -4029 -4048
1273 -4048 6986 50 -5255 2522 3219 -993 -2125 2022 4636 -3252 -2190 6181 -365 -3965 1793
1288 1793 1770 -204 -3333 677 4367 -4426 -3053 5329 -1673 -4532 1085 1806 -1181 -4311 2097 3907
1304 3907 -5601 -790 5908 -2323 -3007 3106 2273 -1072 -2297 3869 3394 -4976 970 5264 -2615 -1909
1320 -1909 2057 1384 -834 -3281 2297 2317 -5518 -28 3897 -2793 -2885 596 2133 -1385 -4103 3325
$$ packed form
1214c427M288M464m605o621R818K528j2767M718P974o219m622L592O477o236p593
1229h231J2255J050j2931O220O980o432l730M175N810o565m970J1523j517r938
1243f301P187L575m651k208K379N133n648m352J0139k186q246O036K356l372k894
1258c053K673N218p465k980J0840m149p654P250K531m694k561M870M069q924j9
1273d048J1034o936n305P777O97m212j132M147K614p888J062Q371o546l600N758
1288A793k3j974l129M010L690q793J373Q382p002k859N617P21k987l130O408J810
1304C907r508M811O698q231o84O113q33l345j225O166m75q370N946M294p879P06
1320a909L966o73k218k447N578K0p835N490L925o690r2L481J537l518k718P428
$$ plain form
1336 3325 2486 -5803 1363 4260 -2431 -1283 1959 2346 -751 -2259 4084 1294 -4279 2708 2491 -2258
1352 -2258 71 891 1125 -1082 -2205 2851 -262 -4387 2139 927 -2724 -600 268 1104 -2154 -2351
1368 -2351 3997 -441 -4158 3533 2307 -2725 -202 2222 2316 -2658 -1050 5418 -1371 -3626 4115
1383 4115 1385 -2615 -377 1513 1571 -3023 -1378 4025 -2292 -3428 2403 183 -1726 -1305 186 2208
1399 2208 -3007 -1618 4178 -1267 -2630 2702 1264 -285 -915 1340 3145 -2896 107 4492 -2276
1414 -2276 -1350 2982 -72 -796 -638 1048 912 -3138 375 2201 -3453 -932 1394 -1269 -501 -1283
1430 -1283 626 1081 -3139 708 2532 -2311 -101 1862 602 9 -1074 2514 1784 -2897 1695 2839
1446 2839 -2676 109 1623 -101 -517 -1046 2037 -64 -3541 1498 712 -3193 216 160 -923 -320
$$ packed form
1336C325q39q289P166K897o691J148L242L87l097j508O343k790n573O987k17m749
1352b258K329Q20K34k207j123N056l113m125O526j212l651K124Q68Q36l258j97
1368b351O348m438l717P691j226n032K523K424R4m974J608O468o789k255P741
1383D115k730m000K238J890N8m594J645N403o317j136N831k220j909M21J491K022
1399B208n215J389N796n445j363N332j438j549o30K255J805o041L003M385o768
1414b276R26M332l054p24J58J686j36m050L513J826n654K521K326k663P68p82
1430a283J909M55m220L847J824m843K210J963j260n93j083L588p30m681M592J144
1446B839n515K785J514j724m16n29L083k101l477N039p86l905L409n6j083O03
$$ plain form
1462 -320 -1227 1169 -127 -2284 1904 624 -1921 1199 488 839 153 -1037 2998 283 -2378 2875
1478 2875 1125 -1905 1129 805 415 -1121 -742 2481 -1637 -2506 2487 -593 -2585 532 -487 160
1494 160 -1327 -1223 2307 -1143 -1900 1984 -124 -332 365 19 1964 -650 -1046 2994 -311 -1145 2015
1511 2015 244 170 -32 -71 1324 -1506 -814 1981 -1691 -978 1111 -1561 -261 -234 -1102 443 -1519
1528 -1519 -150 1178 -1756 451 1381 -1244 1261 275 33 1660 -615 723 2117 -1346 618 1418
1544 1418 -602 638 -378 663 795 -2602 596 1222 -2649 203 647 -1321 -502 -995 686 294
1560 294 -2375 1015 850 -1860 820 668 -168 929 -913 1291 1397 -1233 1284 1412 -734 736
1576 736 -22 745 589 -2008 1386 812 -2360 932 424 -1636 -29 -596 174 -212 -1719 1123 -296
$$ packed form
1462c20r07K396j296k157M188j280k545L120p11L51o86j190M035k715k661N253
1478B875j750l030L034l24l90j536L79L223m118q69M993l080j992L117j019O47
1494A60j487J04L530l450p57L884k108k08O97l46J945k614l96M040l305q34L160
1511B015j771p4k02l9J395k830O92K795l672P13K089k672J300K7q68J545j962
1528a519J369J328k934K207R30k625K505r86k42J627k275J338J394l463J964Q00
1544A418k020J240j016J041J32l397L198O26l871K852M44j968Q19m93J681l92
1560B94k669L390j65k710K680j52q36J097j842K204J06k630K517J28k146J470
1576G36p58P67j56k597L394n74l172L292n08k060J607n67P70l86j507K842j419
$$ plain form
1593 -296 -1918 1265 -357 -790 1061 -791 954 519 -832 1511 384 -991 1581 133 102 951
1609 951 -945 1335 150 -1716 1576 -267 -1778 744 -683 -367 -395 -1383 800 -1196 -1293 1787 -1113
1626 -1113 -993 1620 -997 62 610 -300 1524 -214 -137 1740 -484 540 1327 -632 816 173 -759
1643 -759 1663 -942 -433 1724 -1283 -384 680 -1043 -59 -1131 -491 996 -2204 -154 1556 -1696
1659 -1696 -210 938 -459 349 -431 737 1312 -1770 713 1626 -1184 1007 471 43 1005 -1113 427
1676 427 1723 -1794 -167 797 -1122 -135 -527 148 453 -2237 568 1013 -2306 339 606 -1132 423
1693 423 -488 240 867 -1178 1036 890 -1123 1608 278 -108 1519 -417 423 798 -1061 875 240
1710 240 -1020 745 -600 -632 544 -1329 205 -184 -1872 1221 -499 -1508 1305 -646 -702 577
$$ packed form
1593b96j622L183j622m33J851j852J745m35j351K343j127j375K572j448l1Q49
1609I51j896K280j185j866L292j843j511K522j427L16k8r88K183j996r7L080k900
1626a113J20K613k617J059N48r10J824j738P7J877k224J024P87j959J448o43r32
1643g59K422k605N09K157l007Q99J064j723R84j072O40J487l200K050J710l252
1659a696J486J148j397Q08p80J168N75l082K483R13k810K191n36m28R62k118J540
1676D27J296l517J627R64j919R87l92O75L05k690K805M45l319K645K67j738J555
1693D23r11P28O27k045K214j46k013K731j330l86J627j936Q40L75j859J936o35
1710B40j260J765j345l2J176j873J534l89j688L093j720j009K813j951n6J279
$$ plain form
1726 577 -164 783 -558 -364 2078 -609 -601 2380 -274 86 902 -222 1108 -455 -416 1818 -811 -683
1744 -683 975 -909 -138 -510 -837 779 -1333 -1190 1331 -1200 -881 786 -526 304 -467 -109 1873
1761 1873 -1028 59 1881 -1006 201 1545 -451 895 -89 35 1066 -856 -5 755 -1490 445
1777 445 102 -883 569 -1079 -557 1045 -1686 -154 685 -969 147 -270 -247 651 -798 426 1263
1794 1263 -1288 895 940 -759 1173 104 19 1125 -801 816 585 -993 1066 -150 -1163 923
1810 923 -836 -639 482 -1365 -16 -83 -1145 932 -593 -468 518 -739 205 483 -986 1345 496
1827 496 -1105 1718 179 -145 1078 -32 816 105 -454 1909 -383 -1009 1644 -605 -615 275 -882
1844 -882 305 -691 -1126 1036 -738 -980 538 -853 26 270 -860 1533 -205 -1153 1699 -127 -303
$$ packed form
1726E77p41R47j341J94K442k687QK981k654L60Q16j124J330j563L9K234k629J28
1744f83J658j884P71l72l27J616k112J43K521k531L19J667j312Q30p71L58J982
1761A873k901J087J822k887J207J344j996J346r84J24J031j922Q51P60k245J935
1777D45l43r85J452j648N22J602k731J532Q39j654J116m17K3Q98j449J224Q37
1794A263k551K183M5j699J932j069q5J106j926J617k31j578K059j216j013K086
1810I23j759J97J121j847J349o7j062K077j525J25R86j257R44K78j469K331q49
1827D96j601K823j539l24J223j110Q48p11n59K363k292o26K653k249j0Q90j157
1844h82J187r96m35K162j774k42J518j391Q79K44j130K393j738r48K852j826j76
$$ plain form
1861 -303 962 -86 810 -141 -477 1589 -500 -591 1061 -644 -120 441 -1396 545 -353 -1420 568
1878 568 -1005 -536 172 -1146 264 -46 -1664 1042 -268 -897 1003 -401 -149 1216 -632 950
1894 950 325 -224 1487 -166 144 909 -918 670 872 -1322 555 173 -952 452 -810 -275 284
1911 284 -1712 492 -18 -1056 886 -587 -608 836 -1216 406 1109 -577 699 511 -164 860 -495
1928 -495 498 1171 -1058 851 754 -932 710 290 -494 567 -939 117 408 -1593 279 -18 -1252
1945 -1252 621 -664 -500 480 -1093 498 685 -1101 676 525 -56 855 -100 837 709 -938 1468
1962 1468 650 -1248 994 427 -704 422 -510 329 -223 -1546 823 -277 -1217 444 -532 -563 254
1979 254 -1205 737 181 -1552 887 105 -482 771 -68 651 295 -749 1438 355 -896 1375 39
$$ packed form
1861c03J265j048Q96r51l36K066k089r1J652j705N24N61j837J941q98j067J988
1878E68j573M69P08j318J410l10j618K706j310o29J900j404K52J365j848J582
1894I50o25n49J711j653L10P65j827J588K02k194J877l82j125J404j262N35N59
1911B84j996K204n10j038J942j473k1J444k052J622P03j686J276j88o75J024j355
1928d95R93O73k229J909r7j686J642m20p84J061j506J056K91k001J872k97j234
1945a252J873j285J64R80j573J591J87j786J777j51n81R11r55R37j28j647K406
1962A468q18j898K242n67j131J126r32Q39n52j323K369j100r40J661r76l1Q17
1979B54j459J942n56j733K439p82n87J253q39P19l56j044K187j083j251K271j336
$$ plain form
1996 39 -301 704 -269 345 379 -896 628 -833 -857 770 -1325 -416 557 -1033 3 -251 -1101 685
2014 685 -896 -331 1058 -927 355 931 -366 653 -376 334 1415 -952 310 1667 -676 33
2030 33 721 23 45 -947 167 892 -2067 69 940 -1642 -358 -131 -408 -46 -1163 271 723 -1647
2048 -1647 311 676 -722 537 48 356 818 -1200 774 1400 -987 645 1007 -571 260 -269 284
2065 284 368 -1524 878 276 -1797 553 1 -1222 -68 -748 46 -55 -1373 981 14 -1288 1114
2082 1114 68 -509 766 -155 898 307 -718 1158 319 -754 979 97 -245 365 -596 815 -565
2099 -565 -1254 1288 -473 -1462 978 -534 -680 -195 -571 487 -903 -642 1471 -784 -853 1135 -487
2116 -487 112 557 -20 1224 -512 7 1677 -457 -66 1201 -86 149 -19 -154 976 -1244 -567
$$ packed form
1996C9l40J005r73O14L4j275J524j461k4J627k095R09R73j590J036k54q50J786
2014F85j581N65J389j985J282N76j297J019j029P10J081k367J262J357k343P09
2030C3O88o98K2r92J114P25k959K136Q71k582J284K27k77L62j117J434M52k370
2048a647J958L65j398J259m89L08M62k018J974O26k387J632L62j578Q31n29N53
2065B84Q4j892K402o02k073K350n52j223J154o80P94j01j318K354r67j302K402
2082A114j046n77J275r21J053n91j025J876q39j073J733q82l42O10r61J411j380
2099e65o89K542j761r89K440j512j46M85l76J058j390K61K113k255o9J988j622
2116d87N99M45n77J244j736N19J670k134L91J267j287K35j68j35J130k220O77
$$ plain form
2133 -567 1509 -1091 -853 582 -500 -362 -739 112 965 -1791 56 1514 -1192 -229 731 15 335
2150 335 -225 599 1131 -1180 255 1214 -754 352 480 4 269 -667 247 711 -1588 97 469 -1061
2168 -1061 -138 -154 -591 192 -974 258 112 -1548 856 282 -1218 836 0 -289 588 -169 994 362
2186 362 -689 1707 347 -1019 1142 -7 -96 -28 -453 780 -233 -1192 1523 -133 -917 109 -297
2203 -297 -15 -807 -654 1287 -469 -1560 1561 -44 -938 336 367 542 -431 145 1823 -652 -903 1657
2221 1657 -170 -340 379 -123 407 -520 -623 1283 -854 -932 978 -621 -610 -359 -284 251 -992 -538 912
2240 912 -692 -356 1171 -283 -38 194 364 895 -790 679 1516 -775 277 1344 -516 -93 332
2257 332 330 363 -988 -36 603 -1566 141 336 -831 -101 -707 21 299 -1269 300 524 -1357 550
$$ packed form
2133e67K076k600K38J435j082J38l77Q51Q53k756J847J458k706R63R60p16L20
2150C35n60Q24N32k311J435R59j968J106J28m76K65r36R14M64k299J685L72j530
2168a061R23j6m37P83j166J232j46j660K404n74j500K054q36k89Q77p57J163o32
2186C62j051K396j360j366K161j149q9O8m25J233j013r59K715j656p84J026m06
2203b97K82p92J53J941j756j091L121j605q94J274L1J75r73N76J678k475k51K560
2221A657j827j70P19n02N30r27j03J906k137p8J910j599J1K51P5N35j243M54J450
2240I12j604L36J527j454K45K32J70N31j685J469Q37k291J052J067j860M23M25
2257C32kL3j351R52O39k169J707J95j167P30o06P28K78j568J569K24j881J907
$$ plain form
2275 550 481 -333 153 -31 622 443 -1086 1215 837 -998 938 640 -362 467 30 349 -72 -779 1163
2294 1163 22 -1393 324 59 -502 -296 -718 361 -755 -1141 895 79 -1039 755 161 0 -57
2311 -57 -358 1127 -202 -896 1891 288 -734 969 274 119 -156 -426 1171 -316 -749 1139 -536
2328 -536 -635 326 -410 122 -357 -469 461 -609 -487 1076 -582 -307 311 -465 359 -122 -50 1100 -468
2347 -468 45 1234 -616 108 709 -167 468 -347 141 630 -1244 -14 787 -946 -170 233 -496 -128
2365 -128 -560 228 389 -1513 1 792 -890 -138 440 241 198 -553 742 999 -799 508 1132 -493
2383 -493 507 92 299 388 -1008 891 738 -1468 410 427 -820 -220 -407 -72 -100 -1060 790 203 -993
2402 -993 588 196 -230 413 -285 563 464 -519 980 259 -541 662 458 -71 279 -287 734 38 -912
$$ packed form
2275E50o9q14M86j84O53j79j529K301l78j835J936k98j002Q29m37L19m21p07J942
2294A163j141j415J717k65n61K06m22J079j116l86K036q16j118J794n94j61n7
2311e7l01J485j329o94K787j603j022J703o95j55k75k70J597j487m33J888j675
2328e36r9R61p36N32m79j12R30j070J22J563j658K75O18p76Q24m81P2J150j568
2347d68N13J189j850P24O01q76O35q15M88M89j874J230Q01j733P76M03p29L68
2365a28m32P88J61j902J514P91j682P52N78j99m3p51J295K57j798J307O24j625
2383d93J000m15K07Q9j396J899j53k206J878J7j247O00j87L35k8r60J850n87j196
2402i93J581l92m26O43o98Q48r9r83J499p21q00J203k04n29L50n66J021o96r50
$$ plain form
2421 -912 864 -284 -935 442 -161 -232 1 -740 201 -255 -550 707 -392 -463 630 -460 110 258
2439 258 -335 369 -106 -430 898 -74 11 773 -149 284 189 -243 495 -500 -265 817 -499 -277 253 -551
2459 -551 -24 -213 -158 31 -1102 -342 988 -991 -350 560 -260 107 -263 -113 837 -592 370 986 -551
2478 -551 427 424 243 593 -599 353 601 -829 -5 567 -585 -161 -283 -188 -195 -1248 142 178 -1218 138
2498 138 113 -426 68 16 80 680 -465 248 627 -250 651 -197 -88 945 -284 -197 770 -582 248 309
2518 309 -636 287 -202 -571 191 -532 -278 168 -609 421 -89 -966 642 -359 -575 269 -97 159 -96
2537 -96 -173 1180 -261 -365 964 161 103 478 -12 608 67 -467 1006 -141 -563 385 -68 -240 -289 -516
2557 -516 365 -665 -709 518 -468 -617 201 -305 -12 -499 -242 859 -545 -83 1006 -127 -53 594 92
$$ packed form
2421i12J776j148o51J377o03p1K33p41R41m56k95J257j099p1J093j090N70J48
2439B58n93P04m75l24J328r72Q5P62r22M33r5m32P38r95K35J082j316K22N30q04
2459e51N27j89N5J89j133P60J330j979O41R10q20L67l70J50R50j429R62O16j537
2478e51R78lj81L50j192R52K48j430Q24N72j152M24j22R5pj053J390L6j396J356
2498A38k5n39M94n2O4O00j145P13L79q77R01q48J09J033j229Q7R67j352Q30O1
2518C09r45R23m89l69P62p23K54M46p77J030n10q77J608j001k16Q44l66K56k55
2537i6p7J353j441j04J329q03n8L75m90O20n41n34J473j147m22R48m53j72m9k27
2557e16Q81j030m4J227r86j49Q18n06K93m87K57J101j404M62J089j133P4O47n02
$$ plain form
2576 92 598 -88 -182 724 -230 -259 523 -622 -94 -126 -377 188 -549 -426 429 -886 -343 656 -511 -44
2596 -44 38 -177 293 -661 224 745 -721 283 721 -189 433 183 34 611 -336 248 498 -542 238 104
2616 104 -686 390 -596 -132 301 -860 -56 311 -721 112 -427 -377 251 -228 -165 364 -367 419 106 -572
2636 -572 937 520 -199 471 -91 455 175 -346 815 -108 -583 507 -67 -478 226 -395 188 -147 -716
2655 -716 803 -132 -822 451 -116 152 -49 -361 725 -78 -688 1014 126 -317 439 212 318 182 135
2674 135 611 -116 -360 822 -553 -232 462 -447 295 -130 -386 324 -342 -427 141 -534 -125 199 -482 451
2694 451 82 -156 685 -48 163 799 -290 490 404 -11 434 -200 313 561 -226 300 446 -964 171
2713 171 303 -367 17 -582 -223 330 -723 153 181 -392 76 -86 -196 91 -595 114 485 -606 563
$$ packed form
2576I2N06o86r4R06r54k9P82j145N28l2k51N65p37J23Q55j315N43R99j167M67
2596d4Q2k15M70r54Q85N21j466J004M38r10O22k50j49N77r47N84K50j040P80j34
2616A04p90J076r86M64M33j161Q04L67j032Q33n39N0O28m79O3N29p31P86l13o78
2636e72J509m17p19O70n62N46k80n21J161r23m75J090n74m11P04o21N83l35n69
2655g16J519r35o90J273n67K68k01l12J086q03o10J702q88m43P56k27J06j36m7
2674A35M76p27k44J182j375L21O94r09P42m25k56P10o66q5N68o75M09L24o81R33
2694D51l69k38Q41p33K11O36j089P80q6m15M45o34N13K48p87N26J46j410J135
2713A71J32o70L84n99L59N53j053Q76K8n73M68j62j10K87o86P09L71j091J169
$$ plain form
2732 563 625 -186 333 172 211 420 -451 644 438 -724 329 181 -496 -49 -154 114 -104 -884 284
2751 284 -251 -821 464 -179 -494 339 -451 9 72 -597 735 449 -217 600 43 89 197 -216 855 -3
2771 -3 -506 792 -42 -579 277 -373 -87 154 -462 242 -83 -628 424 -528 -436 198 -411 47 -11 -756 498
2792 498 -121 -145 563 18 -62 526 -415 679 379 108 694 -212 153 617 -299 -70 549 -676 -218 24
2812 24 -96 313 -652 -86 545 -948 -149 344 -410 169 -205 -103 568 -711 353 657 -468 338 484
2831 484 181 468 -173 278 652 -684 412 624 -534 104 -71 -65 1 -762 -160 451 -688 -36 293 -712
2851 -712 123 -448 61 403 -451 303 241 -234 398 5 -252 751 -83 130 675 -338 481 372 -86 729
2871 729 134 -281 440 -450 77 -140 -599 389 -202 -479 360 -509 -255 228 -353 -169 -214 -320 599 -99
$$ packed form
2732E63O2q11N19j61L9K09q71J095k06j162J053j48o77M47j05K68k18p80J168
2751B84n35n70J285o43l15Q33p90M60O3o69J332k86o66Q17n57M6J08m13J071q58
2771cn03J298q34n37Q56o50K86K41o16P04l25n45J052r52R2O34o09M58n8p45J254
2792D98o19k4P08n45q0N88r41J094l00k71N86r06L65M64r16K29O19j225M58K42
2812B4j20M09r65N66O31j493P99M93p54N79l74J02O71j279J064L04j125Q06J46
2831D84l03K87o41M51L74j336J096K12j158O38j75OO6p63O02O11j139O52L29j005
2851g12Q35n71N09L42q54P54o2m75O32l93k57J003q34K13N45j013Q19j09m58Q15
2871G29n95m15P21q90N27k17m59R88n91k77Q39q69K54M83n81J84m5j06R19o98
$$ plain form
2891 -99 -374 609 1 -11 367 -183 376 79 -201 443 -64 -28 511 -165 47 243 -231 339 -359 -458 407
2912 407 -601 -389 219 -469 137 -95 -431 379 -353 -231 711 -431 128 332 -337 295 0 172 878
2931 878 -154 -55 709 -255 -45 282 -183 150 -414 -325 548 -589 -192 260 -762 9 -189 -162 251 -397
2951 -397 244 457 -499 104 151 -98 459 -45 190 605 -146 273 665 -300 550 297 54 634 -363 -238
2971 -238 463 -550 44 139 -583 286 -295 -538 138 -690 -373 174 -486 388 -43 -519 397 -41 21 365
2991 365 106 134 138 -130 730 188 -210 346 -64 -116 286 -347 436 86 -280 617 -147 -709 447 -320 -433
3012 -433 -63 -464 564 -229 -588 555 -310 -400 275 20 182 24 20 665 -30 256 756 -9 -131 376
3032 376 -199 498 -53 -551 397 -361 -585 446 -515 -344 -301 -496 242 -147 -365 380 -344 -305 426 -330
$$ packed form
2891i9k75R83o08j2L78n50N59k97k80O44n07L6N39o76K12J96m74N70o98r9Q65
2912D07j008K12O08o88O06k32l36Q10p32J22R42j142N59K04o69O32k95J72P06
2931H78j032R9P64r64K10L27m65L33n64Q9Q73j137L97M52j022P71j98K7M13o48
2951c97O41K13r56O03M7k49N57n04K35M15p51M19L92r65Q50k53k43N80r97J25
2971b38P01j013N94R5p22Q69n81k43O76q28L17N47o60Q74m31m76R16m38O2L44
2991C65k59K8Mk68Q60n42l98N56m10n2M02o33P83l50l66Q97p64n62J156p67j13
3012d33L70m01J028p93l59J143q65r0O75k55J62j58mO45o95K86N00p65j22N07
3032C76n75O97n51m98R48p58k24J031r61J71M3j95P38l89k18P45p24L9P31p56
$$ plain form
3052 -330 124 326 -163 516 -296 13 640 -236 278 478 -428 168 333 -415 238 -578 -212 424 -898 -112
3072 -112 15 -540 -78 -337 -190 121 -588 191 168 -479 412 256 -516 281 75 203 211 -433 780 80 -518
3093 -518 566 463 -413 168 -131 122 102 -426 580 -92 -541 265 -287 -296 -42 -501 500 -81 -747 104
3113 104 294 -681 444 289 19 -64 -24 692 121 -404 669 149 -332 193 -4 93 -13 -381 691 -418
3133 -418 -549 492 -192 -440 -50 -631 91 12 -440 420 -271 -480 127 -131 -11 356 -253 558 -5 -108
3153 -108 739 -121 109 478 -374 15 363 -242 75 88 -108 548 -657 23 258 -926 -344 16 -436 -160
3173 -160 -391 -290 118 -595 100 508 -701 250 118 -121 158 -144 294 635 -381 278 608 -377 316
3192 316 93 102 378 -478 297 149 -758 12 -14 -633 97 -193 -42 -80 -545 -51 269 -649 250 -62 -479
$$ packed form
3052c30M54K02m89O79q12L09O27q76N14K00r06N96J65p48O53q16L66O36j322P86
3072a12J27n55M62k59J47L11p09P79k3o47Q91j56p72P97k06J28Qo44J213p00n98
3093e18J084j03q76N81k99K53k0n28J006o72m49Q06n52rK54m59J001n81o66Q51
3113A04J90r75J125j55k70q3M0P16n71n25J073n20m81N25j97R7j06l68J072j109
3133d18j31J041o84k48L90n81P22p9m52Q60o91k09O07k58J20L67o09Q11n63j03
3153a08Q47q60K30L69q52L89L48o05L17J3j96O56j205O80K35j184N82L60m52K76
3173a60k31J01M08p13O95M08j209R51j32k39K79l02M38L41j016O59L30r85O93
3192C16k23RK76q56P75j48r07P70k6o19P30k90J51l8m65M94L20r18Q99l12m17
$$ plain form
3213 -479 378 -187 243 392 -327 407 279 -212 730 166 -103 362 -201 181 172 -479 493 -63 -548 403 -58
3234 -58 -461 41 -223 144 -221 -372 171 -344 0 495 -194 112 193 82 606 185 99 636 -6 -61 586
3255 586 -204 18 233 -74 499 -97 -25 539 -493 -50 119 -238 -165 -50 -162 157 -409 -206 553 -818
3275 -818 -91 433 -423 116 95 284 663 -496 95 629 -277 206 112 -51 160 -63 246 513 -563 -124
3295 -124 419 -435 -35 71 -139 -329 -600 -38 1 -862 137 124 -581 277 -128 -29 545 20 377 307 -251
3316 -251 572 272 -263 449 -159 -140 382 -305 434 160 -399 293 -236 -285 253 -201 -228 -77 -118 267 -96
3337 -96 -570 510 -185 -503 430 33 297 -124 8 580 -263 -103 687 -1 -15 403 50 223 -137 -259
3357 -259 574 -327 -157 473 1 -251 -164 -258 178 -460 -314 388 -367 -203 315 -247 -179 -258 72 525 -50
$$ packed form
3213d79Q57n65M30J49p19P34j28m91R42n64k69M65n63L82ro51R72n56m85R51m61
3234e8m03N02k64L67l65j51N43n15L44M95o89L06Q1j11N24m21q6N37o42n5O47
3255E86p90K22K15l07N73n96P2N64j032M43J69l57P3J15j12L19n66K03P59j371
3275h18P27N24q56N39k1J89L79j159N91N34r06M83r4j63K11k23L09K67j076M39
3295a24N43q54M00J06k10j90k71N62L9q63R99j3p05Q58m05R9N74n25L57p0n58
3316b51Q23l00n35P12o08J9N22o87P39k74n59O92n29m9N38m54k7J51m1L85l63
3337i6m74J080o95l18R33l97K64m21J32N72q43J60P90o88j4M18l53J73l60j22
3357b59Q33r01J70O30m72k52Q7r4M36o38J46P02p55J64N18n62O8p9L30M53n75
$$ plain form
3378 -50 75 701 -288 -85 628 -45 176 -9 29 491 -106 137 362 -393 110 187 -214 -8 -83 -72 14 -589
3400 -589 -57 154 -534 -25 213 -335 228 -228 165 28 -191 545 478 -444 390 373 -118 301 -20 58 320
3421 320 -209 429 149 -405 343 -97 -194 234 -254 -169 -123 -308 450 -110 -451 362 5 -335 -53 -349 375
3442 375 56 -271 743 367 -325 480 102 -130 70 132 538 -226 -307 656 -140 -230 183 -167 -137 -302 -395
3463 -395 226 -330 -444 247 -129 -267 174 -198 131 8 -20 568 -72 38 584 -116 231 101 -152 317
3483 317 -43 26 190 -325 -141 62 -137 -135 -276 -464 -34 -43 -359 -125 -698 19 40 -622 77 106 -364 62
3505 62 -30 -69 229 -425 399 343 -155 300 239 50 104 -56 193 375 -485 315 226 -394 -24 -192 -291 34 -140
3528 -140 178 25 -449 -39 -37 -184 39 -4 78 252 -395 489 97 -562 472 190 197 35 -134 127 185 -277
$$ packed form
3378e0J25O26r89K03P13o73K21j85L8M62n97K43K25p55N03P7m01K06p5J1Q6o03
3400e89N32K11o88N09K38n48N63m56L93j37k19P36o7r22Q34j7m91M19l21P8K62
3421C20n29O38k80n54P48m40r7M28m88Q5M6j85P58n60l41Q13l57l40K82k96P24
3442C75l19l27J014l76o92Q05l78k32K00O2M06p64q1R63p96r0M13l50L0j65r3
3463c95O21n56j14O91l76j38M41l72L29j23k8N88o40J10N46p00L47j30k53M69
3483C17l60O9J64n15J84K03j99Kj41j88M30rl16K34n73P17K1o62O99K9m70M26
3505F2r2l9K98o54Q24n6m98M55o1j89N4j60K49J82q60Q00q9o20L70j68r9L25j74
3528a40L18j53m74M10Kj47K23m3Q2J74o47Q84l92o59J034k82Pj62j69K61N8m62
$$ plain form
3550 -277 362 -184 -230 301 -284 87 97 -396 99 -26 -317 365 -223 -298 306 -43 166 3 6 321 42 -31
3572 -31 454 -211 113 472 104 254 100 -134 343 -136 21 193 -346 -166 136 -365 138 -61 -380 170
3592 170 -204 -202 7 -506 -32 359 -437 110 80 -89 12 -174 143 690 -205 309 267 -103 531 336 182
3613 182 115 -414 171 327 -369 -50 -36 -370 -85 -282 28 42 -588 -306 107 -346 41 24 -107 53 -124
3634 -124 203 398 -487 218 387 -204 303 -55 182 472 -225 156 320 14 212 57 -237 318 -386 -39
3654 -39 11 -453 -18 -366 -131 309 193 56 -63 -368 -13 317 -111 92 -188 120 317 -112 225 495 -189
3675 -189 9 146 -56 227 -34 -212 273 -287 -77 241 -162 -84 -105 -201 208 -344 -169 340 -307 21 84
3696 84 -3 289 200 -171 426 -228 74 314 -116 367 415 35 300 -151 97 466 -239 196 50 -345 -31
$$ packed form
3550b77O39n46m6N31n85L71J0m93M95j25k91O82n88p5O04l49K09j63LL15k79p3
3572c1M85o65L24L59l68J50j54k34M77m79J57J72n39J80L02n01N03j99l19N50
3592A70l74KK09n13M74L91p96N47l0j69J01j86L17N47q95N14m2l70O34j95j54
3613A82o7n29N85J56o96L19J4l34K85j97L10J4o30K82M13m53L87j7j31J60j77
3634a24L27J95q85P05J69n91N07l58K37K90o97L81J64l06J98j55k94N55p04L47
3654c9N0m64M35l48K35M40j16j37j19l05L55L30m28K03k80L08J97m29L37K70o84
3675a89J98J37k02K83k61j78M85n60K10L18m03P8k1r6M09n52J75N09o47L28O3
3696H4q7K92q9l71N97o54L02K40m30M83M8l80K65m51K48L69p05M35j46l95L14
$$ plain form
3717 -31 -161 -240 171 -243 -249 267 -531 -50 158 -125 158 -210 -68 410 -306 123 297 -120 401 -115 0
3738 0 476 -158 108 236 -184 124 213 -279 190 -388 -170 288 -64 -150 -24 -182 -126 -64 -243 262 -408 -97
3760 -97 225 -218 176 254 -260 329 173 -102 546 -151 256 275 5 210 142 -224 354 -308 -148 434 -458
3781 -458 -195 -27 -269 56 -262 -382 368 -192 -239 172 -353 39 -126 -319 474 -151 -212 453 -142 135 339
3802 339 141 421 -12 -4 411 -50 -51 -60 -272 14 20 -310 454 -92 -424 92 -55 12 31 -355 187 11 -285
3825 -285 145 -97 -406 34 71 -79 236 -241 434 74 -566 301 185 11 462 -98 79 -55 -375 193
3845 193 -49 15 213 -226 -70 -37 -256 84 -15 -262 30 14 -106 183 -227 186 184 -93 278 80 111 474
3867 474 -206 419 307 -198 74 138 -98 336 -281 -94 191 -347 135 87 -283 109 -23 -194 181 -315 -240
$$ packed form
3717c1j30p9M11m14oN16p98M81K08k83K83l68J42M78p16M29J74m17N21n16J15
3738@M76o34K66J28m20L08Q9m92M69n78K18M58l52q6J26j58N6O2j79N05o70L11
3760i7L22m43L94P8n14N89j56k75O48o97M07J9k70K05o8l66N78o62J60N82q92
3781d58K63J68k42L25l18j20P50n60m7M11n25L92j65j93P93o25o1O65n95K77K04
3802C39j98K80m33QM15m61jrk12K86Ol30P64n46l32N16j47O7J9l86N42j76k96
3825b85M30k42l09M40L7j50L15m77O75l60o40Q67j16j74M51n60J77j34l20N68
3845A93k42O4J98m39J56L3k19L40r9k47K92j6j20K89m10M13kk77L71j98L1L63
3867D74o80O25j12n05K72O4k36M34o17J87K85n38M82m8l70L92j32j71L75m96P5
$$ plain form
3888 -240 221 -241 162 32 -299 188 -114 283 467 -51 367 137 12 384 223 -114 552 -67 154 259
3908 259 -424 83 26 -346 164 -338 -281 -58 -370 -362 -247 -90 149 51 -196 101 31 -109 243 -14 441 178
3930 178 -23 434 383 -73 237 169 -63 362 -202 330 117 -356 -46 -211 -356 -159 -428 -153 11 -546 8
3951 8 47 -282 18 -299 126 -85 -224 282 -15 -294 262 61 -58 400 -81 -166 360 -86 155 130 -41 114
3973 114 -7 -152 96 -216 8 58 -140 -3 -186 -291 398 -331 96 180 -287 276 169 -124 54 -35 35
3994 35 516 -237 2 251 -196 297 110 -6 281 -356 110 84 -390 133 2 -401 348 -228 -397 119 -341
4015 -341 50 323 -10 186 -209 -58 323 -200 135 254 -178 263 152 46 553 -3 86 253 -335 93
4035 93 116 -135 361 46 105 228 -206 -45 102 -476 -54 -29 -489 63 5 -163 354 -248 81 172 69 205
$$ packed form
3888b40M61m62M03j30l31M87l02L97J84n18M18k30j25L72j61l37O66o19K21J05
3908B59o83N07n7l72N10n02N7K23l12QJ15J57K39r8k47K97p0j40L52k57M55k63
3930A78k01M57n1m56L10o8k32M25n64N32k13m73L10j65j45J97k69K75J64n57N54
3951HL9l29L00l17M25k11j39N06k97k79N56k01j19M58m81q5N26m46K41k5j71J55
3973A14j21j45K48l12K24N0j98J37j83j05O89p29M27Q4m67N63j07k93J78q9P0
3994C5M81p53K39K49m47M93j87j16K87o37M66k6m74N23j31m03P49n76j69N16m60
4015c41L91K73l33J96l95J51L81n23L35J19m32M41j11j06N07n56Q9J67n88M28
4035I3K3k51M96l15N9J23m34J61J47n78M22K5m60N52n8j68N17o02L29R1j03J36
$$ plain form
4057 205 435 58 388 186 -157 398 -91 67 357 -314 262 -63 -145 252 -174 -201 244 -387 -115 5 -370
4078 -370 -38 -314 -183 124 -318 -74 99 -53 154 116 -95 237 -76 114 263 -70 245 34 141 278
4098 278 -197 -120 45 -106 -160 294 -118 -348 -238 -176 152 -314 -156 29 -339 -21 66 -50 179 -92 -9 215
4120 215 -61 -137 298 -191 213 -32 15 427 -17 190 301 -323 32 150 -87 -62 -332 -289 -40 -181 -434
4141 -434 93 -352 -246 -220 -322 148 -237 -251 423 -154 5 152 -125 399 24 -9 464 -100 187 316 -36
4162 -36 316 62 -317 247 -25 -264 300 -244 -86 158 -241 63 -350 -428 243 -190 -151 52 -144 -11 -17 49
4184 49 247 -111 -92 190 -144 -1 317 -101 149 111 -132 266 -94 224 303 -75 -11 26 -354 140 38 -164
4206 -164 241 -243 -109 -63 -462 -41 92 -236 -131 249 -34 280 -24 297 257 -30 135 91 -202 75 8
$$ packed form
4057B05K30l77L30k02l43N55m89J58K90o71N76l25q2L97m26k7M45o31K72J20l75
4078c70L32k76J31L07m42K44J73j52K07l8k11L32l13J90J49l33L15k11J07J37
4098B78m75P7J65j51n4M54m12k30J10O2L28m66J58J85l68L18Q7j16K29k71Q3K24
4120B15k76p6M35m89M04k45M7M12m44K07J11o24L55J18k37K5k70M3K49j41k53
4141d34N27m45J06K6j02M70l85j4O74n77J59J47k77N24l75l3M73n64K87J29l52
4162c6L52k54l79N64k72k39N64n44J58K44l99L04m13p8O71m33L9K03j96J33oO6
4184D9J98l58J9K82l34J43L18m18K50l8k43L98l60L18P9l78O4L7l80M94j02k02
4206a64M05m84J34M6l99M21J33l28J05L80k83L14l04L21m0k87J65m4k93K77o7
$$ plain form
4227 8 -68 461 -227 -48 -69 -203 144 -121 -98 3 13 4 -149 -226 -24 -94 -214 57 -146 -97 182 -207 46 129
4251 129 -52 171 296 -20 186 -67 -15 154 12 170 -19 -197 136 71 -219 -262 -228 -52 -74 -263 233 -121
4273 -121 -460 286 -363 -262 -128 -205 103 -110 -275 143 -33 220 416 92 273 184 -337 318 46 -273 283
4294 283 -154 -122 84 -408 125 -4 -372 -15 -181 -373 154 -295 19 -50 -440 61 45 -329 96 -175 -5
4315 -5 430 -220 163 215 -410 184 254 -73 64 -134 92 299 -153 188 71 -293 157 -349 -90 55 -177
4336 -177 -332 160 -250 -151 -83 -172 90 -111 -130 -18 -143 192 201 -114 317 58 -60 89 -103 -47 72 -155
4358 -155 70 -63 -525 147 -196 -268 -70 -253 -7 36 -95 273 -30 -248 205 -295 4 68 -63 419 261
4379 261 -164 231 237 303 96 35 82 145 -81 0 128 -125 279 -83 89 152 -55 -104 -232 -314 22 -258 -260 382
$$ packed form
4227Hp6N29o88J79k1j34L47k65K3J01J0rj53p7K02p0j20K71k03M9K79l89K53Q3
4251A29j81K23J25l16K06k53N2J69j42J58j89j78L33o5k90m3L4J76k2j89M96l54
4273a21l39P46o49J01J34p7L08k13j65M18j76K53J96l24J81q9n21O55k72l19N56
4294B83m37L2K06m92N33j29l68L57j66j92N27m49L14o9l90N01j6l74M25k71J70
4315eM35o50L83N2o25N94P0l27J37j98K26K07m52L41j17l64M50n06K59J45k32
4336a77j55M92m10R9O8q9K62k01j9J12j25L35Rl15M31k59j18J49j92N6J19k27
4358a55K25j33m62O72l43p2J98j83K46M3j31L68l03k18M53n00K99O4j31M82j58
4379B61m25L95OO6k07o1M7O3k26Q1J28k53M04l62J72O3k07m9j28q2L36k80kO42
$$ plain form
4403 382 -379 -115 -137 -74 22 -195 -129 230 -109 -60 61 -227 198 174 -162 101 -59 142 236 -46 47 122 -360
4426 -360 -162 -116 -23 176 -98 -49 79 -248 -5 139 -335 -146 38 -11 261 -133 55 251 -159 44 124 228
4448 228 174 113 -88 576 -403 69 124 -202 -85 30 -165 86 -267 -305 178 -374 -111 103 -120 -177 -42 -195
4470 -195 72 -90 56 -25 -101 210 104 278 344 -84 -3 353 -128 -270 212 -236 201 -72 -30 102 -164 68
4492 68 110 -286 80 -103 78 29 -427 -251 180 5 -211 289 -106 148 -33 -154 550 145 -57 257 -81
4513 -81 190 -9 -178 28 30 44 129 83 198 47 -227 -114 -71 -248 -8 -277 -197 123 -211 -314 77 -226 -96
4536 -96 -236 -90 303 -115 226 17 -33 111 64 -33 132 -164 21 106 -74 306 16 -117 79 16 -126 59
4558 59 -227 -252 103 -435 -428 -73 -132 -65 -150 -52 52 -141 45 95 -223 135 42 -114 434 200 -30 375 38
$$ packed form
4403C82p61K64k2O3R6k17O6L59l39M9J21k88M25k4l36K63j60K01R4k82R3P5m82
4426c60J98M6R3J99k74M9J28l27K43J44m74J89J84m9K72l94J88J96m10K03Q0J04
4448B28n4o1k01O64r79M72N5l26J17J15j95K51l53l8M83n52K63K14k23n7J35j53
4470a95K67j62J46q1p6L11j06J74O6m28Q1L56m81j42M82m48M37k73M2J32k66K32
4492F8M2l96L66j83J81m9m56J76M31j75k16N00l95K54j81j21P04m05k02L14l38
4513h1K71j99j69K06KJ4Q5m6J15j51k74J13M3j77K40k69Q0L20l34j03L91l03J30
4536i6j40J46L93m18L41k09n0J44m7r7J65k96J85Q5j80L80k90j33J96o3j42J85
4558E9k86k5L55n38PL55n9O7q5R8J04j93J86N0l18L58r3j56N48k34k30M05l37
$$ plain form
4581 38 46 -270 220 322 -187 -400 -113 48 -34 87 -31 77 -108 -203 384 -25 -287 -184 152 176 -226 43
4603 43 138 47 -149 234 -68 -83 164 -41 196 286 -185 356 12 -285 420 -298 145 -207 -72 261 -49 -199
4625 -199 -11 47 -197 88 -195 33 -115 -322 33 1 -115 57 -182 179 13 -164 230 71 8 96 -1 158
4647 158 166 -244 279 10 -14 191 -228 14 -24 -377 102 -60 -539 3 118 -202 -12 -48 -124 -34 -48 34 151
4670 151 -121 167 159 6 82 120 128 -30 -93 236 37 -253 172 26 -293 -94 -313 268 105 -447 -141 -63 -19
4693 -19 -134 -42 -366 348 -369 -74 -208 -306 37 97 -51 122 -82 106 81 8 297 -40 -213 82 -27 -69
4715 -69 140 -118 18 -176 -291 238 -49 -435 56 -256 5 -115 -303 29 93 -233 -7 33 69 -77 -231
4736 -231 -35 192 -215 207 344 -7 277 -182 96 57 -106 226 190 -200 -182 -67 -90 -200 -343 161 14
$$ packed form
4581C8Ql16M90J02n09k13K87J61q2J21j18J08j85r5N87m09k62J03L36K4m02K69
4603D3R5r1j96L83l02j5K47k05K37R0m71N41l44k97P05p18M43l52J35L33l10j50
4625a99J88N8k44K85k83K28j48k07L55l2j16J72k39L61j66j77L94j59o3Q8r7J59
4647A58Qm10N23k69k4K05m19K42l8l53M79j62m79N42J15l20J90l6p6R0j4Q2J17
4670A51k72K88qj53P6L8Qj58o3L29j99k90M25j46l19J99k19N81j63n52L06P8M4
4693a9j15R2l24P14p17K95j34r8L43O0j48J73k04J88k5p3K89l37j73K95j09m2
4715f9K09k58J36j94j15N29k87l86M91l12K61j20j88L32O4l26K26M0L6j46j54
4736b31J96K27m07M22J37l51K84m59K78l9j63L32l6l90J8J15k3j10j43N04j47
$$ plain form
4757 14 -452 91 0 12 -50 72 -88 212 -211 131 98 -245 230 100 -154 144 -138 354 350 67 276 36
4779 36 -84 -74 -64 -63 61 -166 -215 -22 -375 -94 -105 -280 136 -172 81 -111 -205 189 158 -106 7 -22 -123
4802 -123 172 -219 98 378 -286 82 -76 61 61 -94 -51 414 -97 -31 70 -11 233 -48 -151 64 -132 -105
4824 -105 29 -146 -15 -75 -175 -29 -286 85 173 297 264 -175 -250 149 61 101 114 -148 -116 181 -209 -37 17
4847 17 -321 98 -138 73 39 -227 16 53 -55 -103 134 124 109 -155 19 56 -164 107 59 101 211 98 94 162
4871 162 -22 355 173 -99 104 23 -84 46 11 114 44 -230 -124 -31 -113 27 -288 -192 86 -31 -28 39 -207
4894 -207 -254 264 -35 207 111 129 301 -99 300 -2 -242 251 219 -116 430 -312 -102 199 -202 -136 193 -141
4916 -141 -31 -38 -129 107 -88 -71 -67 -194 142 -270 -66 283 -18 112 23 -200 173 5 146 -34 -98 -67 198
$$ packed form
4757A4m66N43r1J2o2J22j60L00m23L42l3l43M75j30k54K98k82M92mk83K09k40
4779C6j20J0J0JJ24k27m9J93l53K81j1j75M16l08K53j92r4L94l1k64J13k9j01
4802a23K95l91L17K80o64L68j58J37%j55M3M65n11O6J01q1K44k81j03K15j96K7
4824a05J34j75J31o0j00J46k57L71Q8J24l3m39p5L99q8M0J3k62L2K97l90J72N4
4847A7l38M19k36K11l4k66K43L7j08m8K37j0j5k64J74L7k20K71m8M2J10j13mO8
4871A62j84L77j82k72K03q1j07J30l5J03p0k74J06R3q2J40l15R6K78j17LO7k46
4894b07m7N18k99K42r6J8J72m00L99l02k40M93l2l35N46p42K10L01m01O6L29l34
4916a41J10pr1K36j95J7Mj27L36m12K04L49l01J30q9k23L73j68J41j80o4L1K65
$$ plain form
4939 198 -160 82 121 -242 175 50 -445 -56 9 -295 -59 -22 144 -157 -62 274 -6 -100 238 -23 -101 282
4961 282 -52 161 74 53 439 135 -24 323 92 75 36 -6 -50 -13 -337 158 -54 -247 -182 -21 53 -282 -172
4984 -172 110 -160 -377 165 -41 41 -45 -75 268 -53 -203 538 10 -210 252 121 -5 99 -251 266 -148
5005 -148 -34 133 -27 -118 153 -311 -201 78 -358 61 62 5 46 -178 -119 221 -150 180 33 -220 371 -212
5027 -212 -53 9 134 79 -102 -83 131 164 -80 96 15 142 63 -42 275 -64 1 0 -202 -55 -14 -287 144
5050 144 -75 -363 7 312 -126 114 -138 275 71 -81 186 -225 -38 228 -7 -4 48 115 -28 -124 -232 310
5072 310 129 -233 169 -259 -184 -217 -93 222 67 -159 315 71 -154 -9 -90 149 133 33 48 276 -49 168
5094 168 100 123 344 75 118 135 -285 159 301 -3 -61 -335 -24 -67 -284 158 -13 -111 -67 -182 -121 82 -97
$$ packed form
4939A98l58K42L9l63M17j25m95L89O5l04K36L7J66l01R5L36k80r4L38k61p8L83
4961B82l34K13q7k1L86l04j59L47k31j7l9m2m4L7l24M95k12j93O5J61P4l35J10
4984a72K82k70k17N42k06Q2q6l0L43l21j50P41n28k20M62j31j26J04l50N17m14
5005a48J14J67j60r1K71m64J10K79m36M19Jn7M1k24N9L40l71L30j47k53N91n83
5027b12J59O2J25n5j81J9K14L3k44J76q1J27p9j05L17l39O5jk02J47M1k73M31
5050A44k19k88L70L05m38K40k52M13k04j52K67m11J87K66k35LN2O7j43r6j08N42
5072C10j81l62M02m28P5l3J24L15j55k26M74k44k25J45q1K39j6j00J5K28l25K17
5094A68o8K3K21k69M3J7m20M44J42l04n8k74L11m3k17M42j71r8M4j15O1K03j79
$$ plain form
5117 -97 7 -41 -56 147 -89 43 -63 53 223 221 99 104 196 -56 103 -231 -4 185 -324 -64 22 -321 -100
5140 -100 94 115 -269 -108 25 111 -82 -162 308 -46 191 -33 127 175 -192 72 34 -270 147 294 -247 230
5162 230 76 -32 -75 -459 8 2 -172 95 1 180 122 -196 89 116 -129 -22 -92 -224 66 -218 -369 132
5184 132 22 178 186 -8 219 -72 -207 -11 -51 149 -39 -133 10 -8 -46 219 53 -257 149 -135 -170 101
5206 101 -377 -387 83 -206 51 -8 45 -53 -226 43 58 119 153 -93 -88 525 63 141 216 -34 204 259 -55 -137
5230 -137 83 31 202 -276 40 254 -167 -47 -39 -118 235 -307 -108 -17 -106 -43 4 156 301 -105 96 286 -119
$$ packed form
5117i7J04m8j5K03k36J32j06J16J70kj22NR2k52J59l34K27J89n09K60Q6l43K21
5140a00J94K1l84J61J33Q6j93q0M70l54K37k24J60M8l67K64l8l04M17J47n41M77
5162B30j54j08m3l84M67oj74K67r4J79n8l18K85K7k45J07p0j32K90k84j51N01
5184A32j10J56Qj94K27k91j35J96m0K00j88r4J43j8l8K65j66l10M06k84l5K71
5206A01m78j0M70k89K57n9N3r8j73K69J5O1L4k46NO13m62P8P5k50K38N5l14q2
5230a37K20n2J71m78L16K14m21J20Qp9L53n42J99R1q9O3M7J52J45m06K01J90m05
$$ [...]
8191a28
##END NTUPLES=NMR FID
##END=
