##TITLE=1H_Ad-Co-I(PbH-part)
 CDCl3
 8 sc, 
 23.3.2023
##JCAMPDX= 6.0         $$ Bruker NMR JCAMP-DX V2.0
##DATA TYPE= NMR FID
##DATA CLASS= NTUPLES
##ORIGIN= UXNMR, Bruker Analytische Messtechnik GmbH
##OWNER= root
$$ XWIN-NMR		Version 3.5
$$ Thu Mar 23 16:28:34 2023 Russian Standard Time (UT+4h)  she@DPX200
##.OBSERVE FREQUENCY= 200.13135
##.OBSERVE NUCLEUS= ^1H
##.DELAY= (6, 6)
##.ACQUISITION MODE= SIMULTANEOUS
##.ACQUISITION SCHEME= undefined
##.AVERAGES= 8
##.DIGITISER RES= 18
##SPECTROMETER/DATA SYSTEM= spect
##.PULSE SEQUENCE= zg30
##.SOLVENT NAME= DMSO
##.SHIFT REFERENCE= (INTERNAL, DMSO, 0, 15.7039)
##AUDIT TRAIL= $$ (NUMBER, WHEN, WHO, WHERE, WHAT)
$$ ##TITLE= Audit trail, XWIN-NMR		Version 3.5
$$ ##JCAMPDX= 5.01
$$ ##ORIGIN= Bruker BioSpin GmbH
$$ ##OWNER= she
$$ F:/spectra/data/she/nmr/H-F/1/audita.txt
$$ ##AUDIT TRAIL=  $$ (NUMBER, WHEN, WHO, WHERE, WHAT)
(   1,<2023-03-23 16:27:02.07 +0400>,<she>,<DPX200>,
      <created by zg, POWCHK disabled, PULCHK disabled
       configuration hash MD5:
       00 E9 B6 7A A2 85 ED C7 34 08 36 98 17 FE 4E 26
       data hash MD5: 16K
       44 91 15 D5 20 8A A3 66 EE 55 D6 7F 86 7B 03 F6>)
$$ ##END=
$$ 
$$ hash MD5
$$ 46 5F 1E 21 E2 27 FC B0 29 A5 E0 F8 19 2F 27 CF
##$RELAX= 
##$RELAX= 
##$RELAX= 
##$RELAX= 
##$RELAX= 
##$RELAX= 
$$ Bruker specific parameters
$$ --------------------------
##$DU= <F:/spectra>
##$EXPNO= 1
##$NAME= <H-F>
##$PROCNO= 1
##$TYPE= <nmr>
##$USER= <she>
##$AMP= (0..31)
100 100 100 100 100 100 100 100 100 100 100 100 100 100 100 100 100 100 
100 100 100 100 100 100 100 100 100 100 100 100 100 100 
##$AQSEQ= 0
##$AQ_mod= 1
##$AUNM= <au_zg>
##$AUTOPOS= <>
##$BF1= 200.13
##$BF2= 200.13
##$BF3= 200.13
##$BF4= 200.13
##$BF5= 200.13
##$BF6= 200.13
##$BF7= 200.13
##$BF8= 200.13
##$BYTORDA= 1
##$CFDGTYP= 0
##$CFRGTYP= 5
##$CHEMSTR= <none>
##$CNST= (0..31)
1 1 145 1 1 1 1 1 1 1 1 1 1 1 1 1 1 1 1 1 1 1 1 1 1 1 1 1 1 1 1 1 
##$CPDPRG= <>
##$CPDPRG1= <>
##$CPDPRG2= <>
##$CPDPRG3= <>
##$CPDPRG4= <mlev>
##$CPDPRG5= <mlev>
##$CPDPRG6= <mlev>
##$CPDPRG7= <mlev>
##$CPDPRG8= <mlev>
##$CPDPRGB= <>
##$CPDPRGT= <>
##$D= (0..31)
0 1.2 0 0 0 0 0 0 0 0.06 0 0.03 0 0 0 0 0.0002 0 0 0 0 0 0 0 0 0 0 0 0 
0 0 0 
##$DATE= 1679574421
##$DBL= (0..7)
120 120 120 120 120 120 120 120 
##$DBP= (0..7)
150 150 150 150 150 150 150 150 
##$DBP07= 0
##$DBPNAM0= <>
##$DBPNAM1= <>
##$DBPNAM2= <>
##$DBPNAM3= <>
##$DBPNAM4= <>
##$DBPNAM5= <>
##$DBPNAM6= <>
##$DBPNAM7= <>
##$DBPOAL= (0..7)
0.5 0.5 0.5 0.5 0.5 0.5 0.5 0.5 
##$DBPOFFS= (0..7)
0 0 0 0 0 0 0 0 
##$DE= 6
##$DECBNUC= <off>
##$DECIM= 32
##$DECNUC= <off>
##$DECSTAT= 4
##$DIGMOD= 1
##$DIGTYP= 9
##$DL= (0..7)
0 120 120 120 120 120 120 120 
##$DP= (0..7)
150 150 150 150 150 150 150 150 
##$DP07= 0
##$DPNAME0= <>
##$DPNAME1= <>
##$DPNAME2= <>
##$DPNAME3= <>
##$DPNAME4= <>
##$DPNAME5= <>
##$DPNAME6= <>
##$DPNAME7= <>
##$DPOAL= (0..7)
0.5 0.5 0.5 0.5 0.5 0.5 0.5 0.5 
##$DPOFFS= (0..7)
0 0 0 0 0 0 0 0 
##$DQDMODE= 0
##$DR= 18
##$DS= 0
##$DSLIST= <SSSSSSSSSSSSSSS>
$$ [...]
##$SUBNAM2= <"">
##$SUBNAM3= <"">
##$SUBNAM4= <"">
##$SUBNAM5= <"">
##$SUBNAM6= <"">
##$SUBNAM7= <"">
##$SUBNAM8= <"">
##$SUBNAM9= <"">
##$SW= 18.05172834244
##$SWIBOX= (0..15)
0 0 2 0 0 0 0 0 0 0 0 0 0 0 0 0 
##$SW_h= 3612.71676300578
##$TD= 16384
##$TD0= 1
##$TE= 0
##$TE2= 300
##$TE3= 300
##$TEG= 300
##$TL= (0..7)
0 120 120 120 120 120 120 120 
##$TP= (0..7)
150 150 150 150 150 150 150 150 
##$TP07= 0
##$TPNAME0= <>
##$TPNAME1= <>
##$TPNAME2= <>
##$TPNAME3= <>
##$TPNAME4= <>
##$TPNAME5= <>
##$TPNAME6= <>
##$TPNAME7= <>
##$TPOAL= (0..7)
0.5 0.5 0.5 0.5 0.5 0.5 0.5 0.5 
##$TPOFFS= (0..7)
0 0 0 0 0 0 0 0 
##$TUNHIN= 0
##$TUNHOUT= 0
##$TUNXOUT= 0
##$USERA1= <user>
##$USERA2= <user>
##$USERA3= <user>
##$USERA4= <user>
##$USERA5= <user>
##$V9= 5
##$VALIST= <valist>
##$VCLIST= <CCCCCCCCCCCCCCC>
##$VD= 0
##$VDLIST= <DDDDDDDDDDDDDDD>
##$VPLIST= <PPPPPPPPPPPPPPP>
##$VTLIST= <TTTTTTTTTTTTTTT>
##$WBST= 1024
##$WBSW= 4
##$XGAIN= (0..3)
0 0 0 0 
##$XL= 0
##$YL= 0
##$YMAX_a= 316693
##$YMIN_a= -344946
##$ZGOPTNS= <>
##$ZL1= 120
##$ZL2= 120
##$ZL3= 120
##$ZL4= 120
##$ABSF1= 10
##$ABSF2= 0
##$ABSG= 5
##$ABSL= 3
##$ALPHA= 0
##$AQORDER= 0
##$ASSFAC= 0
##$ASSFACI= 0
##$ASSFACX= 0
##$ASSWID= 0
##$AUNMP= <proc_1d>
##$AZFE= 0.1
##$AZFW= 0.1
##$BCFW= 1
##$BC_mod= 2
##$BYTORDP= 1
##$COROFFS= 0
##$CY= 11.3945322036743
##$DATMOD= 1
##$DC= 2
##$DFILT= <>
##$DTYPP= 0
##$F1P= 2.36226072786647
##$F2P= -0.459571619588291
##$FCOR= 0.5
##$FTSIZE= 0
##$FT_mod= 4
##$GAMMA= 1
##$GB= 0.15
##$INTBC= 1
##$INTSCL= 1
##$ISEN= 128
##$LB= 0.24
##$LEV0= 0
##$LPBIN= 0
##$MAXI= 10000
##$MC2= 0
##$MEAN= 0
##$ME_mod= 0
##$MI= 1.114404
##$NCOEF= 0
##$NC_proc= 0
##$NLEV= 6
##$NOISF1= 3.799351
##$NOISF2= 2.8
##$NSP= 1
##$NTH_PI= 0
##$NZP= 0
##$OFFSET= 15.70392
##$PC= 1
##$PHC0= -19105.96
##$PHC1= 13.60075
##$PH_mod= 1
##$PKNL= yes
##$PPARMOD= 0
##$PSCAL= 0
##$PSIGN= 0
##$REVERSE= no
##$SF= 200.130013532006
##$SI= 16384
##$SIGF1= 3
##$SIGF2= 2
##$SINO= 400
##$SIOLD= 16384
##$SREGLST= <1H.CDCl3>
##$SSB= 0
##$STSI= 0
##$STSR= 0
##$SW_p= 3612.71676300578
##$SYMM= 0
##$S_DEV= 0
##$TDeff= 0
##$TDoff= 0
##$TI= <>
##$TILT= no
##$TM1= 0
##$TM2= 0
##$TOPLEV= 0
##$USERP1= <user>
##$USERP2= <user>
##$USERP3= <user>
##$USERP4= <user>
##$USERP5= <user>
##$WDW= 1
##$XDIM= 8192
##$YMAX_p= 0
##$YMIN_p= 0
$$ End of Bruker specific parameters
$$ ---------------------------------
##NTUPLES= NMR FID
##VAR_NAME=  TIME,          FID/REAL,        FID/IMAG
##SYMBOL=    X,             R,               I
##VAR_TYPE=  INDEPENDENT,   DEPENDENT,       DEPENDENT
##VAR_FORM=  AFFN,          ASDF,            ASDF
##VAR_DIM=   8192,          8192,            8192
##UNITS=     SECONDS,       ARBITRARY UNITS, ARBITRARY UNITS
##FACTOR=    0.0002768,     1,               1
##FIRST=     0,             0,               0
##LAST=      2.2672688,     0,               0
##MIN=       0,             -344946,         0
##MAX=       2.2672688,     316693,          0
$$ Real data points
##PAGE= N=1
##DATA TABLE= (X++(R..R)), XYDATA
0@%%%%%%%%%%qJ6j6J6k4L2m0M8n6P2q8J04j21J43j67J94k27K65l06L50m02M59
32B44n24N96o73P59q54R59j074J198j334J484j646J826k024K237k468K720k998
49a572L305l641M012m422M875n381N951o599P336q186R180j0361J1795j3574J5851
64H569j8885K3153k9638M0781o5067K11179j75556k90194N10403P8426m38361
75a45190n6963M12586p2143l43308Q1537K79777j44289k02700J39592J51208j52688
86e2581q1890J39228N8087j18523j2886R8291K2518o6009j0876N8641M5476m5942
98C3534n6054N2240Q1627o9828j05245P5493J03079j16667j21813J22359R9004
109I7729j60974r2218J68692O0289j76563j8761J78388p837j44298N6373J28606
$$ y = [0, 0, 0, 0, 0, 0, 0, 0, 0, 0, 0, -8, 8, -8, 8, -16, 16, -24, 24, -32, 40, -48, 56, -65, 78, -89, 105, -122, 143, -163, 187, -215, 244, -280, 316, -357, 402, -452, 507, -567, 631, -703, 781, -865, 961, -1063, 1174, -1294, 1426, -1572, 1733, -1908, 2104, -2318, 2557, -2824, 3127, -3472, 3864, -4322, 4858, -5503, 6292, -7282, 8569, -10316, 12837, -16801, 23980, -41087, 170092, -5464, -295658, 214745, 293171, -145190, -202153, 210433, 138290, -205018, -123481, 156296, 12007, -190693, -51101, 100107, -52581, -134471, 4757, 62844, -55679, -68565, 29726, 52244, -13765, -24641, 34000, 79476, 33534, -22520, 29720, 111347, 41519, -63726, 11767, 114846, -1821, -123634, -1275, 97729, -63245, -155463, 13229, 73518, -103045, -121806, 56582, 48745, -95553, -39180, 89426]
120H9426o3877q1615Q7392N6709q5430k3102Q4555k143q1536J3698O5193l3822
132B5448o6643K8131M4893m0735m4792K6791K8643k4126k4819J5320K3249k000
144a0640j1711N748K0387J3198n344o996J3969J7505o013j5451M270J1265o519
157B3668j3491m321j363j918m841j4405q220R556J299j4979m700J3104J0082l793
171a4322p009P096K2815P667k0269N32L6850N949l7746J258M1985q731m4986R688
185G77L5332k5171l6666K3167J7182l6044j2052L0967o512l3886J6856L2278k4942
198a8714k3058L9814K6200l5898j0792M7033J5310l7860l863L9314L000l2388
210H098l270J8263o68j6450j4858q56J3150k942k9918l688L3271l358m0973J3042
$$ y = [89426, 25549, -56066, 31326, 88035, 2605, -20497, 64058, 61915, -19621, -5923, 59270, 25448, -41195, -13064, 31829, -8906, -53698, -26907, 1736, -22390, -47209, -31889, -8640, -10640, -22351, -16603, 3784, 16982, 11638, 4642, 18611, 36116, 30103, 14652, 18922, 30187, 23668, 10177, 5856, 4493, 2575, -2266, -16671, -24891, -15335, -14036, -29015, -33715, -20611, -10529, -14322, -21331, -14235, 8580, 16247, -4022, -3490, 33360, 39309, 1563, 2821, 44806, 36075, -8911, 777, 36109, 10938, -25728, -2561, 14621, -21423, -33475, -2508, -9020, -42906, -26050, 6228, -18714, -41772, -1958, 24242, -11656, -22448, 24585, 39895, 2035, -1828, 37486, 40486, 8098, 4828, 23091, 22423, 5973, -8885, -9741, 3409, 467, -29451, -33139, 132, -3226, -44199, -31157]
224c1157M5062k0501l6237L9438L5458m2318j4224N9104M397n7142J8845O0756
236F1481l4943n4788M8360M1972o5247l6556O4135J4004p5598r162O5107j0900
248G865o2896J8919N1533k6131l5483L4558K7912k7717n856L3352J625j8480J3265
261A2466J5623j3510n624J4185k384j3109K738Q03r282j258r45j3101k71J1083
275b586j2666j7268J7552J6901k4327j0880L3704J1039k9474K165L6878p23k7201
288f886J2995K8327j5272j9613J8993J0698k4803p258J9934p429k5852P994J7076
301H904k0658j8916K0756J0510k3486n330K4514M119j7966M722K0609l38r805
314b365P285J1067j769l393L225J924k925j561r71m676m036J50k240p632l678
$$ y = [-31157, 13905, -6596, -42833, -3395, 32063, -10255, -24479, 34625, 39022, -18120, 725, 61481, 26538, -28250, 20110, 62082, -3165, -39721, 24414, 38418, -37180, -46342, 18765, 7865, -55031, -36112, 15421, -10710, -46193, -11635, 16277, -11440, -17296, 16056, 17681, -799, 12466, 28089, 14579, 8955, 23140, 20756, 7647, 10385, 11188, 1906, 648, -297, -13398, -13669, -2586, -15252, -32520, -14968, 1933, -22394, -33274, 430, 11469, -18005, -15840, 21038, 20315, -6886, 6109, 34436, 19164, -449, 18544, 29242, 4439, -2819, 17115, 9686, -16166, -8172, 8904, -11754, -30670, -9914, 596, -22890, -28220, -3706, 413, -17553, -12831, 7778, 7440, -2365, 4920, 15987, 14218, 10825, 14050, 15974, 13049, 11488, 10517, 5841, 1805, 1955, -285, -7917, -11595]
329a1595L600n24q214n73Q148m4n678M851Q818n16j064O843L997r77L376M674
345A5122l963j858O132j084r739o71N895o419j1112K065M830q388p241N470L392
360g569o400p11Q155R8l118P467N759m308K000J1447j340p942P380Q865r752p462
376B569J0441Q37j5048j183Q990p861j1172N683L429j1152k119J0351k088p945
390a6268P607Q639n596j465J1774L266o228L937Q993l420m525O216J120q172k23
405E655M859p282q451O230R37j3764k067J1923m631j4027P380J3300r877q153
419a7968J6141Q481j2902J432J7222q66j1642Q042J1026r145p031J0307J925j2957
433B065k111P818m863j1209K205M678o286o680M839K700m568m4M758J155J03L457
$$ y = [-11595, -7995, -8519, -16733, -17306, -9158, -9202, -14880, -10029, -1211, -1727, -2791, 4052, 8049, 7072, 10448, 15122, 11159, 9301, 15433, 14349, 4610, 3939, 9834, 3415, -7697, -5632, -802, -9190, -16431, -10961, -7569, -13969, -14680, -6525, -6427, -9545, -2078, 3681, -627, 1373, 12820, 11480, 3538, 10918, 19783, 10031, 2569, 13010, 13847, -1201, -2384, 6606, -1255, -12427, -6744, -3315, -14467, -16586, -6235, -8323, -16268, -8661, -22, -5618, -7083, 4691, 7957, 1729, 5666, 14659, 11239, 6714, 12930, 14050, 5878, 5655, 10514, 3232, -5219, 1011, 1948, -11816, -13883, -1960, -6591, -20618, -13238, 62, -9815, -17968, -1827, 6654, -6248, -4816, 12406, 11540, -102, 7940, 18966, 9821, 2790, 13097, 15022, 2065, -46, 7772, 2909, -8300, -6095, -1417, -7703, -14383, -9544, -6844, -11412, -11456, -6698, -5543, -5440, -1983]
449a983K745M64L567L623j731K57N479m53n584J254M157n736o799L808O79q725
465d978k780M795l422o255K918L819m260j144O433J893l631L876P132j332j661
480A403N482L791l900n10M942n96o028P9L413m502o384K106J576p023l550M682
496e019L9o834J181O311j429l902N425N481k507j137O705L074k844P13M350j21
512I486l434J61J637k241l885m51L88l127l420L30k93k208j182J410L10o6R10
529e675J419J173J854J845Q41J981K175J87n29K129J341k747j633J722j261m045
545G77q79O58k587l255J37M07k229o94J237O27RJ622J834O24R69K940J419n08
563C108J289L083j083j848J677J538l487k712K286q70n450n63K341k791m347J648
$$ y = [-1983, 762, 1226, 4793, 8416, 6685, 6942, 12421, 11968, 6384, 7638, 11795, 6059, -740, 3068, 3747, -4978, -7758, -2963, -6385, -12640, -9722, -5903, -10163, -11307, -4874, -2981, -6612, -2736, 4396, 3064, 1403, 6885, 10676, 6776, 6266, 11208, 10612, 4584, 4663, 8076, 3574, -2810, -704, 872, -6151, -9701, -5019, -4980, -11814, -10633, -4322, -5751, -9653, -4228, 1253, -1254, -2391, 4314, 7388, 4544, 5257, 9607, 9486, 6052, 6213, 7850, 5609, 1724, 1273, 1661, -1466, -4886, -4556, -4849, -7057, -8239, -6829, -6519, -6585, -5675, -4256, -3083, -1229, 616, 1457, 3438, 5613, 5800, 5271, 7400, 8741, 5994, 4361, 6083, 4822, 777, -102, 556, -2031, -5286, -5149, -4742, -6971, -7665, -6428, -5801, -5792, -4170, -2336, -1712, -743, 2197, 3616, 3108, 4397, 7480, 6397, 4549, 6226, 7764, 4277, 1565, 3851, 2981, -2469, -3032, -691, -3482, -7829, -6181]
579f181K233k781j707L928K026k467J220M342J194j215K126L393j6j166Q92J993
595G814j590k147p5K36k501k343o91r5k358j433j5l06n50j17Q2J301J599Q3M04
614b702K960J926n83R69L056L95j245Q84J412j394j874R3k96k457j965j71j020
631b012k118p75n25j16n26rQ40Q16O53J296J143J098J849J192O88M59J689K86
649E928j074K92R43k051j927M79n54k261j976J53o74k126o55J160p91o91P71J735
667c319N70J16J411K643J79M25J342J555J8o60P48N78j637j340L52o23k101j682
685a425j02n61j420j174L49J12q61Q6J372J203k0J97K291J412l06R67J657O69
703D446k90k61O51k78r24q08p12l39j091k110j59j61j437j164O82M71o37k7J149
$$ y = [-6181, -3948, -6729, -8436, -4508, -2482, -4949, -3729, 613, 1807, 592, 2718, 6111, 6095, 4929, 5821, 7814, 6224, 4077, 4002, 4238, 1737, -606, -1297, -1392, -3750, -5183, -5198, -5504, -6054, -6171, -6089, -4788, -3189, -3106, -2702, 258, 2184, 1601, 2570, 5626, 6021, 4776, 5660, 7072, 5678, 3804, 3897, 3601, 1144, -821, -992, -2012, -4130, -4905, -5430, -5546, -6072, -6081, -5241, -4425, -3772, -2476, -1333, -235, 1614, 2806, 3494, 3953, 5642, 5928, 4854, 5146, 6089, 4038, 2111, 2590, 2036, -225, -2201, -2048, -2722, -4848, -5503, -4343, -5134, -5825, -5054, -3319, -2749, -2633, -1222, 1421, 1600, 2025, 3367, 4922, 4940, 4280, 5028, 5606, 3969, 2629, 2981, 2358, 257, -1425, -1527, -2088, -3508, -4682, -4333, -4221, -5082, -4996, -3624, -2421, -2441, -2244, 47, 1459, 1153, 2120, 3777, 4446, 4156, 3895, 4546, 4268, 3344, 2536, 1824, 1485, 394, -1716, -1875, -2036, -3473, -4637, -3955, -3484, -4121, -4148, -2999]
722b999P11L89Q51J583Q07O51O20R24L70M8j36K37p24p35n98p26p03j083r15o13
742b041q43m68l68k65M23K82m2Q87J213M25m0J823J191n00O84J362K56j089N22
761C412N96q67j174m02m62j298j527q7k59j289k78L2L65l50M23P44M08M38J425
780a50P30N06O32J199J87k26O51K30o85o64L99o06j466n94J10j349j598J84k05
799b715q54j95L13O3L08K98J152P13P77O61P71R86N25M45j49L33No24n16R4o60
820A731j216p94K98q91j634j45R15j127j086J043J149j392n0K289J019j408J275
837b4K132L54q76Q38J733q33r46L16M84j037j241m11K06j589j144rk37o88n48
856c520L90O35P7M9N57P89J044j31K27J606Q82q23L09J222k24j169L29Q36j314
$$ y = [-2999, -2288, -1899, -1048, 535, 1342, 1993, 2613, 3537, 3907, 3955, 3819, 4056, 3332, 2597, 1999, 1273, 570, -513, -1428, -2041, -2884, -3352, -3720, -3985, -3562, -3280, -3322, -2435, -1222, -797, -837, 986, 2177, 1677, 2361, 3723, 3979, 2890, 3412, 4008, 3141, 1967, 1565, 1103, -195, -1722, -1809, -2068, -3357, -3635, -3603, -3238, -3588, -3165, -2421, -2013, -1575, -150, 580, 1086, 1718, 2917, 3104, 2878, 3529, 3759, 3074, 2410, 2809, 2203, 737, 143, 253, -1096, -2694, -2510, -2715, -3569, -3764, -3451, -3388, -3080, -2782, -1630, -917, -140, 521, 1292, 2278, 2803, 3248, 3099, 3432, 3437, 2813, 2297, 2391, 1731, 515, -279, 19, -872, -2506, -2651, -1736, -2863, -3949, -2906, -1757, -3149, -3199, -910, 109, -1299, -24, 2108, 2462, 1586, 2424, 4157, 3324, 2378, 2694, 3178, 2141, 900, 489, 695, -894, -2038, -2047, -2284, -2972, -3520, -3130, -2495, -2418, -2369, -1812, -1023, 21, -110, 117, 1723, 2605, 1782, 2091, 3313, 3089, 1920, 2249, 3085, 1771]
875A771j459J98J61j672j200P13J3j338k51R95m9o53P43J111NJ36J109R25q6K29
895A401J141m0l00r8L42o19m98J1n25j086j38k13j086m88N34k58o96K28Q21j80
915a747l33Q41J174k45J48J346P83m44l1R66j29l51k52K0l53p09m15q8r34l91
935a144M1p32l38L8o9j97M13R29m86K75J153Q75p08N68J697j78p31O40O24j291
955A379l96P42l8j554n37N10q45j187K15N64p93k59N23L05n33M48R26N3O6R01
975D90M51N4L72P29k64l44R10k57p16l50M8m65q37m42N25j302q76O62K08q52j39
996b395R51J3R2K29R71R4J14N89P21k6N5N61j67j85o2O3m96k55k42p68o22K48
1018e17l80p54k31M93l58n42P99M25J7j90J052O02k93M24J046j91k80M82Q32p41
$$ y = [1771, 312, 510, 671, -1001, -2201, -1488, -1475, -2813, -3064, -2069, -2118, -2771, -2028, -917, -912, -776, 333, 1258, 1172, 1401, 2542, 2502, 2202, 2104, 2446, 1827, 1329, 1340, 815, -271, -409, -622, -1708, -2196, -1662, -1920, -2616, -2388, -1567, -1747, -2080, -1239, -65, -310, -162, 1184, 1967, 1523, 1492, 2458, 2329, 1978, 1726, 1746, 1393, 684, 269, 181, -753, -1144, -1103, -1835, -2173, -2135, -2204, -2401, -1988, -1059, -1545, -1270, -117, 758, 50, 618, 2315, 2137, 1406, 2046, 2670, 1379, 983, 1725, 1687, 133, -404, 106, -739, -1926, -1711, -1147, -1940, -2199, -1676, -1371, -1904, -1456, -530, -477, -411, 490, 941, 995, 1367, 2096, 1832, 1488, 2398, 2141, 1425, 1075, 1123, 658, -179, -621, -96, -1398, -2274, -1612, -1404, -2256, -2395, -1444, -1431, -1339, -1110, -139, -45, 69, 658, 1379, 1353, 1408, 1969, 1802, 1617, 1555, 1618, 1122, 867, 625, -143, -765, -517, -897, -1651, -1882, -1389, -1747, -2289, -1490, -1065, -1048, -1238, -186, 416, 123, 547, 1593, 1402, 1122, 1604, 2436, 1695]
1038A695p50K62K06q18n45Rj45q06p4k46k05n44J50M29N5q5P48M6O5M38O82L66
1060I33J53K57K3k5P2J01n1q16L21j27r57r9K54m01r72j7O6k5l62K73N36k74J22
1083a015N25M11l6M09L15J80M96J7J51l46K98j17o47J3r7l25r61j27M79o95n51
1104a623N37J53j017N52R81k97k78Q35P68r0mL91L27k79l63P32K38p72k78K34
1124G47k6n80k84j09l09m68L20j41l83QK82k37K97M07o4J80M03N40j86lJ084l75
1146A103n49N65J19l88k78K86j7q75l61L01n11n18o7J55R1n28O46j51J92J80L87
1167b18L72kK97K57j4L85K01j96J5L10l62m00n09L80m19o95L33P9o54n18N45J12
1189g01p47K59L89J38j27K78J158l81J26L63L58k73j0L75j91j39k09J35l57j07
$$ y = [1695, 945, 1207, 1413, 595, 50, 59, -86, -892, -966, -1212, -1417, -1961, -1811, -1382, -1327, -1412, -664, -618, -553, -115, 567, 933, 1086, 1343, 1366, 1341, 1413, 1514, 1463, 647, 968, 841, -116, -215, 39, -362, -1334, -1351, -1285, -1310, -1672, -1399, -863, -1137, -1015, -490, -79, -115, 294, 609, 789, 1285, 1302, 1453, 1107, 1405, 1288, 641, 654, 557, 232, -729, -856, -377, -1072, -1623, -1086, -933, -1950, -1398, -417, -714, -992, -157, 611, 521, 517, 908, 1235, 956, 593, 1325, 1563, 791, 513, 747, 721, 141, -143, -252, -561, -1029, -709, -850, -1233, -1225, -943, -1180, -883, -476, -540, -360, 43, 583, 397, 394, 1478, 1103, 554, 1119, 1238, 850, 572, 858, 841, -34, -395, -94, -605, -1123, -1190, -1035, -944, -1472, -826, -977, -785, -605, -218, 154, 152, 449, 706, 692, 1077, 1278, 1082, 1097, 1407, 1045, 645, 136, 516, 97, -598, -265, -186, -840, -1358, -813, -701, -1448, -1189, -800, -662, -789, -511, 647, 266, 392, 755, 1113, 840, 830, 1205, 1014, 875, 666, 801, 444, 337]
1209C37l52k91j63j73p1k57j31j2J65j45K38K27K66K00N32l46K66K99K73K91k59
1230H94n3K02l43p9j24r9l82n5k32J39l88j20R8l82j49rQ8L4K33M34P2J92L35
1253C06K56j22L04L00j33j68L35j21o09j70N11k1r79O7k10L6l43j10L38k19k58
1274a010K89M90l81N2M60K89j4l5M76J51j06K14M4J41k65j8m82K6m37n5l53j50
1296f74M21l51k30J20J22j10J85K97j58J91L15M2J61P2K18L7J62l49N43k7p09
1317B78K72O6O2o40n6k69m19N3J93m48R5N9LJ26L10kL57l28O67K00k85nL78j8
1341F49Oq5r8Q8m60O4P7k58l13Q3j24l68j25L64k37mp1N21r9J67J22N44j61j06
1365A76K99K34J40l28K07j52M7K3m00l7k06k12j25j73J28m23J99j17M6P2j6K95
$$ y = [337, -15, -306, -469, -642, -713, -970, -1101, -1113, -948, -1093, -855, -628, -362, -162, 370, 24, 290, 589, 862, 1153, 894, 841, 1043, 700, 621, 497, 398, 16, -39, -271, -132, -520, -640, -542, -924, -1073, -1082, -994, -960, -727, -293, -221, -29, 306, 562, 440, 744, 1044, 911, 743, 1078, 957, 348, 178, 689, 668, -311, -244, -454, -418, -761, -871, -533, -752, -1010, -721, -231, -612, -560, -100, 189, 175, 140, 616, 767, 661, 875, 919, 1060, 795, 777, 295, 321, -116, -171, -524, -674, -253, -604, -834, -714, -592, -702, -517, -220, -378, -187, 128, 170, 331, 403, 621, 658, 820, 471, 1014, 987, 278, 550, 616, 678, 38, -18, -287, -706, -653, -460, -908, -813, -754, -751, -625, -315, -317, 40, -288, 379, 579, 294, 289, 667, 649, 655, 570, 472, 560, 100, 164, 241, -17, -330, -247, -371, -739, -864, -500, -737, -741, -812, -291, -390, -223, -101, 443, 282, 176, 475, 709, 849, 521, 728, 576, 623, 646, 246, 209, 3, -209, -334, -507, -379, -802, -603, -720, -674, -602, -618, -323]
1387c23K36k21K41L56k59q7O19r9l1J52MK01l02j50k70K79l02k79J06l56J5J17
1409c53k97J73l3o4n7N5L96J67l52L64K91K73k05K64J05J07l00k18L31m64J60
1430C43n5k04l42O6oj06k52K37k21q1k1J31N1l8L54J8L82L9J42k19K8N09j94%
1454E61O0j6m26j66K78l08j44N0q5k51k53J27K56l34m7K64K08j71K68K96O5r6
1476A36M0P8J17k00K87j04K0l07K43k2k83r1J3j71j90j54M0J25K8Q1j48J6lM31
1500a8k29K50J70K02j19J45p4K2P5k05L83k09l42m5nr0l67K92j29j88k35L42J64
1523b10r5J14j17L30R2m22O67j33l8J45j22J62j27K53m32K3J8J34k87J63l84j20
1545c86M1J20m46J97J39k8j1j02L65J34r6R2Q2L42j6j02NKL8k29K65k97j1J81
$$ y = [-323, -87, -308, -67, 289, 30, -57, 562, 463, 432, 584, 588, 789, 487, 337, 67, 346, 44, -235, -129, -485, -470, -353, -650, -477, -510, -574, -631, -576, -180, -13, -365, -1, 290, 563, 358, 622, 727, 834, 534, 316, 647, 183, 343, 288, 84, -258, -192, -198, -304, -556, -319, -540, -621, -642, -511, -460, -498, -144, -126, 256, 295, 437, 218, 246, 755, 561, 561, 621, 605, 179, 13, 291, -17, -161, -111, -196, -447, -700, -573, -317, -651, -698, -434, -226, -397, -129, 167, 232, 136, 176, 254, 371, 171, 458, 354, 374, 67, 310, 288, 5, -86, -73, -244, -434, -588, -548, -423, -395, -314, -462, -446, -449, -18, -247, 3, 173, 375, 256, 401, 327, 349, 424, 219, 602, 393, 51, 6, 1, -89, -456, -164, -293, -481, -716, -374, -210, -305, -191, -308, 22, 114, -308, 359, 226, 188, 333, 211, 373, 246, 499, 67, 90, 108, 242, -45, 118, -266, -386, -345, -225, -671, -474, -335, -363, -374, -476, -111, 23, -73, 19, 101, 443, 427, 325, 330, 332, 370, 141, 406, 109, 98, 279]
1569B79n08j05N18m06j22rj37P5J25k90l1M43J35K18k10J09Q1l6q8J30K81q7J91
1592E56N0j72k37J1k27K58j19m28M40m47p9l7k6L87k49k47M94J29r6j14K55O8
1614A70j24L25O1j95O0o4J6J29l60J39j02j69J15N0l8l29J50k97L1J80Q9n4K33
1637A6L1n6Jm3N23m70J81j51O7K98k08O6j80rj56M3L88n11K36j46q3j78J55j34
1661c20m3K01o2J36k19M30o0J37k1j7k01L33j31J95k92j35m3K14n0Ok07J49k0
1684b0j81n0n0Q2k03K11n8J07K68o3P5k2J49k55L46j39J49j23J90m35J90j57K85
1707B96j54k79L02l32N6q7L23m14L52k06j73P7J16j0K09L1j70M08k63K13k55M17
1729D57l77J15L5k37J00Q6j71K85j50k64n5M6k84K11K9j34L37k22K00P7k9l6q2
$$ y = [279, -229, -334, 184, -222, -344, -353, -490, -415, -290, -580, -611, -168, -33, 185, -25, 84, 165, 129, 41, 171, 452, 365, 556, 606, 434, 197, 208, -19, 239, 120, -308, 132, -315, -394, -431, -457, -70, -319, -566, -72, 57, -39, -153, 102, 170, 46, 371, 432, 237, 297, 233, 249, 378, 18, 157, 55, -114, 1, 51, 13, -316, -166, -463, -432, -252, -163, -217, 16, 47, -9, -8, -51, 472, 2, 183, 32, 99, 397, 189, 255, 75, 66, -90, -47, 341, -170, 66, -80, -163, -341, -186, -320, -363, -162, -224, -88, -307, 123, 63, 200, 179, 162, -39, 294, 163, 358, 66, -69, -112, 102, 52, 58, -149, 0, -20, -201, -251, -301, -219, -422, -211, -269, -162, 106, 43, 118, 96, 245, -10, 336, 197, 346, 223, 413, -22, 168, 11, 296, 142, -137, 165, -167, -111, -198, 125, -289, 63, -143, -316, -239, -123, -133, 76, 107, -63, 345, 82, 295, 40, 457, 80, 195, 230, -7, 93, 179, 8, 293, 143, -121, -176, -130, -414, -203, -174, -308, 29, -193, 7, 84, 55, 19, -63]
1752f3K45J3l60N18M3j12q0j63J07l6k06l6J42n2j62J41j7r7l8J95q8j35j53K53
1776a41O9K0J57J12l44K46j76K8K95j90J99j58k5J01J9k9j62k82K30l12J73J44
1798b6nk4q1q5m1L64J6j49P7N9J37j24K6J7K88n19j2J98J52k07j87n2M97m11k34
1823c26L20k78J30j78J72j4K27j06J0K7K06k96Q3Q2o3R2J64j80j23L81l67J52
1845A15J1l97L63k24M8k47K49kJ10J84m38J99j55O7N1J21J79j12j05j06J09J40
1867A60J21j94l03J55K58k05K23k85J01R8m07L60M8N7m60K84j69K38j73l5K46
1888A18l0k73J95n5J76M2l29j17L69o0M3j87K45j45l64M75k26K02j18J75m2n9
1910C5m5rJ2K61m57K46j2j79M9J26K4m7J56k09J63q0J44l99K12P4j9q8O2j17j44
$$ y = [-63, 182, 195, -165, 353, 396, 284, 204, 41, 148, 112, -94, -130, 12, -40, -202, -61, -78, -175, -213, -18, -106, -241, -394, -141, -72, -52, 105, 217, -127, 119, -57, -29, 266, 76, 275, 117, 92, 193, 212, 183, 21, -261, -31, -343, -170, -26, -31, -55, -136, -221, -262, 102, 118, -31, 46, 105, 242, 118, 144, 161, 449, -70, -82, 116, 268, 61, -126, -178, 319, -92, -326, -6, -284, -154, -332, -160, -174, 53, -53, -43, -16, 190, -106, -23, 59, -4, 88, 252, 72, -51, 330, -37, 115, 126, -271, 92, -132, -84, -331, -82, -84, 26, 210, -228, -29, -184, -117, -66, 55, 234, 122, 17, -89, 20, 160, 281, 87, -216, -61, 197, -8, 215, -70, 31, 129, -278, 82, 130, 187, -273, 11, -158, 80, -93, -128, 118, 88, -185, 10, -45, 131, 173, -156, -273, 96, 36, 79, -108, 137, -8, -372, 103, -123, 79, -39, 136, 94, 35, -10, -19, -7, 254, -203, 43, 31, -148, -99, 27, 51, 4, 160, -49, 114, 34, 178, -221, -9, 65, 46, -42, 20, -97, -241]
1935b41K11J75m52J27Q8M4J13k55M96k71j2q4J41K3O9m27L63j7L99o31O6o5J3
1958a27J18J84NQ6k57k8j3j47J72j88j40J79K00j23j95M08j95j09K12Q0j36M4
1980C0J02j44K43m56K82R5j72J6o7J28j23K87l71J47L0l7k0j9n7J42q2j55L25
2003A24k73J05J66j99o9J62O7k03K57k02K6J1K14k60k20M60l89J30K1K30l06n6
2025b04K15J30j56R3r6N6p3R7R6m4M5j67J61M1j87o3N9K3j1p0Q7p5J52k01N4L3
2051eJ14R6l02J12k80K27j32m7J90J90j53K3k08N22m15J15O4j38k7q6Q9J53l5
2074F7j99K05j76K0K02k61j40P0K39l45L79l24L52l03L72j72j26K10l25L73j27
2095iJ38K1k30J06K1j40O4P9R4k76L74m19K34j71J06j02j06N8P7j10K65k48K8
$$ y = [-241, -30, 145, -307, -180, -92, -48, 65, -190, 306, 35, 23, -61, 80, 103, 172, -255, 108, 91, 490, -141, -75, -140, -127, -9, 175, 180, 266, 9, -19, -32, -179, -7, -195, -335, -156, 44, -79, -274, 134, -61, -170, 42, 122, -14, 30, 132, -12, 231, -225, 57, 152, -20, -4, -71, 57, -66, 221, -150, -3, 27, -10, -30, -49, -106, 36, -46, -201, 124, -149, -44, 122, -77, -146, 16, 83, -120, 137, -65, -39, -28, 186, -74, -294, 166, -223, -93, -72, 158, -148, -204, 11, 141, -15, 78, -18, 38, -35, 62, 158, 114, 159, -8, 153, 194, 7, -56, 3, 26, 15, -55, 32, -43, 109, -92, -38, -5, 109, 205, -97, 15, -265, -38, -170, -217, -27, 163, 10, 33, -175, 347, -68, 47, 111, -27, -54, -140, -51, 102, 67, -132, 73, -103, -83, 119, -142, -282, -212, 27, -318, 61, -263, 89, -214, 158, -14, -140, 70, -255, 118, -9, 129, 150, -80, 26, 47, -93, -29, 50, 144, -132, 242, -177, 57, -114, -8, -110, -216, -158, -81, -191, 74, -174, -146]
2118a46L17Oj94l0q9J12N7N7J09l12J05K6j18K34m06J68N5O6Q4j49J89k49J44
2141C6j62N0J27j9j99K96l21J37K80j19j49J81m6Q9k2j87J70k6O8k78M6R9m48
2164c97L96J1j6k45J41J42j34N4k86M53j06k39K40J7k54K53K18r8n7n1j78K35
2186I9L1j44J38m68K27J06n6J33k22l2M3N1j08O5Q3M7J07k1j88m6J99m0J87N5
2210B46k02j30K67J3j47j56J16J04m2J13j50J63k93M8O3k41J4K84k14J98Oj32
2232g2K11JM8j95K9J20j22J96j27N9k49J38j5o9J96k24J74l44J93j07n9N0NJ09
2256e4J69j75K57O7k64N7M9k61NJ73j05J01l10J45L23m47K67K73k23k24K44j51
2278h4N3J47j40k2J57J20j57K0j10p4L55j7J3k01K26l9k07k79K34P0R7j45k85
$$ y = [-146, 171, 177, -17, -47, -136, -24, 33, 90, 199, -113, -8, 18, -100, 134, -272, -104, -49, 17, 101, -48, 141, -108, 36, -126, -76, 51, 32, -167, 129, -192, -55, 225, 106, -43, 138, 92, 181, 159, -28, 142, 116, 184, -94, -48, 51, -397, -1, 10, -6, -251, -110, 32, -102, -48, -334, 119, 13, -226, 14, 31, -223, 30, 248, 150, 93, 42, -136, 99, 130, -14, 124, -344, -117, -11, -67, 66, -156, -188, -145, -94, -202, -137, -54, -7, 100, 79, -109, -155, 44, 4, 191, 246, 44, -86, 181, 194, 47, -109, 7, 111, 69, 182, 32, 195, -98, -50, 13, -228, -214, 70, -144, 54, 60, -72, 139, 140, 188, -7, 22, 142, 20, 216, 89, 148, -101, 37, 22, -47, 149, -75, 99, -245, -52, -159, -218, -168, -163, -54, 115, -60, 197, 264, 0, 57, 106, -155, -150, 23, -82, 19, -291, -146, 177, -270, -3, 270, 47, -177, 67, -84, -31, 116, -24, -46, 111, 231, 74, 94, -16, -90, 265, 248, 261, 60, 286, 247, 40, -239, -5, 65, 162, 17, -268]
2301b68L97n5o6j79L19k86j8K40k37O7JO7L45k67J08j19j94J86J73Lk00J23p6
2324F4j6n3MJ30k02j6k0j01M23m10K34N1k08J7j28K49P8Q0Q1j9l17L18m8j91q
2349hJ37P2q6j42J3K3k40L27l52M31j47j45L9m9J65m3o2k1K67n2j37o9L14k60
2373b5K24N9k98J54m7J26q7j58L5P4O2j10k71K2k3M54l94J32mj63K11L5P4Q5j24
2398D3j62J20P4r5N7J83j06k3j45J13j30R5q5J83k95O3j31q4J33J21J21k99K62
2421A3l53M50K10l07j0J26r7J14q5R5N4l23L15l08j5J61l66L58j16O4l61L63L9
2444B1k8k38j86K87O7j82K85r9nO2K2K19k31P7pL18k97Q7k36J24r2n1J8o5j60
2469b90M73m69K0J00jJ18P5n1L0J10O0k31Q2j38L76j12MJ1j33J22l39J67Jj14
$$ y = [-268, 129, 74, 8, -171, 148, -138, -156, 84, -153, -86, -85, -18, 327, 60, 168, 49, -145, 41, 214, 217, 17, 140, 64, 48, -5, -1, 129, -73, -89, -109, -210, 213, -197, 37, 88, -120, -103, -231, 18, 96, 176, 257, 238, -79, 239, 191, 0, -8, 129, 201, 115, -27, -14, 9, -231, 96, -256, 175, 28, -117, -78, -127, 38, -5, -67, -88, 179, 127, -10, -79, 235, -25, 199, 258, -40, 114, 67, 193, 106, -52, -17, 57, 119, 9, -262, -240, -263, 191, -203, -71, -75, -238, -27, 8, 82, 167, 43, -119, 1, 75, -20, 37, 220, 114, 91, -54, 59, -71, 24, -61, 122, -173, -110, -241, -325, -192, -71, 50, -249, 13, -340, 110, 320, 13, 3, 129, 32, 146, 61, 156, 210, -113, 202, -106, -121, 40, -326, 32, -84, -20, -381, -18, 21, -7, -245, -431, -144, -77, -259, 26, -73, -78, -16, 6, 225, -6, 71, 64, 382, 85, 172, -64, 60, -32, -83, -65, -130, -290, 183, -286, -266, -166, -167, -49, 26, -25, 5, 115, 175, -56, 26, -112, 264, 152, 156, 167, 34, 156, -183, -16, -15, -129]
2493a29j26K49j89J30j88k0J42Q8k13J48J62M7p0M1OQ2k78J98j13Q0L7J83M6j93
2517A20lp7p9j25M26k57j40k8m9M8K06j20k17M33k43J96mk05M60k62kK07k50K66
2541C01j01k78J36j07J24j75L5K18k05J04j97Q0q3L15k87n6O0L2K35m12K71L47
2563C57k42J77k25M4K2J26j77j75j5K24j65J32j33q7J12p9K76l86K61l51p3K57
2585a20j43K52Q1J98l32J00N1r6L0nK33j01n2p9N4j26K74k46J65l1o18K44J65
2608a02K96l08J89okk14R9J22QP9j47r2J8M19j56n4m25M83J7j80m3j54O5N9O9
2633D0q5m5n7J34J11J22j53J3j60K44k15J83L2o5K9p4Qk12J34J40j26l9J15N3
2657A27p8o1K97k48k27J27J82m1k27Q5K6n4n3P6J48Q2j68K6O9J51j52m5mm6NJ22
$$ y = [-129, -255, -6, -195, -65, -253, -273, -131, -43, -256, -108, 54, 101, 31, 72, 78, 160, -118, 80, -33, 47, 84, 267, 313, 120, 117, 40, -39, -164, 262, 5, -135, -163, -212, -164, 42, -78, -295, 138, -105, 91, 87, -118, 342, 80, 78, 285, 35, 301, 200, -78, 58, -49, 75, -100, -65, 153, -52, 52, -145, -65, -148, 167, -120, -176, -116, -84, 151, -261, 10, 357, 115, 292, 67, 111, 133, 259, 82, -93, -108, 116, -49, 83, -50, -137, -25, -104, 172, -214, 47, -304, -377, -120, -263, -11, 70, 268, -64, 36, 87, -9, 21, 16, 249, 148, 96, 17, 71, -55, 219, -27, 138, 107, -511, -267, -102, 194, -114, 75, 69, 67, -147, -48, 74, 82, 161, 14, -78, -60, 359, 203, 149, -276, 207, 224, 44, 1, -153, -88, -29, 40, -45, -90, -147, -13, 98, 220, 67, 80, -80, 164, -51, 132, 164, 99, 128, 54, 62, -150, -16, 124, -2, -41, 74, 127, 49, -12, 285, 37, -190, -63, 119, 78, -149, -64, -38, -92, -145, -69, 79, 161, -7, 19, 88, 239, 87, 42, 38, -8, -3, 119]
2683A19L18l74k34K35j7k83j68N12l15P6L5l6J27j29j02L77Q6J01l94J61K9J07
2705B31k01K39O6l61R5lN1n4n8j32L16k87K12k43j33K50j45J04j53J10L30l90
2727a56O5J78l5m5K47k17p5J05J67R4j48l9j48K61j81J36l69K93k10q9RK9kO9
2751f1K5J03q0J06M0k68P9k5N89j95j10k63L16K1K3m15J72r9p7j08Q0M0J8j55
2775b44J35M1j60J89j97P5O9k3j3K15r5J36J11k32L3J00J15K07l79j31n4K14l47
2798b35K43r0J33j67Q2j0k27L5J62o4q6J94j51K12M8M28l28p2j50O9Q5l7j07J42
2822A09L0l47K8N5K20p1k51J25Q5j01j20J0K54j45k2L33k82J81N7n8O4k03J90
2845A41o5J72o9j2j91L47m52J99k30J18l3l32K88q2R1K4J17j83K57k81J06J60
$$ y = [119, 437, 63, -171, 64, 47, -236, -404, 108, -207, -131, -96, -132, -5, -134, -236, 141, 227, 328, -66, 95, 124, 231, 30, 269, 335, -26, 69, 66, 117, 63, 5, -127, 189, -98, 114, -129, -262, -12, -157, -53, -206, -96, 234, -156, -91, 87, 52, 7, 254, 37, -38, 67, 234, 328, 180, 141, -7, 254, 73, 209, -160, 133, -77, -166, -157, -128, -130, -61, -36, 67, -13, 93, 133, -135, -56, -81, 508, 313, 203, -60, 256, 277, 300, -115, 57, -42, -119, -227, -147, -107, -89, -244, -109, -68, -228, -39, -236, -161, -92, -115, -128, 87, -8, 128, 239, 7, 40, 140, 255, 462, 83, -48, -102, 112, -235, 8, -82, 51, -116, -34, -44, -271, -236, -74, -138, -224, -30, -181, 31, 79, 507, 179, 107, -43, 26, 111, 74, -33, 109, 139, -208, -180, -125, 95, 24, -227, -102, -17, -118, -238, -228, 26, -119, -141, 192, -90, 91, 148, 90, 154, -49, 141, 76, 248, 179, 167, -24, 323, -129, 70, -160, -42, -75, -407, -119, -201, -110, -86, 31, -152, 105, -176, -70, 90]
2867I0j16k51M67L9l59J17J89Q2r5j17j52J64j50R8N2j79m5k6J13o8p3Q0P3oO9
2892dN1n8q1k1J55J32l71K87l7Q4j2kk01J63mk14l8n9L01j08nj59k5J12J6l0k5
2919a53M51l07L0K33l20K82lr2Q6k74J25M48j66k21J52m66J01J55j63j65J9J61
2941h7j03o5j03K97j26J50K02j61K41l32l6N90k26j00J2o8l8K0n1O4j54J00J79
2964B05l79K98p9Lj77J50j91J25j3o6J07q4J79r2J41M9o2J38j41n9n6R9o5L28
2988C58k19r3j24j43J08J80k12O6k1r6J30Pj46L45j97K27j50k5J05KM3J4j18P0
3012A11P7j42r5RJ80k60K27Lj55L3l18L29m9K4P3k73L15Pm5k16J67K06k09l2o9
3037a02J96LK51p6k11r4k4J07j83J48j09K7j45J68L3N1j51r3L03m4k07J92R6k62
$$ y = [90, -26, -277, 190, 229, -130, -13, 176, 258, 163, 46, -106, 58, -92, 6, 58, -121, -166, -192, -79, -147, -220, -140, -67, -73, -4, 47, -11, -92, -113, 42, 174, -197, 90, 53, 137, 125, 123, -78, 85, 81, -133, -171, -230, 71, -37, -42, -201, -226, -114, -98, -128, -153, 298, -9, 21, 254, -66, 216, 213, 121, 207, -67, 58, 506, 340, 119, 271, -195, -94, 61, -102, -267, -248, -87, -190, -255, -358, -61, -187, -37, 165, 4, 245, -87, -123, 467, 241, 141, 153, 85, 47, 67, 16, 80, -74, 26, 205, -174, 124, 45, 48, -129, 21, -170, -45, -58, -124, -17, -101, 78, -14, 127, 176, 114, 252, 111, 52, -4, 95, 30, 358, 139, 46, -78, -221, -113, 67, -145, -79, -100, -196, -66, -59, -205, 140, -57, 170, 20, -5, 100, 102, 145, 159, 41, 111, 188, 46, -49, -40, 140, -120, 107, 110, -45, -12, -330, -1, -50, -26, 47, -226, 89, 96, 51, -165, 2, 208, -1, -33, -102, 94, 97, 348, 272, 61, -33, -57, 50, -133, 15, -94, -67, -212, -44, -11, 40, -111, -204, 99, 55, -152, 40, 136, -126]
3061a26L17J89j89j1j48J08MJ00k65J82M2j49ok19k9K20j65K85l59Q3J83j51l8
3084a42q4K75L6p3J68r1r2N8K94j5j38k10K14k4l76r2L69j42O9k3p8J23j24j89
3108b87K77K21k23K04r2k01L35Qk24K65l9j51K3J25k67J69K6o0m5k01Q3k9Rm3
3132a17J33j07K06n3j11M9K2q4J42k99J11P6R4N2j74p7M83l65J62l20K16l6j08
3155a05Q8Lj4k03o0J56J21m1m0Q6j83J33k01K45J8M4q5K02RJ91o7k75k3o5o9L28
3181A93m78L90j71jJ11k95J07j77L41m05K90K06l84M24j06J02J23l62m7L06j17
3202E0L2l7J53j11pJ79l44l21J31K26j04rq9J37K19m86L96J02j67K8j02K52l8
3225I0j36J70k7q4K06l26K94o9j3J1j71q6L53j75n8M7j61J64j80l6j94L91K5k74
$$ y = [-126, 191, 380, 191, 180, 32, 140, 144, 244, -21, 161, 203, 54, 48, -171, -200, 20, -145, 140, -219, -136, 47, -104, -142, -226, 49, 85, 12, 180, 89, -3, 55, 349, 334, 196, -14, 200, 176, -200, -292, 77, -65, 4, -19, -97, 26, -98, -287, -10, 211, -12, 192, 100, -101, 234, 242, 18, 283, 244, 93, 116, 241, -26, 143, 169, 109, 64, -137, -54, -83, -74, -117, 16, -91, 115, 62, -49, 0, 22, -62, 80, -219, -108, -32, 62, 114, -60, -137, 346, -19, 143, -177, 39, 3, -105, -17, -14, -28, -231, -291, -135, -14, -55, -95, -9, -192, -59, -260, -15, 3, 47, -38, 164, 173, 364, 297, 22, -1, -66, -135, 193, -285, 105, -66, -67, 44, -251, -144, -321, 20, -385, -95, 111, -273, 151, 45, 147, 270, -92, -139, 167, 50, 82, 45, 198, 87, 80, 259, -85, -406, -275, -49, -153, -162, -251, -114, 105, -381, 15, 117, -50, -22, -124, 128, 90, -46, 124, 97, 13, 219, -107, 187, 118, 105, 116, -55, -141, 212, 37, -21, 26, -135, 29, -151, -187, -381, 10, 35, -239]
3249b39L19j74M77l01j74L45j50N9j48K57N8k86l9J54O9k14j41k56J29K14j81
3270b22R5kj01R5O2j93K93O5k40L60r9J3Mj3J22k20n6L46l66K91k33n9jm6J02
3295cK2j5k32J15K6MK6J12k34K03n5J20J62j45j1J5m9R1o3K24k03l12K2J83J19
3320A22jq8p8k7l8K53j95O4J29k34j1j13J09P1m2L77m06J96K1J29K4j92j91k17
3344c38L53P8j50oN5m6j36K03k63p4K57m0k55L73j55p1J97n9q8L43j95O7j81L07
3368A76j96p5J85j76O5q8k4r3J12P0j14J13J6j23L12j62N8Mj09M3k41K45nK46
3392B39k68P1J04J0k15rJ72k01J70m6k23J84j05J35l2j96L21o9j70p4N0Q1J02
3415C1k68K59J15j95K20J05k57P9K43k14R4l34K76k92J61R0l25J17J41m4j71j57
$$ y = [-239, 80, -94, 383, 82, -92, 253, 103, 162, 14, 271, 329, 43, 4, 158, 227, 13, -128, -384, -255, -41, -222, -127, -129, -230, -135, -73, -266, 27, 92, -148, 212, 113, 126, 130, 117, 239, 19, -37, 309, -57, 234, 1, -58, -59, -105, -3, 19, 4, -228, -113, -87, -83, -57, 55, -179, 24, -31, 89, 251, 106, 95, 110, 61, 152, 89, 313, 110, -202, -180, 3, 122, 121, 33, -45, -72, -110, 143, -52, 12, 141, -93, -104, -217, -108, -37, -79, 298, -108, 88, 109, 238, 262, 70, -121, -338, 15, 93, -57, -63, -8, -54, -190, 13, -250, -324, -67, -107, -362, 11, -144, -215, -18, -77, -165, 178, -17, 50, -131, 176, -20, -95, 90, -86, -21, -109, -133, -226, -114, -44, -158, -45, -29, -152, 160, -2, 56, 60, -49, -6, -247, -2, -7, 239, -29, 42, 146, 156, -59, -68, 104, -97, 73, 27, -196, -12, -117, 18, -14, -210, 111, 42, -128, -202, -152, -71, 31, -237, 22, 137, -58, 162, 267, 10, 89, 332, 118, 212, -122, 154, -138, 23, 113, -212, -95, 46, 2, -169, -326]
3437c26K15l17M02J16j0K3N2Q0n3k5j2j27K21m6k83N41j42p01O17l15J79k56O
3460a61J86j3J05m6l17O5K28m9j18K48J3J82m41L06j92k8R1jJ35k04J4J96k22
3483b3M7J27m40J44Q2o2q1J67k64K70k9K75l23K5R2%K71l70j7K53J87k20L1m1
3507A01o8j73R2pq3J14k19j01K92J17j27k11o1Q3L54j28J27j13M46l59k42K22
3529E6m5m0j0J50k15J20R5J03o25O02k73K30j47j30J06K29o38K43N7J95k5k4j22
3552a08L25m9q3K0j95J64K0Q4K6k94K31mk12q6K6J00P8k27K16k29J12J48k47O1
3576a23J23m3j05L32l45J67Kmk04R8k8M41M9j22k3jl19J85k00R3j39O9l3Q5j90
3601b35J89on1J29J2j00l8L70l39O4K26k24o7j04J58J31j37L6lL2j04k31J61k84
$$ y = [-326, -111, -428, -26, 90, 80, 103, 155, 235, 182, 157, 145, 18, 239, 193, -90, 451, 309, -392, 225, -90, 89, -167, -161, 25, 12, 117, 71, -246, -181, 47, -2, -120, 128, 141, 323, -118, 188, -4, -32, 59, 58, 193, -11, 3, 199, -23, 24, 151, -289, -145, -63, -125, -206, -39, -303, -33, -62, 213, -110, -85, 7, 7, 278, -92, -109, 144, 331, 111, 142, 101, 33, -140, -48, -55, -138, -24, -243, -344, -52, 65, -62, -273, -334, -251, 103, -25, 102, -11, 435, 76, -166, 56, 11, -29, -39, 111, -104, 16, 111, 214, -411, 191, -82, 148, 1, -129, -23, 206, -432, -189, -132, 63, 38, 14, -108, 217, 168, 85, 105, -90, 74, 94, 178, 204, -90, 141, 137, -75, -161, -135, -35, 43, -184, 32, -197, -85, 63, -184, -123, 0, -43, -148, 184, -161, 6, 8, 4, -200, -102, -130, 311, 360, 238, 215, 214, -105, 80, -120, -27, -166, -97, -130, -45, -235, -46, -52, -103, 26, 38, -62, -100, 270, -69, -5, 221, -3, -70, -174, -16, 115, -22, 14, 11, 43, -61, -292, -131, -415]
3625d15L04K32k24J24j46Q1j84M10l07K52j33Q6J15j59O9R4O5l37K43k57K86k47
3647d8pL07l05J54p3J60l73J11M9p4n8K37j1j50q7M02r1j02j51J8J21K15k88K07
3671A63K38m95j82K38j5j4kj85K65k00O6N6J04r4l1l36K48Q3K69q0l9J5J45j71
3695D6k36L08l7M1j14J77k8l01K3q0K06k15k3N5k17K04L3k1k5J28J17l06L39K
3719G6K87n05L56Pk36L52k52q9K16j86K87k69k85Q7J99j81jL72k40k7K58l99J82
3742IJ1K4R5j22n1J7J38j01j08J01OJ32q2p9R4m3n8K9L1j10L41m24p7J71K40j40
3768D4j8l29M71k83J11P1M6K22k41j14J19K90l50j19K36j15m3j57J71J33l31n0
3790b36O3N4jK02r7j12O6j9R1J93r2j35L47j52j47J0L89m29K34j54j16j07L0P6
$$ y = [-415, -111, 121, -103, 21, -125, -44, -228, 182, -125, 127, -6, 80, 195, 36, 105, 199, 264, -73, 170, -87, 199, -48, -55, 252, -53, 101, 28, 188, -185, -74, -25, -99, -157, 80, 69, -81, -168, 234, 143, 41, -110, -92, 29, 244, -44, 163, 401, -94, -276, -38, -53, -67, -69, -254, 11, -189, -123, -67, 37, -57, -88, -424, -176, -93, 176, 96, 57, 72, 217, 46, -190, 118, 81, 122, 8, 185, 157, -144, -121, -201, 5, -210, -233, -178, -395, -191, -158, -179, -204, -76, 41, -265, 74, 76, 363, -142, 214, 221, -15, 337, 85, -4, 212, 26, 313, 44, -241, -154, 45, -136, -137, 235, -5, -32, 226, -173, 9, 20, 44, 139, 17, -34, -17, 121, 20, -88, 13, 19, 151, 69, -10, 84, 41, -17, 12, 43, -67, 274, -150, -227, -56, 184, 44, 26, -303, 168, -115, -4, 67, 113, 335, 94, -20, 99, 389, 39, -80, 156, 41, -2, -159, 12, 145, -186, -236, -173, -119, -120, 82, -15, -127, -61, -80, 11, 204, 112, -23, 324, 172, 25, 35, 424, -5, 229, 75, -41, -148, -118, -42]
3814d2K6L49l96r4KJ5J51J10K6J06j74j33QJ53K0j48P6K49k70J43k50j4J91J87
3838B91n32L25o3P9l70K78K12l93K42l44L7k4K77K8K42p7nn5r9K02j13r4N9j4
3862H9j02M9J18p6n37L17J05j16mK0j89L88r4o2Pk80L08Q2K1o8M9p3K29j4j3r8
3888E6J10l85K00j98J80mJ04N1k33K35j22J9nRm9j44K08j56J73j71k4J16q5L24
3912B09l15M14k21j84J95p4J58j53O6j5j71K03j14m5P8j89J68j44nl66N66j47
3934h6J48j00O9J75k11J97j14N7L5p4J04m2l94M31k94j02J09j19o7M35l86J69
3956f0j17r8M91j52J29l83L16k91J56r2Q1L10m34M56j4l25J32p5j27j08J84M8
3978B7O4n02J18kL68k48l4L54k99P4J94K03p3j58k74L23O0O8Q7k97J64k82K54
$$ y = [-42, -16, 333, -63, -157, -155, -140, 11, 121, 147, 253, 79, -54, -46, 107, 127, -21, 55, 304, 34, 177, -73, -87, 104, 291, -241, 84, 21, 100, -270, 8, 220, -173, 69, -275, -238, -262, 15, 43, 285, 208, 203, 148, 49, 251, 138, 44, 103, 89, -13, 36, 154, 78, -459, -142, -37, -153, -157, -137, -326, 62, -32, -94, -87, -367, -59, 23, 44, -24, 25, -48, 181, 167, 154, 56, 166, -219, -19, -217, -37, -41, 63, 114, -119, 116, -6, 13, 8, 17, -32, -176, 32, -124, 49, -122, -146, -30, -115, 209, -106, 308, 87, -97, 98, 24, 182, 29, 95, 80, -91, 112, -2, -47, 31, -158, 10, -134, -139, -505, 61, -86, 62, -38, 31, 206, -5, 192, 78, 135, 170, 96, 200, 158, -236, 195, -99, -201, -92, -211, -278, 157, -229, -60, -177, -275, 216, 64, 193, -190, 126, -165, -9, -101, -20, 290, -144, 312, 298, -27, 105, 30, -97, -205, -21, 27, 91, -411, -293, -295, 73, -175, -209, 145, -154, -80, 114, 317, 244, 86, -188, 135, 195, 263, 350, 53, 217, -65, 189]
4001A89l76L48J3k04J76k88J54k57K10j12r3J44K76m51L10j9N7O5Q0m98K71K83
4023B78J4m72K65K3k05K14k68O7p6L16k53J15k60J33J75K30k85j71J17j21O2n2
4045a54L72n6p9J80j27Q8l3l08K54Nr7k43O7J66j39j45J46J70k75L1J94J7q9m0
4069i5K59j76R4k05K88L7L1l11Q0L01m24J44O9K04l83P7J60rl30P2O2j13Q1K91
4093B04j61j71O5pJ97k77P8r3J64j06L44l44K28r0J11l29L09J10m64J78M9k70
4115b75J20j38K77q1M1P4o9J14J19j38r8j4O9J00N9j54J54j68N9J60p6j3j56l0
4139f4K35l11p9rJ52j38J94K3k73Q9R6O7k89M20j22j24J74m0K7K36m33K87J90
4162C08m23L43k67L43k60J3l77J49Q0j18J45j94J42Q7R3m25J7K74r3K78j75Q8
$$ y = [189, -187, 161, 174, -30, 146, -142, 12, -245, -35, -147, -240, -96, 180, -271, 39, 20, 77, 142, 222, -276, -5, 278, 292, -180, 85, 108, -97, 117, -151, -84, -160, 156, -97, 18, -242, -109, 66, 296, 11, -160, -43, -164, -102, -154, 218, 162, 83, 263, 136, 224, 191, -117, 137, 142, 45, -198, -131, 35, -104, -249, -103, 67, -208, -177, 17, 34, -55, -95, 164, -12, 82, -123, 165, 202, 233, -78, 2, 303, -121, 23, 92, 296, -87, -10, 150, 141, -189, -117, -55, -168, -87, 204, 43, -128, -63, -70, 127, -150, -72, -165, -1, -107, 237, -107, 121, 31, 142, -187, 122, 232, -232, -54, -5, -275, -155, -293, -16, -97, -56, 18, -51, 63, 182, 44, -54, -68, 1, 101, 160, 6, 160, -8, 51, 211, 135, 122, -34, -64, 171, -140, -219, -228, -76, -214, -20, 3, -270, -181, -85, -18, -307, 113, -9, -133, 41, 1, 28, 264, -169, 118, 308, -115, 228, -39, 304, 44, 57, -320, -171, -91, -209, -64, -258, -116, -29, 64, -361, -344, -70, -163, 115, -60, 28]
4184B8K14j31j82K49R6k07L8L0l5m03L37J18l46O5J58l30J57J54m4p7J47R8j29
4207Er1K31k13J11l4K49J1o5l61L69J71o45J93M7J14J3j95K89l02m3J9k30L08
4230d9j23J08K04k62k34L52M2K15m0k1k26J15J66l68K06Q3m24L60j73pQ9o0Q2
4253C5k03j8Q6K72n1k69r2J38m9m0L14J1R0n8j06K6kQ7M40m83j58k19K74j23J16
4278A8j28M1O5n3k07K81l1j04R7j88J10L91k93j1K56k15J20k43L65l50K75m30
4300b34K78P0j44j70K98p4l74M39j23j08L08j69N1J97l59o6J51j22L23r1j11o
4322c6K12o5P9k78K21jk28L26j10N4j25j60J0J08n0k22N4K63l08K14J29j04Q3
4345F6J28l26L00M5m10K09O2j09P0j43K27L7r9Q3j92p4O3k7J3r5j12K51j95L19
$$ y = [28, 242, 111, -71, 178, 274, 67, 105, 135, 100, -303, 34, 152, -194, -129, 29, -301, -144, 10, -34, -111, 36, 134, 5, -86, 145, -68, 43, 9, 258, 269, 204, -157, 212, 383, -262, -69, -22, 92, 105, -90, 199, -103, -146, -127, -357, -49, -172, -64, 140, -122, -356, -4, 38, 253, 213, 192, -34, 81, 247, -121, 85, 168, -256, 104, -69, -76, 13, -47, 35, -168, -186, -100, 172, 121, -148, -240, -102, -151, -191, 123, 134, 224, 166, 60, 86, 84, 171, 611, 128, -30, -249, 25, -98, 18, -110, -69, -4, -57, -264, 17, -14, -118, -21, -209, -99, 292, -1, -12, 244, 29, 149, -94, 271, -79, 196, -234, 44, 114, -30, -200, 98, 24, -350, 89, -34, -142, 166, -3, 48, 245, -114, -180, -29, -151, 172, 81, -30, -36, 176, 111, 190, -88, 133, 132, -96, 230, 120, 174, 49, -111, -101, 7, -43, -265, -211, 52, -256, -42, 87, -17, 66, 194, -132, 168, 213, -197, 12, 74, -35, 35, -108, 119, 156, 57, 140, -52, -126, -63, -90, -77, -172, -284, -33, -228, 91]
4369I1j04p9J22pJ61O2l03K45j32J07J40j59n7K9j3J4j72m2K30j67J02m3k45K06
4393a4n6l1K75k47J82j26p7N2K5J84M3j10Lm7J07K73l18Pr8J95m10J14J76k29
4417a27M0l0j0O0pj12K5L00j28K61l01M7k83K8K45m2J97Q3j19K17k52j33n7K49
4441A51k06r0NpL8L7o9m5j91L85K98k73K87k77Qj28J14j14M0L80j46l55L09r9
4465E2K41k57L1k69mK74j39J81k30j8J71l28J40K41j01n3K91j55j99L48o2M8k31
4488b8K7L28K3m92J73J01j72K5J16j11r7J14k12L19l28j39P7R3L7P4K89p1k48
4511a02P9O9K7J22j84p1J04j73K55k7R6l88L60j53J9k56R7n9jJ09r2L97l01J50
4535G7R0j51n5K75k18J46M9j84J98k53Q7J41j59j13J01j51J53n2j25L65l05n3
$$ y = [91, -13, -92, 30, 23, 184, 246, -57, 188, 56, 163, 303, 144, 87, 116, 103, 117, -55, -97, 133, -34, 68, 25, -220, -14, -70, -101, 174, -73, 109, -17, -94, -42, -17, 167, 210, 100, 103, 56, 163, 436, 118, 125, 27, 222, -188, -74, 102, -127, -87, -117, -127, -67, -74, -186, -161, 139, 11, 272, -29, 18, -265, -237, 8, -34, 163, 246, 127, 344, 92, -41, -98, 151, -55, -145, -140, -147, -109, -72, -141, -186, -377, 8, 306, 33, 320, 43, 51, -77, 37, -77, -37, 343, 197, -158, 151, 52, 293, 36, 67, -202, -206, 68, -71, 110, -120, -138, 33, -295, -155, 86, -15, -68, 223, 68, -131, 217, 155, 203, -28, -1, 327, 350, -142, 31, 132, -40, -15, 101, -10, -107, 7, -205, 114, -214, -353, -276, -183, -146, -72, 217, 146, -102, -23, 46, 73, 195, 11, -60, 44, -129, 126, 99, 195, -193, 167, 14, 33, -223, -126, -185, -186, -77, -169, 228, -73, 77, 167, 16, -39, 236, 18, 164, 213, 29, 227, -26, 61, 202, 43, -70, 31, -120, 33, -19, -144, 221, -84, -137]
4557a37N2J55l25K13J29k13K18L8J17j83p3L47k42o8k05J44J17k56J04J55k83
4578a96M2lM5K18k27Q6m6O3j98l6L93l36K54n5M0K13l40Q4J02P8pp2J45j12l2
4603A03R2l39J65m8Q1l55J81L40j48j99O1J6j12N8R0K01Q7j93j05J7o2M5L54k63
4627F7k1k9m3L26k41j69L41k82P6m51O5J29L39r5P5p2p2J71p7j63J76K01j11l5
4651A05R8q6k8j46L16j51j02PJ60O4n46L46r5j32p9J12K59J3p7k55r9M59n9j59
4675g5L17k35O2q7k2Q2p7j58J77QJ70r2l98M38j84j67O3L46k48q5J80j04j77L11
4699D5L5K6k47k9K35j63J93O1k94Q3N0j2O4K06l39RJ42m1J13ll74L77n6q5l1J90
4725A55j84lQ4q6j36J98j62L25Q8k13j16L9J2l8J3j5j57L5J23L2K78k89M7r8L8
$$ y = [-137, -85, 70, -255, -42, 87, -126, 92, 130, 247, 64, -9, 338, 96, 28, -177, -33, 84, -172, -68, 87, -196, -154, -157, -112, 106, -121, -35, -81, -18, -216, -252, 141, -195, 59, 4, 44, 257, -83, 1, 103, 181, 174, 102, 247, 135, 103, 195, -144, 21, -27, 54, -301, -120, 220, 72, -127, -66, -50, -162, -104, -14, 187, 274, 81, -24, -7, -69, -24, 330, 67, 46, 17, -26, 300, 59, -110, 231, -51, 25, -426, -361, -232, 107, 12, 87, 15, -57, 114, 37, -126, 50, 251, 140, 105, 203, 117, 89, -57, 259, 108, 6, 13, 173, 237, -309, 37, -58, -190, -269, -157, 102, 115, 38, -217, -316, 143, 84, -75, 242, 7, 69, -18, -40, 42, -35, -193, -16, -8, 162, 70, -328, 110, -74, -241, -178, 168, -80, -165, 15, -89, -266, 45, 80, 106, -141, -170, 65, -98, 95, 156, -138, -55, -5, -17, 47, 253, -86, -77, 65, 24, 137, 134, -240, 137, 81, -4, -35, 155, -29, -32, 52, -34, -170, 28, -134, 191, 279, 66, -50, -11, 1, -37, -24, -39, -196, -161, -38, -6, 272, -17, 30, -68, -30]
4750c0j97R6M9p7j72M89m5j0N5P8j05j89K89q1M7j01p4l20L63r2n0q4J39j35K56
4775I9k37J32j69rJ56O9r6J75Mj41P3N8k3J65k38k0N1k15J12J95j70K47%j59L4
4800I3M8l34J37j10J65j38J80J53l62R6k50L45P0N4k8j29J61k39K44P2m2m7j2
4823A27o8j52J20l01P4P8J31q4p9j52N07k88J52j92lJ21J02r2pN7j94J69j64J07
4847c1L50j59j96j29L70k71P1j05J07lq7o7J96k32l3J97O8j71K14p7J03Q1lk78
4871h5P2K5R4j3l9q5J09J79m97J33n0J87q5J91l91J13R0P9l50L04o3K49k48j01
4895a82K0L05q6j44L68k81L6J79l17J73n5R6K7j44j26k5p3J53K41n26J79J65m2
4918e9j30L56r0k7l56K25J90J07j07j08j49K15n8J2R0j93J04q4j23J69j66L22
$$ y = [-30, -227, -131, -82, -159, -331, 158, 113, 103, 158, 236, 131, -58, 231, 150, 197, 96, 22, -298, 65, -27, -77, -161, -22, -157, 99, -138, -6, -175, -184, -28, 41, -55, 120, 124, -17, 56, 114, 91, 256, 18, -2, 49, -166, -54, 141, -29, 218, 218, 59, 93, 141, -193, -56, -166, -1, -139, 41, 194, -168, -72, -322, 23, 93, 147, 119, -10, 151, -88, 156, 228, 186, 139, 127, 59, -93, 27, -274, -200, -122, 9, -75, -154, -306, 201, -87, 65, -127, -130, -9, 93, 1, -6, 51, -143, 26, -138, -31, 319, 160, -36, -165, 205, -66, 5, -100, 7, 4, -83, -150, 46, -186, -219, -22, 46, -125, 89, 12, 115, 196, 193, -85, -13, 12, 106, 93, 54, -31, 78, 257, -240, -107, -157, 30, -55, 136, -255, -142, -52, 27, -323, -19, -82, 167, -81, -182, -162, 143, 57, -87, 281, 0, 36, 215, -102, 71, 16, 112, 139, -5, -131, -156, -229, -76, 165, -361, -182, -17, -59, -189, 167, 77, 50, -306, -81, 109, 216, 109, 1, -148, 67, 9, 21, 111, -82, 22, -62, -185, -16, -182, 140]
4940A40k2m27K82k3Nj61J25K3J33j04J91j07j57J33j51J08j81J84Km7Kkl5J90
4964A01j30l78J37J49J21J21k4k29k38L55P9j25j5L77k47L0O8j22rJ22k39J74
4986G8O5n3Q6r0k56J77R4k06j94K69j32r8R3j39J65k5J98p5o2K6j34L78J07m20
5010a48J16J8J41R9j91lK59l07k29J75Q3J15o0o1R5k06J98j66O7J71J38l21k4
5033d1Q7k64L83j25M9j42R1J79m1k35nO1n7r2op2L5J41J13k07J60M7m77L88n9
5058h9r1K32J46l19K30J08P9j82l2j4oN7J3r1k54M95n84K59j15o7K4o2K33j09
5082a39N9K37l35K16j29j79K49J57q6r2M0J75k77L66j26k55J85o6O8j50J68j2
5104G4j89j6l8jO4L7J53l75J68l5M2R1q9K24j85M0k4m6K20j52R2j19J3O0j85J73
$$ y = [140, 118, -309, -27, -50, -45, -206, -81, -58, 75, -29, 162, 55, -102, 31, -120, -12, -193, -9, -7, -54, -52, -54, -89, 101, -29, -407, -270, -121, 0, 121, 97, -132, -370, -15, 64, -61, -76, 301, 54, 84, 152, 30, 21, 143, -96, 78, 143, 90, 176, 86, -170, 7, 101, -105, -299, -30, -162, -260, -167, -306, -141, -166, 32, -43, -105, -79, -213, 165, 272, -148, -32, -14, 127, 226, 35, 32, 291, -16, -245, -70, 13, 128, 68, 7, 102, -104, 94, -72, -5, 166, 304, -17, -41, 46, -218, 165, 40, 89, -53, 38, 217, 176, -59, -64, -3, -60, -152, -158, -230, -195, -54, 59, -148, 12, 59, -418, -30, -89, -180, 52, 198, -121, 109, 217, 296, 114, 82, 68, 62, 119, 132, 41, -213, 282, -302, -43, -158, -225, -201, -263, -30, -139, -80, 157, -178, 38, -91, -270, -21, 136, 50, -42, -2, 173, -104, 262, 136, -119, 66, 0, 68, -82, 86, 74, -115, -131, -169, -170, -106, -69, 84, -291, -123, -158, -116, -25, -114, 110, -75, -35, -59, -105, 115, -37, 55, -64, -51, 9, -176, -3]
5130cP0J4l51J53m7J45o2o8K47rp1j17J61j34K6K11l59J26R7M9Q2j51L9J07K6
5155A81m51J18Q5J97j09k06l1K17k13J79L9ro7j65K59Q7O4p3l1Qo4L23j62j58
5179A8j15J00J46k22J29n1R0O3l09j36o7N07k62P2j7M1j54L57k73J54j9j71M24
5202C05k09L%J3j04k70M29lj99l06L13k80K11J76j56o3kJ87j19P4J09j19l7K1
5226b6m4J59k9q8q8K24O6j96J16j98K73l5l07Q5J60j18M5n6L2K77k70k9K70l05
5250h2k33J12K56j49J62L26k74pj35K8k29K98J05J01m66N01k40j32K54j06l4k59
5272b03R3J96j0m98J61M41j96Q0j59K68l0pj01k95M25k93K74n3Rr0K19k23j19
5295a11L3K04mj18j13K72l91M9J98j64p5M33P0j38p9Q6jj07OJ8m7M0p7L66m96
$$ y = [-3, 67, 81, -270, -117, -164, -19, -81, -149, 98, 89, 18, -99, 62, -72, -46, 165, -194, -68, 29, 78, 160, 9, 48, 155, 181, -270, -152, -67, 130, 21, -185, -216, 1, -212, -33, 6, -3, -70, -235, 24, 111, 175, 102, 71, 79, 15, 338, 176, 18, -97, 3, 149, -73, 56, 5, 95, 158, -151, -287, -354, 153, -109, -37, -54, -13, -167, 190, -83, 71, 52, -119, 305, 96, 99, 99, 112, 8, -262, 167, 164, -35, -341, -28, -308, -97, 79, -77, -140, -142, 45, -74, 0, 109, -10, -47, -26, -70, 89, 60, -28, -116, 108, 174, -22, 94, -104, 169, 134, -173, -88, 72, -46, -1, -57, -25, 252, -18, -47, 223, -82, -315, -203, 53, -96, 66, 392, 118, 111, -24, 4, -225, 73, 178, 279, -187, 314, 74, -58, 196, 90, 56, -203, -110, 86, 76, -422, -261, 180, -16, 64, -95, 173, 143, 136, 35, -260, 165, -128, 146, 93, 102, 12, 231, 8, -111, -78, 126, 122, 4, -109, 163, -228, -179, 19, -145, -220, 213, 283, 145, 66, 152, 151, 44, 50, 68, 21, 61, -16, 350, -146]
5320a46mL63m50K67k2K63m96K12l68L32m1J40J30m56J85k0K41k77N41m96K07k39
5342a34J52k0J61k9l22J58J73k80J51r8J22K07k41L83l07k45J06J6J57k74O8J1
5364h5L7j6o3J09J62J35j11qj03q0O5p2M8j69Q4Q3kK2j52L99n34K31k10J86j43
5389a87J76r7L4J81k45J23J16O6R2k46Q6Q7J0j66n6K11m00L72l16K34k62L07j52
5412c2l42M48k81K53k1k10P5j1K01m5J1J18k3j34K04K7k43mL56m02J97j79k23
5435b60K46j6j03K0M6nk39K61J93o9k27O2k07J92r7J30J27j13J84k63K19k36J92
5458C7J90k1j44j10J46k76J63j53q7K25j87M19l9p8l68J13q8M69k04P8k25J06
5480c4K10k84L97l83J27p3K20k87J46J72k89K29k26k18R5J27J22j61K14l60J82
$$ y = [-146, -150, 213, -237, 30, 8, 271, -225, -13, -381, -49, -90, 50, 180, -276, -91, -111, 130, -147, 394, -102, 105, -134, 18, -2, 159, 130, -192, -34, 139, -141, 10, -88, 34, 241, 0, 383, 76, -169, -63, -47, 110, -164, -96, -85, -48, -64, -127, -18, 144, 279, 168, 160, 57, -23, 42, -30, 18, -151, -67, 16, 14, 36, -116, 283, -251, -20, -230, -44, -187, -11, -108, -74, 107, -138, -15, 101, 167, 259, 13, 99, 186, 196, 30, -26, 185, -215, 157, -159, 75, -187, 120, -32, -374, 74, -207, 46, 25, -185, -110, -121, 80, 35, 46, 164, 141, 7, 211, 238, -5, -9, 347, -55, 142, -37, -260, -14, -30, -133, -113, -67, -72, -311, -50, 143, 74, -153, -91, -298, -106, -203, -73, 54, -59, 125, -138, 81, -155, 37, 227, 206, 62, -48, 98, -178, -15, -168, -255, -30, -217, 202, 163, 85, -283, -170, -258, 211, 7, 85, -140, -34, 176, -108, 289, -94, 33, -40, 180, -107, 39, 211, -78, 151, -75, -293, -198, -71, 51, -110, 104, -256, -74]
5501g4m1P9K69J21l49J69q0K80n15M90l68J93j34l11M54k43o4m8K72k2k68j7L16
5524A09k17Qo4J70J53r2l7k65L29J06q4p7J29j34K72k90k0%K73l6r9j0l99K24
5548e1M1m9O4L3k51K09J5L0k48L56J35p1l48L74j1L5j19J51k40O6m6j89R5K48
5572B29l75J89m7p5R1L1k14J2J43M8j20J47j29o0L38j31r2jJ07l2q7M04q3j13
5596A80mN5kOj49J00j43j34J48Nm8j39L37j46m0j16r5Q0n0J90P2J18M9k89nj01
5622a21K48J66j41J65M1l60q8R4n9J78k55J54r6P5q8j20J73l0J74k51J58m0K55
5645B32k74m4M0M31l19K61n03K29p6O7J66j38n8p8j11J32M4l04J26J20K21k3j56
5668a5lL6j1K1l0j3j72K74K08j89j65J97r4k79L32l44J33J52L7k24K6J79k28j88
$$ y = [-74, -115, -36, 233, 354, 5, 174, 94, 374, -141, 349, -19, 174, 40, -271, 183, -60, -124, -172, 100, 78, -190, -207, 109, -108, -100, -164, 6, 159, 67, 30, -235, 94, 200, 116, 39, 168, 34, 306, 16, -4, -4, 269, 233, 134, 124, -275, -51, -10, -59, 5, 38, -213, -4, 11, 41, -207, 149, 284, 213, -135, 239, 228, 263, 144, 295, 55, 121, 75, -114, -19, 229, -146, 43, -4, -79, 12, 43, -171, -159, -16, 32, -88, 59, -70, -130, 208, 77, -15, -16, 91, 59, -28, 376, 293, 180, 176, 231, 229, 235, 86, 186, 43, -91, 57, 62, 14, -125, 212, 66, 26, -90, -185, -105, -155, 35, 107, 225, 274, -15, -20, -121, 127, 293, 152, 317, 358, -2, -90, 4, -55, 123, -132, 22, -74, 1, -87, -207, -34, -64, 110, -141, 17, -23, 232, -42, -86, -46, 385, 66, 327, -176, 53, -23, 44, 210, 72, 14, -64, -175, -43, 1, -303, -177, -57, 164, 141, -15, -18, 18, 7, 28, -2, -15, -187, 87, 295, 106, -59, 138, 44, -235, 97, -247, -114, 38, 75, -149, -123, 56, -172, -360]
5692c60K96j77J31j07J24R5k4j30K48J92j67J12j49L38k96k40K71pl61M74n57
5713b94m4K93J6l5k3k28K23P1l2k66L32k08P4K12r8j04j17K06J20k2l8J60k47
5736d9kK21j87l6K65k19k22o2K07l0P8j47J00K10k32O1m2J61p9j36N2K45j65K24
5760B16N0l80J76J2k38K08n1N8k09P6m8j24L36m7r3O3J6%o3r5R3K97j09k72K06
5785G8K78m28L3J36l6l4J36j23J0j40K31k93j7Q1K2J11k14J23N4K3j01J79m9o9
5809iJ96k2l05K02J6j00J1J86J03j84k89K54J1k69K22j85K22j61r2J34r6J9Q1
5832e5j85K03K3J35J39k31j53L16lk2L38n95L27j05Q4j61j54RR8N3k15J17n1j29
5856b17Q9r9O5P4J1R0k27L2J97J46j49K04j21K8P1k78O4Q9q3l1K32k81j55K56
$$ y = [-360, -64, -241, -110, -217, -93, 2, -22, -152, 96, 288, 121, 233, 84, 422, 126, -114, 157, 150, -211, 263, -294, -338, -45, -29, -64, -87, -315, -92, -21, -53, -319, 13, -195, -121, 91, -7, -111, -228, -22, 98, 76, 38, 198, -49, -51, 170, -17, -53, 212, -7, -229, -291, -84, -114, -36, -183, -83, 127, -105, -44, -86, 75, -4, -140, -88, 157, -8, 216, 266, -114, 62, 74, -164, 44, -7, 51, -158, -82, -130, -254, 82, 35, -58, 5, 21, 21, -42, -137, -44, 253, 144, -128, 78, 356, -72, -39, 97, 61, 27, 163, 40, 50, -90, 141, -152, -169, -88, -66, 45, -169, -46, 8, 31, -70, 109, 60, -9, 187, 165, -140, 62, 78, -22, -11, 175, 278, 94, -195, 59, 70, -199, 23, -162, 60, -101, -193, -59, -155, -136, -55, -240, -37, -14, 121, 260, 29, -124, 192, 189, 167, 505, -90, 237, 132, 216, 55, -99, -90, 8, 61, -154, -37, -88, -217, -128, -227, -162, -88, -77, 13, -214, -182, 15, 161, 12, 216, 95, 123, 194, -84, -20, 69, -14, -45, 187, -94, -249, 7]
5880GLj85O0J79k45R2K02r0k80K10K5j3K18n2P5Q6j55N4r3J62j42k91K38j45M7
5905c3j54L18l47K65p9J7Q9j40P1j18OK65j10J99N3j18kJ18r0j4k75R2l03M67
5929A77R1k55o4j18O4J24N7j41N5r8K4j42J83m9N6j86L64K93n07K96n8k68l6p
5953a45R9J92n3J50j10J5k72K05j01j26J55j67P0qP1J4P4j41M3N4p7O6K30%n6
5978A82m32M29k1K8k52K33l82J96J47J23l10J84l90M4R7O0J76j60J52l62M8J34
6000g6q0K0M07PJ4n10K11J83k43J99l52j21K31p9L1J80P0j36j35L6l7K26m07L04
6024e7J54l04Q6M8J48L9MJ78m02J79n7M0P1j35R4k9j30L46j62j90j31o8M26k15
6048f7J34k54J88k67J60l7J59Q8m30M00l06K08J26P1qj01%K1k95K97l87K63%Q
$$ y = [7, 10, -175, -115, 64, -181, -89, 113, 23, -257, -47, -22, -35, 183, 131, 206, 292, 137, 191, 98, 260, 118, -173, 65, -80, -33, -187, 131, -216, 49, -30, -13, 76, -64, 7, -111, -105, 160, 50, 249, 302, 184, 182, 300, 210, 196, -79, 13, -290, 177, 268, 13, -51, -169, -105, 19, 76, -65, -10, -108, -84, -226, -43, -92, -36, -222, 142, 435, -72, 224, 166, -102, -138, -145, -46, 146, 93, 243, 133, 148, -124, 81, -20, -146, 9, -158, -88, -96, -25, -11, 63, -78, -35, 19, -58, 8, 238, 238, 182, -250, 179, 158, 186, -66, 167, -215, -19, 128, 251, -59, 125, -265, -221, -124, -64, 112, -48, 104, -258, -210, -76, -156, -136, 271, 278, 292, -218, -7, 176, -67, 132, -220, -341, -110, -189, -158, 22, 92, -44, -179, -143, -180, 46, -361, -57, 97, -207, -121, -73, 75, 114, 118, 296, -106, 73, 16, 56, 127, -8, 86, 57, -73, 273, 111, -79, -210, -278, 148, -67, 67, -187, 1, -266, -106, -143, 16, 104, -326, 74, -232, -24, 102, 173, 165, 64, 64, 85, -210, 87, -300, -37, -37, -29]
6072b9N2P2K14k63p5l0o3J18j81k9R4J06K83j64k86L7R9N7Kj8K12k11K02j01Q5
6097A83k05N3k15j1P9j5J06o9Q1j13J84P9j31P0MJ41l98K16l34N12N4k02K29k38
6121F0j41j18L63l40J7o3J64j40J65k28PJ40K76j89N3L8j01J32j35O5K23n3j58
6144C7N5l33K97l8J8n8R6p0k30K11k77K88k19K29n6j6K89k74L9m7K59l04P4j07
6168a37K89l71L89k0j41K56j74Q6j73k26K71j31J91l56J35n5N9q7P0L54k93j47
6190b11K28p9jK24k21J00p5P8P4j02N5l69M82o9r0j76J52K10j32m0j41J25l22
6213c00K52J5O6j10kJ54k57j46N86l94K88m3o0j26K18J37k94j4O7J12j68o5J32
6236D8j42j33Q0Q1j16o2L39r8K48m19J24n4J34K73m07N4n7r8K08K56j18j81M1
$$ y = [-29, 23, 95, 309, 46, -29, -59, -122, -4, -185, -214, -120, -14, 269, 105, -181, -144, -45, 12, 14, -4, 208, -3, 199, 98, 183, -22, 31, -184, -195, -116, -131, -25, -94, -13, -126, 58, 137, 6, 76, 80, 221, -177, 39, -295, 217, 271, 69, 298, 60, -81, -199, 164, -176, -159, -222, -58, -198, -33, -261, -254, -114, 162, -27, 26, 64, -37, 95, -40, 25, 248, 195, 37, 92, -241, 56, 18, 36, -22, 74, 4, -226, -15, -292, -4, -223, 6, -50, -66, 223, -51, -12, -59, 200, -104, -30, -137, 152, -219, 170, 150, 9, 265, 91, 177, 4, -222, 49, -82, 109, -247, -112, -167, -108, -195, -125, 229, -64, -211, 17, -62, -63, 161, -60, 40, -35, 43, 117, 15, 70, -299, 183, 114, 24, -152, 0, 210, 78, 38, -103, 22, -300, -48, -33, 33, -77, -79, 75, -182, -328, 258, -136, 152, 109, 49, -77, 141, 278, -16, -30, 37, 149, -19, -84, 48, -94, -227, -147, -66, -182, -244, 95, -3, 245, -174, -50, -104, 30, 303, -104, -50, -107, -205, 3, 259, 141, -40, 1]
6259AJ44j28O6N4j98J37j86K49k57K23P5j72j60J48k51L04j36j19M58k08J05k2
6281A27j31j52K14k20N48m42J05n3K49l96L44%j84m3O1l00J02j64L39q6k2n9J56
6304gQ4O6m39J84K72j49L15j48m3k34L1L7J63k86K30j7n5j55J05R2m2l80N30j2
6328A42l40J63J11p7R1M3k79n0R1J8J88q3M7m6j33J6K62j90o5M8N8j16K35k01
6352f7j08J33J7Q7J34k73JJ4L4R4n9N5j19J17Kk35j3L47n4q6J56j33j18R8l26
6377c02K37o5j12K98k23K10m6K55o2L8l67L75l00q6J60o7L28j92k8q9j04J90%
6400D8J0J60p8j77rj70J86K5m09L49P5M16m08r6Km0l0M9J42J59p1j88%J26j94
6425a23K46L4r1k19J45k71J87L9q0K79j7rp6J9j96J96j04J68j05J41l82K31m0
$$ y = [1, 145, 17, 83, 137, -61, 76, -110, 139, -118, 105, 180, 8, -152, -4, -255, 49, -87, -206, 252, 44, 149, 127, -4, -156, 58, -162, 386, -56, 49, -4, 245, -151, 193, 193, 9, -34, 27, -273, -171, -335, 4, -82, -104, -163, -7, 77, 143, -296, -112, 160, 11, 326, 178, 135, -99, -68, -31, 132, -154, 76, 59, 4, -151, -46, 46, 4, -376, 154, 142, -198, -35, 76, -1, 90, 133, -146, -196, -105, -87, 101, 18, 65, 19, -114, -98, 164, -26, -91, -43, 15, -101, 134, -67, -175, -42, -25, 62, 196, -77, -76, -62, -28, 66, 7, 62, -57, 60, 62, -173, -186, 161, 107, 21, 177, 44, -74, 24, -302, -65, -130, -242, 56, -167, 43, -3, 252, 190, 228, -139, 236, -64, -150, 10, -57, 271, 79, 51, -38, -142, 48, 48, 58, 218, 140, -37, -46, -216, -30, -5, -414, -65, 10, 426, 18, -78, -76, -116, -146, -97, 45, 204, 133, -55, -55, 71, -123, 123, 157, 66, -153, -8, -279, -92, -53, -133, 146, 129, 120, 44, 63, -133, 63, -41, 127, 22, 163, -219, 12, -28]
6448b8L5K78k99j28J85k88J90J15j16J46nk67L89k60LK8P5Qj14j56O4L60j53J4
6472G6j68O2J44q3j13Q4J49j35j34P9N0KMq4J6N1j00nP3N3J47j09j39J19j36n7
6498a54K34q6j01K33j96J46l45K77k2p7K94j51Q5j19LM9J61m33K21k31K2J45K36
6521A91k37p1n0L68l08P5J21J00j41K10l47n4J99r5J50j39J71k7Nj73K26k80P5
6544c1j38L83o07L04J2J35l8p4j6r1O2J46L0j66r2K82L67m35l4j72L6K95Pn3j33
6569b1Q3l79j02L69j5J75J2l77J76m7J59m2n9K03l41K21r2J81N0j42m4J44m33
6592c21K70J34k2l8J29j25j64K95j22M9j50J50j9k0L7l42J29J76N3q1j4J83l78
6615a91M33m42K95k02J86L7j72r1j04K61j25J06R5k08K39k57nj25K31J27j58J06
$$ y = [-28, 7, 285, -14, -142, 43, -245, -55, 60, -56, 90, 85, -182, 207, -53, -50, -22, 53, 61, -53, -209, -145, 215, 62, 76, -92, -30, 114, 31, -82, 2, 151, 16, -118, -39, 11, 13, 17, -67, -51, 0, -100, -105, -32, 21, 168, 59, -80, 39, -97, -154, 80, -6, -107, 126, -70, 76, -269, 8, -14, -91, 203, 52, 137, 18, 21, 70, 231, -202, 19, -212, -190, -45, 191, -46, -117, -167, 201, -107, -32, 89, 189, 48, 258, -89, -143, 56, -39, 111, -28, 143, 116, 121, -52, 174, -106, -31, -169, 214, -393, -89, -77, 58, 20, -54, -70, -161, -99, 47, 77, -89, -181, 101, 468, 33, -1, -173, -137, 158, 165, 112, -21, 62, -317, -419, -50, -65, 110, 122, -255, -79, -126, 33, -9, -68, 135, -206, 15, -77, 104, 154, 12, -32, 112, -321, -51, 83, 61, 23, 152, 27, -137, 158, 36, 85, -65, 85, 66, 46, 83, -259, -130, 46, 99, 18, 4, 187, -191, 242, -200, 95, -107, 79, 116, -56, -147, -251, 10, -115, -9, 86, -122, 117, -140, -145, -270, -39, 88, -70, 36]
6637C6nl62K67J26k1J24j59j00J15j93L01j18k0J37j90K23l16L40p4n4KJ9J0L8
6661A26k60J24j09J02N7J61j86N2K66n52Q9J45K10l64K17K18k91%j09J27j70R5
6683e2JJ30j21j68L51J12j28j94J29k18P6J00j05J57J25j47L4j42R0J0J2j00p6
6706a24O3K60k55L41k78Nj16J51r2o3K11j72K22k93K9k0K41P1j23j35q5K77K4
6729A39k03O4J11q4K08l14j90kR4M02l30rl4K09j24L03j54J9j79J29j38J51K3
6752I1P5J4l0j02n0O0M3l42J85K28l3p4k58K32R1j78L9j50J68o7m0J99j57j09
6776a65K1rJ79q4J09j22R0k82J15N2K21l05Q8K22J78j26k37l07M28k74K0J43J21
6799G6L9l54J88K41j37l8j64q6K28N0k68K03j47J60L9j67J12R7J20Q2k53k9j23
$$ y = [36, 31, -331, -64, 62, 41, 165, 6, -94, 21, -172, 129, 11, -9, 128, -62, 161, -155, 185, 111, 57, 59, 78, 88, 126, -134, -10, -119, -17, 40, 201, 15, 67, 333, -219, -130, 15, 225, -139, 78, 296, 5, 5, -104, 23, -147, -52, -51, 79, -42, -210, 141, 253, 125, -69, 60, -158, -82, 18, -87, 70, 195, 48, 82, -60, 30, 40, 52, -48, -124, -61, 199, -56, 285, 7, 12, -104, 47, -45, -108, 103, -69, 153, -140, -111, -131, 110, 181, 58, -77, -162, 115, 139, -64, 0, 111, 27, 235, -79, -269, -271, -177, 225, -105, -114, -148, 61, -63, 240, 86, 105, -74, 55, -83, 68, 91, 166, 180, 150, 48, -2, 58, 101, -241, -56, 172, 139, 65, -193, 39, 130, -48, -9, -159, 9, -58, -98, 101, -56, -165, -144, -153, 26, -58, 51, -71, 19, -263, -148, -96, 125, -180, -92, 130, 308, 182, -55, -362, 66, -208, -188, -45, 76, 115, -239, -51, 190, 53, 15, -149, -235, -7, 43, -225, -22, -169, -9, 30, -137, -25, 72, 192, 274, 21, -8, -131]
6822a31L01m8l48J61J32j32K8o6n5J40q2J50P5j57l9J05j85P2R9N9p0Q7j60J43
6846G9N6j54N7j08J99n5j32p7J48p5J41l10K14JJ0m5L09j53J10k48Q5p5m1K0R8
6871E4q3l1p8K25k58K4K18j03j17M40m19R3o0j4P1p8J08K6l98J60L3J60o5K59
6895A67L6j57L2J2K39m24O5m6K89l30J03j62l9J41J04J14j64j11l48J94L88k73
6917a70M73l78K47k16P2R2L6l9k2K87j71j02J8OL5n28K12K19k12K07Q6L49o40
6940a39J53oq4J7R3J18N2p0K24m68J27K0P8k77J83J75j48j74k39O00K9k92Q4P1
6964A27l41L51p3j10k04O07l95J24J22j31M6J22j85m20N17k41l5O1K66k11L6j21
6986h8J27o3n1k34L84j46P7J88j56O9q0J39k27o9J64M7J12k60M9L8o8r2J55k04
$$ y = [-131, 170, 122, -226, -65, 67, -65, -37, -103, -158, -18, -100, 50, 125, -32, -71, 34, -151, -79, 20, 79, 9, 96, -64, 79, 135, -19, 38, -70, 129, 74, -58, -135, 13, -62, 79, -231, -17, -16, -6, -51, 258, 105, 215, -33, 52, -23, -64, -44, 54, -29, -60, -138, 87, -171, -147, 71, -32, -149, 291, -128, -35, -95, -109, -38, -116, -8, 18, -380, -220, -187, -27, -92, 167, 203, 46, 78, 90, 329, -95, -30, -76, 213, -117, -14, -176, -215, -74, 30, 144, -20, -131, -479, -285, 103, -170, 303, -75, 172, -44, 28, 120, 156, 117, 95, 382, 211, 109, 127, 133, 168, -360, -148, 71, -141, 66, 152, 501, -139, 14, 8, -76, -59, 34, 152, 204, 134, 358, -110, 17, 37, 115, -162, 21, 196, 48, -126, -365, 235, 264, -28, 56, 127, -214, 137, 64, -46, -250, 357, -38, 86, 208, 77, 123, 245, 60, -360, 157, -84, -119, -58, 208, -3, 33, -88, 39, -24, -75, -309, 75, -71, 6, 194, 38, 107, 27, 166, -61, -130, 34, 81, 193, -67, -18, 20, -48, -140, 15, -189]
7010a89j71L74J00k73J13M6r0P4j41J47M3o8r0J09k1J01j22j31L54j13j39K96
7032B09r1j23R2N9R1k75J56k50K42l7O8k28J21j25K7k3J81m8l5%J50l06J70j87
7056a62K69J96k32M6l31M02j07j06L80l58k81J63L29r3k29j57L50j75j02J04l09
7077d03M36n8O2Q0j98J06Pj06R3J6J15j15j6M1R9k09J29l1k28K17J04l34J44J8
7101c1N8K37k84J51kk41L82k13J74j46j66j14L32J14j40j46K8j39k4OJ71n7k57
7124c07K46K53O3J2k42j22J50K25l73P9n9O1J35q6L26m50J93k18N9N3J34k61K58
7147A29k5j4o1K29m0m89L18k32L06%j22O8M5o0r9J70j33J3R8J53j88j76L08m13
7171b15L40l9Jp0q3K03pk26k03L64r7l20J63KL18j99O5Q4k46r6L83K3l97J61K15
$$ y = [-189, -360, 14, 114, -159, -46, 0, -90, -16, -157, -10, 33, -35, -125, -16, -37, 64, -58, -189, 165, 52, -87, 209, 118, -5, 87, 146, 237, -38, 118, -132, 110, 73, 141, -87, 34, -91, -64, -87, 94, 46, 11, 11, 161, -145, 25, -162, 107, 303, 71, 117, -214, 188, 81, -25, 355, -3, -284, -121, 208, 115, -114, -271, 79, -96, -198, -94, -403, 33, -25, 37, 117, -81, 25, 32, -74, 19, 35, 150, 35, 19, 60, 159, -50, 79, 48, -180, 37, 141, -193, -49, -31, 27, 264, -20, 131, 129, -112, 270, 57, 231, 85, -81, -195, 137, 251, 111, -35, -7, -146, -170, -164, 7, -50, -307, -61, 192, 255, 267, 25, -97, 53, 278, -95, -16, -75, -14, 121, 35, 361, -89, 104, -114, -55, -2, 132, -129, 129, 104, 90, 29, 258, 218, -271, 47, -185, 121, 121, -1, 67, 112, 52, -47, 123, -10, 3, 101, 254, 66, -110, 198, -215, 125, 86, 87, 17, -66, 137, 130, -96, -299, 65, -32, -352, -189, -187, 131, -68, -3, 81, -165, -261, 122, 145, -252, -91, 124]
7196A24J8r1M19j98l93L09k69O5J13k22R8K04j76j37J07R8l7k95J44J35q5J88
7218A19j62K78k24m2j8O8J18j63K98k58R7Q1n5p8j18O8L2K04k04P5n53O67l59
7241a29m9l0J36J70j64K33L9k10k74M65l4k30J6J1R7l9j09J42k85J47l6n1r4J91
7265h7J38J23k23J71k73l4L08j91q8J45J70k18M11l19K2k22M87l36p6k4J73K24
7287B81l03j02L23k2k16j29O8j25j6K42m8J27j53l4J08k24J40J41k46J25J6N6
7309Io6P7Q5P7j93K31j15m5j74R6K23m19L51l04P4j91K66J57l52K31o5J32k38
7332a53K02L14j34j85q6K47n1k49j26K22j2j91K1K91p0j19L9K8k45O4J20l8o2
7355a73K81Kn9j52P5J77R4r1j63j10R4J14k28K51P0j72j18%o1N1r6J25K13J4k37
$$ y = [124, 142, 51, 470, 272, -121, 188, -81, -16, 97, -125, -27, 177, 1, -136, -29, 69, 32, -263, -119, 16, -69, 119, -43, 235, 11, -31, -49, 19, 137, -26, 272, 14, 111, 192, 137, 59, -59, 9, 41, 245, 41, 116, -437, 230, -129, -178, -208, -72, 98, -66, 167, 206, -4, -278, 187, 153, -77, -61, -50, 47, 8, -101, 41, -244, -97, -133, -184, -278, -87, 51, 174, -49, 122, -151, -185, 123, -68, -156, -11, 159, -59, 352, 33, 55, -167, 320, -16, -92, -116, 57, 281, -22, -124, 199, 177, -39, -168, -100, -225, -241, 1, -47, 80, -73, -107, 1, -223, -83, 58, -188, -63, -47, 9, -57, 20, 105, 182, -11, 220, 105, 60, -114, -18, 205, -214, 137, -167, -93, -284, -18, 139, -213, 18, -47, 85, -153, 49, 363, 229, 44, -42, 205, 154, -95, -221, 1, -11, -202, -181, 110, 40, -79, -40, -12, -257, -193, -73, -111, -173, 108, 110, 51, -101, -26, 151, 245, 154, -9, -119, -25, 89, -139, 112, 182, 10, -108, -108, -169, -118, -214, -89, 124, 138, -99]
7380i9N9j64o2pK02j2n4K15m2k08L92l0m1L0k4j59R7m3j22K68l12J13j31L28k60
7405f6J48k44K6R8k39J25K22N6j43J9k9n0L8K22j58O7j59O5R6n2j65M37j72r3
7429D9j98k05M44l11L65k33L3J80k77J68O8j07p9m9J1J43k4n7K37q5j77J69J33
7452A98l10K23j00r0L26l7k66K27j04r3K29j41l5J05l92K36N8R9k0j17m3J81r
7475A25k0K9J70nl10P9K3o3P4j51r0J46n9p3K05N3m32J12J60K42j51j21k71n0
7499c78M75l25K46l45M79j30n6n8m9L6K29j08J52l46O1l7J92l00J83L11m21R4
7521i5L30k08j48J77P7J49r1l4J09j95j35p7L43k42J39q2j0o3o8O9j01J04j2j34
7545a98K57k43Q0L01k98m6K23j17J73j61j14K92k07J2l5K81j19O3q2j7l0n4j15
$$ y = [-99, -40, -204, -266, -273, -71, -83, -137, 78, 36, -172, 220, 190, 149, 179, 155, -4, 93, 50, -72, 196, -116, -3, -134, 194, -66, 82, -162, -136, -38, -277, -152, 70, 126, -17, 2, -27, -77, -39, 183, 25, 92, -67, -2, 94, 42, -123, 314, 142, 49, -149, -354, 90, -221, 144, -89, -56, 124, -153, 15, 83, -24, -103, -152, -141, 2, -22, -79, 158, 73, -104, 65, 198, -112, 111, 11, -79, 247, 210, -56, 171, 67, -26, 203, 62, 27, 132, -260, -24, 34, 133, 113, -4, -47, 134, 125, 105, 134, 304, 299, -11, 68, 91, 28, 102, -49, -139, 7, -52, -125, 80, 133, -299, -187, -27, 215, 64, -57, -328, -378, 97, -228, 18, -327, 152, 22, -34, -92, -141, -105, 124, 16, 168, -178, -117, -154, 38, -262, -79, 232, -189, -95, 235, 27, -121, 56, 133, 282, 191, 157, 266, 71, -64, -141, 202, -40, 99, 17, 7, -56, -124, -55, -156, -52, -64, -198, 59, -184, -104, 197, -101, -147, 76, -41, 132, -29, -143, 149, -58, -46, -81, 200, 81, 144, 62, 45, 15, -39, -154]
7568a54k9J98M6j71J56k17K52rj60J38N8j34j08N6M2K6K39j14O8q3l9m1q1L88
7592C27k42k10R1Q2k83J55j99K91J23N0l02L42l53K38qk01J90j4J4j2Q2o8j31
7615c8r9P4n4N2q5K1j83M78l24m7J82j09J27M6j55jJ40j40L8l44N06j07K03l07
7639a26N18l54l13L55j47K1j13R6nR5O4L5p8k29J36l5K11l26K55k64N13j66j95
7662e2J19j98K30q2J42j33k24K47j7j0L61l54J33k8k59L3J90l71J88j80K21J07
7684F3j06J71l05K26j10J35J6Kk12J95m7j03j42L31j34j69J37K13j06RK8k69K21
7707D4J16k67J88j98k15K57J56q6J01J55k11J27k1j2j40k20J40K32k35J42R7j16
7729C4k43K48q5J10j85J64j50J50l1K64k58j47p7L69k25QK42J85j31j55j52j75
$$ y = [-154, -183, 15, 61, -110, 46, -171, 81, 72, -88, 50, 108, -26, -134, -78, -36, -10, 229, 115, 183, 100, 61, 20, -61, 327, 85, -125, -34, 48, -235, -80, -279, 12, 135, 185, -117, 225, -128, 110, 102, -99, 91, 77, 91, 79, 161, 93, -38, -137, -63, -117, -65, -150, -129, -312, 166, -158, -205, -23, -132, -5, 41, -114, -115, 25, -115, -77, -421, 85, -22, 181, -126, 392, 38, -275, 80, -67, -46, -159, -63, -68, 27, 91, 126, 48, -181, -45, -80, 131, -195, 60, -204, 309, 143, -52, 67, -131, 99, 17, 159, 26, -198, 49, 32, 22, 383, 29, 162, 134, -125, -92, 98, -273, -85, -265, -44, 63, -43, 128, -177, 49, -61, 74, 90, 92, -120, 75, 28, -75, -217, 114, -20, -189, -52, 161, 55, 64, 92, -177, 44, 160, -107, 81, -117, -332, -75, 81, -5, 96, 251, 40, 167, 146, 134, -6, -226, -86, 146, -89, 53, 150, 34, -209, 39, -46, 64, -121, 43, -107, 43, 12, 276, 18, -129, -206, 163, -62, -54, 188, 373, 242, 87, -65, -240]
7751b40K70L3K3j24j42R2K29j69j68J02K06k48J80j43J69o6J03l50L5K55j89J15
7773b7m5j6J82j58N3k6J77k22o6kL20l52K02n0l6o0K01l5K0n2O5p9k96O4L88j05
7799D5Oj15K28p5j05rO4Q3j30J25l58L89l79L01k22J60j11kR0j66J54M0P6q8J65
7824A66j94J04J8pM8p3m7L8P5k87K74j09P2p2m7J58J0l5m0l86J48K6J22p1q4J13
7850h0k74M10j7r5K32k80K65m3k70Q1R1o8K22k23K27j93M6p7Q1k11J65q8j15K23
7874IQj37k5k7J5K40O4J02j16j18j04o4M41k22J50o5j52l21K42K12j05o7J36L0
7898A26k70J63K01k27J80j74j9J46j14j77P6K94j73Q9j01K54l00k05K77j6j02
7919g2L48l65k6J19l9r4J67j32M7M06l46N8m7o6P0j10j44J53K44l27k1K53r7N1
$$ y = [-240, 30, 63, 86, -38, -180, -88, 141, -28, -196, -94, 112, -136, 44, -99, 70, 4, 107, -243, -208, 47, -142, -27, -72, -88, 94, -64, -11, -37, 140, -82, -148, -150, 170, -182, 20, -30, -66, -126, 75, 40, 60, 8, 73, -6, -302, -238, 150, 45, 51, -64, 164, 89, -16, -25, 39, 122, -8, 117, -241, 148, -231, 70, -152, 8, -103, -105, -15, -181, -27, 13, 89, 1, 166, -28, 76, 94, 87, 135, 62, 15, 53, 128, -159, 115, 6, 78, 6, -41, 117, 127, 92, 52, -334, -186, -160, -38, -109, -193, -80, -354, 56, 39, -56, 176, -104, 161, 118, -152, -71, 20, -48, 174, -49, 178, -15, 31, -46, 35, -176, -11, -99, -214, 9, 17, -120, -145, -172, -157, 83, 147, 249, 133, 15, -89, -153, 288, 66, 216, 151, -1, -322, -80, 132, 27, -40, 96, 126, -144, 19, 220, -7, 173, -1, -20, 126, 12, -165, -89, 205, 32, 121, 20, 274, -26, -231, 46, 30, -72, 276, -89, -115, 4, -35, -129, 38, -94, -47, 359, 13, 71, 24, -42, 28, -82, -226, -73, 171, -156, -177, 76, -21, 30]
7943C0J29K69l41k68L90j17j53k2%R1l0J48j12J04n5j30K56j75j30J76j10j36
7965a86Q8L25j06k69L45j88N2j88J8m8J30K49j87k11o8k1L37j17J6Kk55L94k15
7988a03L88n55J20K6J67n1k0Q8J2O5k38K54j04j60Q2KJ11p9j80J07k68K84J17
8011F5k02K05K33n29K67j48Q3m9o2k71M60p3MR6k93K05j65J08m12P53l05k06L62
8034A26j19r4J40l9J11k51O9j68M58k06L0L71k89j96k08K04J70K18l08l17M96
8055A98l01J89k03K13j55m9J75o2j29J23O2j10Q9O1j94J69j73l4L74j86j21O0
8077dk39K30j21J65p4J64k61J33M7nk68L01r1L00l98J02J27kk89M54o6j10j93
8100i8R3N4N0jm5k30J52J07LJ5j99P6k78K37l7L42l59j02K63p2j08j8L03J30k78
$$ y = [30, 159, 428, 87, -181, 209, 92, -61, -83, -83, 8, -22, 126, 14, 118, 63, -67, 189, 14, -116, 60, -50, -186, -98, 227, 121, -148, 197, 9, 61, -127, -109, -157, -27, 222, 35, -176, -244, -265, 72, -45, -29, -27, -282, 112, -103, 285, -270, -150, -124, 43, -8, -28, 60, 72, 137, -101, 153, 49, -111, -29, -27, 84, 5, -175, -68, -336, -52, 65, -137, 68, 301, -228, 39, -109, -26, -75, -137, -408, 52, -21, -17, 79, -214, -9, -174, -66, -478, 275, -30, -236, 126, 7, -87, 53, 14, 125, -126, -57, -225, 233, 27, 57, 428, 139, -57, -265, -61, 109, 327, 19, -298, 198, -103, 86, -117, 96, -59, -108, 67, 5, -124, -1, 61, -49, 40, 101, -93, 76, -97, -131, 243, 57, -64, -4, -243, -13, -134, 31, -43, 121, -140, -7, 40, 35, -233, 68, -23, 277, -121, -19, 108, 106, -183, 271, 205, 95, -98, -5, 49, 99, 98, 53, -177, -25, 82, 85, 100, -99, -23, -301, -64, -101, 241, -118, -220, 43, -29, -137, -155, 148, 278, 0]
8125@J12j22J27n4m6Q1n6J0R8k02o8J76N1K2N4m05J21L31k85J20J44j21m7k05
8149a64K56j17l13L98J22j05J38k17O3N3l07R9J83Q4l79K16N2P9q3r0L6R2J36
8172B32j83j12K17j29j17K4N9m9K8Q1J79j98P7j27M1j13j88M50j8
$$ y = [0, 112, -10, 117, 63, 17, 98, 42, 52, 150, -52, -120, 56, 107, 129, 183, -222, -101, 230, -55, 65, 209, 88, 41, -164, 92, -25, -338, 60, 182, 77, 215, -2, 61, 114, -193, -94, 89, 173, -206, 10, 62, 141, 58, -32, 4, 96, 232, 49, -63, 154, 25, -92, -68, -9, -58, -30, 51, 230, 32, 109, -18, 23, -90, -278, 172, 154]
8191A54
$$ Imaginary data points
##PAGE= N=2
##DATA TABLE= (X++(I..I)), XYDATA
0@%%%%%%%%%%%%%%Qj6J6j6J6k4L2l2L9m7N3o1P2q5R5j08J24j40J58j78K01k27
36a20K55k86L18l54L93m34M81n34N89o48P16p91Q70r57J054j161J279j412J563
55H21j733J929k155K420k739L126l606M225n050O207p943J0814j6350L0559j28035
70a07510k37436M87006J74633m51198o6438M40866j4406l77454O9354L08021j27497
81I7941k47908J31732J68799j58004j21451J39284O3636j36634l6693J04203J4546
92A9451q2736j3107O3390L2755m4166m1639N7157Q0327m9710q3516Q0268J12650
104A31124r0654j11977J18607J08071j49314j05940J55415O6730j85871n0247
114a14056J69551k045j67573L0136J36983n9780j01741Q2002P4753q0046l1352
$$ y = [0, 0, 0, 0, 0, 0, 0, 0, 0, 0, 0, 0, 0, 0, 0, 8, -8, 8, -8, 8, -16, 16, -16, 23, -24, 29, -32, 40, -45, 50, -58, 66, -74, 84, -94, 107, -120, 135, -151, 167, -187, 206, -228, 253, -281, 308, -340, 376, -415, 455, -502, 552, -609, 670, -742, 821, -912, 1017, -1138, 1282, -1457, 1669, -1937, 2288, -2762, 3445, -4498, 6316, -10034, 20525, -107510, -344946, 142060, 316693, -134505, -200943, 239923, 225517, -151937, -82583, 225438, 97941, -149967, -18235, 150564, -7440, -128891, 10393, 74029, -62605, -99298, 4905, 19451, -63285, -76392, -13002, 19753, -24413, -66052, -8895, 71432, 21722, -61794, 18474, 131124, 40470, -71507, 47100, 155171, 5857, -100083, 55332, 122062, -63809, -114056, 55495, 53450, -114123, -83987, 52996, -6784, -108525, -26523, 48230, -31816, -63168]
125f3168R3127J6871p6604J4964P8452k0297o3521L3553N6270l6470m7768K9798
137A5207L0891l2884l4205J1669J6099j5585k3240o78J3048K852j1662p084J3269
150b2303J8401l239r291J2150K0264J519o921N877Q762L280j378p890m476P935
164B2690m18j8612r770P391K09j4506j3783J269J2517o88k0405j791L2363P679
178D145l2350L515M5793J608l8374J3792M4817j4760l4522K5160K6721l1868j7655
191c978K9973k264l7359O105K7041k6733l2795K7933K1525m0754j9335M2285J5090
204F734l9005m619M4895Q967k9526L188L1089O094j4079m182Q845J2803k255k4424
218D525n018K6933m631m2575K130L8554k0823m5153K7360L4762m2505k5271N2350
$$ y = [-63168, 29959, 46830, -29774, -14810, 63642, 43345, -20176, 13377, 69647, 33177, -14591, 15207, 46098, 13214, -20991, -9322, 6777, -8808, -32048, -32726, -19678, -16826, -28488, -35572, -22303, -3902, -7141, -16432, -4282, 15982, 17501, 10580, 16457, 25219, 28499, 27121, 19231, 14755, 22690, 22272, 3660, -6110, 1281, 1490, -13016, -26799, -25530, -13013, -13701, -34106, -35897, -3534, 4145, -28205, -24690, 21103, 22711, -15663, -1871, 42946, 28186, -6336, 18824, 45545, 13677, -3978, 25995, 23731, -13628, -7523, 19518, -7215, -40010, -12077, 9448, -31306, -50641, -8356, 6734, -32271, -36890, 8005, 16972, -12554, -9366, 21723, 27817, 13738, 9556, 18401, 31204, 28949, 4525, -493, 26440, 21809, -20766, -18636, 19918, -905, -46058, -18698, 16064, -26441, -51712, 638]
231F38J1567n5202J0781O4215k1725n2869M7701N3738n3338l5935O7552K6956
243F4079p0466j3025O8311n099o9302R490N1730k8152m8968K6072K8034l4650
255b1946j7798L0757L892k3789R106K0772r623n664J8998O149r370P016J0633
268A9133m326N01N314o503k004J0287r539j9071J1059J2755k6206j8921K5410
281b111P803l4421o092L3276p12l0276R670L1450r953j9482K2219J9371j7821
294B921n137K5526J674k2238P794K0812j7049k0248J7593J0459k6480j2173K0084
307C538P94k4580j945J7833m196j4800N249J2230j941l482O070O907Q83J901M569
322I030J376O01L458J452l768k116L334j039r235l933M657l188j1012p81M756
$$ y = [638, 12205, -42997, -32216, 31999, 10274, -42595, 5106, 58844, 5506, -30429, 37123, 64079, -6387, -19412, 48899, 43800, -25502, -16012, 35718, 7566, -41402, -15330, 12704, -21946, -39744, -8987, -5095, -28884, -19778, 994, -8629, -14293, 4705, 10854, 1484, 8500, 19133, 14807, 15308, 20622, 14119, 12115, 22402, 12863, -6208, 4851, 17606, -8600, -27521, -2111, 5692, -28729, -34821, -1545, -2257, -32533, -22863, 8587, -1366, -20848, 1371, 20742, 2921, -2216, 23310, 24984, 2746, 10540, 31352, 14303, -5945, 11648, 22107, -4373, -16546, 3538, 4332, -20248, -22193, -4360, -8556, -23356, -18107, -5877, -7818, -11300, -5230, 1677, 2560, 4461, 9030, 10406, 11007, 14465, 15917, 12149, 10033, 13367, 12328, 3093, -840, 3817, 629, -10383, -11164, -6408]
337f408m511n765L459L249k786J904O024r73P15Q864L664m470K995R959j691p443
353F786L926P083p026q298L998K367r448n687M023k301q198J614L694o321k027
368a5815R111L83p555P250J1603n618m950J3770P149j0690M48J3070k877j1309
382C970N728N843j1001n890P600l251j2522K199N682q895o246P932K681q629J860
397a2939R653j147l939P984N765l924K073R096k065n694Q067M229j0595l483J1143
412A4224l922j5983L536J0462j2069j3231J0852O474j5896m106J5372M80j2894
425a6701O479J3857n675o059J2607P200r074L33J2104p00r576L388O955n866p768
440A504L074J910p447m381K003j690m601M4M40j790Q17K651j030n9O383K534l229
$$ y = [-6408, -10919, -16684, -13225, -9976, -12762, -10858, -4834, -5807, -5092, 3772, 7436, 2966, 5961, 15920, 14229, 6786, 10712, 17795, 10769, 2471, 6469, 8836, -612, -6299, -2276, -4577, -12775, -11161, -7467, -13788, -15815, -6704, -6321, -13876, -6626, 4977, -641, -5591, 8179, 15328, 4638, 5086, 18156, 15279, 3970, 9698, 15541, 4540, -1350, 6250, 2999, -9523, -7324, -1642, -10537, -16783, -8851, -6170, -14799, -12939, -3286, -4433, -8372, -388, 5377, 1453, 3526, 12622, 10557, 4863, 12930, 17159, 6564, 3081, 14224, 10302, -5681, -2145, 8317, -3752, -16983, -6131, 343, -15553, -19659, -4287, -3807, -16701, -10222, 3635, -2040, -8099, 4508, 11708, 2634, 2967, 15071, 14371, 4795, 8183, 15138, 9272, 1504, 4578, 6488, -959, -5340, -3337, -5027, -9628, -9584, -9144, -10934, -10117, -7466, -8496, -8555, -2172, 362, -2867]
457b867L620Q144j520l551N756M357n665k330N436j575p612O45K366o398m807
472f001K786o76o688K20M041k316l565M597M164k722o0O951K619l257K526O732
488I351o42m238L986L741m794l558M379k40q189j528M127l640o963J421L449m905
504h243l755M740K809l605L93N473J868j745K206M459J087j443K031K930j079
519H126k219R05J54k805k360j1j288l124j249m59j429j186L19m97OJ657J86O2
537e212K880K784k47L48M066J604j608R21K825o77k506O93n7k564k539n2j363
554g04k700j310J66j528r44Q71N61j185R34L283L17n91K998L771j089q55M039
571F034J972l229l61L961j771m316P69J902l748m134J685O9m323j680K509n50
$$ y = [-2867, 753, 8897, 7377, 3826, 9582, 13939, 8274, 5944, 11380, 9805, 2193, 2838, 5204, -1194, -6001, -3215, -3891, -10579, -10359, -6318, -8634, -12199, -7602, -3438, -6160, -6220, 731, 3350, 93, 2619, 9351, 8709, 4471, 8457, 12198, 7404, 3846, 8225, 7985, -204, -1732, 2395, -1245, -8208, -6787, -3338, -8243, -11998, -7258, -4449, -8054, -7661, -2188, -320, -2065, 141, 4600, 5687, 4244, 6275, 9205, 8126, 5907, 6812, 6966, 4161, 1801, 1790, 502, -2622, -3871, -4330, -5759, -6945, -6626, -7123, -7117, -5460, -5274, -5212, -2332, 452, 205, 553, 4619, 6223, 4615, 5536, 8361, 7684, 5178, 5871, 5814, 3250, 711, 659, -704, -3404, -4714, -4548, -6076, -7020, -6149, -5588, -6773, -5839, -2556, -2239, -2830, 168, 3939, 2850, 1995, 6034, 8006, 4777, 4416, 8377, 6606, 2290, 3059, 4961, 1213, -2921, -1236, -1167, -5490, -7170, -4661, -5211]
587e211k812Q39L328k6q41K079L661L43j03K081K169K32n73R28Q23j468j475J09
605D083q51j505j849j315o20q79k068j060R55J08j907M06K392J048j044J855L073
622H22M47RK251K079k79l47J302J94j384n19l41j453j732j153j168j324j163q67
640d626n42n76K55J95J62K07J859J329j1J434K512P81n46K148J275o49o61J305
658E851l41j652j203L50j330k519j112n4p84k167k94P71j63j156P20K064L68j08
676b759J648K575J88j92K057J497n17l59Q70J15j152j384K50n49j778j795j74
693a459m33j281j706M62P05j092j78J473J048O5Q65J737J342L30K65J189J056
710D388P0p50M86K70j146j173q5m03j762j489m73M6j664k52j17P8KN85N20Q47
$$ y = [-5211, -8023, -7184, -3856, -3882, -4723, -2644, 1017, 1360, 1257, 3338, 5507, 5739, 5166, 6094, 6917, 5449, 3974, 4083, 3232, 1727, -122, -1437, -2057, -2936, -5004, -6064, -5109, -5001, -6908, -6502, -4110, -3062, -4106, -2251, 822, 1269, 1278, 3529, 5608, 5329, 4982, 6284, 6478, 5094, 4575, 4234, 2781, 1049, -104, -1272, -2596, -3759, -4626, -5168, -5744, -5489, -5294, -5132, -4925, -3066, -1737, -1748, -314, 2198, 2979, 2433, 4581, 5856, 5207, 4546, 5851, 5510, 3858, 2655, 3005, 1675, -844, -1956, -2010, -2794, -4961, -5255, -4484, -4647, -5803, -5083, -3019, -2651, -2759, -1111, 1464, 1652, 1460, 3517, 5014, 4497, 4138, 5008, 5123, 3971, 2587, 2837, 2288, 510, -1285, -1459, -1892, -3173, -4879, -4417, -3712, -4804, -4982, -3509, -2461, -2396, -1531, 206, 1548, 1878, 2143, 3332, 4388, 4458, 3708, 4194, 4464, 3318, 2145, 2060, 1657, -105, -1594, -2067, -2021, -3685, -3937, -4054, -3976, -3974, -3389, -2869, -2022]
730b022K90J356Q60Q73O23N86J012J93r9j39J45l09n09j231m72p43r02j353m72
749b313K7q66j296Q54O87q85M0J822Q98m34J072K040J94j04R09J083J77n22K05
768C588K48j212r63l05n06j159j056n60o14q00k46M51m82L11O02N87N2R16J279
787A31K10M21J538O79n31K40J222m65p23J56nj161q68n52n21r97j084k99l84m99
807c492k69J73L72O75K51P54P80J172L30N39J049P16l52l08J309J88j588j04Q82
826C077j189k053q5O29j726j677J121J27j924k45J435O0j109Q16K320M6o56J310
844B77J835K7l87J339O58m17q66N58J32j448p09m10l58q68j007m76j52N9q26l00
864c339P89L98l33M00J513N58m48P49J736L5o22R93J071n92j146P42M6j502n46
$$ y = [-2022, -1732, -376, 484, 1357, 1980, 2566, 3578, 3771, 3672, 3533, 3678, 3369, 2860, 1629, 1157, 414, -488, -1841, -2313, -2286, -3152, -4448, -3594, -2907, -3792, -3752, -1930, -1032, -1466, -394, 1646, 1840, 1736, 2645, 3728, 3905, 3383, 3588, 3836, 2624, 1661, 1356, 850, -309, -1365, -1925, -2539, -3339, -3585, -3134, -3616, -3305, -2703, -2116, -2064, -1148, 131, 341, 762, 2300, 2979, 2448, 2688, 3910, 3445, 2722, 2878, 2873, 1712, 844, 292, -229, -1226, -2310, -2609, -2993, -3492, -3761, -3588, -3216, -2541, -2290, -1536, -756, 416, 746, 1285, 2334, 3050, 2698, 2390, 3699, 3887, 2299, 2195, 3077, 1888, -165, -250, 379, -1347, -3024, -1903, -1776, -3700, -3945, -2510, -2450, -3559, -2743, -423, -377, -1033, 277, 2112, 2139, 1752, 3091, 3749, 3332, 2466, 3024, 3156, 1708, 999, 589, 231, -637, -1644, -2120, -2272, -2213, -3039, -3339, -2550, -2152, -2485, -2085, -572, -14, -462, 287, 2023, 2058, 1436, 2429, 3500, 2908, 1762, 2504, 2550, 1048, 502]
883E02K24q31j168j46L09q89n75J62L36m05J68R04N40j18Q07Q43K01k3J195M48
903B484o32N03L30q51l83L49m37j015p51L33p27j248K03N01p85o98P67L81P5r
923a610P87P47k11M47J025M82J28J21J78J98m05L2m26m93j01o16n89j71k55q68
943a600o69K36K98q77K47J203o8n41J110J244k78k07J516N62o66q4J324o62p52
962A336L00J76p64j199K44O6r91o60N25o40m02r8N75k91j90P80M75k10Q19J081
982I32k74jJ026M16n79J76O63n76p77M64O8j339n44Q2k06j328J3M76l24q06O57
1003a781M89k17J76O52M56L53L55N04r4O70M62j74j94J98J40o92o26M14m67j246
1023f22K8J23q09p93P90k62m78J57Q36j62l66M07J362l6m15R90N80j88L0N35N2
$$ y = [502, 726, -105, -1273, -1419, -1110, -1999, -2574, -2412, -2076, -2481, -2313, -1409, -869, -987, -180, 663, 864, 841, 2036, 2484, 1852, 2355, 2685, 1834, 1451, 1800, 1363, 348, -403, -70, -797, -2045, -1842, -1341, -2126, -2824, -2057, -1676, -1601, -1610, -823, -76, -287, 160, 1185, 1667, 1795, 1916, 2094, 2292, 1887, 1919, 1493, 1000, 899, 283, -306, -477, -732, -1600, -2269, -2033, -1735, -2612, -2365, -1162, -1230, -1771, -661, 583, 305, 98, 1614, 2176, 1510, 1426, 2750, 2088, 1336, 1636, 1812, 1048, -151, 93, 159, -832, -1492, -967, -1607, -2009, -2107, -1532, -1823, -2013, -1233, -758, -968, -149, 932, 658, 657, 1683, 2099, 1520, 1696, 2359, 1783, 1006, 1470, 1538, 199, -345, -263, -469, -1797, -1784, -1308, -1632, -2438, -1781, -1292, -1509, -1333, -681, -225, 128, 483, 987, 893, 1563, 2025, 1851, 1657, 1855, 1995, 1303, 677, 1091, 624, -622, -594, -471, -1280, -2073, -1283, -1545, -2023, -1866, -1030, -1192, -1558, -1151, 211, 175, -240, 750, 1330, 1142, 1172, 1707, 1759]
1044A759o47L11J11l86p33l20P4r14j98p2K0n26k14K54j46J66L75L57N0J38R85
1065D44J43j78N15R15n25o1M27J75q54L4K82q80m18j66O3o26l27k66k27jJ49J10
1087a272J80j95N70K93R1N94N84j51K42M41l50j15K13M82o51n49J82K35j033m84
1107f93M08o3j008q6Q71n60m20K02J116m51k81P11N38R9k42R90M8k89J6K76j2
1128A170k83j25K03n30l50j61l20l80K87m69l42J65J37m53L07P10k31k8N99M52
1148C58PM3O28J82l51J59M76j64m15n71K98l3q92J9K50p03n51K67J20j21j25L81
1170g38l45J94M53K9J34N09K64J15K46N69j92o05L80L00n12n27L01L2p54n26J33
1191e40J31n56j61K20l03J32J31L62j38J48N30L21M9j5J13M34Q2K37O6j84j75
$$ y = [1759, 1112, 1423, 1534, 1148, 415, 95, 169, -745, -943, -1015, -995, -1521, -1735, -1481, -1627, -1461, -1086, -729, -679, -541, 444, 587, 409, 924, 1839, 1314, 1253, 1680, 1855, 1001, 1035, 1317, 437, 19, -147, -84, -710, -1037, -1303, -1530, -1531, -1382, -1272, -1092, -1287, -717, -424, -333, 261, 845, 694, 936, 1377, 1027, 912, 1125, 1607, 956, 407, 589, 824, -209, -693, -285, -348, -1356, -1442, -571, -1131, -1551, -1349, -233, -684, -965, -254, 284, 383, 141, 1131, 1179, 890, 906, 1182, 1170, 887, 762, 965, 435, 85, -76, -396, -776, -489, -958, -1300, -1135, -998, -1451, -1144, -434, -665, -693, -94, 358, 365, 408, 1036, 1218, 867, 1026, 1502, 1338, 923, 352, 650, 617, -275, -256, -6, -709, -1260, -993, -873, -994, -1119, -738, -1083, -889, -436, -407, -273, 236, 500, 615, 861, 1430, 1238, 633, 1013, 1313, 801, 274, 575, 607, -147, -673, -540, -409, -965, -1126, -906, -1209, -1077, -946, -584, -722, -574, -44, 277, 326, 311, 424, 858, 940, 1177, 1243, 1059, 884]
1212H84p2k17k12q6l20m79M50m95n18j17L31J6l64K39M97r8j57O07M86k34o3N06
1234E84L27K7k84M26k24k49J19k47r2j40l51j79m8l26p0j82Lj66M06n0JM33k32
1257e14K51J87M68J89j85j48O86j70l11L35j40j38j04K57l85m87O5l09M8l43K60
1278d88j84j07k02K58JO2K31L03M19j72L98J36m5J44K00l58N4L39l12k94N5k22
1300B16l46j67k2k29k11J07P2j20k8J32K87l73L74L87J69k82M31J20o0J12P9l5
1322F13j03k98L30j23m95J97j66m02r3m3k42P4l3K68J19k63J91O40j31J27N2J54
1344C73m17O73p7j72J29O9M4J31l36N1m53m8k30n0J11k56j80r5J38r9j2J26J87
1367c93M51j64J07L93j06J88k2L32j79np1J52n15n5K04k14k58m34M91k73l00P6
$$ y = [884, 812, 595, 383, 297, -23, -502, -52, -547, -1065, -1182, -851, -835, -1199, -960, -463, -561, -718, -111, 375, 141, 78, 584, 911, 938, 654, 1080, 856, 607, 726, 479, 387, 247, -104, -283, -331, -657, -727, -909, -906, -1072, -666, -716, -715, -282, -514, -263, -76, 392, 581, 396, 248, 934, 764, 453, 788, 648, 510, 406, 663, 278, -209, -144, -453, -405, -748, -488, -672, -779, -981, -723, -722, -660, -429, -126, 293, 121, 519, 655, 610, 754, 954, 596, 650, 989, 677, 383, 438, 216, -130, -297, -319, -548, -759, -652, -580, -700, -728, -596, -309, -682, -308, 79, 248, -34, 397, 517, 457, 569, 648, 613, 510, 212, 542, 419, -76, 121, -45, -447, -540, -583, -825, -751, -784, -516, -397, -660, -469, 171, 40, 167, 219, 373, -44, 629, 552, 380, 509, 578, 622, 753, 417, 468, 15, -33, -263, -313, -202, -458, -638, -733, -595, -694, -706, -580, -393, 58, -106, 1, 394, 288, 476, 454, 786, 607, 602, 531, 683, 168, 113, 317, 103, -155, -589, -98, -371, -671, -595]
1389e95O2j84P6K47p4r8L39J25K96o9O20k65k0K95j74j00K93l23j92oK0p0k53
1412e0k83P0jj32j4k81j26Q2K62J29M1K80l72N10M81n50K07N14pJ18k36j80l4
1435D28j1n3j03l08j6l15L0O3j87j28l76O17r6j18J93K39k02K92J04J12K02N4
1457D21K01k06j3QK65l33p9m5k04o0k29j43L00l26l50L55J69j25k70J0M58p0O
1480b60M53k9j94L43J4J76m4L9o0j63P0k41k2No7Rl05rk4j39l33L14j1j07K95
1505b90K58L7j85L48k4J23m3L01M6j06k2K70k79k23K6l8k88J15m56O2j92NL35
1528b20k65K01j58J0J84Q5p9J60K89kL20O2l75K10l7J0J04K3m80J53J03k85r9
1551h6j78k63J76o0j34K56R6k86J76j16K99o3M7K08J84l7J42j17L63j37j95j90
$$ y = [-595, -533, -717, -641, -394, -468, -566, -227, -102, 194, 125, 745, 480, 460, 755, 581, 481, 774, 451, 259, 253, 273, 203, -50, -333, -263, -264, -396, -410, -691, -817, -735, -473, -344, -303, -23, -395, 115, 596, 46, 253, 767, 760, 878, 642, 462, 428, 417, 364, 261, -47, -63, -378, -348, -285, -472, -600, -976, -359, -455, -573, -380, -141, -343, -51, 53, 165, 367, 421, 622, 416, 403, 411, 676, 343, 264, 219, 15, -45, -274, -417, -117, -443, -793, -438, -269, -394, -664, -654, -196, -266, -260, 193, 164, -30, 313, 327, 503, 459, 498, 438, 275, 345, 104, 82, 87, 20, 29, -276, -285, -309, -448, -781, -467, -478, -585, -290, -32, 5, -180, 168, 144, 267, 224, 525, 571, 465, 443, 713, 434, 211, 237, 199, -89, 26, -430, -368, -560, -555, -220, -485, -284, -442, -432, -248, -163, -242, -82, 207, 205, 525, 587, 212, 422, 385, 395, 499, 522, 42, 195, 298, 13, -86, -264, -527, -351, -411, -545, -289, -193, -479, -303, -419, -120, -183, -136, 72, 256, 219, 361, 244, 607, 470, 275, 85]
1573H5J48n8j2J41k58l95J42k30K55k93J32%k03K10J53K96k99P8L4M89j89L10
1595E36k61Q0j35L02k90n0J66n18K89q8o1K6j90j68l8l4K19Mj77J10L3R6l31L22
1619a58j6L46L8k4J54q1J17j7j41K60l06k05L86n18j06J64j91O2j29L7J14j85
1641c99J40L42j64j04K16j63J49K08pN9r7J77k03j6K17J02k54j11j66m7O0j19
1663a80J38q6L0J27k29l20N24M8N7m46K75J33j27J73p1J99lk10K11R9m61M81m48
1686h6n9m3K69l0j96J3p7m7K16j18L8j58J76J45J8j11K7J36n5J81j8j01Q7Kk24
1711a5M47j02j66p5J51j3l42K83j95l87J63J45Lj01o8J02o1L36J76k11K72m8k07
1734H7L6m5L8J5L68k49j73j17Q2O1j95k0P2q6M2j06l5%J33J32k84L97Q9l78M77
$$ y = [85, 233, 175, 163, 304, 46, -349, -207, -437, -182, -475, -343, -343, -546, -336, -183, 113, -186, -108, -74, 415, 226, 536, 275, 355, 220, 522, 232, 182, 348, -170, 119, 31, -30, -4, -194, -362, -400, -434, -215, -211, -388, -278, -245, -149, -480, -158, -174, 172, 210, 186, 340, 259, 376, 359, 218, 478, 172, -33, 353, -165, -271, -107, -298, -236, -365, -328, -214, -399, -259, 83, -81, -185, 31, -132, 17, 225, 218, 277, 180, 357, 154, 138, 355, 457, 203, 92, -74, -121, -61, -180, -42, -128, -98, 29, -200, -520, 4, 52, 109, -337, -62, 71, -56, 117, 46, 245, 242, 32, 243, 342, -119, 362, -86, -145, -188, 81, 51, -145, -132, -209, -256, -40, -158, -120, -278, -102, 43, 61, -50, -23, 113, 58, 239, 221, 120, 207, 209, -15, 432, 330, 164, 89, 240, 227, -115, 168, -27, -414, -251, -106, -103, -204, -272, -170, -231, 105, 281, 70, 342, 294, 87, 123, 78, 116, 131, 499, 250, 77, -40, 42, 103, -92, -112, -40, -126, -84, -190, -225, -225, -92, 40, -244, 153, 242, -136, 341]
1759C41K8j15k59pJ84Ol7lQ0j82j52j29p3K4J65J22Pk98M0J23j04k8J59QK49j47
1785Bj18J44J44kj72K75o7L9P3O3j24k94m1J09rq9J53j72n3J02j31k03K89p1L6
1810a17N2J90L3K3n6p2p5J08M6kj00L3K8P6j19j5l6j48K74m78K39k57L15k05K60
1835cj48K7l3j25L50l14L67k56J22J53j65j41M53n36J90kK58m21L5J66p6Q6m7
1858f0p1L24l21j04k7J60J79j92r7J22J77j0K37l26J64J12l47M9J34K4m5j38q8
1881a44J5k36L06J72k11Q6J14k15J85k01J40jk16J80k8M1j95J12M67l81K54m0
1903B04k55J18l4l1j81L37o5nK59m74k0P1J09j76J58j9l78L48j95K00J3P8N4L8
1927A54o9J14K2K4l51J5l2O1J64l7p8J50j80j03R6O1j66k9j07K50J7J40k14K33
$$ y = [341, 369, 254, -5, -12, 172, 178, 141, 138, 218, 36, -116, -245, -318, -294, -129, -7, 0, -298, -258, -135, -239, -267, -108, -100, 149, 2, -116, 28, 172, 170, -2, 273, 206, 245, 318, 381, 257, -37, -78, 31, 22, -67, 86, -86, -139, -37, -168, -371, -82, -153, -117, -65, 125, 158, 181, 125, 53, -22, 86, 132, 130, 30, 63, 91, 167, 48, 33, -3, -151, 123, -355, -116, -373, -58, -263, -3, -151, -124, -157, -282, 68, -246, 121, -135, -13, 140, -25, -166, 287, -249, -59, -61, 197, -224, -189, -23, -99, -13, -60, -131, 193, -128, -232, -259, -99, 80, -112, -209, -87, 90, 80, 317, -9, 155, 267, -80, -31, 103, 127, 82, -56, -144, -129, -365, -59, 113, -98, -12, 102, -113, 72, -129, 11, 10, -206, -26, -54, -13, -208, -96, 371, -10, 244, 204, -51, 67, 33, 2, -179, 158, 93, 88, 347, -127, -147, -76, 33, -143, 15, -4, -382, -34, -229, -29, -16, 62, 116, 154, 85, 199, 221, 245, -106, -91, -123, -62, 102, 65, -13, 137, -43, -146, -50, 11, -155, -184, -291, -41, -24, 116, -98, 135]
1951A35l97K92r3R6O3j48J69j76j14J45J20Kl07L34l81Q0K76M9j81K22j03L2j26
1974a1J6N1j34m9r5J53j2K16k11L1J06J79k19l1K01j72j13J19j69J97J02j84j1
1997d0K39J3k49J78j82J91J39m06K54j86N7j30N6L7l0K95k78M7O5k89n1K20J26
2020G6kk39L84l73K59j26k8K05r7p9J78K8m60K00p8K11o9m6J70k62J46L07j20
2043A85k3k44Q4q7J63K0j23J58n5Kk80K24l6Q0J06j50j44j33L88j80k13J79J70
2066I1q4L1k31J69K70j27q0Q8j26J77j87r6K94l46nK76r9Lk0p8m2J80o7o7N2j96
2092b20R3R9J19R2Q6l97L45k02l02J73O6M9K82l16L00m89J39J16O1j03M0k31R0
2115a10oJ02J41Kn3l02J45k3J23J91j17O8k09kL49j52r4r0J67j05j60J14L8J02
$$ y = [135, -262, 30, -63, 33, 96, -52, 117, -59, -173, -28, 92, 94, -213, 121, -260, -180, 96, 145, -36, 186, 83, 115, -11, 5, 56, -78, -127, -222, -69, -81, 135, -76, -45, 61, 240, 21, -10, 191, 19, -94, 25, -144, 53, 155, -29, -40, 199, 212, -37, 141, -41, 150, 289, -117, 137, -49, 8, -122, -66, -29, -59, 236, -42, 5, 70, -219, -270, -50, 76, 74, -165, 219, -154, 105, -21, -49, 156, 59, -20, 158, 186, -274, -74, -152, 59, -10, -56, 114, -148, -2, 305, 185, 162, -82, 2, -85, 78, 98, -25, 133, 78, 80, -200, 24, -12, 68, 174, 24, -120, -253, 135, -45, -258, -79, 91, 7, 38, -193, -24, 246, 119, 39, 127, 1, 178, -9, -105, 189, -157, -162, 114, 15, 18, -2, -80, -122, 58, -9, -76, -24, -220, -127, -28, 91, 183, 269, -128, 217, 15, -287, -114, -48, 1, 283, -33, 267, -222, -83, 33, 94, -9, 31, -200, -110, -116, -14, 127, 129, 76, -226, -81, -104, 19, 210, 93, 161, -48, -50, 299, 147, 53, -37, 130, 25, -135, -21, 17, 119]
2139A19k05N9J54l95N34k72j30N1J87k22J98j84l2R7J09r5J27r1j09M78m13L33
2161B98n0j61J09k86J74JO2m31K42K75l38K3J57l4pn6%k57J11N46k61j44K05l07
2185a29J32r0L27k59K93k18o5q2Q7LP7nk39J64k23J19N3R8j0P4l19Q1N6j36J25
2210h6M6P1j1M0J04k07O5R9Q1J9k19l1J34j36j12J27O0j32KJ12n3j80J29J16j55
2235a17N6J92k74k43M00jo8r7L94k14p6l1M6k45J21K45l41J56P1O8l06J59M7n
2259f3L2N7m49M70N8j1k5k61O17j07m3q5p3k59K41p4j06J6K64l51J3k3l4k25J7
2284d04M58j44P6n86M95J68j03O8l2K47k22J55k16N4K43k39Q5J43j02j52k98O80
2306C74n15M7J51j42j45J05K02j64J02k01L45n96L97l5M9p7K58j2n0R1k20L14
$$ y = [119, -86, -27, 127, -268, 266, -6, -136, -85, 102, -120, 78, -106, -138, -41, 68, -27, 100, 9, -100, 378, -35, 298, 248, 87, 196, -90, 84, 85, 147, -284, -42, 233, -105, -82, 75, 41, 34, -22, -22, -279, -168, 378, 117, -27, 178, -129, 3, -87, 240, -19, 274, 56, -9, -91, -4, -1, 76, 71, -168, -4, -227, -108, -55, 43, 33, 107, -212, -131, -75, -211, -86, -40, 31, 20, 60, 164, -43, 22, 121, 202, 221, 2, -29, 105, -31, -143, -16, 44, -88, -86, 26, -27, -207, -78, 38, -117, -61, 131, -143, -386, 14, 13, -55, -152, 242, 28, -48, -79, -33, -278, -157, 88, -253, -97, -26, 42, -264, -105, -58, -63, -31, 26, -423, 47, 105, 94, 69, -192, 425, 318, 275, 190, 117, -142, 99, 25, -81, -65, 199, -152, -139, -162, -196, -421, -404, 54, -90, -14, -600, -105, 63, -40, 28, -4, 243, 21, 176, -40, 14, 257, 18, 103, 246, 144, -8, -306, 374, -141, -94, 57, -85, -230, -125, 77, -87, 15, -186, 159, -437, -40, -75, -26, -103, 155, 143, 93, 184, -36, 278]
2328B78l04K42j75j89J34p1J3lJ01p3L5l10K56j75J56k46M53P3k41k8J51J84p6
2351A85J72l29J90L9p4NP2k54J50R3p4k03Jq8K13k10l0l6J1J51K0j86j28O6J90
2376e4L07k72k3Q3k5K24J14k31k5MK07k12k03O1J03p1M1k36r3L36k08R5n3J73
2400D2k2L6k29J26k24K16K55l9j17J19k03J71r2O5M3k27K8K37p3j02L5k11J00
2423f6p1J36j54J69J55l84j19M30m4k17J1K30J86o0j86L59k97p9R8j06k22J14
2445a17L1j03K74m58K95P5j79J07j07O3N2p2J72j41J14Q9J20L4j72k6p1J58J61
2468B99j69R7k6J2l98j31K65L1N7k83K61k89j9j39J87K96n7j7q1K46L3n5R4k60
2492d6J08J2O2jjJ71j70J3m4j26l9J47l19K58l47M77j62k52J42lN0O9J9m2K08
$$ y = [278, -26, 216, 41, -148, -14, -85, -72, -75, 26, -47, -12, -322, -66, -241, -85, -331, 122, 195, -46, -74, 77, 261, 185, 357, 28, 218, 257, 183, 188, 260, 6, 156, 249, 175, -28, -27, -115, 98, -112, -142, -178, -167, -16, 4, -182, -310, -244, -54, 253, -19, -42, 41, 16, 240, 354, 123, 98, 102, 309, 97, -106, -45, 58, -13, 28, -208, -301, 35, -173, -78, -131, 42, 20, 56, -173, -47, -271, -55, 200, 161, 44, 163, -40, 131, 39, 104, 147, -80, -52, 185, 112, 10, 45, -166, -66, -137, -1, -155, 14, 169, -215, -334, 96, 52, -165, -154, 76, 262, 202, 16, 375, 78, -1, 97, -9, -231, -117, -86, -189, 85, -373, -78, -3, -182, -75, -182, -119, -67, -139, 33, -108, 6, 95, 215, 249, 77, 51, -20, 138, 299, 130, 227, 201, 213, -185, -316, -51, -20, 37, -246, 15, -274, -293, -432, -245, 51, -6, -23, -104, 142, 175, 120, 214, -46, 62, 74, 136, 135, 134, 305, 135, 148, 104, -22, -61, 86, -233, 25, -322, 155, -7, -259, -117, -120, -70, -1, 18, -24, 184]
2517A84nJ32k31J07k34K27O3q3m9mM7n14K99K1j4m25J95J23Pj02J31K84p9j23
2541d3J93Q8k54R8l8M5Q4n5M7rr3l53J38J00j53J97j8m7O2jq1K0j67P5J01K06
2567A42q3m10N20N7k8j23k4n4J29K47l20J13L0k63q2K47j97j39J99k05j05Q7R7
2590a65J75K5j58k02M31p7j69L18k17l3j81J06L19j96M2j27K39J63k52J40l87
2611b06P3K41q1J4O9j14r2mk03J92J8K66l12L49j81o9N7J54j10N3q6L17m29J72
2635H8q4K07k86K8j08nK21m9l54J11l4M2K65j21P1Q5%k04m1L94K63o17J79R6k53
2660a06K48r7Rr5lN0O3k98L53k58m2K7j16K24j29K4j95K62J78j48O1j69J76P9
2684I8j47K79k45J75on8j18j05J52kJ00k06N2j13k91L79o6J12lk1J23kn27N12
$$ y = [184, 179, 311, 80, 187, -47, 180, 243, 160, 111, 107, 154, -360, -61, -40, -54, -479, -284, -161, -154, -256, -125, 159, 80, -43, 150, 238, -16, 82, 44, 89, 173, 118, 165, 156, 63, -290, -152, -52, -205, -8, -26, -73, -11, -12, -93, -73, -240, -165, -64, 142, 59, -351, 169, 226, 198, 75, 51, -3, 126, 373, 53, 166, 196, -67, -149, 98, -99, -238, -39, -244, -349, -262, -165, 10, 35, -123, -325, 106, 29, -140, 178, -39, -72, -253, -147, 172, -24, 18, -109, 130, 293, 41, 181, -206, -133, 108, 27, 41, 110, -4, -96, -100, -303, -111, -93, 173, -139, 210, 29, -40, 17, 171, 61, 114, 28, 345, -84, 88, 4, 211, -75, -47, -155, -160, 61, 12, -342, -231, -265, -223, 42, -79, -8, 77, 77, -127, -168, 226, 489, -128, 51, 147, -106, 142, 45, 54, -41, -44, 6, 69, -229, 124, -134, -176, -149, -265, -41, -170, -146, -341, -79, 99, -49, 12, -157, 19, 98, -49, 230, -15, 160, 154, 96, -22, -127, 25, 23, 123, -83, -31, -144, -435, -56, -122, -10, -13, -34, 89, 87, -440, 72]
2708G2n4Q6K30l11M3J47m7J0j38k84K65J3r9P5p7r4q8K03k27j95J76J23K91l61
2732b41J56L0K00N1J52k91J56Q0m15K06mj01K7q1J06M5j28R5k75K06j40j21J02
2755a85j30J10n2o5N75k52j12J12J27K5K6R2j32k06K60j46J06j67P1J10n8k38
2777a29J87k25o7K00q5j4O1j62M08k62k15K80J16j41K4N2L2J20n8l7J14j3o4K3
2801A45k41J03j13J18j49J07j02k0M7k46K75q0L5k01L90k04L06K0J7j82P6J85
2823B86l07j16J08L75k90J50j74n3j34L2j0J73j51Q1k30Q3K84j47k97K23N8O9
2845A3J25r0O3M1j10K04Q3l45J53l32L03p7J94K7l08O3m3k60Q4r9L84l54j01M45
2869F3j13j6J90L2k7Nk8J78r4m81M21Q0k19J58k32j24Q0L7L25m10J84k05J30R4
$$ y = [72, 18, 104, 334, 23, 66, 213, 166, 176, 38, -246, 19, 32, -67, 8, -69, -163, -251, -48, -275, -470, -294, -171, 120, -241, -85, -55, 145, 196, 348, 57, 213, 293, -122, 84, 80, -21, 6, -75, 31, 76, -52, 43, -232, -26, -166, -287, -185, -315, -205, -257, -322, 253, 1, -111, 1, 128, 153, 179, 271, 139, -67, 193, 47, 153, -14, 57, 167, 109, -129, 58, -167, -234, -34, -119, -133, -72, -234, 174, -88, -303, -23, 93, -48, -24, 28, 60, 180, 122, 85, 199, 186, 122, 145, -96, 7, -106, 12, -137, -30, -132, -152, -105, -351, -76, -156, -121, -322, 68, -136, 170, 190, 207, 25, 101, 286, -21, -137, -29, 346, 56, 206, 32, -21, -155, -123, -133, 40, -111, -30, -260, -177, 107, -40, -337, -114, -56, 13, 138, 48, 111, 152, 42, 246, 329, -16, 137, -195, 108, 31, 225, 252, -56, 7, -36, -296, -212, -311, 73, -281, -382, 63, -50, -66, 124, 156, 129, 134, 106, 284, 190, -291, 130, 210, -9, 149, -83, -207, -127, -90, 235, -175, 9, -196, -66, 28]
2893B8O2j26L2j55J99K2m9J6j04L10j65M25k16J33k21K5k37J22j84M7k02j07L33
2916a2j40K32k58j21p3J15j34J64K48k31K00p5L91k12k06lM27p2j72K14k74J42
2938A50M9j75n2r1j60L84k87J76m2j12k27L45j76O7J65k4j14J03L46l46M4J39
2960A62J85j16j47K52o9r8j31p2J0j53P6K34O0o4o00K56m5J97k12J23k11J95J88
2983B0L5K9j23K29j65L57l74k7m8NL10k89k4K48l24K24j17k9j30PP2j55J30P6
3007f3j34J02J03j81K11k60L28k29L62k68nq3K33Jj09j04J71qj73k30K75l53M85
3030G1j72J21k41J38J06k14L27j04O7J27j08j65K07P0j37Q2o8k92K73M1k80L77
3052B26k81j91K38J80l07J40k73J86K78m55M29k40k9P8K96k01J56Q2j47J31k29
$$ y = [28, 90, -36, -4, -159, 40, 62, 13, 29, -75, 235, 70, 495, 279, 412, 191, 216, -21, 101, -83, -36, -238, -345, -12, -152, 80, -178, -299, -372, -257, -391, -227, 21, -210, -10, -85, 306, 94, -112, -115, 312, 240, 68, 282, 8, 150, 199, 24, -28, -119, -279, 105, -182, -6, -48, -160, -387, -42, -218, -151, 14, -10, -124, -21, 325, -21, 23, 162, 347, 231, 84, 336, 267, 169, 38, -34, -24, -177, -101, 133, 193, 129, -471, -215, -260, -63, -275, -152, -363, -168, 20, 55, 84, -39, 190, 25, 382, 8, -19, -67, -62, 248, -41, -65, 183, -141, 83, -34, -63, -193, -186, -114, -269, -139, -63, -197, -95, 8, -173, 38, -222, 106, -123, 239, -29, -34, -117, 116, 117, 8, -96, 75, 67, -106, -336, -61, -414, 71, -101, 20, -221, -83, 23, -191, 136, 32, 99, 226, 118, -47, 160, 230, 93, 175, 107, -185, 88, 129, -151, 226, -55, -246, -8, 172, -135, 5, -268, -82, 196, -259, 170, -70, -99, -21, 275, 74, 230, 312, 165, 296, 67]
3073F7J04J02q3j84P3J3l21N77m31r7J9L2k3j30J06oJ45P6J5j88O4O2J64J90l08
3098C8J37J38o0j11j13j76K24r4j82K6J20J25j93j47l9K18J93j94n1R5k15L99
3120A38Q9j81k07K98k5K92o5j69j74j19K67J90k68r5j07R8k72K61k0j03p3J13
3142a32qJ14k43L15q0k57L83l83L05j15J68K86q4j09p1P1J13k82L84n20J32J27
3164A14M1l72J69j61OL03O6m41L30J47j79N4O3N1j88j19K24L8k18j6J08K16l85
3187a49J82j1J39n4k85K06j71K55m83K56M8K17k03J67k59K6K69ok32J25N2qr7
3210a6J0n3J64j73N5R2p0K82m71L9k4K6l2K95k77K82l01L7r5L3L39K7k50Q9k13
3235b05L54k59J87J08O4m08J60Q9J75j84k52l9P5j27J7K27m2k65R6J91N5k0j10
$$ y = [67, 171, 273, 190, 6, 79, 92, -229, 348, -83, -180, -161, -129, -152, -282, -176, -182, -37, 39, 54, -134, -70, -8, 156, 346, 38, 175, 313, 253, 142, 29, -147, 77, -17, -199, -173, -53, 72, -121, -268, -307, -89, 104, -90, -141, -46, -261, 138, 227, 46, -161, 137, 112, 404, 339, 170, -4, -123, 144, 334, 66, -29, -136, -38, -310, -49, -69, -172, -245, -132, -140, -26, -269, 46, -34, -291, 92, -291, 14, -101, 67, 353, 269, 160, 89, 160, 273, -9, 375, -145, -13, 114, 155, -217, -48, -209, -203, 100, 166, -275, 55, 202, 23, 77, 140, 191, 3, -116, 108, 146, -72, -88, 20, 236, -149, 33, 22, 161, 107, -178, 28, -143, 112, -371, -115, -67, 150, -53, 114, -145, -119, 150, 144, -88, 37, 89, 81, -16, -6, -59, 105, -68, -13, 79, 9, 291, -180, -141, -165, -139, -171, 124, -153, 129, -172, -135, -230, -197, 142, 169, -81, 8, -205, 149, -110, 77, 185, 249, -159, 1, 90, 265, 81, -171, -210, -135, -262, -245, -18, -60, -325, -229, -38, 17, -3, -113]
3258a13J84j84K1L08m8mj14J0n6N3j9q2nJ07q8m0K04k56J21j88k6N9J98nj65J13
3284a5P6j19j54M45r9K2k83N45r0k49q0L0J69k31J40J3p5p0J8l5l32M62l81j4
3308c07J31J31K10k86J28J5K05j92J01j87K90q2J18k58m1OJ09M9k79j29K36k33
3330b65J88M8j78Q9J46mj72j01K55j35L09k44J94K93m54J61q8R7lj11j61O1J15
3353D0N8l60K88j91k07L71j40q7J70J35J08m2rj59P5K00k65L65k86R6o5q5K45
3376B55l26K1kN3o3l6N8J62m75K76q7P5J13k17K78j64K06k08L04Q1n44L36j13
3399a7L11k63J29n8K65m99K73j65J34l6j88j54J89J29J20J44l43J83m5k74J11
3420e4M4j16j12K40P3J03k02L07jk60L13m79p8P7K31J56r4j56j21J72k48J03J4
$$ y = [-113, 71, -113, -92, 216, 168, 164, 50, 60, 4, 57, 38, -44, -49, 58, -30, -70, 134, -122, -1, -189, -215, -156, 42, 37, -128, -15, 61, -58, -212, 233, 134, 156, -127, 418, 328, 79, -1, 29, 198, -33, 107, 120, 45, -25, -7, -42, -374, 88, -293, -307, -176, -45, 165, -121, 7, 22, 227, 35, 136, -51, 239, 157, 275, 17, -24, -18, 91, 140, -139, -268, -32, -265, -77, -29, -207, -118, 28, 24, -148, -249, 6, -129, 180, -64, 130, 423, -31, 130, 42, 139, 136, 25, -136, -75, 40, 98, -262, 26, -165, -372, -1, -141, -228, -58, 77, 185, 143, 134, -25, 50, 250, -15, 350, 64, 160, 95, 10, 255, -71, -50, -52, 1, -62, -98, -40, 122, -353, -77, -164, -89, 24, -193, 85, -79, 127, -81, 223, 304, -240, 96, -17, 294, 31, 160, 102, 367, -132, 141, -24, 110, 74, -114, -268, -79, 50, 170, 314, -29, 154, 109, -165, -54, -10, -126, -238, 2, 75, 178, -24, 283, 282, 22, 335, -144, -222, -145, 86, 242, 148, -8, -129, 43, -205, -102, -88]
3443h8J93j69j5k15L25j57K81L0j92l8m6K15j63L08m01L25l48K13j89m0K2q4O1
3466a72J32J46l87O3Q5m03N92M0j38K72j96n2n3j27M91j43J46j48j24nJ70j4k49
3489g4j30j24L65j39P3J6j9J0J12l79L03j07J4J8LL9L16k56K0J3k4j0J21r5j10
3514d4Q8r3N75p76J41M0K00l83J91K1P9j27qj7n3j69N16j90j13K31k26L18k06
3537eJ60K6k79rJ21Q5j43p1J52J1j57J13q8K7k30Q4n7K58Q4J17k73O7J24J42l08
3562d9K77P1k45J10n1j25J43K8l27J98q8r7J82P1j90m1j43K01n9J48l6j57P6k31
3586c34L71L56j75j67J3L25k66n2J54j48k72K64o6j6j66J09K8K57q7n8l7l7j48
3609a52N7J03J74k34o0j16J65j59L50J64Qp8j66r7k7j6P7J60J12l07J84k23j23
$$ y = [-88, 105, -64, -79, -294, 31, -126, 155, 185, -7, -45, -91, 124, -39, 269, -132, 193, -155, 58, -131, -171, -149, -233, -172, -40, 106, -281, -218, -133, -536, 56, 96, -42, 230, 34, -18, -71, -198, 293, 150, 296, 148, 24, 19, 189, 175, -74, -204, -328, 37, -102, -29, -13, -32, -22, 90, -289, 14, -93, -79, -61, -58, -19, 297, 41, 61, 74, 50, 40, 161, 66, -44, 44, -49, 526, -250, -109, -69, 131, -252, -61, -40, 39, -88, -96, -113, -166, -335, 181, -9, -122, 109, -117, 201, -5, 155, 181, -98, -107, 14, 99, -44, -115, 37, 48, -109, 4, -84, -57, -287, -203, -260, -2, 82, 199, -74, -7, 117, 259, -49, 228, 299, 54, 164, 113, -12, 131, 159, -168, 30, -58, -155, 27, 98, -92, -133, -276, -75, -134, 14, -22, -179, -103, -334, 37, 393, 218, 51, 64, 389, 123, 71, 225, 77, -195, 69, 3, -13, -179, -70, -42, 215, 128, 70, 33, -4, -152, -95, 8, 182, -52, -112, -228, -63, -222, 128, 292, 300, 222, 56, -41, -68, -84, -7, 153, 265, -42, 142, -81, -204]
3632b04J24j72L30k49j73K24K23l12J54Q9M7qj90M12j63r9J64p6j32j4L02l44
3654f7n0o8M1o8r8K77j28J50l77K90J89k19J62k65L84j92p1K15j09j60L02o1j50
3677g3o0P5P2j28O9L2j85J87k62L16l9r0j41J62J59k04J06R3J7K17j71N8j01k14
3701a05K21j69K06K4m7K30m00J14k65pJ40Q0l84M00k66J9J96J46k48P3O8j05M
3724g5M03l34l1PL03l73J67K99l79K72m26K73k71j31L90l70m1q8M96k45P9J41
3746F6k08J00k7K58k25J89j02J70j0J52j32M6k64r7M53l20k29L73j6j88j78J54
$$ y = [-204, -80, -252, 78, -171, -344, -120, 103, -209, -55, 34, 81, 73, -117, 295, 132, 33, 197, 121, -11, -25, 277, -67, -117, -185, -144, -212, -310, -33, -161, -11, -388, -98, 91, -128, 34, -231, 153, -39, -110, 105, -4, -164, 138, 77, -73, -133, -58, 14, -114, -45, -13, -198, -11, -273, 43, 4, -86, -227, -65, 94, -110, -4, 89, 106, 323, 152, 210, 109, -105, 116, -53, 153, 177, 130, 360, -40, 74, -191, -198, -58, 22, -362, 38, -228, -209, -13, 133, -115, -42, 26, -79, -75, 328, -6, -37, -30, 273, -100, 67, 366, -13, 259, -167, 106, -165, -296, 94, -276, -317, -405, 91, -154, -75, 66, -142, -42, -69, 189, -36, 153, 51, 221, 211, 363, 231, 277, 13, -84, 369, 49, -180, 193, 177, -11, -189, -35]
$$ [...]
8191A24
##END NTUPLES=NMR FID
##END=
