##TITLE=1H_Ad-Co-I(PE-part)
 CDCl3
 8 sc, 
 23.3.2023
##JCAMPDX= 6.0         $$ Bruker NMR JCAMP-DX V2.0
##DATA TYPE= NMR FID
##DATA CLASS= NTUPLES
##ORIGIN= UXNMR, Bruker Analytische Messtechnik GmbH
##OWNER= root
$$ XWIN-NMR		Version 3.5
$$ Thu Mar 23 16:35:32 2023 Russian Standard Time (UT+4h)  she@DPX200
##.OBSERVE FREQUENCY= 200.13135
##.OBSERVE NUCLEUS= ^1H
##.DELAY= (6, 6)
##.ACQUISITION MODE= SIMULTANEOUS
##.ACQUISITION SCHEME= undefined
##.AVERAGES= 8
##.DIGITISER RES= 18
##SPECTROMETER/DATA SYSTEM= spect
##.PULSE SEQUENCE= zg30
##.SOLVENT NAME= DMSO
##.SHIFT REFERENCE= (INTERNAL, DMSO, 0, 15.7039)
##AUDIT TRAIL= $$ (NUMBER, WHEN, WHO, WHERE, WHAT)
$$ ##TITLE= Audit trail, XWIN-NMR		Version 3.5
$$ ##JCAMPDX= 5.01
$$ ##ORIGIN= Bruker BioSpin GmbH
$$ ##OWNER= she
$$ F:/spectra/data/she/nmr/H-F/1/audita.txt
$$ ##AUDIT TRAIL=  $$ (NUMBER, WHEN, WHO, WHERE, WHAT)
(   1,<2023-03-23 16:33:57.17 +0400>,<she>,<DPX200>,
      <created by zg, POWCHK disabled, PULCHK disabled
       configuration hash MD5:
       00 E9 B6 7A A2 85 ED C7 34 08 36 98 17 FE 4E 26
       data hash MD5: 16K
       15 BB E0 CF 10 7C C9 E0 CF 49 B1 68 3A 59 54 B1>)
$$ ##END=
$$ 
$$ hash MD5
$$ 46 D0 51 EA 00 35 C8 69 DD 74 E8 5D 8E BD D3 07
##$RELAX= 
##$RELAX= 
##$RELAX= 
##$RELAX= 
##$RELAX= 
##$RELAX= 
$$ Bruker specific parameters
$$ --------------------------
##$DU= <F:/spectra>
##$EXPNO= 1
##$NAME= <H-F>
##$PROCNO= 1
##$TYPE= <nmr>
##$USER= <she>
##$AMP= (0..31)
100 100 100 100 100 100 100 100 100 100 100 100 100 100 100 100 100 100 
100 100 100 100 100 100 100 100 100 100 100 100 100 100 
##$AQSEQ= 0
##$AQ_mod= 1
##$AUNM= <au_zg>
##$AUTOPOS= <>
##$BF1= 200.13
##$BF2= 200.13
##$BF3= 200.13
##$BF4= 200.13
##$BF5= 200.13
##$BF6= 200.13
##$BF7= 200.13
##$BF8= 200.13
##$BYTORDA= 1
##$CFDGTYP= 0
##$CFRGTYP= 5
##$CHEMSTR= <none>
##$CNST= (0..31)
1 1 145 1 1 1 1 1 1 1 1 1 1 1 1 1 1 1 1 1 1 1 1 1 1 1 1 1 1 1 1 1 
##$CPDPRG= <>
##$CPDPRG1= <>
##$CPDPRG2= <>
##$CPDPRG3= <>
##$CPDPRG4= <mlev>
##$CPDPRG5= <mlev>
##$CPDPRG6= <mlev>
##$CPDPRG7= <mlev>
##$CPDPRG8= <mlev>
##$CPDPRGB= <>
##$CPDPRGT= <>
##$D= (0..31)
0 1.2 0 0 0 0 0 0 0 0.06 0 0.03 0 0 0 0 0.0002 0 0 0 0 0 0 0 0 0 0 0 0 
0 0 0 
##$DATE= 1679574836
##$DBL= (0..7)
120 120 120 120 120 120 120 120 
##$DBP= (0..7)
150 150 150 150 150 150 150 150 
##$DBP07= 0
##$DBPNAM0= <>
##$DBPNAM1= <>
##$DBPNAM2= <>
##$DBPNAM3= <>
##$DBPNAM4= <>
##$DBPNAM5= <>
##$DBPNAM6= <>
##$DBPNAM7= <>
##$DBPOAL= (0..7)
0.5 0.5 0.5 0.5 0.5 0.5 0.5 0.5 
##$DBPOFFS= (0..7)
0 0 0 0 0 0 0 0 
##$DE= 6
##$DECBNUC= <off>
##$DECIM= 32
##$DECNUC= <off>
##$DECSTAT= 4
##$DIGMOD= 1
##$DIGTYP= 9
##$DL= (0..7)
0 120 120 120 120 120 120 120 
##$DP= (0..7)
150 150 150 150 150 150 150 150 
##$DP07= 0
##$DPNAME0= <>
##$DPNAME1= <>
##$DPNAME2= <>
##$DPNAME3= <>
##$DPNAME4= <>
##$DPNAME5= <>
##$DPNAME6= <>
##$DPNAME7= <>
##$DPOAL= (0..7)
0.5 0.5 0.5 0.5 0.5 0.5 0.5 0.5 
##$DPOFFS= (0..7)
0 0 0 0 0 0 0 0 
##$DQDMODE= 0
##$DR= 18
##$DS= 0
##$DSLIST= <SSSSSSSSSSSSSSS>
$$ [...]
##$SUBNAM2= <"">
##$SUBNAM3= <"">
##$SUBNAM4= <"">
##$SUBNAM5= <"">
##$SUBNAM6= <"">
##$SUBNAM7= <"">
##$SUBNAM8= <"">
##$SUBNAM9= <"">
##$SW= 18.05172834244
##$SWIBOX= (0..15)
0 0 2 0 0 0 0 0 0 0 0 0 0 0 0 0 
##$SW_h= 3612.71676300578
##$TD= 16384
##$TD0= 1
##$TE= 0
##$TE2= 300
##$TE3= 300
##$TEG= 300
##$TL= (0..7)
0 120 120 120 120 120 120 120 
##$TP= (0..7)
150 150 150 150 150 150 150 150 
##$TP07= 0
##$TPNAME0= <>
##$TPNAME1= <>
##$TPNAME2= <>
##$TPNAME3= <>
##$TPNAME4= <>
##$TPNAME5= <>
##$TPNAME6= <>
##$TPNAME7= <>
##$TPOAL= (0..7)
0.5 0.5 0.5 0.5 0.5 0.5 0.5 0.5 
##$TPOFFS= (0..7)
0 0 0 0 0 0 0 0 
##$TUNHIN= 0
##$TUNHOUT= 0
##$TUNXOUT= 0
##$USERA1= <user>
##$USERA2= <user>
##$USERA3= <user>
##$USERA4= <user>
##$USERA5= <user>
##$V9= 5
##$VALIST= <valist>
##$VCLIST= <CCCCCCCCCCCCCCC>
##$VD= 0
##$VDLIST= <DDDDDDDDDDDDDDD>
##$VPLIST= <PPPPPPPPPPPPPPP>
##$VTLIST= <TTTTTTTTTTTTTTT>
##$WBST= 1024
##$WBSW= 4
##$XGAIN= (0..3)
0 0 0 0 
##$XL= 0
##$YL= 0
##$YMAX_a= 534638
##$YMIN_a= -679643
##$ZGOPTNS= <>
##$ZL1= 120
##$ZL2= 120
##$ZL3= 120
##$ZL4= 120
##$ABSF1= 10
##$ABSF2= 0
##$ABSG= 5
##$ABSL= 3
##$ALPHA= 0
##$AQORDER= 0
##$ASSFAC= 0
##$ASSFACI= 0
##$ASSFACX= 0
##$ASSWID= 0
##$AUNMP= <proc_1d>
##$AZFE= 0.1
##$AZFW= 0.1
##$BCFW= 1
##$BC_mod= 2
##$BYTORDP= 1
##$COROFFS= 0
##$CY= 11.3945322036743
##$DATMOD= 1
##$DC= 2
##$DFILT= <>
##$DTYPP= 0
##$F1P= 2.36226072786647
##$F2P= -0.459571619588291
##$FCOR= 0.5
##$FTSIZE= 0
##$FT_mod= 4
##$GAMMA= 1
##$GB= 0.15
##$INTBC= 1
##$INTSCL= 1
##$ISEN= 128
##$LB= 0.24
##$LEV0= 0
##$LPBIN= 0
##$MAXI= 10000
##$MC2= 0
##$MEAN= 0
##$ME_mod= 0
##$MI= 1.114404
##$NCOEF= 0
##$NC_proc= 0
##$NLEV= 6
##$NOISF1= 3.799351
##$NOISF2= 2.8
##$NSP= 1
##$NTH_PI= 0
##$NZP= 0
##$OFFSET= 15.70392
##$PC= 1
##$PHC0= -19114.93
##$PHC1= 22.60075
##$PH_mod= 1
##$PKNL= yes
##$PPARMOD= 0
##$PSCAL= 0
##$PSIGN= 0
##$REVERSE= no
##$SF= 200.130013532006
##$SI= 16384
##$SIGF1= 3
##$SIGF2= 2
##$SINO= 400
##$SIOLD= 16384
##$SREGLST= <1H.CDCl3>
##$SSB= 0
##$STSI= 0
##$STSR= 0
##$SW_p= 3612.71676300578
##$SYMM= 0
##$S_DEV= 0
##$TDeff= 0
##$TDoff= 0
##$TI= <>
##$TILT= no
##$TM1= 0
##$TM2= 0
##$TOPLEV= 0
##$USERP1= <user>
##$USERP2= <user>
##$USERP3= <user>
##$USERP4= <user>
##$USERP5= <user>
##$WDW= 1
##$XDIM= 8192
##$YMAX_p= 0
##$YMIN_p= 0
$$ End of Bruker specific parameters
$$ ---------------------------------
##NTUPLES= NMR FID
##VAR_NAME=  TIME,          FID/REAL,        FID/IMAG
##SYMBOL=    X,             R,               I
##VAR_TYPE=  INDEPENDENT,   DEPENDENT,       DEPENDENT
##VAR_FORM=  AFFN,          ASDF,            ASDF
##VAR_DIM=   8192,          8192,            8192
##UNITS=     SECONDS,       ARBITRARY UNITS, ARBITRARY UNITS
##FACTOR=    0.0002768,     1,               1
##FIRST=     0,             0,               0
##LAST=      2.2672688,     0,               0
##MIN=       0,             -679643,         0
##MAX=       2.2672688,     534638,          0
$$ Real data points
##PAGE= N=1
##DATA TABLE= (X++(R..R)), XYDATA
0 0 0 0 0 0 0 0 0 8 -8 8 -8 16 -16 18 -24 32 -40 49 -62 73 -89 106 -128 150 -177 207 -240 276 -319 368
30 368 -419 480 -545 618 -698 787 -882 989 -1107 1235 -1372 1526 -1693 1877 -2076 2293
46 2293 -2528 2790 -3075 3385 -3731 4109 -4532 4999 -5521 6111 -6780 7548 -8436 9484
60 9484 -10735 12266 -14183 16666 -20022 24832 -32334 45702 -76621 295301 -193542 -647495
72 -647495 499713 371958 -503978 -225086 534638 44546 -467037 66512 409787 -180254
82 -180254 -291809 205248 212463 -239118 -146920 251878 74228 -284103 38003 242130 -128993
93 -128993 -169445 169674 87582 -174377 -37096 194019 -27466 -193614 122045 160727 -198779
104 -198779 -74396 235711 -4211 -237726 84777 228061 -165076 -176856 235051 76479
114 76479 -246597 16792 190076 -63626 -135084 58586 106779 -62190 -97582 73462 69545
125 69545 -80335 -47342 73635 41346 -81260 -25844 105718 -13145 -99562 62291 63261
136 63261 -72832 -22073 67435 9851 -65239 11726 73464 -55155 -54440 90515 209 -93443
148 -93443 43506 67452 -66045 -50895 78230 31107 -101193 -3463 97574 -31364 -72302
159 -72302 36888 54287 -18204 -63645 23608 84629 -56364 -73649 91761 43949 -99952
170 -99952 -9506 108087 -17303 -111661 63763 93947 -113641 -43194 130228 -17626 -115032
181 -115032 51627 89980 -77274 -75827 103791 38854 -131412 15758 121418 -64746 -86802
192 -86802 85409 59496 -93620 -42287 113494 18615 -125597 25283 122044 -53222 -101305
203 -101305 71595 95052 -94509 -85131 133370 46655 -158704 14417 146800 -66723 -115097
214 -115097 92463 78211 -118162 -42622 134362 -13788 -127913 65994 88106 -90939
224 -90939 -45662 90261 19434 -88178 5671 92185 -35919 -72526 66164 41346 -68129
235 -68129 -15128 61182 8588 -64583 4472 75368 -32334 -69675 58392 45526 -70989
246 -70989 -30684 72884 16352 -87009 6839 89426 -45363 -67862 67067 30526 -64201
257 -64201 -6770 52893 -1286 -46690 17527 41266 -31138 -16961 32199 -67 -13762 63
269 63 7356 12545 -15560 -9582 23611 -2739 -20275 3596 14177 -2595 -22922 10518 22371
282 22371 -31669 -5754 35884 -20658 -23488 28616 8319 -26161 -2641 31044 -4257 -34814
294 -34814 24326 26315 -34760 -3389 29401 -3934 -14959 881 17328 70 -24232 10790
306 10790 19085 -20174 -9967 16284 8321 -19551 -14687 32512 2028 -46955 20143 37588 -39061
319 -39061 -19726 42623 8410 -44710 3250 51913 -23461 -44305 48959 21304 -52561 6899
331 6899 43389 -14819 -33066 19852 31897 -29935 -24203 39532 6028 -36427 3695 24410
343 24410 -3168 -26721 1462 32272 -17783 -31290 31659 15420 -34701 -3810 31544 -673
355 -673 -35492 13070 38562 -33028 -22479 48093 197 -39759 16798 29244 -18881 -22982 25250
368 25250 16334 -34011 59 31658 -16460 -17543 14802 6065 -8417 -11896 7624 14125 -18742
381 -18742 -8992 20290 254 -17000 -1551 19806 1780 -28637 12309 30670 -27105 -14613
393 -14613 33032 1429 -25971 5344 25738 -9354 -26371 22380 18467 -30846 -2248 24617
405 24617 -7451 -15214 2546 12858 -2221 -19990 8032 16943 -15789 -10741 12968 9524 -13892
418 -13892 -13365 24078 7741 -32457 11565 28932 -23718 -13528 26937 6809 -25703 -481
430 -481 31223 -10828 -28534 26793 13172 -30968 2372 21890 -8411 -17160 6710 16459 -14130
443 -14130 -14940 20055 2256 -19155 3897 11251 -1576 -11602 580 20365 -8955 -19329 22074
456 22074 10569 -23177 456 22023 -2593 -22213 11339 24682 -25214 -13565 34104 -5604
468 -5604 -28791 16096 16168 -19296 -12475 20133 6564 -27707 2309 25050 -15943 -15080 16473
481 16473 5804 -10890 -6659 11961 9133 -17766 -1172 20617 -5606 -13605 7594 13725 -5351
494 -5351 -16826 14377 16166 -24999 -3580 26157 -9633 -19081 12582 11950 -14563 -11654 18539
507 18539 2606 -23244 9311 13471 -16688 -1848 10238 -2163 -4772 -774 7253 542 -8386
520 -8386 6352 5442 -5467 422 2056 4214 -1488 -8387 10493 4635 -15418 4808 11009 -9342
534 -9342 -6630 6470 5711 -10975 -6247 16188 -4707 -16960 13361 5689 -14085 2176 7890
547 7890 -2339 -6149 3364 8318 -7624 -2273 11332 -4666 -3368 6814 -2156 1306 303 -3466
561 -3466 6777 -2250 -7103 6905 1674 -6904 -2449 6012 3291 -13512 345 15523 -12494 -9916
575 -9916 16095 -329 -12363 2331 9373 -887 -10987 5709 11284 -10764 -1890 10704 -3276
588 -3276 -2180 2223 1 3454 -3043 -1739 4519 -1503 -1488 -1522 -7 3974 -7447 -1626 8205 -7994
604 -7994 -2757 7934 -6710 -2670 5855 -2889 -2297 2234 3178 -3081 -3844 10070 -682 -9841 9936
619 9936 3959 -8873 3678 4064 -1601 -1022 -929 4614 -2037 -4932 5295 -1524 -3221 2873 -4226
634 -4226 820 2753 -6551 1507 2884 -3878 -424 551 1915 -1702 -3264 7616 -1840 -6346 9557
649 9557 -968 -6825 8897 633 -5611 3490 2634 -1063 -2806 2656 3892 -6705 937 5255 -6344
664 -6344 816 2608 -5055 2754 -716 -4306 3582 -643 -2231 -27 -26 3933 -3649 -2617 8616 -3527
680 -3527 -4615 7643 360 -3166 1545 2017 1947 -3386 783 4262 -4924 1352 2999 -6133 3662 1551
696 1551 -7389 4478 1565 -6006 1623 1839 -1341 -2818 353 4336 -4351 -1367 6487 -4718 -720
711 -720 5921 -3920 313 3719 -2670 1730 1306 -270 815 -2202 3538 515 -5761 5100 1058
726 1058 -6436 3447 1368 -3479 -276 4 1714 -2707 -2312 4889 -3292 -2194 4882 -3899 372 3703
742 3703 -5001 2380 3869 -4522 1504 3275 -512 -1760 -92 5297 -2673 -4279 7549 -1758 -5638
757 -5638 5721 -890 -3404 1921 -1279 -2 -975 -1746 2304 -3480 140 3331 -5141 1324 3390
772 3390 -4323 1402 2311 -1847 1362 -265 1099 1121 -2354 2838 118 -1701 4286 -2895 -1285 5716
788 5716 -4142 -1909 4900 -2916 -2081 1573 736 -1222 -3973 3836 1040 -7146 4058 3145 -7011
803 -7011 3047 3077 -3494 383 1025 2245 -1094 -2446 5387 -119 -4252 4346 700 -1290 850 -1798
819 -1798 3219 422 -5722 4028 2841 -4991 -1278 1940 2065 -4457 -3931 8196 -1987 -8831 7201
834 7201 3321 -7430 563 4275 544 -3763 300 5971 -3421 -2659 6340 -1621 -1662 3548 -1447 1186
850 1186 358 -1842 2829 -1467 -1491 3087 -2476 -1150 1260 -822 1001 -3129 163 4558 -6360 -1646
866 -1646 7450 -4010 -4515 4372 2910 -2632 -4005 6437 3730 -9640 3002 8988 -6831 -2530
880 -2530 6087 973 -3262 -2014 5266 1070 -7448 2713 4406 -4845 -1305 1350 1059 -875 -4770
895 -4770 3815 3455 -8148 1034 6235 -3474 -3688 2650 4497 -3509 -4974 8635 1389 -9484 5438
910 5438 6309 -5841 -1175 4235 1872 -3850 -2276 6539 -1721 -6069 4969 914 -4182 341 407
925 407 868 -1755 -2883 4422 -680 -4532 4043 1088 -2458 -423 1444 3239 -4095 -1670 8258 -2861
941 -2861 -5429 7679 1330 -5983 1095 4990 -330 -6536 2920 6937 -7888 -2723 8109 -2748
955 -2748 -5092 2279 1909 -1162 -4869 2195 4780 -6057 -1736 5719 -1503 -2719 426 3042 1390
970 1390 -5213 2620 6289 -5785 -1496 6484 -875 -3653 637 4644 -827 -6593 5405 4303 -9392
985 -9392 1157 6707 -4425 -3682 2441 2706 -2865 -4112 4881 994 -6140 2351 2966 -2426 -583
1000 -583 -423 2935 698 -4812 3703 3154 -4458 790 3044 -208 -1659 -551 3983 -1219 -4666 4790
1016 4790 673 -5787 2717 1834 -3365 -1326 1478 1980 -4041 -1545 5725 -2842 -4157 5199 2
1031 2 -3079 1096 1196 1614 -2529 -473 5173 -1376 -3094 2925 1208 -888 -1963 1537 4543 -5292
1047 -5292 -2682 7368 -2568 -5602 3665 2283 -3099 -2966 2997 2550 -6488 88 6627 -4462 -3095
1062 -3095 4589 716 -2175 -1369 3230 2182 -4815 1355 5151 -3242 -1276 2964 915 -919 -3026
1077 -3026 2488 3447 -5806 -611 5179 -2872 -3203 1735 2372 -2369 -4229 4483 1863 -6796 2358 4402
1093 4402 -4530 -321 2774 -64 -1395 -674 3132 -207 -3331 3849 1323 -3385 1631 1352 -537
1108 -537 -526 -911 3061 -540 -3939 3369 1224 -3461 -479 1363 1107 -2899 -2471 4996 -895 -5441
1124 -5441 4371 2406 -4392 -316 3166 1167 -3237 -573 5204 -2159 -3006 4331 184 -1782 955
1139 955 233 1222 -1101 -1397 3375 -940 -2631 2076 200 -1151 -717 508 1940 -3611 -1263 5066
1155 5066 -2583 -3632 3987 623 -2840 -650 3113 1982 -5046 1178 6031 -4153 -2752 4769 656
1170 656 -2323 -1194 2758 1972 -4493 249 4442 -2804 -2250 1737 1251 -696 -3513 1654 3444 -4836
1186 -4836 -994 4573 -2068 -2510 2162 1415 -1078 -1914 3173 1141 -4468 2781 2994 -4417 567 3453
1202 3453 -953 -1888 828 3189 -1758 -3726 4430 1323 -5241 1050 2863 -1759 -2698 292 3825
1217 3825 -2153 -5032 4457 2234 -4857 -591 3671 507 -4152 -238 6573 -2384 -5770 6145 2685
1232 2685 -5463 346 4300 -75 -3775 1112 4728 -3431 -3661 5026 -11 -4126 754 1691 -317
1247 -317 -3223 -156 3765 -2436 -2888 3703 463 -2926 60 1847 793 -3205 199 4566 -2903
1262 -2903 -2498 4637 204 -2965 997 2619 -192 -3573 2378 3514 -4601 -899 4380 -2300 -2610
1277 -2610 1711 817 -1489 -2559 2074 1846 -3858 161 3102 -1658 -1335 874 1342 -164 -2922 2939
1293 2939 2683 -4404 123 3931 -1192 -2022 1467 2718 -1616 -3258 3708 1362 -5285 1296 3451
1308 3451 -2590 -1755 1815 1222 -2496 -1901 3867 -391 -4046 2497 1917 -2702 -788 1540 1335 -1609
1324 -1609 -1770 3966 190 -3653 2033 2484 -1695 -1446 1769 2854 -2904 -2254 5050 -582 -4655 2594
1340 2594 1966 -2618 -1868 1674 1487 -3416 -1293 3544 -1551 -2366 2265 248 -1375 -452 558 1292
1356 1292 -1606 18 2476 -1308 -704 2150 -534 -176 208 717 644 -2191 723 2435 -2775 -810
1372 -810 2850 -747 -2087 121 2154 -879 -3595 2369 2433 -4623 -289 3482 -1255 -1978 532 2224
1388 2224 -796 -2704 2342 2141 -2566 -81 2263 -27 -1075 -635 2035 472 -2803 1334 2013 -2449
1404 -2449 -348 1497 -228 -1159 -1019 2209 -278 -2936 1872 1094 -2867 624 1550 -606 -1018 373
1420 373 1841 -1168 -1361 2554 -189 -1865 1236 506 -161 -163 -150 1390 -509 -1423 1537 -25 -1115
1437 -1115 439 186 234 -988 -473 1795 -1497 -1626 2547 -499 -1612 778 694 -308 -528 465 1440
1454 1440 -1646 -206 2336 -1223 -682 1373 -220 -277 -274 477 718 -1341 164 1208 -1240 -411 689
1471 689 -502 256 -1145 126 1219 -1634 -510 1591 -711 -735 573 424 -186 -1055 1430 1039 -2177
1488 -2177 909 1537 -1623 311 998 124 -146 -512 1332 419 -1951 914 832 -1146 0 -280 419
1505 419 189 -1562 848 704 -1663 -15 790 -323 -241 -740 1242 136 -1479 1263 978 -1362 524
1522 524 529 -19 315 -630 320 151 -533 701 -365 -36 934 -1240 -184 1111 -904 -318 279 -588 280
1541 280 -841 -328 998 -884 -149 663 -233 928 -755 -94 1632 -744 -585 1200 11 -430 72
1558 72 228 541 -1022 -156 1462 -1027 -854 870 -555 313 -73 -445 636 -706 -404 677 -514
1575 -514 90 -177 -265 1017 -736 -364 1587 -638 -566 996 -406 -55 79 188 694 -1041 215 809
1593 809 -1128 150 696 -976 70 -150 -214 425 -902 -121 739 -981 -53 124 -88 339 -767 176
1611 176 1229 -998 -108 1307 -536 162 275 432 471 -468 429 706 -1005 360 652 -808 810 -201
1629 -201 -381 584 -547 -18 138 -546 213 -227 -408 705 -401 -178 763 -479 298 162 -677 861
1647 861 105 -229 695 -131 280 -154 -181 981 -145 -652 962 -210 -846 577 22 -116 -142 -140 570 -843
1667 -843 -434 687 -942 -475 663 -271 287 82 -346 891 -372 -519 1016 118 27 1 217 572 -662
1686 -662 -251 1401 -749 -662 1200 -92 -514 -382 114 691 -1082 -417 933 -546 -144 236 -71 330
1704 330 -352 -570 978 -403 -377 606 -13 -40 -168 -218 882 -228 -510 982 -407 45 560 -519 336
1723 336 201 -475 441 -49 -101 -149 -543 752 -103 -1178 1031 -1 -625 176 -44 -6 61 -477 1089 219
1743 219 -550 349 143 190 305 -671 849 361 -826 737 217 -612 262 223 336 -464 -850 588 -91
1762 -91 -694 614 -449 -820 481 -122 -5 30 -43 699 -339 -134 657 -414 -161 673 -526 451 101
1781 101 -497 1013 44 -784 607 65 -249 58 -185 630 -242 -757 893 -468 -511 521 -208 -415 -43
1800 -43 -261 400 -410 -483 727 -115 -23 218 -581 64 192 -254 754 121 -354 462 -224 345 226 -220
1820 -220 405 -259 -544 504 -755 -260 613 -793 139 212 -683 189 -213 -69 26 -476 379 210 -811
1839 -811 561 10 -477 299 226 267 3 -446 681 29 -668 529 55 -344 60 -474 323 144 -720 515
1859 515 75 -741 332 267 -282 -480 -532 671 272 -817 969 98 -582 369 -72 390 94 -356 624
1878 624 119 -361 277 -65 -26 132 -522 367 158 -977 199 -80 -461 -89 -70 276 218 -500 234 210 -299
1899 -299 288 -266 201 459 -520 159 714 -382 -47 -45 39 251 -376 444 351 -605 32 231 -563 238 -74
1920 -74 -393 107 -446 58 196 -326 12 -258 -155 410 -171 -179 151 -207 245 147 -230 437 -12 9 556 -221
1942 -221 375 -66 -458 351 12 -351 529 -174 -291 175 -398 57 155 -590 255 -515 -259 315 -838 391
1962 391 508 -838 298 282 -378 -192 -39 319 198 -252 466 788 -273 145 226 -279 202 -554 331 563
1982 563 -805 32 372 48 -246 -102 233 -7 -711 238 266 -833 214 461 -135 -7 -120 -9 179
2001 179 -428 224 166 -515 322 49 -189 345 -307 -45 305 -597 70 -97 152 -8 -229 82 69 -569 473
2022 473 202 -596 300 -86 -238 379 -10 -20 372 86 129 -231 -64 410 -531 -9 839 -384 -122 296
2042 296 122 124 -296 -75 492 -803 -188 524 -520 -301 26 -72 313 -635 -94 767 -481 -219 363 2
2062 2 165 -40 223 391 -676 22 640 -557 170 457 -103 75 -208 79 82 -479 -145 387 -317 46 148
2083 148 -268 328 -264 167 383 -330 153 129 -558 42 39 -261 200 -61 322 140 -589 600 324 -465 329
2104 329 46 -122 224 -128 65 -55 -458 548 11 -354 53 -17 -129 22 -140 230 -200 -181 320 -139
2124 -139 -78 498 73 15 116 -95 402 -166 -152 377 -168 -238 691 111 -158 -303 110 317 -355 -170 627
2145 627 -390 -416 270 49 -206 -322 245 690 -367 1 358 -335 -111 345 -21 27 -234 208 826 -291
2165 -291 -139 757 -55 73 178 93 271 -519 -35 194 -272 117 132 -477 271 130 7 -38 -205 141 -86
2186 -86 -353 179 43 -272 130 57 -118 72 -116 173 24 -407 339 179 26 223 -4 46 -31 -382 474
2207 474 -55 -417 368 28 -428 231 125 -273 -170 100 423 -163 -480 695 -45 -286 110 216 -24 -257
2227 -257 -121 399 19 -201 512 109 -3 -82 21 157 -404 -186 233 -154 -97 14 -173 -141 242 -103 13
2248 13 -92 -131 299 -495 -30 256 -300 -64 -106 76 157 -196 44 410 -595 97 589 -4 -126 -151 146
2269 146 117 -487 57 249 -580 -101 483 -263 -4 -169 21 78 -429 109 194 -315 341 -105 -165 20 -133
2290 -133 54 -60 -128 217 146 -261 729 -7 -315 50 205 -66 -66 -220 223 -155 -612 11 52 -218 -320 -25
2312 -25 217 -154 -629 402 4 -385 -51 31 -47 -12 98 406 -127 -290 331 -86 -350 184 -84 202 -16
2333 -16 -280 381 -46 -269 177 -215 -73 107 -101 210 37 -122 419 -134 -16 32 -164 56 46 -213 -126
2354 -126 138 122 0 -249 202 418 -258 117 153 -98 346 -218 -109 26 46 -26 -43 -172 -118 362 -159 190
2376 190 -116 -50 148 -289 110 82 -96 58 -66 116 -9 -14 172 152 -211 276 291 -113 96 51 80 -184 -259
2399 -259 164 75 -489 -146 -300 -250 254 45 -176 248 -400 45 46 -249 -33 -124 -108 -37 -16 101 56 -153 57
2422 57 -58 -301 125 -25 126 217 -188 105 45 -200 71 -208 -347 131 141 -174 6 -47 296 131 -138 46
2444 46 1 -264 -95 -157 -184 356 -153 188 -201 -146 218 24 150 -130 -43 -71 264 -18 42 -36 -65 164 -235
2467 -235 -20 41 -116 -298 -7 -100 9 -318 161 -12 -168 370 56 -296 -307 -193 -1 150 -107 17 337
2488 337 -167 -43 148 124 -206 -103 -24 277 -277 -145 127 -211 -269 -70 -14 56 -57 290 157 -356 -71 0
2510 0 -78 297 -179 -8 235 -61 113 240 43 -181 67 -77 -120 -111 -98 249 -186 133 -165 -186 69 -99 192
2533 192 77 -250 49 25 -155 299 -218 -150 326 32 33 -12 -108 -135 179 -122 143 176 -81 220 -84 -37 -36 72
2557 72 90 79 -89 198 -222 149 80 -26 57 -94 104 -24 -67 -192 222 -218 -169 150 -307 122 -96 -140 35
2580 35 -450 74 151 214 -129 128 55 -37 15 -57 -31 -101 82 21 -1 205 -160 -146 -76 -33 209 242 34 -91 -1
2605 -1 -104 100 108 146 -143 23 199 42 -359 -64 -265 89 210 -121 159 260 -341 -88 222 -56 81 -4
2627 -4 81 14 -246 112 46 -466 172 43 -308 135 -139 -80 141 -28 7 383 89 -80 -90 -125 70 -61 48
2650 48 105 189 -27 -89 -56 46 -100 -188 101 -10 -107 -268 165 8 -316 55 228 -152 -288 264 -49 -65 -17
2673 -17 85 163 5 -103 158 -9 46 75 -222 284 10 -206 290 99 -298 25 -106 -78 -186 106 167 -186
2695 -186 1 266 -68 -47 199 -41 -60 -12 48 55 -120 66 205 -46 102 23 -100 114 -16 -140 343 -92
2717 -92 122 -1 -289 172 130 -9 112 -86 17 -136 -96 132 191 -10 128 6 120 -124 89 -67 -118 25
2739 25 -96 -148 -317 118 52 28 66 -174 0 -182 25 321 -50 -74 284 123 -220 269 -171 238 -42 -125
2761 -125 -60 -179 -175 60 48 -12 -34 -192 26 140 -173 294 -142 -222 25 13 -37 63 -12 -172 -148 -212 -1 -205
2785 -205 -77 -120 -116 -59 83 9 13 -352 -40 144 22 85 19 -109 165 -54 -210 409 7 -152 -12 -1 -45 137
2809 137 73 41 -34 -167 -141 113 112 63 32 254 -218 -185 87 -90 -119 20 -86 -51 -259 -35 5 -232 91 -229
2833 -229 -33 185 -163 26 168 109 25 123 164 110 -47 163 -120 -235 -91 -14 -139 1 66 13 155 -137 -146
2856 -146 178 56 -149 216 -153 -148 61 -112 -158 115 101 -293 -131 -70 -99 395 180 -101 17 15 42 40 175 36
2880 36 143 48 27 103 7 80 360 -128 -223 57 -146 100 -174 102 120 -133 78 -34 -20 -176 203 132 -132
2903 -132 -130 60 14 209 -82 78 -18 82 -20 -134 353 -215 5 -132 63 14 -71 46 -75 253 -250 -52
2925 -52 90 16 -124 103 175 -216 -180 133 -270 87 47 122 0 124 -17 27 222 -123 122 128 -11 48 -16 15
2949 15 -108 -163 158 176 7 -118 -59 141 -163 -177 68 -143 -69 254 -60 -514 -27 -39 67 221 8 -22 32
2972 32 43 -28 248 64 6 95 -171 -92 121 37 -87 -170 156 120 128 145 -8 68 51 160 -105 5 -26 35 -81
2997 -81 27 93 30 -37 40 -199 -162 -144 -114 0 -114 -225 -50 -1 -28 -8 -24 -108 -245 151 126 49 -392 -10 22
3022 22 242 21 -148 281 37 115 272 13 -112 149 -22 -229 -73 42 96 46 -68 374 147 -302 -99
3043 -99 -13 -133 39 -159 70 122 1 73 166 -51 218 -214 121 -15 -27 54 -247 145 12 61 -51 -18 131
3066 131 -163 -21 144 61 -68 -125 -373 -62 282 29 63 250 -149 17 81 -210 4 16 -40 -5 -188 41
3088 41 94 -29 -16 38 122 149 -55 37 -73 -415 -330 123 -87 63 -9 56 55 153 72 -332 -23 -155 13 -15 166
3113 166 -109 211 136 -177 -171 -208 -58 244 -29 -190 65 -4 27 -67 140 -57 -37 -190 160 -396 149 54 -207
3136 -207 -16 2 197 145 177 -54 254 -222 -21 28 -134 104 153 -115 239 221 68 56 -188 -14 266 -25
3158 -25 248 -273 27 110 -117 -29 117 28 177 72 26 -120 -265 -182 -26 -253 248 162 83 -67 -25 -17 148 -25
3182 -25 24 54 71 36 -19 63 237 -194 -45 3 103 54 -287 4 -70 -197 -84 103 -242 -126 -299 -2 155
3205 155 68 -142 -55 -76 121 -88 -21 3 -105 73 147 -209 -17 206 -115 -74 14 100 123 -186 -40 -16 235 -116
3229 -116 33 -227 -39 -5 1 -65 -123 66 260 59 174 81 120 -70 -391 -148 -168 -36 -84 -137 51 110 -15 48
3253 48 -224 31 69 -76 -242 33 -90 -7 -9 -5 85 -10 -110 -99 128 302 230 113 -113 -10 -27 128 -250 116
3277 116 -18 -96 -15 -84 6 -38 37 27 115 -156 27 -341 94 14 -1 -80 -77 -79 139 47 35 79 106 -182 -169 -144 63
3304 63 -79 -8 68 -56 -216 -94 237 36 -74 73 -10 -163 -64 -9 194 10 29 135 -52 -7 168 -25 174
3327 174 120 19 307 190 -207 245 -197 183 34 -39 48 75 67 116 19 -158 218 -287 -68 -80 -245 -241 -74 -148
3351 -148 217 252 63 -33 295 44 41 -137 75 126 147 -28 -155 106 119 94 107 -50 -115 -31 291 -80 128 -174
3375 -174 -157 136 -24 77 77 -123 149 20 -265 -57 -157 111 -90 38 208 -132 -194 -20 -230 -247 125 -86
3397 -86 -14 164 104 -77 84 -37 212 290 -135 -18 -125 89 39 23 -74 -129 39 -148 136 -224 -17 -89 139
3420 139 78 -147 30 -25 -70 -175 -18 149 -265 -179 33 -126 -159 44 -168 98 26 -57 78 -67 -181 -203 16
3443 16 26 156 -207 123 106 75 142 -139 190 93 36 218 -78 -187 5 327 -72 -76 -77 84 173 52 -40 31 280
3468 280 -172 -148 173 -53 -52 82 -268 163 -96 9 -40 168 129 -217 -124 99 97 14 -358 28 -212 -149 -127 -79
3492 -79 68 -92 162 -256 20 160 287 27 -11 -276 -23 -83 104 147 218 -24 262 159 -87 -29 -42 -35 -6
3515 -6 180 -152 78 -124 -218 154 135 172 -15 -133 216 225 133 133 7 148 219 176 122 -25 -72 -6 31 56 27 -9
3541 -9 -27 -66 -219 81 -163 -115 111 -159 187 33 -14 -28 152 -90 -43 -63 -124 -83 -149 -142 -88 -204 90 -322 19
3566 19 114 -148 -16 -14 -57 -87 11 106 -41 -99 224 -75 53 262 43 -129 -27 -35 -105 47 -76 31 -140 291
3590 291 59 -72 -95 -209 2 -184 -232 91 -107 131 -125 -53 -1 -92 -241 12 170 -184 -64 233 196 -33
3612 -33 -4 -56 55 -38 110 232 62 -161 25 22 -158 -47 61 31 -2 108 214 -333 -86 14 132 -29 38
3635 38 -149 -58 350 -168 -248 -18 -179 -95 -62 -130 -226 55 91 -102 186 -112 87 -66 200 -41 31 60 -162
3658 -162 -228 37 149 41 216 13 26 -110 134 23 31 251 -51 241 177 -277 128 -95 -55 -15 -37 -136 57
3681 57 237 -105 208 -8 146 67 72 114 -182 89 -218 -88 -36 117 138 59 42 199 172 -41 167 -36 -96 6
3705 6 246 -203 -137 -147 175 -231 -124 -76 -205 128 -230 284 -179 76 17 -106 127 -80 199 12 -2 -182
3727 -182 230 49 -62 9 322 -29 135 -1 130 -230 54 160 -125 -17 35 349 51 -248 50 -57 28
3748 28 295 -155 35 20 -143 88 90 130 214 165 -270 93 190 -27 160 -278 91 -87 -1 -109 12 -27 93
3771 93 -95 -95 101 -168 34 -280 120 -86 -129 -217 -174 -1 -108 43 -67 41 -134 7 -241 79 123 130 -57
3794 -57 229 94 -153 -129 245 141 -51 16 226 258 66 -146 -217 -307 247 -72 66 -168 -128 -119 83 -87 149
3817 149 -28 102 177 187 -80 57 280 53 314 -102 -115 85 -44 211 -141 -27 17 88 189 -13 8 120
3839 120 84 -111 -155 199 53 158 -92 -3 92 -139 51 -15 -16 -29 32 -212 -43 -147 240 -32 -150 -6 -165
3862 -165 93 -187 -82 -54 -139 -26 130 -95 132 12 -12 156 55 289 113 -85 139 72 170 244 -28 69
3884 69 188 -20 23 -142 -118 -210 22 -144 -108 -37 -116 17 -37 -114 -84 38 -18 -109 -4 -55 56 42 53 -48 17
3909 17 167 -158 291 -113 -18 214 68 104 -136 69 -76 -40 76 117 29 163 -45 -134 -285 -2 133 -144
3931 -144 -179 115 -122 -243 29 -83 -53 215 -190 147 -36 -49 -176 -10 -49 -80 82 76 -39 -130 6 188 -167
3954 -167 -174 38 53 16 -38 -163 187 53 -166 14 -60 -69 14 -173 -6 83 238 182 -108 -71 89 94 178 138 -7
3979 -7 -13 -50 -130 62 51 201 -165 -180 236 -139 -89 -264 64 -132 88 -82 -189 210 -80 68 -64 132 111
4002 111 139 78 -76 -127 225 -3 -11 181 20 -16 -24 56 -285 -143 53 -98 -281 -47 65 22 -158 -110 2 -196
4026 -196 -8 -36 303 35 7 90 -101 -228 47 -19 -160 80 29 -99 46 -26 249 62 32 112 -8 65 14
4049 14 187 -110 111 273 57 70 -74 105 -141 -154 254 105 -50 72 102 -98 13 -7 48 82 206 107 -56
4072 -56 150 -24 -26 -39 44 147 189 -38 -101 -16 207 -87 -120 -76 66 30 162 -93 264 112 -79 -162 220 -213
4096 -213 -233 72 -226 2 1 -152 -143 -99 250 -193 9 249 100 133 -12 51 46 -96 -261 -60 -40 -138 96 -83
4120 -83 252 119 50 -13 -46 -42 44 -63 -130 137 -42 195 -131 -150 58 159 173 -28 41 186 25 -226 349 -87
4144 -87 106 20 -48 -119 -264 -153 9 -133 -236 198 12 43 149 -97 -161 207 -226 -4 102 -13 26 128
4166 128 -258 -143 43 204 160 32 -68 -70 -2 107 17 -19 33 -506 61 18 19 -160 -119 -256 -13 -157 21 -139
4190 -139 106 292 -35 -25 21 120 248 -155 -54 258 189 -74 92 -139 68 -206 4 21 -24 -69 -38 281 249
4213 249 -74 -149 -133 -95 -199 98 79 -120 27 -314 90 -21 -4 -5 -168 120 -236 -121 160 -160 96 241
4235 241 8 -94 35 -144 13 -72 -78 -229 16 371 -41 -88 118 87 -6 -149 -36 -228 156 32 -305 -153
4257 -153 -93 -117 -30 -26 142 -45 -60 166 200 -164 -37 12 -219 17 9 20 193 -109 -73 55 143 17 -109 -74 24
4282 24 34 -75 -118 -103 79 -174 7 122 118 268 162 -149 59 -26 40 43 -283 131 -12 48 50 -49 -198 -47 -10
4307 -10 194 126 227 135 -215 67 -173 -58 -86 -121 347 129 -78 48 145 -75 140 -60 -96 -52 6 -217 -117
4330 -117 74 108 92 15 -39 127 -159 -242 -160 23 214 -207 252 -252 141 -65 -102 36 73 -186 -342 279 38
4353 38 -109 -136 26 -66 -135 270 42 -49 -223 -52 -93 -92 163 -51 -81 -195 87 150 322 7 -85 38 196 128
4377 128 -40 -183 121 124 169 159 -301 72 -57 -118 -41 28 -241 26 -393 -213 152 117 -9 229 106 -165 35
4400 35 132 -76 -58 52 75 -48 129 -137 58 80 -26 -18 -87 -122 128 -12 99 178 -92 259 -71 94 189 176
4424 176 -21 14 58 5 -56 41 -243 -41 -55 -10 -126 84 124 -307 -175 -19 -70 36 -7 -10 331 -35 -249 206
4448 206 -130 42 30 191 65 -9 -184 14 -202 -99 4 65 -120 -91 234 171 -104 -42 69 99 -92 177
4470 177 -54 50 -95 8 61 -203 -190 146 87 -63 40 3 125 -261 -211 15 -150 -26 251 12 239 -94
4492 -94 -35 -186 -40 11 80 62 -93 -42 -229 169 -13 -67 22 13 91 95 -59 285 -210 158 133 -63 -33 -102 -117 178
4518 178 -81 -104 182 2 -10 -86 -159 -189 266 -127 239 -220 9 -135 -26 -36 -26 -68 43 48 24 -306 76 250
4542 250 88 -62 -21 -74 23 3 -80 38 30 -37 79 121 -174 -145 53 228 -73 -115 -73 -95 -71 209 -200 129 71
4567 71 1 33 208 -5 -236 356 239 59 10 -368 160 -172 -120 41 -55 -77 112 131 -260 -67 176 104 19
4590 19 -162 142 -43 -111 120 11 -159 121 65 -192 57 -177 -75 39 -110 157 -71 -100 86 -76 42
4611 42 -163 -12 -1 -31 -28 210 -45 213 181 -72 -81 -96 113 101 168 349 23 8 196 36 91 -297 93 -99
4635 -99 154 -62 -157 -156 11 50 29 72 233 -31 294 36 -261 157 -96 143 -123 233 -45 78 -26 206
4657 206 130 -67 110 -11 -236 -179 60 -107 70 -145 88 139 105 80 -201 13 -154 -173 -142 70 -28 -104 110
4680 110 2 -238 -438 106 183 14 -120 72 115 -150 -283 -13 74 -79 117 -220 12 73 46 -43 137 203
4702 203 51 -11 -36 -10 -50 -14 255 170 134 -38 -123 347 -273 -151 -61 49 -28 -198 214 -241 -95 -265 12
4725 12 14 49 -147 -109 -85 72 111 283 175 -21 4 12 106 -112 -100 157 82 -184 159 37 9 21 262 -29 -126
4750 -126 -339 261 -109 -238 87 71 65 -150 -114 -17 71 78 -119 -128 -266 7 -103 -27 -154 -143 16 70 -160 -390
4774 -390 103 11 72 -95 -70 34 -191 -32 -173 -148 -105 -101 127 23 -54 -224 87 -324 26 -49 280 18 165
4797 165 -95 -81 -87 95 28 -92 -103 -123 4 36 79 177 -41 -7 35 -65 0 -136 -124 174 19 43 87 -41 5
4822 5 -32 -117 -193 143 -138 12 -24 28 -204 3 95 -77 -53 108 -8 -149 84 123 49 81 158 136 -63 -261 -87
4847 -87 -94 -10 180 6 -23 -108 -345 -122 -147 -178 -109 32 137 -178 36 -36 90 -32 -50 -25 257 -13 105 -128
4871 -128 221 -190 -49 -68 -204 109 -70 60 -119 -7 43 -51 -128 -193 5 367 234 110 127 2 -68 232
4893 232 31 64 27 70 81 44 -37 45 -86 -270 -40 64 13 -164 10 7 129 60 280 321 -149 -75 107 -30
4917 -30 -183 126 11 -98 -142 -59 -64 16 23 -17 -154 -150 -126 5 -202 12 17 69 65 140 93 5 88 36 187 -32 110
4944 110 203 -182 -283 -104 -77 410 -61 -241 -116 -23 -242 -242 -331 -101 151 -324 -21 -62 -301 37 64 -89 19
4967 19 175 50 105 -338 73 -267 -60 208 73 -10 -125 -106 55 179 -165 55 23 192 125 112 140 33 -222
4990 -222 -100 201 38 -349 -219 -9 -7 -211 237 105 -146 137 -117 116 101 -125 -2 -238 92 25 265
5011 265 209 -82 246 82 158 338 -41 28 334 14 -63 -142 -12 86 3 67 -331 108 -183 21 -163 63 -7
5034 -7 224 -4 155 10 -288 -22 65 -31 -259 -5 1 -31 -70 23 -82 -43 -114 105 -9 33 -35 256 1 -31 -42
5059 -42 -120 -44 25 10 242 157 -13 -32 -42 24 46 -55 3 215 108 -64 204 -159 170 69 -9 -95 -174 155 52
5084 52 -140 -55 146 -158 336 61 -126 489 64 -114 -112 197 -131 -226 31 151 -64 144 21 28 -157 -26
5106 -26 123 194 228 -182 38 -43 -73 67 7 -113 -148 41 14 -160 -38 306 76 -73 -60 -90 173 -1 97 358
5130 358 -352 74 146 -179 -106 28 -60 231 66 -38 -136 -206 110 94 -61 -58 -23 203 -113 3 -135 55 -130
5153 -130 69 25 37 49 -70 -255 -142 295 196 74 19 122 -148 102 190 -207 -219 97 -148 -1 25 -139 47
5176 47 30 -260 73 45 68 119 -214 24 -34 -247 -176 55 -179 -101 35 48 1 -293 -15 74 -116 -152 128 -33
5200 -33 -305 33 92 -170 200 79 -75 63 -86 172 175 111 -20 -91 -64 -123 79 -245 -91 -134 38 61 -3 96
5224 96 -89 -45 -159 136 58 112 273 13 -236 -182 79 309 -269 -95 -7 145 53 -17 57 60 -51 94 86 -71
5248 -71 -52 -121 -59 -243 143 -282 100 124 139 177 86 -214 -230 -64 81 -50 -86 162 -4 10 131 -220 -154 68
5272 68 75 225 61 15 -125 -25 -1 164 -71 -107 69 -6 -56 -28 -78 -166 60 -45 169 -61 58 10 33 -27 115
5297 115 -109 78 -269 55 8 -135 72 -144 246 -110 116 170 2 42 126 51 134 -62 78 -76 166 158 163
5320 163 153 187 0 1 82 9 50 51 -71 -93 76 221 -53 181 1 9 153 -163 44 150 -19 193 21 34
5344 34 37 19 153 -141 45 156 209 340 47 76 38 11 13 73 70 -161 -49 18 53 -90 -126 249 -102 -80 -194 62
5370 62 288 89 -186 106 -387 -214 -54 -162 42 251 114 44 73 -22 87 -243 266 -103 -150 30 48 -50
5392 -50 -89 -93 85 -266 -28 -352 -40 -114 33 -149 -43 44 -57 382 91 21 -361 -207 121 -121 -134 -22 -47
5415 -47 126 54 197 159 48 -268 75 25 38 -167 -44 257 -104 125 -121 78 84 -1 -24 5 -29 32 -200 -139
5439 -139 169 -94 39 201 -32 -99 131 49 229 88 10 43 20 184 77 45 20 -12 -123 134 -217 126 100
5462 100 -61 -211 42 -87 -79 -1 -93 105 230 -160 -89 -104 20 13 -111 115 -201 -28 -63 147 -80 -182 -102
5485 -102 -9 -177 235 -265 -118 -213 58 -165 66 50 180 23 49 204 188 131 -142 -260 -163 -21 -163 198
5507 198 28 -39 -190 -176 -28 -184 -89 -67 119 43 223 -151 114 26 135 182 23 123 101 68 80 -42 -163
5530 -163 -91 45 150 93 22 156 -151 -66 110 63 151 25 102 -254 65 148 255 169 -71 276 -328 10 -55
5553 -55 -54 103 56 56 -144 101 -73 -66 41 168 11 170 -11 40 -28 -154 93 109 16 83 -245 89 51 -81 26
5578 26 87 274 104 96 -101 143 -1 100 13 -261 189 -192 -224 -139 70 -255 102 -407 204 26 -134 -162 292
5601 292 -81 54 -68 82 -237 -105 -255 182 -29 69 119 18 -20 -27 25 65 1 219 101 -180 78 -383 -123
5624 -123 94 50 -178 -36 -95 222 -137 199 -127 -23 3 42 237 83 -30 203 197 -118 107 -30 -3 28 146
5647 146 -14 274 -148 -215 205 79 -321 -6 -106 122 -97 -65 43 -50 -81 96 210 15 -27 -326 -76 11
5669 11 156 -1 3 -216 64 -377 135 171 -29 -307 89 125 160 -47 64 107 -101 -167 142 278 29 -44 -90
5692 -90 -27 -9 -24 -36 132 -77 -77 -40 97 -115 141 101 108 -58 -130 184 -375 -12 -263 107 233 265 -11 -198
5716 -198 -33 114 -86 -47 157 -247 -239 -3 -96 -217 294 -39 -139 -200 -31 123 23 -165 -77 236 -108 -189
5738 -189 -106 -99 -74 -46 -147 38 -93 -30 116 40 -39 192 -260 -364 169 66 163 -101 66 123 15 144 334
5761 334 -53 45 57 233 5 -37 -85 231 185 -153 -180 -246 158 -48 129 21 -39 -17 122 -117 -60 -83 96 202
5785 202 64 118 109 -110 -40 188 54 33 -141 -162 -124 184 78 211 45 197 -155 -113 177 110 -175 13 33
5808 33 128 -15 314 -30 225 -87 118 97 -120 145 -344 255 -67 -6 -136 -62 -28 97 28 54 180 -196 -70
5831 -70 28 58 10 -97 -241 26 130 -192 156 -107 114 -203 195 139 29 153 -313 -55 259 92 56 48 -95
5854 -95 -173 -32 -17 177 138 -236 -2 220 -300 -105 -100 228 -82 206 -62 233 115 147 -168 -50 41 -179 163
5877 163 155 21 75 -60 -122 -70 -241 242 -48 -9 -110 -61 -98 -62 -85 26 301 -168 -124 44 -246 -26 47 -167
5901 -167 45 -69 -387 159 -29 5 173 4 -82 -20 44 -64 8 -47 -205 -145 -159 90 364 -53 -52 -6 13 88
5925 88 89 -87 -10 27 46 -51 194 45 58 101 -45 -78 -259 -453 91 -182 152 323 202 -211 31 -14 237 14
5949 14 140 144 106 -185 -140 13 -69 13 62 40 -137 -82 -237 -102 -57 -198 -72 190 5 -49 57 42 275 -205
5973 -205 -124 -64 154 197 160 19 -171 -103 -50 285 -77 208 62 -89 30 -108 15 -249 -203 -105 -58 -60 7 -12
5997 -12 44 -21 -164 -81 -116 202 -13 -115 -110 130 182 -144 -44 55 -131 26 -108 27 114 -213 -180 -186 -161 -4 156
6022 156 94 176 -209 119 51 126 -126 -127 -15 106 -26 64 -47 -50 -174 157 -150 143 -293 80 29 97 -37 52
6046 52 203 151 229 6 198 122 8 -94 52 -119 228 -129 230 131 -20 220 -142 34 -6 -100 -94 -34 -116 89
6070 89 74 -91 -17 180 -139 -93 -65 217 -160 -45 98 -81 -59 130 113 3 129 202 -177 -86 191 78 38
6093 38 115 109 210 29 -206 203 182 90 -164 84 -302 158 54 227 9 -55 -11 69 -161 -172 40 60 5 16
6117 16 241 130 27 -97 -167 -309 -99 -32 14 88 74 -270 -79 15 143 6 8 13 81 124 119 -188 -1 -16 -84 60
6143 60 146 -22 -114 11 -98 -29 13 -102 72 20 121 76 -14 -67 -15 -8 -28 -5 -113 71 -34 232 221 -97 -225
6168 -225 59 64 57 -268 -80 243 276 127 -78 56 106 250 147 87 -233 124 150 -107 186 173 250 304 262 -85
6192 -85 -248 -140 -295 177 -193 -45 -111 -167 67 -79 -73 -329 364 -135 80 60 69 294 -135 35 152 -80 -241
6215 -241 -79 -68 28 -75 92 180 42 -27 -242 10 202 -76 -217 224 -57 -215 98 -133 -47 44 -15 -60 35
6238 35 87 16 155 -249 323 -95 -237 -74 48 119 -30 126 -9 154 100 -294 -265 34 73 154 -57 346 78
6261 78 -25 188 5 -49 97 -63 55 -86 77 59 -122 -55 274 37 -182 149 -103 124 -19 -12 -37 230
6283 230 -105 -238 -157 87 27 42 121 127 -139 -340 -111 -203 15 1 159 -1 233 186 -12 -114 148 48 104
6306 104 121 -9 145 -120 121 -237 -110 -166 -84 10 -138 -142 -168 128 78 -3 -71 10 171 133 -126 -52 66 65 -74
6331 -74 -65 40 -162 337 -344 93 61 162 -2 157 195 -111 -25 -61 -172 74 138 231 17 238 -4 -5 99 -152
6355 -152 100 230 -47 52 -139 -22 132 90 -135 57 -147 181 19 -141 181 71 186 -135 126 47 11
6376 11 -121 283 19 37 -215 -233 112 155 -45 201 -20 61 97 76 83 -26 -55 287 135 36 166 178 59 11
6400 11 -90 -53 13 -102 -13 -213 -132 -207 210 109 25 27 -34 -151 4 -110 142 -181 -169 204 -1 9 68 142 301
6425 301 31 91 141 -312 -165 -251 -78 233 74 217 -131 -202 165 -2 32 66 -222 -180 223 -130 29 34 312
6448 312 80 45 -48 -202 109 302 90 -41 24 -72 237 159 -226 59 17 -202 -59 27 59 -26 130 -103 24
6471 24 306 115 79 413 100 152 48 29 -56 -40 170 64 -225 -173 -220 53 137 -55 -6 -186 -41 82 -57
6494 -57 -156 -279 216 107 -168 92 43 -240 -235 2 -294 134 63 -39 -173 -126 163 -35 -172 -116 -202 -61 -153
6517 -153 174 -12 57 -37 76 65 213 10 28 -127 14 -65 -98 -275 66 70 0 87 -104 278 116 171 -208 91
6541 91 211 -123 99 207 -118 -97 -92 -3 104 158 -61 224 110 -8 175 118 143 156 113 148 -36 -221 33 -14
6565 -14 11 103 -31 149 4 -64 286 71 39 -113 75 14 91 165 -51 170 -7 -25 13 39 -70 128 -121 -168
6589 -168 -138 276 40 80 -21 -18 86 220 173 17 -6 53 181 14 -12 150 -287 13 48 -101 -163 -144 149 75
6613 75 23 -19 99 9 100 2 -10 -79 -24 195 -199 -204 2 -169 -52 220 -84 -26 -31 124 124 76 182 -75 -15 -79
6639 -79 -49 35 31 -209 220 -96 128 106 59 183 123 156 -78 -58 97 -32 122 274 -24 67 72 0 36 -137 -27
6664 -27 -231 -62 113 -106 -141 12 40 -137 -135 297 56 -141 -147 82 -103 -175 -106 -24 -177 -146 -142 159 -171 -74 95
6689 95 -44 211 225 245 -191 178 -50 -137 189 -22 97 232 47 -280 -49 -16 23 146 -32 -158 111 -305
6711 -305 27 -84 118 -75 -18 345 167 53 82 -70 45 319 88 -69 42 -119 -95 -53 66 195 -127
6732 -127 -338 159 9 -159 206 36 -113 -19 -135 2 33 -104 94 -11 -182 14 7 -281 -112 188 77
6753 77 -268 139 38 73 104 -50 87 92 -30 -144 129 193 4 32 37 -122 -192 69 -62 130 -168 -211 180 -118
6777 -118 -97 -13 197 36 -130 103 293 55 -164 -49 -20 -332 132 -86 205 90 109 27 -67 151 252 -177
6799 -177 -92 371 228 -4 -426 142 108 -28 0 -106 54 -27 -200 -3 -269 55 -65 94 -32 -81 23 -46
6821 -46 69 49 129 -188 -97 172 24 22 8 220 42 4 182 31 -162 62 165 -86 148 -69 -134 -260 -132
6844 -132 115 40 72 67 140 -150 81 42 -184 76 -118 274 149 152 -11 20 158 -177 -63 50 -33 -63 336 59
6868 59 57 -33 15 -52 -71 -149 -52 24 -5 214 -74 -70 -135 37 -200 24 65 -325 -203 -149 13 -316 -10 -60 -9 -54
6894 -54 -107 4 -26 12 51 -76 -98 -97 -118 1 207 70 -232 155 -142 -348 -87 74 8 -175 -45 -160 120
6917 120 -155 -138 29 27 301 -102 113 -185 -275 84 -23 -107 -50 115 237 -153 -142 152 121 -87 -217 34 18
6940 18 -200 -202 15 274 -16 -80 -66 261 15 -87 220 55 122 25 46 -75 -177 3 39 2 -30 26 156 50
6964 50 9 -126 25 -51 -16 116 219 74 67 -63 -159 -16 -188 -34 91 54 -135 29 -45 -102 142 259 77
6987 77 -158 54 131 -85 -73 -93 63 -89 -16 -151 -80 -44 -241 220 -97 -121 -95 183 -116 -116 -17 -107 35 -54 184
7012 184 71 80 -66 -116 69 86 187 -58 189 29 64 129 -170 -24 -33 9 -42 38 -93 -15 -45 -140 193 -198 -159
7037 -159 56 13 -41 223 -28 -44 -265 28 35 98 -188 -62 -69 -17 45 -199 -92 13 -189 -78 -121 -200 -137 102
7061 102 -295 15 431 -62 -242 62 188 -68 35 62 -222 126 182 181 181 -20 161 40 30 83 1 86 -53
7084 -53 -6 73 -163 45 -32 -242 -217 -198 47 17 -205 -178 182 91 -195 -141 -35 -61 464 166 -101 -108 -88 113 -13
7109 -13 -96 12 -12 49 79 42 203 20 127 331 67 -142 -61 99 221 -207 -23 430 151 37 83 -166 96
7132 96 -132 98 45 -93 -240 114 -204 -75 95 148 106 -168 -83 -109 0 -121 -101 24 11 121 -88 -167 -7
7155 -7 -196 -39 -93 89 -26 -65 -6 -271 1 238 -194 -9 28 33 96 -135 24 180 -100 -60 -154 50 197 -23
7179 -23 -70 93 -24 -169 -90 -115 291 -282 -132 227 -157 59 -56 162 -91 4 -20 -26 101 123 305 153 37
7202 37 -53 266 34 25 67 158 -50 196 73 65 42 262 157 -22 108 248 -10 134 102 118 -70 -109 156 36
7226 36 65 191 2 -235 -45 -150 -451 -24 69 194 37 -70 -144 17 -88 180 -255 -180 106 116 -226 274
7248 274 -20 134 -110 -124 11 -19 -115 -51 -18 41 -239 -158 43 266 25 -57 -157 -40 255 -22 55 33 -56 101
7272 101 87 23 -96 -39 -54 290 -244 23 161 -138 -173 -128 -177 28 -17 -204 3 -118 -46 31 33 61 -70 -121 197
7297 197 -20 309 187 -27 76 -71 44 -36 -116 -26 173 116 -193 24 -136 7 258 44 -184 19 136
7318 136 -231 14 29 169 -219 -111 174 -103 -11 0 -222 -17 -158 -41 244 121 301 -191 -72 -57 44
7339 44 -51 -73 -103 -17 86 -53 225 -38 17 -113 9 9 33 235 -74 -110 49 -50 55 -68 110 18 -202 53
7363 53 -176 -182 22 -15 -55 -36 -102 36 -134 286 -20 49 -32 3 -183 27 -117 15 202 343 161 32 249
7386 249 4 126 -191 62 -368 -165 -243 87 33 -262 -65 -196 -46 133 14 -182 134 8 -86 16 -161
7407 -161 -229 -169 43 -42 -15 -154 -48 193 -127 -5 38 -109 86 -252 181 -309 -63 124 354 -14 226 -146
7429 -146 46 -27 21 87 101 -3 0 -53 -92 79 -183 -131 125 -131 60 70 -308 11 -216 179 -127 329 -79
7452 -79 -202 -65 -159 118 81 -77 -151 -152 308 32 -166 60 -82 30 118 23 -33 191 -77 -213 144 92 37 75
7476 75 -127 -19 147 -311 111 158 -42 155 2 -102 23 -14 -3 -202 64 437 -79 13 267 56 -98 43
7498 43 -75 -122 -116 -52 38 157 -14 -67 171 200 130 -383 -100 153 -3 -70 150 -201 26 51 84 250 291 -144
7522 -144 8 117 21 119 145 252 -206 -144 -42 182 -247 142 -10 -137 -55 253 -56 26 -59 175 -232 -205 -209
7545 -209 55 36 -30 82 107 170 -251 94 82 62 -77 -24 121 -171 68 -61 -197 -173 65 101 110 -138 -84 293
7569 293 -153 231 -7 -131 46 -178 -55 300 -12 93 -7 -173 106 -132 -11 -181 -78 6 -127 -13
7589 -13 145 -140 76 -79 34 -17 171 121 -39 -123 85 36 204 -53 1 53 -193 -2 167 -61 157 72 216
7612 216 70 -144 20 26 207 80 -153 241 106 -252 148 85 290 0 -317 104 56 -72 67 245 73
7633 73 -39 -154 -246 85 154 2 -215 109 239 -84 -36 158 231 -15 132 -97 -135 94 23 66 149 -136 121
7656 121 -209 140 -272 -85 -126 -94 -93 202 297 76 87 103 207 10 -13 -56 -156 30 116 148 38 -157 116 242
7680 242 96 45 -60 -173 -39 -50 -101 -154 263 63 -60 -26 -59 -256 -113 -54 -132 -67 -164 -52 65 114 -13 -138
7704 -138 5 180 -92 216 -65 141 134 69 103 262 -69 -208 -93 229 138 126 145 -6 17 232 93 16 3
7727 3 -97 -158 -92 50 -80 -65 -62 132 160 -27 -265 128 123 151 -93 28 -84 -94 -67 95 50 -58 -125 21 51
7752 51 -234 370 36 -219 31 59 -58 -71 84 -323 -194 -61 299 55 121 59 -1 -178 -220 160 -278 124
7774 124 26 -43 64 -64 -184 259 39 274 50 -73 -388 -1 15 139 -111 -8 90 -44 -212 63 101 66
7796 66 -168 62 4 -12 74 60 233 41 267 -105 5 72 14 73 17 -150 -157 -54 52 -60 -65 -16 -11 143 -196
7821 -196 34 -239 93 -91 -291 145 -37 -76 174 -91 179 -90 -34 -130 -246 10 -161 15 -180 219 -83
7842 -83 175 230 -73 -187 126 78 55 -224 255 155 -26 -15 -20 165 -317 -200 102 -225 113 -77 -37 129 70
7865 70 -200 53 37 -45 -151 -80 -94 -45 -43 7 63 47 -172 -5 -35 113 -95 184 -104 -22 -7 65 86 -43 157
7890 157 -174 -8 -8 33 270 -136 -94 50 -25 -75 -152 33 162 -62 -60 -166 -262 36 87 11 353 113 165 -267
7914 -267 -120 -57 -185 38 120 -13 6 60 -5 -132 11 110 -38 -193 -35 6 23 -322 33 202 -124 -155 -95
7937 -95 148 39 -182 -4 119 209 128 -76 49 193 -291 65 -83 -52 13 164 -162 -39 -245 -24 -84 86
7959 86 148 -12 -132 -361 -14 135 150 -310 -6 293 71 -37 14 169 -2 -5 141 78 -89 55 212 -63
7981 -63 -180 -130 238 -169 -19 41 -145 17 12 -27 -203 -49 15 157 217 145 -188 132 -183 51 135 -86 147
8004 147 0 156 -239 23 55 120 45 138 -96 -184 110 58 80 79 -25 16 -32 187 -66 -80 -41 191 64 -32 -81
8029 -81 -154 220 -12 114 82 -166 -19 -24 -177 -139 -20 -135 162 428 -54 24 133 -235 -125 -42 69 53 179
8052 179 -212 -5 -113 17 -5 -132 49 23 156 213 40 177 -173 -229 -197 40 -98 -152 53 -23 55 104 -61
8075 -61 26 -73 161 -71 190 -38 7 -10 -20 70 -55 129 -105 -13 -147 70 -145 220 87 115 26 -46 139 55
8099 55 -131 76 -31 239 -263 -127 -112 105 -140 -6 80 -62 22 330 -107 -6 67 145 116 27 -129 -137 98
8122 98 -58 345 174 -162 -71 6 -20 0 183 133 106 45 93 106 45 139 124 39 -174 62 -92 17 -155 -284 -17
8147 -17 -205 -171 -11 15 -191 -197 102 -114 17 68 94 -18 121 -152 -3 -115 -88 -96 68 -239 -78 -134 87 69
8171 69 167 -157 6 80 -120 -15 207 151 -61 -12 -83 69 256 125 101 33 -318 -144 26 132
8191A32
$$ Imaginary data points
##PAGE= N=2
##DATA TABLE= (X++(I..I)), XYDATA
0 0 0 0 0 0 0 0 0 0 0 0 8 -8 8 -8 8 -16 16 -16 22 -24 32 -32 40 -48 56 -64 73 -85 100 -112 126 -142 164
33 164 -183 206 -231 259 -289 322 -356 395 -438 485 -535 589 -650 718 -790 868 -955 1054
51 1054 -1162 1282 -1417 1569 -1747 1948 -2185 2465 -2806 3225 -3755 4453 -5410 6791 -8942
66 -8942 12683 -20387 42115 -218283 -679643 389010 498523 -503025 -297637 533719 130817
77 130817 -497072 14121 449433 -129661 -347618 198230 251240 -222196 -175905 243106
87 243106 116643 -273816 -20323 268716 -90851 -212289 153610 121482 -174912 -64023
97 -64023 180946 6094 -199162 70953 183192 -165853 -119833 223324 35095 -237003
107 -237003 46937 238348 -121172 -206331 208093 133272 -248162 -23453 225039 -47141
117 -47141 -158652 63418 116368 -59180 -104104 65794 83242 -81030 -58562 74868 40522
128 40522 -76707 -38849 92167 7734 -109268 38854 84087 -71805 -38831 72122 15889
139 15889 -62101 127 72456 -29221 -66784 78063 31059 -95287 26324 82440 -56711
150 -56711 -57947 70983 41205 -91566 -20559 101625 -17878 -88363 36755 57574 -29591
161 -29591 -57639 14483 74730 -38650 -84312 76218 60626 -97480 -24871 104369 -1553
172 -1553 -109112 40097 108732 -88737 -70146 129092 12958 -123752 38624 101941 -64222
183 -64222 -83547 88995 59664 -121330 -14304 129739 -45143 -107023 76791 69049 -90734
194 -90734 -52260 101540 32045 -122228 2474 126600 -41062 -110643 64227 97751 -79144
205 -79144 -90794 114969 71967 -148453 -15425 158364 -42423 -131079 82176 96698 -105068
216 -105068 -61917 127574 15541 -136618 40787 109131 -84725 -67300 90611 29282 -89817
227 -89817 -8488 90352 -20634 -85770 53309 57870 -69823 -24897 65306 11809 -59290 -2581
239 -2581 72470 -15181 -74121 48632 59120 -65979 -35829 71734 24455 -79104 -7685
250 -7685 89798 -27122 -83232 58226 47518 -70091 -17422 56784 1145 -49827 7531 44682
262 44682 -25623 -30702 34687 6854 -22922 3596 9433 8296 -9006 -11921 22432 4725 -21866
275 -21866 5586 16668 -1863 -17291 4366 24393 -21633 -17121 35856 -9628 -32291 25728
287 25728 13390 -28715 -6150 26412 -455 -34991 12716 32343 -32042 -14835 34511 -1704
299 -1704 -20373 4195 15445 2458 -20106 5356 24759 -16000 -13028 19927 8559 -15775
311 -15775 -12226 24748 10693 -42344 7564 43807 -32452 -29695 40877 12010 -44116 -4653
323 -4653 47217 -12919 -51321 36694 34089 -53293 -5556 49320 -12356 -36077 17624 33483
335 33483 -22725 -28289 37217 16601 -38676 1652 30810 -4092 -23666 973 29626 -8584
347 -8584 -34213 25026 23172 -35733 -9547 31368 381 -34026 3857 37501 -23420 -33141 42263
360 42263 10963 -45846 10595 34427 -17624 -23982 22211 21478 -29094 -8102 35787 -8332 -24260
373 -24260 18506 10625 -11250 -7603 6202 13737 -13606 -13211 20042 2412 -20040 -810 15572
386 15572 1902 -25208 3019 31146 -21004 -24108 32015 6963 -29658 3079 25577 -5330
398 -5330 -25644 16297 25095 -27075 -9448 30452 -3533 -18491 6476 13142 -693 -16548 3898
411 3898 19184 -13068 -14832 13948 8302 -13184 -12999 16913 11499 -30826 499 31811 -19614
424 -19614 -21578 26472 9186 -25219 -3229 28980 -2874 -30531 20245 22964 -29960 -3199
436 -3199 28038 -6190 -17771 7769 16445 -9351 -16926 17333 8712 -21975 1249 13875 -4533
449 -4533 -11072 -1314 15110 -4157 -22083 15272 15402 -24222 -4242 22495 -1546 -20902 6696
462 6696 25181 -17278 -19727 32455 4806 -31918 13417 22914 -17808 -13029 19009 10068 -24041
475 -24041 -3502 27191 -10747 -21551 17066 8188 -14728 -6359 9369 7937 -15544 -7073 20037
488 20037 -3228 -17287 7993 12542 -5418 -14417 9451 19077 -19359 -9959 28241 -3032 -22051
501 -22051 12886 15040 -12880 -11530 16050 7902 -21978 2923 18683 -15391 -7852 13570 -2632
514 -2632 -7880 -343 4346 1080 -9439 2394 7825 -7138 -1434 3885 1406 132 -6069 6228
528 6228 8738 -13191 1155 14989 -7482 -7163 8355 5892 -7663 -6638 13527 1298 -18391
541 -18391 9169 11033 -16259 -1529 10224 -3536 -7092 1195 6559 -5540 -6609 10307 -1428
554 -1428 -8113 7429 55 -2458 3160 -2946 4505 2099 -7290 6046 5059 -6667 -886 5900 3539
569 3539 -9115 -2666 15575 -7036 -14419 14801 3339 -15599 1590 9255 -2265 -10641 2194
582 2194 11529 -9075 -7598 12029 -1652 -6353 4400 837 1556 -671 -2729 5695 614 -2438
596 -2438 1495 381 3981 -3328 -3767 8999 -3251 -6600 9150 -3050 -6196 6769 -1851 -4602
610 -4602 1967 1441 -2444 -4634 5749 2072 -11502 5611 7742 -10722 960 7220 -3035 -1033
624 -1033 582 3572 858 -4893 4904 2595 -4707 3901 -540 -1479 4586 -5026 -1097 5188 -3980
639 -3980 -1565 1435 -139 -1279 -4032 4375 777 -8658 5727 3133 -9546 5402 4249 -7659
653 -7659 2770 4336 -1887 -1801 1912 4834 -4196 -1206 7676 -3843 -1988 5971 -3871 577 2733
668 2733 -4971 2563 1384 -4269 193 -342 1212 -1609 -4787 6371 -445 -8222 6145 1982 -5942
683 -5942 1486 2329 405 -1882 -762 5264 -2373 -1292 5594 -3895 959 5394 -6117 2060 5251
698 5251 -6084 711 3720 -1866 -2404 -186 3373 -2781 -4587 5662 -2324 -5077 6016 -2629 -3613
713 -3613 4526 -2605 -670 2864 -1169 613 -1093 1742 2826 -4748 2935 4534 -6236 2188 4691
728 4691 -3886 159 1120 609 -915 -3038 3720 -478 -5047 4397 -1988 -3412 4512 -3981 -1374 4990
744 4990 -4438 -1045 4289 -1428 -1835 -188 3788 -258 -5109 6329 2157 -6781 4951 3232 -4774
759 -4774 2678 830 -673 1043 -1740 1857 -830 -2153 3508 -3174 -2236 4520 -3746 -1613 3269
774 3269 -2660 -77 500 -973 1613 -2216 1138 2060 -3110 3067 403 -3515 5787 -915 -4165 6044
790 6044 -410 -3147 2691 835 -932 -2384 1627 3369 -6116 1366 5551 -6978 -392 5033 -4423
805 -4423 -1577 1744 13 -324 -3332 3082 1877 -5671 2731 2815 -3144 1472 -251 1559 2176 -4966
821 -4966 2527 5310 -4522 -1063 3426 1378 -2397 -3457 6242 1157 -10030 4683 6214 -8610
835 -8610 -1137 4653 -918 -3506 -1254 4781 -1995 -5131 5621 100 -4750 3730 224 -900 2128
850 2128 -1718 1965 840 -2280 3309 -276 -1974 2727 -382 178 -725 -1440 4400 -3051 -4069 6853
866 6853 -2156 -6908 4138 2538 -3747 -4116 3726 4613 -8442 -950 10307 -5594 -5280 7239 1258
881 1258 -4134 -711 4228 2503 -6255 1140 6974 -4105 -2222 3653 703 -323 -3302 1647 4702
896 4702 -7043 -1472 7466 -3422 -5033 2611 3191 -2907 -5372 5766 3783 -9751 2148 8599
910 8599 -6297 -2921 5184 1538 -3329 -1882 5897 1300 -6596 4161 4076 -5340 1009 2366 -146
925 -146 -383 -2820 3119 1405 -5323 2277 2331 -4269 -645 1169 1111 -2763 -3342 6619 -701 -7627 6236
942 6236 3589 -7135 755 5308 -369 -4941 1681 7754 -5168 -5086 9079 -225 -6640 3331 3002
957 3002 -1637 -3512 946 5002 -4499 -4097 5883 -496 -4211 788 1724 674 -4272 -325 6413 -4598
973 -4598 -4221 6827 222 -5046 1324 4307 -26 -5425 3332 6943 -7397 -1352 8913 -2971
987 -2971 -4817 3728 2768 -2322 -3709 3503 3100 -6373 331 4584 -3254 -1749 542 1173 965 -4463
1003 -4463 1306 4346 -4639 -772 4349 -667 -1674 144 3174 587 -4658 3824 3465 -5665 1859
1018 1859 4283 -3171 -896 1777 1183 -2480 -2436 4805 -971 -5779 4240 1732 -4894 839 1545 -163
1034 -163 -1894 -1890 4253 -137 -4492 2821 2172 -1861 -952 1116 3995 -2540 -3787 7225 221 -6568
1050 -6568 3809 3660 -3422 -2496 2422 3085 -5104 -2102 6773 -2742 -5448 4743 1382 -3764 -1038
1065 -1038 2301 1855 -4264 -941 5347 -2597 -3128 3857 834 -1286 -1408 1520 4265 -3751 -2034 6132
1081 6132 -1206 -3836 2505 2601 -1837 -3144 2924 3415 -6216 -234 5778 -4271 -2576 3690 -439
1096 -439 -1923 -854 1603 392 -3787 1943 2639 -3969 567 2524 -1050 -186 -38 1824 876 -3625
1112 -3625 2271 3086 -3977 -87 2256 327 -1444 -1977 3941 631 -6099 2794 3680 -5235 -1184 3480
1128 3480 286 -3329 -1369 4293 -659 -4393 3549 1541 -3221 1158 1019 368 -208 -1349 2902 747
1144 747 -2971 2225 1221 -1745 4 441 1750 -2044 -2129 4570 -890 -5045 3400 1714 -3781 -854
1160 -854 2033 1213 -4237 -1020 5691 -2588 -4653 5062 1531 -3440 -351 2334 1875 -3079 -847 4962
1176 4962 -1605 -3193 2798 1579 -705 -2178 532 4046 -3618 -2730 4991 -1181 -3835 2175 1391
1191 1391 -1785 -2144 1913 1586 -4279 691 4212 -3999 -1174 4224 -1260 -1910 1069 2504 -182 -3285
1207 -3285 3368 3179 -5032 84 4327 -1602 -2427 654 3081 -601 -4930 3204 3604 -5144 -1202 4178
1223 4178 -74 -3907 -921 5156 -992 -6524 4260 4593 -5843 -843 5232 -178 -3682 581 4926
1238 4926 -1538 -4353 4587 1809 -4477 840 2920 -529 -2131 -233 3287 -1344 -3719 3339 1419
1253 1419 -3897 -192 1728 34 -2638 -756 4024 -1725 -3834 4314 1099 -4040 1046 2858 -473
1268 -473 -2932 949 4145 -3232 -2106 5210 -792 -3560 2586 1546 -1348 -1563 1339 2166 -3116 -1052
1284 -1052 3758 -1386 -2324 1329 1011 -496 -2631 1140 3147 -3794 -1175 4563 -831 -3159 1661
1299 1661 2281 -794 -2958 2847 2804 -4642 380 4639 -2335 -2254 2274 1432 -1767 -1903 3225 525 -4661
1316 -4661 1584 3014 -3077 -1140 1940 481 -1545 -1917 2644 960 -4220 1119 3270 -2009 -1631
1331 -1631 1771 2405 -2000 -2535 4222 1376 -5092 2012 3556 -2647 -1595 1820 1798 -2208 -1493 3493
1347 3493 -422 -3467 1784 1012 -1982 16 513 281 -971 -1000 1812 -772 -1848 2055 -134 -1192
1363 -1192 903 425 417 -1067 332 2826 -1720 -1715 3296 160 -2188 681 1754 -326 -2928 1195 3325
1380 3325 -3741 -1665 4016 -698 -3093 722 1961 -167 -2770 1418 2459 -2969 -849 2611 -259
1395 -259 -1261 -159 1342 1416 -2410 579 2691 -2006 -901 2144 10 -1053 -687 1446 488 -2966
1411 -2966 1325 1756 -2827 -254 1874 -994 -1163 281 1213 -550 -2152 2053 740 -2509 1135 1250
1427 1250 -1019 -11 356 896 131 -1710 1589 879 -1401 453 687 -11 -579 -491 1330 -215 -2030
1444 -2030 1889 548 -2359 838 495 -829 -781 -244 832 -1333 -1050 2410 -687 -1660 1782 -66
1460 -66 -559 399 137 889 -771 -125 1768 -749 -479 967 17 -205 -184 -153 1182 -1141 -881 1815 -805
1479 -805 -1291 811 275 -563 -1092 626 1011 -2066 -116 2235 -1198 -663 1673 26 -195 -314 784
1496 784 985 -1327 440 1586 -707 79 285 48 550 -961 -138 1310 -1439 -498 1051 -626 -590
1513 -590 -674 138 763 -1678 287 1520 -1613 1 835 -442 507 -100 129 696 -581 383 382 -300 1073
1532 1073 -545 -758 1582 -509 -562 1112 -225 355 151 -411 789 -625 -897 462 -202 -104 -308 -714
1550 -714 1155 -182 -1227 1088 206 -796 8 667 470 -676 -391 1856 -351 -943 1330 -11 -388
1567 -388 521 -356 759 116 -612 509 -87 -326 141 -541 337 -591 -1198 1246 -299 -1034 991 -52
1585 -52 -493 322 237 365 -345 -129 1335 -773 -367 1043 -729 64 504 -387 515 -142 -266 1089 -541
1604 -541 -414 503 -449 173 -383 -645 971 -1045 -650 1227 -595 -615 359 4 384 -717 65 1258
1622 1258 -773 -9 1151 -640 441 585 -637 618 118 -516 565 -111 9 -186 -557 459 -182
1639 -182 -907 590 -259 -439 494 -930 101 264 -853 442 68 -241 197 -446 665 289 -871 801
1657 801 430 -994 447 430 -380 105 138 276 -132 -438 1042 -367 -936 932 -199 -277 37 -736 540
1676 540 -54 -687 579 100 -504 73 -81 416 -361 -608 1521 -437 -1043 1329 93 -584 369 335 654
1695 654 -517 -628 1091 -198 -754 660 -332 198 1 -803 681 171 -902 474 -9 -102 -249 -365
1713 -365 680 -106 -933 929 -39 -696 505 -70 108 819 -708 574 481 -283 226 -212 513 450 -935
1732 -935 461 705 -1095 46 309 -166 -165 -405 430 291 -1039 326 214 -200 199 -596 320 478 -930
1751 -930 139 659 -436 308 299 -47 125 -565 619 451 -660 637 556 -1070 861 14 -388 72 -7
1770 -7 264 -86 -923 490 77 -617 323 -198 38 168 -420 594 122 -742 513 338 -139 -24 40 395
1790 395 97 -722 907 15 -979 553 143 -405 -76 -434 223 -192 -676 485 -204 -371 137 -375 -71
1809 -71 485 -729 263 393 -376 393 105 74 375 -491 217 243 -324 699 -241 -295 832 -790 -217 828
1829 828 -650 -64 150 -420 88 -705 145 358 -929 269 624 -647 282 256 -121 86 -182 348 368
1848 368 -612 381 291 -464 146 -72 16 414 -725 593 696 -977 -83 379 -194 -173 -445 524 -123 -1103
1868 -1103 425 499 -823 194 323 84 270 -675 723 396 -403 312 365 28 249 -126 153 523 -369
1887 -369 195 503 -241 51 -12 -7 478 -457 226 325 -546 282 3 -443 743 -598 -429 405 -376 -145 163
1908 163 -29 248 -203 94 870 -246 139 602 -458 125 413 -347 431 -62 -305 355 -427 5 -203
1927 -203 -416 279 -205 -216 530 -128 -275 105 -433 -67 96 -466 8 37 -141 744 -515 444 537 -658
1947 -658 117 291 -335 426 -272 -22 593 -427 12 103 -375 43 -121 0 332 -745 -140 667 -590
1966 -590 -170 162 59 33 -497 205 506 -821 21 421 -102 165 -137 -59 511 -450 -140 907 -110 -65
1986 -65 35 102 328 -377 156 272 -756 -78 471 -428 -412 -41 -247 244 -434 25 325 -524 295 24 -424
2007 -424 450 -121 -60 487 -128 147 422 -22 275 152 -145 303 -292 -86 229 -299 317 351 -438 272 -56
2028 -56 -220 -25 135 -287 113 -327 377 -352 -454 706 -148 -394 394 58 -178 -100 16 456 -599 -160
2048 -160 452 -106 -433 225 -100 138 -225 -100 756 -556 -544 698 96 -181 -304 6 323 -791 -310
2067 -310 792 -283 -430 645 -19 -75 142 30 366 -102 -180 370 -206 -156 366 -361 208 191 -422 243
2087 243 -343 291 226 -437 -57 -140 -162 -23 -230 28 110 -321 -77 271 -613 313 431 -381 42 73 237 268
2109 268 -254 313 61 -486 300 118 -328 246 -136 -51 236 -291 425 -184 -529 -61 46 -161 73 -86
2129 -86 127 -315 -164 459 -54 -393 227 311 -288 -52 424 655 -250 21 770 -296 -532 444 137 -367
2149 -367 -87 -24 489 -126 -428 429 -180 -462 55 -159 -45 -72 -574 247 -304 -361 549 -64 -170 110 70
2170 70 16 -205 65 353 -334 -170 739 -245 219 98 -104 -65 -47 -149 131 -296 146 128 -473 42 390 -261
2192 -261 157 -53 -49 304 -306 442 207 -367 372 414 -112 90 128 239 33 -323 246 283 -561 205 490 -228
2214 -228 -95 -112 350 -202 -420 528 75 -667 55 154 -79 -46 13 340 26 -619 312 208 19 34 -27 8
2236 8 34 -219 523 74 -497 470 250 -93 183 -169 313 -149 -338 162 -487 -559 348 -157 -313 172 142 -180
2258 -180 -198 -287 120 -186 -189 370 -126 -21 198 -58 264 -155 0 164 -264 112 70 255 -87 126 23 230
2280 230 -144 -178 370 -184 -69 147 -118 1 -179 108 42 -329 89 -63 -501 301 165 -209 -12 -54 146
2301 146 -34 204 202 268 -166 -145 162 -118 86 -52 221 -28 -305 196 325 -620 -44 39 -187 -242 190 243
2323 243 -76 -383 8 -36 -613 187 140 -33 81 -198 244 175 -2 97 -122 -99 45 -10 102 224 27 38
2345 38 -35 -370 265 -67 -22 236 -237 -96 24 11 -101 -263 -244 303 -123 54 376 79 23 15 -214 -4 -17
2368 -17 53 234 -135 349 189 -301 39 -55 -34 36 -337 122 -10 -274 -32 144 -96 -22 -470 -8 332 -277
2390 -277 -179 402 -56 -74 152 39 221 -31 223 328 -196 93 413 -48 134 -30 27 44 -368 141 118 -445
2412 -445 277 -17 -61 -90 64 149 16 -364 266 39 63 -107 20 34 176 -98 -60 346 228 -43 -35 -258 243
2435 243 107 -254 93 -68 -4 -68 74 30 -41 -260 484 259 336 8 -104 19 65 93 194 184 -41 -62 -290
2458 -290 -70 141 -52 29 166 83 62 -133 76 287 -22 -19 154 -241 -14 -2 -23 283 -112 -82 100 29 -163
2481 -163 -130 71 544 -67 93 21 47 -368 82 -178 -112 -202 187 350 -354 -175 485 -37 9 -25 -2 115 -307
2504 -307 223 47 51 21 15 -75 -126 -278 49 227 -199 -48 232 12 -176 -150 -109 253 133 -64 260 -12 134
2527 134 -2 -119 -39 74 -301 111 97 78 -14 -223 203 34 6 218 136 -277 -263 7 2 -97 -328 108 -81
2550 -81 -32 212 90 -20 46 179 -73 12 -143 337 -177 -293 65 -141 -164 92 2 59 2 -60 -106 -64 -335 318
2574 318 -127 -432 -77 -237 11 -183 -307 159 -37 92 83 -15 -20 4 -127 208 -15 -8 195 -21 138 9 61
2597 61 -131 123 -76 193 48 -110 80 -197 -95 308 -7 371 78 -47 119 126 95 81 -214 28 131 -136
2619 -136 48 -36 225 -29 -247 -29 95 -107 -120 -169 -78 -112 -38 -205 9 -152 47 15 -91 191 16 6 -10
2642 -10 41 -25 70 106 -28 -212 -266 312 197 -12 -127 13 103 184 -130 295 87 43 47 -128 284 56 -77 90
2666 90 190 -288 284 188 -251 -37 -221 102 -68 -336 -156 128 -142 -118 122 -60 -76 27 56 -176 -249 138
2688 138 -196 -157 46 45 88 122 -48 266 242 -39 21 -259 4 -64 176 -81 -287 -175 89 -78 -12 68 -135
2711 -135 -237 181 -158 77 -89 202 259 -52 44 109 94 -30 101 121 190 11 -200 171 -12 33 -12 -162 -149
2734 -149 29 -50 -11 -14 -20 164 -259 6 171 -5 -35 -34 237 156 -97 176 -157 25 44 -24 -120 59 182 -353
2758 -353 -154 -58 203 31 -32 37 -73 -31 91 121 60 28 -241 66 -56 -117 95 78 81 41 46 89 -23 -129 -63
2783 -63 -179 -122 34 -85 -99 -92 -50 43 62 -49 79 93 -10 -83 33 257 -22 -126 -198 -166 -290 -37 -270 23
2807 23 -11 159 37 -70 16 -72 145 36 133 30 244 -45 148 -57 33 85 81 62 -36 55 -268 8 5 -342 45
2832 45 -51 -148 -38 -108 63 62 -209 -126 92 -29 60 17 154 33 -81 299 94 -114 -192 96 -133 -127 10 71
2856 71 155 37 122 213 162 112 91 325 353 -140 173 -168 -35 -14 260 155 166 49 114 177 68 169 -105 -77
2880 -77 51 139 -367 30 -145 -123 185 -34 99 61 -329 158 13 80 253 -277 49 27 -59 -167 -45 71
2902 71 109 -100 106 -81 137 28 20 -264 9 -80 -231 108 -37 30 -119 51 -167 209 245 100 -416 8
2924 8 -57 -262 -132 216 -128 -48 -167 136 110 -67 160 -96 59 146 -81 50 3 64 245 109 146 19 54
2947 54 -25 -61 1 75 43 -118 292 94 -47 66 134 158 -129 -214 -88 160 -4 -120 121 -58 -11 59 -47 148
2971 148 -143 -167 21 11 -108 155 105 155 63 -147 127 -82 -145 -144 93 218 -124 -48 168 -117 18 -129 -162
2994 -162 91 -124 -32 70 -219 126 50 -205 -81 -35 -290 -8 -143 -83 -81 -29 137 205 230 -1 -37 -11 -22 -144
3018 -144 -152 336 340 -181 269 -40 -239 -48 56 -2 -146 -33 59 21 -110 -69 24 51 -339 189 143 -8 292 -74
3042 -74 97 51 357 97 275 140 357 168 159 34 -29 62 22 50 40 -166 -151 114 93 147 126 20 8 65 123
3067 123 122 45 -8 123 -173 6 292 -42 102 -27 36 87 -27 155 60 55 -5 -78 -305 -58 -55 -158 -210 -10 69
3092 69 122 -35 116 69 49 14 -107 -41 137 -44 197 78 55 -70 -143 -96 -72 142 -9 70 -33 -163 143 122
3116 122 193 -145 -48 21 -112 81 -77 121 102 167 -17 18 -57 -93 -28 61 132 49 98 30 61 20 -62 -162 71 44
3142 44 142 -12 209 113 -83 -72 128 99 122 -69 198 154 -166 -41 67 -102 -440 -134 -62 165 70 158 -11
3165 -11 102 110 28 75 136 43 91 22 30 -27 -127 89 -163 -203 -138 9 -31 129 7 -193 -189 -209 208 -3 -132 125
3191 125 186 -42 -198 -120 48 -117 -77 85 6 -190 -82 -68 399 98 21 10 -191 77 19 -149 -106 199 -18
3214 -18 81 -16 -310 166 178 78 -75 -55 -205 -23 -40 -28 -118 -52 -100 154 -107 65 -2 -99 -63 -175 121 -68
3238 -68 -117 115 -211 73 -130 -506 298 20 -33 -45 36 -162 192 232 -83 -214 172 -134 63 -35 68 -190
3260 -190 -234 76 -111 73 -234 83 90 -167 25 198 -190 184 39 -77 28 62 -12 -114 200 167 55 38
3282 38 309 -84 -8 1 21 25 0 55 -170 148 27 127 86 6 73 71 -326 -154 -16 57 -225 80 -10 70 68 103 -118
3309 -118 -56 46 -59 -10 -202 -69 172 -154 -111 -13 10 290 57 136 16 100 65 16 -38 20 60 126 -159 34
3333 34 -17 -161 -97 -308 -91 115 -72 12 109 -185 -3 2 -74 -118 2 253 28 -2 -109 -261 -65 -87 -33 49
3357 49 84 -10 15 -36 27 53 17 95 -100 -164 -33 -3 155 4 -139 -77 157 -36 281 143 247 165 130 174 91
3382 91 32 -100 -208 -125 -104 183 134 197 104 43 -9 117 3 -64 41 189 -31 -122 -74 67 35 -120 -439 -69
3406 -69 223 40 -50 222 130 26 112 -30 7 -229 44 -287 -84 25 184 44 -185 -15 -10 -11 -25 97 51 44
3430 44 41 -140 -1 -125 118 272 102 3 152 -220 -39 -251 -130 78 -82 48 -60 -206 -53 5 -58 153
3452 153 -382 59 -87 190 31 173 -30 -45 101 0 133 -166 72 -91 -169 137 72 -216 -206 -145 -66 -56
3474 -56 -140 -27 205 60 102 -96 -79 103 -75 -113 66 -77 76 -173 -314 129 147 -206 29 8 75 317 -269
3497 -269 -78 -173 67 118 15 317 35 98 34 -126 116 -82 37 -13 -63 -109 -174 -219 -6 28 200 -158 -26
3520 -26 -46 102 119 -18 40 25 21 -301 127 50 156 -117 143 -71 10 -61 -360 13 -7 -56 -313 -55 27 63 112
3545 112 -157 43 145 -472 146 -195 -47 191 7 99 -111 -54 91 -329 70 49 147 65 79 -21 -129 39
3567 39 -203 -33 -33 -49 -121 -361 286 71 4 85 75 137 -130 -318 8 41 48 61 178 -107 358 -147 127 -71
3591 -71 -99 156 40 -14 1 -209 -70 152 -23 -99 55 129 248 98 34 100 33 223 -205 -33 -72 52 -43 -50
3615 -50 -132 -21 82 -296 -118 4 -64 -55 -65 -32 112 -225 179 164 26 48 14 -135 161 85 44 -21 15 108 -19
3640 -19 -159 81 -102 -79 234 8 35 -74 33 -306 111 -70 243 82 91 132 -169 57 -158 41 61 230
3662 230 -34 13 180 -8 37 -53 13 51 -34 76 -50 85 -225 150 39 137 -133 64 -50 103 105 0 -59
3685 -59 -39 -118 -8 315 -36 -109 3 65 -346 8 -54 -42 86 63 -58 -172 44 226 69 174 20 -122 -173
3708 -173 276 -34 149 156 -61 -150 19 -79 -124 4 -34 -84 64 61 157 -96 -253 66 100 -395 89 21 -125 125
3732 125 139 61 -132 129 -219 -5 45 122 55 40 26 -272 35 -125 115 -107 17 -35 109 120 -195 -98 -32 204
3756 204 -223 0 -54 -14 -73 -94 -289 -175 101 27 240 232 -198 92 106 -279 -55 -54 -313 -41 -237 -3 209
3779 209 -150 -142 428 -192 -147 -104 84 -20 -190 -48 35 -196 38 -184 -89 -6 247 118 150 181 213 -183 8
3802 8 26 -89 140 -37 -213 321 -13 -62 150 -90 -49 78 161 -169 -191 -166 -44 -1 -78 -152 -153 -40 -44 33 -207
3827 -207 41 -39 -53 105 47 132 -59 -93 -154 -149 68 -349 24 -36 3 -144 -46 111 223 81 134 86 -230 47
3851 47 -165 203 73 58 -198 42 -43 -196 227 148 253 -29 -72 137 -15 -133 -50 -16 -26 191 -66 212 12
3874 12 10 -167 108 -27 166 116 43 86 -102 187 -78 250 163 65 130 74 22 -114 26 155 -74 103 21 -150
3898 -150 159 71 -345 -76 99 130 -36 -229 -51 -124 -99 113 0 69 84 -171 34 -138 -135 146 -92 -142 148
3921 148 59 182 126 6 136 -97 -87 -58 1 5 -8 199 116 29 -15 -215 198 37 -300 -122 79 -9 45 126 2
3946 2 88 12 -59 -174 30 121 79 -206 113 84 -19 -9 -96 158 -27 31 -106 -151 -137 135 -29 -128 4 135 -198
3971 -198 172 31 -57 86 -2 -114 -174 -97 -176 36 210 45 87 -104 -44 83 -7 37 21 66 106 377 -215 -71
3995 -71 34 -128 -248 47 -234 69 -46 -85 -115 91 -187 -85 -8 133 -35 33 24 -192 93 53 23 -21 -6 -49
4019 -49 -170 30 -9 142 -224 -69 203 -105 223 103 103 97 -327 -165 -132 163 -166 125 -197 37 -157 -147 277
4042 277 -68 108 50 129 17 -61 -287 -19 59 140 316 -202 -99 84 -159 -48 -34 -194 72 301 17 129
4064 129 -180 -221 -98 193 73 -25 -79 -124 195 -10 -23 -33 58 -53 49 41 -139 -346 93 -22 129 -83 156
4087 156 198 187 -108 65 310 -30 63 -99 -51 -19 203 -42 147 -9 -235 -95 241 144 49 149 104 -22 13
4110 13 -34 -11 -3 -221 24 12 71 -210 164 132 18 4 58 141 36 -35 -46 -65 -58 -317 -73 117 210 -44 17 -212
4136 -212 -45 -166 -39 146 -249 136 192 142 -13 -30 59 -28 -257 -114 12 133 26 32 -113 203 -75 -35 -38
4159 -38 -192 -115 111 37 141 64 -118 -265 6 117 -126 46 -165 -95 5 45 -479 32 24 175 46 122 195
4182 195 -28 -21 132 -60 -215 -12 -70 -49 93 -151 -65 -54 200 111 -101 125 1 161 -253 -130 -151 14 132
4205 132 133 -263 235 -337 95 20 -67 -160 -1 12 47 -71 -180 176 -90 -179 179 249 -79 177 24 85 -119
4228 -119 283 -137 -18 119 -156 -101 297 -15 68 -114 -336 -284 -94 -87 34 324 23 109 120 -50 68 26 -39
4251 -39 -74 43 -199 -145 136 -90 -124 -126 93 -63 158 -48 100 -48 -115 -86 -232 -199 -51 -194 -102 45 -44 146
4275 146 116 205 118 -221 140 189 -129 32 -35 -125 -92 72 -179 -240 -205 52 -111 -91 142 -141 276 37 56 188
4299 188 -33 89 -101 -139 -183 -150 226 -49 43 -1 -174 78 78 38 186 -215 -45 -33 -63 -77 13 -49 -91 -62 -47
4324 -47 -180 -21 13 -216 -13 -129 -100 -317 3 -73 -49 39 -98 15 -238 -132 159 103 -25 -163 98 121 33
4347 33 -111 53 -35 24 9 -75 -144 -147 -39 -26 -129 -116 114 -100 124 19 121 79 -15 -111 406 -379 -245 180
4371 180 11 89 91 -111 -199 -82 0 -133 -3 66 103 329 -8 147 -40 -6 -223 -110 -73 214 -151 46 29
4394 29 20 -106 -59 148 -304 87 -78 -12 -74 99 29 56 -157 -240 94 -24 -96 -84 -119 -99 54 31 156 -78 -270
4419 -270 60 -16 56 -177 -11 -217 -125 12 16 -15 -40 104 134 92 133 -27 186 231 57 -5 224 -79 -163 79
4443 79 -16 -191 -185 114 129 -137 -9 58 0 146 -182 -86 129 -321 195 -21 119 -61 -262 441 -186 19 -94
4466 -94 121 149 6 53 35 114 -140 69 36 -92 42 -78 52 -72 149 34 247 -191 257 185 198 -242 -116
4489 -116 54 284 264 -141 145 -138 -92 112 -258 -116 -141 -118 2 28 -210 -37 -68 -104 99 119 105 -28 114
4512 114 -134 171 -300 -192 -117 54 -78 -160 -46 38 120 -5 112 74 74 106 -44 39 228 380 89 59 -139
4535 -139 -47 -47 -9 176 -33 -51 -23 -88 8 -25 -21 238 92 -37 220 7 -112 -94 -69 -81 106 -47 -80 26 25 -134
4561 -134 125 130 63 178 103 13 203 161 -17 -135 154 -21 -79 -113 -15 75 136 34 48 232 196 -117 -41 166 -252
4586 -252 -141 -33 -90 -24 -37 -20 195 125 -7 -17 10 73 53 43 78 145 -168 49 -154 -143 21 -122 94 -103
4610 -103 233 -146 -90 -30 -148 -105 -31 57 29 197 95 -23 -111 184 -71 -15 111 -44 -166 -59 11 19 -66 132
4634 132 -88 -47 108 -46 -143 -95 220 -114 -5 -18 175 260 -38 -47 61 59 91 -158 160 95 -159 308 -226 -135
4658 -135 -63 -128 -129 -24 -169 100 58 130 92 101 168 -10 -94 -101 15 -34 24 -34 -274 -27 122 -55 45 -61 68
4683 68 -52 60 435 18 -37 112 93 28 162 71 -189 97 32 71 -91 -41 51 -440 -81 33 -265 12 5 -245
4707 -245 0 81 0 -177 42 234 35 93 -90 20 -159 -133 2 -119 -81 86 -31 12 -35 99 71 75 104 -17
4731 -17 32 -88 -256 -195 125 -125 -239 -139 -62 -60 197 108 134 223 -42 162 36 -114 -124 76 248 89 84 -15
4755 -15 -151 -23 31 -2 -41 -2 -141 276 -157 -64 8 167 -25 -11 10 -4 -54 -217 -64 46 61 -31 57 116 -67
4780 -67 163 174 246 -277 148 -124 -142 131 -61 48 -194 110 -191 -91 161 243 -33 -118 99 -280 32 -175
4802 -175 73 -14 56 -119 -209 64 -54 172 -223 92 12 270 -343 -129 -54 -169 -163 -77 105 -62 65 150 284
4825 284 -139 152 75 11 -54 30 105 182 -60 -125 248 -28 -253 -283 25 161 26 -50 45 -97 203 -87 -190
4848 -190 154 -64 20 45 -51 10 60 -132 234 129 -157 171 -178 -128 156 -37 -71 131 152 -97 -100 55 142 -183
4872 -183 -175 15 -43 64 -123 -73 -323 109 136 -20 -40 13 278 -122 7 -29 5 -167 35 -17 -125 -103 -46 -124
4896 -124 115 -82 50 -59 352 -200 150 11 -3 -22 -131 -166 -150 174 199 140 -65 168 -64 108 139 106 117
4919 117 -139 34 -32 33 27 35 342 14 -50 -172 -102 47 -112 -229 -28 -201 -18 -258 -33 196 -61 -145 -34
4942 -34 155 -57 -239 87 -72 29 18 161 82 -77 5 133 103 128 -3 -30 35 -41 -131 51 218 -25 -100 192
4966 192 -142 197 246 -116 54 129 254 272 302 -171 179 48 174 -189 11 -154 31 -105 46 169 -54
4987 -54 -183 8 -224 -157 85 -169 -75 27 -193 -211 -56 14 160 114 13 -126 -108 187 -221 5 45 -216 -221
5010 -221 -189 17 208 -78 -7 98 -76 120 -421 -95 179 137 -78 43 181 274 -43 -7 -9 -216 188 -230
5032 -230 11 -19 -102 179 23 -94 -19 -112 -19 -126 -72 124 153 70 -274 93 -60 -81 7 57 -57 26 -27 78
5056 78 44 -2 141 -40 -39 -48 211 56 -45 33 157 -109 153 6 -103 206 3 281 13 -97 -136 -1 86
5079 86 116 39 109 297 -173 -16 -9 -285 42 101 -57 -39 25 -133 288 75 -204 -59 44 -159 -101 134 262
5102 262 -60 -104 13 -84 134 124 263 131 140 -72 1 81 89 206 122 -153 -37 -2 -64 -65 -278 99 52 -280 -185
5127 -185 44 117 181 79 -13 -49 -58 -262 -48 238 85 145 -224 21 42 111 61 -81 63 -191 76 93 109 62
5151 62 -158 -186 11 -203 -205 -209 -105 -112 -95 -162 45 52 46 215 127 60 35 -179 14 27 -13 70 86 -35 151 177 -61
5178 -61 -9 138 3 -74 -52 267 -20 15 117 56 303 -73 93 -88 -221 69 -108 188 126 -86 -60 35 -85
5201 -85 142 156 41 -147 123 102 -132 -18 42 -28 -90 121 109 0 62 199 94 -104 -44 -83 273 -94 -99 -229
5225 -229 -155 -66 -64 20 210 -172 -34 -32 -68 24 -220 -337 -39 80 -5 -265 10 157 0 44 -14 -61 -137 56 -55
5250 -55 -55 -106 -326 81 -275 -8 -44 -61 83 -93 288 -8 -23 -72 74 15 -373 -93 -238 110 151 300 185
5273 185 -161 200 150 85 -69 89 109 101 38 46 -21 17 7 6 -55 -46 -92 -34 110 -164 11 -106 -100 -120 12 136 29
5300 29 -34 -102 -8 120 -155 -7 92 -122 22 247 66 78 -21 -21 139 -28 147 44 117 -152 -189 67 -114 -245
5324 -245 276 -124 137 36 -56 43 112 -274 66 93 125 290 79 -29 -171 46 7 199 -2 237 -121 -68
5346 -68 -191 1 -86 34 -4 -129 52 -163 -111 11 -195 -163 30 132 -143 -176 -91 164 123 66 -238 -28 -25 -179
5370 -179 -125 4 92 -237 142 -198 100 -105 102 40 -32 -62 -104 34 -196 -101 -55 7 -234 171 52 -43 -234
5393 -234 -32 41 -8 -105 -148 64 185 60 -115 97 -39 -43 158 141 -306 166 38 -270 34 -27 13 -16 -224
5416 -224 6 151 -186 27 98 57 -149 158 9 158 -6 68 -25 -24 -174 -107 302 -146 102 258 35 90 169
5439 169 -268 -139 82 54 -81 -112 138 -68 56 9 -98 -34 -16 -20 -221 107 69 53 -252 -273 -362 113 205 -121
5463 -121 -136 -60 116 -190 -185 -215 112 -94 -25 -14 -176 -66 -26 5 83 9 -133 193 107 27 -198 -18 18 -341 256
5488 256 -111 -223 30 -380 -2 -188 149 88 134 -23 -13 -228 -75 138 55 33 211 209 -239 -55 -178 141
5510 141 -69 104 -53 108 30 -92 51 -168 -80 129 -103 43 -8 204 -128 265 -343 41 -80 -284 86
5531 86 113 169 173 65 -26 169 79 78 -210 1 -5 -147 -135 -74 224 121 -71 48 -209 102 -119 -136 186 -69 -36
5556 -36 68 346 110 117 -6 -207 -111 -180 73 -52 -19 301 29 15 -92 -180 -269 77 13 29 -7 -132 -8 -83
5580 -83 -151 -156 -46 -55 106 -7 122 89 -101 -77 -5 155 30 54 -186 61 -93 8 -240 -23 69 214 -112 30
5604 30 -100 145 -60 -64 58 -254 26 -285 -32 74 -66 -105 -101 17 -59 119 -176 10 114 31 141 -105 420
5627 420 28 102 -137 -83 -126 41 129 14 26 -5 -154 -4 -173 35 94 -182 117 83 -14 -141 -102 65 -35
5650 -35 27 -64 -40 60 126 -137 -136 -295 105 -46 -180 159 5 382 -75 193 133 157 83 -77 93 -229 102
5673 102 16 -196 -53 249 -65 168 57 43 -213 -112 -84 -38 -24 -185 -311 84 -41 130 -55 50 10 -43
5695 -43 -40 54 -18 196 -152 62 -238 141 -35 29 -107 70 31 95 205 -214 -112 -26 82 -106 -18 -77 -7 201
5719 201 -51 -141 48 107 113 48 135 161 33 111 27 -50 -75 -9 171 70 -109 -114 -244 -180 -18 -42 -208 26 28 -32
5745 -32 286 136 -51 136 -89 -162 259 0 -100 87 -81 83 287 -39 184 32 -49 273 97 78 -215
5766 -215 4 -127 321 293 65 0 73 150 196 -8 157 24 -111 59 -160 -53 -3 132 -6 -134 108 -9
5788 -9 -354 93 78 -104 -248 -307 33 -121 -6 74 -75 70 170 -80 47 68 85 151 155 52 -89 -20 -85 222
5812 222 47 -54 6 -21 128 -361 108 160 -202 -100 19 -46 157 -95 -30 -9 -166 30 171 185 -95 181
5834 181 -354 -211 29 -68 -118 40 78 -93 243 -162 -82 41 192 95 -9 -145 -75 -140 -37 -121 -252 56 -115
5857 -115 -5 204 97 50 19 236 22 -22 6 -122 4 45 -79 170 45 -67 76 -19 -52 -26 24 -103 85
5880 85 40 -162 217 -217 255 -207 -58 73 -91 306 327 209 24 -290 166 -5 -83 -40 -219 70 -112 -47
5902 -47 209 -261 -14 -98 249 32 -155 42 -27 219 -28 28 119 27 -221 -147 -112 -152 -34 -152 83 220 -238
5925 -238 -59 183 -53 -5 -64 -85 -191 -232 103 178 -98 53 112 11 -69 164 195 83 150 96 180 107 -71 -2
5949 -2 46 -75 -99 11 149 112 156 -214 51 -193 35 -67 89 -246 136 -161 -46 145 -143 225 8 -147
5971 -147 -98 -207 21 348 31 291 82 -353 162 -121 -46 -80 -12 -41 35 -47 99 112 91 -105 -397 -94 -222
5994 -222 25 43 -14 111 23 4 -18 -17 97 -218 -42 72 38 -90 -150 157 289 419 28 -8 124 -240 -149 -62
6018 -62 -131 -55 133 -17 188 32 -255 -171 212 -80 45 77 -94 -32 -218 71 19 -26 -107 -52 177 -190 50
6041 50 -39 -42 -7 133 239 -11 -174 -63 -67 -76 -44 -92 216 -223 -112 -129 -163 -44 194 -27 -94 -66 -131 -24 159
6066 159 -50 -79 -193 -155 -113 -147 244 168 33 -24 137 -123 -93 45 -196 257 52 243 216 179 106 126 108 -146
6090 -146 -30 17 210 -60 -197 -55 -156 -46 -30 -34 167 -100 239 -102 141 -19 -111 -44 -109 51 262 50
6112 50 -209 -6 -307 -65 53 135 82 193 136 -100 3 -75 -23 -155 17 -57 -69 -23 12 94 -77 54 29 27 -50
6137 -50 54 75 -13 -157 -65 -173 59 100 210 -62 6 113 139 228 -63 20 -19 -7 -36 248 -50 155 0 198
6161 198 52 61 -251 -70 -86 -66 -99 2 412 -177 78 117 113 -16 -14 34 -86 -22 -7 16 -8 138 118 -339 206
6186 206 28 -118 -104 106 -194 -106 233 182 -34 152 -148 -208 -117 -80 -196 -91 -137 14 124 -145 -48 -142 87
6209 87 29 89 153 41 -298 -52 10 -108 222 98 -72 27 -56 -21 -56 10 16 0 196 95 -229 37 12 111 138
6234 138 5 112 -95 47 -186 -214 -138 48 91 -65 -329 15 -61 -162 56 137 -131 16 7 -37 236 -186 -147
6257 -147 -10 -447 11 80 -3 129 61 41 -117 -96 223 -39 -11 41 187 -55 279 -18 -91 -53 41 -13 -98 -18
6281 -18 -286 -10 -173 162 -165 -37 -299 39 -192 -189 -183 201 153 -21 -82 -244 2 -99 -102 126 64 44 47 -207
6305 -207 321 157 -99 -109 79 53 -68 -82 13 -26 -13 -111 -9 48 -245 132 38 1 -43 135 -86 68 -71 10
6329 10 -57 188 32 54 -209 11 -288 32 1 -16 63 -117 169 -187 138 -231 26 38 113 58 74 -56 -144 -139
6353 -139 -38 74 39 38 233 12 -82 -163 156 268 -90 79 264 158 -195 67 -12 -20 93 62 140 100 39 -44
6377 -44 -292 -300 123 -104 -21 53 21 170 -207 9 109 26 152 28 -100 3 -157 -147 -6 -6 159 -135 27
6400 27 170 -96 -10 61 -14 -57 210 91 -97 -113 -198 -142 27 -39 190 111 25 12 -41 -87 -96 106 128 105 -262 55
6426 55 -1 -49 3 137 -4 175 66 101 56 -47 61 -45 -110 234 104 -5 321 -301 81 141 -46 1 31
6449 31 115 -91 -3 -80 -185 77 25 -146 -139 -75 -116 124 85 -35 -31 -269 180 -246 -200 -87 -175 -164 -158 -97 36 62
6475 62 -160 91 -132 -57 37 -44 43 109 211 -230 -74 160 -314 177 98 -128 10 -32 40 -93 161 -41 188
6498 188 25 62 -140 -25 211 -257 -71 -73 -13 -20 -14 35 -23 148 -50 102 49 27 -15 84 141 30 16 231 19
6523 19 266 38 105 217 65 94 -93 -85 33 -93 202 -86 -210 134 224 299 -88 136 60 25 -55 -76 127 -84
6547 -84 35 157 -66 -390 13 -93 -170 -55 115 337 85 -29 21 92 310 -42 -149 -34 76 -116 111
6568 111 -331 -30 215 -232 93 -300 113 -205 -96 -54 -3 56 -172 -65 -99 12 220 26 311 -48 -61 -98
6590 -98 212 -240 -232 24 60 18 158 99 -101 83 -8 -34 -2 -160 -39 68 14 77 -112 178 5 -29 -195 133
6614 133 -44 -12 3 -134 -122 -10 178 53 258 124 -91 -151 -75 49 161 54 28 -107 326 -37 66 164
6636 164 141 133 192 -98 206 -103 38 -72 -35 187 -25 -87 310 304 -92 143 -87 -200 -79 81 93 45 -5 91
6660 91 123 199 188 -177 -333 49 -215 157 -177 48 66 -171 199 87 27 70 46 -26 7 -14 -120 -52 -51 191 -42
6685 -42 126 241 338 -133 -29 -56 36 79 -135 157 -18 -49 -255 68 -153 -1 -168 3 -101 51 52 -4 208
6708 208 49 -87 322 -105 178 -41 149 163 -11 -62 -45 -8 -120 95 158 16 9 24 147 -61 138 -81 -37
6731 -37 -28 106 298 -315 55 -44 -110 -130 -201 -40 -103 -55 -20 -91 -248 105 203 -206 76 -85 -4 53 124 282 -261
6756 -261 -42 -98 -109 186 -10 62 168 81 -20 213 21 120 94 9 -49 -80 -84 -108 -398 84 -115 -5 94 -201
6780 -201 -115 -53 -104 -89 -260 -58 50 88 -30 72 36 226 101 110 -32 150 -240 -120 278 187 -215 216 21
6803 21 14 -216 -49 -63 14 -30 21 -232 -191 -165 -21 23 20 63 -58 70 -93 245 -17 90 -26 -107 40 159 -118
6828 -118 47 -25 336 -72 193 222 -15 -188 -66 33 279 87 -217 -12 74 129 80 423 -143 -4 -23 25 138
6851 138 -271 -35 1 113 -18 -31 -78 -173 201 -25 122 81 86 121 18 -60 24 -73 -9 203 105 -112 -246 54
6875 54 -267 -116 -16 47 174 -171 -71 13 -56 -106 201 0 -29 -396 82 96 -81 144 -146 24 91 127 -65
6898 -65 393 -54 -226 6 -110 -301 102 34 -39 -224 76 33 -191 -133 144 -150 -129 -94 148 -91 125 28 118
6921 118 -214 -43 -51 0 -328 -139 -193 31 -164 -96 -85 12 -91 -89 -55 184 116 -109 -257 207 -12 88 158 52
6945 52 -47 -157 68 -202 61 195 227 98 -103 -11 53 180 -47 65 94 -200 139 226 110 -158 -149 -165 189
6968 189 -136 -163 115 -38 132 -10 179 -161 18 94 -53 291 -104 78 -95 -75 136 121 -24 256 240 7
6990 7 49 -334 169 31 -23 -108 193 152 -176 102 -35 141 155 119 117 -117 -141 -77 57 11 -213 51 122 4 13
7015 13 -65 -85 -28 -18 126 18 -206 4 22 172 -111 75 57 67 -215 31 -81 22 -88 -153 130 -214 91
7038 91 -37 1 96 -146 215 -365 -112 59 -75 -8 -9 -30 82 226 182 160 99 -283 -10 -105 111 27 -502 60
7062 60 -146 -87 18 -116 76 -43 100 -143 25 -364 -49 136 -92 -19 -54 -148 -120 218 106 23 -162 -50
7084 -50 84 80 -38 111 -10 85 -79 24 -69 33 49 -2 -65 143 -207 -5 59 -5 1 -161 -262 -178 -4 -134
7108 -134 192 -148 -154 47 71 242 -164 -172 22 -296 132 173 -47 271 66 145 -64 221 11 407 141 -260
7130 -260 38 -195 151 74 169 81 -92 65 74 -107 -7 -196 124 -2 -29 16 -319 -71 204 -60 36 -72 149
7153 149 35 -92 -139 57 -21 235 -12 30 -50 144 11 -15 -27 -141 283 64 -45 -139 3 -54 -75 -139 57
7176 57 -198 -67 -210 294 -7 222 26 -68 38 -336 -305 10 -157 88 48 -258 -324 115 215 149 -37 -243
7198 -243 185 -51 -95 -156 72 170 61 -201 351 -28 -5 -196 -222 167 72 146 114 -88 -43 -121 -151 238 -58 -35
7222 -35 -171 -101 73 -43 -105 -22 -54 -6 -78 -152 -95 104 -97 -196 -19 -51 -111 -71 -171 75 -205 11 136 56 128
7247 128 36 -35 -45 -240 66 140 -170 -116 5 23 -269 111 62 195 143 -29 84 -45 117 21 176 -173 99
7270 99 -20 102 -32 -285 147 4 -16 236 76 -68 -54 -76 25 -373 283 94 -71 1 86 -257 7 51
7292 51 -71 142 26 119 222 -151 142 239 98 169 174 -130 -11 -87 -115 -172 59 267 -215 136 -121 -33 -104 -56
7316 -56 138 -36 -38 64 -141 15 52 87 -180 12 -331 -16 216 -258 61 -58 -36 241 111 -249 -105 135
7338 135 133 -97 -81 145 47 43 4 -51 -59 -188 -175 186 88 -113 161 121 -132 83 -155 22 -86 20 51 37 -203
7363 -203 33 -181 -88 -35 7 -34 -98 53 -175 -182 -314 -282 84 -106 -94 66 116 193 -94 314 69 -150 334 174
7387 174 -226 42 -30 -36 -108 -165 159 -9 259 58 -61 -71 -18 50 -13 -73 -112 -157 -12 -257 60 -121 -27 -255
7411 -255 11 -42 -248 -154 -43 -103 189 259 -4 74 47 -80 122 -53 -127 112 -210 122 20 -122 288 134
7433 134 -57 -112 -206 58 22 137 -109 -24 -54 142 103 -377 103 350 57 257 79 -393 171 -166 27 -87
7455 -87 -71 -172 -92 10 21 -94 -136 78 128 70 -168 -249 -129 -29 -23 -89 -5 42 -109 -95 -436 -93 148 -138 22
7480 22 16 -60 11 -111 -104 -185 351 -61 -114 152 67 259 2 -202 -171 -26 168 -99 -150 -147 105 106 168 88 46 -129
7506 -129 -17 -116 64 -134 -2 -59 -36 14 76 42 8 -252 -33 275 165 223 -4 -184 13 -4 68 -114 -132 -24
7530 -24 134 -35 135 54 134 121 -58 141 -309 -139 -64 64 -142 -103 -183 53 120 98 141 32 40 40 78 -289 10
7555 10 -2 -74 -170 -311 -54 -23 133 -45 188 62 170 88 161 450 -112 -6 -53 159 -3 45 92 -145 -184 9
7579 9 106 -70 78 -122 33 -12 111 -98 134 -6 -214 316 -63 75 92 297 423 6 28 125 -124 -304
7601 -304 -293 209 249 201 177 -15 171 2 -250 -22 -187 -196 -131 -187 -118 2 -135 -228 -166 148 -94 -115 81 80 -134
7626 -134 -200 -3 26 -96 -156 -28 29 200 -210 -250 -56 -226 -25 47 -29 -185 52 -134 258 61 5 -171 29
7649 29 78 62 51 -121 -81 -29 20 29 -171 130 -110 18 0 -360 116 169 44 -180 25 -52 -54 -53 163 93 91 -20
7675 -20 128 -14 -31 -68 36 30 96 -68 7 -32 -60 368 -140 223 -122 -15 -58 -258 -113 -85 253 -35 -185 94
7699 94 -7 -184 46 19 117 48 -90 249 -62 29 -82 362 79 108 146 6 45 101 -217 -43 4 17 223 -179
7723 -179 18 -76 -46 -41 -281 27 6 45 83 24 -99 -178 -164 -54 -76 18 76 151 -112 -104 -75 -137 13 -63 -84 -93 -26 22
7751 22 -55 121 87 -74 -30 8 -267 -206 99 -39 -89 254 -48 -217 -67 54 -4 -296 -14 -123 114 -130 -111
7774 -111 -207 -57 -56 60 99 312 320 138 -59 -51 -1 90 72 149 94 200 162 48 47 -201 -16 83 -4 -30 13 126 -178
7801 -178 -8 52 -27 99 -167 310 -67 -159 -179 -178 -77 2 -158 -72 -28 39 -178 146 45 -121 -46 -58 105 -36
7825 -36 48 120 -30 -105 116 35 230 -129 -150 -130 -22 85 -50 3 -90 -38 142 92 -135 6 -54 -156 -125 -52 -75
7850 -75 -1 -152 204 1 231 -48 7 -79 57 108 97 19 24 -196 -262 154 -339 -158 -5 34 -294 -239 140 -243
7874 -243 -53 117 -152 125 142 136 86 22 -190 13 48 30 -73 -38 -46 106 47 240 99 27 -174 -139 22 -55 -97
7899 -97 67 69 94 263 -50 95 -17 11 -35 120 15 91 166 161 264 -199 -21 89 -24 -124 -133 -95 -63 -46 135
7924 135 127 -297 49 -73 -211 60 -165 -3 -166 -182 -18 -5 9 221 49 -131 -11 91 30 40 151 -32
7946 -32 -190 -88 126 -63 -10 40 -68 -88 172 158 -292 189 37 -179 -42 -13 -3 113 -78 76 -66 71
7968 71 -128 -176 93 103 143 -119 87 124 93 91 153 81 119 89 -58 -35 131 130 -41 270 -75 -145 78 -80 -75 -74 152
7995 152 -146 74 176 -98 -151 121 -32 173 214 -328 20 -252 337 -91 -59 119 -237 330 -68 90 -177
8016 -177 92 -59 -154 132 -11 121 -41 -40 -21 -13 -85 -28 -130 277 143 -302 363 164 -300 -12 118 -25 0
8039 0 -203 -17 -47 211 135 41 -105 -37 104 -118 127 -349 -25 -172 -35 -96 112 -142 -23 202 -203 -62
8061 -62 -76 -55 -172 217 45 -203 151 -204 -204 -107 -30 74 -151 52 93 -33 -46 128 -76 84 96 -220 -93
8084 -93 -233 -238 188 -85 -113 272 76 16 39 111 3 227 -14 135 49 -25 105 0 178 74 198 38 -251
8107 -251 -19 0 -44 20 -74 209 176 250 -168 173 -140 -190 307 145 153 -175 -158 73 397 113 -51 106 19 69
8131 69 57 39 102 -229 52 -93 160 136 -152 288 -87 -158 -72 160 29 -90 111 127 139 -225 -217 132 -144 -128
8155 -128 126 -138 167 159 -131 -198 26 54 3 132 -2 416 -27 61 81 15 175 -82 80 202 -123 -156 -33
8178 -33 -111 -259 -105 -28 -27 183 -71 97 -249 -187 119 -70 27
8191B7
##END NTUPLES=NMR FID
##END=
